
##TITLE=UV1215_M5_1296-1170_10_7229370_8bzgtBLeyR
##JCAMPDX= 6.0         $$ Bruker NMR JCAMP-DX V2.0
##DATA TYPE= NMR SPECTRUM
##DATA CLASS= NTUPLES
##ORIGIN= BRUKER
##OWNER= Administrator
$$ 1.72 TOPSPIN		Version 2.1
$$ 2013-01-23 19:52:25.952 -0500  Administrator@X
$$ Compression mode = diff/dup
##.OBSERVE FREQUENCY= 400.02188249412
##.OBSERVE NUCLEUS= ^1H
##.ACQUISITION MODE= SIMULTANEOUS (DQD)
##.ACQUISITION SCHEME= undefined
##.AVERAGES= 64
##.DIGITISER RES= 22
##SPECTROMETER/DATA SYSTEM= spect
##.PULSE SEQUENCE= noesygpps1d.comp
##.SOLVENT NAME= COFFEE_meoh
##.SHIFT REFERENCE= INTERNAL, COFFEE_meoh, 1, 14.96128
##AUDIT TRAIL= $$ (NUMBER, WHEN, WHO, WHERE, PROCESS, VERSION, WHAT)
$$ ##TITLE= Audit trail, TOPSPIN		Version 2.1
$$ ##JCAMPDX= 5.01
$$ ##ORIGIN= Bruker BioSpin GmbH
$$ ##OWNER= Administrator
$$ $$ E:\/data/COFFEE/nmr/UV1215_M5_1296-1170_10_7229370_8bzgtBLeyR/32/pdata/1/auditp.txt
$$ ##AUDIT TRAIL=  $$ (NUMBER, WHEN, WHO, WHERE, PROCESS, VERSION, WHAT)
(   1,<2013-01-23 19:52:20.155 -0500>,<Administrator>,<X>,<go>,<TOPSPIN 2.1>,
      <created by zg
	started at 2013-01-23 19:40:48.747 -0500,
	POWCHK enabled, PULCHK disabled,
       configuration hash MD5:
       86 BA 57 50 F2 9D 5C 9B 26 00 A9 28 5F 66 2E 89
       data hash MD5: 64K
       9F 37 0E 39 6D E8 77 9D 7B B5 89 5F 6B 7B BE A9>)
(   2,<2013-01-23 19:52:23.296 -0500>,<Administrator>,<X>,<proc1d>,<TOPSPIN 2.1>,
      <Start of raw data processing
       efp LB = 0.3 FT_mod = 6 PKNL = 1 PHC0 = 0 PHC1 = 0 SI = 128K 
       data hash MD5: 128K
       F3 94 26 79 13 09 4E 68 2D A5 7F 60 61 50 11 1D>)
(   3,<2013-01-23 19:52:24.358 -0500>,<Administrator>,<X>,<proc1d>,<TOPSPIN 2.1>,
      <pk PHC0 = -80.1947 PHC1 = 0 
       data hash MD5: 128K
       13 27 1E 9E E8 9C 70 C2 40 0D 2D 0E B4 F1 29 A8>)
(   4,<2013-01-23 19:52:25.014 -0500>,<Administrator>,<X>,<proc1d>,<TOPSPIN 2.1>,
      <abs ABSG = 1 
       data hash MD5: 128K
       35 17 BE F5 A0 89 43 44 3E 96 4A 54 D5 99 28 7C>)
(   5,<2013-01-23 19:52:25.202 -0500>,<Administrator>,<X>,<proc1d>,<TOPSPIN 2.1>,
      <abs ABSG = 2 
       data hash MD5: 128K
       D7 08 43 19 66 ED 10 71 CB CD 53 E8 31 3A 6B B0>)
(   6,<2013-01-23 19:52:25.358 -0500>,<Administrator>,<X>,<proc1d>,<TOPSPIN 2.1>,
      <abs ABSG = 3 
       data hash MD5: 128K
       59 6F A2 A2 3F CE 9F 8D 49 ED 28 64 DB 14 AE 65>)
(   7,<2013-01-23 19:52:25.546 -0500>,<Administrator>,<X>,<proc1d>,<TOPSPIN 2.1>,
      <abs ABSG = 4 
       data hash MD5: 128K
       11 2A 92 02 C5 AA 98 46 CD 8F 82 E9 50 27 50 C7>)
(   8,<2013-01-23 19:52:25.686 -0500>,<Administrator>,<X>,<proc1d>,<TOPSPIN 2.1>,
      <abs ABSG = 5 
       data hash MD5: 128K
       B3 94 6C 4E F1 41 60 52 F2 61 9D 1D 82 8C C6 09>)
$$ ##END=
$$ 
$$ $$ hash MD5
$$ $$ 0E 82 BD 78 F2 F0 AA 30 52 05 F5 B6 4B 27 9E B4
##$RELAX= 
##$RELAX= 
##$RELAX= 
##$RELAX= 
##$RELAX= 
##$RELAX= 
##$RELAX= 
##$RELAX= 
$$ Bruker specific parameters
$$ --------------------------
##$DU= <E:\>
##$EXPNO= 32
$$ [...]
150 150 150 150 150 150 150 150
##$TP07= 0
##$TPNAME0= <>
##$TPNAME1= <>
##$TPNAME2= <>
##$TPNAME3= <>
##$TPNAME4= <>
##$TPNAME5= <>
##$TPNAME6= <>
##$TPNAME7= <>
##$TPOAL= (0..7)
0.5 0.5 0.5 0.5 0.5 0.5 0.5 0.5
##$TPOFFS= (0..7)
0 0 0 0 0 0 0 0
##$TUNHIN= 0
##$TUNHOUT= 0
##$TUNXOUT= 0
##$USERA1= <user>
##$USERA2= <user>
##$USERA3= <user>
##$USERA4= <user>
##$USERA5= <user>
##$V9= 5
##$VALIST= <valist>
##$VCLIST= <CCCCCCCCCCCCCCC>
##$VD= 0
##$VDLIST= <DDDDDDDDDDDDDDD>
##$VPLIST= <PPPPPPPPPPPPPPP>
##$VTLIST= <TTTTTTTTTTTTTTT>
##$WBST= 1024
##$WBSW= 4
##$XGAIN= (0..3)
0 0 0 0
##$XL= 0
##$YL= 0
##$YMAX_a= 6265371
##$YMIN_a= -13914367
##$ZGOPTNS= <>
##$ZL1= 120
##$ZL2= 120
##$ZL3= 120
##$ZL4= 120
##$ABSF1= 14.96128
##$ABSF2= -5.596902
##$ABSG= 5
##$ABSL= 3
##$ALPHA= 0
##$AQORDER= 0
##$ASSFAC= 0
##$ASSFACI= 0
##$ASSFACX= 0
##$ASSWID= 0
##$AUNMP= <proc_prof1d_extract.lims>
##$AXLEFT= 0
##$AXNAME= <>
##$AXNUC= <1H>
##$AXRIGHT= 0
##$AXTYPE= 0
##$AXUNIT= <>
##$AZFE= 0.1
##$AZFW= 0.1
##$BCFW= 0
##$BC_mod= 0
##$BYTORDP= 0
##$COROFFS= 0
##$CY= 15
##$DATMOD= 1
##$DC= 0
##$DFILT= <>
##$DTYPP= 0
##$F1P= 0
##$F2P= 0
##$FCOR= 0.5
##$FTSIZE= 131072
##$FT_mod= 6
##$GAMMA= 0
##$GB= 0
##$INTBC= 1
##$INTSCL= 1
##$ISEN= 128
##$LB= 0.3
##$LEV0= 0
##$LPBIN= 0
##$MAXI= 10000
##$MC2= 0
##$MEAN= 0
##$ME_mod= 0
##$MI= 0
##$NCOEF= 0
##$NC_proc= -2
##$NLEV= 6
##$NOISF1= 0
##$NOISF2= 0
##$NSP= 0
##$NTH_PI= 0
##$NZP= 0
##$OFFSET= 14.96128
##$PC= 1
##$PHC0= -80.1947
##$PHC1= 0
##$PH_mod= 1
##$PKNL= yes
##$PPARMOD= 0
##$PPDIAG= 0
##$PPIPTYP= 0
##$PPMPNUM= 2147483647
##$PPRESOL= 1
##$PSCAL= 4
##$PSIGN= 0
##$PYNMP= <proc.py>
##$REVERSE= no
##$SF= 400.020009523995
##$SI= 131072
##$SIGF1= 0
##$SIGF2= 0
##$SINO= 400
##$SIOLD= 131072
##$SPECTYP= <>
##$SREGLST= <1H.CDCl3>
##$SSB= 0
##$STSI= 131072
##$STSR= 0
##$SW_p= 8223.68421052631
##$SYMM= 0
##$S_DEV= 0
##$TDeff= 65536
##$TDoff= 0
##$TI= <>
##$TILT= no
##$TM1= 0
##$TM2= 0
##$TOPLEV= 0
##$USERP1= <user>
##$USERP2= <user>
##$USERP3= <user>
##$USERP4= <user>
##$USERP5= <user>
##$WDW= 1
##$XDIM= 131072
##$YMAX_p= 478468190
##$YMIN_p= -12786
##$CURPLOT= <Network HP LaserJet P1505>
##$CURPRIN= <$Network HP LaserJet P1505>
##$DFORMAT= <normdp>
##$LAYOUT= <+/1D_H.xwp>
##$LFORMAT= <normlp>
##$PFORMAT= <normpl>
##$SURQMSG= 1
$$ End of Bruker specific parameters
$$ ---------------------------------
##NTUPLES= NMR SPECTRUM
##VAR_NAME=  FREQUENCY,     SPECTRUM/REAL,   SPECTRUM/IMAG
##SYMBOL=    X,             R,               I
##VAR_TYPE=  INDEPENDENT,   DEPENDENT,       DEPENDENT
##VAR_FORM=  AFFN,          ASDF,            ASDF
##VAR_DIM=   131072,        131072,          131072
##UNITS=     HZ,            ARBITRARY UNITS, ARBITRARY UNITS
##FACTOR=    0.0627417313425164, 1,          1
##FIRST=     8223.62146879497, -166,         -67475
##LAST=      0,             2045,            -67362
##MIN=       0,             -12786,          0
##MAX=       8223.62146879497, 478468190,    0
$$ Real data points
##PAGE= N=1
##DATA TABLE= (X++(R..R)), XYDATA
$$ [...]
61594C46536k748j836j165j120j464j774j853j674j478j780k661l296k885j861
61580C18941j253j148q33l03l59j081j471r92l40k55n28p16q54r43o13J00M26
61563C07778m1n70k68P26J664K212K475K409J922J306R99J084J351J629J768J595
61547C28039J106N16n8n95q12k89Q20J740J999J945K050K197K048J739J748K199
61531C46392K651K498J544L06l00J16Q89J099O59R1n60j716l134l771l079j738
61515C41947p37l18k25l20n39o97p44q13p93l67L49P89P74P33Q34O18j65j052
61497C39274j578j776j646r52QK99l02p06k3J084J434J054P98Q26N80N8j02K59
61479C38589N94O47P83J183J487J491J471J594J551J086M33J2l8K24O53R46P35
$$ y = [346536, 343788, 341952, 340787, 339667, 338203, 336429, 334576, 332902, 331424, 329644, 326983, 323687, 320802, 318941, 317688, 316540, 315707, 315404, 315045, 313964, 312493, 311501, 311161, 310906, 310378, 309662, 308808, 307865, 307252, 307352, 307778, 307737, 307167, 306899, 307625, 309289, 311501, 313976, 316385, 318307, 319613, 320612, 321696, 323047, 324676, 326444, 328039, 329145, 329661, 329603, 329008, 328196, 327907, 328727, 330467, 332466, 334411, 336461, 338658, 340706, 342445, 344193, 346392, 349043, 351541, 353085, 353391, 353091, 353207, 354096, 355195, 355854, 355945, 355385, 353669, 350535, 346764, 343685, 341947, 341210, 340892, 340667, 340347, 339808, 339111, 338367, 337554, 336761, 336394, 336743, 337532, 338306, 339039, 339873, 340491, 340326, 339274, 337696, 335920, 334274, 333322, 333330, 333629, 333327, 332621, 332598, 333682, 335116, 336170, 336968, 337794, 338374, 338432, 338330, 338589, 339183, 339830, 340613, 341796, 343283, 344774, 346245, 347839, 349390, 350476, 350909, 350921, 350883, 351107, 351760, 352706, 353441]
61462C53441j0q22j180r66m59J4L18M86N80O83R47J507K181K450K041J404J204
61445C63819J461J658J692J988K567K768K246J600J494J815K192K740L617M373
61431C96030M472M100L680L004J716L52q6M80J143J275J027O10Rl74J23J338K185
61414D21084K029J441J080O77k38j325j954k256k763l316l250k513j794j487j339
61399D04076j259j613k402k877k478j659j205j177j082p58m40j20M01R31R82N84
61383C89904L56O05R42R84R07R84J097J102J187J429J421Q94L56N25J337K070
61367D06100K268K048J629J178R82J266J787K099K169K302K579K867L272M033
61353D36579M986N692O102O588P351Q354R695J1358J2601J2357J0502Q085O128
$$ y = [353441, 353431, 352609, 351429, 350463, 350004, 350018, 350336, 350822, 351402, 352085, 353032, 354539, 356720, 359170, 361211, 362615, 363819, 365280, 366938, 368630, 370618, 373185, 375953, 378199, 379799, 381293, 383108, 385300, 388040, 391657, 396030, 400502, 404602, 408282, 411286, 413002, 413354, 413268, 413748, 414891, 416166, 417193, 417803, 417812, 417438, 417561, 418899, 421084, 423113, 424554, 425634, 426311, 426073, 424748, 422794, 420538, 417775, 414459, 411209, 408696, 406902, 405415, 404076, 402817, 401204, 398802, 395925, 393447, 391788, 390583, 389406, 388324, 387566, 387126, 387006, 387407, 388338, 389320, 389904, 390260, 390865, 391807, 392791, 393698, 394682, 395779, 396881, 398068, 399497, 400918, 401812, 402168, 402693, 404030, 406100, 408368, 410416, 412045, 413223, 414205, 415471, 417258, 419357, 421526, 423828, 426407, 429274, 432546, 436579, 441565, 447257, 453359, 459947, 467298, 475652, 485347, 496705, 509306, 521663, 532165, 540250, 546378]
61340E46378M782L815L269L176L221L013K460J693R65O10O50M53o18k284l683
61325E67900m585n435o218o302n601m839m271l285j756p07q04j165n99P93K196
61310E25322L421M697N766O368P175R067J1745J4096J5619J6460J6377J4859J2179
61297F63151R162N963K231j503l928m714n007n722o402o434o314o886p973q679
61283F16945q634q189p665p055o367n626m646l233j560L7J570L267M959O007O006
61268E85816N245M411M001M125M597N030N103M965N291O615Q617J0369J1348J1831
61254F77364J2141J1932J0633Q276N454K602r5k254l456l950m558n630o664p167
61240F94628p283p231o759n676m443l668l358l203l214l507l756l512k879k302
$$ y = [546378, 551160, 554975, 558244, 561420, 564641, 567654, 570114, 571807, 572772, 573382, 574032, 574485, 573867, 571583, 567900, 563315, 557880, 551662, 545360, 539759, 534920, 530649, 527364, 525608, 524901, 524097, 522932, 522333, 523126, 525322, 528743, 533440, 539206, 545574, 552749, 561816, 573561, 587657, 603276, 619736, 636113, 650972, 663151, 672313, 678276, 680507, 679004, 675076, 670362, 665355, 659633, 653231, 646797, 640483, 633597, 625624, 616945, 608311, 600122, 592457, 585402, 579035, 573409, 568763, 565530, 563970, 564007, 565577, 568844, 573803, 579810, 585816, 591061, 595472, 599473, 603598, 608195, 613225, 618328, 623293, 628584, 635199, 643816, 654185, 665533, 677364, 689505, 701437, 712070, 720346, 725800, 728402, 728307, 726053, 722597, 718647, 714089, 708459, 701795, 694628, 687345, 680114, 673355, 667679, 663236, 659568, 656210, 653007, 649793, 646286, 642530, 639018, 636139, 633837]
61226F33837j826j115q5J042K239L601M853N474N407N143N080N235N584O156O727
61211F87352O907O704O450O054M842K532M6j149m59J308K796L385L574M322O083
61196G40747Q591J1338J3966J6220J7993J9519K1077K2181K1576J8612J4270J0269
61184I36359P346N081L157J935J560J371O51m98j512k317l429n230p482r606j1201
61169I16185j2208j2712j2793j2627j2571j2928j3634j4390j5112j5932j6680
61158G64598j6807j6062j4836j3560j2098j0206q172o410m732k708n85R22J723
61145F61067K392K922K272k53l803o775q494r447j0007r705q101n834m216l741
61131E98277l490k273j3K410M439O362Q495J0603J2394J4039J5705J7058J7839
$$ y = [633837, 632011, 630896, 630811, 631853, 634092, 637693, 642546, 648020, 653427, 658570, 663650, 668885, 674469, 680625, 687352, 694259, 700963, 707413, 713467, 718309, 720841, 720887, 719738, 719279, 720587, 723383, 726768, 730342, 734664, 740747, 749338, 760676, 774642, 790862, 808855, 828374, 849451, 871632, 893208, 911820, 926090, 936359, 943705, 948786, 951943, 953878, 955438, 956809, 957460, 956962, 955450, 953133, 949704, 944474, 936992, 927386, 916185, 903977, 891265, 878472, 865845, 853274, 840346, 826712, 812322, 797210, 781278, 764598, 747791, 731729, 716893, 703333, 691235, 681029, 672857, 666447, 661715, 659007, 658422, 659344, 661067, 663459, 666381, 668653, 668400, 664597, 657822, 649328, 639881, 629874, 620169, 612068, 606234, 602018, 598277, 594787, 592514, 592501, 594911, 599350, 605712, 614207, 624810, 637204, 651243, 666948, 684006, 701845]
61118G01845J8506J9704K1384K3051K4618K6190K7266K7178K6287K5764K5976
61107I67769K5992K5061K3573K2060K0090J7030J3310R995P310M451P77l463p666
61094A126289j1607j5350j8857k1843k4016k5392k6390k7358k7980k7535k5962
61083H73999k4182k2942k1844k0123j8042j6606j5990j5226j3604j1482r407p259
61071F77292m921l065k383k426k028q27M09J011J275J936L234M799O088O784O999
61056F94177P227P898Q962J0076J1181J2505J4041J5451J6612J7842J9469K1426
61044H56867K3478K5488K7303K8695K9598L0268L1010L1930L2872L3471L3411
61033A184391L2939L2949L4013L5521L6445L6817L7684L9552M1729M3340M4165
$$ y = [701845, 720351, 740055, 761439, 784490, 809108, 835298, 862564, 889742, 916029, 941793, 967769, 993761, 1018822, 1042395, 1064455, 1084545, 1101575, 1114885, 1124880, 1132190, 1136641, 1137418, 1133955, 1126289, 1114682, 1099332, 1080475, 1058632, 1034616, 1009224, 982834, 955476, 927496, 899961, 873999, 849817, 826875, 805031, 784908, 766866, 750260, 734270, 719044, 705440, 693958, 684551, 677292, 672371, 669306, 666923, 664497, 662469, 661642, 662051, 663062, 664337, 666273, 669507, 674306, 680394, 687178, 694177, 701404, 709302, 718264, 728340, 739521, 752026, 766067, 781518, 798130, 815972, 835441, 856867, 880345, 905833, 933136, 961831, 991429, 1021697, 1052707, 1084637, 1117509, 1150980, 1184391, 1217330, 1250279, 1284292, 1319813, 1356258, 1393075, 1430759, 1470311, 1512040, 1555380, 1599545]
61022A599545M4341M4121M4194M5339M7629N0804N5474O2620P1833Q1493R0992
61011B238385J01070J11858J22931J35989J54816J81329K14642K55585L08477
61002C825082L75823M55625N48483O63644Q12843J003478J245805J556680J929121
60993A2416584K284893K477842K379215J976961J389092P81062K79291m3761j43283
60984B3797896j1447K73487N37781N93278L51545j33062p21129j277706j717045
60975B1693598j997695k110097k075566j939576j750272j540623j329389j130238
60967G820142r53070q00475o69986n59788m69161l95314l34359k84885k46890
60958C106214k17809j93089j70639j51446j35725j21570j07786r5155q4185p4065
$$ y = [1599545, 1643886, 1688007, 1732201, 1777540, 1825169, 1875973, 1931447, 1994067, 2065900, 2147393, 2238385, 2339455, 2451313, 2574244, 2710233, 2865049, 3046378, 3261020, 3516605, 3825082, 4200905, 4656530, 5205013, 5868657, 6681500, 7684978, 8930783, 10487463, 12416584, 14701477, 17179319, 19558534, 21535495, 22924587, 23705649, 23984940, 23941179, 23797896, 23786449, 24059936, 24597717, 25190995, 25542540, 25409478, 24688349, 23410643, 21693598, 19695903, 17585806, 15510240, 13570664, 11820392, 10279769, 8950380, 7820142, 6867072, 6066597, 5396611, 4836823, 4367662, 3972348, 3637989, 3353104, 3106214, 2888405, 2695316, 2524677, 2373231, 2237506, 2115936, 2008150, 1912995, 1828810, 1754745]
60948A754745o4622n7092n2243m9468m8239m8583m9571m9329m7342m5120m3849
60937A199287m2893m1245l9052l6942l5049l3294l1648k9707k7111k4529k2961
60926H34856k2008k0272j7632j5492j4479j3558j2026j0654j0111r708q587o871
60914F73458m903k637n48J94n91j376q74L73J188J527K063K855L470L754L660
60899F81613K899J530K41n47j309k528l912n049o051o928p066o120m877m458n014
60884F32424n835o266o106n499m989n279o527q100r245r616r179q168p261p056
60870E33298p250o950n928m879m320m022l624l058k267j252m75l63m28J81J279
60855D89942J849J632J365J368J218R38J183J921K314K201K383L007L158K538
$$ y = [1754745, 1690123, 1633031, 1580788, 1531320, 1483081, 1434498, 1384927, 1335598, 1288256, 1243136, 1199287, 1156394, 1115149, 1076097, 1039155, 1004106, 970812, 939164, 909457, 882346, 857817, 834856, 812848, 792576, 774944, 759452, 744973, 731415, 719389, 708735, 698624, 688916, 680329, 673458, 668555, 665918, 665370, 665564, 664973, 663597, 662723, 663096, 664284, 665811, 667874, 670729, 674199, 677953, 681613, 684512, 686042, 686283, 685736, 684427, 681899, 677987, 672938, 666887, 659959, 652893, 646773, 641896, 637438, 632424, 626589, 620323, 614217, 608718, 603729, 598450, 591923, 583823, 574578, 564962, 555783, 547615, 540354, 533298, 526048, 519098, 513170, 508291, 503971, 499949, 496325, 493267, 491000, 489748, 489273, 488910, 488482, 488663, 489942, 491791, 493423, 494788, 496156, 497374, 498312, 499495, 501416, 503730, 505931, 508314, 511321, 514479, 517017]
60841E17017K086K217J966O68r02j872k491l101l249k730k328k458k316j355l99
60826E00753k71m66l09k71r12j617j638j385j529j746j602j619k235k655k145
60811D80353j418j422j696j547j702l058m607m625l381k674l000l207k865k965
60797D42186l959m906n068m925m990m890m187l181k365j862j731k088k606k552
60783C92876j682n63J80N04O91Q83R94Q76O14O70J379K148J909P25J48J279L294
60766D06925M629M899M656M086L131K434K725L552L832L432L095K952K380J298
60752D54026L78j61q50j885k780l273l638l830l215j589J41P59j71k108m076n348
60736D22380n930o331o674o452n521m727m810n185m751l539k622k506k563k139
$$ y = [517017, 519103, 521320, 523286, 523954, 523052, 521180, 518689, 515588, 512339, 509609, 507281, 504823, 502507, 501152, 500753, 500482, 500016, 499707, 499436, 498524, 496907, 495269, 493884, 492355, 490609, 489007, 487388, 485153, 482498, 480353, 478935, 477513, 475817, 474270, 472568, 469510, 464903, 460278, 456897, 454223, 451223, 448016, 445151, 442186, 438227, 433321, 428253, 423328, 418338, 413448, 409261, 406080, 403715, 401853, 400122, 398034, 395428, 392876, 391194, 390631, 390811, 391315, 392006, 392889, 393883, 394759, 395373, 396043, 397422, 399570, 401479, 402204, 402352, 403631, 406925, 411554, 416453, 421109, 425195, 428326, 430760, 433485, 437037, 440869, 444301, 447396, 450348, 452728, 454026, 454404, 454243, 453393, 451508, 448728, 445455, 441817, 437987, 434772, 433183, 433324, 434083, 433912, 431804, 427728, 422380, 416450, 410119, 403445, 396993, 391472, 386745, 381935, 376750, 371999, 368460, 365838, 363332, 360769, 358630]
60722C58630j374p54n19n77n79j55N55Q63M53o5KM17N52M22M58O44O74N91N76
60703C60814N01M12R06K111K974K634J943K366L748M590M297L702L448L237K891
60688D00574K763K906K918K899L389M156M209L335K549K534K730K473K106K255
60674D41796K657K479J402m8j030j070n39m53j431k910l856m041m041m198m312
60659D20405m289m279m172l689k957k332j762j009l11L2M36J468K670L059K718
60644D05988K546K494J454p05k454k706k367k834l878m141l198k043j660j950
60630C84546k152j772r01N1P39J028R31O35N21Q49J251J056L60J86J117K247K264
60613C92956J122q1n99n81m11k44j77j63N9M73N63J34j90ML6o89j324o93P51J503
$$ y = [358630, 357256, 356502, 355983, 355406, 354827, 354672, 355227, 356090, 356543, 356478, 356480, 356897, 357449, 357871, 358329, 358973, 359647, 360238, 360814, 361315, 361727, 362633, 364744, 367718, 370352, 372295, 374661, 378409, 382999, 387296, 390998, 394446, 397683, 400574, 403337, 406243, 409161, 412060, 415449, 419605, 423814, 427149, 429698, 432232, 434962, 437435, 439541, 441796, 444453, 446932, 448334, 448286, 447256, 446186, 445647, 445194, 443763, 440853, 436997, 432956, 428915, 424717, 420405, 416116, 411837, 407665, 403976, 401019, 398687, 396925, 395916, 395605, 395637, 396073, 397541, 400211, 403270, 405988, 408534, 411028, 412482, 411777, 409323, 406617, 404250, 401416, 397538, 393397, 390199, 388156, 386496, 384546, 382394, 380622, 379721, 379772, 380511, 381539, 382470, 383105, 383626, 384475, 385726, 386782, 387142, 387328, 388445, 390692, 392956, 394078, 393997, 393398, 392817, 392406, 392162, 391985, 391822, 391881, 392354, 392917, 393051, 392861, 392865, 392901, 392212, 390888, 390195, 390946, 392449]
60593C92449J290J225J780K194K060K028K458K756K500K109J892J508Q53N12P58
60578D18372J030Q24L53m5l32k64O30K218L649M514N308O487P836R066J0319J1727
60562D81692J3145J4520J5887J6760J6287J4162J0792O613K071j905m455n913
60550E79656p289q573q717p422n676m180k543m87J401K710L976N748P780R749
60536E66133J1890J4422J7205K0273K3738K6732K7553K5522K1781J7692J3401
60525G86342Q632L831l77m101p632j0554j2133j2230j1344j0158r332r183r228
60512G02533q591p092n351l773k278r81j58O77K450N043P296Q832J0690J3715
60498G23012J7533K1710K6592L2289L8046M3447M9033N4911N9799O2411O2798
$$ y = [392449, 393739, 394964, 396744, 398938, 400998, 403026, 405484, 408240, 410740, 412849, 414741, 416249, 417102, 417614, 418372, 419402, 420226, 420579, 420534, 420202, 419938, 420568, 422786, 426435, 430949, 436257, 442744, 450580, 459646, 469965, 481692, 494837, 509357, 525244, 542004, 558291, 572453, 583245, 589858, 591929, 590024, 585569, 579656, 572367, 563794, 555077, 547655, 541979, 537799, 535256, 534769, 536170, 538880, 542856, 548604, 556384, 566133, 578023, 592445, 609650, 629923, 653661, 680393, 707946, 733468, 755249, 772941, 786342, 794974, 798805, 798428, 794327, 786695, 776141, 764008, 751778, 740434, 730276, 720944, 711761, 702533, 693942, 686850, 681499, 677726, 675448, 674467, 674309, 674986, 677436, 682479, 689775, 698607, 709297, 723012, 740545, 762255, 788847, 821136, 859182, 902629, 951662, 1006573, 1066372, 1128783, 1191581]
60487A191581O1485N8235N2620M4830L4998K2702Q160o896k0603l2528m3028n1880
60475A319676n8538o2985o5355o5363o2989n9067n4395m9063m3381l8495l4971
60464G25074l1792k7918k4011k1318j9573j7548j5088j3099j1779j0352q551p089
60452E16956o498o440o340n967n301m451l648k959k216j574j662k646l697l948
60438D59609l466k722j789p87l92r30j622j610j212j171j239o60L08N81j34r50
60422D41814j034m88N1R5l69q09n30M91J539K156K592K910K496J178M0J36J070
60405D53338J684J680J584J622J606J588J665J495P91K0j57K33Q29J666K764L489
60389D75897L282K598K256K269K188K102K362K715K675K385K228K007J510J382
$$ y = [1191581, 1253066, 1311301, 1363921, 1408751, 1443749, 1466451, 1474611, 1467715, 1447112, 1414584, 1371556, 1319676, 1261138, 1198153, 1132798, 1067435, 1004446, 945379, 890984, 841921, 798540, 760045, 725074, 693282, 665364, 641353, 620035, 600462, 582914, 567826, 554727, 542948, 532596, 524045, 516956, 510458, 504018, 497678, 491711, 486410, 481959, 478311, 475352, 473136, 471562, 469900, 467254, 463557, 459609, 456143, 453421, 451632, 450845, 450453, 449523, 447901, 446291, 445079, 443908, 442669, 442009, 442317, 442898, 442764, 441814, 440780, 440292, 440343, 440438, 440069, 439260, 438730, 439221, 440760, 442916, 445508, 448418, 450914, 452092, 452132, 452268, 453338, 455022, 456702, 458286, 459908, 461514, 463102, 464767, 466262, 467053, 467073, 466916, 467149, 467978, 469644, 472408, 475897, 479179, 481777, 484033, 486302, 488490, 490592, 492954, 495669, 498344, 500729, 502957, 504964, 506474, 507856]
60375E07856K333L773M402L974L455L419L401K845J885J031O80R02J259J072L17
60360E42604j11M64J564K374K925L737M835N900O895P846Q543R171J0514J2744
60346F20005J4705J5265J4603J3211J0659O625K238j130l752o650r460j0921j1093
60333F54305j1243j1641j1240r695q040p031o248n267m432m025l709l248k993
60320E65493l301m061m854n104m247k458p68K80J523L757O192P617Q466J0114
60306E78649J2559J4545J5807J7324J9319K0802K1312K1416K1046J9009J4768
60295G76556R258L449k600q742j4118j8238k1416k3593k3885k1976j8943j6007
60283F19745j3427j1164r607q889q353p412o289n398m691m042l647l572l567l542
$$ y = [507856, 510189, 513962, 518364, 522338, 525793, 529212, 532613, 535458, 537343, 538374, 539054, 539956, 541215, 542287, 542604, 542493, 542957, 544521, 546895, 549820, 553557, 558392, 564292, 571187, 579033, 587576, 596747, 607261, 620005, 634710, 649975, 664578, 677789, 688448, 695073, 697311, 696181, 692429, 685779, 676319, 665398, 654305, 643062, 631421, 620181, 610486, 602446, 595415, 589167, 583900, 579468, 575443, 571734, 568486, 565493, 562192, 558131, 553277, 548173, 543926, 541468, 540700, 540980, 542503, 546260, 552452, 560069, 568535, 578649, 591208, 605753, 621560, 638884, 658203, 679005, 700317, 721733, 742779, 761788, 776556, 785814, 789263, 786663, 777921, 763803, 745565, 724149, 700556, 676671, 654695, 635752, 619745, 606318, 595154, 585547, 576658, 568305, 560893, 554604, 549206, 544515, 540473, 536826, 533254, 529687, 526145]
60269E26145l682l881l756l341k997k652j943j123p99q13m91l2l27j225j464o95
60253D96924n9j84j01R37J951J690N81m6J14K93J12n5J15M64O74M92r5n96l50
60234E02861N68J278J292J116J301J551J356R95J244K274L327L477K557J445J325
60219E27967K357L354L250K579K672L728M705M992N040N264N445N548N978O684
60205E89563P017O831O730O867O523N363M111L455L198L007L062L423L549L024
60191F55723K029O70j246l308m378l978l033k608k714k884l077l370l475l240
60177F21111l031l110l243l269l302l032j842m2J075R64N72O76O72r7r68r86m60
60160F01688l09n48o23o37j047j527j286l20N43P51M86K25M26J319K452K856K238
$$ y = [526145, 522463, 518582, 514826, 511485, 508488, 505836, 503893, 502770, 501971, 501158, 500667, 500635, 500308, 499083, 497619, 496924, 496865, 496681, 496580, 497517, 499468, 501158, 501739, 501693, 501807, 502100, 502212, 502157, 502272, 502736, 503410, 503902, 503807, 503211, 502861, 503429, 504707, 505999, 507115, 508416, 509967, 511323, 512318, 513562, 515836, 519163, 522640, 525197, 526642, 527967, 530324, 533678, 536928, 539507, 542179, 545907, 550612, 555604, 560644, 565908, 571353, 576901, 582879, 589563, 596580, 603411, 610141, 617008, 623531, 628894, 633005, 636460, 639658, 642665, 645727, 649150, 652699, 655723, 657752, 658422, 657176, 653868, 649490, 645512, 642479, 639871, 637157, 634273, 631196, 627826, 624351, 621111, 618080, 614970, 611727, 608458, 605156, 602124, 600282, 600240, 601315, 602279, 602851, 603527, 604199, 604102, 603134, 602148, 601688, 601379, 600831, 600208, 599571, 598524, 596997, 595711, 595391, 595934, 596685, 597171, 597396, 597822, 599141, 601593, 604449, 606687]
60143F06687J510J532J895J734J193J148J912L071M279N455O389O931P366P881
60129F58983Q013P294O114N168M318K897R88n39j210j405j525j419q70n0P44J441
60113F88942K073K525K604K264J698J209Q74L82n89j852k924l715m563n493n980
60098F77455n697n073m774m947n143m743l422j507J28R23J300K019L019L624L740
60083F56902L949M371M428L892L220K568J530J55p84j035j460k774m643o426p993
60068F55900r228r706r472r282r357q882p374n655m705m417m330m558n099n180
60054E58655m352l463l378l513k830j592q15m92K01J309K063K293K648L401M150
60039E54285M692N193N414M810L501K242J368M99n53j443j990k503l088l367l140
$$ y = [606687, 608197, 609729, 611624, 613358, 614551, 615699, 617611, 620682, 624961, 630416, 636805, 643736, 651102, 658983, 666996, 674290, 680404, 685572, 689890, 692787, 693775, 693236, 692026, 690621, 689096, 687677, 686807, 686757, 687501, 688942, 691015, 693540, 696144, 698408, 700106, 701315, 702189, 702571, 701982, 700130, 697206, 693491, 688928, 683435, 677455, 671758, 666685, 661911, 656964, 651821, 647078, 643656, 642149, 642277, 643200, 644500, 646519, 649538, 653162, 656902, 660851, 665222, 669650, 673542, 676762, 679330, 680860, 681015, 680231, 679196, 677736, 674962, 670319, 663893, 655900, 646672, 636966, 627494, 618212, 608855, 599973, 592599, 586944, 582239, 577822, 573492, 568934, 563835, 558655, 554303, 550840, 547462, 543949, 541119, 539527, 538712, 538220, 538421, 539730, 541793, 544086, 546734, 550135, 554285, 558977, 564170, 569584, 574394, 577895, 580137, 581505, 582004, 581451, 580008, 578018, 575515, 572427, 569060, 565920]
60024E65920k893l187l917m428m307l911m047n041o234o709o456o353o841p310
60010D94286p024o080m968l789k456j188k68K98M94J60m60o06l7M85L27M1M76
59993D69691J347J645J121N11M20Q21J471K146K458K194J780J843K266K232J231
59978D93177k93j407j561j026o10q21j269j224p03m27o56p51k70L11M32L95Q31
59961D84128J749K632L203L528L691L737L624L095J930N13m18p63j096j592j713
59946E06248j247p98q75j285j783k357k620j999r75r42k234l457l496k888k439
59931D76853j839p59L5K5K06J523L054L377K956L413N009O484P115P315P363P047
59915E29177O505O153N727M632L136K225K240K646L014L377L738M058M495M960
$$ y = [565920, 563027, 559840, 555923, 551495, 547188, 543277, 539230, 534189, 527955, 521246, 514790, 508437, 501596, 494286, 487262, 481182, 476214, 472425, 469969, 468781, 468513, 468811, 469305, 469465, 469005, 468399, 468362, 468847, 469174, 469215, 469691, 471038, 472683, 473804, 474315, 474735, 475556, 477027, 479173, 481631, 483825, 485605, 487448, 489714, 491946, 493177, 492884, 491477, 489916, 488890, 488280, 487459, 486190, 484966, 484263, 483836, 483180, 482429, 482159, 482470, 482902, 483297, 484128, 485877, 488509, 491712, 495240, 498931, 502668, 506292, 509387, 511317, 511830, 511412, 510649, 509553, 507961, 506248, 505001, 504203, 503328, 502043, 500260, 497903, 495283, 493284, 492309, 491367, 489133, 485676, 482180, 479292, 476853, 475014, 474255, 474290, 474315, 474521, 476044, 479098, 482475, 485431, 488844, 493853, 500337, 507452, 514767, 522130, 529177, 535682, 541835, 547562, 552194, 555330, 557555, 559795, 562441, 565455, 568832, 572570, 576628, 581123, 586083]
59901E86083M853L933K922K367J696L64q27q51j21L54P66J855L050L061K010J270
59885F12785J282J296J208J852L229M144M002L527L353L289L374M106N190N346
59871F57983M035K280J126L52o86j916k895l578m117m452m584m677m631m081l053
59856F27106k099j636j560j538j184j06J567K924L289L325M349O685R380J1364
59842F61866J1976J0662P379L346L29j032j445j548j184j94R88J685J424K9k117
59827F92164m151n643p059q684r730r489q662q270p857o318m138l108l757m761
59813F00537n060n079n465n928n845n028l619k036j083j120j285o23L25L26l87
59798E58630l83O02J286R79M12P7n03j370j620j010n77r79j541j675j856k420
$$ y = [586083, 590936, 594869, 597791, 600158, 601854, 602218, 601391, 600540, 600419, 600773, 601539, 603394, 606444, 609505, 611515, 612785, 614067, 615363, 616571, 618423, 621652, 625796, 629798, 633325, 636678, 639967, 643341, 647447, 652637, 657983, 662018, 664298, 665424, 665776, 665090, 663174, 660279, 656701, 652584, 648132, 643548, 638871, 634240, 630159, 627106, 625007, 623371, 621811, 620273, 619089, 618983, 620550, 623474, 626763, 630088, 634437, 641122, 650502, 661866, 673842, 684504, 691883, 695229, 695558, 694526, 693081, 691533, 690349, 690155, 691143, 692828, 694252, 694281, 692164, 688013, 682370, 675311, 666627, 656897, 647408, 638746, 630476, 622619, 616301, 612163, 609055, 605298, 600537, 595477, 590398, 584933, 579005, 573160, 568132, 564513, 562477, 561394, 560274, 558989, 558366, 558691, 559017, 558630, 558247, 558849, 560135, 561114, 561526, 561603, 561100, 559730, 558110, 557100, 556523, 555544, 554003, 552328, 550472, 548052]
59782E48052k713k328k006k401k953k898k461k185j921j277m34K64Q18J180J081
59767E27818P68J085K281L482L876L686L474L377L470M081N124N923O171O363
59753E80979O838P235P326P543Q163Q755Q942R037R384R756R776R335Q393O975
59739F98437N568M665L858K311K61j055j208j136j601k277k788l395m162m509
59725F92969m264m090m315m378l979l732m034m308m036l531l106k420j292k80
59711F45204J59J80j62j110k196k285j241l94o13j077p56L0M27M61O34R35J071
59694F39267J025O95j83j175j209j46P03L19p46j487j774j783j284l86L5l84p92
59677F30695o28p77k168m189n603o211o521o525n970n174m568m013l391l130l383
$$ y = [548052, 545339, 543011, 541005, 538604, 535651, 532753, 530292, 528107, 526186, 524909, 524475, 524739, 525557, 526737, 527818, 528586, 529671, 531952, 535434, 539310, 542996, 546470, 549847, 553317, 557398, 562522, 568445, 574616, 580979, 587817, 595052, 602378, 609921, 618084, 626839, 635781, 644818, 654202, 663958, 673734, 683069, 691462, 698437, 704005, 708670, 712528, 714839, 715100, 714045, 712837, 711701, 710100, 707823, 705035, 701640, 697478, 692969, 688705, 684615, 680300, 675922, 671943, 668211, 664177, 659869, 655833, 652302, 649196, 646776, 645484, 645204, 645363, 645543, 645381, 644271, 642075, 639790, 638549, 638155, 637542, 636465, 635709, 635739, 636166, 636627, 637261, 638196, 639267, 640292, 640987, 640804, 639629, 638420, 638274, 638977, 639296, 638550, 637063, 635289, 633506, 632222, 631836, 631871, 631487, 630695, 630067, 629290, 627122, 622933, 617330, 611119, 604598, 598073, 592103, 586929, 582361, 578348, 574957, 571827, 568444]
59662E68444l437k851k309k371k338j364P4R46J170J313J503J711K419L837N032
59647E71779M896L570K029P86k09j024j914l336n009n777n200m332m044l738k700
59632E45777j611j292j083p7J010Q22l91j297j687k421l497l958l588l151k957
59617E20599k613k242k482l162l332k787k341k384k239j333k0J052J666J915J998
59602E02295K232K735L106K953K573K507K630K355J577P95M15M52O94P21J40p67
59586E27413j127p09m11r09j515j227k73L80M73M32K74l39j205j686j535r80k96
59569E16760J47j14q67j093l81K59j55j004j093n40m03q47j033n92qL74O79R25
59551E11014R96J055J198J030M71M46J746L597M518M353M319N172O510P988J0191
$$ y = [568444, 565007, 562156, 559847, 557476, 555138, 553774, 553848, 554794, 555964, 557277, 558780, 560491, 562910, 566747, 571779, 576675, 580245, 582274, 583060, 582851, 581827, 579913, 576577, 571568, 565791, 560591, 556259, 552215, 548477, 545777, 544166, 542874, 541791, 541714, 542724, 543546, 543155, 541858, 540171, 537750, 534253, 530295, 526707, 523556, 520599, 517986, 515744, 513262, 510100, 506768, 503981, 501640, 499256, 497017, 495684, 495664, 496716, 498382, 500297, 502295, 504527, 507262, 510368, 513321, 515894, 518401, 521031, 523386, 524963, 525758, 526173, 526625, 527319, 528040, 528180, 527413, 526286, 525577, 525166, 524257, 522742, 521515, 521242, 521622, 522095, 522527, 522801, 522462, 521257, 519571, 518036, 517056, 516760, 516907, 516793, 515926, 514833, 514452, 514711, 514556, 513552, 512459, 511919, 511516, 510669, 509636, 509044, 509036, 509410, 510089, 511014, 512010, 513065, 514263, 515293, 515764, 516210, 517956, 521553, 526071, 530424, 534743, 539915, 546425, 554413, 564604]
59536E64604J3922J9078K4069K6210K3349J5971P224J57m542p519q721p716n219
59523F60867k675o27J198K472K466J439M98kp09k008l607n383p473r518j0825
59508F26113j1340j1470j1140r999q505p659p614p520o833n844m990m397m106
59495E24696l972l489k435j431j084r70l66M65P27M79L99N14L02r9RO83J371J968
59477E17767K799L590L636L000K586K990M071N465O641O750N428L566K373J937
59463E72599J601J322J499J862J850J888K956M987O865P942Q480Q666Q352P738
59449F38607P237O769O060N395N073M444K652kk534m755p076r189j0270j0225
59435F32186r541q139n795l352k047j779j386m85L67J142K420M118N594O985R093
$$ y = [564604, 578526, 597604, 621673, 647883, 671232, 687203, 694427, 694584, 690042, 682523, 673802, 666086, 660867, 658192, 657565, 658763, 661235, 663701, 665140, 665638, 665636, 664927, 662919, 659312, 653929, 646456, 636938, 626113, 614773, 603303, 592163, 582164, 573659, 566000, 558386, 550866, 544033, 538189, 533199, 528802, 524696, 520724, 517235, 514800, 513369, 512285, 511315, 510949, 511414, 512141, 512620, 513019, 513533, 513835, 513736, 513745, 514428, 515799, 517767, 520566, 524156, 527792, 530792, 533378, 536368, 540439, 545904, 552545, 559295, 564723, 568289, 570662, 572599, 574200, 575522, 577021, 578883, 580733, 582621, 585577, 590564, 597429, 605371, 613851, 622517, 630869, 638607, 645844, 652613, 658673, 664068, 669141, 673585, 676237, 676235, 673701, 668946, 661870, 652681, 642411, 632186, 622645, 614506, 608711, 605359, 603312, 601533, 600147, 599662, 600029, 601171, 603591, 607709, 613303, 620288, 629381]
59420F29381J1833J4191J5710J6850J7892J8653J9223J9986K1237K3500K7226
59409H35682L0843L0338K2894J0418k409j2654j9788k3153k2005j7610j2086n218
59397H15252M293J4146J8647J4840N622m379j3091j9871k3431k3324k1433j9681
59385G47590j7737j4720j1482r321p799n787l567k164j508q48j96K7L3K08L76
59370F73105M41Q52J535J527O21P4O32J217Q66O37J916M080N485O009O813Q236
59354G14046R547J0490J1545J2785J3730J4280J4808J5462J6099J6725J7260J7271
59342H84048J6539J5488J4530J3365J1500Q924N852K410j002l812o214r058j2284
59329I40286j4566j5264j5636j7071j8992j9674j8555j6636j4984j3845j2960
$$ y = [629381, 641214, 655405, 671115, 687965, 705857, 724510, 743733, 763719, 784956, 808456, 835682, 866525, 896863, 919757, 930175, 927766, 915112, 895324, 872171, 850166, 832556, 820470, 815252, 819545, 833691, 852338, 867178, 872800, 868421, 855330, 835459, 812028, 788704, 767271, 747590, 729853, 715133, 703651, 694330, 686531, 680744, 677177, 675013, 673505, 672657, 672461, 672488, 672521, 672729, 673105, 673546, 674398, 675933, 677460, 678081, 678155, 678787, 680004, 680870, 681507, 683423, 687503, 692988, 698997, 705810, 714046, 723593, 734083, 745628, 758413, 772143, 786423, 801231, 816693, 832792, 849517, 866777, 884048, 900587, 916075, 930605, 943970, 955470, 964394, 970246, 972656, 971654, 967842, 961628, 952570, 940286, 925720, 910456, 894820, 877749, 858757, 839083, 820528, 803892, 788908, 775063, 762103]
59318G62103j2013j0848r731r057q652p962p122o998p713q128p307n702m267l260
59304F53343k493j887j170J79K104L973N897Q898J2996J6202J6442J3650R108
59291G37242L627k481q370j2814j5212j5788j5079j3745j2237j0314p490m279
59279F23060j971p58P48L416O272Q141R436J1106J2862J3762J3917J4209J4788
59266G28988J4978J4434J3409J2057J0312Q201N733K782m11l120n020o672q502
59253G87169r941j0183r328q111p017o147n525m988m224l263k452j746o38R71
59239G14577K605M047N507O820P490P675Q005Q226P345N393L620K532J236p36
59225G84342k526l670n063p262r306j0325j0920j1757j2219j1679j0879j0616
$$ y = [762103, 750090, 739242, 729511, 720454, 711802, 703840, 696718, 689720, 682007, 673879, 666572, 660870, 656603, 653343, 650850, 648963, 647793, 647972, 650076, 654049, 659946, 668844, 681840, 698042, 714484, 728134, 737242, 740869, 738388, 730018, 717204, 701992, 686204, 671125, 657380, 645143, 634829, 627339, 623060, 621089, 620331, 621079, 624495, 630767, 638908, 648344, 659450, 672312, 686074, 699991, 714200, 728988, 743966, 758400, 771809, 783866, 794178, 802379, 808112, 810894, 810483, 807363, 802343, 795671, 787169, 777228, 767045, 757717, 749606, 742589, 736442, 730917, 725929, 721705, 718442, 715990, 714244, 713606, 714577, 717182, 721229, 726736, 733556, 741046, 748721, 756726, 764952, 772297, 777690, 781310, 783842, 785078, 784342, 781816, 778146, 773083, 765821, 756515, 746190, 735270, 723513, 711294, 699615, 688736, 678120]
59213F78120j0225q800o937n864n633n437n043m713m401m076m131m498m274l054
59199F01034j700r01o3J349K568K789K542K664K904K758K601K810K911K721L114
59184F30101M358N095M423L646M248N451N655N132N194N655N318M346L990M372
59170F96984M543M462N027O229P075P237P272P254O576N059L081Q49j469l308
59156G56871m514n930q090j0120j1144j1826j2975j3664j2557j0329q807q319
59144F38596p853p309p478q042p746o603n935o166o278n692m941m326l456k381
59130E54390j762j632j224j74J228K839M517N481N111M304M598O075P456Q132
59116E99339Q688R515J0316J1029J1943J2840J3200J3126J3020J2638J1615J0520
$$ y = [678120, 667895, 659095, 652158, 646294, 640661, 635224, 630181, 625468, 621067, 616991, 612860, 608362, 604088, 601034, 599334, 598433, 598370, 599719, 602287, 605076, 607618, 610282, 613186, 615944, 618545, 621355, 624266, 626987, 630101, 634459, 639554, 643977, 647623, 651871, 657322, 662977, 668109, 673303, 678958, 684276, 688622, 692612, 696984, 701527, 705989, 711016, 717245, 724320, 731557, 738829, 746083, 752659, 757718, 760799, 761648, 760179, 756871, 752357, 746427, 738337, 728217, 717073, 705247, 692272, 678608, 666051, 655722, 646915, 638596, 630743, 623434, 615956, 607914, 600168, 593565, 587630, 581464, 575186, 569494, 564553, 560227, 556771, 554390, 552628, 550996, 549772, 549598, 550826, 553665, 558182, 563663, 568774, 573078, 577676, 583751, 591207, 599339, 608027, 617542, 627858, 638887, 650830, 663670, 676870, 689996, 703016, 715654, 727269, 737789]
59104G37789R978R258P279M605K805K083J297N1j035k002l615n572o480n947n014
59089G45480m317l343j894o90j43Q8m2j103k949m639n879p156q287q322p288o513
59073F83003o733p156o999o641o620o568n902m750l675l098l215l780l929l049
59059F10888j872j783k933l998l952l145k432k035j630r10K0N53Q4r88j382n60
59043E83925M16M43q1k34j19k20j68M20P27j5q65m70O23R80R22J970M052N571
59025E97877O254P604J0169J2587J3890J4819J6075J6906J6348J4492J1862Q567
59013G47450M777J091j984m296n728o383o820p272o975n353l332k146j442MK168
58998G03759M011N304O441O895N815L957L006L076K827J896J182P87j96j634k327
$$ y = [737789, 747767, 757025, 764304, 768909, 771714, 773797, 775094, 775145, 774110, 772108, 768493, 762921, 756441, 750494, 745480, 741163, 737820, 735926, 735236, 735093, 735181, 735139, 734036, 731087, 726448, 720569, 713413, 705126, 696804, 689516, 683003, 676270, 669114, 662115, 655474, 648854, 642286, 636384, 631634, 627959, 624861, 621646, 617866, 613937, 610888, 609016, 607233, 604300, 600302, 596350, 593205, 590773, 588738, 587108, 586198, 586218, 586771, 586855, 585867, 584485, 583925, 584341, 584784, 584703, 584469, 584350, 584130, 583962, 584382, 585109, 585094, 584229, 583759, 584382, 585362, 586284, 588254, 592306, 597877, 604131, 611735, 621904, 634491, 648381, 663200, 679275, 696181, 712529, 727021, 738883, 747450, 752227, 753318, 751334, 747038, 741310, 734927, 728107, 720835, 713860, 708507, 705175, 703029, 701587, 701591, 703759, 707770, 713074, 719515, 726410, 732225, 736182, 739188, 742264, 745091, 746987, 748169, 748956, 748760, 747126, 744799]
58983G44799k253k793m295n449n473m972m227k585j54J797K842M072O173Q401
58969G35883J0064J1430J2659J3304J3359J3412J3508J3156J2610J2629J2978
58958H74992J2687J1646J0255P869L672j181m678p086j0414j4670j7513j8003
58946H47576j7862j8221j7985j6458j4969j4422j3685j1763r541p985o558m763
58934F93364l379k876k353j202k09O8K57N94K40q77j466j100j079k071k911k884
58918F72116l000l774l849k442j074j230k060k139j789j893j903q21J083K993
58904F50218M911O903Q349R139J0367J2542J4439J4938J4696J4791J5088J5080
58892G91461J5083J5432J5757J6080J7279J9526K1709K3180K4478K5503K4853
$$ y = [744799, 742546, 739753, 735458, 730009, 724536, 719564, 715337, 712752, 712598, 714395, 717237, 721309, 727482, 735883, 745947, 757377, 770036, 783340, 796699, 810111, 823619, 836775, 849385, 862014, 874992, 887679, 899325, 909580, 917449, 921121, 919940, 915262, 908176, 897762, 883092, 865579, 847576, 829714, 811493, 793508, 777050, 762081, 747659, 733974, 722211, 712670, 704685, 698127, 693364, 689985, 687109, 684756, 683554, 683345, 683413, 683670, 684264, 684504, 683627, 682161, 681061, 679982, 677911, 675000, 672116, 669116, 665342, 661493, 659051, 657977, 656747, 654687, 652548, 650759, 648866, 646963, 646142, 647225, 650218, 655129, 662032, 670381, 679520, 689887, 702429, 716868, 731806, 746502, 761293, 776381, 791461, 806544, 821976, 837733, 853813, 871092, 890618, 912327, 935507, 959985, 985488, 1010341]
58881A010341K2002J8298J4732J0681N983J981q85m355r486j4534j7458j8672
58869A018628j9484j9629j8360j6393j4755j3044j0723q707p931p651o933o390
58857H68628o838p647q162r135j1020j2354j1808j0320r366q617p308o302o635
58844G53116p378p183o722p400q752r386r437r922j0593j0510r916r527q854p229
58830F30307n533m969m992m365l299k618j871l43J059J123O01J004J945K040J649
58815F11738K348M118N365N566N668N989N716M570L292K388J701J127N80l64j738
58800F58064k646k534k209k550l129l359l847n173o386o323n470m922m483l376
58786F01657j952j039m71K54Q27J020J663L216M498M441L856L910M098L468K488
$$ y = [1010341, 1032343, 1050641, 1065373, 1076054, 1082037, 1084018, 1083133, 1078778, 1069292, 1054758, 1037300, 1018628, 999144, 979515, 961155, 944762, 930007, 916963, 906240, 897533, 889602, 881951, 875018, 868628, 861790, 854143, 845981, 836846, 825826, 813472, 801664, 791344, 781978, 773361, 766053, 759751, 753116, 745738, 738555, 731833, 724433, 715681, 706295, 696858, 686936, 676343, 665833, 655917, 646390, 637536, 630307, 624774, 619805, 614813, 610448, 607149, 604531, 602660, 602317, 603376, 604499, 605100, 606104, 608049, 610089, 611738, 614086, 618204, 623569, 629135, 634803, 640792, 646508, 651078, 654370, 656758, 658459, 659586, 660166, 659802, 658064, 655418, 652884, 650675, 648125, 644996, 641637, 637790, 632617, 626231, 619908, 614438, 609516, 605033, 601657, 599705, 598666, 598195, 598449, 599276, 600296, 601959, 605175, 609673, 614114, 617970, 621880, 625978, 629446, 631934]
58771F31934J808N41k171n070o377o350o236n883m533k936k394k590k405j930
58757E85408j671r48Q23K422K587K262K805L273K083J79k45P21J248J051J442
58742F03440K623L584M277N398O520O747O660P295P962P413O356O328O923O771
58728F88297O414P300Q674Q473O872N900N941N564M640M562N392N719N478O131
58714G75357P825R011R097Q974Q783P593N528L793K445L62k535n226p693j0799
58700H12515j4211j6689j8279j9950k1388k1496k0657k0039j9139j6731j3833
58689F10103j2634j2744j1642q977p139p176p242n899m141l259l130l377m072
58676E18671m666m179k856j737o36J364L625M597M614N480P314Q580R290J1262
$$ y = [631934, 633742, 634283, 632112, 627042, 620665, 614315, 608079, 602196, 597663, 594727, 592333, 589743, 587338, 585408, 583737, 582789, 583612, 586034, 588621, 590883, 593688, 596961, 599044, 599223, 598978, 599699, 600947, 601998, 603440, 606063, 609647, 613924, 619322, 625842, 632589, 639249, 646544, 654506, 661919, 668275, 674603, 681526, 688297, 694711, 702011, 710685, 719158, 726030, 731930, 737871, 743435, 748075, 752637, 758029, 763748, 769226, 775357, 783182, 792193, 801290, 810264, 819047, 826640, 832168, 835961, 838406, 838768, 836233, 831007, 823314, 812515, 798304, 781615, 763336, 743386, 721998, 700502, 679845, 659806, 640667, 623936, 610103, 597469, 584725, 573083, 564106, 556967, 549791, 542549, 536650, 532509, 529250, 526120, 522743, 518671, 514005, 509826, 506970, 505233, 504597, 505961, 509586, 514183, 518797, 524277, 531591, 540171, 549461, 560723]
58662E60723J4752J7585J8138J6736J3741Q895L080j704m681o558p444o933o182
58649F20148p144r461j0715r980q546p120n202l402l217m065l514j083J110K050
58635E49859L117N010O342O293N876N585M380K040R4o06r38j470j589j218j125
58620E81650j078KJ704K437K226K649L809M217L842M221N228M899K990J524J220
58605F21540N89p92j415j008j286k618l196k485k255l147l468k515j835j997j351
58590E92761O72K268K607L383N596P736Q591Q924R104Q133O328N910P552R158
58576F78723R399R345R499Q488O169M706N121N892O375Q216J1815J4994J6876
58563G95618J9542K3950K7693K8995K9458L0581L0803K8453K4565K0369J4998
$$ y = [560723, 575475, 593060, 611198, 627934, 641675, 650570, 653650, 651946, 647265, 640707, 633263, 626330, 620148, 613004, 603543, 592828, 582848, 574302, 567182, 561980, 558578, 555361, 551296, 547782, 546699, 547809, 549859, 552976, 557986, 564328, 570621, 576497, 582082, 586462, 588502, 588596, 587990, 587052, 585582, 583993, 582775, 581650, 580572, 580574, 582278, 584715, 586941, 589590, 593399, 597616, 601458, 605679, 610907, 615806, 618796, 620320, 621540, 622129, 621337, 619922, 618914, 617628, 615010, 611814, 609329, 607074, 603927, 600459, 597944, 596109, 594112, 592761, 593433, 595701, 598308, 601691, 607287, 615023, 623614, 632538, 641642, 649775, 656103, 662013, 669565, 678723, 688122, 697467, 706966, 715454, 721623, 726329, 731450, 737342, 743717, 751933, 763748, 778742, 795618, 815160, 839110, 866803, 895798, 925256, 955837, 986640, 1015093, 1039658, 1060027, 1075025]
58552A075025Q088J764k363n463q629j0587j0449r774r664q872p006o565r163
58539I96342j2742j5063j7006j9747k1723k1389k0254k0119j9804j7650j4826
58528G96019j3150j1803r127n795l459k057q97m75j027j226m46j11j001j643j274
58513G42528j498k932l354j618k44j341l016k842j998k631l821l600k695k848
58499G08090l485l171k527k731l020k363j687j853j652k34P85K36j15J386L332
58484F90991M036M628O522Q597R759J1579J5160J8149J8205J6762J6050J5017
58472H35455J1767P426L964N66m111q407j0068j0008j0140r789p788n761n496
58459G87610n299k816P59L004M622P459J0365J1110J0576J0930J1342R532N983
$$ y = [1075025, 1083113, 1084877, 1082514, 1077051, 1068422, 1057835, 1047386, 1037612, 1027948, 1019076, 1012070, 1005505, 996342, 983600, 968537, 951531, 931784, 910061, 888672, 868418, 848299, 828495, 810845, 796019, 782869, 771066, 761939, 756144, 752685, 750628, 749731, 749256, 748229, 747003, 746557, 746446, 745445, 743802, 742528, 741030, 738098, 734744, 733126, 732882, 731541, 728525, 725683, 723685, 721054, 717233, 713633, 710938, 708090, 704605, 701434, 698907, 696176, 693156, 690793, 689106, 687253, 685601, 685367, 686152, 686388, 686273, 687659, 690991, 695027, 699655, 706177, 714774, 724533, 736112, 751272, 769421, 787626, 804388, 820438, 835455, 847222, 854648, 858612, 859178, 855067, 846660, 836592, 826584, 816444, 806655, 798867, 793106, 787610, 782311, 779495, 780254, 783258, 787880, 795339, 805704, 816814, 827390, 838320, 849662, 859194, 865177]
58446H65177K771j65l915p397q937r381j0110r871p200l964k658k179k18K161
58432H04114K538J813K617M580N413N265N966P249P647P772R006J0242R593P819
58418H91634O604N138J936j780m098n778q112r675r004q077r188j0667r856p895
58404H21182p296p239n751m069m194m485k529K9M46K61K494N709O393N196N291
58389H11438O247N185K630J659K344K217J175R88J179K00o55P94L354M636N498
58374H48889P635R201P933O167P308R706R711Q327Q847J0294R583P959Q780J0897
58360I71237J0826R592J0701J3088J2965J0928J0373J0468P866L811K370K926
58348A077151J682o91k69K444L488K967M183O445O349N148P104J1381J3400J3314
$$ y = [865177, 867948, 867783, 863868, 856471, 847534, 838153, 828043, 818172, 810972, 807008, 804350, 802171, 801953, 804114, 806652, 808465, 811082, 815662, 821075, 826340, 832306, 839555, 847202, 854974, 863980, 874222, 883815, 891634, 898238, 903376, 905312, 903532, 899434, 893656, 885544, 875869, 866865, 858788, 849600, 838933, 829077, 821182, 813886, 806647, 800896, 796827, 792633, 788148, 785619, 785648, 786094, 786355, 788849, 794558, 800951, 806147, 811438, 817685, 822870, 825500, 827159, 829503, 831720, 832895, 833883, 835062, 835262, 834607, 835401, 838755, 843391, 848889, 856524, 865725, 873658, 879825, 887133, 896839, 906550, 914877, 923724, 934018, 943601, 951560, 960340, 971237, 982063, 991655, 1002356, 1015444, 1028409, 1039337, 1049710, 1060178, 1068044, 1071855, 1074225, 1077151, 1078833, 1078142, 1077873, 1080317, 1083805, 1086772, 1090955, 1097400, 1103749, 1108897, 1116001, 1127382, 1140782, 1154096]
58334A154096J5192J8602J9288J7560J7654J9241J7989J4264J2713J3329J1540
58323A331468P192M834M887L228j10n88K063L272K378L325O251P118O127P702
58309A389147J1498J2454J0370J0450J3597J5212J4435J5354J8318J9145J7734
58298A547714J8258K0360J9640J7133J8266K2083K2064J8250J7516K0958K2291
58287A764533K0147K0314K3868K4777K1705K0805K4115K6355K5790K7143L1221
58276B030773L2819L1445L2842L7584L9704L8678M0785M6450M8771M6941M8143
58265B474935N3649N6436N5311N7561O4449O8294O7314O8821P4142P5280P0626
58254C186818O8720P2073P2738O8658O8494P5114Q0261Q0957Q4901R4212J00510
$$ y = [1154096, 1169288, 1187890, 1207178, 1224738, 1242392, 1261633, 1279622, 1293886, 1306599, 1319928, 1331468, 1338660, 1343494, 1348381, 1351609, 1351499, 1350911, 1352974, 1356246, 1358624, 1361949, 1368200, 1375318, 1381445, 1389147, 1400645, 1413099, 1423469, 1433919, 1447516, 1462728, 1477163, 1492517, 1510835, 1529980, 1547714, 1565972, 1586332, 1605972, 1623105, 1641371, 1663454, 1685518, 1703768, 1721284, 1742242, 1764533, 1784680, 1804994, 1828862, 1853639, 1875344, 1896149, 1920264, 1946619, 1972409, 1999552, 2030773, 2063592, 2095037, 2127879, 2165463, 2205167, 2243845, 2284630, 2331080, 2379851, 2426792, 2474935, 2528584, 2585020, 2640331, 2697892, 2762341, 2830635, 2897949, 2966770, 3040912, 3116192, 3186818, 3255538, 3327611, 3400349, 3469007, 3537501, 3612615, 3692876, 3773833, 3858734, 3952946, 4053456]
58243D053456J01807J07128J18602J26623J28719J34805J47462J56311J58527
58234E233440J65019J79149J90036J94595K04629K23928K40635K50925K66995
58225G149351K92515L14510L29333L51154L84356M14494M37697M70594N18934
58216A0662938N66309O07131O59147P29154Q00047Q67259R52057J062124J177619
58207A8083785J294855J442344J633668J849548K088645K386692K761758L196692
58199C4737987L704076M347225N166505O156277P350698Q851043J0731164J3022477
58191I4067452J5846928J9441592K3995675K9625096L6490427M4381542N1589801
58184C15438513N4445582M9051132L4368321J3682865p269952k3788474l4173687
$$ y = [4053456, 4155263, 4262391, 4380993, 4507616, 4636335, 4771140, 4918602, 5074913, 5233440, 5398459, 5577608, 5767644, 5962239, 6166868, 6390796, 6631431, 6882356, 7149351, 7441866, 7756376, 8085709, 8436863, 8821219, 9235713, 9673410, 10144004, 10662938, 11229247, 11836378, 12495525, 13224679, 14024726, 14891985, 15844042, 16906166, 18083785, 19378640, 20820984, 22454652, 24304200, 26392845, 28779537, 31541295, 34737987, 38442063, 42789288, 47955793, 54112070, 61462768, 70313811, 81044975, 94067452, 109914380, 129355972, 153351647, 182976743, 219467170, 263848712, 315438513, 369884095, 418935227, 453303548, 466986413, 459716461, 435927987, 401754300]
58177D01754300l9150958m0270078l8937239l6230799l2899975k9357372k5800001
58170A59107878k2376570j9217141j6381378j3875935j1707124r870062q320942
58163E7358726p009900n918287n030862m302415l685991l167168k741210k383620
58155B3119273k071162j806275j593784j416418j256783j120442j014349r24309
58147A1915751q35715p55531o92513o35614n72824n12725m66955m28296l85642
58138F629936l44617l14726k90925k65682k45256k36776k32157k21054k07539
58129D271204j98855j89974j74228j57634j48033j40716j28604j16167j10078
58120B906915j06135r8150r0038q7016q4530p7599p1403p1161p1183o5408n9122
$$ y = [401754300, 362603342, 322333264, 283396025, 247165226, 214265251, 184907879, 159107878, 136731308, 117514167, 101132789, 87256854, 75549730, 65679668, 57358726, 50348826, 44430539, 39399677, 35097262, 31411271, 28244103, 25502893, 23119273, 21048111, 19241836, 17648052, 16231634, 14974851, 13854409, 12840060, 11915751, 11080036, 10324505, 9631992, 8996378, 8423554, 7910829, 7443874, 7015578, 6629936, 6285319, 5970593, 5679668, 5413986, 5168730, 4931954, 4699797, 4478743, 4271204, 4072349, 3882375, 3708147, 3550513, 3402480, 3261764, 3133160, 3016993, 2906915, 2800780, 2702630, 2612592, 2525576, 2441046, 2363447, 2292044, 2220883, 2149700, 2084292, 2025170]
58109B025170n8738n9387n4354m7854m6575m7013m3000l7896l7780l9712l8033
58098A514828l5338l6379l7736l4226k9291k8648k9725k7395k4148k4657k6016
58087A181269k3285j9199j8851k0061j8397j6431j8623k2129k1834j9795k0644
58076I62020k2461k1059j8738j9854k2037k0596j7508j7396j8602j6721j3328
58065G53720j2784j3889j2670j0077r262q722n712k919m196p173p533o912r125
58052F42746j2251j2211j0685j1607j3163j1165p263n998o531n058k680l083m909
58039E36142m227k337l448o560p234n616n309o047m830k818l706o516p062n607
58025D64825o096q712r823q706p936p795o332m298m195n182m508k941l192m255
$$ y = [2025170, 1966432, 1907045, 1852691, 1804837, 1758262, 1711249, 1668249, 1630353, 1592573, 1552861, 1514828, 1479490, 1443111, 1405375, 1371149, 1341858, 1313210, 1283485, 1256090, 1231942, 1207285, 1181269, 1157984, 1138785, 1119934, 1099873, 1081476, 1065045, 1046422, 1024293, 1002459, 982664, 962020, 939559, 918500, 899762, 879908, 857871, 837275, 819767, 802371, 783769, 767048, 753720, 740936, 727047, 714377, 704300, 695038, 686316, 680604, 677685, 673489, 666316, 658783, 651871, 642746, 630495, 618284, 607599, 595992, 582829, 571664, 564401, 558403, 551872, 546814, 544134, 541051, 536142, 531915, 529578, 526130, 519570, 512336, 506720, 501411, 495364, 490534, 487716, 484010, 477494, 470432, 464825, 458729, 450017, 440194, 431488, 423552, 415757, 409425, 405127, 400932, 395750, 391242, 388301, 385109, 380854]
58011C80854l072o21m40k129k244o77l08j157p37N36P1j403p75J511K090Q08O61
57994C72968K004K307J393J604K815K525Q40L63J182Q38q05j458r77j482k978
57979C81139l471l100l780n103n047m195m684n611m260j337j47r54j086k41o68
57964C37455k148k011k67K16r77j077P85K294K265J953J652J75j926k602k132
57949C33655k728m329m735l850l604l814k445L8J009N35J380L901N465N393O003
57934C31874Q088R712J0186J1129J2717J2977J1464R814Q121M800N37j834k132
57921D27453l300o246q406q464q356r331r845q842p577o863n725l955k802k281
57907C35460r25J136K062J858K481L919L808J780L97Q44J332Q44P94J790K224
$$ y = [380854, 377782, 377161, 376721, 374592, 372348, 371671, 371363, 370206, 369469, 370005, 370076, 368673, 367898, 369409, 371499, 372307, 372968, 374972, 377279, 378672, 380276, 383091, 385616, 386456, 386819, 388001, 388839, 388034, 386576, 385599, 384117, 381139, 377668, 374568, 370788, 365685, 360638, 356443, 351759, 346148, 341888, 340551, 340404, 339450, 338364, 338123, 337455, 335307, 333296, 333029, 333245, 332268, 331191, 331976, 334270, 336535, 338488, 340140, 340315, 338389, 335787, 333655, 330927, 326598, 321863, 318013, 314409, 310595, 308150, 308188, 309197, 309732, 311112, 315013, 320478, 325871, 331874, 339962, 349674, 359860, 370989, 383706, 396683, 408147, 417961, 426082, 430882, 431419, 429585, 427453, 424153, 417907, 409501, 401037, 392681, 383350, 373505, 364663, 357086, 350223, 344498, 340543, 337741, 335460, 334535, 335671, 337733, 339591, 342072, 345991, 349799, 351579, 351976, 352820, 354152, 354996, 355790, 357580, 359804]
57892C59804J420Q42J001M15j203j931r92m0l4K6L67l12j886k415j687j859l505
57875C48011m547m211m516o341p516o551n017m520m283l391k620k395j710m70
57861B89923j57q30k79K392N145O389P143Q398R194Q879Q630R092R037P786O545
57846C77287O063N384M045K952K065K1k908m502m330m753o845q455p891o477n801
57831C45855n360m640m647n539n555l984k599k479k249j051l27q62j037N6O77
57816C06259l55j383r68l53p76j109n26o96k824n132n834o114p495q689p872n950
57800B50183m813m222l138k207k329k440j309P8L98N25J752L098K905J678Q37
57785B40996J06j388k734k379n82J422L521N958P743P996P723Q260R075Q953Q185
$$ y = [359804, 361224, 362066, 363067, 363482, 362279, 360348, 359356, 359316, 359282, 359308, 359675, 359363, 357477, 355062, 353375, 351516, 348011, 343464, 339253, 334737, 328396, 320880, 314329, 309312, 304792, 300509, 297118, 294498, 292103, 290393, 289923, 289766, 288936, 288657, 291049, 296194, 302583, 309726, 318124, 327318, 336197, 344827, 353919, 362956, 370742, 377287, 383350, 388734, 392779, 395731, 397796, 397817, 394909, 390407, 386077, 381324, 374479, 366024, 358133, 351656, 345855, 340495, 335855, 331208, 325669, 320114, 316130, 313531, 311052, 308803, 307752, 307425, 306563, 305526, 305582, 306259, 305904, 304521, 303553, 303200, 302424, 301315, 300789, 300093, 297269, 292137, 286303, 280189, 272694, 264005, 256133, 250183, 245370, 241148, 238010, 235803, 233474, 231034, 229725, 229803, 230201, 230726, 232478, 235576, 238481, 240159, 240996, 241102, 239714, 236980, 234601, 234019, 235441, 238962, 244920, 252663, 260659, 268382, 276642, 285717, 294670, 302855]
57770C02855P635O919N409L835L110K614J385k44j670l245n014n898n769o452
57756C05470q841j0887j0540q798p655o882n277l475k811k695j732l96q9n33m46
57741B34413L9j07p42j052j181j405p30J599M221N361N394N725O223N898N112
57726B68768M893M940M410L808M042M530M201L400K928K238O28r39j314j337k345
57711C02851l687m003l802m389n178m794l888m271n784o619o245n629n021l965
57697B35576l028l222l943l744k769k309k406k108j633j936k514j991n84J94R6
57682B03679K24P97J033J102K024L694N164O721R535J3317J6506J8974K2450K8043
57668C33263L5294M3913N4439O6429P7115Q2200P7414O0351L2832J346k6606m6976
$$ y = [302855, 310490, 317409, 322818, 326653, 329763, 332377, 333762, 333518, 331848, 328603, 323589, 317691, 311922, 305470, 296629, 285742, 275202, 266404, 258749, 251867, 246590, 243115, 240304, 237609, 235877, 235481, 235392, 234859, 234413, 234452, 234345, 233603, 232551, 231370, 229965, 229235, 230834, 235055, 240416, 245810, 251535, 257758, 263656, 268768, 273661, 278601, 283011, 286819, 290861, 295391, 299592, 302992, 305920, 308158, 308786, 307847, 306533, 305196, 302851, 299164, 295161, 291359, 286970, 281792, 276998, 273110, 268839, 263055, 256436, 250191, 244562, 239541, 235576, 232548, 229326, 225383, 221639, 218870, 216561, 214155, 212047, 210414, 208478, 205964, 203973, 203389, 203583, 203679, 203903, 204700, 205733, 206835, 208859, 212553, 217717, 224438, 233973, 247290, 263796, 282770, 305220, 333263, 368557, 412470, 466909, 533338, 610453, 692653, 770067, 830418, 863250, 864596, 837990, 791014]
57656G91014n9547o5251o5129o1132n5487m9053m1771l4401k8190k3209j8761
57645B89083j4993j2466j0675q780p215o725o488n246l633l103l229k461j111
57632B02958r26j888k115j089l68p41j120p27k22j05J2J20l59j106j144p95j388
57615A88997k768l206k194j338j776k578k422j347j13P17O99k46j163r76j12J42
57599A70316k08m0O62P00j32o47l98m12j298k374l044l488l617k939j806j334
57583A49941j743k222k466k871l132k469j311r95j600j855j334r53j066r63n68
57568A24393p30j445j601r00k95k19j52j78r66j958j628n0Q78L46l34k50k67j007
57550A13637j524j096n65o63p18j17M31K53j8L21P92P33M82O79J274J938K553
$$ y = [791014, 731467, 666216, 601087, 539955, 484468, 435415, 393644, 359243, 331053, 307844, 289083, 274090, 261624, 250949, 242169, 234954, 228229, 221741, 216495, 212862, 209759, 206530, 204069, 202958, 202032, 200144, 198029, 196940, 196572, 195831, 194711, 193984, 193762, 193657, 193669, 193789, 193430, 192324, 191180, 190385, 188997, 186229, 183023, 180829, 179491, 177715, 175137, 172715, 171368, 171255, 171972, 172671, 172425, 171262, 170286, 170174, 170316, 170108, 170068, 170730, 171430, 171298, 170651, 170253, 169841, 168543, 166169, 163125, 159637, 156020, 153081, 151275, 149941, 148198, 145976, 143510, 140639, 137507, 135038, 133727, 132732, 131132, 129277, 127943, 126990, 125924, 124961, 124393, 123663, 122218, 120617, 119717, 119422, 119203, 119051, 118873, 117907, 115949, 114321, 114271, 115149, 115495, 115161, 114911, 114644, 113637, 112113, 111017, 110452, 109789, 109071, 108954, 109385, 109638, 109620, 109941, 110733, 111466, 111948, 112627, 113901, 115839, 118392]
57533A18392K861K595K235K466K798K056L74q17r41p82o08J67J207J114j63p77
57517A32177K27J422J314M69J99O42J237J891K576K807K386J706Q24o11k224l032
57501A44010l045l263l755l496k521k350l601n023n619n955o424o180m834l571
57487H4373l358l519l061k070r13M64J670J893J510J947L175L289J625K08P67
57472H8000K250K763K227J514O04n99j017K18K129L189L300L177K841K036J165
57457A13797O06M0n38l19Q22J625J321P90Q03O08l98j169o76L31P83J084J951
57440A21461K712K514K025K246K717K577K316K721L120K508J524J465K042J930
57426A53878R97K45K1j50l17j65K6j85m07mP20J055J033J000P61K07O3Q56J847
$$ y = [118392, 121253, 123848, 126083, 128549, 131347, 133403, 133777, 132960, 132019, 131237, 130629, 130796, 132003, 133117, 132954, 132177, 132404, 133826, 135140, 135609, 135808, 136450, 137687, 139578, 142154, 144961, 147347, 149053, 149877, 149266, 147042, 144010, 140965, 137702, 133947, 130451, 127930, 125580, 121979, 116956, 111337, 105382, 98958, 92778, 87944, 84373, 81015, 77496, 74435, 72365, 71452, 71916, 73586, 75479, 76989, 78936, 82111, 85400, 87025, 87233, 88000, 90250, 93013, 95240, 96754, 97358, 96759, 95742, 95960, 98089, 101278, 104578, 107755, 110596, 112632, 113797, 114403, 114443, 113905, 113586, 114408, 116033, 117354, 118144, 118947, 119555, 119157, 117988, 117312, 117643, 118426, 119510, 121461, 124173, 126687, 128712, 130958, 133675, 136252, 138568, 141289, 144409, 146917, 148441, 149906, 151948, 153878, 154875, 155120, 155141, 154991, 154674, 154509, 154535, 154350, 153943, 153939, 154659, 155714, 156747, 157747, 158508, 158715, 158778, 159634, 161481]
57407A61481K181K194K484K533J681O59O29J309J463Q75M33O37J169J700K100
57392A83528K170J991K067K444K405J670J052J134J401J471J985L237M111L668
57378B14334K630K132K111K179K819M260N326M978L897L164K418J005k16k8J095
57363B52104J897K383L199L844L503K881L249M210M349L663L416L931M358M373
57349C01360M355M166L449K863L329M280M322L396K720K773K991L265M099N205
57335C52573N499M671L492K586K026K029K816L878M452M537M568M463M029L811
57321D05430M331N025N028M563M337M216L778L474L964M796N137N212N679O214
57307D71184O094N661N727O106O140O100O675P607Q173Q401Q482P894O497N593
$$ y = [161481, 163662, 165856, 168340, 170873, 172554, 173213, 173842, 175151, 176614, 177489, 177922, 178559, 179728, 181428, 183528, 185698, 187689, 189756, 192200, 194605, 196275, 197327, 198461, 199862, 201333, 203318, 206555, 210666, 214334, 216964, 219096, 221207, 223386, 226205, 230465, 235791, 240769, 244666, 247830, 250248, 251253, 251037, 251009, 252104, 254001, 256384, 259583, 263427, 266930, 269811, 273060, 277270, 281619, 285282, 288698, 292629, 296987, 301360, 305715, 309881, 313330, 316193, 319522, 323802, 328124, 331520, 334240, 337013, 340004, 343269, 347368, 352573, 358072, 362743, 366235, 368821, 370847, 372876, 375692, 379570, 384022, 388559, 393127, 397590, 401619, 405430, 409761, 414786, 419814, 424377, 428714, 432930, 436708, 440182, 444146, 448942, 454079, 459291, 464970, 471184, 477278, 482939, 488666, 494772, 500912, 507012, 513687, 521294, 529467, 537868, 546350, 554244, 560741, 566334]
57293E66334O185P208P210O739P107P848P718P340Q300J0147J0935J0462J0424
57280F73957J1363J2063J2126J2734J4355J5857J6469J6800J7413J7997J8294
57269H39428J8444J8227J7369J6568J6679J7180J6969J6322J6302J6662J6393
57258A026543J5928J6544J7779J7867J6777J6389J7463J8782J9680K0978K2843
57247A227573K3989K3855K3578K4031K4703K5124K5621K6082K5769K4912K4795
57236A500032K5696K6474K6575K6652K6879K6571K5947K6251K7564K8590K9107
57225A796338L0507L3027L4746L4356L3069L2511L2508L2167L1523L0876K9909
57214B151537K8602K7742K7547K7102K6045K5481K6322K7945K9487L1216L3607
$$ y = [566334, 572519, 579727, 586937, 593676, 600783, 608631, 616349, 623689, 631989, 642136, 653071, 663533, 673957, 685320, 697383, 709509, 722243, 736598, 752455, 768924, 785724, 803137, 821134, 839428, 857872, 876099, 893468, 910036, 926715, 943895, 960864, 977186, 993488, 1010150, 1026543, 1042471, 1059015, 1076794, 1094661, 1111438, 1127827, 1145290, 1164072, 1183752, 1204730, 1227573, 1251562, 1275417, 1298995, 1323026, 1347729, 1372853, 1398474, 1424556, 1450325, 1475237, 1500032, 1525728, 1552202, 1578777, 1605429, 1632308, 1658879, 1684826, 1711077, 1738641, 1767231, 1796338, 1826845, 1859872, 1894618, 1928974, 1962043, 1994554, 2027062, 2059229, 2090752, 2121628, 2151537, 2180139, 2207881, 2235428, 2262530, 2288575, 2314056, 2340378, 2368323, 2397810, 2429026, 2462633]
57203B462633L6162L8069L9153L9502L9078L8278L7870L7896L7641L7023L6802
57192B880107L7106L7053L6282L5596L5660L6213L6860L7467L7596L6882L6062
57181C282884L6146L6629L6203L5138L4901L5312L4536L2384L1145L2158L3856
57170C661292L4427L4316L4663L5093L4611L3342L1948L0556K9274K8672K8807
57159D017001K8902K8721K8946K9569K9455K8227K7048K6748K6794K6818K7501
57148D325730K8971L0069L0141L0015L0307L0452L0382L1239L3339L5136L5470
57137D671251L5121L4864L3852L1351K8504K6636K5198K2906J9763J6536J3441
57126D959423J0780R878J1929J6690K3331L1622M1389N1882O2614P3785Q5170
$$ y = [2462633, 2498795, 2536864, 2576017, 2615519, 2654597, 2692875, 2730745, 2768641, 2806282, 2843305, 2880107, 2917213, 2954266, 2990548, 3026144, 3061804, 3098017, 3134877, 3172344, 3209940, 3246822, 3282884, 3319030, 3355659, 3391862, 3427000, 3461901, 3497213, 3531749, 3564133, 3595278, 3627436, 3661292, 3695719, 3730035, 3764698, 3799791, 3834402, 3867744, 3899692, 3930248, 3959522, 3988194, 4017001, 4045903, 4074624, 4103570, 4133139, 4162594, 4190821, 4217869, 4244617, 4271411, 4298229, 4325730, 4354701, 4384770, 4414911, 4444926, 4475233, 4505685, 4536067, 4567306, 4600645, 4635781, 4671251, 4706372, 4741236, 4775088, 4806439, 4834943, 4861579, 4886777, 4909683, 4929446, 4945982, 4959423, 4970203, 4980081, 4992010, 5008700, 5032031, 5063653, 5105042, 5156924, 5219538, 5293323, 5378493]
57115E378493R5749J05186J14308J23632J32995J43378J57386J77110K03155K36379
57105F867771K78419L29521L88197M54675N33106O29381P48842Q97411J082688
57096A2210011J312276J592570J930192K331623K798960L327137L906220M523492
57088C3932481N160933N792635O386804O908527P319374P578223P647094P496232
57080H8222303P103047O450971N536204M378356L024836J547020L1692j432777
57072A14861652k774818l952091m947673n755717o371664o791876p016123p049527
57064G0202163o906244o612785o204983n719956n191084m648000m116075l613643
57056B7189393l151457k735475k368563k049822j775257j540386j341088j172294
$$ y = [5378493, 5474242, 5579428, 5693736, 5817368, 5950363, 6093741, 6251127, 6428237, 6631392, 6867771, 7146190, 7475711, 7863908, 8318583, 8851689, 9481070, 10229912, 11127323, 12210011, 13522287, 15114857, 17045049, 19376672, 22175632, 25502769, 29408989, 33932481, 39093414, 44886049, 51272853, 58181380, 65500754, 73078977, 80726071, 88222303, 95325350, 101776321, 107312525, 111690881, 114715717, 116262737, 116294429, 114861652, 112086834, 108134743, 103187070, 97431353, 91059689, 84267813, 77251690, 70202163, 63295919, 56683134, 50478151, 44758195, 39567111, 34919111, 30803036, 27189393, 24037936, 21302461, 18933898, 16884076, 15108819, 13568433, 12227345, 11055051]
57048A1055051j028250r04575p98396p06591o25991n55331m94754m43034l97352
57039E100777l55983l19058k86358k56489k28744k03673j81223j60261j40366
57030B968622j22061j04782q6710o7178m6860k4665K575L4593O3192P5954O5154
57019B757834L2757j2091n8807r9294j28849j45684j50534j46319j36900j25149
57009A786964j12135r8405q5331p4439o5940n8854n2397m6490m1250l6836l3490
56998A081397l1041k8690k5993k3561k2042k0944j9363j7204j4827j2087q800
56987H56845n568k996n34K915P537J2407J6029J6393J1665K173r059j8834k6040
56974H62933l0726l2399l0951k7965k5153k2293j8439j4328j1513r824p685m544
$$ y = [11055051, 10026801, 9122226, 8323830, 7617239, 6991248, 6435917, 5941163, 5498129, 5100777, 4744794, 4425736, 4139378, 3882889, 3654145, 3450472, 3269249, 3108988, 2968622, 2846561, 2741779, 2655069, 2587891, 2541031, 2516366, 2518941, 2553534, 2616726, 2692680, 2757834, 2790591, 2778500, 2719693, 2620399, 2491550, 2345866, 2195332, 2049013, 1912113, 1786964, 1674829, 1576424, 1491093, 1416654, 1350714, 1291860, 1239463, 1192973, 1151723, 1114887, 1081397, 1050356, 1021666, 995673, 972112, 950070, 929126, 909763, 892559, 877732, 865645, 856845, 851277, 848281, 847747, 850662, 858199, 870606, 886635, 903028, 914693, 916866, 907807, 888973, 862933, 832207, 799808, 768857, 740892, 715739, 693446, 675007, 660679, 649166, 639342, 631657, 627113]
56962F27113j051K679P098J1956J6895K2827L0373L7051L8262L1516J8333K191
56950H45243j3598k6241l4040l7404l7949l6412l2603k7203k1912j7646j3988
56939E46247j0435o917l091J516O711J2046J7843K4725L2500M0340M7056M9959
56927G58500M4942L0150R046j2064k9112m1237m8128m9436m6629m2449l8091l3010
56915E02482k7556k3403k0932j8612j5550j2689j0869r613q401p559p251p055
56903C32992o851o825o512n289l727k908k563j549M7J202K116M077P191J0333
56889C21734J3364J7287K2231K7271L2213L7106L9911L7335K8677J6802M864n763
56877E93032j4044j8542j9195j7799j5643j2407q019l676j15L315P110J0873J4738
$$ y = [627113, 626062, 628741, 635839, 647795, 664690, 687517, 717890, 754941, 793203, 824719, 843052, 845243, 831645, 805404, 771364, 733960, 696011, 659599, 626996, 599793, 577881, 560235, 546247, 535812, 528895, 525804, 527320, 534031, 546077, 563920, 588645, 621145, 661485, 708541, 758500, 803442, 833592, 842638, 830574, 801462, 760225, 712097, 662661, 616032, 573583, 535492, 502482, 474926, 451523, 430591, 411979, 396429, 383740, 372871, 363258, 354857, 347298, 340047, 332992, 326141, 319316, 312804, 307515, 303788, 300880, 298317, 296768, 296815, 298017, 300133, 304210, 311401, 321734, 335098, 352385, 374616, 401887, 434100, 471206, 511117, 548452, 577129, 593931, 598795, 593032, 578988, 560446, 541251, 523452, 507809, 495402, 487383, 483707, 483592, 486907, 494017, 504890, 519628]
56864E19628J9866K6732L4626M3502N4616O8168Q1284Q8796Q5357O7801L7986
56853A128362L592k6169m6614n8490o3650o2565n6176m7089l7523k7965j8552
56842F87161r879j710P073J6634K6196L6244M8602O4037Q2049J02772J25262J42710
56830A327151J43201J18667P2219J5810l7527p8682j03752j14000j13885j07274
56820A121928r5904q1582o7416n5279m4049l2068j9913r024Q54J1170K2576L5097
56808G86390M9340O5921Q3585R8132J02783R0627N9626J6391k6846o0331q1372
56797A184246r1722r3528q8858q0367p0140n8984m7756l7894k9782k2358j5118
56786E47739q629k505M879J3789K2644L1106M0682N0558N5488N0182L4353J2032
$$ y = [519628, 539494, 566226, 600852, 644354, 698970, 767138, 848422, 937218, 1022575, 1090376, 1128362, 1131954, 1105785, 1059171, 1000681, 937031, 874466, 818290, 771201, 733678, 705713, 687161, 677282, 675572, 682645, 699279, 725475, 761719, 810321, 874358, 956407, 1059179, 1184441, 1327151, 1470352, 1589019, 1661238, 1677048, 1639521, 1560839, 1457087, 1343087, 1229202, 1121928, 1026024, 944442, 877026, 821747, 777698, 745630, 725717, 716693, 717547, 728717, 751293, 786390, 835730, 901651, 985236, 1083368, 1186151, 1276778, 1336404, 1352795, 1325949, 1265618, 1184246, 1092524, 998996, 910138, 829771, 759631, 700647, 652891, 614997, 585215, 562857, 547739, 539110, 536605, 541484, 555273, 577917, 609023, 649705, 700263, 755751, 805933, 840286, 852318]
56774H52318j1889l2910m7287n4019n5414n3990n0140m3980l7378l2140k7924
56763D05247k3860k0483j8245j5821j2115q408o527o148n851n517n724o019n654
56750B64875n022m726m363l680l488m008l869k381j075j268j834j383q50j657
56736B25271k894k739j442n03j9P60J302O13n73o72J62M19l16j068j201q52j10
56719B16138Q10J200Q54O50J080J365J074J168K128K631J688N39O29J231J049
56704B34234O95J490K934L548L200K698K040R53J40K37N02K03J14R61J742J402
56688B57093Q10J190J959K095K167K853L005J551n7J21J272J205p4q38q30j305
56672B72217k472l384l899m489m681l888l162l804m914m621l195k577l286m109
$$ y = [852318, 840429, 807519, 760232, 706213, 650799, 596809, 546669, 502689, 465311, 433171, 405247, 381387, 360904, 342659, 326838, 314723, 306315, 299788, 293640, 287789, 282272, 276548, 270529, 264875, 259853, 255127, 250764, 247084, 243596, 239588, 235719, 233338, 232263, 230995, 229161, 227778, 226928, 225271, 222377, 219638, 218196, 217693, 217674, 218434, 219736, 220349, 219776, 219104, 219266, 219685, 219369, 218301, 217100, 216248, 216138, 216948, 218148, 219002, 219652, 220732, 222097, 223171, 224339, 226467, 229098, 230786, 231325, 231954, 233185, 234234, 234929, 236419, 239353, 242901, 246101, 248799, 250839, 251792, 251932, 252169, 252671, 252874, 252988, 253949, 255691, 257093, 257903, 259093, 261052, 263147, 265314, 268167, 271172, 272723, 272666, 272787, 274059, 275264, 275190, 274352, 273522, 272217, 269745, 266361, 262462, 257973, 253292, 249404, 246242, 242438, 237524, 232903, 229708, 227131, 223845, 219736]
56658B19736m443m742m896m328l415k965k640j688o62n79r55o14J75L56K25R06
56642A89471K253L176L575M059M349L803K926K573K448K040K071L170M129L550
56628B33593K172J473J087j36j565j840j509k049l035k872j744j241j583j668
56614B19083j410j624k008j626r08r70j410j062l12m07j057j062o73r90j662j603
56598B00299j250j696k250j447J62Q58O80R37J477J211O63J170K052J502j44q49
56582B03375k64J64R8M96J177J051M94P58J366R24Q2O65K216K562J591J314K185
56565B20254K558J953J702K162K223J968K883N130P157Q207Q686Q186N947L134
56551B82150J823J859J578J169K068L459L037J207O97J780J817K2j259q81o38
$$ y = [219736, 215293, 210551, 205655, 201327, 197912, 194947, 192307, 190619, 189957, 189378, 188423, 187809, 187984, 188340, 188565, 189471, 191724, 194900, 198475, 202534, 206883, 210686, 213612, 216185, 218633, 220673, 222744, 225914, 230043, 233593, 235765, 237238, 238325, 238189, 236624, 234784, 233275, 231226, 228191, 225319, 223575, 222334, 220751, 219083, 217673, 216049, 214041, 212415, 211507, 210537, 209127, 208065, 207753, 207346, 206289, 205227, 204554, 203564, 201902, 200299, 199049, 197353, 195103, 193656, 193818, 194676, 195356, 196293, 197770, 198981, 199644, 200814, 202866, 204368, 204224, 203375, 203111, 203275, 203373, 203869, 205046, 206097, 206591, 207349, 208715, 209639, 209721, 210386, 212602, 215164, 216755, 218069, 220254, 222812, 224765, 226467, 228629, 230852, 232820, 235703, 240833, 247990, 256197, 264883, 273069, 279016, 282150, 283973, 285832, 287410, 288579, 290647, 294106, 297143, 298350, 299047, 300827, 302644, 302666, 301407, 300526, 299888]
56536B99888j529j923r52l02j048j694j036k24m95j256j731k192k489j776n64
56521B80677n99j854k289j344r19j943k763k165j278j165j075l45J71j36n60p22
56505B61691j198j801j399j36M58J43L30J280J483M65m12n82j015j683j112P33
56489B57245J891J553J041R67K52j130j473m58k4r72j507m33Q36Q19kp88j659
56472B56158k336j875n82J06J71R01J869J193p60j240M45J742J097rl75r10j801
56455B53794j366N95J666O95l33M6M34l42r74m12J16l16n22J67M11k99k40J279
56437B54399K222J284J42L28P85M88N87J765K349J225LJ53N89J64j10O19J116
56420B68108N20J61Q84J218J95n84J96J201J004M03K83k49j556k004p70M23L24
$$ y = [299888, 298359, 296436, 295484, 295182, 294134, 292440, 291404, 291180, 290685, 289429, 287698, 285506, 283017, 281241, 280677, 280078, 278224, 275935, 274591, 273672, 271729, 268966, 266801, 265523, 264358, 263283, 262938, 263109, 262973, 262413, 261691, 260493, 258692, 257293, 257157, 257615, 257758, 258088, 259368, 260851, 261316, 260904, 260322, 259307, 257624, 256512, 257245, 259136, 260689, 261730, 262697, 262949, 261819, 260346, 259888, 259864, 258892, 257385, 256952, 257788, 258607, 258605, 257817, 256158, 253822, 251947, 251365, 251471, 251642, 252543, 254412, 255605, 254845, 253605, 254050, 255792, 256889, 256880, 256505, 255595, 253794, 252428, 253023, 254689, 255384, 255051, 255097, 255531, 255189, 254215, 253803, 253919, 253603, 253081, 253248, 253659, 253360, 253120, 254399, 256621, 257905, 258047, 258375, 259160, 259648, 260235, 262000, 264349, 265574, 265577, 265730, 266319, 266483, 266373, 266992, 268108, 268628, 268789, 269673, 270891, 271086, 270502, 270698, 271899, 272903, 273306, 273589, 273340, 271784, 269780, 269010, 269433, 269757]
56403B69757J79Q74J013j47p95K16J182Q31P51K295L940M158M021M502M218K374
56387B99369R69J425J910P64l75L44J666J881J998L234M078K940J193N88J59j332
56371C20811k424j540m9K13O7O84Q07o00j599m61R89N59l28O19K253K147R30P26
56353C23804J204P73J2L82J118P81L11J287K659K369P49o70k072m126n534m850
56337C18197l129k018r07J217L026K860J691J279J283R26J297L139M530L815K661
56322C39867L147M076L427K147K136K577J804P83J267K367K298J750K155K635
56308C72436J878J076J710K469J689O89J317K386K030J355K170L324L035K620
56294D00184M082O067O167N237N506O397O057N154N223N248L784K509L686O044
$$ y = [269757, 269936, 270810, 271823, 271676, 270881, 271097, 272279, 273110, 273861, 276156, 280096, 284254, 288275, 292777, 296995, 299369, 300338, 301763, 303673, 304437, 304062, 304406, 306072, 307953, 309951, 313185, 317263, 320203, 321396, 321984, 322143, 320811, 318387, 316847, 316798, 317011, 317078, 317762, 318569, 317969, 316370, 315909, 316898, 317457, 317129, 317748, 320001, 322148, 323078, 323804, 325008, 325781, 325793, 326175, 327293, 328074, 328385, 329672, 332331, 334700, 335449, 334779, 332707, 328581, 323047, 318197, 315068, 313050, 312143, 313360, 316386, 319246, 320937, 322216, 323499, 324425, 325722, 328861, 333391, 337206, 339867, 343014, 347090, 350517, 352664, 354800, 357377, 359181, 359964, 361231, 363598, 365896, 367646, 369801, 372436, 374314, 375390, 377100, 379569, 381258, 381947, 383264, 385650, 387680, 389035, 391205, 394529, 397564, 400184, 404266, 410333, 416500, 421737, 427243, 433640, 439697, 444851, 450074, 455322, 459106, 461615, 465301, 471345]
56280D71345P065P275Q371R341Q634P918R329J1086J0470R009R987J2702J4033
56267E96565J4003J4931J6508J6586J5705J6156J7759J8924K0505K4243K8748
56256H00633L1591L3868L8259M4046M8770N3226O0059O8744P6810Q4721R4668
56245A435395J05650J14673J21842J29480J37172J42209J44031J43805J40751
56236B615008J33267J22406J09876R4237P3536N0056K7543N543j8441m2888o3716
56225C106427q0304r4789j06755j14135j18050j21319j23274j21459j17169j13785
56215A995388j10821j05309r7849r1608q6425p9781p2583o7951o5029o0093n3176
56204A104763m7752m4365m0409l5683l2391l0185k6808k3027k1284k0368j7252
$$ y = [471345, 478410, 485685, 494056, 503397, 512031, 519949, 529278, 540364, 550834, 559843, 569830, 582532, 596565, 610568, 625499, 642007, 658593, 674298, 690454, 708213, 727137, 747642, 771885, 800633, 832224, 866092, 904351, 948397, 997167, 1050393, 1110452, 1179196, 1256006, 1340727, 1435395, 1541045, 1655718, 1777560, 1907040, 2044212, 2186421, 2330452, 2474257, 2615008, 2748275, 2870681, 2980557, 3074794, 3148330, 3198386, 3225929, 3231472, 3213031, 3170143, 3106427, 3026123, 2931334, 2824579, 2710444, 2592394, 2471075, 2347801, 2226342, 2109173, 1995388, 1884567, 1779258, 1681409, 1589801, 1503376, 1423595, 1351012, 1283061, 1218032, 1157939, 1104763, 1057011, 1012646, 972237, 936554, 904163, 873978, 847170, 824143, 802859, 782491, 765239]
56193G65239j3240j2143j3268j2529r729q247q139o273l003j947l209l336j930
56180F68246j877l084k473k67J97j076q30R49J116k22J02J829J633j21L01K888
56164F67311L909L045L671N992O791O105P216R819J0279Q778R095J1197J1413
56151G64621J0040J1185J4752J6375J5856J7751K2829K6824K8683L2268L8771
56140I99955M5155N1264O0844P4251Q7581R9885J13478J26231J31640J27899J19275
56129B037458J07782R1873P4331O2396N7991N5670N1691M7054M0605K8329J1541
56118B666721k692j1397j7991k3783k6213k7169l3558m7272o3143p8503r5414
56107B239586j11695j19905j18215j12879j07249r7849q4032p1436o2498n2981
$$ y = [765239, 751999, 739856, 726588, 714059, 704330, 696083, 687944, 681671, 678668, 676721, 673512, 670176, 668246, 666369, 663285, 660812, 660545, 660742, 659666, 658836, 659785, 660901, 660679, 660781, 662610, 664243, 664122, 664423, 667311, 671220, 674265, 677936, 683928, 690719, 696824, 704040, 713859, 724138, 732916, 742011, 753208, 764621, 774661, 785846, 800598, 816973, 832829, 850580, 873409, 900233, 928916, 961184, 999955, 1045110, 1096374, 1157218, 1231469, 1319050, 1418935, 1532413, 1658644, 1790284, 1918183, 2037458, 2145240, 2237113, 2311444, 2373840, 2431831, 2487501, 2539192, 2586246, 2626851, 2655180, 2666721, 2664029, 2652632, 2634641, 2610858, 2584645, 2557476, 2523918, 2476646, 2413503, 2335000, 2239586, 2127891, 2007986, 1889771, 1776892, 1669643, 1571794, 1487762, 1416326, 1353828, 1300847]
56097A300847m1393l2419k7682k2545j5459j1012j0376q392l568j128k569k232
56085A122072K024M802L710L750P093Q761O730O169R129J0296P514O397R712J2363
56071A220522J1535J1708J4935J6479J4669J4726J8260J9610J7072J6656K0247
56060A396419K1469J8132J6857K0197K1359J7284J4687J7113J8358J4948J2885
56049A589708J5515J7071J4781J4853J9746K2271J9164J7646K1553K4160K1962
56038A798430K1959K7667L1648K9842K9513L4847L8701L7009L7042M2761M6546
56027B175965M4286M3840M9512N3311N0871N0422N6380O0123N7089N6374O3012
56016B761185O7750O5313O5203P2837P8126P5072P4192Q2525Q9974Q9214R0095
$$ y = [1300847, 1259454, 1227035, 1199353, 1176808, 1161349, 1150337, 1139961, 1131569, 1128001, 1126873, 1124304, 1122072, 1124096, 1128898, 1132608, 1136358, 1143451, 1152212, 1158942, 1165111, 1174240, 1184536, 1192050, 1198447, 1208159, 1220522, 1232057, 1243765, 1258700, 1275179, 1289848, 1304574, 1322834, 1342444, 1359516, 1376172, 1396419, 1417888, 1436020, 1452877, 1473074, 1494433, 1511717, 1526404, 1543517, 1561875, 1576823, 1589708, 1605223, 1622294, 1637075, 1651928, 1671674, 1693945, 1713109, 1730755, 1752308, 1776468, 1798430, 1820389, 1848056, 1879704, 1909546, 1939059, 1973906, 2012607, 2049616, 2086658, 2129419, 2175965, 2220251, 2264091, 2313603, 2366914, 2417785, 2468207, 2524587, 2584710, 2641799, 2698173, 2761185, 2828935, 2894248, 2959451, 3032288, 3110414, 3185486, 3259678, 3342203, 3432177, 3521391, 3611486]
56005C611486J00055J09416J10888J14128J25734J34939J34866J37302J50012
55996D728826J60878J61579J64722J79523J93504J97308K03886K23195K42331
55987F455752K51642K64934K91797L16593L28424L44241L77318M11635M33977
55978I476313M61255N07695N56392N93615O38609P07323P81082Q45379R23046
55969A5490709J032273J151040J263127J397786J580808J791648K016132K292785
55961B8016308K655644L086352L581366M206497N020086O010904P187043Q648716
55953F8412916J0490359J2731595J5455604J8903038K3304915K8778880L5502829
55946B13580136M3515675N1599274N6352385N3373113M0412409J9635198l427313
$$ y = [3611486, 3711541, 3820957, 3931845, 4045973, 4171707, 4306646, 4441512, 4578814, 4728826, 4889704, 5051283, 5216005, 5395528, 5589032, 5786340, 5990226, 6213421, 6455752, 6707394, 6972328, 7264125, 7580718, 7909142, 8253383, 8630701, 9042336, 9476313, 9937568, 10445263, 11001655, 11595270, 12233879, 12941202, 13722284, 14567663, 15490709, 16522982, 17674022, 18937149, 20334935, 21915743, 23707391, 25723523, 28016308, 30671952, 33758304, 37339670, 41546167, 46566253, 52577157, 59764200, 68412916, 78903275, 91634870, 107090474, 125993512, 149298427, 178077307, 213580136, 257095811, 308695085, 365047470, 418420583, 458832992, 478468190, 475040877]
55939D75040877k3239779l6827329m3932232m5779467m4019004m0214203l5547998
55932B05480865l0711570k6070215k1875369j8275095j5255935j2723866j0622511
55925F9946304q915372p520885o351164n377697m595056l957788l410525k943954
55917B6873863k566535k252761j968719j718766j519952j356492j202074j062133
55909A3226431r53634q65733p78190o97235o37746n89705n35700m82830m45758
55900G239900m16149l78813l40965l16708k98949k74045k48485k34545k24783
55891D506458k06457j86505j77248j71448j56033j37176j27851j23106j10922
55882C109712r5559q7663q2579p0710n8507n7548o2745o2195n8958o2739o9457
$$ y = [475040877, 451801098, 414973769, 371041537, 325262070, 281243066, 241028863, 205480865, 174769295, 148699080, 126823711, 108548616, 93292681, 80568815, 69946304, 61030932, 53510047, 47158883, 41781186, 37186130, 33228342, 29817817, 26873863, 24307328, 22054567, 20085848, 18367082, 16847130, 15490638, 14288564, 13226431, 12272797, 11407064, 10628874, 9931639, 9293893, 8704188, 8168488, 7685658, 7239900, 6823751, 6444938, 6103973, 5787265, 5488316, 5214271, 4965786, 4731241, 4506458, 4300001, 4113496, 3936248, 3764800, 3608767, 3471591, 3343740, 3220634, 3109712, 3014153, 2926490, 2843911, 2773201, 2714694, 2657146, 2594401, 2532206, 2473248, 2410509, 2341052]
55871B341052o9201o5812o8911p4590p2996o7363o7000o8816o3937n5688n3264
55860A613474n4084m9586m2332m0590m1869l8122l1644k9981l0665k6525k0743
55849A207333k1312k5669k5791k3560k6243l1432l1194k6959k6090k7664k5446
55838I15973k1073k0804k2889k1149j7385j7495j9224j6392j1458j1148j3405
55827G23551j1320o476n694p855o606l215m169q523r857q663j0703j5079j5572
55814F09819j2297j0870j1488r641o066n484o890n255j321J21q1K736P401Q846
55800E59530P886R396J2546J2400R475Q220P795L780k555o149p550j1089j5479
55787E88206j5728j2835j2027j2806j0285n394m110p264j0185j1738j4678j7788
$$ y = [2341052, 2271851, 2206039, 2137128, 2062538, 1989542, 1922179, 1855179, 1786363, 1722426, 1666738, 1613474, 1559390, 1509804, 1467472, 1426882, 1385013, 1346891, 1315247, 1285266, 1254601, 1228076, 1207333, 1186021, 1160352, 1134561, 1111001, 1084758, 1053326, 1022132, 995173, 969083, 941419, 915973, 894900, 874096, 851207, 830058, 812673, 795178, 775954, 759562, 748104, 736956, 723551, 712231, 705755, 700061, 692206, 685600, 682385, 678216, 669693, 659836, 651173, 640470, 625391, 609819, 597522, 586652, 575164, 565523, 559457, 553973, 547083, 541828, 540507, 540628, 540547, 543283, 550684, 559530, 567416, 576812, 589358, 601758, 611233, 619453, 627248, 631028, 628473, 622324, 614774, 603685, 588206, 572478, 559643, 547616, 534810, 524525, 519131, 515021, 507757, 497572, 485834, 471156, 453368]
55775D53368j6814j2865j1149j1666r624m701j374l72J715M479L752k81k944l195
55761C88329m288o510o783n439n871p664p260n069m661n555m218j610k018m901
55747C16482n673m169m480o637o490l923l233m923m925k603j874l550l985k279
55733B57738j656k683k054Q01K505K044J898K178J27l811n804n209n158o077n071
55718B29768k268j273k593k877j389r45j816j066J357K193J207J678L858M363
55704B30197K773K413L705L213L35j494j387k412n153o273m888m205n266n179
55690B06379l106j954k526j962L65J321J06k1K114L486K750K586M251N341M887
55675B24017N147O353N307J336j749j871j654k946l664k472j531k117k291j231
$$ y = [453368, 436554, 423689, 412540, 400874, 391250, 386549, 385175, 384803, 386518, 390997, 394749, 394468, 391524, 388329, 384041, 377531, 370748, 365309, 359438, 351774, 344514, 339445, 334784, 329229, 325011, 323401, 321383, 316482, 310809, 306640, 302160, 295523, 289033, 285110, 281877, 276954, 272029, 269426, 267552, 264002, 260017, 257738, 256082, 253399, 251345, 252146, 254651, 256695, 258593, 260771, 260898, 257087, 251283, 246074, 240916, 234839, 229768, 227500, 226227, 223634, 220757, 219368, 218423, 216607, 215541, 216898, 219091, 220298, 221976, 225834, 230197, 232970, 235383, 239088, 242301, 242636, 241142, 239755, 237343, 232190, 225917, 221029, 216824, 211558, 206379, 203273, 201319, 198793, 196831, 197196, 198517, 198623, 198602, 200716, 204202, 206952, 209538, 213789, 219130, 224017, 229164, 235517, 240824, 242160, 240411, 238540, 236886, 233940, 230276, 227804, 226273, 224156, 221865, 220634]
55661B20634j149k602k631K5K459K707K792M313N518N185N108O214O332M298K265
55646B61468J598M51k306m656n244n775p398q441p934p657q516q653p196o242
55632A83499o921p124n312l062j846p40O40N53j417k803k212j503k060k324j069
55617A46299J70j6o35p27j092j953j955r55p17j579j695o82m77j452j576n79q32
55600A29547k660l091j081L63o47j875j434j033k138k868j591k9N2q3R21J672
55584A14025Q86ML48N80m32j138k37O97O2r28n99M78J231J982K683K023K38j27
55566A21776J838L498K804J278Q59Q00l9p27m63m28j303j569m15M56j2j65J103
55549A29291K036J119l45j005j809l308l665j940m14j003k021j216O00J563J902
$$ y = [220634, 219485, 216883, 214252, 214277, 216736, 219443, 222235, 226548, 232066, 237251, 242359, 248573, 254905, 259203, 261468, 263066, 263517, 261211, 256555, 251311, 245536, 238138, 229697, 221763, 214106, 205590, 196937, 189741, 183499, 176578, 169454, 164142, 161080, 159234, 158494, 159134, 159687, 158270, 155467, 153255, 151752, 149692, 147368, 146299, 146469, 146453, 145818, 145091, 143999, 142046, 140091, 139136, 138419, 136840, 135145, 134463, 133986, 132534, 130958, 130379, 129547, 126887, 123796, 122715, 123078, 122431, 120556, 119122, 118089, 115951, 113083, 111492, 111463, 111515, 111432, 112353, 114025, 114911, 114915, 115263, 115843, 115411, 114273, 114036, 114733, 114795, 113867, 113268, 113746, 114977, 116959, 119642, 121665, 121903, 121776, 123614, 127112, 129916, 131194, 132053, 132853, 132814, 132087, 131624, 131196, 129893, 128324, 127909, 128365, 128353, 128188, 129291, 131327, 132446, 132101, 131096, 129287, 125979, 122314, 120374, 119960, 118957, 116936, 115720, 116320, 117883, 119785]
55534A19785K490K603J732J320K284K986J927J81r83k295m185m987l791k509k680
55519A13878k921j933j255k293l435k964k240k948l715k645r47p40j321p89L91
55504H4123N32p4j29n3r77k365l077l399l751l023m78K302L629M131M872N077
55488H7340L970K811K703K385P45o08P6J480J439M61L13P65N55N8K44M23l43j057
55470A03760n02L78J50n72o59p52j603j936o23P94M83m75j11R18P08l98o99k27
55452I8634j17j40M88J002M62o5O74J482O09j051j477r68j194j936j693n78Q5
55435I4217K77P66J018J79q39p15j52m82j032m08P05P56J94M05R29M88k36K12
55417I6282J092O74m29k20J069J406N04j8K93L29l5K11Q92P81j6k13J82r6j081
$$ y = [119785, 122275, 124878, 126610, 127930, 130214, 133200, 135127, 135308, 134325, 132030, 127845, 122858, 119067, 116558, 113878, 110957, 109024, 107769, 105476, 102041, 99077, 96837, 93889, 90174, 87529, 86582, 85842, 84521, 83732, 84123, 84655, 84581, 84452, 84399, 83422, 81057, 77980, 74581, 70830, 67807, 67329, 69631, 73260, 77391, 82263, 87340, 91310, 94121, 96824, 99209, 99954, 99346, 99422, 100902, 102341, 102802, 103115, 103880, 104435, 104493, 104737, 105160, 104817, 103760, 103258, 103636, 103786, 103214, 102555, 101803, 100200, 98264, 97641, 98435, 98918, 98443, 98332, 99250, 99958, 99560, 98861, 98634, 98517, 98377, 98865, 99867, 100329, 100264, 100938, 102420, 103029, 101978, 100501, 99533, 98339, 96403, 94710, 94132, 94217, 94494, 95260, 96278, 96457, 95618, 94903, 94751, 94269, 93237, 92829, 93534, 94290, 94484, 94889, 95818, 96306, 96070, 96282, 97374, 98048, 97619, 97399, 98468, 99874, 100378, 100360, 100653, 100982, 100947, 101158, 102050, 102831, 102815, 102602, 102784, 102688, 101607]
55398A01607j449q83m51n88o11l03k21m55n70n86p34p01m23p21j826k380j422
55381H7283j27J30O3Q82J825J583Q78J204K116K177J555J286R81j77j176n43Q71
55364A00811J093K33j65j02p34j654j397k61J06m26n40o5Mk52P9O03J51q30q30
55345I5824Q6N65M92Q60J443J057p0n70l54m99r99q75k85k04l67K88J391J576
55327I9359Q19J99j89r29j502j028k01j22n8J196K550K031K98k84M43N43l76p35
55309A02014j82p3o47o91j47k50q10l13J092J539O91J54L27k04j625k167j182
55292I7526k02j67r5O03J018P33N92P70L51m81k31J169J743N86o85n73K05L79
55274A03241N1n5J60M75O71J93j161k282k003j082j079j603r34P69J487O83nK28
$$ y = [101607, 100158, 99275, 98824, 98236, 97625, 97322, 97101, 96646, 96076, 95490, 94756, 94055, 93632, 92911, 91085, 88705, 87283, 87156, 87286, 87349, 88231, 90056, 91639, 92517, 93721, 95837, 98014, 99569, 100855, 101836, 101659, 100483, 99940, 100811, 101904, 102137, 101972, 101870, 101136, 99482, 98085, 97824, 97930, 97504, 96964, 96899, 96903, 96651, 96730, 97333, 97484, 96654, 95824, 95910, 96475, 96967, 97827, 99270, 100327, 100257, 99687, 99333, 98834, 97835, 96960, 96675, 96471, 96104, 96392, 97783, 99359, 100178, 100377, 100188, 99259, 97757, 96729, 96528, 96406, 96348, 97544, 100094, 102125, 102423, 102139, 102582, 103125, 102749, 102014, 101832, 101759, 101112, 100421, 100274, 100024, 99214, 98901, 99993, 101532, 102223, 102377, 102704, 102500, 100875, 98708, 97526, 97324, 97157, 97062, 97665, 98683, 99416, 100008, 100778, 101129, 100648, 100417, 101586, 103329, 103915, 103230, 102657, 102862, 103241, 103292, 103237, 103397, 103872, 104543, 104736, 103575, 101293, 99290, 98208, 97129, 95526, 94592, 95361, 96848, 97531, 97526, 97754]
55256I7754K73m21p93l47o1l45l16K52L68j37j66M38M19n11j029n23N1K32P32
55237I5870J440J119j86q15k62J7o00q54k22o0r30j256n9J252J302Q86J155J606
55219I9403J427J067J047P63j43p01j54P59J157J197J038J84j132j613r13l81
55203A03005q07j181o65o9j47j93M37J028R74R66J440J459M60l97o3O24M21l41
55185A06951o43n09n01m88j76l0m62r75r50n59j50L61Q59Q46M06K79N54M63j02
55166A05174k97Q0K17l9K05J073J433R16O04R93J062K73l49j19O2n84j369j542
55148A07793j423j214l40R97J407N40o3N47J215Q86L79N14M16n79j147lJ696J931
55130A13552P09n21j200j711j915j410o27k35n7L23O56P61J196K095K404J421
$$ y = [97754, 98027, 97606, 96813, 96466, 96405, 96060, 95744, 95996, 96364, 96227, 96061, 96499, 96918, 96407, 95378, 94855, 94906, 95138, 95870, 97310, 98429, 98243, 97428, 97166, 97183, 96583, 95729, 95507, 95447, 94517, 93261, 93202, 94454, 95756, 96642, 97797, 99403, 100830, 101897, 102944, 103707, 103564, 102863, 102709, 103468, 104625, 105822, 106860, 107044, 105912, 104299, 103386, 103005, 102198, 101017, 100352, 100283, 100136, 99943, 100380, 101408, 102382, 103348, 104788, 106247, 106707, 106310, 106247, 106871, 107292, 106951, 106308, 105799, 105298, 104810, 104634, 104604, 104142, 103167, 102217, 101658, 101508, 101869, 102728, 103574, 103980, 104259, 104813, 105276, 105174, 104877, 104957, 105174, 105135, 105340, 106413, 107846, 108762, 109366, 110359, 111421, 111694, 111345, 111226, 111288, 110704, 109335, 107793, 106370, 105156, 104816, 105813, 107220, 107760, 107697, 108244, 109459, 110345, 110724, 111238, 111654, 111075, 109928, 109925, 111621, 113552, 114261, 113740, 112540, 110829, 108914, 107504, 106877, 106642, 106585, 106908, 107564, 108325, 109521, 111616, 114020, 115441]
55114A15441Q3m30l60m58n28j51J77r2m05r3L95L45rj59l19o76o41Q1O82M98J35
55093A13516K68M68J83j93k51l71o52l17P50J280O56J50P66J387P25l09r9R42
55075A18899J182M81J50O56J215J308J068N02l96j084j131r64r54n30O79J671
55059A22752J341K33l55l40n30j008j250j291j485j499p88K69Q92J070J178R92
55043A20181J96o69q84o48n24l33K99Q67O43r5n11m83m19l55j61j84p33j357j435
55024A13395j079o83j79N32J021R52O30L61o2o35q51o42o88j141j154l10N92R33
55006A10992J129J358Q49n39j375n52J076K085K290K118J485N78L45R47J046k4
54990A23808q10K4J469J841J381J327J591J226L25l68q75j381j167J07J132P42
$$ y = [115441, 115524, 115094, 114734, 114276, 113748, 113597, 113774, 113682, 113277, 113184, 113579, 113924, 113915, 113756, 113437, 112761, 112120, 112201, 112883, 113381, 113516, 113784, 114252, 114435, 114242, 113991, 113620, 112968, 112651, 113401, 114681, 115337, 115487, 116253, 117640, 118365, 118056, 117957, 118899, 120081, 120562, 120712, 121368, 122583, 123891, 124959, 125461, 125065, 123981, 122850, 121886, 120932, 120402, 121081, 122752, 124093, 124326, 123971, 123631, 123101, 122093, 120843, 119552, 118067, 116568, 115780, 116049, 116941, 118011, 119189, 120181, 120377, 119708, 118824, 118176, 117652, 117319, 117618, 118485, 119128, 119033, 118522, 118039, 117620, 117265, 117104, 116920, 116187, 114830, 113395, 112316, 111633, 111454, 111986, 113007, 113959, 114589, 114950, 114888, 114253, 113402, 112760, 112072, 110931, 109777, 109467, 110059, 110992, 112121, 113479, 114328, 113789, 112414, 111862, 112938, 115023, 117313, 119431, 120916, 121494, 121839, 122786, 123832, 123808, 122998, 123022, 124491, 126332, 127713, 129040, 130631, 131857, 132182, 131814, 130939, 129558, 128391, 128498, 129630, 130372]
54974A30372p0K06R62N60p67j316o13L45J082J821K142J418L95M01J287J782J581
54957A41588J375J235P28J82J50L4j011k257k330j507j185j445j156k50J80m2
54941A34289M9O58R31O56N64Q49R11O35M52L29Q8M16J880L335L090J523O80J394
54923A52729K646L690M928O477P690Q369Q852Q792P417N065K938J232q50l230
54909B16745m776n167n305n766o247o660p182p215n926l894k658k517k372j751
54895A49309j254r39j31R53J166L62k83k04l7o1K88R91J240J045J425K577L503
54878A59950L815M315N333O197O724P548Q402P866N543K827Q27r55l091m989o062
54863B04250o649o957o424n048m051m253m928n104m833m445l695k527j593j199
$$ y = [130372, 130302, 130508, 131470, 132030, 131263, 129947, 129334, 129679, 130761, 132582, 134724, 136142, 136537, 136938, 138225, 140007, 141588, 142963, 144198, 144926, 145108, 145258, 145292, 144281, 142024, 139694, 138187, 137002, 135557, 134401, 134151, 134331, 134289, 134338, 134996, 135927, 136583, 137147, 137996, 138907, 139542, 139994, 140323, 140411, 140827, 142707, 146042, 149132, 150655, 151335, 152729, 155375, 159065, 163993, 170470, 178160, 186529, 195381, 204173, 211590, 216655, 219593, 220825, 219975, 216745, 211969, 206802, 201497, 195731, 189484, 182824, 175642, 168427, 162501, 158607, 155949, 153432, 151060, 149309, 148055, 147116, 146985, 147938, 149104, 149466, 149183, 148979, 148942, 148881, 149169, 150160, 151400, 152445, 153870, 156447, 159950, 163765, 168080, 173413, 179610, 186334, 193882, 202284, 210150, 215693, 218520, 219347, 218392, 215301, 210312, 204250, 197601, 190644, 184220, 179172, 175121, 170868, 165940, 160836, 156003, 151558, 147863, 145336, 143743, 142544]
54849A42544p37O7L56n16j801k344k008j418r63p14o58n07N4N82J74j070j804
54832A29237j151J82R80R61O73O65J082J537J247l4j339j558j000p72q46k36R42
54815A30570J308M61l13j35J57l49j088j090m32K58Q41J337J411R12L54K15M04
54798A34821P04J025J028L91l31j59P96J375J136Q85J125J292J008P66Q41P09
54782A47412J78j79k02n39j201j113J50J459J822J762K090K541K662K947L966
54767A63755N152N690N819O287P058P565P634P342O390M489J978n24k689m348
54753B21598n342n910o613p451p769p274o452n686m817l818k968k090p43N83P03
54738A55951l99j238r16j80K31P37J582J844J024L20R43K280L097L589M680O012
$$ y = [142544, 141807, 141874, 142230, 141714, 139913, 137569, 135561, 134143, 133180, 132466, 131808, 131301, 131355, 131937, 132111, 131041, 129237, 128086, 128268, 129248, 130209, 130882, 131547, 132629, 134166, 135413, 135379, 134040, 132482, 131482, 130710, 129864, 129628, 130570, 131878, 132339, 132026, 131891, 132048, 131699, 130611, 129521, 129089, 129347, 130188, 131525, 132936, 133848, 134202, 134417, 134821, 135525, 136550, 137578, 137969, 137638, 137479, 138275, 139650, 140786, 141671, 142796, 144088, 145096, 145862, 146703, 147412, 147590, 147411, 147209, 146670, 145469, 144356, 144506, 145965, 147787, 149549, 151639, 154180, 156842, 159789, 163755, 168907, 174597, 180416, 186703, 193761, 201326, 208960, 216302, 222692, 227181, 229159, 228635, 225946, 221598, 216256, 210346, 203733, 196282, 188513, 181239, 174787, 169101, 164284, 160466, 157498, 155408, 154665, 155248, 155951, 155552, 154314, 153398, 153218, 153449, 154186, 155768, 157612, 158636, 158956, 159899, 162179, 165276, 168865, 173545, 179557]
54722A79557O391N863N702O407O988O446M913L127J520O8j494l346n262o697p408
54707B02775p675p627o923n435l810k852k695k909l040k789k081j227o66m25k94
54692A52327m46j173k050k235j663j080p89m26o0k98j009j190n32L9q1k94o0K08
54674A39188R3p6j05m10r15p28L33J061O52m4m4J31m50j438j794j330n78J92Q11
54655A34549Q14J49l38o2L54J95j84j25J55K28M36J118J619J247N39L98O32M77
54637A42201M5M5M27M71%m91o89o80n94o07r94j544j541q16j65j28j67K65P07
54618A35745O37N03Q85J386J330Q35K81m10j088r15L20J333J014J38J02P46Q80
54601A43722K77l09n89q30r19o26l98o99j005o60j47k43n08o1P00O70p0m88l91
$$ y = [179557, 185948, 191811, 197513, 203920, 210908, 217354, 222267, 225394, 226914, 226982, 225488, 222142, 216880, 210183, 202775, 195100, 187473, 180550, 175115, 171305, 168453, 165758, 162849, 159809, 157020, 154939, 153712, 153046, 152621, 152327, 151881, 150708, 148658, 146423, 144760, 143680, 142891, 142465, 142405, 142107, 141098, 139908, 139376, 139415, 139334, 139040, 138980, 139188, 139281, 139205, 139100, 138690, 137775, 137047, 137380, 138441, 139093, 139049, 139005, 139136, 138686, 137248, 135454, 134124, 133546, 133738, 134549, 135363, 135512, 135174, 135112, 135466, 135661, 135477, 135352, 135507, 135735, 136171, 137289, 138908, 140155, 140694, 141092, 141724, 142201, 142246, 142291, 142718, 143189, 143189, 142698, 142009, 141329, 140735, 140128, 139134, 137590, 136049, 135233, 135068, 134940, 134773, 135038, 135745, 136382, 136885, 137770, 139156, 140486, 141321, 141602, 141192, 140104, 139189, 139509, 140842, 141856, 141994, 142096, 142842, 143722, 143999, 143690, 143101, 142271, 141352, 140726, 140328, 139629, 138624, 137964, 137817, 137574, 137066, 137005, 137705, 138375, 138305, 137817, 137426]
54582A37426m09m61J19J025J197O01K91O04P80N24M20N59K03p12j113l77P20J191
54564A42588J065R20R42R77Q65M93n4l79k37Jk4OM33O76M3q75q38J23O77J46p16
54543A46832r87n11N45J963L000K793J555M73J62J56R3L09Q23P90l12j705k187
54526A53792j507m58J2m44j345j703r43M00J303J420J176Q91N33K47L25O56Q18
54509A55173P36N70J21q30j705j593o60j30o20j356j411q87m53l42k85m7L66P90
54491A47437R85Q21M55J06j27r8M58J365J760R97m18j312j154l33N11R16O90J97
54473A53256K76J189K114K241J904J777J613Q25j33k56M03Q64P58N57L94n6n67
54456A67159n61l40q31j889k228j375l68j09k03k4K35K25J91L23K26l22p60n80
$$ y = [137426, 137017, 136556, 136675, 137700, 138897, 139498, 139789, 140393, 141173, 141697, 142117, 142676, 142879, 142167, 141054, 140677, 141397, 142588, 143653, 144573, 145515, 146492, 147357, 147850, 147796, 147417, 147180, 147181, 147157, 147163, 147596, 148272, 148315, 147440, 146602, 146725, 147402, 147548, 146832, 145845, 145334, 145879, 147842, 150842, 153635, 155190, 155663, 155825, 155981, 156074, 156383, 157206, 157996, 157684, 155979, 153792, 152285, 151827, 151839, 151395, 150050, 148347, 147404, 147804, 149107, 150527, 151703, 152594, 153127, 153374, 153699, 154355, 155173, 155909, 156479, 156600, 155770, 154065, 152472, 151812, 151682, 151062, 149706, 148295, 147408, 146955, 146613, 146328, 146281, 146647, 147437, 148422, 149243, 149698, 149804, 149677, 149579, 150037, 151402, 153162, 154159, 153741, 152429, 151275, 150942, 151453, 152369, 153059, 153256, 153532, 154721, 156835, 159076, 160980, 162757, 164370, 165195, 165062, 164806, 165209, 166073, 166831, 167388, 167782, 167726, 167159, 166598, 166258, 165427, 163538, 161310, 159935, 159567, 159458, 159255, 159231, 159466, 159691, 159882, 160205, 160431, 160109, 159349, 158769]
54438A58769j59j29l78l15K28Q00Q49K35o14r68n55N3K60L32Q44J470J313L40
54420A62375m67m97q9L48Q16J127Q69K31q1L3%j40M17J639K190J314N9k01M05
54401A70348Q59Q81Q63Q11M75K19O63J553J880J222K59k03j55j42n26j190j836
54384A75981k257k360k003j107K4P87R45R54J242J475J106L72O7L60O14M27J38
54367A76765J29L14N60R85J557J916J898J804J921K132K275K434K734L055L171
54352B03650K885K106J020Q8m62r58j725k458k674k561k714l213l633l747l615
54337A81989l191k492j939j694j106K36J328Q82o33j469j120q20j351j865j483
54322A65272o63j93K4L53N81M98N12Q68J001M16m18p43n61l48l09m32p72j119
$$ y = [158769, 158610, 158481, 158103, 157788, 158016, 158816, 159665, 159900, 159286, 158318, 157763, 157816, 158076, 158408, 159252, 160722, 162035, 162375, 161908, 161411, 161322, 161670, 162486, 163613, 164482, 164713, 164632, 164665, 164665, 164525, 164942, 166581, 168771, 170085, 170144, 169943, 170348, 171207, 172088, 172951, 173762, 174237, 174456, 175119, 176672, 178552, 179774, 180033, 179830, 179675, 179533, 179007, 177817, 175981, 173724, 171364, 169361, 168254, 168278, 169065, 170010, 170964, 172206, 173681, 174787, 175159, 175226, 175586, 176200, 176627, 176765, 176894, 177208, 177768, 178753, 180310, 182226, 184124, 185928, 187849, 189981, 192256, 194690, 197424, 200479, 203650, 206535, 208641, 209661, 209749, 209287, 208329, 206604, 204146, 201472, 198911, 196197, 192984, 189351, 185604, 181989, 178798, 176306, 174367, 172673, 171567, 171803, 173131, 174013, 173380, 171911, 170791, 169971, 168620, 166755, 165272, 164609, 164416, 164440, 164793, 165374, 165872, 166384, 167252, 168253, 168669, 168251, 167508, 166947, 166599, 166290, 165858, 165086, 163967]
54304A63967r43j76N09O02L82K23rm37p00n35j86K01Q68J596J493L05q53q80j40
54285A65287K96K14K01M64P30R93J484K008K016J323K32q37j466j326o57l03p26
54268A69933j331j321p83l34n8M61J262J881K035J859J540J197J027J118J205
54253A79691R73N34K24J31J30K58N95R28Q96L89m20j289j922j968j363n59j48
54236A77080k94o75q63o72k51J16M02Q51J463J719J256N28J92J04l08q23o44J22
54218A79303L51l50q83k85Q40J260Q09K54J9j46n14j085j747k219k110j449q12
54201A71236n72m52j32J14m0k71j4P04J347J521J206N66r6m62n46o64r33j149
54183A71363j205j110o18M69J538J605P50J55L32M22j71o14j0R96J220P59O01
$$ y = [163967, 163024, 162848, 163357, 163959, 164341, 164564, 164555, 164118, 163418, 162883, 162697, 162898, 163766, 165362, 166855, 167160, 166307, 165427, 165287, 165583, 165797, 165998, 166462, 167192, 168185, 169669, 171677, 173693, 175016, 175248, 174411, 172945, 171619, 170962, 170659, 169933, 168602, 167281, 166498, 166164, 166106, 166567, 167829, 169710, 171745, 173604, 175144, 176341, 177368, 178486, 179691, 180664, 181198, 181422, 181553, 181683, 181941, 182536, 183464, 184360, 184749, 184329, 183040, 181118, 179150, 177787, 177228, 177080, 176786, 176111, 175248, 174576, 174325, 174441, 174843, 175694, 177157, 178876, 180132, 180660, 180852, 180956, 180648, 179825, 179181, 179303, 179654, 179304, 178421, 178136, 178976, 180236, 181045, 181299, 181318, 181172, 180658, 179573, 177826, 175607, 173497, 172048, 171236, 170664, 170212, 170080, 170194, 170154, 169883, 169869, 170573, 171920, 173441, 174647, 175213, 175117, 174655, 174109, 173445, 172512, 171363, 170158, 169048, 168430, 168899, 170437, 172042, 172792, 172947, 173279, 173701, 173530, 172916, 172906, 173902, 175122, 175881, 176482]
54166A76482Q74P56j5p28p84l52J42M38L29k35r16j281j254r16j95P08J007J38
54148A74198j318k160j910j059k45K80N30P66J409K408K885K022K62j008r10J83
54132A76333J223J399O45k67k91Q16K107K478J828R06L69M44J053J758J905J348
54116A94054P52O77Q54Q18P58R91J115N38m26q96p02n06p27j117j332j250p64
54099A92837O9P09O16N5j57L40J191K016K714L219L527L924M678N578O280O921
54083B34517P704Q083P089M553J339j600l863n365o132o431o514o175n096l596
54069B18513k461k011j884j783j754j653j044N9R07Q35R3m45k61L48O90N05K78
54052B08932O09J373J890K045K609M046N603O235O001N731N700N521N171N104
$$ y = [176482, 177356, 178112, 178097, 177369, 176585, 176233, 176375, 176813, 177142, 176907, 175991, 174710, 173456, 172540, 172345, 173053, 174060, 174198, 172880, 170720, 168810, 167751, 167506, 167786, 168316, 169082, 170491, 172899, 175784, 177806, 178068, 177060, 176150, 176333, 177556, 178955, 179600, 179333, 179042, 179858, 181965, 184443, 186271, 187177, 187546, 187990, 189043, 190801, 192706, 194054, 194806, 195483, 196337, 197155, 197913, 198904, 200019, 200557, 200131, 199235, 198533, 198027, 197300, 196183, 194851, 193601, 192837, 192906, 193615, 194231, 194286, 194129, 194469, 195660, 197676, 200390, 203609, 207136, 211060, 215738, 221316, 227596, 234517, 242221, 250304, 257393, 261946, 263285, 261685, 257822, 252457, 246325, 239894, 233380, 227205, 222109, 218513, 216052, 214041, 212157, 210374, 208620, 206967, 205923, 205982, 206889, 207724, 207817, 207372, 207111, 207459, 208149, 208654, 208932, 209541, 210914, 212804, 214849, 217458, 221504, 227107, 233342, 239343, 245074, 250774, 256295, 261466, 266570]
54038B66570N237M817L640K603K506K922K853K178J775K276L170L426K756J902
54024C08631J676J988K128J790J302R50O31K71lk65q54j725k415k839l483m435
54008C03348n005m805m453m577m862m827m775n064n172m505l613l436l725l488
53994B41041k658k087k021j842j335r71q42n04o6k57j091j607j355j067j291j438
53978B20609q81j66k47j024j496j046K0J017J449J216O55L13L99N83M94J73p2
53961B21996l8K51O00P37N55L53N39J126J761K223K548K760K837L007L645M808
53945B49708O174P490Q843J0529J2852J5892J9040K0942K0351J7132J2137O386
53933D07476P60l747o345p180p204p175p073o569n652m640l834l226k420j054
$$ y = [266570, 271807, 276624, 280264, 282867, 285373, 288295, 291148, 293326, 295101, 297377, 300547, 303973, 306729, 308631, 310307, 312295, 314423, 316213, 317515, 318465, 319096, 319367, 319364, 319099, 318245, 316520, 314105, 311266, 307783, 303348, 298343, 293538, 289085, 284508, 279646, 274819, 270044, 264980, 259808, 255303, 251690, 248254, 244529, 241041, 238383, 236296, 234275, 232433, 231098, 230127, 229285, 228781, 228715, 228458, 227367, 225760, 224405, 223338, 222047, 220609, 219728, 219562, 219315, 218291, 216795, 215749, 215769, 216786, 218235, 219451, 220106, 220419, 220818, 221401, 221895, 222068, 221996, 221958, 222209, 222809, 223546, 224101, 224454, 224993, 226119, 227880, 230103, 232651, 235411, 238248, 241255, 244900, 249708, 255882, 263372, 272215, 282744, 295596, 311488, 330528, 351470, 371821, 388953, 401090, 407476, 408236, 404489, 398144, 390964, 383760, 376585, 369512, 362943, 357291, 352651, 348817, 345591, 343171, 342117]
53919C42117N95J743K062K138K601L354M150N257O792P922P776O802O161N962
53905D05432N251L686K083J096M73j20n74r46j628k516k877k564k490l330m506
53890C96470n113n215n557o436p460q135q176p570o715o257o375o456n854m744
53876C06407l893l744l993m015l551l010l033l644m041l577k703k385k798l302
53862B58718l585m004m555m441l171j484o03q48j488j710j364q14m53l32k76k17
53846B29373k64l50j71K70M13p6o94q53q50j298j867j606l89Q43J410J474J210
53829B26575L87q40j624j453q51n63n95m85MP67J549J996J913J619J613J859J927
53812B33798J786J780J843J616J368J812K791L252K834K430K736L310L662M181
$$ y = [342117, 342712, 344455, 346517, 348655, 351256, 354610, 358760, 364017, 370809, 378731, 386507, 393309, 399470, 405432, 410683, 414369, 416452, 417548, 418021, 417901, 417327, 416381, 414753, 412237, 409360, 406796, 404306, 400976, 396470, 391357, 386142, 380585, 374149, 366689, 358554, 350378, 342808, 336093, 329836, 323461, 317005, 311151, 306407, 302514, 298770, 294777, 290762, 287211, 284201, 281168, 277524, 273483, 269906, 267203, 264818, 262020, 258718, 255133, 251129, 246574, 242133, 238962, 237478, 236875, 236027, 234539, 232829, 231465, 230651, 230198, 229866, 229590, 229373, 229109, 228759, 228588, 228858, 229271, 229195, 228501, 227648, 226798, 225500, 223633, 222027, 221638, 222481, 223891, 225365, 226575, 226962, 226122, 224498, 223045, 222194, 221631, 221036, 220551, 220555, 221322, 222871, 224867, 226780, 228399, 230012, 231871, 233798, 235584, 237364, 239207, 240823, 242191, 244003, 246794, 250046, 252880, 255310, 258046, 261356, 265018, 269199]
53798B69199N148N825N519M791M546M612M263L649L491L659L281K207J305J174
53784C22669J406J390J085P14K61m45j451k668l899m779n052m949n010n413n667
53769B88192n153l857k557k198l053m391n090m582l184j611m10J09j76j085k067
53754B48887k431j843p15n4n47j630j959j109k40m84j318j415p25m52j048j561
53738B31356j227n69l10k39J79P86J031Q36N55M52O06R51J140Q42M04O26J535
53721B38954K125J685P36K18L68Q74J510K055K119J699J427J755K312K529K451
53706B62817K438K515K529K533K553K388K071K087K663L362L702L696L432K813
53692C01599K154K253L237L937L254J543Oq04j113j078p12l17k06j78P9L98M79
$$ y = [269199, 274347, 280172, 285691, 290482, 295028, 299640, 303903, 307552, 311043, 314702, 317983, 320190, 321495, 322669, 324075, 325465, 326550, 327264, 327525, 327080, 325629, 322961, 319062, 314283, 309231, 304282, 299272, 293859, 288192, 283039, 279182, 276625, 274427, 271374, 266983, 261893, 257311, 254127, 252516, 252106, 252215, 252039, 250954, 248887, 246456, 244613, 243898, 243844, 243297, 241667, 239708, 238599, 238359, 237875, 236557, 235142, 234417, 233965, 232917, 231356, 230129, 229560, 229250, 229011, 229190, 229976, 231007, 231843, 232398, 232850, 233456, 234407, 235547, 236389, 236793, 237419, 238954, 241079, 242764, 243500, 243718, 244086, 244960, 246470, 248525, 250644, 252343, 253770, 255525, 257837, 260366, 262817, 265255, 267770, 270299, 272832, 275385, 277773, 279844, 281931, 284594, 287956, 291658, 295354, 298786, 301599, 303753, 306006, 309243, 313180, 316434, 317977, 317983, 317179, 316066, 314988, 314276, 313959, 313753, 313575, 313654, 314052, 314531]
53675C14531M77N92M91j49r00j123r26q93j150j398j522j557j357r21o81p62m73
53658C02279O71J911K176J589J067P93K61m63p58o20o37p70l84M21P10K71k1L01
53640C08797N54K92K71J271K720L457L247K678K048J168J54m16j25Q76K090K929
53624C32011K963K335J821K037K717L082K888K642K806L258L763M511N801P366
53610C80001Q458Q694Q438Q192P888P074N647M076K925K365K138J758Q72l84j378
53595D46764j569j077m50n5K3k54p53r80n69J12M14L22L07L40r7r90j665j833
53577D37990j938k278k566k639k708k661k064j207j068j710j862q48K17J37m80
53562D14315k90O34J065N74j34n37p14o30j22M12L16l12p42o72l46J73J002J767
$$ y = [314531, 315008, 315600, 316091, 315942, 315042, 313919, 312993, 312100, 310950, 309552, 308030, 306473, 305116, 304195, 303514, 302752, 302279, 302950, 304861, 307037, 308626, 309693, 310486, 310747, 310284, 309526, 308906, 308269, 307499, 307115, 307536, 308246, 308517, 308496, 308797, 309351, 309643, 309914, 311185, 313905, 317362, 320609, 323287, 325335, 326503, 326657, 326241, 326116, 326992, 329082, 332011, 334974, 337309, 339130, 341167, 343884, 346966, 349854, 352496, 355302, 358560, 362323, 366834, 372635, 380001, 388459, 397153, 405591, 413783, 421671, 428745, 434392, 438468, 441393, 443758, 445896, 447654, 448526, 448142, 446764, 445195, 444118, 443668, 443613, 443636, 443382, 442629, 441649, 441080, 441192, 441606, 441928, 442235, 442575, 442478, 441488, 439823, 437990, 436052, 433774, 431208, 428569, 425861, 423200, 421136, 419929, 418861, 417151, 415289, 414441, 414658, 414795, 414315, 414025, 414659, 415724, 416298, 416164, 415627, 414913, 414283, 414161, 414573, 414889, 414577, 413835, 413163, 412817, 412990, 413992, 415759]
53544D15759J864J344Q25N97N28O72J156J670J949K498L863N372N805N235M986
53529D54123N676O473O678O749P273P988Q483R023R968J1000J1646J2068J2698
53516E69846J3489J4028J4149J4081J4267J5238J7267J9824K1775K2528K2681
53505G59173K3165K4063K4663K4498K3949K3713K3910K3965K3343K2316K1611
53494A018369K1353K0880J9860J8985J8990J9514J9651J9336J9236J9440J9214
53483A234828J8231J7235J7107J7836J8703J9080J8803J8108J7332J6543J5500
53472A429306J4145J2809J1611J0059P789N300L252J429p74l185n190o945r135
53459A470471j1572j3273j4032j4646j5368j5472j4896j4966j6595j8795j9941
$$ y = [415759, 417623, 418967, 419792, 420389, 420917, 421589, 422745, 424415, 426364, 428862, 432725, 438097, 443902, 449137, 454123, 459799, 466272, 472950, 479699, 486972, 494960, 503443, 512466, 522434, 533434, 545080, 557148, 569846, 583335, 597363, 611512, 625593, 639860, 655098, 672365, 692189, 713964, 736492, 759173, 782338, 806401, 831064, 855562, 879511, 903224, 927134, 951099, 974442, 996758, 1018369, 1039722, 1060602, 1080462, 1099447, 1118437, 1137951, 1157602, 1176938, 1196174, 1215614, 1234828, 1253059, 1270294, 1287401, 1305237, 1323940, 1343020, 1361823, 1379931, 1397263, 1413806, 1429306, 1443451, 1456260, 1467871, 1477930, 1485719, 1491019, 1494271, 1495700, 1494926, 1491741, 1486551, 1479606, 1470471, 1458899, 1445626, 1431594, 1416948, 1401580, 1386108, 1371212, 1356246, 1339651, 1320856, 1300915]
53448A300915j9816j9400j9322j9473j9754k0115k0084j9174j7739j6638j5953
53437A093447j4853j2826j0454q619p376o024m167k283j150q87q02j87R86K305
53423A027110L517M620N570O318P146Q465J0310J2272J4029J5591J7100J8639
53411A150687K0206K1614K2564K3102K3771K4958K6335K7482K8690L0501L2665
53400A432575L4426L5735L7328L9509M1745M3684M5749M8251N0700N2414N3345
53389A915461N3872N4277N4760N5488N6232N6338N5425N3811N2030N0298M8663
53378B506655M7164M5536M3201L9891L6003L2049K8135K4238K0578J7308J4042
53367B854800J0074M983j136p875j4822k1762k8653l5247m0902m5078m7937n0076
$$ y = [1300915, 1281099, 1261699, 1242377, 1222904, 1203150, 1183035, 1162951, 1143777, 1126038, 1109400, 1093447, 1078594, 1065768, 1055314, 1046695, 1039319, 1033295, 1029128, 1026845, 1025695, 1024808, 1024006, 1023819, 1024805, 1027110, 1030627, 1035247, 1040817, 1047135, 1054281, 1062746, 1073056, 1085328, 1099357, 1114948, 1132048, 1150687, 1170893, 1192507, 1215071, 1238173, 1261944, 1286902, 1313237, 1340719, 1369409, 1399910, 1432575, 1467001, 1502736, 1540064, 1579573, 1621318, 1665002, 1710751, 1759002, 1809702, 1862116, 1915461, 1969333, 2023610, 2078370, 2133858, 2190090, 2246428, 2301853, 2355664, 2407694, 2457992, 2506655, 2553819, 2599355, 2642556, 2682447, 2718450, 2750499, 2778634, 2802872, 2823450, 2840758, 2854800, 2864874, 2869857, 2868721, 2860846, 2846024, 2824262, 2795609, 2760362, 2719460, 2674382, 2626445, 2576369]
53355B576369n1735n2694n2852n2426n1554n0193m8425m6482m4469m2497m0947
53344B042095m0104l9636l9081l8671l8969l9732l9984l9191l7649l5673l3307
53333A620098l0847k8723k6635k3840k0475j7695j6126j5178j4279j3785j4070
53322A398445j4677j5102j5587j6396j6973j6632j5532j4269j3039j1828j0926
53311A237484j0465r887q616o881n304l945k440p64O79J615K101K489L424N462
53297A204952Q256J0695J2195J3370J4926J6647J8142J9855K2335K4897K6147
53286A392417K5787K5035K5065K5695K5784K4541K2256J9946J8341J7178J5661
53275A637706J3488J0986Q245M876R44k679n384p593r870j1971j3519j4997j7141
$$ y = [2576369, 2524634, 2471940, 2419088, 2366662, 2315108, 2264915, 2216490, 2170008, 2125539, 2083042, 2042095, 2001991, 1962355, 1923274, 1884603, 1845634, 1805902, 1765918, 1726727, 1689078, 1653405, 1620098, 1589251, 1560528, 1533893, 1510053, 1489578, 1471883, 1455757, 1440579, 1426300, 1412515, 1398445, 1383768, 1368666, 1353079, 1336683, 1319710, 1303078, 1287546, 1273277, 1260238, 1248410, 1237484, 1227019, 1217132, 1208516, 1201635, 1196331, 1192386, 1189946, 1189182, 1189861, 1191476, 1193577, 1196066, 1199490, 1204952, 1213208, 1223903, 1236098, 1249468, 1264394, 1281041, 1299183, 1319038, 1341373, 1366270, 1392417, 1418204, 1443239, 1468304, 1493999, 1519783, 1544324, 1566580, 1586526, 1604867, 1622045, 1637706, 1651194, 1662180, 1670425, 1675301, 1676245, 1673566, 1668182, 1660589, 1650719, 1638748, 1625229, 1610232, 1593091]
53262A593091j9742k1968k3598k5069k6504k7564k8240k8933k9625k9800k9324
53251A302724k8815k8843k9152k8956k7795k6015k4405k3410k2747k2025k1561
53240A019000k2007k3118k3692k3091k2038k1412k1051k0445j9833j9622j9284
53229G83407j7930j5653j3310j1203r100p349o784p387q149q504q941r850j0772
53216F48475j1308j1957j3338j5075j6156j6128j5398j4474j3481j2362j1224
53205D97574j0241r394q441p264o192n750o022o486o631o604o948p832q771r108
53191C91890q629p738p081o891o744o200n505n220n204m678l489k531k488k873
53177C16619k846k378j889j374p61o22j503k794l245k637j990k085k571k699k224
$$ y = [1593091, 1573349, 1551381, 1527783, 1502714, 1476210, 1448646, 1420406, 1391473, 1361848, 1332048, 1302724, 1273909, 1245066, 1215914, 1186958, 1159163, 1133148, 1108743, 1085333, 1062586, 1040561, 1019000, 996993, 973875, 950183, 927092, 905054, 883642, 862591, 842146, 822313, 802691, 783407, 765477, 749824, 736514, 725311, 716211, 708862, 702078, 694691, 686542, 678038, 669097, 659247, 648475, 637167, 625210, 611872, 596797, 580641, 564513, 549115, 534641, 521160, 508798, 497574, 487333, 477939, 469498, 462234, 456042, 450292, 444270, 437784, 431153, 424549, 417601, 409769, 400998, 391890, 383261, 375523, 368442, 361551, 354807, 348607, 343102, 337882, 332678, 328000, 324511, 321980, 319492, 316619, 313773, 311395, 309506, 308132, 307371, 306749, 305246, 302452, 299207, 296570, 294580, 292495, 289924, 287225, 285001]
53162B85001j349m02K05J73l03o94p86p26n17L2P45J045O89Q0l51o59j090j557
53144B79536j767j651j469j514j726j694j133m36l75j043j508r11L77J255J300
53129B67241J085J150J381J467J384J208Q44L05K1N12J702K716K582J231k34n97
53113B83998K32J271J744J726J477Q82n6q02r07o39n61q30j341k030k549k289
53097B79326j268m85o30j056q16j50K0m07p87r47j160j189n30M15O14n4o15n02
53079B69779j84j31k13m25j079j896j853n93Q70J366Q71R0n42r47j045q89p97
53062B62382q74q31m72o8O5j39p36j766k745k804j719k75O47Q81P25M80M99J042
53044B54292J715J676Q32J39L05Q46J005Q83R73J112P77P5l80l92l62n49p90r07
$$ y = [285001, 283652, 283250, 283455, 283628, 283325, 282631, 281845, 281119, 280602, 280634, 281379, 282424, 283113, 283193, 282842, 282183, 281093, 279536, 277769, 276118, 274649, 273135, 271409, 269715, 268582, 268146, 267771, 266728, 265220, 264309, 264686, 265941, 267241, 268326, 269476, 270857, 272324, 273708, 274916, 275760, 276065, 276086, 276598, 278300, 281016, 283598, 284829, 284595, 283998, 284230, 285501, 287245, 288971, 290448, 291330, 291274, 290472, 289565, 288926, 288365, 287535, 286194, 284164, 281615, 279326, 278058, 277573, 276943, 275887, 275071, 274921, 274941, 274534, 273747, 272800, 271640, 270451, 269921, 270336, 270950, 270896, 270281, 269779, 269595, 269464, 269251, 268826, 267747, 265851, 263998, 263405, 264275, 265641, 266512, 266602, 266060, 265113, 264068, 263179, 262382, 261508, 260677, 260205, 260137, 260202, 260063, 259327, 257561, 254816, 252012, 250293, 250018, 250665, 251546, 252271, 252751, 253250, 254292, 256007, 257683, 258515, 258654, 258959, 259805, 260810, 261693, 262666, 263778, 264555, 264630, 264250, 263858, 263496, 262947, 262157, 261250]
53026B61250q85o64k11K46M52N35P95J114J049N18J5pL47O73Q06R06J092J176
53008B69207Q72K26l28m01n1M47J024J740K380K487J888Q56k07j055j528j600
52992B75957j514j494j324o14M22J025Q39M29M86R50J220R80M81J68K38M97N41
52975B79287K04j41k7M62Q39R47J002R49M44l00m24M36J473J720J273R29J007
52958B90080J183J270J405J557J389P27j96j044j591j748j594j377j229r73n36
52943B87323l22p86j683k219j977j298o44r9L22L25k60j026j371j303j386j859
52927B71737k215j859r40j54O5j17l48m40l28j9K71K52J7R2P81J631J814R95l37
52908B70898j297j302m82M74R32Q25M54m8o69j101q89k00K66K71L54P87R82M67
$$ y = [261250, 260365, 259701, 259490, 259736, 260188, 260723, 261518, 262632, 263681, 264199, 264214, 264207, 264554, 265227, 266033, 266939, 268031, 269207, 270079, 270305, 269977, 269576, 269525, 269972, 270996, 272736, 275116, 277603, 279491, 280347, 280140, 279085, 277557, 275957, 274443, 272949, 271625, 271011, 271433, 272458, 273297, 273726, 274212, 275162, 276382, 277362, 277843, 278011, 278249, 278746, 279287, 279491, 279350, 279323, 279785, 280624, 281571, 282573, 283522, 283966, 283666, 283242, 283678, 285151, 286871, 288144, 289073, 290080, 291263, 292533, 293938, 295495, 296884, 297611, 297415, 296371, 294780, 293032, 291438, 290061, 288832, 287859, 287323, 287001, 286215, 284532, 282313, 280336, 279038, 278394, 278295, 278617, 278942, 278682, 277656, 276285, 274982, 273596, 271737, 269522, 267663, 266723, 266569, 266634, 266517, 266169, 265729, 265401, 265382, 265653, 265905, 265922, 266014, 266795, 268426, 270240, 271235, 270898, 269601, 268299, 267817, 268291, 269223, 270048, 270502, 270454, 269785, 268684, 267795, 267595, 267861, 268132, 268486, 269273, 270255, 270722]
52890B70722j93j53N20J174J585J811J531M87o78j041p10n45p10n54K8K93j6j14
52872B73437O11J613J929J324L60j97J71J318K328K415J980K019K531K468J473
52857B95780N20L60L45m60j821k807l110l133l203l402l783m133l893k899j847
52842B62514j490j741k004k032j894j562j098q89j039r09J8J159J435P80K52N84
52826B52084J320J529R74K54J5K26K51l33j079j117k86N98P51L39J18N03J340
52809B57487K282L029L401L407L059K103L39j661k792k679k202k281k725k810
52795B57957k522k386k370j826o24L95M23k81p12l14M41P14L35r3j12M5M0J05
52777B49215M88P10K11m43j11J130J913J612J214J586J997J350q3j157j488j500
$$ y = [270722, 270529, 270376, 270896, 272070, 273655, 275466, 276997, 277484, 276806, 275765, 275055, 274510, 273800, 273246, 273274, 273567, 273551, 273437, 274048, 275661, 277590, 278914, 279274, 279077, 279248, 280566, 282894, 285309, 287289, 289308, 291839, 294307, 295780, 296300, 296660, 297005, 296545, 294724, 291917, 288807, 285674, 282471, 279069, 275286, 271153, 267260, 264361, 262514, 261024, 259283, 257279, 255247, 253353, 251791, 250693, 249804, 248765, 247856, 247874, 249033, 250468, 251248, 251500, 252084, 253404, 254933, 255907, 256161, 256176, 256402, 256653, 256320, 255241, 254124, 253838, 254436, 255187, 255526, 255644, 256147, 257487, 259769, 262798, 266199, 269606, 272665, 274768, 275107, 273446, 270654, 267975, 265773, 263492, 260767, 257957, 255435, 253049, 250679, 248853, 248229, 248624, 249047, 248766, 248054, 247740, 248181, 248895, 249230, 249137, 249025, 249070, 249110, 249215, 249703, 250413, 250624, 250181, 250070, 251200, 253113, 254725, 255939, 257525, 259522, 260872, 260789, 259632, 258144, 256644]
52761B56644j407j159j080j503j943j622o60J70O11R47J026M17m43m09P14J694
52745B51997J517P51N84J190J744J757J652J969K535K653J918O60l77o67k16N26
52729B70193J011J005Q70J204J912J988P43j043j941j688j269j176p89J19N50
52714B71689k30j338j467p51l28o00r54r32o00L1R14J480J137K49k32m2K89M63
52696B68778O53P82M65j84n59m78l88m55j93P13J797K265J747N38n55q01l64k70
52678B73491j052j857j623p13l18n43l53N72J273J095N86L93K78j34n72o61n38
52661B69324l30K78J328K156K183J623R67M09K33J009K656L964L875K792J823
52646B94290J202L00j049k164k435j965j211n85l58n34q02r81j249j600j381j05
$$ y = [256644, 255237, 254078, 252998, 251495, 249552, 247930, 247270, 247440, 248051, 248998, 250024, 250441, 249998, 249589, 250303, 251997, 253514, 254265, 254849, 256039, 257783, 259540, 261192, 263161, 265696, 268349, 270267, 270927, 270550, 269883, 269667, 270193, 271204, 272209, 273079, 274283, 276195, 278183, 278926, 277883, 275942, 274254, 272985, 271809, 271020, 271139, 271689, 271459, 270121, 268654, 267903, 267575, 266975, 266021, 265089, 264489, 264520, 265434, 266914, 268051, 268300, 268068, 268026, 268315, 268778, 269431, 270213, 270678, 270494, 269935, 269457, 269069, 268614, 268421, 269134, 270931, 273196, 274943, 275481, 274926, 274125, 273761, 273491, 272439, 270582, 268959, 268246, 267928, 267385, 267032, 267604, 268877, 269972, 270558, 270951, 271229, 271095, 270523, 269862, 269324, 268994, 269272, 270600, 272756, 274939, 276562, 277529, 277938, 278171, 279180, 281836, 285800, 289675, 292467, 294290, 295492, 295792, 294743, 292579, 290144, 288179, 286968, 286383, 286025, 285491, 284689, 283708, 282459, 280859, 279478, 279373]
52630B79373J553K382K298K539L878N378N450L650R72j329k651l003k676k132
52616B95682j783j719j750j793j956k194k187j737j109o86m40k6O61J242J281
52601B81486P41P4j14M25J240J502R63L60M71R75Q71l0q10p89l59p4K62R82J658
52582B89834J661J159Q27P85O23L39L54O37N90mn66n08M5N12M65j14q55j206r43
52563B93635m25j35m2J57L38N8p27j534k020k195k060j551q90m88m15m07l97n01
52545B80401n45j47N79J068J096R58P78L20l73q30r23j060j355j244l85O27J028
52528B79993Q75Q15J172J737K134K001J133r0p37k67P22J135O71Q6K20J081J918
52511B94599K019J435R81J407K576L650M019L701K814J252q19k622l340k899j921
$$ y = [279373, 280926, 283308, 285606, 288145, 292023, 297401, 302851, 306501, 307473, 306144, 303493, 300490, 297814, 295682, 293899, 292180, 290430, 288637, 286681, 284487, 282300, 280563, 279454, 278768, 278328, 278302, 278963, 280205, 281486, 282227, 282301, 282187, 282612, 283852, 285354, 286317, 286677, 287148, 288123, 288994, 288964, 288154, 287365, 287006, 286932, 287194, 288176, 289834, 291495, 292654, 293481, 294266, 294889, 295228, 295582, 296219, 296809, 296805, 296239, 295731, 295776, 296288, 296753, 296639, 295784, 294578, 293635, 293210, 293075, 293033, 293190, 293528, 293586, 292859, 291325, 289305, 287110, 285050, 283499, 282609, 282121, 281706, 281299, 280902, 280401, 279856, 279709, 280288, 281356, 282452, 283410, 284188, 284508, 284135, 283305, 282382, 281322, 279967, 278723, 278338, 278965, 279993, 280868, 281683, 282855, 284592, 286726, 288727, 289860, 289770, 289033, 288766, 289488, 290623, 291294, 291380, 291600, 292681, 294599, 296618, 298053, 299034, 300441, 303017, 306667, 310686, 314387, 317201, 318453, 317634, 315012, 311672, 308773, 306852]
52496C06852j131j061j880l070l536k583p76N59P07J64k32k56k40l32k53J51N13
52479B93596L88L0J77J042J886J953J423J006Q77O19M3m79n52j48N77J442K135
52462C06015K441K573K866L146K853J838N32o51j592k128k160k085k468l114l218
52447C04848k646k239k516k867k580j902j473j308j048p17m70o4O44J034M72m64
52431B86704m83P01J895J945R93n1o57q82q22m26J72O19P12O80Q75J268J445J217
52413B95905R64J124J540J738J772K269L541N208O925Q903J1289J3427J4327J3579
52399C82511J1465Q342M425J14l911o955q518q507p563o911p278p951p437n250
52385C36576k653j321j583k314k417j881j261n87N56K031K887K553J711J449J871
$$ y = [306852, 305721, 304660, 302780, 299710, 296174, 293591, 292815, 293374, 294081, 294245, 294013, 293757, 293517, 293185, 292932, 293083, 293596, 293984, 294014, 294191, 295233, 297119, 299072, 300495, 301501, 302378, 302997, 303040, 302561, 302009, 301861, 302438, 303880, 306015, 308456, 311029, 313895, 317041, 319894, 321732, 322264, 321613, 320021, 317893, 315733, 313648, 311180, 308066, 304848, 302202, 299963, 297447, 294580, 292000, 290098, 288625, 287317, 286269, 285552, 285082, 285018, 285662, 286696, 287168, 286704, 286221, 286922, 288817, 290762, 291755, 291704, 291047, 290165, 289343, 288917, 289089, 289708, 290420, 291100, 291975, 293243, 294688, 295905, 296869, 297993, 299533, 301271, 303043, 305312, 308853, 314061, 320986, 329889, 341178, 354605, 368932, 382511, 393976, 402318, 406743, 406857, 402946, 395991, 387473, 378966, 371403, 364492, 357214, 349263, 341826, 336576, 333923, 332602, 331019, 328705, 326288, 324407, 323146, 322559, 323115, 325146, 328033, 330586, 332297, 333746, 335617]
52370C35617K257K408K948M095M976M608L110J523P43Q77J356J411P40q5k04M40
52354C66820J121J390J584J919J888J118K06K1N02Q89Q47P05P67J035J559K413
52338C84784L300L751L782L948M580N379N882O068O332P043Q182R378J0319J1148
52324D73876J2206J3385J4129J4292J4543J5469J6595J6914J6239J5494J5601
52313F38743J6569J7755J8664J9288J9849K0371K0546K0138J9478J9241J9598
52302H50240J9989J9937J9688J9575J9215J8032J6332J5049J4378J3385J1272
52291A037092Q406N681L385J213q83k526l601m557n752o828p132o609n884n434
52277A006571n123m697m275l977l416k139l64J310K814M552O437P696P959P850
$$ y = [335617, 337874, 340282, 343230, 347325, 352301, 356909, 360019, 361542, 362285, 363162, 364518, 365929, 366669, 366584, 366380, 366820, 367941, 369331, 370915, 372834, 374722, 375840, 376046, 376067, 376569, 377458, 378305, 379010, 379777, 380812, 382371, 384784, 388084, 391835, 395617, 399565, 404145, 409524, 415406, 421474, 427806, 434849, 443031, 452409, 462728, 473876, 486082, 499467, 513596, 527888, 542431, 557900, 574495, 591409, 607648, 623142, 638743, 655312, 673067, 691731, 711019, 730868, 751239, 771785, 791923, 811401, 830642, 850240, 870229, 890166, 909854, 929429, 948644, 966676, 983008, 998057, 1012435, 1025820, 1037092, 1045498, 1051179, 1054564, 1055777, 1054894, 1052368, 1048767, 1044210, 1038458, 1031630, 1024498, 1017889, 1012005, 1006571, 1001448, 996751, 992476, 988499, 985083, 982944, 982580, 983890, 986704, 991256, 997693, 1005389, 1013348, 1021198]
52263A021198Q178R075J0257J1558J2807J3598J3819J3960J4506J5287J5913J6404
52251A176560J6881J6987J6262J4878J3366J1844J0006P796N462L068N46j868
52239A291788l779n213o504p647q327q639r195j0275j1359j1734j1325j0661j0238
52226A176892j0072r825r293q701q388q244p801o933o055n388m544l263k044j461
52212A084880j155k55J413L166M393M972M948M506M198M424M704M248L301K958
52198A130701L468L740L148K790M127O817Q994R413Q531P442O575N679M540L228
52184A209193J840L29j403l311n111o470p418q392r627j0580j0372q952p401o759
52170A125566o809o500n395m144l390k927k256j471r93o49K31J730K997L177K339
$$ y = [1021198, 1029376, 1038451, 1048708, 1060266, 1073073, 1086671, 1100490, 1114450, 1128956, 1144243, 1160156, 1176560, 1193441, 1210428, 1226690, 1241568, 1254934, 1266778, 1276784, 1284580, 1290042, 1293110, 1293656, 1291788, 1288009, 1282796, 1276292, 1268645, 1260318, 1251679, 1242484, 1232209, 1220850, 1209116, 1197791, 1187130, 1176892, 1166820, 1156995, 1147702, 1139001, 1130613, 1122369, 1114568, 1107635, 1101580, 1096192, 1091648, 1088385, 1086341, 1084880, 1083725, 1083470, 1084883, 1088049, 1092442, 1097414, 1102362, 1106868, 1111066, 1115490, 1120194, 1124442, 1127743, 1130701, 1134169, 1137909, 1141057, 1143847, 1147974, 1154791, 1163785, 1173198, 1181729, 1189171, 1195746, 1201425, 1205965, 1209193, 1211033, 1211362, 1209959, 1206648, 1201537, 1195067, 1187649, 1179257, 1169630, 1159050, 1148678, 1139726, 1132325, 1125566, 1118757, 1112257, 1106862, 1102718, 1099328, 1096401, 1094145, 1092674, 1091681, 1091032, 1091263, 1092993, 1095990, 1099167, 1101506]
52155A101506J295P60Q43J133J186J022J103J564J830J413R44J555L176M317L811
52140A127458K111M94l91o94p99j148k112l380l833k658l51J923L625N126O960
52125A132331R343J2122J4777J6721J8035J9511K1588K3695K5101K5888K6430
52114A345542K6522K5830K4783K4138K3886K3432K2566K1488K0144J8491J7175
52103A593997J6945J7391J7328J6361J5161J4162J3012J1447R700P727N019J509
52091A739759k196n823r774j4009j7503j9382j9928j9900j9484j8527j7148j5461
52079A560624j3252j0612q483p705p811p488o113m219k475r28O27K098L381M809
52065A502453O919R597J1880J2849J2761J2856J3930J5475J6546J7014J7367J7536
$$ y = [1101506, 1102801, 1103561, 1104404, 1105537, 1106723, 1107745, 1108848, 1110412, 1112242, 1113655, 1114599, 1116154, 1119330, 1123647, 1127458, 1129569, 1130063, 1129672, 1128978, 1128179, 1127031, 1124919, 1121539, 1117706, 1115048, 1114697, 1116620, 1120245, 1125371, 1132331, 1141674, 1153796, 1168573, 1185294, 1203329, 1222840, 1244428, 1268123, 1293224, 1319112, 1345542, 1372064, 1397894, 1422677, 1446815, 1470701, 1494133, 1516699, 1538187, 1558331, 1576822, 1593997, 1610942, 1628333, 1645661, 1662022, 1677183, 1691345, 1704357, 1715804, 1725504, 1733231, 1738250, 1739759, 1737563, 1731740, 1721966, 1707957, 1690454, 1671072, 1651144, 1631244, 1611760, 1593233, 1576085, 1560624, 1547372, 1536760, 1528277, 1520572, 1512761, 1505273, 1499160, 1494941, 1492466, 1491538, 1492165, 1494263, 1497644, 1502453, 1509372, 1518969, 1530849, 1543698, 1556459, 1569315, 1583245, 1598720, 1615266, 1632280, 1649647, 1667183]
52053A667183J6808J4967J2737J0861R260P407N033K160j152m703q036j0724j2657
52040A709144j3971j4979j6015j7018j7334j6513j5315j5108j6171j7341j7626
52029A531753j7355j7213j7022j6341j5678j5994j7249j8361j8650j8476j8287
52018A341127j7824j6754j5453j4579j4092j3305j1930j0581j0011j0110j0093
52007A196395r586r209r877j1825j4430j6846j8498j9252j9378j9330j9255j8755
51995A010154j7421j5442j3461j1935j0993j0761j1377j2647j4045j5047j5344
51984H61681j4890j4119j3895j4673j5843j6478j6609j7048j7873j8015j6687
51973F85551j4571j2957j2111j1092r032o128l310j251J51J384K616L649M550
$$ y = [1667183, 1683991, 1698958, 1711695, 1722556, 1731816, 1739223, 1744256, 1746416, 1745264, 1740561, 1732525, 1721801, 1709144, 1695173, 1680194, 1664179, 1647161, 1629827, 1613314, 1597999, 1582891, 1566720, 1549379, 1531753, 1514398, 1497185, 1480163, 1463822, 1448144, 1432150, 1414901, 1396540, 1377890, 1359414, 1341127, 1323303, 1306549, 1291096, 1276517, 1262425, 1249120, 1237190, 1226609, 1216598, 1206488, 1196395, 1186809, 1177600, 1167723, 1155898, 1141468, 1124622, 1106124, 1086872, 1067494, 1048164, 1028909, 1010154, 992733, 977291, 963830, 951895, 940902, 930141, 918764, 906117, 892072, 877025, 861681, 846791, 832672, 818777, 804104, 788261, 771783, 755174, 738126, 720253, 702238, 685551, 670980, 658023, 645912, 634820, 625788, 619660, 616350, 615099, 615250, 616634, 619250, 622899, 627449]
51960F27449N816P447Q321P175M131N89k353m652o526p773q225q146p797p054
51946F08402n785m161k275N2K813N551P884R868J1632J3031J3889J4203J3907
51933F89011J2925J1638J0723J0190R183P115M538K430J140N03N81J605L482N776
51919G70840P933R092Q055M061k398r905j7080k2932k6655k7790k6594k3888k0420
51906F22319j6599j2773r377o746m904l511k093m82Q46J061k57k754n665q317
51892E50748j0310j1541j2179j2372j1946j0708q955p234n589l596j209R63K453
51879D58525L446M365N437O865Q855J1051J2542J2710J1706R846P158L891Q79
51866E57276j220k678m179n839p130p513o841n401l828k637j665l18J448K933
$$ y = [627449, 633265, 640712, 649033, 656208, 660339, 660928, 658575, 653923, 647397, 639624, 631399, 623253, 615456, 608402, 602617, 598456, 596181, 596233, 599046, 604597, 612481, 622349, 633981, 647012, 660901, 675104, 689011, 701936, 713574, 724297, 734487, 743670, 750785, 755323, 757753, 758893, 759396, 759977, 761582, 765064, 770840, 778773, 787865, 795920, 799981, 797583, 787678, 770598, 747666, 721011, 693221, 666627, 642739, 622319, 605720, 592947, 583570, 576824, 571920, 568409, 566316, 565834, 566680, 567741, 567484, 564730, 559065, 550748, 540438, 528897, 516718, 504346, 492400, 481692, 472737, 465503, 459914, 456318, 455109, 456072, 458525, 461971, 466336, 471773, 478638, 487493, 498544, 511086, 523796, 535502, 545348, 552506, 556397, 557276, 556056, 553378, 549199, 543360, 536230, 528717, 521876, 516475, 512647, 510010, 508345, 508027, 509475, 512408]
51852E12408L583L498K811J310r52l287n092o337p011o830o018n506n671n668
51838D71238m750l601l380l966m149l206j451M36J830K231J759J273J291J168
51824D56723K16q94r21%M56k54j294j649j264o17N2O62J082J258J176O77k02q58
51806D54349p33k29k55r35j509j559j499j648j615j049l29j13n40j218j687j724
51790D37707j423j116r73p97m52k61n36q84o56N8N66O22O16P10N28j0k26N50K184
51771D36207L971N412O488P514Q726R891J0419J0118R532R029P925N327J605j881
51757E30283m424o394p981q687q431q066q181q237p652o933o855p035o376m684
51743D30347k963k021j556q29L52J661K806L669M051L813L330L404M314N174M723
$$ y = [512408, 515991, 519489, 522300, 523610, 522658, 519371, 514279, 507942, 500931, 494101, 488083, 482577, 476906, 471238, 466488, 462887, 459507, 455541, 451392, 448186, 446735, 447171, 449001, 451232, 452991, 454264, 455555, 456723, 456939, 456045, 455124, 455124, 455580, 455326, 454032, 452383, 451119, 450502, 450554, 451216, 452298, 453556, 454732, 455409, 455207, 454349, 453616, 453387, 453132, 452197, 450688, 449129, 447630, 445982, 444367, 443318, 442989, 442876, 442336, 441118, 439431, 437707, 436284, 435168, 434195, 433398, 432946, 432685, 432149, 431265, 430609, 430667, 431233, 431855, 432471, 433181, 433709, 433699, 433473, 434023, 436207, 440178, 445590, 452078, 459592, 468318, 478209, 488628, 498746, 508278, 517307, 525232, 530559, 532164, 530283, 525859, 519465, 511484, 502797, 494366, 486300, 478119, 469882, 462230, 455297, 448442, 441407, 435031, 430347, 427384, 425363, 423807, 422978, 423330, 424991, 427797, 431466, 435517, 439330, 442660, 446064, 450378, 455552, 460275]
51728D60275K829O47p54j380j537r48N95K169K377R90q79k237l050l550l529k744
51712D49274j387O2J091J181K11j054j474p19N80J933L472N053N703M640K364
51697D70930J55j197j727j655r61M04K143L511L661K422O48o64j562k899m844
51682D68365o376o594n810m883m033k954j673o09N7M97P64O52P4o98j258j331
51666D34190q40J99J786L840N913P241P433O958O430N606L777J239n25m92P14
51651D83469J854K680L907N923Q132R479R103O637K357k850p794j1410j3062j2824
51637D85601j1599j0467r741q926p643o121m597k900j007N81J506K093K715L103
51623D32598K913K515K389K119Q74j153k755l278l373l845m416m257l302k408
$$ y = [460275, 463104, 463751, 462997, 461617, 460080, 459132, 459727, 461896, 464273, 465263, 464384, 462147, 459097, 455547, 452018, 449274, 447887, 447949, 449040, 450221, 450432, 449378, 447904, 447185, 447765, 449698, 453170, 458223, 463926, 468566, 470930, 471085, 469888, 468161, 466506, 465545, 465949, 468092, 471603, 475264, 477686, 478334, 477670, 476108, 473209, 468365, 461989, 455395, 449585, 444702, 440669, 437715, 436042, 435433, 435490, 435987, 436751, 437403, 437477, 436779, 435521, 434190, 433350, 433549, 435335, 439175, 445088, 452329, 459762, 466720, 473150, 478756, 482533, 483772, 483247, 482755, 483469, 485323, 488003, 491910, 497833, 505965, 515444, 524547, 531184, 533541, 530691, 522897, 511487, 498425, 485601, 474002, 463535, 453794, 444868, 437225, 431104, 426507, 423607, 422600, 423181, 424687, 426780, 429495, 432598, 435511, 438026, 440415, 442534, 443408, 442255, 439500, 436222, 432849, 429004, 424588, 420331, 417029, 414621]
51609D14621k282k714l034k933k598k250j842j300p02n3Q69K228L856N496P177
51594D14539R030J0922J2608J3963J4557J3314R465L928j149m452o345p506p692
51581D75182o576m782l168j554Q62M098P339J0114J2582J4687J5942J6336J6628
51568E57690J7410J8388J8879J8597J7649J6208J4641J3811J4785J8150K3616
51557G49824L0161L6521M1682M5023M6042M4150L8971L0910K1091J0687L95r506
51545A085951j8794k7128l4111l9424m2966m4842m5246m4298m2098l8866l4925
51534F73253l0587k6052k1435j6862j2695r559p880p295o743n412l412j455l9
51521E23827P71R70M06r51k726m262n075n238n265n539n852n775n337n048n141
$$ y = [414621, 412339, 409625, 406591, 403658, 401060, 398810, 396968, 395668, 394966, 394913, 395782, 398010, 401866, 407362, 414539, 423569, 434491, 447099, 461062, 475619, 488933, 498398, 502326, 501177, 496725, 490380, 482874, 475182, 468606, 463824, 460656, 459102, 459964, 464062, 471401, 481515, 494097, 508784, 524726, 541062, 557690, 575100, 593488, 612367, 630964, 648613, 664821, 679462, 693273, 708058, 726208, 749824, 779985, 816506, 858188, 903211, 949253, 993403, 1032374, 1063284, 1084375, 1095062, 1095457, 1085951, 1067157, 1040029, 1005918, 966494, 923528, 878686, 833440, 789142, 747044, 708178, 673253, 642666, 616614, 595179, 578317, 565622, 556063, 548183, 540888, 534145, 528733, 525321, 523866, 523827, 524598, 525568, 525974, 525023, 522297, 518035, 512960, 507722, 502457, 496918, 491066, 485291, 479954, 474906, 469765]
51506D69765n261n082m888n089n479n439m886m418m469m675m401l625k934k623
51492D06496k240j258N9Q90R17O95P72R88R74Q73R60R17K80n87p97k79P6k35o49
51473D08852n88l91o54j251j618j585j389j220j200j491j922j909j223m39j22
51458C91850LM25Q76O94l1n31m70l12n02q27o87L69K249M157N167N440O578R853
51440D24301J4274J7189J6889J3905R832N866K725J010P55J120J037N5j725m092
51426E03141o686q803r758r394q056o238m391k932k068j722j666j636j385r00
51412D37506n75q23j441j718j393r80r91j182j061p00n58o13k86Q06K371L797
51396D32159M654M759M138L194K689L213M582N982O798P285Q236J0033J2246J4320
$$ y = [469765, 464504, 459422, 454534, 449445, 443966, 438527, 433641, 429223, 424754, 420079, 415678, 412053, 409119, 406496, 404256, 402998, 403057, 403947, 404864, 405559, 406331, 407319, 408293, 409166, 410126, 411043, 411323, 410736, 409939, 409660, 409736, 409501, 408852, 408264, 407873, 407219, 405968, 404350, 402765, 401376, 400156, 398956, 397465, 395543, 393634, 392411, 391972, 391850, 391853, 392278, 393154, 393848, 393817, 393286, 392816, 392504, 392002, 391175, 390488, 390857, 393106, 397263, 402430, 407870, 414448, 424301, 438575, 455764, 472653, 486558, 496390, 502256, 504981, 505991, 506746, 507866, 508903, 508958, 507233, 503141, 496455, 487652, 477894, 468500, 460444, 454206, 449815, 446883, 444815, 443093, 441427, 439791, 438406, 437506, 436931, 436108, 434667, 432949, 431556, 430576, 429585, 428403, 427342, 426642, 426084, 425471, 425185, 425991, 428362, 432159, 436813, 441572, 445710, 448904, 451593, 454806, 459388, 465370, 472168, 479453, 487689, 497722, 509968, 524288]
51382E24288J6447J9425K3662K8742L4029L9373M4900N0459N5634N9997O2861
51371I59817O2922N8895N0812M0225K8724J6633L623r761k1973l1895l9745m6243
51359A072034n1434n4698n5610n4340n1421m7521m3380l9508l5967l2599k9363
51348E76193k6236k3002j9553j6255j3636j1753j0257q937p751o472m905l474
51336D23962k930l260l561l207k639k551k819k742k078j306r60j018r80l63Q28
51321C94376K086K935L401L698L721L252K626K444K622K404J532O50K80J13k44
51306D25896o08q68j487k677l658l611k851k282k135k080k202k780l475l685l629
51291C87868l960m344l574j387Q07J491O61m67p59K05K161M319N802O274O037
$$ y = [524288, 540735, 560160, 583822, 612564, 646593, 685966, 730866, 781325, 836959, 896956, 959817, 1022739, 1081634, 1132446, 1172671, 1201395, 1218028, 1221651, 1211890, 1189917, 1158022, 1118277, 1072034, 1020600, 965902, 910292, 855952, 804531, 757010, 713630, 674122, 638155, 605556, 576193, 549957, 526955, 507402, 491147, 477511, 465758, 455501, 446564, 438813, 432341, 427436, 423962, 421032, 417772, 414211, 411004, 408365, 405814, 402995, 400253, 398175, 396869, 395909, 394891, 393911, 393548, 394376, 396462, 399397, 402798, 406496, 410217, 413469, 416095, 418539, 421161, 423565, 425097, 425747, 426027, 426140, 425896, 425288, 424420, 422933, 420256, 416598, 412987, 410136, 407854, 405719, 403639, 401437, 398657, 395182, 391497, 387868, 383908, 379564, 375990, 374603, 375410, 376901, 377562, 377095, 376336, 376541, 378702, 383021, 388823, 395097, 401134]
51276D01134N504M861M227L667K918J636J8j193j490r98j11R06J842K507K832
51261D28260K729K018R01K73Q18J904K130J035n25j752k748l688m191m077l944
51246D19143m321m760m417l189j727p11m53q12j105o71J13J8j247k205j374O38
51230C92920J831J301K3o59l59N01J297J392O35j18L13J937L458L950L870L949
51214D16241L836K731R13l34l60J18J68j42j26M27J100J610K118K710L060K894
51198D36964K411J960J461O38l33q60p48n66r82j934k704k690j920r78m80n29
51182D28710n40J98J638K882L114K462J692J197O61k48j233j684j493j255j589
51167D34512k358k813k427j419l18P51K018L479M612M794L842K175O50M7L43N33
$$ y = [401134, 406638, 411499, 415726, 419393, 422311, 423947, 423965, 422772, 421282, 420284, 420173, 421079, 422921, 425428, 428260, 430989, 433007, 433908, 434181, 434999, 436903, 439033, 440068, 439543, 437791, 435043, 431355, 427164, 423087, 419143, 414822, 410062, 405645, 402456, 400729, 400018, 399565, 398753, 397648, 396977, 397090, 397108, 395861, 393656, 392282, 392920, 394751, 396052, 396075, 395416, 395057, 395558, 396855, 398247, 398882, 398764, 399077, 401014, 404472, 408422, 412292, 416241, 420077, 422808, 423721, 423387, 423027, 423145, 423313, 423171, 423045, 423472, 424572, 426182, 428300, 431010, 434070, 436964, 439375, 441335, 442796, 443434, 443101, 442241, 441493, 440927, 439945, 438011, 435307, 432617, 430697, 429719, 429239, 428710, 428170, 428368, 430006, 432888, 436002, 438464, 440156, 441353, 442014, 441766, 440533, 438849, 437356, 436101, 434512, 432154, 429341, 426914, 425495, 425177, 425928, 427946, 431425, 436037, 440831, 444673, 446848, 447498, 447545, 447888, 448421]
51151D48421l79k147l492l622l036k628k585k707l156m155n108m948l544k076
51137D04838j650k034k120j330n9J092J985K706L072K749J842J042J009J737K665
51122D17544L370L931M601N332N691N230L896K199R94Q72J648K542K959K893K571
51107D66273J961R66j36p87p24k16L08O55Q49Q74O14N1n06n76o1L45k62j858l227
51088D64543l226k046p55J57J120K346L107K677J425M23J90L58M31L36K27J96
51072D71509L16O30R83J175J378K041L256M448M973M795M487M741O010Q289J1013
51057E30044J3436J5259J6660J7479J6937J4685J1847J0266J0665J2116J3298
51046F82692J3679J3269J1972R618O433K956m02l548o616r747j2711j4582j4233
$$ y = [448421, 448042, 445895, 442403, 438781, 435745, 433117, 430532, 427825, 424669, 420514, 415406, 410458, 406914, 404838, 403188, 401154, 399034, 397704, 397645, 398737, 400722, 403428, 406500, 409249, 411091, 412133, 413142, 414879, 417544, 420914, 424845, 429446, 434778, 440469, 445699, 449595, 451794, 452788, 453660, 455308, 457850, 460809, 463702, 466273, 468234, 469200, 469064, 468277, 467553, 467337, 467645, 468300, 469149, 470023, 470637, 470688, 470182, 469606, 469545, 469890, 469628, 467770, 464543, 461317, 459271, 458516, 458673, 459793, 462139, 465246, 467923, 469348, 469771, 469961, 470319, 470750, 471086, 471313, 471509, 471825, 472455, 473438, 474613, 475991, 478032, 481288, 485736, 490709, 495504, 499991, 504732, 510742, 519031, 530044, 543480, 558739, 575399, 592878, 609815, 624500, 636347, 646613, 657278, 669394, 682692, 696371, 709640, 721612, 731230, 737663, 740619, 740217, 736669, 730053, 720306, 707595, 693013, 678780]
51033F78780j1581q189o178o463q131r437r304q015o709o131n865m899k968r43
51019E83967K62P14J076J603K080K586L583N149O554P073O954P309Q916J1315
51005F49141J3304J4262J4693J5281J5746J5221J3640J2020J1077J0216Q407N654
50993G98662K926R21n05j722k764l537m165m794n179m708k966k92K425M740P284
50978G86326J0906J5204J8529J9681J9098J8085J7491J7678J9129K2241K6661
50967I91029L1516L6236M0713M4935M9062N3572N8675O3643O7394O9641P0962
50956A577378P1848P2252P1903P0337O6823O1085N4070M7161M0544L3261K5121
50945B191783J7538J1962Q296N594L719L306M274N204M552K002j610n395r061
$$ y = [678780, 667199, 659010, 652832, 646369, 638238, 628801, 619497, 611482, 604773, 598642, 592777, 587878, 584910, 583967, 584229, 584943, 586019, 587622, 589702, 592288, 595871, 601020, 607574, 614647, 621601, 628910, 637826, 649141, 662445, 676707, 691400, 706681, 722427, 737648, 751288, 763308, 774385, 784601, 793008, 798662, 801588, 802509, 802004, 800282, 797518, 793981, 789816, 785022, 779843, 775135, 772169, 771877, 774302, 779042, 786326, 797232, 812436, 830965, 850646, 869744, 887829, 905320, 922998, 942127, 964368, 991029, 1022545, 1058781, 1099494, 1144429, 1193491, 1247063, 1305738, 1369381, 1436775, 1506416, 1577378, 1649226, 1721478, 1793381, 1863718, 1930541, 1991626, 2045696, 2092857, 2133401, 2166662, 2191783, 2209321, 2221283, 2229579, 2235173, 2238892, 2242198, 2246472, 2251676, 2256228, 2258230, 2256620, 2251225, 2242164]
50932B242164j2497j5278j7122j8679k1133k4818k8848l2514l6373m1300m6977
50921A946625n2201n6343n9608o2059o3388o3683o3394o2325n9602n5051m9815
50910A299156m5177m1318l7653l3893l0288k7212k4894k3322k2177k0988j9491
50899I72743j7691j5655j3503j1499r807q385p371p144p438o986m966k347p51
50886H59200k80K28J044J270Q26J017K456L976M473M557N346O722P851Q646R565
50871I16897J0668J1825J3328J5266J6921J7677J8101J9204K1089K3189K5389
50860A109554K8009L1039L4254L7821M1961M6386N0903N6157O2915P0827P8903
50849A648729Q6886R5305J04389J13793J23303J32825J41818J49587J56111J61725
$$ y = [2242164, 2229667, 2214389, 2197267, 2178588, 2157455, 2132637, 2103789, 2071275, 2034902, 1993602, 1946625, 1894424, 1838081, 1778473, 1716414, 1653026, 1589343, 1525949, 1463624, 1404022, 1348971, 1299156, 1253979, 1212661, 1175008, 1141115, 1110827, 1083615, 1058721, 1035399, 1013222, 992234, 972743, 955052, 939397, 925894, 914395, 904588, 896203, 888832, 881688, 874250, 867264, 862298, 859951, 859200, 858920, 859148, 860192, 861462, 862288, 863305, 865761, 869737, 874210, 878767, 884113, 890835, 898686, 907332, 916897, 927565, 939390, 952718, 967984, 984905, 1002582, 1020683, 1039887, 1060976, 1084165, 1109554, 1137563, 1168602, 1202856, 1240677, 1282638, 1329024, 1379927, 1436084, 1498999, 1569826, 1648729, 1735615, 1830920, 1935309, 2049102, 2172405, 2305230, 2447048, 2596635, 2752746, 2914471]
50839B914471J66012J67749J66009J60531J51058J37249J19447R8892P6940N4599
50829D212957L2798J2468n792k1562l4097m2473m6305m5850m1501l3767k3773
50818C963103j3138l377M200Q141P223J360q433k1060l5856n2148o8958q5409
50806C695648j00975j15202j27595j37774j45391j49832j50532j47578j41654
50797B479115j33485j23684j12987j02009r0865p9532o8549n8693n0010m1779
50787A617522l3511k5493j8336j2526q368n747l972k463j515j726k830l914m796
50774A492325o181q247j0088j1061j1738j2935j4473j5658j6523j7735j9539k1400
50762A326747k2708k3358k3651k3880k4028k3639k2139j9439j6202j3317j1177
$$ y = [2914471, 3080483, 3248232, 3414241, 3574772, 3725830, 3863079, 3982526, 4081418, 4158358, 4212957, 4245755, 4258223, 4252431, 4230869, 4196772, 4154299, 4107994, 4062144, 4020643, 3986876, 3963103, 3949965, 3946588, 3950788, 3958929, 3966152, 3967512, 3959079, 3938019, 3902163, 3850015, 3781057, 3695648, 3594673, 3479471, 3351876, 3214102, 3068711, 2918879, 2768347, 2620769, 2479115, 2345630, 2221946, 2108959, 2006950, 1916085, 1836553, 1768004, 1709311, 1659301, 1617522, 1584011, 1558518, 1540182, 1527656, 1519288, 1513541, 1509569, 1507106, 1505591, 1503865, 1501035, 1497121, 1492325, 1486144, 1477897, 1467809, 1456748, 1445010, 1432075, 1417602, 1401944, 1385421, 1367686, 1348147, 1326747, 1304039, 1280681, 1257030, 1233150, 1209122, 1185483, 1163344, 1143905, 1127703, 1114386, 1103209]
50751A103209r443p416m693j572J242L500N803Q905J2707J6449J9778K3226K7476
50738A199171L2624L8190M3656M8786N3691N8550O3211O7276P0748P4271P8250
50727A828424Q2044Q4623Q5781Q6074Q5738Q4461Q2240P9552P6380P1729O4467
50716B711513N4154M0990K5517Q751p932k3243l6101m5349n0090n0488m7664m2566
50704B537492l5440k6616j7081p963J3O200R825J0551Q667M321k948j3361k5952
50691B447708l9052n1314o1926p0299p6185p9877q1557q0760p7058p1211o4812
50680A693657n8668n2129m4275l5324k6434j8403j1073l941L129J0025J6868K3718
50668A497150K9914L4293L6440L7122L7130L6093L3125K8469K3723K0304J8262
$$ y = [1103209, 1093766, 1086350, 1081657, 1080085, 1081327, 1084827, 1090630, 1099535, 1112242, 1128691, 1148469, 1171695, 1199171, 1231795, 1269985, 1313641, 1362427, 1416118, 1474668, 1537879, 1605155, 1675903, 1750174, 1828424, 1910468, 1995091, 2080872, 2166946, 2252684, 2337145, 2419385, 2498937, 2575317, 2647046, 2711513, 2765667, 2806657, 2832174, 2840925, 2832993, 2809750, 2773649, 2728300, 2678210, 2627722, 2580058, 2537492, 2502052, 2475436, 2458355, 2450392, 2450405, 2456605, 2466430, 2476981, 2485648, 2489969, 2487021, 2473660, 2447708, 2408656, 2357342, 2295416, 2225117, 2148932, 2069055, 1987498, 1906738, 1829680, 1758469, 1693657, 1634989, 1582860, 1538585, 1503261, 1476827, 1458424, 1447351, 1443410, 1446539, 1456564, 1473432, 1497150, 1527064, 1561357, 1597797, 1634919, 1672049, 1708142, 1741267, 1769736, 1793459, 1813763, 1832025]
50657A832025J6690J4863J2749J0815R497Q713P890O758N922O118P094P846P993
50644A954973Q334R888J2942J7178K2172K7504L2755L7670M2035M5360M7066M7070
50632B304947M5851M4010M2081M0548L9536L8826L8822M1022M5999N0709M9269
50621B781620L7391J5826j0554l5959n5823o7560p1078o8433o2089n3406m3013
50610B366922l1902k1321j1984m019K484P351J0400J1116Q690K934n174j4369
50598B321128k4138l4389m4551n3679o1155o6657o9807p0509o9389o7268o4376
50587A695210o0677n6680n3181n0322m7553m4522m1375l8230l4982l1669k8582
50576A207437k5813k3057j9874j6011j1573p143l447n86K110N108P908R699J0559
$$ y = [1832025, 1848715, 1863578, 1876327, 1887142, 1896639, 1905352, 1913242, 1920000, 1925922, 1932040, 1939134, 1946980, 1954973, 1963307, 1973195, 1986137, 2003315, 2025487, 2052991, 2085746, 2123416, 2165451, 2210811, 2257877, 2304947, 2350798, 2394808, 2436889, 2477437, 2516973, 2555799, 2594621, 2635643, 2681642, 2732351, 2781620, 2819011, 2834837, 2824283, 2788324, 2732501, 2664941, 2593863, 2525430, 2463341, 2409935, 2366922, 2335020, 2313699, 2301715, 2297696, 2300180, 2307531, 2317931, 2329047, 2337737, 2340671, 2335497, 2321128, 2296990, 2262601, 2218050, 2164371, 2103216, 2036559, 1966752, 1896243, 1826854, 1759586, 1695210, 1634533, 1577853, 1524672, 1474350, 1426797, 1382275, 1340900, 1302670, 1267688, 1236019, 1207437, 1181624, 1158567, 1138693, 1122682, 1111109, 1103966, 1100519, 1099933, 1102043, 1107151, 1115059, 1124758, 1135317]
50563A135317J1357J2727J4645J6879J9230K1353K3004K4483K6391K8893L1598
50552A365877L4091L6149L7486L7868L7473L6760L5858L4517L2658L0636K8850
50541A748223K7481K6707K6875K8336L1233L5374M0188M4927M9240N3341N7550
50530B169475O1845O6228P1172P7197Q4148R1397R8630J05900J12874J18695J22676
50519C180237J24745J25022J23259J18898J11432J00647Q6730P0267N1988L2435
50509D125660J1936r178l0412n1114p0463q7638j02099j13484j21053j23637j20571
50498C307947j12524j00982q7000p0834n2710l3398j3904N118K3289L9896N3515
50487B958413O2334O4967O0959N0468L3834J1781j4073m1446o8164r2233j11435
$$ y = [1135317, 1146674, 1159401, 1174046, 1190925, 1210155, 1231508, 1254512, 1278995, 1305386, 1334279, 1365877, 1399968, 1436117, 1473603, 1511471, 1548944, 1585704, 1621562, 1656079, 1688737, 1719373, 1748223, 1775704, 1802411, 1829286, 1857622, 1888855, 1924229, 1964417, 2009344, 2058584, 2111925, 2169475, 2231320, 2297548, 2368720, 2445917, 2530065, 2621462, 2720092, 2825992, 2938866, 3057561, 3180237, 3304982, 3430004, 3553263, 3672161, 3783593, 3884240, 3970970, 4041237, 4093225, 4125660, 4137596, 4128418, 4098006, 4046892, 3976429, 3888791, 3786692, 3673208, 3552155, 3428518, 3307947, 3195423, 3094441, 3007441, 2936607, 2883897, 2850499, 2836595, 2841713, 2865002, 2904898, 2958413, 3020747, 3085714, 3146673, 3197141, 3230975, 3242756, 3228683, 3187237, 3119073, 3026840, 2915405]
50476B915405j23993j30116j32032j31716j29148j23401j14849j05262r6043q7243
50466A741602p8326o9197o0304n2326m5836m0953l7305l4503l2344l0398k7820
50455A232290k4146j9915j5973j2499r189o000l093l70K274M563O306P934R865
50442A172047J1737J3046J4115J5514J6859J7225J6542J5546J4470J2980J1326
50431A331407J0356J0166R942R392R151R347Q980P430N618M898N434O408P327
50418A435856Q401J0032J2519J5976K0149K4573K9218L4532M0614M6841N2598
50407A731309N7858O2636O6461O8768O9458O8625O6265O2651N8507N4245M9319
50396B416102M2800L4321K4093J2380n58j4234k8124m1841n4801o5917p4035p8624
$$ y = [2915405, 2791412, 2661296, 2529264, 2397548, 2268400, 2144999, 2030150, 1924888, 1828845, 1741602, 1663276, 1594079, 1533775, 1481449, 1435613, 1394660, 1357355, 1322852, 1290508, 1260110, 1232290, 1208144, 1188229, 1172256, 1159757, 1150568, 1144568, 1141475, 1141105, 1143379, 1147942, 1154248, 1162182, 1172047, 1183784, 1196830, 1210945, 1226459, 1243318, 1260543, 1277085, 1292631, 1307101, 1320081, 1331407, 1341763, 1351929, 1361871, 1371263, 1380414, 1389761, 1398741, 1406171, 1411789, 1416687, 1422121, 1428529, 1435856, 1444257, 1454289, 1466808, 1482784, 1502933, 1527506, 1556724, 1591256, 1631870, 1678711, 1731309, 1789167, 1851803, 1918264, 1987032, 2056490, 2125115, 2191380, 2254031, 2312538, 2366783, 2416102, 2458902, 2493223, 2517316, 2529696, 2529138, 2514904, 2486780, 2444939, 2390138, 2324221, 2250186, 2171562]
50384B171562p9849p8244p4463o8995o1850n2813m2273l1312k0736j0432q1R810
50372A660324J8112K3975K7135K7521K5039J9618J1284M23j1788k3603l3824m2465
50360A701751m9918n5775n9061n9412n7475n4168n0120m5910m2279l9615l7399
50349A150619l4496l0147k4684j9104j3981q936l445J995N812O547L877j358p651
50336A025048j3378j7360j9370j9835j9045j6945j3757j0331p513n465l780k027
50324H76242r8J787L250M177M930N860O811P459Q000Q768R333Q804P164N413M179
50309I62079L128K082J670K297L306L924M303M861N325N259M915M651M131L023
50295A014954J989J927K581L025L141L520M123M283M018M119M697M795L761K074
$$ y = [2171562, 2091713, 2013469, 1939006, 1870011, 1808161, 1755348, 1713075, 1681763, 1661027, 1650595, 1650514, 1660324, 1678436, 1702411, 1729546, 1757067, 1782106, 1801724, 1813008, 1813431, 1801643, 1778040, 1744216, 1701751, 1651833, 1596058, 1536997, 1477585, 1420110, 1365942, 1315822, 1269912, 1227633, 1188018, 1150619, 1116123, 1085976, 1061292, 1042188, 1028207, 1019271, 1015826, 1017821, 1023633, 1030180, 1034057, 1032699, 1025048, 1011670, 994310, 974940, 955105, 936060, 919115, 905358, 895027, 887514, 882049, 878269, 876242, 876144, 877931, 881181, 885358, 890288, 896148, 902959, 910418, 918418, 927186, 936519, 945323, 952487, 957900, 962079, 965207, 967289, 968959, 971256, 974562, 978486, 982789, 987650, 992975, 998234, 1003149, 1007800, 1011931, 1014954, 1016943, 1018870, 1021451, 1024476, 1027617, 1031137, 1035260, 1039543, 1043561, 1047680, 1052377, 1057172, 1060933, 1063007]
50281A063007M04j216k783l674l284j834K9K013M093O005P298P815P847P852Q107
50266A101679Q414Q095O637M424K542J773K028K757L562M392N521P420J0202J3224
50252A182670J5602J7292J9153K1742K4434K5995K5754K4100K2120K0793K0308
50241A419963K0158K0060K0521K1992K3657K3849K1674J7481J1653L974n330j4721
50229A584931k2330k7399l0284l1431l0951k8876k5255k0354j5246j1962j2295
50218A328548j6353k2634k9274l4920l8704m0152l9358l6923l3639l0270k7363
50207I78958k4888k2277j9230j6266j4061j2475j0861r164q011p669p628p425
50195H19003p229p230p014o053m559l409l276m111n278n954n627m519l466l046
$$ y = [1063007, 1063411, 1062195, 1059412, 1055738, 1052454, 1050620, 1050649, 1052662, 1056755, 1062760, 1070058, 1077873, 1085720, 1093572, 1101679, 1110093, 1118188, 1124825, 1129249, 1131791, 1133564, 1135592, 1138349, 1141911, 1146303, 1151824, 1159244, 1169446, 1182670, 1198272, 1215564, 1234717, 1256459, 1280893, 1306888, 1332642, 1356742, 1378862, 1399655, 1419963, 1440121, 1460181, 1480702, 1502694, 1526351, 1550200, 1571874, 1589355, 1601008, 1604982, 1599652, 1584931, 1562601, 1535202, 1504918, 1473487, 1442536, 1413660, 1388405, 1368051, 1352805, 1340843, 1328548, 1312195, 1289561, 1260287, 1225367, 1186663, 1146511, 1107153, 1070230, 1036591, 1006321, 978958, 954070, 931793, 912563, 896297, 882236, 869761, 858900, 849736, 841725, 834056, 826428, 819003, 811774, 804544, 797530, 791477, 786918, 783509, 780233, 776122, 770844, 764890, 759263, 754744, 751278, 748232]
50181G48232k997k697k046j510j357j321j106q11o13l53J82P76R92Q37Q17J205
50165G38230J585J501J242J570K635L664L910L593L509L972M589N111N910P377
50151G88398R218J0750J1692J2268J2562J2302J1370J0231R552R601J0223J1271
50139I19438J2879J5366J9096K4248L0544L7227M3515M9107N3984N7859O0052
50128A323315O0053N8036N4794N1373M8799M7874M8747N0497N1198M8715M1886
50117A885287L1228J8400M866q787k2156l4241m3992n1441n7379o1885o3913o2829
50105A533158n9557n5664n1743m7477m2891l8715l5568l3395l1821l0492k9072
50094A076763k7345k5413k3409k1084j8140j4881j2063r996q282o430m327k109
$$ y = [748232, 745235, 742538, 740492, 738982, 737625, 736304, 735198, 734387, 733774, 733421, 733603, 734379, 735371, 736208, 737025, 738230, 739815, 741316, 742558, 744128, 746763, 750427, 754337, 757930, 761439, 765411, 770000, 775111, 781021, 788398, 797616, 808366, 820058, 832326, 844888, 857190, 868560, 878791, 888343, 897944, 908167, 919438, 932317, 947683, 966779, 991027, 1021571, 1058798, 1102313, 1151420, 1205404, 1263263, 1323315, 1383368, 1441404, 1496198, 1547571, 1596370, 1644244, 1692991, 1743488, 1794686, 1843401, 1885287, 1916515, 1934915, 1939781, 1930994, 1908838, 1874597, 1830605, 1779164, 1721785, 1659900, 1595987, 1533158, 1473601, 1417937, 1366194, 1318717, 1275826, 1237111, 1201543, 1168148, 1136327, 1105835, 1076763, 1049418, 1024005, 1000596, 979512, 961372, 946491, 934428, 924432, 916150, 909720, 905393, 903284]
50082I03284r4J218J617J743K485L807M797N017M953M976M774M312M328N152N807
50067I58176N256L955L225L391L504K701R74j181l054l859l449k840l122m014
50053I59663m450m416m885n890o072m813l398l210l722l356j594Q63L505O306
50039I24531Q883J0542J1310J2037J3231J4542J5483J6083J6541J6798J6761J6501
50027A093243J6053J5266J3996J2278J0253Q244O853O586P258Q208R084J0187
50015A217509J1917J4272J6958J9581K1629K2630K2628K2126K1432K0310J8583
50004A429575J6787J5937J6691J8759K0975K1795K0098J5767R388J404q204j9131
49992A559841l0029l8973m4724m7372m7918m7444m6621m5683m4591m3217m1439
$$ y = [903284, 903190, 904408, 906025, 907768, 910253, 914060, 918857, 923874, 928827, 933803, 938577, 942889, 947217, 952369, 958176, 963432, 967387, 970612, 974003, 977507, 980208, 981182, 980001, 976947, 973088, 969639, 966799, 963677, 959663, 955213, 950797, 945912, 940022, 933950, 929137, 925739, 922529, 918807, 915451, 913857, 914720, 918225, 924531, 933414, 943956, 955266, 967303, 980534, 995076, 1010559, 1026642, 1043183, 1059981, 1076742, 1093243, 1109296, 1124562, 1138558, 1150836, 1161089, 1169333, 1176186, 1182772, 1190030, 1198238, 1207322, 1217509, 1229426, 1243698, 1260656, 1280237, 1301866, 1324496, 1347124, 1369250, 1390682, 1410992, 1429575, 1446362, 1462299, 1478990, 1497749, 1518724, 1540519, 1560617, 1576384, 1585772, 1587176, 1578972, 1559841, 1529812, 1490839, 1446115, 1398743, 1350825, 1303381, 1256760, 1211077, 1166486, 1123269, 1081830]
49981A081830l9208l6564l3585l0266k6593k2832j9546j7126j5394j3856j2230
49970H14630j0487q618o768n445n125n586o091o161n765m883l476j935q40o2J146
49955G44534K958M621N712O949R048J1422J2822J2816J1808R995P324M407K382
49942H46798J677J553J083k2j639l596n519o920p842r024j1111j3861j6400j7932
49928G57245j8085j6871j4682j2172r944q362p555p321o992n801l595j043J010
49915F45832K277L031L680M389M986N194N023M970N533O612P675Q522R478J0758
49901G27960J1968J2588J2667J2666J2684J2167J0589Q284O317N259M313K109
49889H39571j546n299p917r755j1888j4229j5484j5034j3807j3002j2728j2430
$$ y = [1081830, 1042622, 1006058, 972473, 942207, 915614, 892782, 873236, 856110, 840716, 826860, 814630, 804143, 795525, 788757, 783312, 778187, 772601, 766510, 760349, 754584, 749701, 746225, 744290, 743450, 743388, 744534, 747492, 752113, 757825, 764774, 773822, 785244, 798066, 810882, 822690, 832685, 840009, 844416, 846798, 848475, 850028, 851111, 851089, 849450, 845854, 840335, 833415, 825573, 816549, 805438, 791577, 775177, 757245, 739160, 722289, 707607, 695435, 685491, 677129, 669574, 662253, 655261, 649460, 645865, 644822, 645832, 648109, 651140, 654820, 659209, 664195, 669389, 674412, 679382, 684915, 691527, 699202, 707724, 717202, 727960, 739928, 752516, 765183, 777849, 790533, 802700, 813289, 821573, 827890, 833149, 837462, 839571, 838025, 832726, 824809, 815054, 803166, 788937, 773453, 758419, 744612, 731610, 718882, 706452]
49877G06452j2039j1946j2121j1988j1105r575p735n834m063k627j591q10o8O75
49863F15625J259J659K341M030O776R506J1001J1300J1636J2792J4143J4615J4117
$$ y = [706452, 694413, 682467, 670346, 658358, 647253, 637678, 629943, 624109, 620046, 617419, 615828, 615018, 614950, 615625, 616884, 618543, 620884, 624914, 631690, 641196, 652197, 663497, 675133, 687925, 702068, 716683, 730800]
$$ [...]
##END NTUPLES=NMR SPECTRUM
##END=
