
##TITLE=UV1216_M5_1296-1170_20_7229458_uisxWrOONC
##JCAMPDX= 6.0         $$ Bruker NMR JCAMP-DX V2.0
##DATA TYPE= NMR SPECTRUM
##DATA CLASS= NTUPLES
##ORIGIN= BRUKER
##OWNER= Administrator
$$ 1.72 TOPSPIN		Version 2.1
$$ 2013-01-23 19:02:51.507 -0500  Administrator@X
$$ Compression mode = diff/dup
##.OBSERVE FREQUENCY= 400.02188249412
##.OBSERVE NUCLEUS= ^1H
##.ACQUISITION MODE= SIMULTANEOUS (DQD)
##.ACQUISITION SCHEME= undefined
##.AVERAGES= 8
##.DIGITISER RES= 22
##SPECTROMETER/DATA SYSTEM= spect
##.PULSE SEQUENCE= zg30
##.SOLVENT NAME= COFFEE_meoh
##.SHIFT REFERENCE= INTERNAL, COFFEE_meoh, 1, 14.98509
##AUDIT TRAIL= $$ (NUMBER, WHEN, WHO, WHERE, PROCESS, VERSION, WHAT)
$$ ##TITLE= Audit trail, TOPSPIN		Version 2.1
$$ ##JCAMPDX= 5.01
$$ ##ORIGIN= Bruker BioSpin GmbH
$$ ##OWNER= Administrator
$$ $$ E:\/data/COFFEE/nmr/UV1216_M5_1296-1170_20_7229458_uisxWrOONC/30/pdata/1/auditp.txt
$$ ##AUDIT TRAIL=  $$ (NUMBER, WHEN, WHO, WHERE, PROCESS, VERSION, WHAT)
(   1,<2013-01-23 19:02:43.554 -0500>,<Administrator>,<X>,<go>,<TOPSPIN 2.1>,
      <created by zg
	started at 2013-01-23 19:01:37.054 -0500,
	POWCHK enabled, PULCHK disabled,
       configuration hash MD5:
       86 BA 57 50 F2 9D 5C 9B 26 00 A9 28 5F 66 2E 89
       data hash MD5: 64K
       6B 5D 1D 1A 56 72 E3 63 44 09 F7 E2 EA BD 60 31>)
(   2,<2013-01-23 19:02:46.617 -0500>,<Administrator>,<X>,<proc1d>,<TOPSPIN 2.1>,
      <Start of raw data processing
       efp LB = 0 FT_mod = 6 PKNL = 1 PHC0 = 0 PHC1 = 0 SI = 32K 
       data hash MD5: 32K
       F0 F2 A5 F9 4E 4F 12 7F BC A7 7C FE B4 2E E9 50>)
(   3,<2013-01-23 19:02:47.070 -0500>,<Administrator>,<X>,<proc1d>,<TOPSPIN 2.1>,
      <pk PHC0 = 101.3049 PHC1 = 0 
       data hash MD5: 32K
       32 D8 72 3F 5E 99 34 DD F1 85 E9 CD A7 2D C6 87>)
(   4,<2013-01-23 19:02:47.304 -0500>,<Administrator>,<X>,<proc1d>,<TOPSPIN 2.1>,
      <abs ABSG = 1 
       data hash MD5: 32K
       32 3F 64 D3 21 90 31 44 03 E7 AA 2A 20 08 6F 0B>)
(   5,<2013-01-23 19:02:47.445 -0500>,<Administrator>,<X>,<proc1d>,<TOPSPIN 2.1>,
      <abs ABSG = 2 
       data hash MD5: 32K
       DF 95 0F 6D 50 43 BA D5 79 36 F4 5A 51 8D 6E 97>)
(   6,<2013-01-23 19:02:47.585 -0500>,<Administrator>,<X>,<proc1d>,<TOPSPIN 2.1>,
      <abs ABSG = 3 
       data hash MD5: 32K
       92 64 CB B5 10 C4 4B 7F 7D 71 08 5B 0E 90 B2 2D>)
(   7,<2013-01-23 19:02:47.726 -0500>,<Administrator>,<X>,<proc1d>,<TOPSPIN 2.1>,
      <abs ABSG = 4 
       data hash MD5: 32K
       88 56 2C 24 5F C1 35 13 6B 14 9B EA 55 31 48 32>)
(   8,<2013-01-23 19:02:47.867 -0500>,<Administrator>,<X>,<proc1d>,<TOPSPIN 2.1>,
      <abs ABSG = 5 
       data hash MD5: 32K
       59 ED D0 23 58 F7 58 DB 51 9C F4 3B 07 0F AA CB>)
$$ ##END=
$$ 
$$ $$ hash MD5
$$ $$ 22 84 2A D0 2D 7C 97 BC FA E2 D2 53 E0 D7 DF 84
##$RELAX= 
##$RELAX= 
##$RELAX= 
##$RELAX= 
##$RELAX= 
##$RELAX= 
##$RELAX= 
$$ Bruker specific parameters
$$ --------------------------
##$DU= <E:\>
##$EXPNO= 30
$$ [...]
##$TP= (0..7)
150 150 150 150 150 150 150 150
##$TP07= 0
##$TPNAME0= <>
##$TPNAME1= <>
##$TPNAME2= <>
##$TPNAME3= <>
##$TPNAME4= <>
##$TPNAME5= <>
##$TPNAME6= <>
##$TPNAME7= <>
##$TPOAL= (0..7)
0.5 0.5 0.5 0.5 0.5 0.5 0.5 0.5
##$TPOFFS= (0..7)
0 0 0 0 0 0 0 0
##$TUNHIN= 0
##$TUNHOUT= 0
##$TUNXOUT= 0
##$USERA1= <user>
##$USERA2= <user>
##$USERA3= <user>
##$USERA4= <user>
##$USERA5= <user>
##$V9= 5
##$VALIST= <valist>
##$VCLIST= <CCCCCCCCCCCCCCC>
##$VD= 0
##$VDLIST= <DDDDDDDDDDDDDDD>
##$VPLIST= <PPPPPPPPPPPPPPP>
##$VTLIST= <TTTTTTTTTTTTTTT>
##$WBST= 1024
##$WBSW= 4
##$XGAIN= (0..3)
0 0 0 0
##$XL= 0
##$YL= 0
##$YMAX_a= 646788
##$YMIN_a= -552703
##$ZGOPTNS= <>
##$ZL1= 120
##$ZL2= 120
##$ZL3= 120
##$ZL4= 120
##$ABSF1= 14.98509
##$ABSF2= -5.573092
##$ABSG= 5
##$ABSL= 3
##$ALPHA= 0
##$AQORDER= 0
##$ASSFAC= 0
##$ASSFACI= 0
##$ASSFACX= 0
##$ASSWID= 0
##$AUNMP= <proc_prof1d_extract_pilot.lims>
##$AXLEFT= 0
##$AXNAME= <>
##$AXNUC= <1H>
##$AXRIGHT= 0
##$AXTYPE= 0
##$AXUNIT= <>
##$AZFE= 0.1
##$AZFW= 0.1
##$BCFW= 0
##$BC_mod= 0
##$BYTORDP= 0
##$COROFFS= 0
##$CY= 15
##$DATMOD= 1
##$DC= 0
##$DFILT= <>
##$DTYPP= 0
##$F1P= 0
##$F2P= 0
##$FCOR= 0.5
##$FTSIZE= 32768
##$FT_mod= 6
##$GAMMA= 0
##$GB= 0
##$INTBC= 1
##$INTSCL= 1
##$ISEN= 128
##$LB= 0
##$LEV0= 0
##$LPBIN= 0
##$MAXI= 10000
##$MC2= 0
##$MEAN= 0
##$ME_mod= 0
##$MI= 0
##$NCOEF= 0
##$NC_proc= -8
##$NLEV= 6
##$NOISF1= 0
##$NOISF2= 0
##$NSP= 0
##$NTH_PI= 0
##$NZP= 0
##$OFFSET= 14.98509
##$PC= 1
##$PHC0= 101.3049
##$PHC1= 0
##$PH_mod= 1
##$PKNL= yes
##$PPARMOD= 0
##$PPDIAG= 0
##$PPIPTYP= 0
##$PPMPNUM= 2147483647
##$PPRESOL= 1
##$PSCAL= 4
##$PSIGN= 0
##$PYNMP= <proc.py>
##$REVERSE= no
##$SF= 400.02
##$SI= 32768
##$SIGF1= 0
##$SIGF2= 0
##$SINO= 400
##$SIOLD= 32768
##$SPECTYP= <>
##$SREGLST= <1H.CDCl3>
##$SSB= 0
##$STSI= 32768
##$STSR= 0
##$SW_p= 8223.68421052631
##$SYMM= 0
##$S_DEV= 0
##$TDeff= 65536
##$TDoff= 0
##$TI= <>
##$TILT= no
##$TM1= 0
##$TM2= 0
##$TOPLEV= 0
##$USERP1= <user>
##$USERP2= <user>
##$USERP3= <user>
##$USERP4= <user>
##$USERP5= <user>
##$WDW= 1
##$XDIM= 32768
##$YMAX_p= 477669191
##$YMIN_p= -767827
##$CURPLOT= <Network HP LaserJet P1505>
##$CURPRIN= <$Network HP LaserJet P1505>
##$DFORMAT= <normdp>
##$LAYOUT= <+/1D_H.xwp>
##$LFORMAT= <normlp>
##$PFORMAT= <normpl>
##$SURQMSG= 1
$$ End of Bruker specific parameters
$$ ---------------------------------
##NTUPLES= NMR SPECTRUM
##VAR_NAME=  FREQUENCY,     SPECTRUM/REAL,   SPECTRUM/IMAG
##SYMBOL=    X,             R,               I
##VAR_TYPE=  INDEPENDENT,   DEPENDENT,       DEPENDENT
##VAR_FORM=  AFFN,          ASDF,            ASDF
##VAR_DIM=   32768,         32768,           32768
##UNITS=     HZ,            ARBITRARY UNITS, ARBITRARY UNITS
##FACTOR=    0.250966925370066, 1,           1
##FIRST=     8223.43324360094, -74220,       90689
##LAST=      0,             -64438,          -347108
##MIN=       0,             -767827,         0
##MAX=       8223.43324360094, 477669191,    0
$$ Real data points
##PAGE= N=1
##DATA TABLE= (X++(R..R)), XYDATA
$$ [...]
19532a59039B09160a62764f6526q0550B88963a45709e7489A0610J4708a34784
19521C20260c50034o1238A89394a02889A13326m175J40101j02218a93294m3483
19511b36777J09652k18444A2498L0640i337r2596A04679a77591O9093A70880b02444
19499C40604b81668A76515p5010d18459a72513O8907j19508a4841j60417K9658
19489a45600j85078e9199k29136k765K7896d7922a5588p464A05099E1065C478
19477c15114P1122B87191A17289m257a11872N5376A54927G503J37695a9285j8587
19466c7872j29555C5368a13347A87191c19172H8050a43193D7526J63624R9853
19456C11003a3376A04242i6689A8667J2992j5790c54435a2596j63002c6447A86101
$$ plain form
19532 -159039 209160 -162764 -66526 -147076 288963 -145709 -57489 10610 25318 -134784
19521 320260 -350034 -411272 189394 -102889 113326 109151 249252 147034 -193294 -236777
19511 -236777 -127125 -345569 12498 43138 -9337 -101933 104679 -177591 -108498 170880 -202444
19499 340604 -281668 176515 101505 -418459 -172513 -103606 -223114 -14841 -175258 -145600
19489 -145600 -330678 -59199 -288335 -291100 -263204 -47922 -15588 -23052 105099 51065 3478
19477 -315114 -243992 287191 117289 113032 -111872 -56496 154927 7503 145198 -19285 -37872
19466 -37872 -167427 35368 -113347 187191 -319172 88050 -143193 47526 211150 311003
19456 311003 -13376 104242 -96689 18667 31659 15869 -354435 -12596 -175598 -36447 186101
19444B187a47657B22909a53818d9534j46105I8686B2676J02167c5171q8088A00593
19432H6145i4463o4416d9913B39269b29924R3109q1160B5338J8759A3255a78602
19420a15217a0591j46071c3545B79232g8096j66638O873c2820E4554b46444d7992
19408d717k0771j52025f1806r3596A37127a75464N5829C634b33506d1599B92802
19396a8554l09683A19853c3441C4599g0941m1960j19337d9075A18255L6936a26779
19384c2897F7975c84615J9092A28578P8693a97142j76696J85400J970A58153i5237
19372A27128a37840A21248b64623B30631c9352j88193A80280F9712i4968c2741
19361a4413G3080L57981f9089A87275a29168C4258g9749j08137p1384D1652J55500
$$ plain form
19444 2187 -147657 222909 -153818 -49534 -195639 98686 22676 124843 -35171 -123259 100593
19432 86145 -94463 -158879 -49913 239269 -229924 -136815 -217975 25338 44097 13255 -178602
19420 -115217 -10591 -156662 -33545 279232 -78096 -244734 -237861 -32820 54554 -246444 -47992
19408 -4717 -25488 -177513 -61806 -155402 137127 -175464 -119635 3634 -233506 -41599 292802
19396 -18554 -328237 119853 -33441 34599 -70941 -112901 -232238 -49075 118255 155191 -126779
19384 -32897 67975 -384615 -365523 128578 207271 -197142 -373838 -188438 -186468 158153 -95237
19372 127128 -137840 121248 -264623 230631 -39352 -227545 180280 69712 -94968 -32741
19361 -14413 73080 431061 -69089 187275 -129168 34258 -79749 -187886 -259270 41652 197152
19350A97152E1480e0536A15220a57174N0961F778d8138p7867j18979Q5491B16516
19338A67423d7185j47028e4311l72895a41043B78259F9974K5217a05518C6839
19327a47425A4985J1317J33640B475K28001A13064c50668a0040A61309a18218
19316C3088a50830C8643a52533j50774A74000b64333n2283b9475G3890k8238Q2937
19305A28589c07177B22571M9547c75684f5033A56875k0688a9458j54198l5477
19295b09133h0010m390C1959d1742k11815a07688n9664o3479B6152b62085B1989
19283c58962A98133F0737J51665g8277H7267b0390k48449C6862e55874D11014
19272c7771j9572k50323C2919L3381b73936B6682c36578e4291K5139j23592j45362
$$ plain form
19350 197152 51480 -50536 115220 -157174 -106213 6778 -48138 -126005 -244984 -159493 216516
19338 167423 -47185 -194213 -54311 -427206 -141043 278259 69974 95191 -105518 36839
19327 -147425 14985 26302 159942 2475 230476 113064 -350668 -10040 161309 -118218
19316 33088 -150830 38643 -152533 -303307 174000 -264333 -316616 -29475 73890 45652 128589
19305 128589 -307177 222571 272118 -375684 -65033 156875 136187 -19458 -173656 -209133
19295 -209133 -80010 -84400 31959 -41742 -253557 -107688 -167352 -230831 26152 -262085 21989
19283 -358962 198133 60737 212402 -78277 87267 -20390 -268839 36862 -555874 411014
19272 -37771 -57343 -307666 32919 66300 -273936 26682 -336578 -54291 -29152 -152744 -298106
19261b98106E0440a46622F0708b52692E8118d9150j17793g9793G0189L16632b55580
19249g5055k0906j4424B3089b32189k39861A61348b22642A67040e8702G3183a03945
19237I1784a15273j82272L6381C5334K09082a24539d9873m5267A8577b00275d8244
19225i6333M0176C33609i7082j18930K1626n0733F6308b79229J22702n0724D5491
19213f1217a1320A01706a93214Q4887r2513D1422c4845k71390j99996a77356A45646
19201d6174C4033R5120g677k47775c8036j32567A14834A9807m409L72149a16786
19189c8963B35935a37425L3487p5949g2160B6765b39513A38920F4299Q5990c29842
19177A00393L58839A00213h7168A42608K4655g2546k51086B9132b12392B02634
$$ plain form
19261 -298106 50440 -146622 60708 -252692 58118 -49150 -166943 -79793 70189 386821 -255580
19249 -75055 -95961 -110385 23089 -232189 -472050 161348 -222642 167040 -58702 73183 -103945
19237 91784 -115273 -297545 -261164 35334 244416 -124539 -49873 -95140 18577 -200275 -48244
19225 -96333 -56157 333609 -97082 -216012 -194386 -245119 66308 -279229 -156527 -207251 45491
19213 -61217 -11320 101706 -193214 -108327 -200840 41422 -34845 -306235 -506231 -177356 145646
19201 -46174 34033 129153 -7677 -255452 -38036 -170603 114834 19807 15398 387547 -116786
19189 -38963 235935 -137425 -103938 -179887 -72160 26765 -239513 138920 64299 150289 -329842
19177 100393 459232 100213 -87168 142608 167263 -72546 -323632 29132 -212392 202634
19166a99258B5295g8970j74055A08947K2406a80301n4349E4704L3724l9907c58557
19154A0239a63482o890F1062A9799c27525j15452J79953a23259p5503n7431F3401
19142D9124J35599C4955c297j07421j21512A27107a21605q2793p9903F5434a54104
19130e957j50562E3294a68346Q3066b5812j39898P1950K7747c858j60070E2631
19118b0702F4409a00463m84297a07507j76224J6063k00905a48395K0805a0579
19107i6384c0150F546h3282I7038h2440B24945i812A96007F9497I919a1676j40060
19095a51736j9340l853N9034j08487L5204R2412k56423i4319A25595c37846a13832
19083B69868a09338D7309b93015h3869j88415r7009b4843C9237b65297J7858C68068
$$ plain form
19166 -199258 25295 -78970 -253025 108947 131353 -180301 -234650 54704 88428 48521 -358557
19154 10239 -163482 -170372 61062 19799 -327525 -442977 -263024 -123259 -198762 -256193 63401
19142 49124 184723 34955 -3297 -110718 -232230 127107 -121605 -204398 -284301 65434 -154104
19130 -5957 -156519 53294 -168346 -85280 -25812 -165710 -93760 -66013 -3858 -163928 52631
19118 -20702 64409 -100463 -584760 -107507 -283731 -267668 -468573 -148395 -127590 -10579
19107 -96384 -30150 6546 -83282 97038 -82440 224945 -9812 196007 69497 9919 -11676 -151736
19095 -151736 -171076 -174929 -115895 -224382 -189178 -96766 -353189 -94319 125595 -337846 -113832
19083 269868 -109338 47309 -293015 -83869 -272284 -369293 -24843 39237 -265297 -247439 368068
19071a13006F4334k7364K0028e5127A2867K17091c30670J56050f7531E4096a32460
19059e878B04203a55096j01610g5855H5203l5439L4180e2424A69594b2062p9689
19048a01751A59014o3761a4935r5258L4869B307L0930a6423J655j00458K3732
19037i1494A53577J97943b9687A53484E3147J55331q3677O7961a47818A24322
19026d2019r557A50424K9782L7097H4202g6728A368g3082F6800J61273R888E9105
19013I6857D5622O8990e3383r0461c6914B0362M2110a08158f677q253j42318A78775
19000A11634b29621F3313e0020j97590P3235K0721d8207A81424b5420C19134A2465
18988F6132I360J54618a2271A67845c70701J12469m1616A47530m0371a43614O5916
$$ plain form
19071 -113006 64334 36970 56998 -55127 12867 229958 -330670 -174620 -67531 54096 -132460
19059 -5878 204203 -155096 -256706 -75855 85203 49764 83944 -52424 169594 -22062 -101751
19048 -101751 159014 95253 -14935 -110193 -75324 2307 33237 -16423 -14768 -115226 -91494
19037 -91494 153577 351520 -29687 153484 53147 208478 124801 192762 -147818 124322
19026 -42019 -51576 150424 180206 217303 84202 -76728 1368 -73082 66800 228073 237961 59105
19013 96857 45622 114612 -53383 -143844 -36914 20362 62472 -108158 -6677 -14930 -157248 178775
19000 111634 -229621 63313 -50020 -247610 -174375 -153654 -48207 181424 -25420 319134 12465
18988 66132 9360 163978 -12271 167845 -370701 -258232 -299848 147530 107159 -143614 -77698
18977g7698B3217a3482l64251a50329l9490P8641o4770C30074d6488J321o4861
18966a10028l8681A23318g8471B32988b16090R5763e8059A61254b9373D5015J13981
18955A58996D0822a50087j21295E5513J13629c84249D3054b21591B0480J52364
18945A72844c9044l11072a48493D1711A5718J49414o1554J56912c54931g0442
18934F7950b07151n7144K0312m00866a04138A16511a65111K8740l36504A6186
18923A14257G177h5646D5363K74693j55458b9336j19476B12128b47115F7408J14864
18912A82272a0805m2199A95220a51309f0176A26293B754K67261A19770b86150
18901c06739a23822F3068J9359i7051k65013c6261N654C20159A08414J65249b27205
$$ plain form
18977 -77698 23217 -13482 -377733 -150329 -189819 -111178 -175948 330074 -46488 -45167 -110028
18966 -110028 -148709 123318 -78471 232988 -216090 -120327 -58059 161254 -29373 45015 158996
18955 158996 40822 -150087 -271382 55513 169142 -384249 43054 -221591 20480 172844
18945 172844 -39044 -350116 -148493 41711 15718 165132 103578 260490 -354931 -70442
18934 67950 -207151 -264295 -243983 -644849 -104138 116511 -165111 -136371 -472875 16186
18923 114257 7177 -85646 45363 320056 164598 -29336 -148812 212128 -247115 67408 182272
18912 182272 -10805 -53004 195220 -151309 -60176 126293 2754 270015 119770 -286150
18901 -306739 -123822 63068 82427 -97051 -362064 -36261 -30607 320159 108414 273663 -227205
18889b9915j18729k46205A50400c51323e6454E2878b23813D9551g7936B8892a4420
18877d37200A70J74860n4869n2958d9299H1730J2895b7102o3750m8425n2872A02822
18864e2350A16867n722M4043a70119j05515A80636a4571j25450C82884A65717
18853a00869j45302i1152J862L1495F0898K55235a09308G9069j8775a15712j0650
18842a26362A62488a64129f4239I369i9861k09924J09981d3810j35098L1418j80023
18831c27513a44485A23510K17509a11746D9958g3117A09891f8107k97155a19640
18820c29534b3404j43136k591g8524C06687L4371G3592e6030a7694r2482M2216
18809f7960j58298a05860E566J56293P8713f3568k66171L0787e29F9545K31114
$$ plain form
18889 -29915 -148644 -394849 150400 -351323 -56454 52878 -223813 49551 -77936 28892 -14420
18877 -437200 170 175030 120161 67203 -49299 81730 94625 -27102 -90852 -139277 -192149 102822
18864 -52350 116867 111145 155188 -170119 -275634 180636 -14571 -140021 382884 165717
18853 -100869 -246171 -91152 -89290 -57795 60898 316133 -109308 79069 60294 -115712 -126362
18842 -126362 162488 -164129 -64239 9369 -99861 -309785 -199804 -43810 -178908 -147490 -327513
18831 -327513 -144485 123510 341019 -111746 49958 -73117 109891 -68107 -365262 -119640
18820 -329534 -23404 -166540 -169131 -78524 306687 341058 73592 -56030 -17694 -110176 -67960
18809 -67960 -226258 -105860 5566 161859 240572 -63568 -329739 -298952 -529 69545 300659
18798C00659H4628a5682l4944C179J9129a17303N6428A65764C7941J10510d32468
18786b3477m0621b4170o4705m4115j14250j36448B4564L4291b76057l5028J08053
18775b03032k66565B50943h5113j59599Q8768A19173i801j98984A91167B681J52417
18764A55098D3807e7565l5484j83786G0643R601a21004M4233F1427h495E001b1416
18751b44692E756a24421A65243Q6451i2884j22390b5811A86841H2501J22990c16267
18739a86634E0690a70720P7919b3502B2693P8635O4896D5574R3431c3938a6209
18727a97712g8060D9361b5422C9362K00173A08327D9599a01361C22708c36736
18716f8341I4346b10923h1985G8166b00443b636r4793c7396j28663B44676f47636
$$ plain form
18798 300659 84628 -15682 -50626 3179 22308 -117303 -60875 165764 37941 148451 -432468
18786 -23477 -64098 -24170 -88875 -132990 -247240 -383688 24564 58855 -276057 -311085 -203032
18775 -203032 -469597 250943 -85113 -244712 -155944 119173 -9801 -208785 191167 2681 155098
18764 155098 43807 -57565 -93049 -276835 70643 80244 -121004 -76771 61427 -8495 5001 -21416
18751 -244692 5756 -124421 165243 251694 -92884 -215274 -25811 186841 82501 205491 -316267
18739 -186634 50690 -170720 -92801 -23502 22693 101328 166224 45574 139005 -33938 -16209
18727 -197712 -78060 49361 -25422 39362 239535 108327 49599 -101361 322708 -336736
18716 -68341 94346 -210923 -81985 78166 -200443 -2636 -97429 -37396 -166059 244676 -647636
18704c51304R4962k9829a06300j36083H194a61624A48580a10782B87995a32655
18693a91649P7151d2828k03426L6333a2549A75164a74849b713j27461j47978i0151
18681G9c59826A99045b07216A34103g6556A1375K34740a3908j42841A52523N5385
18670B07908l3837a57338A00138Q8587L306D2541c4138q4298L5823A53236a71153
18658b51170c8085j40304f6889D87844g0653A12052i183D0413f6454B24031I0383
18646H4062k1507J14891b68000A90673a04989l07609A65589a40650J3147A52314
18635E6433K17738C371a48050G8670g819j21319k51146C0616b69550J00334A3176
18623b22897I6236j6303g6639j69185J07834r5618h9632K7599k49818J07791A48082
$$ plain form
18704 -351304 -256342 -286171 -106300 -242383 8194 -161624 148580 -110782 287995 -132655
18693 -191649 -114498 -42828 -246254 -209921 -12549 175164 -174849 -2713 -130174 -278152 -90151
18681 79 -359826 199045 -207216 134103 -76556 11375 246115 -13908 -156749 152523 207908
18670 207908 174071 -157338 100138 188725 192031 42541 -34138 -118436 -82613 153236 -171153
18658 -251170 -38085 -178389 -66889 487844 -70653 112052 -9183 40413 -66454 224031 90383
18646 84062 62555 177446 -268000 190673 -104989 -412598 165589 -140650 -127503 152314
18635 56433 274171 3371 -148050 78670 -7819 -129138 -380284 30616 -269550 -169216 13176
18623 -222897 96236 79933 -76639 -245824 -137990 -233608 -89632 -62033 -311851 -204060 148082
18611A82536q0508a93314I6747b54979K8401q7869a34352A88723K20499f0249
18600C68874A15742a22389C5815a64562J8673N6931M2828A58775n3760J16454
18590B21469a57736j93092R7337J7913B02198i5076k56590q205a10156k0069o7593
18579a97818A5908a19236b1586k95432B51713H2918a20936c9952H7395b95621
18568E8689c3955j39016J05B2319b82831F731M4165A8503a16303J8645M1108r9849
18556a56399B86919a82826A8907b12726E2893g1387F3394a11531A42991b29564
18545a0759j19167j2716p4121a7791k8972C10885C7327i8234n3697A21266D7008
18533A55408a94891e6126A29367n0467I829d11223J46223k35392J85321C6758
$$ plain form
18611 182536 102028 -193314 96747 -254979 -226578 -314447 -134352 188723 409222 -60249
18600 368874 115742 -122389 35815 -164562 -145889 -88958 -46130 158775 105015 221469
18590 221469 -157736 -350828 -253491 -235578 202198 -95076 -351666 -359871 -110156 -130225 -197818
18579 -197818 15908 -119236 -21586 -317018 251713 82918 -120936 -39952 87395 -295621
18568 58689 -33955 -172971 -172866 22319 -282831 6731 50896 18503 -116303 -97658 -56550 -156399
18556 -156399 286919 -182826 18907 -212726 52893 -71387 63394 -111531 142991 -229564
18545 -10759 -129926 -142642 -216763 -17791 -46763 310885 37327 -98234 -151931 121266 47008
18533 155408 -194891 -56126 129367 78900 9829 -411223 -265000 -500392 -315071 36758
18522A85771A4901a77883B3750c03897A72678c37765Q7125F245a3540A21412b07518
18510A31378b8988p4780n8820H1614a1576o4881B2240L3668g0299j65658Q2531
18499a53426A86087a80667B3364b91761c7188k10517L2665M1680k1673g1970B04354
18487a88218B40791C7989e890j4434A5167e373D18353A74540b20184f7322A64825
18475a95771R1660R083j23362B974a48068D1307b69663a27591D6815a9006j38053
18464a57059J804m9731C25657F1317j741A2298b41339A3427a56371l66601B39714
18452b39166k016g2220b519A96686E6042J32188B3623c0653k52150B0115a8385
18440B28392P8057a54117C13275F0203a34381m0759A04536d13855B24754A04795
$$ plain form
18522 185771 14901 -177883 23750 -303897 172678 -337765 -250640 6245 -13540 121412 -207518
18510 131378 -28988 -103768 -162588 81614 -11576 -76457 22240 55908 -70299 -235957 -153426
18499 -153426 186087 -180667 23364 -291761 -37188 -247705 -215040 -173360 -195033 -71970 204354
18487 -188218 240791 37989 -5890 -20324 15167 -5373 418353 174540 -220184 -67322 164825
18475 -195771 -104111 -95028 -218390 2974 -148068 41307 -269663 -127591 46815 -19006 -157059
18464 -157059 -155255 -204986 325657 61317 59576 12298 -241339 13427 -156371 -522972 239714
18452 -239166 -241182 -72220 -2519 196686 56042 188230 23623 -30653 -282803 20115 -18385
18440 228392 306449 -154117 313275 60203 -134381 -175140 104536 -413855 224754 104795
18429A15604N2270K6320d8695j0319b4042B5259R7796a49643L1310I7142N8738
18418A55880g3211A38612g7831E2588K3978c0607J1617A96910E5563c88325I0366
18406B00170d32540J26547i9300k16601d7427j98073A5588O4732d28765G0433
18395a48770f7017k86287C02479a39072A74400J71061A47648F6365j9044c38830
18384B73070F226g1599A16410b37388B04165a73787L3363I0544a25010M3904k46426
18373c27532J57687A2865c56157A52670G2258B6335b5860q103I5249a50056j35873
18362b85929J24560b3215B9201K41316H2276J15707f1575B86309a2972F7768A5865
18350a88820P8272I9986e5101k22219C75225A82826N7856o1246a06063J6136B89808
$$ plain form
18429 115604 167874 194194 -48695 -59014 -24042 25259 123055 -149643 -118333 97142 155880
18418 155880 -73211 138612 -77831 52588 76566 -30607 -18990 196910 55563 -388325 90366
18406 200170 -432540 -305993 -99300 -315901 -47427 -245500 15588 80320 -428765 70433
18395 -148770 -67017 -353304 302479 -139072 174400 345461 147648 66365 47321 -338830
18384 273070 6226 -71599 116410 -237388 204165 -173787 -140424 90544 -125010 -81106 -327532
18373 -327532 -169845 12865 -356157 152670 72258 26335 -25860 -33963 95249 -150056 -285929
18362 -285929 -161369 -23215 29201 270517 82276 197983 -61575 286309 -12972 67768 15865
18350 -188820 -110548 99986 -55101 -277320 375225 182826 240682 179436 -106063 -89927 289808
18338a19768E1082a02E382a9848j03793I6930c04627E3451c32839d0521a5359
18326a02672j60334h314j95713a4373j39105P6574e951m61505i9391r3941B64570
18314B8070a89452d6561n9078B0509R1472a8226E9879i2446C5053d3378k41448
18303b84826G7556g3376o3823q7811Q7247c0834A4592d57078E1854N0956e3468
18291A1071i3777B0599b84452e8028M153j04757k1462j4009f9839j13331k5668
18280b08838Q0870L6032l97126a53602d1864j25600B5054J67595q4243d31844
18269B28632c21894b5111j4473j36724F9550c4369C750a43385F5132B121J71789
18258A73910e9757b7090C43294f8676j54221J07200A34727p706a07461D68051
$$ plain form
18338 -119768 51082 -102 5382 -19848 -123641 96930 -304627 53451 -332839 -40521 -15359
18326 -102672 -263006 -8314 -204027 -14373 -153478 -76904 -5951 -467456 -99391 -193332 264570
18314 28070 -189452 -46561 -105639 20509 111981 -18226 59879 -92446 35053 -43378 -284826
18303 -284826 77556 -73376 -137199 -225010 -137763 -30834 14592 -457078 51854 102810 -53468
18291 11071 -93777 20599 -284452 -58028 -53875 -158632 -180094 -194103 -69839 -183170 -208838
18280 -208838 -127968 -91936 -489062 -153602 -41864 -167464 25054 192649 108406 -431844
18269 228632 -321894 -25111 -39584 -176308 69550 -34369 3750 -143385 65132 2121 173910
18258 173910 -59757 -27090 343294 -68676 -222897 -115697 134727 127021 -107461 468051
18247E4689b04435j82430A87184b71861P2780C84793A29712H834J42139c27606
18236a09307K5050j58275L2210a4618B909a78193D8014h6152h58k14083R3839
18225a21102b7343l84356J20619C10239b15623r7283A22914e8345B841L9483b74866
18213B91525a28167J9931k20673D323R6147C0772a45918c4496k40960a29677B96915
18201E7930K32199a16940C56873A19133E619J02293L003b35123P1453b003k24031
18190b26034b9770I268M6858b18030r2048J02124L7501E0707R8869J61340b84049
18178D9241a78229Q0681d4551F2976a95489e106p1016j7103o7436A02368b3903
18166B8030K18764A20822b2068P121l4148C2826L2412a8312H7692a59214A71219
$$ plain form
18247 54689 -204435 -386865 187184 -271861 -199081 384793 129712 8834 150973 -327606
18236 -109307 -84257 -242532 -210322 -14618 2909 -178193 48014 -86152 -858 -214941 -121102
18225 -121102 -27343 -411699 -291080 310239 -215623 -312906 122914 -58345 2841 42324 -274866
18213 291525 -128167 -108236 -328909 4323 100470 30772 -145918 -34496 -275456 -129677 296915
18201 57930 290129 -116940 356873 119133 5619 107912 110915 -235123 -163670 -2003 -226034
18190 -226034 -29770 9268 56126 -218030 -310078 -207954 -170453 50707 149576 310916 -284049
18178 49241 -178229 -97548 -44551 62976 -195489 -5106 -76122 -93225 -160661 102368 -23903
18166 28030 246794 120822 -22068 -14947 -49095 32826 65238 -18312 87692 -159214 171219
18154g8369A33257I027a85684g4488D781b00506N2900H7287P262j4460g8795F3026
18141A11113B9768c7786k35636e1685j5345j59754p885C6874P8874J23645a93532
18129d1398j77877h2676E75986A20397Q9843c733k53276I0375a48538G2862a86894
18117A27663a30383o667r8625B3287O4821f0931C0937J12225J2750F4689c05736
18105c07048c9023C8207A1936a68247B45411c43962J16634C06576E8667c03448
18094a16359j78813N1081A82373F0392c56581a74159G4769a30326A01845b57901
18083a43523e0307A46825D1641j1354f3890k52421N2718H0480R134B459K4111
18072B6570i0119A18920a58923B6000e20705g8831E7209a91132B06648b14781
$$ plain form
18154 -78369 133257 9027 -185684 -74488 4781 -200506 -147606 87287 94549 80089 -78795 63026
18141 111113 29768 -37786 -273422 -51685 -67030 -226784 -234669 36874 115748 239393 -193532
18129 -41398 -219275 -82676 575986 120397 210240 -3733 -257009 90375 -148538 72862 -186894
18117 127663 -130383 -137050 -235675 23287 88108 -60931 30937 143162 155912 64689 -305736
18105 -307048 -39023 38207 11936 -168247 245411 -343962 -227328 306576 58667 -303448
18094 -116359 -295172 -244091 182373 60392 -356581 -174159 74769 -130326 101845 -257901
18083 -143523 -50307 146825 41641 30287 -63890 -316311 -263593 80480 89614 2459 26570
18072 26570 -90119 118920 -158923 26000 -520705 -78831 57209 -191132 206648 -214781
18061A53830b10323D0985q753g4596B6637J41971b14610N067e8433k0321B11755
18049D8478G337K47124A3931N9961A7018b16644g760D67981a19555B34572A8396
18037a10178A32791l4439a38002r8620B01724q4833k3213e0652k45816F0438c8926
18025a70036g2391C46462G0395c90924a43691K1012L2300C56636D1345N9749a17026
18013a62659G2942d2574j23238c8874r0493j33749j05777B03231P1945c78257
18002a10713b0941f522k27237A53735i3566j79748f6104G7790c5031q8882L1954
17991i1959A99761a77557J8499A1783b47752A34036b888o9223o365H4552c10673
17979h1757o1994j47580b3463F4362d6991m05212A64065c76893H4899r575h5692
$$ plain form
18061 153830 -210323 40985 32232 -74596 26637 168608 -214610 -209543 -58433 -78754 211755
18049 48478 7337 254461 13931 73892 17018 -216644 -7760 467981 -119555 234572 18396
18037 -110178 132791 98352 -138002 -236622 201724 116891 93678 -50652 -296468 60438 -38926
18025 -170036 -72391 346462 70395 -390924 -143691 -122679 -90379 356636 41345 101094 -117026
18013 -162659 72942 -42574 -165812 -38874 -129367 -263116 -368893 203231 275176 -378257
18002 -110713 -20941 -6522 -233759 153735 -93566 -273314 -66104 77790 -35031 -123913 -91959
17991 -91959 199761 -177557 -159058 11783 -247752 134036 -2888 -72111 -78476 84552 -310673
17979 -81757 -143751 -291331 -23463 64362 -46991 -452203 164065 -376893 84899 75324 -85692
17967a34291b5614k87237A00182o540C6774b29510C25024f2200A27466J29582
17957B57048F375L2116b07727A81493c62572i3646k30361H0166K6281b63583H2610
17945B05213a8850j73908A02516f8075A55899l3907N0112a55746G3671a27599
17934F6597K10005J485G2380G381e8369j77911B08212I2479G185i0652L7286A17718
17921a0811C72577c6432H5724G643c2595l73696J70270E0466c7777A21447A1231
17909B99784n2181d72468a50534j7794E4837J97337F1144j8207a91220B80710
17898F1053K26425a66251q5638N2152j50516C29250j49387f0431D9343J23679
17888A73022a38168j90142G7505h8961j38164P6804A52102a00104Q872G3050K21594
$$ plain form
17967 -134291 -25614 -312851 100182 93642 36774 -229510 325024 -62200 127466 257048
17957 257048 6375 38491 -207727 181493 -362572 -93646 -324007 80166 106447 -263583 82610
17945 205213 -18850 -192758 102516 -68075 155899 121992 172104 -155746 73671 -127599
17934 66597 276602 278087 72380 7381 -58369 -236280 208212 92479 7185 -90652 -53366 117718
17921 -10811 372577 -36432 85724 7643 -32595 -406291 -236021 50466 -37777 121447 11231
17909 299784 247603 -472468 -150534 -168328 54837 252174 61144 42937 -191220 280710
17898 61053 287478 -166251 -251889 -199737 -350253 329250 179863 -60431 49343 173022
17888 173022 -138168 -328310 77505 -88961 -227125 -150321 152102 -100104 -91232 73050 294644
17877B94644a79292g6765I190a86174j02476d9426B11962a91369R5493H3354K41040
17866C24394I7457J597d9666B58451e5532j3152A87301b95889J13261A83488M343
17855A87831a03078j66441A17874d67405A16616R0164b37691a08939L8519j9714
17845i0134p4694B31372M3430j32000b09100P6255d0984j88209A93776e3970o1750
17834a15720F7570h2861R248B89893A19668a34204D041a30276b9680E1517J94766
17823B46283a45997d1594f544G8069c21467p7793G9380a26205O3098n5801j26588
17812b45496G9426f9139A58791g8422H7220b4841A39974F5100c60143c3899A61177
17800h6029q5435A47096l6688m3269c59642a7389A24395e9834G6149J87179e1112
$$ plain form
17877 294644 -179292 -76765 9190 -186174 -288650 -49426 211962 -191369 -95876 83354 324394
17866 324394 97457 99054 -49666 258451 -55532 -68684 187301 -295889 -182628 183488 187831
17855 187831 -103078 -269519 117874 -467405 116616 206780 -237691 -108939 -70420 -90134
17845 -90134 -164828 231372 274802 142802 -209100 -132845 -40984 -229193 193776 -53970 -115720
17834 -115720 67570 -82861 -73613 289893 119668 -134204 4041 -130276 -29680 51517 246283
17823 246283 -145997 -41594 -6544 78069 -321467 -399260 79380 -126205 -63107 -118908 -245496
17812 -245496 79426 -69139 158791 -78422 87220 -24841 139974 65100 -360143 -33899 161177
17800 -86029 -171464 147096 110408 67139 -359642 -17389 124395 -59834 76149 263328 -51112
17788d59280B97340a29805C20038j45277j9945A443a0404A76545b83356J00489
17778a82867j12239a11215B4273L3216B2291b00944E8031K6884a1790F0022a67319
17766D6390I967b00859B22902b44787d130k24902M5354A83607o7112a85594C2831
17754C30349q1024a29357k8352C37493i0866j32257L8099A11197b17002h147A56200
17742D360a76890j07607R1447C12343g7988j42237j5682B29646b30122B44086
17731b27057A50547a52086B39670a64782O2379I2204a6721j46648N6724A06855
17720b62095C9987a88268B05624a27910B49928c24602D2140J79O1551h6922p7271
17709a64193h1826k9805A7483a29878N218A72233b44307a00874L8191B44251r0138
$$ plain form
17788 -459280 297340 -129805 320038 174761 154816 1443 -10404 176545 -283356 -182867
17778 -182867 -295106 -111215 24273 57489 22291 -200944 58031 84915 -11790 60022 -167319
17766 46390 9967 -200859 222902 -244787 -4130 -229032 -183678 183607 116495 -185594 32831
17754 330349 249325 -129357 -157709 337493 -90866 -223123 -185024 111197 -217002 -8147 156200
17742 4360 -176890 -284497 -193050 312343 -77988 -220225 -235907 229646 -230122 244086
17731 -227057 150547 -152086 239670 -164782 -102403 92204 -16721 -163369 -106645 106855
17720 -262095 39987 -188268 205624 -127910 249928 -324602 42140 42319 103870 -86922 -164193
17709 -164193 -81826 -111631 17483 -129878 -124660 172233 -244307 -100874 -62683 244251 154113
17698A54113b17538B33665a65183e3812E3989d24065a6925l8039n2529A16744
17687b09635B42420a06258a2195j50093k5787B01438a31430e5371r2528b5349
17676A21988A635J46323a18852N2635j65221D4467i1247j16249A11323Q6230E5608
17664A11044d61541B06874a32104A31735a4355F0870K56215a02321D51198A82764
17653c5394M013j05847C16683A01260N6183C1078K04290a07204B05197N7057J16506
17642C78760l9939H6651a59842M9440B70244K58732a37290B22630f2858A9491
17631C07678i5627C04857j46074L18320A55100b52747B54461a01396d1459A21887
17620B88318a61392g4562l8420B05260a12250C2375a36513K1429C00777h5657
$$ plain form
17698 154113 -217538 233665 -165183 -53812 53989 -424065 -16925 -54964 -107493 116744
17687 -209635 242420 -106258 -12195 -162288 -188075 201438 -131430 -55371 -147899 -25349
17676 121988 1635 147958 -118852 -66217 -231438 44467 -91247 -207496 111323 197553 55608
17664 111044 -461541 206874 -132104 131735 -14355 60870 317085 -102321 451198 182764
17653 -35394 -31381 -137228 316683 101260 157443 31078 235368 -107204 205197 262254 378760
17642 378760 338821 86651 -159842 -110402 270244 528976 -137290 222630 -62858 19491
17631 307678 -95627 304857 158783 477103 155100 -252747 254461 -101396 -41459 121887
17620 288318 -161392 -74562 -112982 205260 -112250 32375 -136513 -115084 300777 -85657
17609a49237A34011n9263c10263c6059k07522M6446A85394q1573B8210b9869m9413
17598g9282a8102E9606J40812b91460F1878Q9195B6751N1994e4156A32288J80076
17587C12364I6382e6212A99666a40730L3221B66043J3092j37991M2823i4561I466
17575A00080L06932k2229a55121F5504J85496g9960A52350e5063A51815b06835
17564C28806N4541b10726i8331B52469D4238c57953A61852R047a53075b6966m9128
17553g6094A12128f7513C2613j5173C348O6114N1273l4969i7309L1939C14864
17541D58767g479C06324q3001r5421D1295J257K7161a00504F206N60731C8016
17529A71182g2396I4706l320k3455J42162i4161A16026a16665j39900A48902a02387
$$ plain form
17609 -149237 134011 74748 -310263 -36059 -243581 -197135 185394 103821 28210 -29869 -79282
17598 -79282 -18102 59606 200418 -291460 61878 151073 26751 78745 -54156 132288 312364
17587 312364 96382 -56212 199666 -140730 -107509 266043 279135 141144 183967 -94561 9466
17575 100080 407012 384783 -155121 65504 251000 -79960 152350 -55063 151815 -206835
17564 328806 383347 -210726 -98331 252469 44238 -357953 161852 170899 -153075 -26966 -76094
17553 -76094 112128 -67513 32613 17440 3348 69462 120735 85766 -97309 -65370 314864
17541 458767 -7479 306324 223323 127902 41295 42552 69713 -100504 6206 566937 38016
17529 171182 -72396 94706 91386 67931 210093 -94161 116026 -116665 -256565 148902 -102387
17517a54694a5826A57195b9119G7660l5586J97697j07733L3862m5034o0181h9079
17505f6664A75210a56423J2922o5466A72953k895E9600R3174k6460b46697p050
17494b53747C5599F561a00670A29774J63886c8246n2046F963J10491b4124D9778
17482G6492J87164J79992A01172N3921E8377K75861b12180d4598B82301D4325
17471H9761g7875A04769e3772I6415D352J411N9518L5323J34622D9126J85716
17460B34842g1007k0939j72328G4748j5758J51075K03221J15533A31392f4520
17449B35400j07615N0598N067J11316a9647A09540J27138q1369N0948J55675J43693
17438E05625j61700q1519J1132d9045F07258j80313A73645K43703O5177k41194
$$ plain form
17517 -154694 -15826 157195 -29119 77660 42074 239771 132038 165900 120866 60685 -89079
17505 -66664 175210 -156423 -143501 -208967 172953 170058 59600 152774 126314 -246697 -253747
17494 -253747 35599 6561 -100670 129774 293660 -38246 -90292 6963 117454 -24124 49778
17482 76492 263656 443648 101172 155093 58377 334238 -212180 -44598 282301 44325
17471 89761 -77875 104769 -53772 96415 4352 5763 65281 100604 235226 49126 234842
17460 234842 -71007 -91946 -264274 74748 58990 210065 413286 528819 131392 -64520
17449 235400 127785 178383 183450 294766 -19647 109540 236678 155309 206257 361932 505625
17438 505625 343925 262406 273538 -49045 607258 426945 173645 417348 482525 241331
17428B41331J40869A62849J24509a42290C17513J35318A88198K70404A48111M159
17418A52270K00136n3743J78302j64551A05013K41860A13200L41324A44265d0212
17407B15814J63710g6937B33234a63777A27359R2970A0743f635L136A70183K3608
17396A93791b8210H6000O0174D9614M35193j50741A01168L0474O9969F3051P1374
17385A34425L09319F1499K42398c6287B70094d59B01653a04397A03645F043c0536
17373C36906j64805J51127l8651a3579B69392a71023E65537a13489A36034K03762
17363C39796A18280J12496O968N8396A16819B4208L71196i6650A78371G7624b9998
17351B11408I3638a86740d945A06560L68513A39821c3286I6059J98067j33537
$$ plain form
17428 241331 382200 162849 287358 -142290 317513 452831 188198 458602 148111 152270
17418 152270 352406 298663 476965 312414 105013 346873 113200 454524 144265 -40212
17407 215814 379524 -76937 233234 -163777 127359 220329 10743 -6635 -3499 170183 193791
17396 193791 -28210 86000 146174 49614 484807 334066 101168 131642 201611 63051 134425
17385 134425 443744 61499 303897 -36287 270094 -459 201653 -104397 103645 6043 -30536
17373 336906 172101 323228 284577 -13579 269392 -171023 565537 -113489 136034 339796
17363 339796 118280 230776 237744 296140 116819 24208 395404 -96650 178371 77624 -29998
17351 211408 93638 -186740 -4945 106560 475073 139821 -33286 96059 294126 160589
17341A60589J24622Q4322m2521A52576L05912B3510a0125A73405J53994a41703
17330A97267a22449A67002j610b50I6061Q4713a3611G2438J14273c1532G7958
17318G0328L07087I7563a59573f0263j78122C98898j01876a11984q4556D855K44453
17307B49308C1173L78044F9327o276d5065D21934j34907o4830a89928D04986j76659
17296B28327N1724A30301Q0525G0271K24238j43321L27497j92588k9728C9390
17285C05648f4734A21434E0754r020b5183I9470K17611Q1620A27313K66698A75277
17273A63527a17137A85223l2019J63462F0974K53270h9638B967b80311D39901
17262c1201B05576J8297K05660a03316c3439r2520B07296l5301L37554a06109
$$ plain form
17341 160589 285211 369533 327012 152576 458488 23510 -10125 173405 327399 -141703
17330 197267 -122449 167002 165392 -250 96061 180774 -13611 72438 186711 -31532 77958
17318 70328 377415 97563 -159573 -60263 -238385 398898 297022 -111984 -196540 4855 249308
17307 249308 31173 409217 69327 63051 -45065 421934 287027 222197 -189928 404986 228327
17296 228327 280051 130301 210826 70271 294509 151188 478685 286097 256369 39390
17285 305648 -64734 121434 50754 41734 -25183 99470 317081 398701 127313 394011 175277
17273 163527 -117137 185223 153204 316666 60974 314244 -89638 2967 -280311 439901
17262 -31201 205576 223873 429533 -103316 -33439 -125959 207296 171995 509549 -106109
17251B1383L47346A28036j236J71452H6438E091L88927Q8645B41122K06578H3406
17239h4533C21564K04430B17301l6977J18969K80524A75617K15279a6746E62941
17228g6468C30709j57403l4153J73004l7995C7108L44265L6862A47859a89428
17217D45919a7836F3586N1392L01892A05649P2924F2271J45602F0040N0172P3864
17206A84076Q4914j14851L08149Q196f8149B44339L2720M7258K07965A75367j8022
17195A57345R3625J58009l1396j5655A58672L28009I6320J32140J32495h4684
17184B55197l5679l4779J0327k2326f464A62990K37139r8174j05778a429B50774
17172C16702I8068Q5795k9288K89627j22447N7009J03174k04073l3090J84331
$$ plain form
17251 21383 368729 128036 126800 298252 86438 5091 394018 482663 241122 447700 83406
17239 -84533 321564 525994 217301 180324 299293 579817 175617 390896 -16746 562941
17228 -76468 330709 173306 139153 312157 274162 37108 381373 418235 147859 -189428
17217 445919 -17836 63586 114978 416870 105649 178573 62271 207873 60040 110212 184076
17206 184076 268990 154139 462288 470484 -68149 244339 277059 324317 532282 175367 157345
17195 157345 250970 408979 377583 361928 158672 486681 96320 228460 360955 -84684
17184 255197 219518 184739 195066 172740 -6464 162990 400129 301955 196177 -1429 250774
17172 316702 98068 183863 154575 444202 321755 378764 481938 277865 244775 429106
17162D29106o6904j31922r3374a9169D86855j06957j89719P5040J64298q6397
17152C43120o7252J45626n8799E4741J60806J83999m3776R4914C5812M43395L8911
17141E18118j16843A88166J10316P476b3509A19741E6657K04742J62687l4230
17131C89856J28882B50226D0873d1466D98456A99414J54207j02745q7067K3183
17121A86992p5581N84350A17757L16640r2471j699L98412j3371A69718L44313
17111E14031B02600J859F9901M30352J53632B92938F2789N28987k60243K09272
17101E40805m7448m1297j7479P796J97615k65620A18143O40347l26937j19412
17091C12141Q8269r133m663J00229K09441B23377K13300K49110J28591A76055
$$ plain form
17162 429106 362202 230280 136906 -19169 486855 379898 190179 265219 429517 343120
17152 343120 275868 421494 362695 54741 215547 399546 355770 450684 35812 479207 518118
17141 518118 401275 188166 298482 305958 -23509 119741 56657 261399 424086 389856
17131 389856 518738 250226 40873 -41466 498456 199414 353621 250876 163809 186992
17121 186992 111411 695761 117757 434397 341926 340227 738639 725268 169718 514031
17111 514031 202600 204459 69901 500253 653885 292938 62789 591776 331533 540805
17101 540805 493357 452060 434581 442377 639992 374372 118143 758490 431553 312141
17091 312141 400410 391277 386614 486843 696284 223377 436677 685787 814378 176055
17080E54770D3742M29384n1885J03102j84718p309P0083l457j53070L00826R3623
17069F40321B56230J23035E4690K09109J81480j98467J74282M4454P1211j07329
17059D29430K10276j07575J44946C36198J25614L5772k6274J58445j39039L17023
17049H07739j39779e7068C95016J29215J1813J78581p6816j06923k58739J84202
17039D56349J49896l1184j08049q4356J56761B54197K18667n8089j51951N27340
17029G90164j07905j00444j32055A69939M86389k26867K48189r8739L0155j30553
17019D78513Q2876K33852m5008P1686L4790k19614J29556j12310j77383Q6927
17009E63885j19596M71190m48642L68903k18904J68395k88259K83441B88124L43839
$$ plain form
17080 554770 43742 473126 421241 524343 339625 332316 402399 398942 245872 546698 640321
17069 640321 256230 379265 54690 263799 445279 246812 421094 465548 536759 429430
17059 429430 639706 532131 677077 336198 461812 497584 471310 629755 490716 807739
17049 807739 667960 -57068 395016 524231 536044 714625 637809 530886 272147 456349
17039 456349 606245 575061 467012 382656 539417 254197 472864 414775 262824 790164
17029 790164 682259 581815 449760 169939 656328 429461 677650 578911 609066 478513
17019 478513 561389 795241 750233 821919 856709 637095 766651 654341 476958 563885
17009 563885 444289 915479 466837 835740 616836 785231 496972 780413 288124 631963
16999F31963K0049K185j67109J90151N8291j2633K6424Q1964j37105J11881m289
16988H01772m5427k07971L85809P5037J35985E27659N02405q2699m73485P81119
16978A254999k47446k01983j07980K13783n6062L70225n04165L2960L30591N6018
16968A140940k79820J01038k56890L0006K70206K092j89643K78756l43672M04908
16958A157921j22798J85580J60170j50310J52187k22058j9035k85286L10849n3824
16948A113396j42073K83172j9855m38287L61989L9830n3467k41006J0969K2813
16938I37481L89831k68j30579P4365Q386N198R7106M8563j09369J4111j6350L4267
16926A352742J90623k68997O938l4493J1828j9833J77968j48308j0929K43930
$$ plain form
16999 631963 652012 654197 487088 677239 735530 722897 749321 831285 694180 806061 801772
16988 801772 756345 548374 934183 1009220 1145205 527659 1030064 947365 473880 1254999
16978 1254999 1007553 805570 697590 911373 855311 1225536 721371 754331 1084922 1140940
16968 1140940 861120 962158 705268 735274 1005480 1007572 817929 1096685 753013 1157921
16958 1157921 1035123 1220703 1380873 1230563 1382750 1160692 1141657 856371 1167220 1113396
16948 1113396 971323 1254495 1234640 796353 1158342 1198172 1144705 903699 914668 937481
16938 937481 1327312 1327044 1196465 1270830 1279216 1284414 1381520 1430083 1320714 1334825 1318475 1352742
16926 1352742 1543365 1274368 1281306 1246813 1258641 1238808 1416776 1268468 1257539 1501469
16916A501469j18082K55855j97331n4907K43756J34013q4712k94523o4895N9769
16906A380412N66348k21261o67105O03479J12086K631K36425j58095k4811J88750
16896B018859m34945K96015R7455k89063N61217m66790J21024j45565M10913j52060
16886B017060J52154m5320j19422L13460j92679j86060L71032j27006J82832j23110
16876B242941K55156j44596J12709k6371l5834K63389l5534j69865j69202L11322
16866B604115j02664L41975l59266M30137p0050o5116o2887J34467K40076l9041
16856C051746j01632m8200J75167J35526L02943n64995J80434L49135k75843L28558
16846C532839P3934r2887j12131J99953L7159J59573J94927P4431J81900k37815
$$ plain form
16916 1501469 1383387 1639242 1441911 1387004 1630760 1764773 1680061 1385538 1320643 1380412
16906 1380412 1946760 1725499 1058394 1661873 1773959 1776590 2013015 1854920 1830109 2018859
16896 2018859 1583914 1879929 1977384 1688321 2249538 1782748 1903772 1758207 2169120 2017060
16886 2017060 2169214 2123894 2004472 2317932 2125253 1939193 2310225 2183219 2366051 2242941
16876 2242941 2498097 2353501 2466210 2439839 2404005 2667394 2631860 2461995 2292793 2604115
16866 2604115 2501451 2843426 2484160 2914297 2844247 2779131 2716244 2850711 3090787 3051746
16856 3051746 2950114 2901914 3077081 3212607 3515550 2950555 3130989 3480124 3204281 3532839
16846 3532839 3606773 3513886 3401755 3601708 3638867 3798440 3993367 4067798 4249698 4011883
16836D011883L71063k33759J66006k6867K88789j36233J05400q7154L96857o7994
16826D787991K78737m5664k1718l16593M63482L24059j41638m8061K34723J54827
16816E670145M2521N9702K40174q3997K95481j45762M63163L73992m54152K92499
16806F753766L60364L41855J33475P7362j03556M05323K48778M6741N80151J53832
16796H998091m4665L94797j12584L38376M96237j6887K06092L02356M41286M07141
16786A1410240N9089N67202j69925k9952J082402K15157L66472M87959M72922
16777A4461566N92340N0443N03447O18697M58662N97894M47655O06347P94638
16768A9131689N06228J122817M97099M40667J091362N94329J029115P60035J328090
$$ plain form
16836 4011883 4382946 4149187 4315193 4288326 4577115 4440882 4546282 4459128 4855985 4787991
16826 4787991 5066728 5021064 4999346 4682753 5146235 5470294 5328656 5280595 5515318 5670145
16816 5670145 5712666 5772368 6012542 5928545 6224026 6078264 6541427 6915419 6461267 6753766
16806 6753766 7114130 7455985 7589460 7666822 7563266 7968589 8217367 8264108 8844259 8998091
16796 8998091 8953426 9348223 9235639 9574015 10070252 10053365 10259457 10561813 11003099 11410240
16786 11410240 11469329 12036531 11866606 11836654 12919056 13134213 13500685 13988644 14461566
16777 14461566 15053906 15104349 15607796 16226493 16685155 17283049 17730704 18337051 19131689
16768 19131689 19637917 20760734 21257833 21698500 22789862 23384191 24413306 25173341 26501431
16759B6501431M83852J489007J334314J272149J267836J540882J469507J731026
16751C7090004J601865J925413J887884J920793K481407K624783K702949K300842
16743E4535940K835610L090054L403877L155760M133639M282843M232348M227312
16735H3897383M995383M907926N633660N798867N647142N948336O721876O862041
16727A30412614O433006O602689O448038O669388O083317N567833M856686M130366
16719A77203937L434230J605571J510209j91894j117993k179172l262021l864950
16711A73137917m979725n628870o083985o611264o149362o661037o944614o866248
16703A23212812o722138o104793n997521n676224n695269m747997n027706m559836
$$ plain form
16759 26501431 26985283 28474290 29808604 31080753 32348589 33889471 35358978 37090004
16751 37090004 38691869 40617282 42505166 44425959 46907366 49532149 52235098 54535940
16743 54535940 57371550 60461604 63865481 67021241 71154880 75437723 79670071 83897383
16735 83897383 88892766 93800692 99434352 105233219 110880361 116828697 123550573 130412614
16727 130412614 136845620 143448309 149896347 156565735 162649052 168216885 173073571 177203937
16719 177203937 180638167 182243738 183753947 183562053 182444060 180264888 177002867 173137917
16711 173137917 168158192 162529322 156445337 149834073 143684711 137023674 130079060 123212812
16703 123212812 116490674 110385881 104388360 98712136 93016867 88268870 83241164 78681328
16695G8681328m456101l914446l875865l704192l158256l024816l041046k798701
16687E0707905k054040k943659j998697k134051j654662k012490j440036j816364
16679C4653906j663791j147457j692011j045244j508417o29853j163749j434814
16671B4368570l96685q47753j103253o03938p34543r78236n75874p66673r86957
16662A7374658P8117q53083p27567n24970l92799k70589o21732o64936k84809
16653A3112290j33453n01438l88045m39622j31528n20770j35763l71067n77264
16644I913340j8871r40042M41397j78527m83971j0360k79295j86140n94676j25677
16634G537178K62217m17197Q1902M4462l94251r3749n68436k0913m63540L64987
$$ plain form
16695 78681328 74225227 70310781 66434916 62730724 59572468 56547652 53506606 50707905
16687 50707905 48653865 45710206 43711509 41577458 39922796 37910306 36470270 34653906
16679 34653906 32990115 31842658 30150647 29105403 27596986 26967133 25803384 24368570
16671 24368570 23971885 23124132 22020879 21416941 20682398 19704162 19128288 18361615 17374658
16662 17374658 17452775 16599692 15872125 15347155 14954356 14683767 14062035 13397099 13112290
16653 13112290 12978837 12477399 12089354 11649732 11518204 10997434 10861671 10490604 9913340
16644 9913340 9894469 8954427 9395824 9217297 8733326 8722966 8443671 8257531 7662855 7537178
16634 7537178 7799395 7382198 7464100 7508562 7114311 7020562 6452126 6431213 5967673 6332660
16624F332660m61442l1543k01412k26611o1539m35k44345J60250l73961J61070
16614E052692j49525m34882L50281n83149J29509R5544R924j43915l36707L59983
16604D349755k52562l88546K47111o2438k79346J08622m14842M32327k23046k06181
16594C310854K57557k72333m4698j8006o4025J00957j82959p6126J13802n33787
16584B591236N70576l22251l05046J15537L02869k86894k01909K16750l39831
16575B341037K89634k23618P5306j48321j59065L61075j79877q26l08793O9794
16565B116346M4475o37j75951J8478K32392k41165m6219Q657L81236m67789J23825
16554A993648P5007j14716j52721J20790L18135m81392j24298K44378Q2278m47785
$$ plain form
16624 6332660 5871218 5839675 5638263 5411652 5350113 5349678 5105333 5265583 4891622 5052692
16614 5052692 4903167 4468285 4818566 4235417 4364926 4460470 4470394 4326479 3989772 4349755
16604 4349755 4097193 3708647 3955758 3893320 3613974 3722596 3307754 3740081 3517035 3310854
16594 3310854 3568411 3296078 3251380 3233374 3169349 3270306 3087347 3011221 3125023 2591236
16584 2591236 3161812 2839561 2534515 2650052 2952921 2666027 2464118 2680868 2341037
16575 2341037 2630671 2407053 2482359 2334038 2174973 2536048 2356171 2355345 2046552 2116346
16565 2116346 2160821 2160184 1984233 2002711 2235103 1993938 1947719 1956376 2337612 1869823 1993648
16554 1993648 2068655 1953939 1801218 1922008 2240143 1758751 1634453 1878831 1961109 1513324
16544A513324q0136J61158j36507R1239j97201L20199j81999k8243J33411k99268
16534A295977M0501q0420P0047J15621k32548K05487j45608k70461M07385k9954
16524A376027K4456O3824j35632o1387J55618p7180j37347k7825r1159O3860l8930
16513A114325K29280R3258r964l80009N7135k51567J35621J40843l8201J01684
16503A192405p0011j11431K59800N9189j70946k90749m3316J54620j22534J64923
16493A021950k38576Q5602L74469l22268j04424L01926Q1110r1938l34122K66513
16483A040242l06857J47612D23619O82813n4340J05259j75812J22729D08845M59615
16473H68460j93468K8038O5030J24232k53610n2270p0450O91088n87665j89588
$$ plain form
16544 1513324 1433188 1594346 1457839 1549078 1351877 1672076 1490077 1461834 1595245 1295977
16534 1295977 1336478 1256058 1326105 1441726 1209178 1414665 1269057 998596 1405981 1376027
16524 1376027 1400483 1464307 1328675 1267288 1422906 1345726 1208379 1180554 1089395 1153255 1114325
16513 1114325 1343605 1436863 1426899 1046890 1104025 852458 988079 1128922 1090721 1192405
16503 1192405 1122394 1010963 1270763 1329952 1159006 868257 824941 979561 857027 1021950
16493 1021950 783374 868976 1243445 921177 816753 1118679 1199789 1107851 773729 1040242
16483 1040242 733385 880997 423619 1106432 1052092 1157351 981539 1104268 408845 868460
16473 868460 674992 703030 768060 892292 638682 586412 515962 1207050 619385 429797
16463D29797L75154L40799D48669K39596N2865m2041K11520O1581j89928j14850
16453F67412l19691J97136J22487N7882N9583O4340p740l54808J85631n4546J7131
16442F34817L7437l04560L73804L03250B01728M95951J4383k77884K73130k71558
16432D35750l310K32279j28873k52050K78311j34111j05588J64034K25138j93168
16422E18412m3823K48925o1248J49942l69299j64118J75705K71699B12789L2439
16412B45228N62723P8664l97385M1579J77822f8683K9174B72832K54857q4099
16402D43590N9333I3380M95316j02644B31917K04030e7002C92921m6332n5374
16392B91215J87766e0904D56452Q2791j82358J87856o4346j41163N2592l8382
$$ plain form
16463 429797 804951 1145750 448669 688265 741130 699089 910609 972190 782262 667412
16453 667412 347721 544857 667344 725226 784809 849149 841409 486601 672232 617686 634817
16442 634817 672254 367694 741498 1044748 201728 697679 712062 434178 707308 435750
16432 435750 432440 664719 535846 283796 562107 427996 322408 486442 711580 518412
16422 518412 474589 723514 662266 812208 442909 278791 454496 726195 212789 245228
16412 245228 807951 886615 489230 530809 708631 -68683 -39509 272832 527689 443590
16402 443590 502923 93380 588696 486052 231917 435947 -57002 392921 346589 291215
16392 291215 478981 -50904 456452 539243 356885 544741 480395 339232 391824 353442
16382C53442R1734J74315C03351K17906M9506A31588J33668L54980j66813J4271
16372D67694j28204A67382i900G0153M46874B17300J19402J21254j81835l5247
16362B40874j1842J56893c3166A09012D3254K80894q9813l372K71137A47887J91147
16351C39034E6820M40466A72861J07219A28142J83728o7619J50887A54255N7766
16341B12021J5545N7322E1931M90347j52913A62917J54738l4500P5221K8649l1597
16330C55428A35937J63060N1261H1941L78730i4990B40698j5307K74526k29841
16320B70076F1715K19362K6904M8394K34383k06171j83214a32421A68074K71198
16310D39272m7142k6920L4070m2526J01579j51508j11664k6354n597L09357j59780
$$ plain form
16382 353442 445176 619491 303351 521257 570763 131588 265256 620236 453423 467694
16372 467694 339490 167382 -9900 70153 517027 217300 336702 457956 276121 240874
16362 240874 229032 385925 -33166 109012 43254 324148 234335 230963 502100 147887 339034
16351 339034 56820 497286 172861 280080 128142 311870 244251 395138 154255 212021
16341 212021 227566 284888 51931 542278 389365 162917 317655 283155 358376 387025 355428
16330 355428 135937 298997 350258 81941 460671 -94990 240698 225391 499917 270076
16320 270076 61715 281077 307981 356375 590758 384587 201373 -132421 168074 439272
16310 439272 392130 365210 399280 356754 458333 306825 195161 168807 163210 472567 312787
16299C12787H9749m3336K06395J70935j99664J25719A59542K84877k4070B09784
16288C16608C889J63341r518K48062A37203a8783A66113m7484J19652a9980B2370
16276C3135f1656B84044r6784R472J4435E1924a30186d8810j4632a5563B29668
16264B03486c49453J05820A19601L2462J4485D0296K36317A23342J28254K31479
16254D83075A83691J38621A11716O2255a25394b7718A33250K2359d7670j0688
16244e8358D48120p5816F1608a12727I221J75769j0182E4284J39561G9174K12507
16233B91681J9591j25748b65506E4453a91256A98286R7126b69621H011i5154A64614
16221G1379J96277e866A23096C9405J7581B4945L28606D4402b82972a14409A86939
$$ plain form
16299 312787 89749 46413 252808 423743 224079 349798 159542 444419 420349 209784
16288 316608 3889 167230 157712 405774 137203 -18783 166113 118629 238281 -19980 22370
16276 33135 -61656 284044 187260 196732 211167 51924 -130186 -48810 -63442 -15563 229668
16264 203486 -349453 -243633 119601 152063 166548 40296 276613 123342 251596 483075
16254 483075 183691 322312 111716 173971 -125394 -27718 133250 155609 -47670 -58358
16244 -58358 448120 372304 61608 -112727 9221 184990 174808 54284 193845 79174 291681
16233 291681 311272 185524 -265506 54453 -191256 198286 295412 -269621 8011 -95154 164614
16221 71379 267656 -5866 123096 39405 56986 24945 353551 44402 -282972 -114409 186939
16209b60236A06040K84507a8619j78102A18478a5365p4477A42108K20640C411
16198I2088a96094C46289F2937a09382A20940n3545a94982A73649a90280I8644
16187A5227L95632E5049H418L07552A27869C2152J29189h0352A1110h7695G7225
16175A61659a74095A6197J09672K18193A15399b58696g4968K8979H6328N1439
16165A37767a27932j796d3784E1398R1247b30976A93279o045a87504G5484K60773
16154C36257a16571A38240d0843q7212B05824m1151d4624j00003C54349A02566
16143C03702P1849F4920K672d9690l7540A58569J04897B7071b17003A25451p877
16132A17574a06729F9200O657K79423H8285b45520c230A21357j2703a22866Q407
$$ plain form
16209 -260236 106040 390547 -18619 -196721 118478 -15365 -89842 142108 362748 3411
16198 92088 -196094 346289 62937 -109382 120940 67395 -194982 173649 -190280 98644
16187 15227 410859 55049 8418 315970 127869 32152 161341 -80352 11110 -87695 77225
16175 161659 -174095 16197 125869 344062 115399 -258696 -74968 -45989 86328 137767
16165 137767 -127932 -129728 -43784 51398 142645 -230976 193279 187234 -187504 75484 336257
16154 336257 -116571 138240 -40843 -128055 205824 164673 -44624 -144627 354349 102566
16143 303702 375551 64920 67592 -49690 -87230 158569 263466 27071 -217003 125451 117574
16132 117574 -106729 69200 75857 355280 88285 -245520 -3230 121357 108654 -122866 -114459
16121a14459A481N2989J20294J14395a56253B83378A8617Q7992N6579J3648J07483
16110B84319f3297G1629J0338g7281j14477B45086b34371A40537O2706i8899A45025
16098A32446A6654R9206i7121D6291J60783b52006j994E2031L1494C6107l785
16087C2322O8260J53351b52141k7257B60866a6878B61216c04324a21596k219C9958
16075I6382b05735B86693j32494c6836j44202B57599h8982D14537I2104o841j9105
16064F6158K15390f5400c0649j68716H2321R0344a06134B33345a80682N8311G6413
16052B67131B7532h1674B38862d5763j23456O0018A24321b0006C00156G8163L30013
16041D08176A87825a29878C7105N8257d1827r6411f7682I8657A9152r081J24623
$$ plain form
16121 -114459 1481 54470 174764 289159 -156253 283378 18617 106609 163188 176836 284319
16110 284319 -63297 71629 81967 -77281 -191758 245086 -234371 140537 203243 -98899 145025
16098 132446 16654 115860 -97121 46291 207074 -252006 -254000 52031 83525 36107 32322
16087 32322 100582 253933 -252141 -279398 260866 -16878 261216 -304324 -121596 -123815 39958
16075 96382 -205735 286693 154199 -36836 -181038 257599 -88982 414537 92104 85263 66158
16064 66158 281548 -65400 -30649 -199365 82321 172665 -106134 233345 -180682 -122371 76413
16052 267131 27532 -81674 238862 -45763 -169219 -109201 124321 -20006 300156 78163 408176
16041 408176 187825 -129878 37105 95362 -41827 -138238 -67682 98657 19152 10071 134694
16030A34694J11145K50706B45408q6885e0187h930C9837b48369H4142g3912H4034
16018b28517h1150p5880B72421b4330B946K7705N1131J87773C9191a61731f112
16006b5776H7112d8620k0691G455M0104a50283B41076a02507A01324b45649A13537
15994A25299e7211B70081G883N0899c49101B41434f9833j64253J014A02185d5529
15982D3876N14310A33738Q03a96161K181A50947b65522d9827E3203K2093J96172
15971B71468b70312a34494B39357g6567L522j06976D1004N8844d42359K08881
15961b33478A3190d0222k46273A631K44881I1542B946J72059H1272A1679d7752
15949a61393F7150b0546D2299b4980k31141a832A65548g9038J9613r910k43210
$$ plain form
16030 134694 245839 496545 245408 158523 -50187 -8930 39837 -248369 84142 -73912 84034
16018 -228517 -81150 -157030 272421 -24330 2946 30651 81782 269555 39191 -161731 -6112
16006 -25776 87112 -48620 -69311 7455 47559 -150283 241076 -102507 101324 -245649 113537
15994 125299 -57211 270081 7883 58782 -349101 241434 -69833 -234086 -233072 102185 -45529
15982 43876 558186 133738 134541 -196161 -193980 150947 -265522 -49827 53203 75296 271468
15971 271468 -270312 -134494 239357 -76567 -73045 -180021 41004 99848 -442359 -233478
15961 -233478 13190 -40222 -286495 1631 246512 91542 2946 175005 81272 11679 -47752
15949 -161393 67150 -20546 42299 -24980 -256121 -1832 165548 -79038 -59425 -69335 -312545
15938c12545a34801f6160C59712a5521k21137h326j16610H4443c33482h5373a3497
15926b04942M1879I9987C4881a71159g6131D8294a21893G449K58006E2918g67827
15914b46665h294A35703C467d5966o2767k84563A9885J84314A5348d30146J87995
15903b42151c0076q6796L7140C05869a31946A10993A2184J74294b00065G9714
15892a08080A20979i7032B32575b16056F1945b88580O0054C3000J33570k0202
15882A46368b04659J4818B50456a18541E4025b00436Q8494B590J15658C5509L45418
15871C80927b73338J13110L1761F8428A3156a86023B6079f7040j53102I1641a45836
15859b22674F4012a26392E8276h6593j1550H9264a38818c4527A70911c6731B5271
$$ plain form
15938 -312545 -134801 -66160 359712 -15521 -236658 -8326 -124936 84443 -333482 -85373 -13497
15926 -204942 -163063 99987 34881 -171159 -76131 48294 -121893 7449 265455 52918 -767827
15914 -246665 -8294 135703 3467 -45966 -108733 -393296 19885 204199 15348 -430146 -242151
15903 -242151 -30076 -116872 -79732 305869 -131946 110993 12184 186478 -200065 79714
15892 -108080 120979 -97032 232575 -216056 61945 -288580 -228526 33000 166570 146368
15882 146368 -204659 -189841 250456 -118541 54025 -200436 -111942 2590 118248 35509 380927
15871 380927 -273338 -160228 -128467 68428 13156 -186023 26079 -67040 -220142 91641 -145836
15859 -222674 64012 -126392 58276 -86593 -98143 89264 -138818 -34527 170911 -36731 25271
15847B82603b03039H5307b95085H7622b74819a34191B39680F314g0944l6939A08974
15835B93002B2330a98345d4958a5697H9439h2635E4850e3943j44714g8258a0793
15823E90490b14741B40710E0730a74071F1596b39329B7281b99225J37497D6630
15812h6154l6212q3595D0902b23263N9509m0883E5521N4148g0793j07447h3098
15800b3089m9807O743j48239b6683m25683F5512c3611A19221a21056A25859R6518
15789B22377a00305j35278H7703J03558C3439K05373d43321A71873a84984D6966
15778H2554a24480D5074P3075J45078a48485O7355A40853a12808E9971d1753j23558
15767a65311n4743D73626A17701a37182j12924n3226H2117a81715I2817b83113
$$ plain form
15847 282603 -203039 85307 -295085 87622 -274819 -134191 239680 6314 -70944 -107883 108974
15835 293002 22330 -198345 -44958 -15697 89439 -82635 54850 -53943 -198657 -78258 -10793
15823 590490 -214741 240710 50730 -174071 61596 -239329 27281 -299225 -161728 46630
15812 -86154 -122366 -205961 40902 -223263 -163754 -204637 55521 109669 -70793 -178240 -83098
15800 -23089 -72896 -66153 -214392 -26683 -452366 65512 -33611 119221 -121056 125859 222377
15789 222377 -100305 -235583 87703 191261 33439 238812 -443321 171873 -184984 46966
15778 82554 -124480 45074 118149 263227 -148485 -81130 140853 -112808 59971 -41753 -165311
15767 -165311 -220054 473626 117701 -137182 -250106 -303332 82117 -181715 92817 -283113
15756a13953A21714a38863P109B52221G7684a28343C76307H9432J34498r6641
15746A27289I768J99887R5432a78142b9953A19660b30791F5433c37048J25536
15736b11512E3184g2201G3574b18917Q2439A92906b65007G2749c40342a36080
15725d8690j623j84652l2413F9303f1759o4221A29645K4460m3710c7331A31985
15713d0736A87327a4456m0095j38259l3615A9529J204K42503a43297A24085b42660
15701H3308f3972I6431h0637E25804a03267B4937L83981j40799c8865E7915a6732
15689b21499a00574l2682r2753B50850i5000A46410a61765d5688r7556r2492d1020
15677c17356A67336a4574A61764J4064K3887q9212b9256C86603j83429d3356A37083
$$ plain form
15756 -113953 121714 -138863 -131754 252221 77684 -128343 376307 89432 223930 127289
15746 127289 9768 209655 305087 -178142 -29953 119660 -230791 65433 -337048 -211512
15736 -211512 53184 -72201 73574 -218917 -136478 192906 -265007 72749 -340342 -136080
15725 -48690 -50313 -234965 -267378 69303 -61759 -125980 129645 154105 110395 -37331 131985
15713 -40736 187327 -14456 -54551 -192810 -226425 19529 20733 263236 -143297 124085 -242660
15701 83308 -63972 96431 -80637 525804 -103267 24937 408918 268119 -38865 57915 -16732
15689 -221499 -100574 -133256 -226009 250850 -95000 146410 -161765 -45688 -143244 -235736 -41020
15677 -317356 167336 -14574 161764 175828 199715 110503 -29256 386603 203174 -43356 137083
15665a56774n7998J00494a0590l3758o6213j54228A21609i7621D824d3688A78839
15653E0211P8136a40570A03739J22780f3935C5515Q1546E2333b49664B4203K64259
15642B88462b69881L6205C84472b71158a5774I0353I452N6380a83361m68922C7840
15630a45033q8808A73477e3845J56B89147j04127K6946c39606M0873e1086b2716
15618a87675A9771a20276I7097K66056f070j6852k20485C09260j27387b58696
15607a21222k8006B3319J30481c32295B2976g7646F3275R6292a62471I552a99395
15595A01765k9586b40887Q3493k0432f1669G3661K11731D5622O2793a24759j51117
15584b75876A44621f8944H3776L5362h1381P572A49233J02764c75199A5195R6638
$$ plain form
15665 -156774 -214772 -114278 -10590 -44348 -110561 -264789 121609 -97621 4824 -43688 178839
15653 50211 128347 -140570 103739 226519 -63935 35515 117061 52333 -249664 24203 288462
15642 288462 -269881 -233676 384472 -271158 -15774 90353 9452 65832 -183361 -652283 37840
15630 -145033 -233841 173477 -53845 -53689 289147 185020 211966 -339606 -298733 -51086 -22716
15618 -187675 19771 -120276 97097 363153 -6070 -22922 -243407 309260 181873 -258696
15607 -121222 -149228 23319 153800 -332295 22976 -77646 63275 159567 -162471 9552 -199395
15595 101765 72179 -240887 -157394 -177826 -61669 73661 285392 45622 108415 -124759 -275876
15584 -275876 144621 -68944 83776 119138 -81381 -73809 149233 251997 -375199 15195 111833
15573A11833c46354b8739k13341A14845J4669c96407J69259j1932A39618K1744
15563A61362K21430h0965D06574H6746J33025d660j35124B18995g494A59270e7549
15551I4336c41360A89797J2137b9257j7363j15625F7871J469e6630h783m3951
15540e2734j62054l8879R4658j00856b8674k03948i6834A67903K30352e8698q236
15529f6934d821j83213A10839f0361B46492e6023E16503A40051j7060f5610J8095
15518d7515G6134b57643j71642e1513l21589A65543K9132G2980e9577j04660A63620
15506f4581k7553n969A83147i3778m5216B57389i6967P236A29138a72492l1341
15495b03833d0539C4165K1549A5340g0686o7624I9906d8534H0809a45835I3603
$$ plain form
15573 111833 -346354 -28739 -242080 114845 129514 -396407 -227148 -239080 139618 161362
15563 161362 382792 -80965 406574 86746 219771 -4660 -139784 218995 -7494 159270 -57549
15551 94336 -341360 189797 201934 -29257 -46620 -162245 67871 69340 -56630 -8783 -52734
15540 -52734 -214788 -253667 -159009 -259865 -28674 -232622 -96834 167903 398255 -58698 -66934
15529 -66934 -4821 -188034 110839 -60361 246492 -56023 516503 140051 122991 -65610 -47515
15518 -47515 76134 -257643 -429285 -51513 -373102 165543 194675 72980 -59577 -164237 163620
15506 -64581 -92134 -98103 183147 -93778 -138994 257389 -96967 -89731 129138 -172492 -203833
15495 -203833 -40539 34165 55714 15340 -70686 -138310 99906 -48534 80809 -145835 93603
15483d2900A33615b99012H1216Q1001J11415F4219k5184a08243M4418B7129c7771
15471a62861O1908j5479C43001A7831J83512b12664c1445A12686a0702m13781
15461d24483d9192j02960B2306b34207J12436k2377B3804R412a04980M3438A55922
15449B92974b9891k32036e512B46901b13088A23213a33550B87758d32851c4288
15438B80886e0923F5029K04926j13323c20401d3789j34841q6973A3060P6980a23728
15426a10662n2399A62795i1718a438j03415e2292j57077A12703i120D4166b02030
15414b42363C5302J15329M0436b74347a14383B43631C4257b99017i6239A16548
15403e6191H8950d81618a41344B29277b33274A11620K2667J53988j11702d2962
$$ plain form
15483 -42900 133615 -299012 81216 162217 273632 64219 39035 -108243 -63825 27129 -37771
15471 -162861 -100953 -116432 343001 17831 201343 -212664 -31445 112686 -10702 -424483
15461 -424483 -49192 -152152 22306 -234207 -121771 -144148 23804 33216 -104980 -61542 155922
15449 292974 -29891 -261927 -5512 246901 -213088 123213 -133550 287758 -432851 -34288
15438 280886 -50923 65029 269955 156632 -320401 -43789 -178630 -265603 13060 90040 -123728
15426 -110662 -163061 162795 -91718 -1438 -104853 -52292 -209369 112703 -9120 44166 -202030
15414 -242363 35302 150631 191067 -274347 -114383 243631 34257 -299017 -96239 116548
15403 -56191 88950 -481618 -141344 229277 -233274 111620 134287 288275 176573 -42962
15392F19512F8373M4659h722G537K23220i931n0114H5263J55901d28376a60391
15380C57233j08328a33881A14165j9698a8008n972m0241p3326H5894a78878j46605
15369c25483D6204b27617A71570a07617N802n6555C20671a11501l1603I5354d09002
15357B05301e3112j06935k65362A0093J85099M9026f8624o2793A96438a0868A80179
15345G8962h0959D5297B065c00752J43782A71171c3437b043B15421n0456l6571
15334A28394D3651e3651A5035b29050E0568J34399H3749a13762j35618a6786C49204
15322e4586F451N2029b61230A65128e7472B14582G3646c1307j21040B27681n7786
15311A69895a43812C79813a28311A84985K12117j92827b97276B03652b389o5775
$$ plain form
15392 619512 68373 113032 -8722 7537 230757 -9931 -60045 85263 241164 -428376 -160391
15380 357233 248905 -133881 114165 94467 -18008 -23980 -64221 -137547 85894 -178878 -325483
15369 -325483 46204 -227617 171570 -107617 -101815 -158370 320671 -111501 -143104 95354 -409002
15357 205301 -53112 -160047 -425409 10093 195192 244218 -68624 -131417 196438 -10868 180179
15345 78962 -80959 45297 2065 -300752 -156970 171171 -33437 -2043 215421 164965 128394
15334 128394 43651 -53651 15035 -229050 50568 184967 83749 -113762 -249380 -16786 349204
15322 -54586 6451 58480 -261230 165128 -57472 214582 73646 -31307 -152347 227681 169895
15311 169895 -143812 379813 -128311 184985 397102 204275 -297276 203652 -2389 -68164
15301f8164A60866C953J00411a7545j76597n3050c3160A10055b16140N567c4356
15289B2875K44415b40322G3372J10255G2527a25398C4090g3240B6701d5641C2659
15277A28119J72598k2693i9293A88862D1212J60283G8159k2043i8634B58027C3474
15265H1155K53310h8698A77953f5560b2304B99455J30830j60419H9204a22896
15254B24376l5682k4282P8566K73730A62839J11379O20383O52519o31744L79376
15244A294752K41393o32239d9121C31791K17r4371d7845p0244j02873A59732L5078
15233A94810L7269q5522b8346m3123k66313b2329B19700J03697a59628e505A36265
15221A40467D3212J13625C3182b04181h6132j84284A05055L77797a25576O1534
$$ plain form
15301 -68164 160866 3953 104364 -17545 -194142 -247192 -33160 110055 -216140 -210573 -34356
15289 22875 267290 -240322 73372 183627 72527 -125398 34090 -73240 26701 -45641 32659
15277 128119 300717 278024 -99293 188862 41212 201495 78159 56116 -98634 258027 33474
15265 81155 334465 -88698 177953 -65560 -22304 299455 430285 269866 89204 -122896
15254 224376 188694 164412 242978 516708 162839 274218 894601 1547120 915376 1294752
15244 1294752 1536145 903906 -49121 331791 332008 237637 -47845 -118089 -220962 159732 194810
15233 194810 232079 146557 -28346 -71469 -337782 -22329 219700 323397 -159628 -5505 136265
15221 140467 43212 156837 33182 -204181 -86132 -270416 105055 482852 -125576 -64042
15211f4042c706C27305A50874f3416a4531J07A0270c72750c490D7331J7726N9732
15199A24789l0972b13375A49130E5116J62830M396r6856k7812a99525J6477C1681
15187A42632a55090d5147D0643a01669A10431n2109N9781J43801c91894a55968
15176b06769B36269C2772M0919K555Q7961k7683m8908K69217g8400A64285o6804
15165I7481k7084J74941p6470L05089a26839b0478A13531e5381J5844H313K0584
15154B8897c5578j35379b6130B59658r1745a82769A55896i8668A29884b09454
15143A32878b397B45759M5635r9309m0270L62181a78568E62299B47850n2294o5028
15132A30528K88961A39783k1668d3117F2479Q3166J52442a35200A35586n1000
$$ plain form
15211 -64042 -3706 327305 150874 -63416 -14531 -14424 10270 -372750 -3490 47331 65057 124789
15199 124789 93817 -213375 149130 55116 217946 222342 125486 97674 -199525 -183048 31681
15187 142632 -155090 -45147 40643 -101669 110431 58322 118103 261904 -391894 -155968
15176 -206769 236269 32772 73691 76246 164207 136524 87616 356833 -78400 164285 97481
15165 97481 70397 245338 168868 473957 -126839 -20478 113531 -55381 -39537 8313 28897
15154 28897 -35578 -170957 -26130 259658 167913 -182769 155896 -98668 129884 -209454
15143 132878 -2397 245759 291394 192085 151815 513996 -178568 562299 247850 195556 130528
15132 130528 419489 139783 118115 -43117 62479 145645 298087 -135200 135586 84586
15122H4586K8022j7120K22748l5531Q4691P825G1292J05563F2043Q9052O1708
15111B12803a54529B84217A35185K4590k8708J09932b44158A80820l0773K34000
15101C84047i2889B68008a69530B00871i0262C42094a00489B32318A01369e1414
15090a75128a4500l1969q1244B7651p577N5848q612L10423i7627b799A55970N7453
15078B13423K07057A35723a37704B4411K15472B3213N8935J07751c1337o3083
15068i4420I7634D6498N91437k52996h1713G7463J49294P7364A13136J75202J54730
15057D43068L2574I3795M74402i8325B27294d6501B41927J87157A79353q5823
15047I3530J86602j25753K1346c77838a59823B09582j0098j1464P56E008J86668
$$ plain form
15122 84586 112608 95488 318236 282705 367396 375221 71292 176855 62043 151095 212803
15111 212803 -154529 284217 135185 159775 131067 240999 -244158 180820 150047 384047
15101 384047 -92889 268008 -169530 200871 -90262 342094 -100489 232318 101369 -51414
15090 -175128 -14500 -46469 -127713 27651 20074 75922 67310 377733 -97627 -2799 155970 213423
15078 213423 420480 135723 -137704 24411 239883 23213 82148 189899 -31337 -94420
15068 -94420 97634 46498 637935 384939 -81713 77463 226757 304121 113136 288338 443068
15057 443068 475642 93795 568197 -98325 227294 -46501 241927 429084 179353 93530
15047 93530 280132 154379 175725 -377838 -159823 209582 199484 188020 188776 5008 191676
15036A91676K59379a89154A84230k5610K4437R4372G4569J55477l2296K80443
15026D78193A76834q4599M33150B09448N5872a91990O5866A03964P8516F2235
15015A05811M61210a04043A70178b0728A75523h2355m5047I7668K89280F9367
15004B72261o7196l8085Q5591m0559H1215J67179j22376j6099E0392K14181i1630
14992A50396L6893g7454F0908R0838K13865A21982b26473B00393g3842D7696L16868
14981C64564c08088i073A83384a08090B74679J5070J23109k02154p856K53884
14971D56732k25214J70365a230G0133K6444P4771L35337k51273l6085k1399b71664
14959C36671r3698J14515A9204J0622L34966G7035R1007e7288A46009K3282K90588
$$ plain form
15036 191676 451055 -189154 184230 158620 183057 277429 74569 230046 197750 478193
15026 478193 176834 92235 525385 209448 265320 -191990 -126124 103964 182480 62235
15015 105811 567021 -104043 170178 -20728 175523 -82355 -127402 97668 386948 69367
15004 272261 205065 166980 252571 212012 81215 248394 126018 109919 50392 264573 -91630
14992 150396 187289 -77454 60908 151746 365611 121982 -226473 200393 -73842 47696 364564
14981 364564 -308088 -9073 183384 -108090 274679 289749 412858 210704 202848 456732
14971 456732 231518 401883 -1230 70133 96577 171348 506685 255412 219327 197928 -271664
14959 336671 242973 357488 19204 29826 364792 77035 168042 -57288 146009 169291 459879
14948D59879B18583l2909J32346A36899K99017j63764J30230G6012L22931c2784
14937G6524Q7590K70533j65498H8887K42145q7268j3517N9195J22099l7617k7010
14926C46914r4542q4515K43794j12821J4565C9628P2920g1046E26534P0705k18991
14915C78248a94643C02549L37196k96295m3256A11548M73170A31200L1162J75112
14905C37474N8989k7039K9062o8368B696M74023M8666l441f9446A01118K20059
14894C21177I9315J66410L3125p2530L00360B63165J50875A33664M52767A10689
14883B85978J77650k07189O41525C75707n2541A38034K88583N0683k7053j3330
14873D36917j68283N6655n2771A31819M80869A31835R429L06281l6710N21O6674
$$ plain form
14948 459879 218583 185674 318020 136899 435916 272152 402382 76012 398943 -32784
14937 76524 164114 434647 269149 88887 331032 243764 230247 289442 411541 373924 346914
14926 346914 252372 167857 411651 298830 313395 39628 112548 -71046 526534 597239 378248
14915 378248 -194643 302549 639745 343450 300194 111548 584718 131200 162362 337474
14905 337474 396463 369424 398486 330118 2696 476719 525385 521944 -69446 101118 321177
14894 321177 99315 265725 298850 226320 526680 263165 414040 133664 586431 110689
14883 285978 463628 256439 897964 375707 323166 138034 426617 477300 450247 436917
14873 436917 268634 325289 272518 131819 612688 131835 141264 447545 410835 411356 478030
14862D78030l8790k409j77896M932n6780J57491Q355L3294j92339M2755k2575
14851B34068J18511J32396K5805B12764N21618k58823k08123L2867L8153J09300
14841D47756K39725E2280L15418J96117m4651J2042j28777j30571O017J52174
14831D30049j20317J24562J35971j13081j51523P2172J60689j36487L37969B82499
14820E01297m868j83841K52826j75177L0266j56131j03128M05741k83013K50246
14810E34218k49391N3406M67679j47926j80570l1653j15761M5361J74138A94157
14799C63051J48881R5511k36221P3210L59134A44266L71136J00269K54237l80656
14789D89252J20573j87514L4096j51891A25235J75438K10399A69583Q9884L44368
$$ plain form
14862 478030 439240 436831 258935 263867 207087 364578 372933 406227 213888 256643 234068
14851 234068 352579 484975 510780 212764 734382 475559 267436 300303 338456 447756
14841 447756 687481 52280 367698 563815 519164 531206 402429 271858 277875 430049
14831 430049 309732 434294 570265 457184 305661 377833 538522 402035 740004 282499
14820 501297 496429 312588 565414 390237 420503 264372 161244 566985 283972 534218
14810 534218 284827 338233 805912 657986 477416 445763 330002 375363 549501 194157
14799 363051 511932 607443 371222 444432 803566 144266 515402 615671 869908 489252
14789 489252 609825 422311 456407 304516 125235 300673 511072 169583 259467 603835
14779F03835m085p8643j76775L05262j96854L79876j81403k43074J1354L68856
14769G88349j39477J99408C80560L56630k16163k32530J21506J96882q9027J30226
14759F48084j12026a7044G63499l9424J0853J20722l75031A91254P29248k12622
14749G07880J5849k35189L58640k77006o1035N4605J06107P161o3452J02473j08552
14738F07481N3332M2079k17665J16562k65954L14982O3105M7551k4051N9338r526
14727G87234M0609n0703l62568L75424k11456K86765k11808j92476K96695K16718
14717I74434k46514n332j04990J29578r0262j63545M57198m46841O2225J28082
14707F94033K08227k13244K83815K97029n92854J95921k4940k17730J79488k58982
$$ plain form
14779 603835 599750 521107 344332 649594 452740 832616 651213 408139 419493 788349
14769 788349 648872 848280 380560 737190 521027 288497 410003 606885 517858 648084
14759 648084 536058 -17044 763499 724075 734928 855650 480619 191254 920502 707880
14749 707880 723729 488540 847180 570174 509139 563744 669851 677012 613560 716033 607481
14738 607481 660813 702892 485227 601789 335835 650817 713922 761473 737422 796760 787234
14727 787234 827843 777140 414572 789996 578540 865305 653497 461021 757716 974434
14717 974434 727920 722588 617598 747176 656914 493369 950567 503726 565951 694033
14707 694033 902260 689016 972831 1269860 677006 872927 847987 630257 809745 550763
14697E50763M31723k82390j5517Q8612J31038r5055j23739J02814K29286j33116
14687H84419k53531l4445M50949r833J84049m28862J81615R9599j45905J26633
14677A054688j61756j62311K64609K73853q297n810l47530j52324O0135J92117
14667A007374k68316J59081K07829k35790M8488M7903K49542l39752j65250L87412
14657A098521j76540M28320j61729j15710k4210r6599j29483O95533l64765N0642
14647A203980N3040k31874L12076l49876j14419J78105K48901J53934l56263J28423
14637A226027J19493r8058j94332L26895j09937l10300J76886J71217M4876j56821
14627A195946j74204L17489L00229l02395j14352r8115L61889j78786O3883R5914
$$ plain form
14697 550763 982486 700096 684579 773191 904229 809174 685435 788249 1017535 884419
14687 884419 630888 596443 1047392 1037559 1221608 792746 974361 1073960 928055 1054688
14677 1054688 892932 730621 995230 1269083 1260786 1254976 907446 755122 815257 1007374
14667 1007374 739058 898139 1105968 870178 918666 966569 1216111 876359 711109 1098521
14657 1098521 921981 1350301 1188572 1072862 1048652 952053 822570 1518103 1153338 1203980
14647 1203980 1257020 1025146 1337222 987346 872927 1051032 1299933 1453867 1097604 1226027
14637 1226027 1345520 1247462 1053130 1380025 1270088 959788 1136674 1307891 1352767 1195946
14627 1195946 1021742 1339231 1639460 1337065 1222713 1124598 1486487 1307701 1371584 1467498
14617A467498m64595N03441n0698l5740l31541L04775p0830N0911K10032k68332
14607A314921L54328k00694K162L01593j01568j09920L42896m72708O8463k59560
14597A239913L08471R4641r8263k20379M07779L7584k81752K74680j6352N9976
14587A806298j42493O3673J49058j75418l04993O56594l25511L541J44017r4571
14577A780195j77504J31134j97911K85281J62028J12421n35704N71453J42749
14568B274142j16988P6269q523K07582l72221K77729J2641K86544j24100N0835
14558B563910K64656k11030K44529L22389q1857M82489j09150O55378J098469
14549E229783J753715L071304P697234J8551499J4218837B3891496A1447323E570109
$$ plain form
14617 1467498 1002903 1506344 1455646 1419906 1088365 1393140 1322310 1373221 1583253 1314921
14607 1314921 1669249 1468555 1470717 1772310 1670742 1560822 1903718 1431010 1499473 1239913
14597 1239913 1548384 1643025 1544762 1324383 1732162 1769746 1487994 1762674 1746322 1806298
14587 1806298 1663805 1727478 1876536 1701118 1396125 2052719 1727208 1730749 1874766 1780195
14577 1780195 1602691 1733825 1535914 1821195 1983223 2095644 1559940 2131393 2274142
14568 2274142 2157154 2233423 2224900 2432482 2060261 2337990 2350631 2637175 2513075 2563910
14558 2563910 2828566 2617536 2862065 3184454 3102597 3585086 3475936 4131314 5229783
14549 5229783 6983498 10054802 17752036 36303535 50522372 23891496 11447323 5570109
14540C245402p86803o0453l04824j76727j2008j79871P4219K48381j27540Q3435
14530B003211O2170k21471m2722L4679L10842J61538l02995N80794k41849l63837
14520A980360L13653n0975J82428l16350K66169k56955J28749N61252m94709J43682
14510B457304K22734q9809J47772K75903K07589m20570j35057J95298N543k06958
14500B659749K86219J9319O801J98135j47970K30406j0400J26157k89432j53055
14490B925929M94795j85003N2422J30652j47177L68835k70997M6779k74K51331
14480C667292j72109n0842J03050K63074j0313M6402j02719q4163L86465Q335
14470D054472k86513N41133k67423j28564K95681L09551p6258k65364L57493l1375
$$ plain form
14540 3245402 2458599 2398146 2093322 1916595 1904587 1724716 1798935 2047316 1919776 2003211
14530 2003211 2065381 1843910 1801188 1835867 2146709 2308247 2005252 2586046 2344197 1980360
14520 1980360 2294013 2243038 2425466 2109116 2375285 2118330 2247079 2808331 2313622 2457304
14510 2457304 2680038 2590229 2738001 3013904 3221493 2800923 2665866 2861164 2866707 2659749
14500 2659749 2945968 2965287 2972088 3170223 3022253 3252659 3242259 3368416 3078984 2925929
14490 2925929 3420724 3235721 3288143 3418795 3271618 3640453 3369456 3416235 3415961 3667292
14480 3667292 3495183 3444341 3547391 3810465 3800152 3846554 3743835 3659672 4046137 4054472
14470 4054472 3767959 4309092 4041669 3913105 4208786 4518337 4442079 4176715 4534208 4502833
14460D502833j5751P4781j09429m7630K87303J06802K0226j10169K50772m08074
14450D551664L94842M34622J21093l09867K66938k86186J29942J34158J70705
14441E607911J29931k66487M80072l75027M94383j53065N36071m40515K60488
14432F273762L9351O67221o20259J45599K35770J03583j42836K15250j70026N35647
14422G283062q3471l7516K72618J285j23007N47137J63536N7304J32409J57055
14412H370412l96380O61160m41369O65515l67781P91904j62814K24320J09113
14403I454080J82562j9061K29161K8221L42951q9420M98880k34818M12121J74986
14393A0979663o3214M10389p8657M78992M091M61359K4559M61067N1737R6792
$$ plain form
14460 4502833 4487082 4561863 4452434 4404804 4692107 4798909 4819135 4708966 4959738 4551664
14450 4551664 4946506 5381128 5502221 5192354 5459292 5173106 5303048 5437206 5607911
14441 5607911 5737842 5471355 5951427 5576400 6070783 5917718 6453789 6013274 6273762
14432 6273762 6313113 6980334 6360075 6505674 6741444 6845027 6702191 6917441 6747415 7283062
14422 7283062 7199591 7162075 7434693 7435978 7312971 7860108 8023644 8080948 8213357 8370412
14412 8370412 7974032 8635192 8193823 8859338 8491557 9283461 9120647 9344967 9454080
14403 9454080 9636642 9617581 9846742 9874963 10217914 10128494 10627374 10392556 10804677 10979663
14393 10979663 10916449 11326838 11248181 11727173 11731264 12192623 12217182 12678249 12729986 12826778
14383A2826778L63267N03241j74291M89384L25102J23242O4927N84880R4307P59283
14373A5960120q6557N55852k6252K43069M86786L28327L92638M08137L64840M42013
14363A9068973K57032L88889O18221K82329N61927O67410M58450L76071K2847
14354B2702149P18020N96058P50343L35078M11094J167764J90989Q69033O10795
14345B8351323R73360L40203J081374P75425O48944J028953P95647Q71651J294239
14336C6161119N31432J156332O50177J558239J134764J300491J234217J354220
14328D5080991J590090R81550J751238J748285J509660J844839K099716J628508
14320E8234877K565293J911863J988102K739565K239231K754598L115780K748564
$$ plain form
14383 12826778 13190045 13693286 13518995 14008379 14333481 14456723 14521650 15106530 15200837 15960120
14373 15960120 15873563 16429415 16403163 16646232 17133018 17461345 17853983 18262120 18626960 19068973
14363 19068973 19326005 19714894 20333115 20615444 21177371 21844781 22303231 22679302 22702149
14354 22702149 23420169 24016227 24766570 25101648 25512742 26680506 26871495 27740528 28351323
14345 28351323 29324683 29664886 30746260 31521685 32170629 33199582 33995229 34866880 36161119
14336 36161119 36692551 37848883 38499060 40057299 41192063 42492554 43726771 45080991
14328 45080991 46671081 47652631 49403869 51152154 52661814 54506653 56606369 58234877
14320 58234877 60800170 62712033 64700135 67439700 69678931 72433529 75549309 78297873
14312G8297873K889064L479777L821431L507277L979269M238451M576085M549323
14304A09338550M832049N392979N843447N811483O471227O820461P214991P614919
14296A59340106P866185R056196R133339R764309J0366332J1100894J1718069
14289B28345430J2615436J2783824J3437728J4221212J4937302J5486764J5733439
14282C27561135J6107538J6259030J6337722J6335666J5747957J5322496J4344484
14275D38016028J2656138J1461650P215991M833718K450335L76798O58533j755675
14267D75913516l987852n856040q089095j0553440j2308515j4437122j5145720
14260D05535732j6168977j6881405j6896779j6457731j6608962j5747249j5030827
$$ plain form
14312 78297873 81186937 84666714 88488145 91995422 95974691 100213142 104789227 109338550
14304 109338550 114170599 119563578 125407025 131218508 137689735 144510196 151725187 159340106
14296 159340106 167206291 176262487 185395826 195160135 205526467 216627361 228345430
14289 228345430 240960866 253744690 267182418 281403630 296340932 311827696 327561135
14282 327561135 343668673 359927703 376265425 392601091 408349048 423671544 438016028
14275 438016028 450672166 462133816 469349807 474183525 476633860 477010658 477669191 475913516
14267 475913516 471925664 466069624 457980529 447427089 435118574 420681452 405535732
14260 405535732 389366755 372485350 355588571 339130840 322521878 306774629 291743802
14253B91743802j4432311j4287585j3321903j2928869j2329762j1523511j0942064
14246B01977797r837225r725615q736370q179168q251586p411219o906681p001505
14238A35928428n940842n638496n579744n412605m848538m800659l959449l978189
14230I5769906l475354l822061l800478l398271k896119l062198k841835k473480
14222G0000110k776866k383215j859029k354573k308455j825258j643729k438726
14214E2410259j207232j251531j894823j625900j397338j403100j131085o38369
14206D1860881j187103j445296j521151p84501j128610q13826j22475j198966
14198C3658953j285682r80591m76425j246461o30837o40865q65108o32463r22681
$$ plain form
14253 291743802 277311491 263023906 249702003 236773134 224443372 212919861 201977797
14246 201977797 192140572 182414957 173678587 165499419 157247833 149836614 142929933 135928428
14238 135928428 129987586 124349090 118769346 113356741 108508203 103707544 99748095 95769906
14230 95769906 92294552 88472491 84672013 81273742 78377623 75315425 72473590 70000110
14222 70000110 67223244 64840029 62981000 60626427 58317972 56492714 54848985 52410259
14214 52410259 51203027 49951496 48056673 46430773 45033435 43630335 42499250 41860881
14206 41860881 40673778 39228482 37707331 36922830 35794220 34980394 34857919 33658953
14198 33658953 32373271 31392680 30916255 29669794 29038957 28398092 27532984 26900521 25977840
14189B5977840o49219n38589n24414l79011n77175n65448m08292o41484m66656
14180B1227552k16338m87233m88993o71866l95352l62855o15594J04329q68537
14171A7225113l0720n33268k72618j32759l95421k89615k98809n17445k99177
14162A4455281M87118m03046n91037j52408l50294m71246r6488j5512j75363k05412
14152A2481593n46744M9565m2783k76889k05496J00858p94638k631l23333K39283
14142A0678785n5454n86860L41160o5470l91171k89650m0574j65488P5427m95940
14132I004765j30020j98966K45032n32100J00923j87302k80854N54748n06969
14123H069257k76559k17146J66016k43598N17662p20111M4709l70339j3643k64888
$$ plain form
14189 25977840 25328621 24790032 24265618 23886607 23309432 22743984 22335692 21694208 21227552
14180 21227552 21011214 20523981 20034988 19363122 18967770 18604915 17989321 18093650 17225113
14171 17225113 17194393 16661125 16388507 16255748 15860327 15570712 15271903 14754458 14455281
14162 14455281 14942399 14539353 13948316 13795908 13445614 12974368 12877880 12862368 12687005 12481593
14152 12481593 11934849 11984414 11941631 11664742 11459246 11560104 10765466 10762835 10439502 10678785
14142 10678785 10623331 10036471 10377631 10312161 9920990 9631340 9590766 9425278 9500705 9004765
14132 9004765 8874745 8675779 8920811 8388711 8489634 8302332 8021478 8576226 8069257
14123 8069257 7792698 7575552 7741568 7497970 8015632 7295521 7340230 6969891 6956248 6691360
14113F691360M70655Q1883o50258J40013P4747k3516k95958k65673k8833J30307
14103F324727j32300N7928j07718k15710N6615j46437M202j96749m45523M92996
14093E692031J43997k33313n81093K21212j22451M12713m02410o0661k50849r2048
14083D727128M11056n51244j3353K75942o3917j55438J0980J99936j89655n49162
14073D102273K42000O3509p0701N35476r36944J77650R300k80528J09069J629
14063C952733K01444j34509j68158o2715j41655M85066k21635q9546m5480j31150
14053C644395Q2428J16513l07797Q3483J48070m41828K22336l38646K15399N2169
14043C476522l26866j44490O5608K33027m36439L18405q7169k14795Q5908L37726
$$ plain form
14113 6691360 7162015 7243898 6593640 6733653 6808400 6784884 6488926 6223253 6194420 6324727
14103 6324727 6192427 6250355 6142637 5926927 5983542 5837105 5841307 5644558 5199035 5692031
14093 5692031 5836028 5602715 5021622 5242834 5120383 5533096 5130686 5070025 4819176 4727128
14083 4727128 5138184 4586940 4573587 4849529 4785612 4630174 4641154 4841090 4651435 4102273
14073 4102273 4344273 4407782 4337081 4872557 3935613 4113263 4122563 3842035 3951104 3952733
14063 3952733 4154177 4019668 3851510 3788795 3647140 4132206 3910571 3821025 3775545 3644395
14053 3644395 3726823 3843336 3535539 3619022 3767092 3325264 3547600 3208954 3424353 3476522
14043 3476522 3149656 3005166 3070774 3303801 2867362 3185767 3098598 2883803 2969711 3307437
14033C307437m84242K93472l62450L13730j34017j20730J56115j40727j66676
14024B661912o8267j02780N52891n15774J3540o7915r4133Q7634l31749O74288
14014B809647k10398l57564O2588m7621M4783J87594l00368L54732k85124j71972
14004B086297J74368l83552M62276r30k94758J73648R3449l38480j79560J90661
13994A983419J10553j57618j59055L55172J86363J139948J849106N411177J7877450
13985B8596515K2304499k1577065A4149399o000247j914606j562101m72672k39197
13977C960576o62825j89629j54251j65459k25967J71186k66482K94567k97385
13968B464331j41518j96r5891K07945l40201n365J55836k36803O3133N0960q0748
$$ plain form
14033 3307437 2823195 3116667 2754217 3067947 2933930 2813200 2969315 2828588 2661912
14024 2661912 2593645 2490865 3043756 2527982 2541522 2473607 2379474 2467108 2135359 2809647
14014 2809647 2599249 2241685 2304273 2256652 2301435 2489029 2188661 2543393 2258269 2086297
14004 2086297 2260665 1877113 2339389 2338459 2043701 2217349 2310798 1972318 1792758 1983419
13994 1983419 2093972 1936354 1777299 2132471 2318834 3458782 5307888 10719065 28596515
13985 28596515 50901014 29323949 14149399 8149152 6234546 4672445 4199773 3960576
13977 3960576 3297751 3108122 2953871 2788412 2562445 2733631 2467149 2761716 2464331
13968 2464331 2322813 2322617 2226726 2434671 2094470 2089105 2244941 2008138 2071271 2122231 2041483
13957B041483j51522N20317k27613l20488M87375n89836L60784k65505m2300K84906
13947B097601m04359K54150r9290l5617M2425j63240J67084K35067l43458j2639
13937A737724J08355q7381k3851k23027o407O9625M01783m63177M15211j42868
13927A785987l13144K28663p4031q6274k9265j62777L53966j46128j01250J87247
13917A642994j71118j53415R1476l00445M21378j84118J52026P5781l7409j91483
13907A345667L98429o92054M64891k25929j5556P4040O887j00930J36779l42459
13897A049765L85759k94321J6852k1580j30623L24833j34549O6798L65189n45177
13887A082946L26329n80655N49791j16483j59045J18687J88946k73905J69161
$$ plain form
13957 2041483 1889961 2410278 2182665 1862177 2349552 1759716 2120500 1854995 1812695 2097601
13947 2097601 1693242 1947392 1848102 1812485 1854910 1691670 1858754 2093821 1750363 1737724
13937 1737724 1846079 1758698 1734847 1511820 1505413 1575038 1976821 1513644 1928855 1785987
13927 1785987 1472843 1701506 1627475 1541201 1511936 1349159 1703125 1556997 1455747 1642994
13917 1642994 1471876 1318461 1409937 1109492 1530870 1346752 1498778 1574559 1537150 1345667
13907 1345667 1744096 1052042 1516933 1291004 1275448 1349488 1356375 1255445 1392224 1049765
13897 1049765 1435524 1141203 1158055 1136475 1005852 1330685 1196136 1262934 1628123 1082946
13887 1082946 1409275 828620 1378411 1261928 1102883 1221570 1410516 1136611 1305772
13878A305772l34092L09592J466J77992l80118R8128k25528O623M836K79267m15144
13867H28794M66367n3730r3614L2288k12931K36999k96807j11641K82623M3723
13857A122071J57921k31818L1505M7089m10495R5609K81704k89434J30217P998
13847I42367l67J44453K34818n85556K68518J31697l39292J37420j25256K23764
13837A032566n7257K81445m33222N0135j65025k8374K89541L4822j83208n3435
13827G67988Q8020n6548j64718J58738L15266n9989n8601D56908M81618J4176
13817I52702k41011j5046k52991M00508J00751j21302j53318M6015O2829m0686
13807G38451K4766J25178J817k32109K56871k68441J09823m1140K5839o195J59476
$$ plain form
13878 1305772 971680 1281272 1282738 1460730 1080612 1178740 953212 959835 964671 1243938 828794
13867 828794 1295161 1241431 1147817 1180105 967174 1204173 907366 795725 1078348 1122071
13857 1122071 1279992 1048174 1079679 1126768 716273 811882 1093586 804152 934369 942367
13847 942367 942000 1086453 1321271 735715 1004233 1135930 796638 934058 808802 1032566
13837 1032566 975309 1256754 823532 873667 708642 680268 969809 1004631 821423 767988
13827 767988 856008 799460 634742 793480 1108746 1048757 990156 456908 938526 952702
13817 952702 711691 696645 443654 844162 944913 823611 670293 716308 779137 738451
13807 738451 763217 888395 890212 658103 914974 646533 756356 715216 741055 734860 894336
13796H94336o8380J23056j09089m3873l15125O37453D83761K74951k00763L59287
13786I17236j55817R1032N6409C59461M58945r1662P567n4370J62975j20124n893
13775G16899K13194j02973K71878l73803L157l30135N46041D13249j86552N35226
13765G61923C79185L12552k6113K99155k07192j46904K51479j21350m8730L8300
13755G30382k73630J58537J0406k55335M91981k88264M24368j70800j70154K03013
13745H60504k60922J46787j19190B46744O03301l66611M31082m31490m422j54477
13735C24127L07684j6523J44763K16915C47645L59550k90983K08778p5208J12956
13725F62738k29223K75740l18211J41979j27438M5887J12156l6895J02807P9303
$$ plain form
13796 894336 825956 949012 839923 796050 480925 1118378 483761 758712 557949 917236
13786 917236 761419 852451 908860 359461 818406 726744 734311 679941 842916 722792 716899
13775 716899 930093 827120 1098998 725195 728352 398217 944258 413249 226697 761923
13765 761923 379185 691737 665624 964779 757587 610683 862162 740812 692082 730382
13755 730382 456752 615289 625695 370360 862341 574077 998445 827645 657491 860504
13745 860504 599582 746369 627179 246744 850045 483434 914516 483026 478604 324127
13735 324127 631811 615288 760051 976966 347645 707195 416212 624990 549782 662738
13725 662738 433515 709255 391044 533023 405585 451472 563628 526733 629540 708843
13715G08843j35531J49918k45728N3842m4378J52014B10371L97226j00129m1951
13705D65517n6893J6132p2721p0694L24020J39276j21377J47129n6157j78728
13695E35504L5413P8938C10087K81463m6804K67384B77274M81470k53240o3281
13685D42223K64883K03500l37180A75190N51789B60360M21209j93628J90860k10587
13675D68214j39367J78424K7354L27386l86277k3996K33380k30812A80025j863
13665A78162J27293L93195C30983F4334L77597j89209K81081k24123J13727j59711
13655B63696K2919K08877k46801Q6233q6637J46354K35944j99627G8724K42686
13645C21410J96690j06695J85479M381B90800L82850A44077N13729j62636j16830
$$ plain form
13715 708843 573312 723230 477502 531344 486966 638980 210371 607597 507468 465517
13705 465517 408624 424756 352035 281341 605361 744637 623260 770389 714232 535504
13695 535504 570917 649855 310087 591550 544746 812130 277274 758744 505504 442223
13685 442223 707106 910606 573426 175190 726979 260360 681569 487941 678801 468214
13675 468214 328847 507271 534625 862011 475734 451738 685118 454306 180025 178162
13665 178162 305455 698650 330983 64334 441931 252722 533803 309680 423407 263696
13655 263696 286615 495492 248691 334924 248287 394641 630585 430958 78724 321410
13645 321410 518100 411405 596884 601265 290800 673650 144077 657806 495170 378340
13635C78340j44202J49161I067K86375P2340K0722k4267K69464j91030r1052J75340
13624E26959J00978A33601K34226K68032j96334B08208J70470O9666k19168K02813
13614D31989J67738B15606Q1500A32397L69783j70059J89027J19542j970l06493
13604C32227E3390K85959q0628K68119j25747J77164A07787J77248L16383I0834
13593B34287J57768J68293j59828k3729P749K76917D7768L86339P3047k38082
13583B69072M9963a0731B83965K42076A01477L87174n9315J20226B32968L5857
13573B68825A14988K43359K8011j87886o4117J21792D8928L66943R1375o3469
13563D43777J98858B6644K21031k9205k0709N0973O0310R3527k9422K21094A11456
$$ plain form
13635 378340 234138 383299 9067 295442 367782 388504 364237 633701 442671 351619 526959
13624 526959 627937 133601 367827 635859 439525 208208 378678 448344 229176 431989
13614 431989 599727 215606 297106 132397 502180 332121 521148 640690 638720 332227
13604 332227 53390 339349 258721 526840 401093 578257 107787 285035 601418 90834
13593 234287 392055 560348 400520 376791 384540 661457 47768 434107 507154 269072
13583 269072 319035 -10731 283965 526041 101477 488651 429336 549562 232968 268825
13573 268825 114988 358347 386358 198472 134355 256147 48928 415871 507246 443777
13563 443777 642635 26644 247675 218470 197761 248734 309044 402571 373149 594243 111456
13551F90184k30082b3337A52276J38039a30028D64306Q790j62575H9228K14358
13541C03586K14468j66117A20075K50096I0424N27873k09680n5147n8949P9874
13531C74395K04920j81396k2784k134k331e5643D52192j54568J08322e1390D08124
13519D15988n0479n7982o6486a0023C22852A20560J54276o1165L53743n2545m0199
13508D74670j55043m3439p3375J32107H1628b7264B96603n5418q3030K23207F208
13496G20170k75819B00524m0737K99851A74267Q974K30890Q5082j26971e3256
13485B88691J8837q7847J28659J5478I1023a54451j0800B85586H178L9674M12361
13474D60213A61726K11847m7617H0023K29957B2412K84314K0286A7927g4552A30974
$$ plain form
13551 690184 460102 -23337 152276 290315 -130028 464306 473096 310521 89228 303586
13541 303586 518054 351937 120075 370171 90424 618297 408617 353470 294521 374395
13531 374395 579315 397919 375135 373001 370670 -55643 452192 297624 405946 -51390 408124
13519 415988 365509 307527 241041 -10023 322852 120560 274836 213671 567414 514869 474670
13508 474670 319627 276188 202813 334920 81628 -27264 296603 241185 158155 381362 6208
13496 720170 444351 200524 159787 459638 174267 183241 414131 499213 372242 -53256
13485 288691 307528 219681 348340 363818 91023 -154451 -165251 285586 8178 47852 460213
13474 460213 161726 373573 325956 80023 309980 22412 306726 327012 17927 -74552 130974
13462E17875k55074D7237N1890J14107K73842F3910P1339M03101A71006K30264
13452D01270D5863J69074J55067J5674o8649a34180G2683Q6306R362H0617L4573
13441A15190d622D64995A52816p5263J52071q9803a05003o036B37283i3704B62443
13429A47708L03809r8136j75509G6504O4691e1890B19361O8882l2847r3050R6571
13418B58917p0874L0040n589J1162p1384E4220L50134A16378a97303B16091a74703
13406B51162B2345K41168j7809C1066R2014j8716J8672P4796E5965P5786a2200
13394C88928A32745k5468m6890L53056j78234L6030B3477K92776j37306B1236
13383B93345d8227d680B46034b8753B01230E1240K76981j24521D7592L61667b3215
$$ plain form
13462 517875 262801 47237 99127 213234 487076 63910 135249 538350 171006 401270
13452 401270 45863 214937 370004 385678 317029 -134180 72683 158989 168351 80617 115190
13441 115190 -4622 464995 152816 77553 229624 139821 -105003 -111039 237283 -93704 262443
13429 147708 451517 353381 177872 76504 141195 -51890 219361 288243 255396 162346 258917
13418 258917 188043 218083 212494 223656 152272 54220 404354 116378 -197303 216091 -174703
13406 251162 22345 263513 245704 31066 123080 104364 123036 197832 55965 131751 -12200
13394 388928 132745 107277 60387 413443 235209 271239 23477 316253 178947 21236
13383 293345 -48227 -4680 246034 -28753 201230 51240 328221 203700 47592 409259 -23215
13371A72888J70466Q4547G9901Q6545p6831J91800L56517k20002G1827K81997
13361C53824A26769J82626K8195a27049C41776A45726g0262B53348J45169A46556
13350D45371A55498J78954M1660j60375j00006K90914G1075K87209J47821A03683
13339A95886L86218j11734j28536j35134K92025b8723B04509q082J22157p5219
13329B43365O9789j30175k4622K89600D5468a37782A46035E7713L9105N2465J10758
13318B60041N9300o9453A15801f0072E71721B46096J54697F2818J10562p6706
13308I6674i518B20532G9482a28428A89226J69969j7756J03569A15867E7741K7832
13297H5573L97023m9259H3502a56007D4277Q0893a88090A14467J63603q4097l49
$$ plain form
13371 172888 343354 427901 79901 166446 89615 281415 637932 417930 71827 353824
13361 353824 126769 309395 337590 -127049 341776 145726 -70262 253348 398517 146556
13350 445371 155498 334452 376112 215737 115731 406645 71075 358284 506105 103683
13339 195886 582104 470370 341834 206700 498725 -28723 204509 196427 318584 243365
13329 243365 313154 182979 158357 447957 45468 -137782 146035 57713 96818 149283 260041
13318 260041 319341 249888 115801 -60072 571721 246096 400793 62818 173380 96674
13308 96674 -9518 220532 79482 -128428 189226 359195 341439 445008 115867 57741 85573
13297 85573 482596 433337 83502 -156007 44277 125170 -188090 114467 278070 193973 193624
13286A93624P0830M4061f3377A08025K61005N8783j43677q1981a99707B47348
13275a17607B49521b40859A58074K45087j04995F2605L9856M9400E7338g6946
13264B43455J35443a89213A6890a26019C71027A16289m8321C0275J79861j9160
13254A90976J40169f4539j98590J01382M5491E3282J74406a05564A04124J33569
13244B37693a98205C62326a71841B80133e0998H0708J57238G8563b8474A30473
13233D27184B07758i0293A91419G2312j7890K5301J41083l5109E116J13221A6478
13221H0628R4278J03040i5998F1958B7857J10866J23516j13009C1907K62783q5040
13210B09650a59474C13002J3900d0458A21057b34384a9090A44038k0033O3005
$$ plain form
13286 193624 264454 308515 -63377 108025 369030 427813 284136 202155 -199707 247348
13275 -117607 249521 -240859 158074 403161 298166 62605 102461 151861 57338 -76946
13264 243455 378898 -189213 16890 -126019 371027 116289 67968 30275 210136 190976
13254 190976 331145 -64539 -263129 -161747 -116256 53282 227688 -105564 104124 237693
13244 237693 -198205 362326 -171841 280133 -50998 80708 237946 78563 -28474 130473
13233 427184 207758 -90293 191419 72312 54422 79723 220806 185697 5116 118337 16478
13221 80628 174906 277946 -95998 61958 27857 138723 262239 149230 31907 294690 209650
13210 209650 -159474 313002 326902 -40458 121057 -234384 -19090 144038 124005 187010
13200A87010k3759n9455k3387M4100o0269L0825J8582K0351Q7578O5948j4831
13189B72693C6327d31981B68984A24735a3516r178A34473c56678A08464L0414
13179A38878C7957J97538f0840l2159o0658C58031H5937O9836e5538B0556K26056
13168B46612j8509M8283M23876A14653M8730b0802D208M00169A10466K8057J7308
13157A55831a8243A99820a06982A22563K27347r4854f9577B20729a59676F4825
13146a82622A15804D8979a65694j53685a18556H715J6569d4842A43792i4620A11222
13134a2429A0883L00609j19972K22864j75738J15673A5725L6444J85978j5847
13124B22300q2468N9793L4075B7942O3600J30766J35193b36842A0551P5457A0408
$$ plain form
13200 187010 163251 103796 80409 124509 64240 95065 113647 133998 221576 287524 272693
13189 272693 36327 -431981 268984 124735 -13516 -22694 134473 -356678 108464 138878
13179 138878 37957 235495 -60840 -92999 -153657 358031 85937 155773 -55538 20556 246612
13168 246612 228103 276386 700262 114653 163383 -20802 4208 404377 110466 138523 155831
13157 155831 -18243 199820 -106982 122563 349910 255056 -69577 220729 -159676 64825
13146 -182622 115804 48979 -165694 -319379 -118556 8715 25284 -44842 143792 -94620 111222
13134 -12429 10883 311492 191520 414384 238646 354319 15725 52169 238147 222300
13124 222300 139832 199625 233700 27942 91542 222308 357501 -236842 10551 86008 10408
13112B8873d78633B90749A0377a8479l00505A17770n3668d77381A17176B776O281
13101I057c5823B82945A31027a39480A47506f115B35864D350a54670g6633J0648
13090f5985f232B62828g7845B72633f6951C5943J98358q8071J79239a40847E0025
13078H1505a64773C8060K99458A23399J1959n8852d1037H7014c725E563Q9728
13067I5291J86462K14801A52850a00879A30082F3341K1052J05644a43036H4594
13056g8065A95149L3561J84014p6953I7852j3442M0338F0880M47169A01192K0420
13045A21612J75859H5326b72384C04886A8035b60222C4321J42688K0385J31334
13035C28728A20825K96413j77169a43610a372A49639n7493C0581J76189m5197
$$ plain form
13112 28873 -478633 290749 10377 -18479 -318984 117770 64102 -477381 117176 2776 9057
13101 9057 -35823 282945 131027 -139480 147506 -6115 235864 4350 -154670 -76633 -65985
13090 -65985 -6232 262828 -77845 272633 -66951 35943 234301 146230 325469 -140847 50025
13078 81505 -164773 38060 337518 123399 135358 76506 -41037 87014 -3725 5563 95291
13067 95291 281753 496554 152850 -100879 130082 63341 84393 190037 -143036 84594
13056 -78065 195149 228710 412724 335771 97852 84410 124748 60880 508049 101192 121612
13045 121612 297471 85326 -272384 304886 18035 -260222 34321 177009 197394 328728
13035 328728 120825 417238 240069 -143610 -1372 149639 92146 30581 206770 161573
13025A61573K09903j81281J03779a7629B63263b38845H0402J8624a79091j07561
13015b86652F12621a20844B7403J99747g1870p7664a4426A41178j9462J62762
13005B84478f984C19672a20307F4185A876J08585J16096l5007M5247I8945c45545
12993h6622B96279A12837F445a01922H0987B3893J39594E5590f1440J737B9801
12981a31574C3117M1021c4516k35399h437k15350G3219J29947e9637j22706A13534
12969a35508K0422I6177R2318b63282A33864d08566B67688b03346C11209j36816
12959A74393a07751E6478i814B58661C8843d416A49482a32619L172D6717c85591
12947b1490n4237A85523K657a38856A65575o4818b00911A56254b68762A00737
$$ plain form
13025 161573 371476 190195 293974 -17629 263263 -238845 80402 99026 -179091 -286652
13015 -286652 612621 -120844 27403 227150 -71870 -149534 -14426 141178 121716 284478
13005 284478 -6984 319672 -120307 64185 1876 110461 226557 191550 236797 98945 -345545
12993 -86622 296279 112837 6445 -101922 80987 23893 163487 55590 -61440 -59703 29801
12981 -131574 33117 74138 -34516 -269915 -8437 -223787 73219 203166 -59637 -182343 113534
12969 -135508 -115086 96177 188495 -263282 133864 -408566 267688 -203346 311209 174393
12959 174393 -107751 56478 -9814 258661 38843 -4416 149482 -132619 -129447 46717 -385591
12947 -21490 -75727 185523 188180 -138856 165575 100757 -200911 156254 -268762 100737
12936A18414K65987a75613p011a6779j82741A97366G8601i4283B90472I0794a96931
12924A5289J33148A1678b22791o6508a1603j20063A61557b5941G2023c17702D6779
12912a67970D3564b16863B57401A4572J07752r959e8931E4570O3630i0046j44633
12901b34679C74398b98763B37271G7464L25022A333K12444k6491J42282F9220
12890A98685q4295M7450o9132l7c61714O2956A44233a91038r8353E20212k50958
12879B69254h8256l0530j73545B04749I91P1979e9956K874A22197C8765M86244
12868E25009A41920N2653f6897J4580A03423a52938J869a2740C0882J13840a08186
12856c63307a32023A65239J09381n1961E2210L6629a28987C19078P367b23395
$$ plain form
12936 118414 384401 -175613 -182624 -16779 -199520 197366 78601 -94283 290472 90794 -196931
12924 15289 148437 11678 -222791 -289299 -11603 -131666 161557 -25941 72023 -317702 46779
12912 -167970 43564 -216863 257401 14572 122324 112365 -58931 54570 118200 -90046 -234679
12901 -234679 374398 -298763 237271 77464 402486 1333 213777 187286 329568 69220
12890 198685 114390 161840 92708 92671 -361714 -298758 144233 -191038 -289391 520212 269254
12879 269254 -88256 -118786 -292331 204749 991 72970 -59956 -57082 122197 38765 525009
12868 525009 141920 194573 -66897 -52317 103423 -152938 -151069 -12740 30882 144722 -108186
12856 -363307 -132023 165239 274620 222659 52210 88839 -128987 319078 326445 -223395
12845H1759k2483K34455c1189B55866b0993r3791A89676D915c80846J61257B7993
12833C9941j8948L9368f4145a0022A41589E3907J66086G9983b71907D900K0641
12822B5541R5894a18061B46309a28168d3555A33712l7218J34166D5065a73569
12811A9007K99208B9182K31835f1802H3317J23636n5108i354k31865F3161J97568
12800B60729I9332M3056J01763b79691A10473N9267O4520j08267b03944R7419
12790a06525D06753i9228E6937a29063C7763K24919a35682B7461K11424a46826
12779F4297A9358J346a31868m6750A01307J572j1832b78447h3527A29539e2555
12767e2508f049A3672a21883J730k34230B21946a19961A55868H347R0997a48760
$$ plain form
12845 81759 59276 293731 -31189 255866 -20993 -114784 189676 4915 -380846 -219589 27993
12833 39941 20993 60361 -64145 -10022 141589 53907 219993 79983 -271907 4900 25541
12822 25541 121435 -118061 246309 -128168 -43555 133712 96494 230660 45065 -173569
12811 19007 318215 29182 261017 -61802 83317 206953 151845 -9354 -241219 63161 260729
12800 260729 99332 142388 244151 -279691 110473 169740 234260 125993 -203944 -106525
12790 -106525 406753 -99228 56937 -129063 37763 262682 -135682 27461 238885 -146826
12779 64297 19358 20704 -131868 -178618 101307 102879 91047 -278447 -83527 129539 -52555
12767 -52508 -6049 13672 -121883 -120153 -354383 221946 -119961 155868 8347 99344 -148760
12755d08654b1020I7857i6993c6410j33147b4024A5739J2937K67424a42933A50273
12743A95217D435J02740C6427j1508c01065e2938A88559f7023B04941P6182c5536
12731A70216Q3834D4274K93775g5481o0401j1032q3323B90484A36895a06367j18505
12720b24872A91015b57737e638A66352H1856K91890A63999M4443b25961B08635
12709C06070c8550C78704B1577M94684c962C22574A57508b53193B60833r5237
12699A65596o9819D6912R2313q379J72328j8292A00754K26437f1975j0404f865
12687d2543j1732G2438a060C18049f167H9824g4299C5275J27127F9475d7080m2307
12675h9387D19018A31026B0082Q1882j2051Q4218D6227J91834a16857l33501I2453
$$ plain form
12755 -408654 -21020 97857 -96993 -36410 -169557 -24024 15739 28676 296100 -142933 150273
12743 195217 4435 107175 36427 24919 -301065 -52938 188559 -67023 204941 281123 -35536
12731 170216 254050 44274 338049 -75481 -135882 -146914 -230237 290484 136895 -106367 -224872
12720 -224872 191015 -257737 -5638 166352 81856 373746 163999 208442 -225961 208635
12709 306070 -38550 378704 21577 516261 -3962 322574 157508 -253193 260833 165596
12699 165596 95777 46912 139225 130846 303174 284882 100754 327191 -61975 -72379 -6865
12687 -42543 -54275 72438 -1060 318049 -6167 89824 -74299 35275 162402 69475 -47080 -89387
12675 -89387 419018 131026 20082 101964 89913 174131 46227 238061 -116857 -450358 92453
12663A93852J37404A07105K1418J1166i7833E10772f6768H5263a11721A69059
12652F6829A3694K9581J501R8866D1444a15452B8940L37093j53654r2538K54967
12641C74808A53597b20400C5217K3357h778k63609B70814E1803R0535e2583j16651
12630a69234A35950J4500c8915A44882D4151g2223A98843K39761J25080C0037
12619D93153B04681d4923n4835L6055o2794d4064j56621b0630I0728d02737a69175
12607f3477A11408Q7451a31717B10246L48877C4090J905A5988Q5726o874L6212
12596A31052C6727C713M851b99390A83098b49979K486C06857H5003i3647E5418
12584e8576j5985q838D09381B3140a75124a3576B88943A5083g1115B70818L0621
$$ plain form
12663 193852 331256 107105 128523 139689 -97833 510772 -66768 85263 -111721 169059
12652 66829 13694 43275 44776 143642 41444 -115452 28940 366033 212379 119841 374808
12641 374808 153597 -220400 35217 58574 -8778 -272387 270814 51803 142338 -52583 -169234
12630 -169234 135950 150450 -38915 144882 44151 -72223 198843 438604 563684 30037
12619 493153 204681 -44923 -99758 -63703 -126497 -44064 -200685 -20630 90728 -402737 -169175
12607 -63477 111408 198859 -131717 210246 559123 34090 35995 15988 101714 94840 131052
12596 131052 36727 3713 8564 -299390 183098 -249979 -247493 306857 85003 -93647 55418
12584 -58576 -74561 -83399 409381 23140 -175124 -13576 288943 15083 -71115 270818 301439
12573C01439I446R7946i0673a4353b358q1949C5247P3825g4047c4253B43350I4409
12560a33367d5086G5811f3919k816A46073l4329a24652C144L42374A19923a84830
12548F0417a66226H9975J48707l1227E4898q126b13112O5851B4611a62301B25641
12536i873j61039A35885b05592Q7499D99221c09639C25461F771M13985j06195
12526C14561e3823G8524c40752a62346B38641d09434B6240K7340a10239b0985
12515I2881D5085b7977D49733D2736c6692C54414a16286k1217d6594I8207M8016
12504A46223m7941E943b2200l99959C1560a21988r0082C05185R0896e4125r0556
12493a44681o2344J8808a0086j53375B8882a31122g708D84994a2972p679o588
$$ plain form
12573 301439 9446 107392 -90673 -14353 -2358 -84307 35247 109072 -74047 -34253 243350 94409
12560 -133367 -45086 75811 -63919 -66735 146073 111744 -124652 3144 345518 119923 -184830
12548 60417 -166226 89975 238682 207455 54898 46772 -213112 -147261 24611 -162301 225641
12536 -9873 -170912 135885 -205592 -118093 499221 -309639 325461 6771 420756 314561
12526 314561 -53823 78524 -340752 -162346 238641 -409434 26240 53580 -110239 -20985
12515 92881 45085 -27977 449733 42736 -36692 354414 -116286 -137503 -46594 98207 146223
12504 146223 98282 5943 -22200 -422159 31560 -121988 -212070 305185 396081 -54125 -144681
12493 -144681 -207025 -188217 -10086 -163461 28882 -131122 -7708 484994 -12972 -20651 -27239
12482b7239N548A39533N1298h4823r0300k1666j49141J59477A38569c2211I8704
12470e8102J3349D3722a48320k9357A24957J2621a02318l9188B69137C6472a29602
12458A14084a2515j28796A84843m7827h845k0639C1899K3989k5644e4161k3830
12447g7991B47785a34103j180B58884b25471f7087B49110E2144k5956J52560d6850
12435A24984a6930l7896j38764G0897b12912A46177g2809B77352j27990J21055
12425B70417j16794C7109K74161D5762b5026D1860K33491K9862A06999j7561a08316
12413C20886G2762L69414i5052B39248C5417J32510J18122L1593a04524j8350
12403a22874n0507A33450b32671B89957A24121n8279O8455m2532a23385J6203
$$ plain form
12482 -27239 -21691 139533 190831 -84823 -175123 -196789 -345930 -186453 138569 -32211 98704
12470 -58102 -44753 43722 -148320 -177677 124957 137578 -102318 -141506 269137 36472 -129602
12458 114084 -12515 -141311 184843 137016 -8845 -29484 31899 55888 30244 -54161 -77991
12447 -77991 247785 -134103 -135283 258884 -225471 -67087 249110 52144 26188 178748 -46850
12435 124984 -16930 -54826 -193590 70897 -212912 146177 -72809 277352 149362 270417
12425 270417 153623 37109 311270 45762 -25026 41860 275351 305213 106999 89438 -108316
12413 320886 72762 442176 -95052 239248 35417 167927 286049 317642 -104524 -122874
12403 -122874 -173381 133450 -232671 289957 124121 65842 134297 91765 -123385 -107182
12393a07182e2548e68A78610q0231b82658I2445N6259p1569a99163A39409m4416
12382I4993o101b22946A03275Q2287c88106a05044M4079I998N21780j37558c7138
12370F5409a35825I3046B8143K7165J0385a61762r3625e7512n0411q799N1355
12359f5367j56649l986L3639N8858A14513a648l6364A40019R4257n78F3292f0795
12346B4271N1801M0159K31860a68426A13433h8511J3387A65786o8194m4628J01835
12335A54799F7139Q8679c59893a71825B38544a74121h1478A05939E301J34898
12325A40199F2463j0782J09881Q5823a64069d1411j10050d8807A74959A2456J58551
12314A71007F3337J14379c9811F2726B2786b26633A03452b19280F5190K9195D3221
$$ plain form
12393 -107182 -52548 -568 178610 98379 -282658 92445 148704 77135 -199163 139409 94993
12382 94993 88892 -222946 103275 185562 -388106 -105044 -60965 9998 531778 394220 -37138
12370 65409 -135825 93046 28143 55308 65693 -161762 -255387 -57512 -107923 -116722 -65367
12359 -65367 -222016 -226002 -192363 -133505 114513 -1648 -38012 140019 234276 233698 63292 -60795
12346 24271 76072 116231 348091 -168426 113433 -88511 -75124 165786 97592 52964 154799
12335 154799 67139 155818 -359893 -171825 238544 -174121 -81478 105939 5301 140199
12325 140199 62463 51681 161562 247385 -164069 -41411 -151461 -48807 174959 12456 171007
12314 171007 63337 177716 -39811 62726 22786 -226633 103452 -219280 65190 94385 43221
12302a28351J9320A04626e7764r4041N218A40027c2658l27853a29658A10646J64954
12291B75600q5023e8198j9004B38617a14462E2780d2766l08137A84791C0209a9734
12279A39499Q0685D3332J96755L8708A22838N8161q1452j3216Q2241a74817g3944
12267B81317I8326c57368I217c2641j5580A24205i6849D3350b4203E6050N9241
12256A15291d3737D76639j5164e3903a1371k78067C83612j59440J29449A2161
12245a14068d8841F4951L52991G5438L7396P4873d4514a2024k35331f3267C02896
12233G7602p615P1307e4596A96622F2520f329G4963J33037a7869C25622E865N17719
12221E23584j76408h3728C35120J55442j79699A12971B5119J27469J82259p8289
$$ plain form
12302 -128351 -109031 104626 -57764 -151805 -146587 140027 -32658 -360511 -129658 110646 275600
12291 275600 190577 -58198 -77202 238617 -114462 52780 -42766 -350903 184791 30209 -19734
12279 139499 220184 43332 240087 278795 122838 180999 99547 86331 168572 -174817 -73944
12267 281317 98326 -357368 9217 -32641 -48221 124205 -96849 43350 -24203 56050 115291
12256 115291 -43737 476639 461475 -53903 -11371 -289438 383612 224172 353621 12161
12245 -114068 -48841 64951 417942 75438 112834 187707 -44514 -12024 -247355 -63267 302896
12233 77602 69987 141294 -54596 196622 62520 -6329 74963 208000 -17869 325622 5865 523584
12221 523584 347176 -83728 335120 490562 310863 112971 25119 152588 334847 256558
12211B56558a7052B12319m9366c34623B50811a06683b5393E4226J42534J21810
12201C18570E2162K97929i8211B27582o0794A4051L91441G7432J86832P1980r3675
12190B42569n1573p9665E4416f7293a8518B69109F2205K81570I3317j2428M381
12179H5270J21603C7334M00786B08677f4774j63252B91978j5840a3004B02759
12168D7157K01891e3500B34086q2993J05587a08716D24508A73693Q792h1393f337
12156A91413e4985C15314q1301J07005J5940F3346n383K2990h0510A87179A2020
12144A36537i2289B6028J79994k0039I2649P3000d5984E1599J41837J3388o9487
12133A37337A7968L0507g137A1163a81786B85547A4541a08431B37558a1129j18893
$$ plain form
12211 256558 -17052 212319 162953 -334623 250811 -106683 -25393 54226 196760 318570
12201 318570 52162 350091 -98211 227582 166788 14051 405492 77432 264264 336244 242569
12190 242569 190996 111331 54416 -67293 -18518 269109 62205 343775 93317 80889 85270
12179 85270 206873 37334 438120 208677 -64774 -228026 291978 276138 -13004 202759
12168 47157 249048 -53500 234086 151093 256680 -108716 424508 173693 182485 -81393 -6337
12156 191413 -54985 315314 234013 341018 356958 63346 57963 80953 -80510 187179 12020
12144 136537 -92289 26028 206022 185983 92649 165649 -45984 51599 193436 206824 137337
12133 137337 17968 48475 -7137 11163 -181786 285547 14541 -108431 237558 -11129 -130022
12122a30022B24806O230a5488A81341f5897a5276k2080B87845r9491C9488a70871
12110A16089D2573J67612A0174a07626C06130a80978C34135b40817C31328i8514
12099a27428E457c9614D7969a62245h0729C11391f0044A02748e1693k54771A12062
12087A37830f2065A71757L3887a28171j57473J18467d404F4369A2129P1841L69263
12076D53233H3794b82865Q5611F54186J146439q09296D25561o6005D6699i5387
12065D43314j62004F0441e010E0642Q3230I36K20227b7426C14001I238J18154
12054A27392B465J13183k831L5761c18148a458a9D7754o565M4489c54190A53656
12041B7938b79935a1142D8283a29801K3439L201j68532J17373l1829B30042a34756
$$ plain form
12122 -130022 224806 231036 -15488 181341 -65897 -15276 -37356 287845 188354 39488 -170871
12110 116089 42573 210185 10174 -107626 306130 -180978 334135 -240817 331328 -98514
12099 -127428 5457 -39614 47969 -162245 -80729 311391 -60044 102748 -51693 -306464 112062
12087 137830 -62065 171757 205644 -128171 -285644 -167177 -4404 64369 12129 83970 453233
12076 453233 83794 -282865 -197254 654186 1800625 991329 425561 359556 46699 -95387
12065 443314 281310 60441 -5010 50642 133872 936 221163 -27426 314001 9238 127392
12054 127392 2465 115648 112817 148578 -318148 -1458 -19 47754 41189 85678 -354190 153656
12041 27938 -279935 -11142 48283 -129801 -106362 -103161 -271693 -154320 -186149 230042 -134756
12029b13277R1400A68321o2787O1167a69154L7248j30925j50856B11768j1111
12019B00657q5423c23965B54348h0035C91447K2265j83524b93088f4552A29690
12008A10807a87381c4913D3905d47321a58110E4239c44749b6942j83604m3671
11998b54217G3542c45015J23361b6187B0404c454D3193d11226e6952j87700i3767
11986d4833E4534b06872o2916c0981k18551C0524h4079H3575k9700i8106C50994
11974B61722E1551a47227a8795B71290D1115a35870A18118E2096Q1658d2105A7418
11962c2572f244j32325j67722J06492B55918b4296j16872o3166e0376J6566H547
11950b15948d7783E6215J21942p3430i942j50634o8053A5095Q3704J965J29449
$$ plain form
12029 -213277 -121877 168321 105534 166701 -169154 -131906 -262831 -413687 211768 200657
12019 200657 115234 -323965 254348 -80035 391447 413712 230188 -293088 -64552 129690
12008 110807 -187381 -34913 43905 -447321 -158110 54239 -344749 -26942 -210546 -254217
11998 -254217 73542 -345015 -221654 -26187 20404 -3454 43193 -411226 -56952 -244652 -93767
11986 -44833 54534 -206872 -269788 -30981 -249532 30524 -84079 83575 53875 -98106 350994
11974 261722 51551 -147227 -18795 271290 41115 -135870 118118 52096 133754 -42105 17418
11962 -32572 -6244 -138569 -306291 -199799 255918 -24296 -141168 -204334 -50376 -33810 8547
11950 -215948 -47783 56215 178157 104727 -9942 -160576 -228629 15095 98799 100764 230213
11939B30213A7884L2607J34441n7494N3059H8466J3661e9516K1385A40387B2951
11927e4646B12295i7013A99352o2643K16660J31562B9450b86937I8014b24404
11916a81045F7474c8879C00030A8238b80568C09929h3261I9186K41833a41245
11905a39501J6524a4781I9870R4428N4240e52A02112i3831i698k68967i7077A46808
11892C24178b39521d4906j91724q227B43650a07436m9055F8306R340c10066J28591
11881a81475g0852j85479F2815k3586a14237j45726B05765a87675l0729R8878
11871a19526m0207M2400C33116e7770A81445a42863q396l37974I9809M1118e8926
11859C3096A4064P8530K15097c29112B31119g7851a1126l02895a31936I3218L8275
$$ plain form
11939 230213 17884 50491 184932 127438 180497 88466 102127 -59516 -38131 140387 22951
11927 -54646 212295 -97013 199352 136709 353369 484931 29450 -286937 98014 -224404
11916 -181045 67474 -38879 300030 18238 -280568 309929 -83261 99186 341019 -141245
11905 -139501 -122977 -14781 99870 194298 248538 -552 102112 -93831 -9698 -278665 -97077 146808
11892 324178 -239521 -44906 -236630 -244857 243650 -107436 -156491 68306 77646 -310066 -181475
11881 -181475 -70852 -256331 62815 39229 -114237 -259963 205765 -187675 -218404 -119526
11871 -119526 -159733 -117333 333116 -57770 181445 -142863 -151259 -489233 99809 140927 -58926
11859 33096 14064 92594 307691 -329112 231119 -77851 -11126 -314021 -131936 93218 131493
11848A31493E6869A8134J72819r2577m7288b48661K6332Q1564j50429A22459b87401
11836a28685a2973E5132g9017A93210j6865a25496j66598F3767B027c84078A10288
11824D4185a96502d8729j60846k1835P4550n6058A04361Q0415e4393k73055J55854
11813a71594P4594K5681k31579B29667d4804B09663h5940F0777N9563i9324A26913
11801B57587a51620E1637a53767c6347j24897M807O4966B04170a26223k7037C10024
11789D02598G8744i7462j61561B039h9605D8625K20526b85362A9379Q5972a4586
11777A3855a94690h7580k03075a35305k50624a41977c1991A30705b79991M7667
11767b32324j18420c0992D13760a76405H2616d67610d052B66573a30933R151A09099
$$ plain form
11848 131493 56869 18134 190953 98376 51088 -248661 -222329 -140765 -291194 122459 -287401
11836 -128685 -12973 55132 -79017 193210 176345 -125496 -292094 63767 2027 -384078 110288
11824 44185 -196502 -48729 -209575 -231410 -156860 -212918 104361 184776 -54393 -327448 -171594
11813 -171594 -97000 -71319 -302898 229667 -44804 209663 -85940 60777 120340 -99324 126913
11801 257587 -151620 51637 -153767 -36347 -161244 -156437 -91471 204170 -126223 -153260 310024
11789 402598 78744 -97462 -259023 2039 -89605 48625 269151 -285362 19379 105351 -14586
11777 13855 -194690 -87580 -290655 -135305 -385929 -141977 -31991 130705 -279991 -232324
11767 -232324 -350744 -30992 413760 -176405 82616 -467610 -4052 266573 -130933 -121782 109099
11755a68020L6718H8969C4376a86599b8847j73772O0493A21915M7812m8032a7608
11743b87161a35078F920Q301b46062m5526C97347A94653l6996i832k4605F4217
11731d2533A48139L9180c0411C0410d62075h5032C52625l1215a13719j280g754
11719a67135E7506e0483E164N5316I797N48539k05276d7436j57963c8096C1599
11707A06364J07446h690j18748A31992J03178k2277E2086d9657m3026C18660b2639
11695A30942a13914a9467D17804B03555a23816j4499F8685a98579A21236L8228
11685A59464p0062a08475B82693b23177B86659k203A34299a86919c3464H2068
11674d623A19543a92751B78829I540J69931G4869a39266j94959a7659A76880e8516
$$ plain form
11755 -168020 -131302 88969 34376 -186599 -28847 -202619 -142126 121915 169727 121695 -17608
11743 -287161 -135078 6920 15221 -246062 -291588 397347 194653 157657 -9832 -34437 64217
11731 -42533 148139 187319 -30411 30410 -462075 -85032 352625 321410 -113719 -114999 -7754
11719 -167135 57506 -50483 5164 60480 9797 558336 353060 -47436 -205399 -38096 31599
11707 106364 213810 -8690 -127438 131992 235170 212893 52086 -49657 -92683 318660 -22639
11695 130942 -113914 -19467 417804 203555 -123816 -138315 68685 -198579 121236 159464
11685 159464 89402 -108475 282693 -223177 286659 284456 134299 -186919 -33464 82068
11674 -4623 119543 -192751 278829 9540 179471 74869 -139266 -334225 -17659 176880 -58516
11662e2220E8632b34229F0625a40698b8561D5049a5659I712a96764j75478G865
11650B25977b25344H7775J3461a2416A22259J79625H2956b85462e2636B98413
11639a49552L3683A87362E272a59546A08263l0634a17273M1699A13724f6477A33026
11627C74992c5617I4059A2304O6269M01211F2476j2018F560J12920h2416F8137
11615a18827B77279B7140A2452J8948c0689B48858b31590O3147a5235n5144B85578
11603A4481a31762A06954K8530K11411j68680O8123F8565A6520L62902c3026j12952
11592a45978b0955C49598j65902l4734P3377A082a02981B7041m615d7313A12096
11580a35340D01593b17959I8096a54290A31237k2865D8317N3554b27564b400B11898
$$ plain form
11662 -52220 58632 -234229 60625 -140698 -28561 45049 -15659 9712 -196764 -372242 7865
11650 225977 -225344 87775 101236 -12416 122259 301884 82956 -285462 -52636 298413
11639 -149552 -115869 187362 5272 -159546 108263 77629 -117273 -75574 113724 -66477 133026
11627 374992 -35617 94059 12304 78573 479784 62476 50458 6560 119480 -82416 68137
11615 -118827 277279 27140 12452 31400 -30689 248858 -231590 -168443 -15235 -70379 285578
11603 14481 -131762 106954 135484 346895 178215 246338 68565 16520 379422 -33026 -145978
11592 -145978 -20955 349598 183696 148962 222339 1082 -102981 27041 22426 -47313 112096
11580 -135340 401593 -217959 98096 -154290 131237 108372 48317 101871 -227564 -2400 211898
11568G8283j1378d7623C35667j06297b95955A65664j7999b84623i929F7044H398
11556a3581m85952A3432N2853q850K8362a17261k7005B30732d0316E1033J05194
11545A56227i7035q3353D000h2825J0354B42792a1112A89903H2094a67045D79551
11533C90975a51982C29041a69872A22316L8231J03603p1781b4439H5918O628J07329
11522A99875b68646H2746L3299a0446j50334A80025e1691C5088a17344A12559
11511h5349L223C34134c0495B14969J55441a44977B09507a82557A09953J878g9341
11499A11375L51786I3054P3479a09409C85358j81310J13698C6093a09187c9236
11488A87862k7860j2648a45042I7679J04366p2575K78075A00920b7676B66356
$$ plain form
11568 78283 66905 -47623 335667 229370 -295955 165664 147665 -284623 -9929 67044 8398
11556 -13581 -499533 13432 66285 57435 85797 -117261 -144266 230732 -40316 51033 156227
11545 156227 -97035 -180388 4000 -82825 -72471 242792 -11112 189903 82094 -167045 479551
11533 390975 -151982 329041 -169872 122316 160547 264150 192369 -24439 85918 92546 199875
11522 199875 -268646 82746 116045 -10446 -160780 180025 -51691 35088 -117344 112559
11511 -85349 -82126 334134 -30495 214969 370410 -144977 209507 -182557 109953 111831 -79341
11499 111375 463161 93054 166533 -109409 385358 204048 317746 36093 -109187 -39236
11488 187862 160002 147354 -145042 97679 202045 129470 407545 100920 -27676 266356
11477a23138N4005K3197j630B94933b4371B17945k1465R5898G2484J01302a28891
11465D9479F171N8163J29231E5213a69107e3802D23631i3178I1931h968k01429
11454b10397A42591K54700p4843o8347l7698i8682b1970C30191A45916c33713
11443H8524J59178c3325k67665B66892f157B63726d6056C250J46091P5415h1456
11431b05310H4695e3251B86227C8739O7690k3263a82068G7019c2788B55803i6336
11419B38587a42071a7014c840j25582N5759k84238C16332d3582j71297K2524A72043
11407G6047O6118E7918L18257A72448c0459A9339L04220H2757J96942A29287B8070
11395a15580B43140a86400B94413A24214a7750H4978a27297M8430H931g5639j9644
$$ plain form
11477 -123138 -69133 -45936 -47566 294933 -24371 217945 196480 292378 72484 173786 -128891
11465 49479 6171 64334 193565 55213 -169107 -53802 423631 -93178 91931 -8968 -210397
11454 -210397 142591 397291 322448 254101 216403 -98682 -21970 330191 145916 -333713
11443 88524 247702 -33325 -300990 266892 -6157 263726 -46056 3250 149341 224756 -81456
11431 -205310 84695 -53251 286227 38739 106429 83166 -182068 77019 -32788 255803 -96336
11419 238587 -142071 -17014 -3840 -129422 -73663 -357901 316332 -43582 -214879 -192355 172043
11407 76047 142165 57918 376175 172448 -30459 19339 323559 82757 279699 129287 28070
11395 -115580 243140 -186400 294413 124214 -17750 84978 -127297 -78867 8931 -75639 -95283
11384i5283I407K07699a26107B3587K35954e7595k4421B11786b21980A13102J1264
11373A24366b00628g4448M4A18510b13060C3838a13345M1204m59029a14869j85208
11362c00077A46877D6493b77090I8290C3618e4205k36986c8620l43321g6722J5172
11351f1550q4868E7941b45992c4703C7917h3127C19461d8953j24762D7576M09937
11340D57513E1183a48010c1657j20328D09559d2092r676j09694B33003d13511
11329D7507R770K3225a04301A51685a20282b8053A01425a05184A92871A8063R5022
11318A13085b01023D12106a4782G6961J57239G0348K1154b67598J07695j01576
11308b61479j44767Q7788B12815B602J47279d9189j83244F5212O6709i3536C76624
$$ plain form
11384 -95283 9407 217106 -126107 23587 259541 -57595 -82016 211786 -221980 113102 124366
11373 124366 -200628 -74448 -74404 118510 -213060 33838 -113345 -72141 -531170 -114869 -300077
11362 -300077 146877 46493 -277090 98290 33618 -54205 -291191 -38620 -381941 -76722 -61550
11351 -61550 -146418 57941 -245992 -34703 37917 -83127 319461 -48953 -173715 47576 457513
11340 457513 51183 -148010 -31657 -151985 409559 -42092 -51768 -161462 233003 -413511
11329 47507 57277 80502 -104301 151685 -120282 -28053 101425 -105184 192871 18063 113085
11318 113085 -201023 412106 -14782 76961 234200 70348 91502 -267598 -159903 -261479
11308 -261479 -406246 -318458 212815 2602 149881 -49189 -232433 65212 131921 -93536 376624
11296A5805h8642J7984k58687J37375A29342J05395a2605B94489j18666i568j56165
11285a65733A95420a19390m63773B08433K6663c1761B26869g5319O602j18477
11275a87194q4054I1137R7114P0289g3332J9948J2000j78553J9577C54761a54200
11263b7712A49878g2090J3388r8859b8731P90G422c10192G8943K00340a94616
11251A8901c6522j835j55156l1841C23102A18631I276M3650K44578f1332A56782
11239a29713I4706i6012j91220a15633L3395n5804m1176B6307a36493A852h9661
11227G9093b21191A42055d8429j81182j2560A2207c91515A0388a78659A13885
11216a45611e6577l75803H7888J0512K85983a97062j58307d6510G3833b3130B8349
$$ plain form
11296 15805 -88642 -70658 -329345 -191970 129342 234737 -12605 294489 175823 -9568 -165733
11285 -165733 195420 -119390 -583163 208433 235096 -31761 226869 -75319 -68717 -187194
11275 -187194 -271248 91137 188251 258540 -73332 -53384 -41384 -219937 -200360 354761 -154200
11263 -27712 149878 -72090 -58702 -157561 -28731 -27941 7422 -310192 78943 279283 -194616
11251 18901 -36522 -38357 -193513 -225354 323102 118631 9276 52926 297504 -61332 156782
11239 -129713 94706 -96012 -287232 -115633 -82238 -138042 -179218 26307 -136493 1852 -89661
11227 79093 -221191 142055 -48429 -229611 -242171 12207 -391515 10388 -178659 113885
11216 -145611 -56577 -432380 87888 98400 384383 -197062 -355369 -46510 73833 -23130 28349
11204a5022H5521Q2913M0056a97708A52428o6652J41949a3914J957A40630b06115
11192a15677e7343j16249B19152b5061A30259i645j52485q6923A52647C6410b96264
11180b99397a09657D892L0384b53013N5694p2546J25532c5232m04857A98119a08636
11168i5835o1640I7244a48691n8558b4832j32959L5248B23489b42925a09006A32726
11156B90083F1893c05712F7714R0584N150a27176A61528b9180j0472B44951a58809
11144h025j53424A05911f4441A70312A336P0397b39470B34344F0098P0012d3957
11132a42257f9735b0423l3465A77867j7677E1701i6535A25059b7109j6870D2968
11120B83153c18367g9634j94949J11171A89271a53103A32043p285P658a72389
$$ plain form
11204 -15022 85521 168434 208490 -197708 152428 85776 227725 -13914 -11957 140630 -206115
11192 -115677 -57343 -173592 219152 -25061 130259 -9645 -162130 -249053 152647 36410 -296264
11180 -299397 -109657 4892 35276 -253013 -197319 -269865 -144333 -35232 -440089 198119 -108636
11168 -95835 -157475 97244 -148691 -207249 -24832 -157791 -122543 223489 -242925 -109006 132726
11156 290083 61893 -305712 67714 158298 163448 -127176 161528 -29180 -39652 244951 -158809
11144 -8025 -161449 105911 -64441 170312 1336 71733 -239470 234344 60098 130110 -43957
11132 -142257 -69735 -20423 -53888 177867 160190 51701 -96535 125059 -27109 -43979 42968
11120 283153 -318367 -79634 -274583 -163412 189271 -153103 132043 124758 132416 -172389
11109d1847A83877d0330A6508g4984A10671k5351c58994J65671B55104J24539
11099C79643F8681O9184n7875N2521l1269L86687G7447K16665j13616E394K98484
11088C03878c8344C31703A29205a72873g4421H1190N06694k81114L9367N8113
11078D04250A49931L13621F0219J87527B9174K40439I0518e4654B37383J63261
11068D00644j64135J10940L69205g718C00040K22521J0284C2978N7267N70314
11058F60559j31971k54731D5632M93693L43021J46431k08374j59131k10375K18983
11048F69880M04735m71179K73115B22498O39533l48627J56778A97492M60122n7839
11038E99775o0361j66108K94084o0773O115k61909o5298J02113K44186o6802l2365
$$ plain form
11109 -41847 183877 -40330 16508 -74984 110671 85320 -358994 -193323 255104 379643
11099 379643 68681 137865 79990 132511 101242 487929 77447 294112 180496 5394 303878
11088 303878 -38344 331703 129205 -172873 -74421 81190 587884 306770 346137 404250
11078 404250 149931 463552 60219 247746 29174 269613 90518 -54654 237383 400644
11068 400644 236509 347449 716654 -7718 300040 522561 532845 32978 90245 660559
11058 660559 528588 273857 45632 539325 882346 1028777 820403 661272 450897 669880
11048 669880 1074615 603436 876551 222498 862031 513404 670182 197492 657614 599775
11038 599775 539414 373306 667390 606617 612732 350823 285525 387638 631824 565022 532657
11027E32657L2733K83496k02912k78641J94803j50060K64977k44213L17370q885
11017G41325C14543L39011P636j1483Q546M1646j88349L37375A75413M20762A67356
11005C79264J22418q0477M940J02765o4550K80096k3139k04985J70988J59269
10995H46589l81754M23878m19136K57605l21300J562K25218K13646P7371k13344
10985G10335n8870M25119Q3909k53218L2063N73784j10853k54472o3767N55385
10975A639415K27626J48718J03996M33080J04521l22227K65984J40174q21162
10966A920125K88343m37202j6143j92722l24617K91257K04064j43000q967j9961
10956A561177J02341m5391m89912m5176J35241m13485J36039D33004L18880k20057
$$ plain form
11027 532657 565390 848886 645974 367333 562136 412076 677053 432840 750210 741325
11017 741325 314543 653554 661190 649707 658253 699899 511550 848925 175413 596175 167356
11005 379264 501682 421205 426145 528910 464360 744456 721317 516332 687320 846589
10995 846589 464835 888713 469577 727182 405882 407444 632662 846308 923679 710335
10985 710335 651465 1076584 1160493 907275 939338 1513122 1402269 1147797 1084030 1639415
10975 1639415 1867041 2015759 2119755 2552835 2657356 2335129 2601113 2741287 1920125
10966 1920125 2208468 1771266 1755123 1562401 1237784 1529041 1733105 1590105 1581138 1561177
10956 1561177 1663518 1618127 1128215 1083039 1218280 804795 940834 433004 751884 531827
10946E31827A00932L12610j79644N03559l13792J06570b31489A08039J58576k4807
10936B41808H3911a30690H6610P2530f8725B80554F7979A6859a01248k9215B15626
10924i9235L6109J3574A19104r450h8069k22894A01939N0642b02471E9074M2191
10913A01265h1789k28125I5599J24536J1093b9201B9096M09894A13904L86708
10903E00612a0214m69663A3825P2347a3126l000j06095H7339b0956k68787a586
10891B9736b9579j71733f8387m8765j11264h835n056n9034C6854f7820c078A09058
10878g1126m23767a51459f1996l07432A0283N0174b65812a24680A71024a05890
10867a87420O3583c201B3555O5474C4279a09976k78766h5555H7334e255A99081
$$ plain form
10946 531827 100932 413542 233898 737457 423665 530235 -231489 108039 266615 241808
10936 241808 83911 -130690 86610 159140 -68725 280554 67979 16859 -101248 -130463 215626
10924 -99235 -63126 -49552 119104 109654 -88069 -310963 101939 152581 -202471 59074 101265
10913 101265 -81789 -309914 95599 220135 231228 -29201 29096 438990 113904 500612
10903 500612 -10214 -479877 13825 86172 -13126 -16126 -122221 87339 -20956 -289743 -1586
10891 29736 -29579 -201312 -68387 -117152 -228416 -8835 -13891 -72925 36854 -67820 -3078 109058
10878 -71126 -494893 -151459 -61996 -369428 10283 60457 -265812 -124680 171024 -105890
10867 -187420 -123837 -3201 23555 89029 34279 -109976 -388742 -85555 87334 -5255 199081
10855D63830H3601a86541b8684j52687c0871G6726G222c68839B43326a87845A58154
10843C1158a66791C77305a54046j31112E5841b01825h408j44821O8361G7319e2579
10831a28243J0157D3014a7742j51A38278f9009k16188A49180O3848e235A55988
10819d3205C2456R1619i7049c7806j30724J6969q2463A48205J8162i9949E7079
10807a79864e1771b3636n8863I6656J0190f011E3840K9627J47841e2508A02598
10795B1759K55241g1504G2275J3591p96J03971b27578H8476J8364K28967D5542
10783a49473f7255j7039l55885a80493l09305a06739j49386a23362f1328K4068
10773c7260k80397a10941A62294a49192a3271A1591g9208k98305D1355M715i5020
$$ plain form
10855 463830 83601 -186541 -28684 -181371 -30871 76726 7222 -368839 243326 -187845 158154
10843 31158 -166791 377305 -154046 -285158 55841 -201825 -8408 -153229 -84868 77319 -52579
10831 -128243 -118086 43014 -17742 -17893 138278 -69009 -285197 149180 213028 -5235 155988
10819 -43205 32456 124075 -97049 -37806 -168530 -151561 -234024 148205 166367 -99949 57079
10807 -179864 -51771 -23636 -82499 96656 106846 -6011 53840 83467 231308 -52508 102598
10795 21759 277000 -71504 72275 85866 85070 189041 -227578 88476 106840 335807 45542
10783 -149473 -67255 -84294 -440179 -180493 -489798 -106739 -256125 -123362 -61328 -37260
10773 -37260 -317657 -110941 162294 -149192 -13271 11591 -79208 -377513 41355 46070 -95020
10761a83984B080i8789l48871C4831q112j1139a79620e3081j39173O0496O113
10750a25645B6134J65347P3500b30955G3311O6281e03850a2691D0392h9857E5381
10738h7006k3899H0274i0891m6567c8587G2092J80437a03660B42727a32549a2157
10726a42071M0078j6240G8082a36595A01877o978a72417A07120c05431N9081A67306
10714G5349a33460L1373d39r9732g334A2296a18354A37480a24200f1380I3415
10702B35553F1304g6913k06336a41246J4053l2026d0047j3604n2884l0917r9045
10691b36497P7536e5090B2706b80306a10063g41l5000k9747A43244c24008A84222
10679b79722a22469q6640a277j13481l85835A80375c14219e9428p903A63248f3
$$ plain form
10761 -183984 2080 -98789 -447660 34831 26719 15580 -179620 -53081 -192254 -131758 -125645
10750 -125645 26134 191481 264981 -230955 73311 139592 -503850 -12691 40392 -89857 55381
10738 -87006 -110905 80274 -90891 -137458 -38587 72092 252529 -103660 242727 -132549 -12157
10726 -142071 -101993 -118233 78082 -136595 101877 94899 -172417 107120 -305431 -246350 167306
10714 75349 -133460 -102087 -439 -100171 -7334 12296 -118354 137480 -124200 -61380 93415
10702 235553 61304 -76913 -283249 -141246 -127193 -159219 -40047 -53651 -106535 -137452 -236497
10691 -236497 -158961 -55090 22706 -280306 -110063 -741 -35741 -65488 143244 -324008 184222
10679 -279722 -122469 -209109 -1277 -114758 -500593 180375 -314219 -59428 -67331 163248 -63
10667B10554k9025g6085F6637J41416a62220D8156b88713H1234J3039K2019a9427
10655B88371j03441a03317M101m61494a11384C29895B4302a93029J2097Q6148
10645i4784j06822h5510d0263l67201D7983e5054F6484Q0130c28493a45021m5557
10634a90578M6719b629l36009l7342A2826J0532r11c27164A67519d56643h453
10622C46696c51685L3656a23060F9666M3088a2780C8825b896C2905P6863a05021
10610H330K69996a14527I6214a24611e0325B4241K6750M7497g3376j63434j06651
10599c43461G6548k6187a14198F2609h8356j84202A59257b00069d9503j44488
10589a93991m95J6152g9849j13186N7902A80680l6473a83220F6825a88794N4764
$$ plain form
10667 210554 181529 -76085 66637 208053 -162220 48156 -288713 81234 94273 116292 -19427
10655 288371 184930 -103317 -99216 -560710 -111384 329895 24302 -193029 -180932 -94784
10645 -94784 -201606 -85510 -40263 -407464 47983 -55054 66484 146614 -328493 -145021 -190578
10634 -190578 -143859 -2629 -338638 -375980 12826 23358 22447 -327164 167519 -456643 -8453
10622 346696 -351685 -318029 -123060 69666 112754 -12780 38825 -2896 32905 109768 -105021
10610 8330 278326 -114527 96214 -124611 -50325 24241 50991 98488 -73376 -236810 -343461
10599 -343461 76548 50361 -114198 62609 -88356 -272558 159257 -200069 -49503 -193991
10589 -193991 -194486 -178334 -79849 -193035 -135133 180680 144207 -183220 66825 -188794 -134030
10578a34030k43710a46652A6701f477E0594e3268D2116b75131O7335M3471E1754
10566b70404Q7882i0259h500j68241O2556p5381l2597M5065n1667h0498A44487
10554c1901C42747j66143J58483n2913A08359K12203d83223A89304M8824K35513
10544D73641A69284b7240B62569a38675J0658J8395b5958p2447A22960a15211
10533e1576B41427j5186c55696E6989O8794C9394b05946A19750l6230B256L515
10522E771a72535A11154i7946m7668A01198k3683P376L32773l4987j7192d2544
10510c7387o9889o4120d85k29460R4404d71j902k70925C67958D0101a60902D6849
10497B13265a48665O8277O863c4287j03034G8629g7014l40304A03032A5570L828
$$ plain form
10578 -134030 -377740 -146652 16701 -6477 50594 -53268 42116 -275131 -207796 -164325 51754
10566 -270404 -182522 -90259 -8500 -176741 -114185 -189566 -222163 -177098 -228765 -80498 144487
10554 -31901 342747 176604 335087 282174 108359 320562 -483223 189304 238128 473641
10544 473641 169284 -27240 262569 -138675 -128017 -109622 -25958 -98405 122960 -115211
10533 -51576 241427 226241 -355696 56989 125783 39394 -205946 119750 83520 2256 5771
10522 5771 -172535 111154 -97946 -145614 101198 77515 84891 417664 382677 365485 -42544
10510 -37387 -107276 -171396 -485 -229945 -135541 -471 -2373 -273298 367958 40101 -160902 46849
10497 213265 -148665 -80388 -73525 -34287 -137321 78629 -77014 -417318 103032 15570 19398
10486A9398O265J85455q8329i6518j2703C63381O8083Q363A09392K70584A11199
10474C24210c08711I1928M33561j30635I7627K02583A41151b50301A59137K340
10464A61477h8559q2j7436D2218g8898A81799f5437L1330k97494A36673c03567
10452a02030k67833d5048k23160j4694A30236a25198K3296k15950J06405g4060
10441i7537K0557g513D9901r743j8002L54972h4j70359j5543N0311A72231O0613
10429B32844F5468b81744B74926I8163D0799O6537c61330G890M3341B5538J79973
10418B05511b01460N0024B1720i8722K8191j74144a5191C20053D6453k1859a34158
10406a84168A8607J14382d24148e0154k7725a0751l31804A25211J86031D041h2289
$$ plain form
10486 19398 25663 211118 122789 -96518 -109221 363381 431464 439827 109392 379976 111199
10474 324210 -308711 91928 525489 394854 97627 300210 141151 -250301 159137 161477
10464 161477 -88559 -88641 -106077 42218 -78898 181799 -65437 -34107 -331601 136673 -303567
10452 -102030 -369863 -45048 -268208 -282902 130236 -125198 -101902 -317852 -211447 -74060
10441 -97537 -76980 -7513 49901 40158 22156 377128 -84 -170443 -185986 -135675 172231 232844
10429 232844 65468 -281744 274926 98163 40799 107336 -361330 7890 51231 25538 205511
10418 205511 -201460 -151436 21720 -98722 -70531 -244675 -15191 320053 46453 24594 -134158
10406 -184168 18607 132989 -424148 -50154 -77879 -10751 -342555 125211 311242 4041 -82289
10394A25088A8036J09873a94735A24535I013K7274J68024I1266b36181D01860
10383b3934o9l4713A22982K67770D8622J33849R6174j19266J05379A4366J90495
10372B04861J2365J04727n1450j13246K09989J29363K963m1710J7967F8237M0036
10361A08273J92908I7567M73122j36559H977j677c48532B75091J22279D0083M72272
10350E12355M1137N6260j18873B13209e6508B06190L67461j27075m3584J51621
10340E54613B41961n8352n039N8441G6805M49907B27768c004D1785K09100a5960
10328a5039A65515J11629l7110A3595K23182A11973e0047B52859b18365b1831
10317I7724C0880J02574n4410Q664c1632A45014E3926J5964e1152J536B9451J47450
$$ plain form
10394 125088 18036 127909 -194735 124535 9013 36287 204311 91266 -236181 401860
10383 -23934 -24003 -58716 122982 390752 48622 182471 278645 159379 264758 14366 204861
10372 204861 217226 321953 270503 157257 367246 496609 499572 457862 475829 68237 108273
10361 108273 301181 97567 570689 434130 8977 7300 -348532 275091 397370 40083 512355
10350 512355 553492 609752 490879 213209 -56508 206190 573651 446576 402992 554613
10340 554613 241961 183609 178570 237011 76805 526712 227768 -3004 41785 250885 -15960
10328 -15039 165515 277144 240034 13595 236777 111973 -50047 252859 -218365 -21831
10317 97724 30880 133454 79044 87708 -31632 145014 53926 69890 -51152 -49616 29451 176901
10305A76901J11475j34973b3137j84314g5917p0206L844J6901d8256A97222b17877
10293B00525b00900c4353q0432F6061f6176H9136d0042g9j23281C13937b34922
10281D192a54592A89268F9802B8594R8310L48705A37700h2161b2768m37047A87982
10269i2446A22158K26959a27848j54066C10057a05941D6294i4569C48100j40377
10259B07723a76095B01940K53071R7460B75817a7615B14960b03664P9071C37814
10248H0955a65171C00555G6439B3645J2296c48952P8659M0875B0064b17824b1018
10236a18556e3204m5817B4034b17557I0718a12360b1784k95077G3831b2733k31314
10225b54047a00039J94A09096D5055K650a90060I1726m2043c34074E7706J05292
$$ plain form
10305 176901 288376 153403 -23137 -207451 -75917 -146123 -142279 -125378 -48256 197222 -217877
10293 200525 -200900 -34353 -114785 66061 -66176 89136 -40042 -79 -123360 313937 -234922
10281 4192 -154592 189268 69802 28594 126904 475609 137700 -82161 -22768 -459815 187982
10269 -92446 122158 349117 -127848 -281914 310057 -105941 46294 -94569 348100 207723
10259 207723 -176095 201940 455011 552471 275817 -17615 214960 -203664 -124593 337814
10248 80955 -165171 300555 76439 23645 35941 -348952 -270293 -229418 20064 -217824 -21018
10236 -118556 -53204 -99021 24034 -217557 90718 -112360 -21784 -316861 73831 -22733 -254047
10225 -254047 -100039 -99845 109096 45055 47705 -190060 91726 49683 -334074 57706 162998
10214A62998a14664G3230a83218g623A89661B2732K5791b26114C94577b9205M340
10203b4865F9567a91996K3262A05768K22520L8389A42191a27659K0143E1891d8069
10191A9301J99545j511g3699A52877J36581g7812I4889D3128M3629a13277j09975
10180b23252J07852j31141A28230a86627b8301F5051c97630a94089a5419j87367
10170b02786A46470a74577f0323l23114a57878a6858l7845A65148c80670I6303
10159a36364e8731j25276j90868J50487C306a51551F068K87964c9428j81019A01298
10147A45747b5048A36383a34382L9303L340A36080e5450B23851E6118k7237a07801
10135B23481a16305e207j38956J9244C59979a6163F3703b54645B21165a15216
$$ plain form
10214 162998 -114664 73230 -183218 -7623 189661 22732 48523 -226114 394577 -29205 -24865
10203 -24865 69567 -191996 -168734 105768 328288 366677 142191 -127659 -107516 51891 -48069
10191 19301 218846 217335 -73699 152877 289458 -77812 94889 43128 86757 -113277 -223252
10180 -223252 -115400 -246541 128230 -186627 -28301 65051 -397630 -194089 -15419 -202786
10170 -202786 146470 -174577 -60323 -383437 -157878 -16858 -54703 165148 -380670 96303
10159 -136364 -58731 -184007 -374875 -224388 3306 -151551 6068 294032 -39428 -220447 101298
10147 145747 -25048 136383 -134382 -95079 -91739 136080 -55450 223851 56118 28881 -107801
10135 223481 -116305 -5207 -144163 -124919 359979 -16163 63703 -254645 221165 -115216
10124d05380C23982d69836a95471j0779R3533o6183c2156A85249H0782C6524c14946
10112B1912b03807j12638c8615o3211c6908A53511c49338C2360L5083a65954O7811
10101i8143d452k5365C5764K70723b9640o3379D3619a76494d8930C8300L03062
10090C41362j2830f9799D8723K5763C2313a63996J303L1798f1219o4212b6895
10078c8846M476j9051D2317c29439c2471n1466m0786a6735q8992I7624a26558
10066a43628D03420c354k97529I0926C9340b68496E4459K8547e8660o0666I1697
10054G4663b61977i4506n2008o1698p8404a7868F0747c06246A01209d4453n05932
10043e50385b2830j42039l4082j08889l5979a39586A08512M1722C2926i8320j58916
$$ plain form
10124 -405380 323982 -469836 -195471 -206250 -112717 -178900 -32156 185249 80782 36524 -314946
10112 21912 -203807 -316445 -38615 -101826 -36908 153511 -349338 32360 67443 -165954 -98143
10101 -98143 -4452 -29817 35764 306487 -29640 -93019 43619 -176494 -48930 38300 341362
10090 341362 328532 -69799 48723 74486 32313 -163996 -162693 -130895 -61219 -125431 -26895
10078 -38846 -34370 -53421 42317 -329439 -32471 -83937 -124723 -16735 -105727 97624 -126558
10066 -143628 403420 -3354 -300883 90926 39340 -268496 54459 83006 -58660 -119326 91697
10054 74663 -261977 -94506 -146514 -208212 -286616 -17868 60747 -306246 101209 -44453 -550385
10043 -550385 -22830 -164869 -198951 -307840 -343819 -139586 108512 150234 32926 -98320 -257236
10032b57236B12440a32528A540J05171J89434I2620a83671A20720c95918e7301
10021E5197c6010C40086a03420F5763c39959M6452Q1250R2049n8022A41953D087
10009c21571J57215Q2002A31252c44177F3016N9706b13649J58J5812k13109N1272
9998c59516M2298h6675A11576f7682I5371a95190C11152c48244J1561P4620A76493
9986A29651d03675A72441F5591G886d0388d56l46346a51421A19274b45246D5194
9974a2245o6147B45036b21659k01809E478a60741J4771L3383k62291Q6329a35049
9962b48888m2448F7493b16574c7727m3032k7511m4896j27827a0041k3744p3428
9951a07213G6171a78763F0195B6130d01497J96482I8704A3523a43436C9027Q801
$$ plain form
10032 -257236 212440 -132528 1540 106711 296145 92620 -183671 120720 -395918 -57301
10021 55197 -36010 340086 -103420 65763 -339959 -293507 -212257 -120208 -178230 141953 4087
10009 -321571 -164356 -82354 131252 -344177 63016 122722 -213649 -213491 -197679 -410788 -359516
9998 -359516 -317218 -86675 111576 -67682 95371 -195190 311152 -348244 -336683 -262063 176493
9986 129651 -403675 172441 65591 7886 -40388 -456 -346802 -151421 119274 -245246 45194
9974 -12245 -78392 245036 -221659 -423468 5478 -160741 -145970 -112587 -374878 -288549 -135049
9962 -248888 -291336 67493 -216574 -37727 -80759 -108270 -153166 -280993 -10041 -33785 -107213
9951 -107213 76171 -178763 60195 26130 -401497 -205015 98704 13523 -143436 39027 47828
9940D7828a31839M0305h129j60927A81300k9401b97464a25289k1469j34350e1837
9928b5820C671J88714D7172R5108a50511l2987d3217j33822a417l86335A25250
9916g0489A09759J30208q4393l6443r750m4201K4253b23611l3941B28665d7148
9904C047h0732p1064B65959G5277c0541B10439a18564j05254a10283k02626J42256
9893a70653Q2166j53579a11724F677O304K02340p3674j0373J4530c46180I9667
9881c19480a39775o0058m6257L4737O9571p5640A20041e5448k7570o840A94403
9869G8296b74967J10688M4439l0472K1252E6544f20714b13851F7084K96343a94834
9857c3351A3558L137a01754k2557G2307c9842j78760H2398a7095n7208j32793
$$ plain form
9940 47828 -131839 -91534 -8129 -169056 181300 151899 -297464 -125289 -146758 -281108 -51837
9928 -25820 3671 192385 47172 142280 -150511 -183498 -43217 -177039 -1417 -387752 125250
9916 -70489 109759 239967 155574 119131 109381 65180 89433 -223611 -257552 228665 -47148
9904 3047 -80732 -151796 265959 75277 -30541 210439 -118564 -223818 -110283 -312909 -170653
9893 -170653 -88487 -242066 -111724 6677 12981 215321 141647 131274 145804 -346180 99667
9881 -319480 -139775 -199833 -246090 -211353 -141782 -217422 120041 -55448 -83018 -89858 194403
9869 78296 -274967 -164279 -119840 -150312 -129060 56544 -620714 -213851 67084 363427 -194834
9857 -33351 13558 16695 -101754 -124311 72307 -39842 -218602 82398 -17095 -74303 -207096
9846b07096c713j02757C6a53856B5821M1361A765J57486g7703B73061c97836A85380
9833b93977C0039b7851B37377a28705A39424C8102b1231p9939o4061m7186e1753
9821a8514k5891q9j68090P9588A91106c9294C50540j35036d34472B33615h1540
9809b66448g755o3915c42k09045M1042g1407a2895C33973b10109F2418c03295
9797b50319B6711d31086k9372B25848b2456A75193c17311n8570g9452J8666j15714
9786a76500H94J50283a32536A88455a49586O0f4269i150H2855B2049D118J2905
9774A7023P6523C9942P429d6258B44114A3393J9993b16237l21884a38987A06045
9762a04325H0740c816k04427O9572C45082j05696d3347j88027B73240c46226P901
$$ plain form
9846 -207096 -3713 -106470 36 -153856 25821 67182 1765 159251 -77703 273061 -397836 185380
9833 -293977 30039 -27851 237377 -128705 139424 38102 -21231 -101170 -165231 -212417 -51753
9821 -18514 -44405 -44494 -212584 -132996 191106 -39294 350540 215504 -434472 233615 -81540
9809 -266448 -7755 -71670 -342 -209387 -168345 -71407 -12895 333973 -210109 62418 -303295
9797 -250319 26711 -431086 -460458 225848 -22456 175193 -317311 -375881 -79452 -60786 -176500
9786 -176500 894 151177 -132536 188455 -149586 -149526 -64269 -9150 82855 22049 4118 17023
9774 17023 93546 39942 47371 -46258 244114 13393 33386 -216237 -538121 -138987 106045
9762 -104325 80740 -3816 -208243 -138671 345082 239386 -43347 -231374 273240 -346226 -338325
9751c38325e5191D867N9977a10771j55839c0435j58768N3540j14531A90130b51264
9739b13956Q4979j354B20170b53550i1815r4986h4171j70410j52817j9678a8416
9727A8877J62806b11274a02815F3613Q1058b03135B42057c26878A81269b64712
9716A9324g0197j10609D3256a48575e7856o6694M7615A62813K41019A79149O0563
9705B39712j18310g4295D0332a68813C0105a55299M2236E5494b28167B94496a28405
9693A20878b25605I7913a79967j39956J57719g0234I792a36334k93j29792E1336
9681b09889l1430f078B01265b32349F3092R220e2518C839M5540J85548i2801c4201
9668h3235B58465e7922O205B244d59760B48308A8749R516g2787k13729A7602d9435
$$ plain form
9751 -338325 -55191 4867 64844 -110771 -266610 -30435 -189203 -135663 -250194 190130 -251264
9739 -213956 -128977 -130331 220170 -253550 -91815 -186801 -84171 -254581 -407398 -427076 -18416
9727 18877 181683 -211274 -102815 63613 144671 -203135 242057 -326878 181269 -264712
9716 19324 -70197 -180806 43256 -148575 -57856 -124550 -76935 162813 403832 179149 239712
9705 239712 121402 -74295 40332 -168813 30105 -155299 -113063 55494 -228167 294496 -128405
9693 120878 -225605 97913 -179967 -319923 -162204 -70234 9792 -136334 -136627 -266419 51336
9681 -209889 -241319 -6078 201265 -232349 63092 72312 -52518 3839 49379 234927 -92801 -34201
9668 -83235 258465 -57922 -51717 2244 -459760 248308 18749 28265 -72787 -286516 17602 -49435
9655B5544O4335a66663q0514F0779k6499J65307p6451K5322g4541k15136J527
9644b88150h2501C68676h2252j42978b0677I3805a44882q943q4239J05836n9462
9633a91690f4375j29408h175B41173a33930D1455A9184a99107R4167B89570A10263
9621d12343A01931b41007J0553a12735L4851A51469M2365c30916a02338A99242
9610e3223F001a94525g031k30673C279b3191j90036H8980a0646m907l54432a00055
9597c48381J37407n0918l26313C47126c31110h9477A89749a73199E8866b29842
9586a55127j09378R5175b6808n5642q9693p9296k12053d1189j82857d9726k61964
9575c11690a1849r1886r9206C0174f7701A7339a41318B5952L2264R9648b82182
$$ plain form
9655 25544 89879 -166663 -247177 60779 34280 199587 123136 148458 -74541 -289677 -288150
9644 -288150 -82501 368676 -82252 -225230 -20677 93805 -144882 -153825 -238064 -132228 -191690
9633 -191690 -64375 -193783 -8175 241173 -133930 41455 19184 -199107 -104940 289570 110263
9621 -412343 101931 -241007 -230454 -112735 -77884 151469 193834 -330916 -102338 199242
9610 -53223 6001 -194525 -7031 -237704 3279 -23191 -213227 88980 -10646 -15553 -369985 -100055
9597 -348381 -210974 -261892 -588205 347126 -331110 -89477 189749 -173199 58866 -229842
9586 -155127 -264505 -169330 -26808 -82450 -172143 -251439 -463492 -41189 -224046 -49726 -311690
9575 -311690 -11849 -103735 -202941 30174 -67701 17339 -141318 25952 58216 157864 -282182
9563I8733a96677K2799H0335e8756K3630j55435d2063A81104f7216K8481B30546
9551a25349j04895F2339c3638E7177c25569a54280B05264b94374A99951d3619
9540e4321C9538b1139C6049N0712a92788B6031b00865A57885O4051e8930A34588
9528I2568k9657M2793a80396O4643k2253o9135B48462A17044f8073A44474C4790
9516d36517P5627C2729L21670a53553q3238I9771R750n2409c10045B4840K24687
9505B49527a97906D9490R4745l3475l9765P3098b88010J03482Q7488m5196m8728
9494a90964D0139i6963l13909o9344R9548J11671d5092A64935A7475J35255d045
9482A99469b82083d5382L33k47068k90601b23084R5072M9411m3600k1586a7944
$$ plain form
9563 98733 -196677 -173878 80335 -58756 -35126 -190561 -42063 181104 -67216 -38735 230546
9551 -125349 -230244 62339 -33638 57177 -325569 -154280 205264 -294374 199951 -43619
9540 -54321 39538 -21139 36049 86761 -192788 26031 -200865 157885 221936 -58930 134588
9528 92568 62911 105704 -180396 -115753 -138006 -207141 248462 117044 -68073 144474 34790
9516 -436517 -360890 32729 354399 -153553 -236791 99771 109521 57112 -310045 24840 249527
9505 249527 -197906 49490 144235 110760 70995 144093 -288010 -184528 -97040 -142236 -190964
9494 -190964 40139 -96963 -410872 -480216 -380668 -268997 -45092 164935 17475 152730 -4045
9482 199469 -282083 -45382 -45049 -292117 -582718 -223084 -128012 -78601 -122201 -143787 -17944
9470b5681j51917k18210H2637a20554K8451m1158A69640a16879j7226A38252a58955
9458c83482B0783J96886H0819a71832L2106C5439b28492B5685J00547d19996B06040
9446i3885n4880d1411j58502A4108a65010k92842J93737H8856i4889D41859a99310
9434A59926g9827J4115j44430B21694B3586J60692b60029C36633a90730m9137
9424b39867C37833a46460A60799a40901A31081i6564H4713c05954a6914A99698
9413E0988a87128Q4871j5904E9412L4605M1514B2676b60978B2376f5740B82249
9401b36209P7880N0962k9117C8498d36550a74225E5781c55462B3770a2421A49853
9389D4175c93041a07360B38729a03244C76907a13907j47376b7867N687f160o8302
$$ plain form
9470 -25681 -177598 -395808 82637 -120554 -92103 -133261 169640 -116879 -134105 138252 -158955
9458 -383482 20783 217669 80819 -171832 -139726 35439 -228492 25685 126232 -419996 206040
9446 -93885 -148765 -41411 -199913 14108 -165010 -457852 -264115 88856 -94889 441859 -199310
9434 159926 -79827 -65712 -210142 221694 23586 184278 -260029 336633 -190730 -239867
9424 -239867 337833 -146460 160799 -140901 131081 -96564 84713 -305954 -16914 199698
9413 50988 -187128 -102257 -118161 59412 94017 135531 22676 -260978 22376 -65740 282249
9401 -236209 -158329 -107367 -136484 38498 -436550 -174225 55781 -355462 23770 -12421 149853
9389 44175 -393041 -107360 238729 -103244 376907 -113907 -261283 -27867 -22180 -6160 -74462
9378g4462G6472b6982A07519g10j35637H3875b45340a00519A09022c61889i8993
9366b28390D3015M263c4547A43225C4321J05502b774j00291I5851e3251I0180
9354a04705j80513H8394b40015f5770A55164i0838c3862k40855B7336b74898F2853
9342a45593B43896c68880F8048J43041a31828e9421o06j33064A09679a97005K7929
9331a69076D86932a00780A49583c9463j34329M7439O2306F6489K41096j30821
9321A76764a17442I2483M8792c92110A6264a09143J7510A46904e3162j49162j71769
9310c74093B11290b43407A65635b26108r665B84380a85155j770A87284b20456
9299a01579A26211l4484b43527a920n9537A21985a54099j05114k51009K20099
$$ plain form
9378 -74462 76472 -26982 107519 -710 -136347 83875 -245340 -100519 109022 -361889 -98993
9366 -228390 43015 47278 -34547 143225 34321 139823 -2774 -103065 95851 -53251 90180
9354 -104705 -285218 88394 -240015 -65770 155164 -90838 -33862 -274717 27336 -274898 62853
9342 -145593 243896 -368880 68048 211089 -131828 -59421 -60027 -193091 109679 -197005 -169076
9331 -169076 486932 -100780 149583 -39463 -173792 -126353 -64047 66489 307585 176764
9321 176764 -117442 92483 141275 -392110 16264 -109143 -91633 146904 -53162 -202324 -374093
9310 -374093 211290 -243407 165635 -226108 -235773 284380 -185155 -186925 187284 -220456
9299 -101579 126211 91727 -243527 -1920 -61457 121985 -154099 -259213 -510222 -290123
9289b90123B96812i5878A59030a95152E4298a99850A24956a11770l977j11557
9279b27304B54845A02812a50814f3995H6339a43111b0161P716B13969G206a94518
9267C5710a81431d0355D3119c00416G8639J88126a17983B9265Q7450a91835B76248
9255B98217b358k9555j01491m3472O5810j79170g3017j1121L3399H297i3870r110
9243a02980b9864k36130E9534J65094b60853i0180G4820C5615N0036L8244j3679
9232A10216d05122a31812c552I6527a90976j46843J27118A62844c12990B34876
9221B36341a85694l0214P6066A64762J6743b83085P0767A35124M2244L39773a10163
9209A74681D7602K4863g0220B9332f7485m9356M5590b2155o1997j04694B65435
$$ plain form
9289 -290123 296812 -95878 159030 -195152 54298 -199850 124956 -111770 -115747 -227304
9279 -227304 254845 102812 -150814 -63995 86339 -143111 -20161 -12445 213969 7206 -194518
9267 35710 -181431 -40355 43119 -300416 78639 266765 -117983 29265 116715 -191835 276248
9255 298217 -2358 -31913 -133404 -176876 -111066 -290236 -73017 -84138 -50739 8297 -93870 -102980
9243 -102980 -29864 -265994 59534 224628 -260853 -90180 74820 35615 85651 123895 110216
9232 110216 -405122 -131812 -3552 96527 -190976 -337819 -210701 162844 -312990 234876
9221 236341 -185694 -215908 -139842 164762 181505 -283085 -212318 135124 177368 517141 -110163
9209 174681 47602 72465 -70220 29332 -67485 -116841 -71251 -22155 -84152 -188846 265435
9197H0186d12981K06031C65561a7170B05175c32223h2482k20787c8406r8847F6725
9185A41260L0493F563c0349B49685E1171N3858f4799B65267I0786J1008b71486
9173d3701p3015M4584b4581n9856b9444k26327b4957k93164O7916P3632k6578
9162b03151C50592b24917A40226b20807B3178a48908A2066P806L5382B2327e1890
9150a26462A04975b33883m0529D3598e9240r7024G615a88587C12666h5564o8550
9139a54114A93964a93802E521a55096A28371L4052o7613e1666E3379f4242k96515
9128c60757g1810k9521A2791a20307m4898g7785a4275r2579B75000c49984B22335
9116a83556g6811j04018B78650D6780r789N2079C8547a78149B51043b2207j41919
$$ plain form
9197 80186 -412981 -206950 365561 -17170 205175 -332223 -82482 -303269 -38406 -137253 66725
9185 141260 171753 6563 -30349 249685 51171 105029 -64799 265267 90786 101794 -271486
9173 -43701 -116716 -72132 -24581 -84437 -29444 -255771 -24957 -318121 -250205 -176573 -203151
9162 -203151 350592 -224917 140226 -220807 23178 -148908 12066 19872 55254 22327 -51890
9150 -126462 104975 -233883 -274412 43598 -59240 -156264 7615 -188587 312666 -85564 -154114
9139 -154114 193964 -193802 5521 -155096 128371 162423 94810 -51666 53379 -64242 -360757
9128 -360757 -71810 -101331 12791 -120307 -165205 -77785 -14275 -106854 275000 -349984 222335
9116 -183556 -76811 -180829 278650 46780 36991 89070 38547 -178149 251043 -22207 -164126
9105a64126j61268N4613A32569e9770k47048B8747b55955J11567n8609O7869k85123
9094d20251I5952a38790r653A58408c24644A40347b26630A6485c27342A4642a64612
9082a98570k59910A19459a99592A41977b63905h3156A18385g2687k852c0381j50111
9071a80492A86118C2404J12726a01219c0518F3981J06655h5486P106m2915A88370
9059A12272b60277P2227A2365K56610j04521J76791b92777k2629O9684A01073
9048A18126h1981C5138b10966h7328j0253p9750K2549N471A23054d02679e6209
9036A34184a72955A27085b09968M005B8183m550a29286j3229J6678k984b836A2936
9023a53685n194B88877f3971B58214q4787f0994B13737i5193l8447C39638A09499
$$ plain form
9105 -164126 -325394 -270781 132569 -59770 -306818 28747 -255955 -144388 -202997 -135128 -420251
9094 -420251 95952 -138790 -148443 158408 -324644 140347 -226630 16485 -327342 14642 -164612
9082 -198570 -458480 119459 -199592 141977 -263905 -83156 118385 -72687 -75539 -30381 -180492
9071 -180492 186118 32404 145130 -101219 -30518 63981 170636 -85486 -78380 -121295 188370
9059 112272 -260277 -188050 12365 268975 164454 341245 -292777 -315406 -245722 101073
9048 118126 -81981 35138 -210966 -87328 -97581 -177331 -154782 -149311 123054 -402679 -56209
9036 134184 -172955 127085 -209968 -205963 28183 23633 -129286 -142515 -125837 -128821 -2836 12936
9023 -153685 -158879 288877 -63971 258214 173427 -60994 213737 -95193 -133640 339638 109499
9011a53943Q711k2611A77130C4358L17584C2035c71233A32098d5307B61789n0274
9000B11515a51889k03491A26051a36543m3728B36157c19908F944c19395P9663
8990b39732C0726a35600b6758A77084b90466g4486C3526c25253a17877R896m0830
8979a48811j41672B35958b21214i7839j20046A23550b1056b761C46960H7771i509
8967a45947K2170J8515L0282C6105I932h1355D7450d8245A39973a10145n2718
8956a62863D5954g9428q2092A47974o3439J51337F2038a07308E4778a76222P6476
8945i9746H9116a92165C77673F5890J74709B2410O6282O9271M3303n1014C4155
8933I9862l3128K92544j44942a19407c8893Q368A64521J89687O9463P09167J375426
$$ plain form
9011 -153943 -145232 -167843 177130 34358 351942 32035 -371233 132098 -45307 261789 211515
9000 211515 -151889 -355380 126051 -136543 -180271 236157 -319908 6944 -319395 -239732
8990 -239732 30726 -135600 -26758 177084 -290466 -74486 33526 -325253 -117877 -107981 -148811
8979 -148811 -290483 235958 -221214 -97839 -217885 123550 -21056 -2761 346960 87771 -9509
8967 -145947 -123777 -105262 -74980 36105 9932 -81355 47450 -48245 139973 -110145 -162863
8956 -162863 45954 -79428 -161520 147974 84535 235872 62038 -107308 54778 -176222 -99746
8945 -99746 89116 -192165 377673 65890 240599 22410 88692 157963 201266 150252 34155
8933 99862 66734 359278 214336 -119407 -38893 -30525 164521 354208 423671 1132838 2508264
8922B508264O069839J0001584G188949A793015H33556C34191j17259E5111p943
8913D7168a3574k60614A12169a23791c0074B99473j21618c3483A12572a5355K238
8902a3117l82490i9180q8320k08051C17037c18642c5493n7460D5006a37548c2354
8890a64700j2258j69933J50969A6516d3121n3012l1067d2819H5941h8193k7784
8879a15977j3388C345a57715k37077B07182b06376j31480j9513a78016a5043I1531
8867b21380C5613A5394b64592Q1608d8844H9239i3128d981j31910K7251A02300
$$ plain form
8922 2508264 8578103 18579687 7188949 1793015 833556 334191 216932 55111 47168
8913 47168 -13574 -274188 112169 -123791 -30074 299473 177855 -33483 112572 -15355 -13117
8902 -13117 -395607 -99180 -187500 -395551 317037 -318642 -35493 -92953 45006 -137548 -32354
8890 -164700 -176958 -346891 -195922 16516 -43121 -96133 -127200 -42819 85941 -88193 -115977
8879 -115977 -129365 3345 -157715 -394792 207182 -206376 -337856 -357369 -178016 -15043 91531
8867 -221380 35613 15394 -264592 -182984 -48844 89239 -93128 -4981 -136891 -109640 102300
$$ [...]
##END NTUPLES=NMR SPECTRUM
##END=
