
##TITLE=UV1217_M5_1296-1170_30_7229326_oI9TZXSJEr
##JCAMPDX= 6.0         $$ Bruker NMR JCAMP-DX V2.0
##DATA TYPE= NMR SPECTRUM
##DATA CLASS= NTUPLES
##ORIGIN= BRUKER
##OWNER= Administrator
$$ 1.72 TOPSPIN		Version 2.1
$$ 2013-01-18 01:52:32.867 -0500  Administrator@X
$$ Compression mode = diff/dup
##.OBSERVE FREQUENCY= 400.02188249412
##.OBSERVE NUCLEUS= ^1H
##.ACQUISITION MODE= SIMULTANEOUS (DQD)
##.ACQUISITION SCHEME= undefined
##.AVERAGES= 8
##.DIGITISER RES= 22
##SPECTROMETER/DATA SYSTEM= spect
##.PULSE SEQUENCE= zg30
##.SOLVENT NAME= COFFEE_meoh
##.SHIFT REFERENCE= INTERNAL, COFFEE_meoh, 1, 14.98509
##AUDIT TRAIL= $$ (NUMBER, WHEN, WHO, WHERE, PROCESS, VERSION, WHAT)
$$ ##TITLE= Audit trail, TOPSPIN		Version 2.1
$$ ##JCAMPDX= 5.01
$$ ##ORIGIN= Bruker BioSpin GmbH
$$ ##OWNER= Administrator
$$ $$ E:\/data/COFFEE/nmr/UV1217_M5_1296-1170_30_7229326_oI9TZXSJEr/30/pdata/1/auditp.txt
$$ ##AUDIT TRAIL=  $$ (NUMBER, WHEN, WHO, WHERE, PROCESS, VERSION, WHAT)
(   1,<2013-01-18 01:52:24.821 -0500>,<Administrator>,<X>,<go>,<TOPSPIN 2.1>,
      <created by zg
	started at 2013-01-18 01:51:18.742 -0500,
	POWCHK enabled, PULCHK disabled,
       configuration hash MD5:
       86 BA 57 50 F2 9D 5C 9B 26 00 A9 28 5F 66 2E 89
       data hash MD5: 64K
       3A 0D 31 D2 31 9E 5B B4 9E 69 AF 78 47 23 20 FE>)
(   2,<2013-01-18 01:52:27.867 -0500>,<Administrator>,<X>,<proc1d>,<TOPSPIN 2.1>,
      <Start of raw data processing
       efp LB = 0 FT_mod = 6 PKNL = 1 PHC0 = 0 PHC1 = 0 SI = 32K 
       data hash MD5: 32K
       51 08 1D 02 D1 06 33 7D E7 D6 A8 C6 63 A5 02 04>)
(   3,<2013-01-18 01:52:28.336 -0500>,<Administrator>,<X>,<proc1d>,<TOPSPIN 2.1>,
      <pk PHC0 = 96.07544 PHC1 = 0 
       data hash MD5: 32K
       4B C2 EE E9 E4 D1 25 26 DC 19 D4 F3 21 BF ED 91>)
(   4,<2013-01-18 01:52:28.555 -0500>,<Administrator>,<X>,<proc1d>,<TOPSPIN 2.1>,
      <abs ABSG = 1 
       data hash MD5: 32K
       F9 67 65 78 45 9F D4 A1 DB 8A FD A2 E0 8E FE AE>)
(   5,<2013-01-18 01:52:28.711 -0500>,<Administrator>,<X>,<proc1d>,<TOPSPIN 2.1>,
      <abs ABSG = 2 
       data hash MD5: 32K
       AE E2 D5 04 6C CE 5E 07 F2 2B 5E 12 56 BC BE CA>)
(   6,<2013-01-18 01:52:28.852 -0500>,<Administrator>,<X>,<proc1d>,<TOPSPIN 2.1>,
      <abs ABSG = 3 
       data hash MD5: 32K
       2E 33 30 01 C0 5E A4 EE 0C F0 D5 E1 FB FA A3 92>)
(   7,<2013-01-18 01:52:28.992 -0500>,<Administrator>,<X>,<proc1d>,<TOPSPIN 2.1>,
      <abs ABSG = 4 
       data hash MD5: 32K
       47 C4 E4 0E B1 C3 6A BC 08 A4 23 1F 1A 68 C5 57>)
(   8,<2013-01-18 01:52:29.133 -0500>,<Administrator>,<X>,<proc1d>,<TOPSPIN 2.1>,
      <abs ABSG = 5 
       data hash MD5: 32K
       D5 57 6E E6 2F EC D9 32 DF B8 55 FC 6B 1E 66 D8>)
$$ ##END=
$$ 
$$ $$ hash MD5
$$ $$ 9B F6 14 7B B8 01 BB 65 4C 7F F2 C5 A5 1E E1 39
##$RELAX= 
##$RELAX= 
##$RELAX= 
##$RELAX= 
##$RELAX= 
##$RELAX= 
##$RELAX= 
$$ Bruker specific parameters
$$ --------------------------
##$DU= <E:\>
##$EXPNO= 30
$$ [...]
##$TP= (0..7)
150 150 150 150 150 150 150 150
##$TP07= 0
##$TPNAME0= <>
##$TPNAME1= <>
##$TPNAME2= <>
##$TPNAME3= <>
##$TPNAME4= <>
##$TPNAME5= <>
##$TPNAME6= <>
##$TPNAME7= <>
##$TPOAL= (0..7)
0.5 0.5 0.5 0.5 0.5 0.5 0.5 0.5
##$TPOFFS= (0..7)
0 0 0 0 0 0 0 0
##$TUNHIN= 0
##$TUNHOUT= 0
##$TUNXOUT= 0
##$USERA1= <user>
##$USERA2= <user>
##$USERA3= <user>
##$USERA4= <user>
##$USERA5= <user>
##$V9= 5
##$VALIST= <valist>
##$VCLIST= <CCCCCCCCCCCCCCC>
##$VD= 0
##$VDLIST= <DDDDDDDDDDDDDDD>
##$VPLIST= <PPPPPPPPPPPPPPP>
##$VTLIST= <TTTTTTTTTTTTTTT>
##$WBST= 1024
##$WBSW= 4
##$XGAIN= (0..3)
0 0 0 0
##$XL= 0
##$YL= 0
##$YMAX_a= 687284
##$YMIN_a= -583143
##$ZGOPTNS= <>
##$ZL1= 120
##$ZL2= 120
##$ZL3= 120
##$ZL4= 120
##$ABSF1= 14.98509
##$ABSF2= -5.573092
##$ABSG= 5
##$ABSL= 3
##$ALPHA= 0
##$AQORDER= 0
##$ASSFAC= 0
##$ASSFACI= 0
##$ASSFACX= 0
##$ASSWID= 0
##$AUNMP= <proc_prof1d_extract_pilot.lims>
##$AXLEFT= 0
##$AXNAME= <>
##$AXNUC= <1H>
##$AXRIGHT= 0
##$AXTYPE= 0
##$AXUNIT= <>
##$AZFE= 0.1
##$AZFW= 0.1
##$BCFW= 0
##$BC_mod= 0
##$BYTORDP= 0
##$COROFFS= 0
##$CY= 15
##$DATMOD= 1
##$DC= 0
##$DFILT= <>
##$DTYPP= 0
##$F1P= 0
##$F2P= 0
##$FCOR= 0.5
##$FTSIZE= 32768
##$FT_mod= 6
##$GAMMA= 0
##$GB= 0
##$INTBC= 1
##$INTSCL= 1
##$ISEN= 128
##$LB= 0
##$LEV0= 0
##$LPBIN= 0
##$MAXI= 10000
##$MC2= 0
##$MEAN= 0
##$ME_mod= 0
##$MI= 0
##$NCOEF= 0
##$NC_proc= -8
##$NLEV= 6
##$NOISF1= 0
##$NOISF2= 0
##$NSP= 0
##$NTH_PI= 0
##$NZP= 0
##$OFFSET= 14.98509
##$PC= 1
##$PHC0= 96.07544
##$PHC1= 0
##$PH_mod= 1
##$PKNL= yes
##$PPARMOD= 0
##$PPDIAG= 0
##$PPIPTYP= 0
##$PPMPNUM= 2147483647
##$PPRESOL= 1
##$PSCAL= 4
##$PSIGN= 0
##$PYNMP= <proc.py>
##$REVERSE= no
##$SF= 400.02
##$SI= 32768
##$SIGF1= 0
##$SIGF2= 0
##$SINO= 400
##$SIOLD= 32768
##$SPECTYP= <>
##$SREGLST= <1H.CDCl3>
##$SSB= 0
##$STSI= 32768
##$STSR= 0
##$SW_p= 8223.68421052631
##$SYMM= 0
##$S_DEV= 0
##$TDeff= 65536
##$TDoff= 0
##$TI= <>
##$TILT= no
##$TM1= 0
##$TM2= 0
##$TOPLEV= 0
##$USERP1= <user>
##$USERP2= <user>
##$USERP3= <user>
##$USERP4= <user>
##$USERP5= <user>
##$WDW= 1
##$XDIM= 32768
##$YMAX_p= 474244903
##$YMIN_p= -769345
##$CURPLOT= <Network HP LaserJet P1505>
##$CURPRIN= <$Network HP LaserJet P1505>
##$DFORMAT= <normdp>
##$LAYOUT= <+/1D_H.xwp>
##$LFORMAT= <normlp>
##$PFORMAT= <normpl>
##$SURQMSG= 1
$$ End of Bruker specific parameters
$$ ---------------------------------
##NTUPLES= NMR SPECTRUM
##VAR_NAME=  FREQUENCY,     SPECTRUM/REAL,   SPECTRUM/IMAG
##SYMBOL=    X,             R,               I
##VAR_TYPE=  INDEPENDENT,   DEPENDENT,       DEPENDENT
##VAR_FORM=  AFFN,          ASDF,            ASDF
##VAR_DIM=   32768,         32768,           32768
##UNITS=     HZ,            ARBITRARY UNITS, ARBITRARY UNITS
##FACTOR=    0.250966925370066, 1,           1
##FIRST=     8223.43324360094, -19692,       52384
##LAST=      0,             -71396,          111261
##MIN=       0,             -769345,         0
##MAX=       8223.43324360094, 474244903,    0
$$ Real data points
##PAGE= N=1
##DATA TABLE= (X++(R..R)), XYDATA
$$ [...]
19532B53570i0948n8988n4833H9194c67310Q228A77734A5282C403L30375A58310
$$ 253570 -90948 -149936 -204769 89194 -367310 -359082 177734 15282 3403 333778 158310
19520E2801a98048B00744i0525l97331c2695L238l5213k19957C6230b72302G5458
$$ 52801 -198048 200744 -90525 -487856 -32695 -29457 -64670 -284627 36230 -272302 75458
19508h7731j7810j86053a32438F1496k9761h4572E8695J15945b2205B28698A11483
$$ -87731 -105541 -291594 -132438 61496 31735 -84572 58695 174640 -22205 228698 111483
19496b57420B34362a83576K4528F219c9102C1765J81687b18868j80480d8941A073
$$ -257420 234362 -183576 -159048 6219 -39102 31765 213452 -218868 -399348 -48941 1073
19484A98252p9864a15515A65710m1533d4798A80964L8957g9613c2304k94885b954
$$ 198252 118388 -115515 165710 124177 -44798 180964 219921 -79613 -32304 -327189 -2954
19472a64284P8112l51845A81177k5131b68919h5645L7899A15237b73659A53787
$$ -164284 -86172 -438017 181177 156046 -268919 -85645 -47746 115237 -273659 153787
19461c97859M524O9023f2869k52506M7149E7341M6645b16806j24851J26437h3709
$$ -397859 -393335 -324312 -62869 -315375 -268226 57341 103986 -216806 -341657 -215220 -83709
19449b21935p0691C621d4522C8215J46627F1217a59898B9193d6284j98234l1525
$$ -221935 -292626 3621 -44522 38215 184842 61217 -159898 29193 -46284 -244518 -276043
19438b76043i6849I9567c11580a01442B2070d42151B98585j12784A36c1424l93710
$$ -276043 -96849 99567 -311580 -101442 22070 -442151 298585 185801 136 -31424 -425134
19427d25134a65500d9685l09172B381a88200e4621B36350J703p4089h3009A07199
$$ -425134 -165500 -49685 -358857 2381 -188200 -54621 236350 238053 163964 -83009 107199
19415C95500a64482A3263b62821c7153j75582G682a65009k450G582J54770o4841
$$ 395500 -164482 13263 -262821 -37153 -212735 7682 -165009 -167459 7582 162352 97511
19404I7511a05319C0089b10272l9014i5296B78521G3532J6027C0978J1640K8976
$$ 97511 -105319 30089 -210272 -249286 -95296 278521 73532 89559 30978 42618 71594
19393G1594G48a51820A2790c09063A63210n4303K3806a07091j15473a02286j72743
$$ 71594 748 -151820 12790 -309063 163210 108907 132713 -107091 -222564 -102286 -275029
19382b75029P2422c6973B92034j38929b4215k27871g0741j41408a05227m1026
$$ -275029 -202607 -36973 292034 153105 -24215 -252086 -70741 -212149 -105227 -146253
19372a46253E7334b65184a26198A9259a75143A34122a4073B54806A8347a21649
$$ -146253 57334 -265184 -126198 19259 -175143 134122 -14073 254806 18347 -121649
19361a6369j5687j58937C543P4029c28245J12391E3599b32835j3843n121F0978
$$ -16369 -32056 -190993 3543 77572 -328245 -215854 53599 -232835 -246678 -251799 60978
19349A0717J3904N9371r64i4665j0112k22434A32016C201J31689c93941a03620
$$ 10717 24621 83992 83028 -94665 -104777 -327211 132016 3201 134890 -393941 -103620
19337a96648A75791h41l12765D27193c6081B98192b79834A72762I150a04457n3405
$$ -196648 175791 -841 -313606 427193 -36081 298192 -279834 172762 9150 -104457 -157862
19326a57862K4829A17018a75729A8938J8571a95423m4577G5004b65970J32591
$$ -157862 -133033 117018 -175729 18938 37509 -195423 -240000 75004 -265970 -133379
19316a33379f0089m4166B88421b56027A65945A3828a71867i911E9444P8556b87262
$$ -133379 -60089 -104255 288421 -256027 165945 13828 -171867 -9911 59444 138000 -287262
19304E66442a40898j94042B04580a36627j55351D9461c2363k9876p6388B68219
$$ 566442 -140898 -334940 204580 -136627 -291978 49461 -32363 -62239 -138627 268219
19293A4112a04765j54521k85728J43564J16097b1608k32890a591A054P0947c013
$$ 14112 -104765 -259286 -545014 -401450 -285353 -21608 -254498 -1591 1054 72001 -3013
19281b22888e0452A27404b44955A14178h9840m5237M741l94623a4361p5367b5898
$$ -222888 -50452 127404 -244955 114178 -89840 -135077 -130336 -524959 -14361 -89728 -25898
19269c65080A7530N9761C0540a22361l4108a1073r8743M4843j50892a03531j320
$$ -365080 17530 77291 30540 -122361 -156469 -11073 -109816 -64973 -215865 -103531 -104851
19258a04851j51904g0327j11173H9084a94740b7362J2428B6058a31277D7990H709
$$ -104851 -256755 -70327 -181500 89084 -194740 -27362 -14934 26058 -131277 47990 8709
19246b81615F1380J7456c23285h8765j24541N0710F9413j7964e8774L806A9750
$$ -281615 61380 78836 -323285 -88765 -213306 -162596 69413 51449 -58774 -54968 19750
19234G8706c45804B3228i3684B47710a81689A52951J56252h0733j49617j28552
$$ 78706 -345804 23228 -93684 247710 -181689 152951 309203 -80733 -230350 -358902
19224c58902B8151K4235a08359K0221n1209J6687j4422D5707K3601A0526b06996
$$ -358902 28151 52386 -108359 -88138 -139347 -122660 -137082 45707 69308 10526 -206996
19212E0114b25706A1215l548b09235c7633j2528A08603a28486F8627b75603P7357
$$ 50114 -225706 11215 7667 -209235 -37633 -50161 108603 -128486 68627 -275603 -198246
19201a98246A13435a3800H2076j8875f5905j32167p5087j6224B9834n389b2084
$$ -198246 113435 -13800 82076 63201 -65905 -198072 -273159 -289383 29834 24445 -22084
19189A85054f4662n700m2389C0792d1130A4823b1902l33879n527c6890q4123A19218
$$ 185054 -64662 -70362 -112751 30792 -41130 14823 -21902 -355781 -361308 -36890 -121013 119218
19176b08535P8012p1404A53388l9123m8993C2195J65639b02057P8779r3061m5164
$$ -208535 -130523 -201927 153388 114265 65272 32195 197834 -202057 -123278 -216339 -261503
19165b61503L0125D2672a71079E1039b1443o5564j30038F7544K06625c4986l9156
$$ -261503 -231378 42672 -171079 51039 -21443 -87007 -217045 67544 274169 -34986 -74142
19154g4142q0301f5979C26705b90484a19557C8087c5588B32545b08148l2906j01973
$$ -74142 -154443 -65979 326705 -290484 -119557 38087 -35588 232545 -208148 -241054 -343027
19143c43027G5123d6014n3735A5302f2390A33713b16266R6073M7577A6842a5292
$$ -343027 75123 -46014 -99749 15302 -62390 133713 -216266 -120193 -72616 16842 -15292
19131C72606A42892o3657a75654A71770a74679O7513C0640O4487N19a1619l0776
$$ 372606 142892 79235 -175654 171770 -174679 -107166 30640 95127 95646 -11619 -42395
19120d2395B83140i7319L3888A07452i8158C6163J4574h2494j94966A938b83441
$$ -42395 283140 -97319 -63431 107452 -98158 36163 50737 -82494 -277460 1938 -283441
19108h9845j28884Q079B60096p9305c91890e6209l56603e9970J6041j66094e2048
$$ -89845 -218729 -210650 260096 180791 -391890 -56209 -412812 -59970 -43929 -210023 -52048
19096A4480b43086g2979A05529g3528j41383j75333a21510A68951E6487Q3981
$$ 14480 -243086 -72979 105529 -73528 -214911 -390244 -121510 168951 56487 140468
19086A40468a08582A6780i8197j02830B2901O7537a88498P3766k68508B06083
$$ 140468 -108582 16780 -98197 -201027 22901 90438 -188498 -114732 -383240 206083
19075A4457L39364b15970A98347b252j85246C46556A48485K34236a1651B27395
$$ 14457 353821 -215970 198347 -2252 -187498 346556 148485 382721 -11651 227395
19064d8370A79058b26343B35695K1151j02210b44694i6666j45613i5222A7773
$$ -48370 179058 -226343 235695 256846 154636 -244694 -96666 -242279 -95222 17773
19053A8778b7791n0505c8107m1279J7737l24287A29573O9700a43629A33819c02296
$$ 18778 -27791 -78296 -38107 -79386 -61649 -385936 129573 199273 -143629 133819 -302296
19041A03304J397a30584B6315R0325Q3844C0541c9189l4331r7142k33520A35509
$$ 103304 104701 -130584 26315 116640 200484 30541 -39189 -73520 -170662 -404182 135509
19029f4556j95053J01638c421A36251K16928j07359D0146c86442g0869A9653a51057
$$ -64556 -259609 -157971 -3421 136251 353179 245820 40146 -386442 -70869 19653 -151057
19017A41975b4889i114A3926b02368B53019b51596J17921C5931a57309A8312g0969
$$ 141975 -24889 -9114 13926 -202368 253019 -251596 -133675 35931 -157309 18312 -70969
19005b42473J07841d5357r3607k29395h6088B53733b17229A0575b36830O2055
$$ -242473 -134632 -45357 -138964 -368359 -86088 253733 -217229 10575 -236830 -174775
18995a74775H9927J0401a09530l7147e3068b5120A16300a52618C5128c05244F1924
$$ -174775 89927 100328 -109530 -146677 -53068 -25120 116300 -152618 35128 -305244 61924
18983h350m6436k95723L5886a6947o96l11653H3782B5288e132q2379o7559I9024
$$ -8350 -54786 -350509 -314623 -16947 -17643 -329296 83782 25288 -5132 -87511 -155070 99024
18970f3203p8101H7817i9754F1086a20152k07311R6256F8436c2258E4716g052
$$ -63203 -141304 87817 -99754 61086 -120152 -327463 -231207 68436 -32258 54716 -7052
18958A28662o3350b73096d8899r3138E8012J39110c59806B47502a72334i082B43178
$$ 128662 65312 -273096 -48899 -142037 58012 197122 -359806 247502 -172334 -9082 243178
18946d3783k28383F2265K2224K9132f349C29077b02098j11295A63578a28042j3805
$$ -43783 -272166 62265 84489 113621 -6349 329077 -202098 -313393 163578 -128042 -141847
18935a41847a5793l24221E2491a01905o0118e9359A80643a11480A92142c510j28121
$$ -141847 -15793 -340014 52491 -101905 -162023 -59359 180643 -111480 192142 -3510 -131631
18924a31631p3854I3276a70622L0230j23703F5099h7802q6127d7678F1718b32050
$$ -131631 -205485 93276 -170622 -140392 -264095 65099 -87802 -173929 -47678 61718 -232050
18912E2353b41971e20l7548G5959b45866E6865Q7586a4813A09290a20623F2953
$$ 52353 -241971 -520 -38068 75959 -245866 56865 144451 -14813 109290 -120623 62953
18900B6340J77834a90477K862b9332C29032c8327A93390k0434b79068C0196b5302
$$ 26340 204174 -190477 -187615 -29332 329032 -38327 193390 172956 -279068 30196 -25302
18888a94939j68560J80062j36515b808A03469e27726b10425B29347c78371Q4269
$$ -194939 -363499 -183437 -319952 -2808 103469 -527726 -210425 229347 -378371 -294102
18878b94102A3963a32520B36771a79295B16506a63382C5629a50269a867j86205
$$ -294102 13963 -132520 236771 -179295 216506 -163382 35629 -150269 -1867 -188072
18868a88072I8808O9080c9363B2186d48600G1821b1207k06694K4114J778B16704
$$ -188072 98808 167888 -39363 22186 -448600 71821 -21207 -227901 -203787 -202009 216704
18856d2265q5623e7647l45527C5891a09445K6752C6136L63495A19440N2017a36434
$$ -42265 -127888 -57647 -403174 35891 -109445 -82693 36136 399631 119440 171457 -136434
18844a80568k00211J39790B12973b67110F6108a04110j32648C48200m73A11566
$$ -180568 -380779 -240989 212973 -267110 66108 -104110 -236758 348200 347727 111566
18833G6862b18090j64074E3388f0942C26506n1408b41876J2236J1451A0077a45831
$$ 76862 -218090 -382164 53388 -60942 326506 275098 -241876 -229640 -218189 10077 -145831
18821I953K54454a27430K9734I170g7097j77501Q1799q030D29725h8866L5530
$$ 9953 264407 -127430 -97696 9170 -77097 -254598 -172799 -180829 429725 -88866 -53336
18810e3336A72477m8437N1393a00334a9807k17818M4403A75612a94863p8417B4999
$$ -53336 172477 124040 175433 -100334 -19807 -237625 -193222 175612 -194863 -273280 24999
18798A0239b2097j12236A11874K9728K5970K3947n667i3313n891C6983a73673
$$ 10239 -22097 -134333 111874 141602 167572 191519 185852 -93313 -99204 36983 -173673
18786h6110c4444m8372o1163c9472B0123e0517j01695g5429c7205B50789i74j17476
$$ -86110 -34444 -82816 -143979 -39472 20123 -50517 -152212 -75429 -37205 250789 -974 -118450
18774a18450r3412D41369a40774O9536B74343A25881a6777B26942a85723N2636
$$ -118450 -211862 441369 -140774 -71238 274343 125881 -16777 226942 -185723 -133087
18764a33087l54368b34801j5751i4324d0166A69429a08837r374e3279n40566b35952
$$ -133087 -487455 -234801 -250552 -94324 -40166 169429 -108837 -118211 -53279 -593845 -235952
18752B66036a30776o6775o0312a27452G2499b30567E9028a75633p1415I0796O63
$$ 266036 -130776 -197551 -257863 -127452 72499 -230567 59028 -175633 -247048 90796 91459
18741I1459K29129A7495f767q3073j96380L0432O6482g4471A54969i2219Q499
$$ 91459 320588 17495 -6767 -89840 -286220 -255788 -189306 -74471 154969 -92219 -83720
18730h3720C93513a10410j3839k08614A25247a51492r7541N3937p961N8029b0298
$$ -83720 393513 -110410 -124249 -332863 125247 -151492 -249033 -195096 -203057 -145028 -20298
18718a86880C2996a31859m8217j84021a52874j9110h1o6933H4421q134a92149
$$ -186880 32996 -131859 -180076 -364097 -152874 -171984 -81 -67014 84421 76287 -192149
18706A98914F6896f591o7280b2274k63608a32293B9488A0719b02664A76130J93975
$$ 198914 66896 -6591 -73871 -22274 -285882 -132293 29488 10719 -202664 176130 370105
18695C70105g1723C7923e2934j34743j22811d3525l01997C464c68814A3130J53340
$$ 370105 -71723 37923 -52934 -187677 -310488 -43525 -345522 3464 -368814 13130 166470
18684A66470a63033j50064a28167p209A5145p112d4040H1670l0342f9906D0729
$$ 166470 -163033 -313097 -128167 -135376 15145 8033 -44040 81670 51328 -69906 40729
18672E8001c80905a8427C5559b27374j01479A31250a52024C3002K77752l0680
$$ 58001 -380905 -18427 35559 -227374 -328853 131250 -152024 33002 310754 280074
18662B80074g4758l26793a358l16567a48047A17050J22282B0714J31474p3150
$$ 280074 -74758 -401551 -1358 -317925 -148047 117050 239332 20714 152188 79038
18652G9038K9330a04684A40647g9031j78541A75192b94529C53658a71307j50142
$$ 79038 108368 -104684 140647 -79031 -257572 175192 -294529 353658 -171307 -321449
18642c21449i8860A44330a35568M8201M480A26487C5179a98986Q6848l25068A20529
$$ -321449 -98860 144330 -135568 -87367 -82887 126487 35179 -198986 -112138 -437206 120529
18630b94062M0793c2940k61025h206m93751A65400C0075J8398g0960a6085o6608
$$ -294062 -253269 -32940 -293965 -8206 -501957 165400 30075 48473 -70960 -16085 -82693
18619h2693k34144a28569m6024K7590M5798j07298a01204A26641a61299G7630
$$ -82693 -316837 -128569 -174593 -147003 -101205 -208503 -101204 126641 -161299 77630
18608f6793L748F2164i9119j63872i4629r5086F8499R4636c30277D4564a70280
$$ -66793 -63045 62164 -99119 -262991 -94629 -189715 68499 163135 -330277 44564 -170280
18596A54498b15317D4897b35442b5249E8803a66637A72715o4286d6028l27530
$$ 154498 -215317 44897 -235442 -25249 58803 -166637 172715 108429 -46028 -373558
18586c73558d9369H7852Q0194a29881A64267b3730k03212B08657d3725F743c62859
$$ -373558 -49369 87852 168046 -129881 164267 -23730 -226942 208657 -43725 6743 -362859
18574H9831g9316A98337a18403j68820b1122j15010j23527G5979K35769b17021
$$ 89831 -79316 198337 -118403 -287223 -21122 -136132 -259659 75979 311748 -217021
18563C9300a96261e0077l25816C0126b87884A42020b49923I8067b67998m731a25448
$$ 39300 -196261 -50077 -375893 30126 -287884 142020 -249923 98067 -267998 -272729 -125448
18551E1405O7676K5167c01796B30383E3997J01269b3956A27509a40638A42827
$$ 51405 119081 144248 -301796 230383 53997 155266 -23956 127509 -140638 142827
18540a90322f4130k298A50457a31227F1508K15277b53257a11159A01400a75567
$$ -190322 -64130 -66428 150457 -131227 61508 276785 -253257 -111159 101400 -175567
18529b31941M2622B25861o2184b41828A59691J7677m2609B8936e938j0072G1024
$$ -231941 -189319 225861 163677 -241828 159691 177368 134759 28936 -5938 -16010 71024
18517a27804E322R1217c18280h1206L3728A33188N7540J11428D9954a58326K4280
$$ -127804 5322 96539 -318280 -81206 -47478 133188 190728 302156 49954 -158326 -134046
18506a34046m8812e9146j64925q4206J03470R4676q0576n4488J12143k72989a60506
$$ -134046 -182858 -59146 -224071 -308277 -204807 -110131 -190707 -245195 -133052 -406041 -160506
18494a27864J0619B18496k3613b25486J03509p698j9439p165c4833H4843c02177
$$ -127864 -117245 218496 194883 -225486 -121977 -129675 -149114 -156279 -34833 84843 -302177
18482B16193a9333A88281h4718j57498q2994J59188q5989A27944a58801b2776
$$ 216193 -19333 188281 -84718 -242216 -325210 -166022 -252011 127944 -158801 -22776
18471A5310a5737l3040j50229b1731k52713a1677H0985b41438n3592a22542c2664
$$ 15310 -15737 -48777 -199006 -21731 -274444 -11677 80985 -241438 -295030 -122542 -32664
18459G7506i5866j9577N3405E8903O1753E7300N3858r284a8375m9033G071a975
$$ 77506 -95866 -115443 -62038 58903 120656 57300 111158 101874 -18375 -67408 7071 -1975
18446c65758A67212h3714j5736C7270c93068F5869R3242g4114B31937d6822k38287
$$ -365758 167212 -83714 -99450 37270 -393068 65869 159111 -74114 231937 -46822 -285109
18435b85109a04620A39141C2085b49951f7017A4393b40488f2767B1594n855K76951
$$ -285109 -104620 139141 32085 -249951 -67017 14393 -240488 -62767 21594 15739 292690
18424B92690A05146B4064a60279k15141a13189e323l0908F2552g4598E4172b72666
$$ 292690 105146 24064 -160279 -375420 -113189 -5323 -36231 62552 -74598 54172 -272666
18412a02116D36823k16155e554A12328c07023E7847c48761A223J36157o5022b27940
$$ -102116 436823 220668 -5554 112328 -307023 57847 -348761 1223 137380 72358 -227940
18400E5514a10578A20691P7791D6902Q0464f2658k60629B73761p4831a15824E9224
$$ 55514 -110578 120691 198482 46902 127366 -62658 -323287 273761 198930 -115824 59224
18388a31232a816A62760b28197i6168q4651a8275l48439A93645a59003m4401b1920
$$ -131232 -1816 162760 -228197 -96168 -180819 -18275 -366714 193645 -159003 -203404 -21920
18376A46118a72442A31444D6091a37088A11557i0877k30454B07681B310Q2748
$$ 146118 -172442 131444 46091 -137088 111557 -90877 -321331 207681 2310 85058
18366H5058C326J98785H4238K44914d9276p0850k91295A29299k4071M4055o9037
$$ 85058 3326 202111 84238 329152 -49276 -120126 -411421 129299 105228 149283 80246
18355H0246c51794i6805K093A08621a4076A99183a22937l1971G8163J41966I6370
$$ 80246 -351794 -96805 -94712 108621 -14076 199183 -122937 -154908 78163 220129 96370
18343C1531d4811k36426B5543c8165j48861k3821E7045c35406a08720j45408f6665
$$ 31531 -44811 -281237 25543 -38165 -187026 -210847 57045 -335406 -108720 -254128 -66665
18331A18071i4322A28073O6517a18403A65978G7719i2629n6219r3672A16412c8678
$$ 118071 -94322 128073 194590 -118403 165978 77719 -92629 -148848 -242520 116412 -38678
18319a77642d3787A38517c45797J33956l37251B36545f1356j3103r1644B86343
$$ -177642 -43787 138517 -345797 -211841 -549092 236545 -61356 -74459 -166103 286343
18308a79556E5974D068R7284R6016i9607o2743r4415h6539j15903A24243J92150
$$ -179556 55974 4068 101352 197368 -99607 -162350 -256765 -86539 -202442 124243 316393
18297C16393a40405I5274h9505q3544H7736a52448l7060g0761A00816J65674C9574
$$ 316393 -140405 95274 -89505 -173049 87736 -152448 -189508 -70761 100816 266490 39574
18285C3911j761A3558J03140J9924g4736pj17312F7085B3363N205h1930A40432
$$ 33911 32150 13558 116698 136622 -74736 -74743 -192055 67085 23363 28568 -81930 140432
18272f6713B01105B5130b03974D32837b18274b4441B74621b52827e7170j38919
$$ -66713 201105 25130 -203974 432837 -218274 -24441 274621 -252827 -57170 -196089
18262a96089l02620b749k78925J00834H0949b30470j51704A32472a51102B8420
$$ -196089 -498709 -2749 -281674 -180840 80949 -230470 -382174 132472 -151102 28420
18251b04899A53152b16721M4125A92119a93097i1449k19284M4135P5865k69134
$$ -204899 153152 -216721 -172596 192119 -193097 -91449 -310733 -266598 -190733 -459867
18241d59867B39696b16552A7656a71773C4551a41791C29470m0699a8337q4096
$$ -459867 239696 -216552 17656 -171773 34551 -141791 329470 288771 -18337 -102433
18231a02433K6873C07449b34778D92668a25682m5939A74196K04128c96991A11626
$$ -102433 -75560 307449 -234778 492668 -125682 -171621 174196 378324 -396991 111626
18220i2433j12957j39995a1625j14692C63106C3475Q1149h3700C2663b64489C25154
$$ -92433 -205390 -345385 -11625 -126317 363106 33475 114624 -83700 32663 -264489 325154
18208a79401F4963K62938d41322a08831B00772C7152c2726k37597d7934b1114
$$ -179401 64963 327901 -441322 -108831 200772 37152 -32726 -270323 -47934 -21114
18197c3005d037A18296J70033D7314K13173c64680A4620K51450c08807j4454A86598
$$ -33005 -4037 118296 288329 47314 260487 -364680 14620 266070 -308807 -323261 186598
18185A21295l6421c876A44840a72458A45019A6731J4767L46515b22402b7307H6012
$$ 121295 84874 -3876 144840 -172458 145019 16731 31498 378013 -222402 -27307 86012
18173a40884e7486o8556a9882j97544A27821a56671l3007C37768I2866R223O6030
$$ -140884 -57486 -126042 -19882 -217426 127821 -156671 -189678 337768 92866 102089 168119
18162A68119b54838P1509g5517K6193D8535L07285A14196P4054c86342J09755
$$ 168119 -254838 -183329 -75517 -49324 48535 355820 114196 188250 -386342 -276587
18152b76587d7819B17519b6824G1239c0444l23413d2231R990k98765A5013b87609
$$ -276587 -47819 217519 -26824 71239 -30444 -353857 -42231 -32241 -331006 15013 -287609
18140e6140a699r4486A24010b08718F3133a9751H996K05605a46569j03314h192
$$ -56140 -1699 -96185 124010 -208718 63133 -19751 8996 214601 -146569 -249883 -8192
18128c78342A21866J62824j41438a59372G9882B003N8925c2993C7561R8534a65502
$$ -378342 121866 284690 143252 -159372 79882 2003 60928 -32993 37561 136095 -165502
18116a92426f1482E3428a74039e0486l5432D6305L12565f0779k10466B62531g3094
$$ -192426 -61482 53428 -174039 -50486 -85918 46305 358870 -60779 -271245 262531 -73094
18104H3186C1524K65582d4621F6821C3359M9188l7755K10830a60510j26737A12941
$$ 83186 31524 297106 -44621 66821 33359 82547 44792 255622 -160510 -287247 112941
18092A4635e2990m5906B55907a27630o5593d7023j34893a7280e893E2445M645
$$ 14635 -52990 -98896 255907 -127630 -193223 -47023 -181916 -17280 -5893 52445 57090
18081E7090J9225N4931E3370a83979e7317B37745D9162q376J24493a33509c5603
$$ 57090 76315 131246 53370 -183979 -57317 237745 49162 40786 165279 -133509 -35603
18069A5899K46909a61735G9854a43974I6030c07501J13641P8210l7840p0536H8138
$$ 15899 262808 -161735 79854 -143974 96030 -307501 -193860 -115650 -153490 -224026 88138
18057B3935J24796I245J8178N9154f2293j57505F0274c2477A12652d8002A41145
$$ 23935 148731 9245 27423 86577 -62293 -219798 60274 -32477 112652 -48002 141145
18045i5332B1230e9464A90678a51068B64520a15233r0243l01075i1850B24810
$$ -95332 21230 -59464 190678 -151068 264520 -115233 -205476 -506551 -91850 224810
18034a74053C9631K54191j34025J08305E6065K32992a49459B24583b02801A30424
$$ -174053 39631 293822 159797 268102 56065 289057 -149459 224583 -202801 130424
18023i3007q0094P5947j85824i1081A20352h3038j40331R9332B18331b54412N4932
$$ -93007 -173101 -97154 -282978 -91081 120352 -83038 -223369 -124037 218331 -254412 -199480
18012a99480B57155b33902C0823g1464i868l0946A9690c57333h3459A72183c404
$$ -199480 257155 -233902 30823 -71464 -9868 -40814 19690 -357333 -83459 172183 -3404
18000F869b22322A8216K71039E1534K26634I4402a53274B49841C8199C830a41871
$$ 6869 -222322 18216 289255 51534 278168 94402 -153274 249841 38199 3830 -141871
17988A22010k626c7574k4378E6005J8318M0593a48005C35470D7952a62575j17502
$$ 122010 119384 -37574 -61952 56005 74323 114916 -148005 335470 47952 -162575 -280077
17977b80077C1015b13763c3408A34827h10k17908B85221A13429g7150B15800C4086
$$ -280077 31015 -213763 -33408 134827 -810 -218718 285221 113429 -77150 215800 34086
17965a77060E3518k5531k709J74409c2156C6865a08019D709K22203A05311J19182
$$ -177060 53518 27987 25278 199687 -32156 36865 -108019 4709 226912 105311 224493
17954B24493j11549b59568B72475a6288F7399a02862c6327E3159b43304r5289
$$ 224493 112944 -259568 272475 -16288 67399 -102862 -36327 53159 -243304 -338593
17944c38593a32293e9302N859A23022a04878A89311a37575l8630A71975a55962
$$ -338593 -132293 -59302 -53443 123022 -104878 189311 -137575 -176205 171975 -155962
17933a24064j31554K6095E3593b672m1893A18928c02737g3335A40580a6698A69796
$$ -124064 -255618 -229523 53593 -2672 -44565 118928 -302737 -73335 140580 -16698 169796
17921a11B7758K90557E6657f5838p1756A14351I008c56050a3149j49213F6972
$$ -111 27758 318315 56657 -65838 -137594 114351 9008 -356050 -13149 -162362 66972
17909A94256i1984F6665k3042B062b9567A43973c45486B5226a8873A16489a55746
$$ 194256 -91984 66665 43623 2062 -29567 143973 -345486 25226 -18873 116489 -155746
17897A83074a4262A0734c1531k73039F3464j2361J49049I9802b63663L3732F1580
$$ 183074 -14262 10734 -31531 -304570 63464 51103 200152 99802 -263663 -229931 61580
17885b11933a04641J7653B01832e8648j72576L0400b5596j05212A0402L89823
$$ -211933 -104641 -86988 201832 -58648 -231224 -200824 -25596 -130808 10402 400225
17875D00225a76276A8492R6b33358j513a05788A15981c0770j22362p0056J06446
$$ 400225 -176276 18492 18588 -233358 -234871 -105788 115981 -30770 -153132 -223188 -116742
17864a16742j60258A61917N8316f2608k20171H5430p407J8047B2663a30348B06087
$$ -116742 -277000 161917 220233 -62608 -282779 85430 78023 96070 22663 -130348 206087
17852a52162a2057k0134B125J4407J159J3158J26615G5204J14771j1550b541j00737
$$ -152162 -12057 -32191 2125 16532 17691 30849 157464 75204 189975 178425 -2541 -103278
17840a03278A55600e0012r4385A89633C3485a35048E1215D287h4690p2536e9458
$$ -103278 155600 -50012 -144397 189633 33485 -135048 51215 4287 -84690 -157226 -59458
17828f7512j83509j3314j93273J86717E7952Q3336n3738g3081B63910l3562m7670
$$ -67512 -251021 -264335 -457608 -270891 57952 141288 87550 -73081 263910 230348 182678
17817A82678R4241A959J05127b13028A18237a90049L151F6004a9165o9626j02829
$$ 182678 276919 1959 107086 -213028 118237 -190049 -186898 66004 -19165 -88791 -191620
17806a91620G6374O6836a6647B98066o3133J96664A64118a16007o7491e6592j76134
$$ -191620 76374 143210 -16647 298066 234933 431597 164118 -116007 -183498 -56592 -232726
17795b32726B40202b24154J09095j3953j54498N7353A56472G7634k4564K85032
$$ -232726 240202 -224154 -115059 -129012 -283510 -226157 156472 77634 53070 338102
17785C38102a47436d9652j78060A02087f844B19985A02719a82964B2117J09448
$$ 338102 -147436 -49652 -227712 102087 -6844 219985 102719 -182964 22117 131565
17775A31565e2691n434A38398a31183B33711a46771e3319h314j72996P7191A23338
$$ 131565 -52691 -58125 138398 -131183 233711 -146771 -53319 -8314 -181310 -104119 123338
17763b95005a46284B28940c8874J499C4307a16171D3421d4470k721a3080D43849
$$ -295005 -146284 228940 -38874 -37375 34307 -116171 43421 -44470 -47191 -13080 443849
17751A7946a13961A75408I475a46216p7038j21443a8232j96524B29980a94557
$$ 17946 -113961 175408 9475 -146216 -223254 -344697 -18232 -214756 229980 -194557
17740a47158A36200o6903k4175l413L26205b18417D84257A43533f4002A1966c04850
$$ -147158 136200 69297 45122 41709 367914 -218417 484257 143533 -64002 11966 -304850
17728A17353N7538C9866h7473o7904k58814B22059C6506P0162b87285A30836C1114
$$ 117353 174891 39866 -87473 -155377 -414191 222059 36506 106668 -287285 130836 31114
17716C53373B6219a43245B58839e1595B25652a4643l082j9651N365p1067L2660
$$ 353373 26219 -143245 258839 -51595 225652 -14643 -17725 -37376 -32011 -103078 -70418
17705g0418A71175j545N9481R044m5037C3979J21505c94B7979c99315a03602B55608
$$ -70418 171175 169630 229111 238155 193118 33979 155484 -394 27979 -399315 -103602 255608
17692a00020M3802H3501A7201J59267k3161a43772C26770C1704a67748A10518
$$ -100020 -56218 83501 17201 176468 153307 -143772 326770 31704 -167748 110518
17681A31622l4081a94713e1793j10304k01319A21365c23681A88825g5783I0333
$$ 131622 97541 -194713 -51793 -162097 -363416 121365 -323681 188825 -75783 90333
17670H6509l0861a21470A44195j2252b89443O4913j19619J32124A58874j8664
$$ 86509 55648 -121470 144195 131943 -289443 -224530 -344149 -212025 158874 140210
17660A40210c53148E552J61658J2224n8866J19291C6145a03018o9723E2330c1201
$$ 140210 -353148 5552 167210 179434 120568 239859 36145 -103018 -172741 52330 -31201
17648A57218f7461b5132j84003G2185b0572C95475B9183J97337E5696O8147j8459
$$ 157218 -67461 -25132 -209135 72185 -20572 395475 29183 226520 55696 123843 105384
17637A05384k1995C0400i602K881A9029b44045F8977Q3380a89735A47575E3489
$$ 105384 83389 30400 -9602 -6721 19029 -244045 68977 152357 -189735 147575 53489
17625A38080K29594e0256D19066I0921a59968j82213B8720b65928A53746O0530
$$ 138080 367674 -50256 419066 90921 -159968 -342181 28720 -265928 153746 214276
17615B14276J91380F7009b61022e6383l9135A30964c1137H6719K13759N590a18202
$$ 214276 405656 67009 -261022 -56383 -95518 130964 -31137 86719 300478 306068 -118202
17603B39861f9201j01733C10L694K29570a01471p3978H982J06858C3919J997b9071
$$ 239861 -69201 -170934 310 4004 233574 -101471 -175449 8982 115840 33919 35916 -29071
17590B96390f3264C63009E6075f5899j64220A40087c9467K888A8670L07485A45551
$$ 296390 -63264 363009 56075 -65899 -230119 140087 -39467 -36579 18670 326155 145551
17578a41714C9199G982O7324M7746n9159b38411P5202B74206I8636R6946C4120
$$ -141714 39199 7982 75306 123052 63893 -238411 -163209 274206 98636 195582 34120
17566d7655E7707a45358C54718j08152m8341c9119A21991b32279C6782e1756K4604
$$ -47655 57707 -145358 354718 246566 198225 -39119 121991 -232279 36782 -51756 -27152
17555b7152B40900b13582C91969A9388O4893k8933K5865A0516a69800A09556i8974
$$ -27152 240900 -213582 391969 19388 84281 55348 81213 10516 -169800 109556 -98974
17543D9482J81832A0871c0631A93861j0407n2836m5490a60914d034A04065j8485
$$ 49482 231314 10871 -30631 193861 183454 130618 85128 -160914 -4034 104065 85580
17532H5580Q4863N0572Q5946I9749a10977Q483D37399o1051A63524J48380a9454
$$ 85580 170443 221015 306961 99749 -110977 -102494 437399 376348 163524 311904 -19454
17520B32823j01701J56957j23411b8074C40713A47047b98923A20628i0213B33566
$$ 232823 131122 288079 164668 -28074 340713 147047 -298923 120628 -90213 233566
17509A13250b73974H2311L84993A60713C2347b1256n0631A15510f9844B03158
$$ 113250 -273974 82311 467304 160713 32347 -21256 -71887 115510 -69844 203158
17498A24281c783A3436c78923i947j0714C93761A25564J22089d3286J2904B64357
$$ 124281 -3783 13436 -378923 -9947 -20661 393761 125564 247653 -43286 -30382 264357
17486h1763q0869B33017d2991A21569l8811K82684A1791h8944A69195l5364a10757
$$ -81763 -162632 233017 -42991 121569 82758 365442 11791 -88944 169195 133831 -110757
17474A64827K5198r2324J04563J57818D26L86119A40473o2982J10085I1698K3399
$$ 164827 190025 97701 202264 360082 426 386545 140473 77491 187576 91698 115097
17463A15097J07625m3025c09115C58369a14955C191a71356a3384A89797b193B88568
$$ 115097 222722 179697 -309115 358369 -114955 3191 -171356 -13384 189797 -2193 288568
17451B18500H1717L46367j64642I6108J31252C0736K75919R5597P931J21029q3252
$$ 218500 81717 428084 263442 96108 227360 30736 306655 402252 410183 531212 447960
17440D47960J7703A95896P3767A23878o1680M86788A80676M13428d7010F07387
$$ 447960 465663 195896 269663 123878 62198 548986 180676 594104 -47010 607387
17429b0157D57544J83906A88138j0792J6812L16811A73378c379A21708K10409
$$ -20157 457544 641450 188138 177346 194158 510969 173378 -3379 121708 332117
17419C32117J79991o4058j37003I9829L55666q288J6711A38631K66291A9323L45124
$$ 332117 512108 448050 311047 99829 455495 447207 463918 138631 404922 19323 364447
17408C64447A69274J11488j15703b9297J3901A47221J70830F1627K3096J47071
$$ 364447 169274 280762 165059 -29297 -15396 147221 318051 61627 84723 231794
17398B31794A11356a71627A88579n3265c6851A11817J40724a3202C2967N25292
$$ 231794 111356 -171627 188579 135314 -36851 111817 252541 -13202 32967 558259
17388E58259A34961Q8394p1071e3912B20014I5118M4761L427M00031I2862L14538
$$ 558259 134961 223355 152284 -53912 220014 95118 139879 143306 543337 92862 407400
17377D07400j24341L4800F0835i0707A02828J5589K40085j30667m5967D1582L07320
$$ 407400 283059 317859 60835 -90707 102828 118417 358502 227835 181868 41582 348902
17366C48902e255A0074M02966j45099G6190Q0304J20972j32129N1527C7905K28878
$$ 348902 -5255 10074 413040 267941 76190 156494 277466 145337 196864 37905 266783
17355B66783D9396P6312K68442B0676K67209J73935a06004B72762F4358K32881
$$ 266783 49396 125708 394150 20676 287885 461820 -106004 272762 64358 297239
17345B97239o7984J421J62672G0748d3720l16852F0882a6211B41427O2015D6467
$$ 297239 229255 230676 393348 70748 -43720 -360572 60882 -16211 241427 303442 46467
17333D60948c6726A76386e7284G8334K67527a30438A73051K16953J89664R9272
$$ 460948 -36726 176386 -57284 78334 345861 -130438 173051 390004 579668 678940
17323F78940B21739r6032O0673J11767j46523d62A39557J6242a00203A46938l3754
$$ 678940 221739 125707 186380 298147 151624 -462 139557 155799 -100203 146938 113184
17312A13184g6942D90719A91816b05580A39906P8947J14865O8922I7666K46958
$$ 113184 -76942 490719 191816 -205580 139906 218853 333718 402640 97666 344624
17302C44624A49817E233L33908A44364M56627A8170R6871R8376C8225O8674K54225
$$ 344624 149817 5233 339141 144364 600991 18170 115041 213417 38225 106899 361124
17291C61124A11996D5663L20757j07383K72861k61153a17159E73090c835A81288
$$ 361124 111996 45663 366420 259037 531898 270745 -117159 573090 -3835 181288
17280E0908P9414m2006J32700J00802j60837G1875J65286N4062H9222K45426F2266
$$ 50908 130322 88316 221016 321818 160981 71875 237161 291223 89222 334648 62266
17268D17058d9213d311A32006K53511j40384G1798K36644d6744B75620j32620
$$ 417058 -49213 -4311 132006 385517 245133 71798 308442 -46744 275620 143000
17258A43000J4808i1980j5914C40667n5737A8322K44162q790P4515j52447P2346
$$ 143000 157808 -91980 -107894 340667 284930 18322 262484 253694 328209 175762 248108
17247B48108A4143J70631a23584A81481h9864C34323A26020K47216q5289j15295
$$ 248108 14143 184774 -123584 181481 -89864 334323 126020 373236 287947 172652
17237A72652J26675a14571D95717k12935A18338K5992J66767R1926n5813K4107
$$ 172652 299327 -114571 495717 282782 118338 144330 311097 403023 347210 371317
17227C71317p8473j04165K68885A83906F6754J07094J52709C2224L78926A86270
$$ 371317 292844 188679 457564 183906 66754 173848 326557 32224 411150 186270
17216B68342L20761k90777C5337K81948J083j31829H0708L09780A26613E6523
$$ 268342 589103 298326 35337 317285 318368 186539 80708 390488 126613 56523
17205C03819J75991D5046D007M32803j81952A22126Q9726a049C81438k5281p9313
$$ 303819 479810 45046 4007 436810 254858 122126 211852 -1049 381438 356157 276844
17194B76844A36911K74728j91926M0582A2096N32692B17827Q3768L0667J67556
$$ 276844 136911 411639 219713 260295 12096 544788 217827 301595 332262 499818
17184D99818o2496Q4375A25508f2526F19320B31148j0493J33947J29643B35408
$$ 499818 437322 521697 125508 -62526 619320 231148 220655 354602 484245 235408
17173D67106K5063A91160J84842J15318A12975F075O51498a42447B71928H6961
$$ 467106 492169 191160 376002 491320 112975 6075 657573 -142447 271928 86961
17162B87136K8863q2988L55011B34773B0010L54411A46493L81553L4773B60976
$$ 287136 315999 233011 588022 234773 20010 374421 146493 528046 562819 260976
17151B45249J99561p2621j79961n0425g4788j8805D76056J6888A22171L04869
$$ 245249 444810 372189 192228 141803 -74788 -93593 476056 492944 122171 427040
17141D27040A64419J5411D7112M06856r0958j71306K41426q7540K24728G0583
$$ 427040 164419 179830 47112 453968 363010 191704 433130 345590 570318 70583
17130E65995j4321Q7305B41354O6621N4387l3811K95212k39328n9877J34475r6060
$$ 565995 551674 638979 241354 307975 362362 328551 623763 384435 324558 459033 362973
17119C62973Q6615M328K12168j84623o2527J20143j14954J54219k31706L02503
$$ 362973 449588 453916 666084 481461 418934 539077 424123 578342 346636 649139
17109F49139k10907m8566j2789A34505M88058j46635O8261J18488C09908O5464
$$ 649139 438232 389666 376877 134505 622563 475928 544189 662677 309908 375372
17099C75372K62891k42051j59498J48051A28546M24611j68729K10551j46640B22679
$$ 375372 638263 396212 236714 384765 128546 553157 384428 594979 448339 222679
17088D89559Q3634j43225k02732M52507j60997j63406q4827J61682J27620o4J73164
$$ 489559 573193 429968 227236 679743 518746 355340 270513 432195 559815 559751 732915
17077G32915C28830N01432k09452j29678L03501B14298M17038k57049J40286r5244
$$ 732915 328830 830262 620810 491132 794633 214298 631336 374287 514573 419329
17067D19329m8844K38537K7685j6606K4056A95406O22896l29855j06375P5569
$$ 419329 370485 609022 636707 620101 644157 195406 818302 488447 382072 457641
17057D57641L46287k84519J5175K18583j72327j8123L4782l1522j59485J27161
$$ 457641 803928 519409 534584 753167 580840 562717 597499 565977 406492 533653
17047E33653L62852D01347l0451K7767J86570k1033j01167M65825C99152J64905
$$ 533653 896505 401347 370896 398663 585233 564200 463033 928858 399152 564057
17037E64057M36766k01417k48202J5046q7756K47074j9736p9765j71386Q2262
$$ 564057 1000823 799406 551204 566250 478494 725568 705832 626067 454681 536943
17027E36943B46687L82233J14789j44312P1700K85156j38941M4633j62907J83539
$$ 536943 246687 628920 743709 599397 671097 956253 817312 861945 699038 882577
17017H82577L02641E67828J61860j68046L99526j61129L32824m33491L37969j58694
$$ 882577 1185218 567828 729688 561642 961168 800039 1132863 699372 1037341 878647
17007H78647J56099k58887l54614M03678j23930O6370j94902K27667k75669M96374
$$ 878647 1034746 775859 421245 824923 700993 767363 572461 800128 524459 1020833
16997A020833J25620k26125K9974j42425k28031L85886J3398j23833K45976l26968
$$ 1020833 1146453 920328 950302 807877 579846 965732 979130 855297 1101273 774305
16987G74305K77748p5799o8765J80616j03908k63637L82073k00616K44339k67917
$$ 774305 1052053 976254 907489 1088105 984197 720560 1102633 902017 1146356 878439
16977H78439k08696M29360j79239N3078K04349j03912J22381n7174l79790M08099
$$ 878439 669743 1099103 919864 972942 1177291 1073379 1195760 1138586 758796 1166895
16967A166895p7641L3758L0911m5235P5555j5666m8808K13397j90152J56612O9709
$$ 1166895 1089254 1123012 1153923 1108688 1184243 1168577 1119769 1333166 1143014 1299626 1369335
16956A369335l4604j85378K03947l80893J33778r6807K91578l7716r6882k2778
$$ 1369335 1334731 1149353 1353300 972407 1106185 1009378 1300956 1263240 1166358 1143580
16946A143580J72642K45639n65233K85301J02853q2948J03449J03857m53831K85500
$$ 1143580 1316222 1561861 996628 1281929 1384782 1301834 1405283 1509140 1055309 1340809
16936A340809J62103l8163J42913l91371L25579j2050j34373L948J87832K60343
$$ 1340809 1502912 1464749 1607662 1216291 1541870 1529820 1395447 1399395 1587227 1847570
16926A847570m91001J81215p2472L26333m692q6628J31201R2573k53028J52025
$$ 1847570 1356569 1537784 1465312 1791645 1786953 1700325 1831526 1924099 1671071 1823096
16916A823096m0938l4313R0394k95321L93555k95365K47873j21650k61447N29957
$$ 1823096 1782158 1747845 1838239 1542918 1936473 1641108 1888981 1767331 1505884 2035841
16906B035841q3771k36312K87989j49521q7058M22316n13760K06258L61614k08732
$$ 2035841 1952070 1715758 2003747 1854226 1767168 2189484 1675724 1881982 2243596 2034864
16896B034864J11515j60065j5800M3908Q4412M51171l71772p4611J12685K76969
$$ 2034864 2146379 1986314 1970514 2014422 2098834 2550005 2178233 2103622 2216307 2493276
16886B493276n5490L1564O0855m5825J56956J12406j25033N8635j51850L88182
$$ 2493276 2437786 2469350 2530205 2484380 2641336 2753742 2628709 2687344 2535494 2923676
16876B923676l03497K13906m82836M51779J83128l48126K4962K32874J71179K208
$$ 2923676 2620179 2834085 2351249 2803028 2986156 2638030 2662992 2895866 3067045 3069253
16866C069253j54900J90512j42851M16383k91904J25908J50329k87247N37992
$$ 3069253 2914353 3104865 2962014 3378397 3086493 3212401 3362730 3075483 3613475
16857C613475k07144K2670K82011k09694K00151J7521j15924O1059L83685o4074
$$ 3613475 3406331 3429001 3711012 3501318 3701469 3718990 3603066 3664125 4047810 3983736
16847C983736L68814P0663l02038n2727K93127J82794p3830P5464J03387P6908
$$ 3983736 4352550 4423213 4121175 4068448 4361575 4544369 4470539 4546003 4649390 4726298
16837D726298l5150L23208l07649J24030M96627k90445Q9674J55201k96906J54041
$$ 4726298 4691148 5014356 4706707 4830737 5327364 5036919 5126593 5281794 4984888 5138929
16827E138929K84756J87358J67075q0489J54768j08167M90873L92386p08283O01569
$$ 5138929 5423685 5611043 5778118 5697629 5852397 5744230 6235103 6627489 5919206 6520775
16817F520775K20725j17595L77095m07389N43277J35258j55983M48529n628J67570
$$ 6520775 6741500 6623905 7001000 6593611 7136888 7272146 7116163 7564692 7559064 7726634
16807G726634L33623J14640K80315m656K10394R2099P35159j51598K13398J33616
$$ 7726634 8060257 8174897 8455212 8450556 8660950 8753049 9488208 9336610 9550008 9683624
16797I683624L82825m5162O01669n3452L54915M73768K12931J95452N68004k21200
$$ 9683624 10066449 10021287 10622956 10569504 10924419 11398187 11611118 11806570 12374574 12153374
16787A2153374R36764J72029J17274N12711K88502N21129J85435O17389O18647
$$ 12153374 13090138 13262167 13379441 13892152 14180654 14701783 14887218 15504607 16123254
16778A6123254Q22452j26439O70431J87308J268476K97899P17739O38652M04695
$$ 16123254 16945706 16819267 17489698 17677006 18945482 19243381 19961120 20599772 21004467
16769B1004467J195655N06117Q79842O65252Q09035J233429R65413J165977O70386
$$ 21004467 22200122 22706239 23586081 24251333 25060368 26293797 27259210 28425187 29095573
16760B9095573J553897J102934J376445J584638R95648J907923J250119J834743
$$ 29095573 30649470 31752404 33128849 34713487 35709135 37617058 38867177 40701920
16752D0701920J882777K038692K027003K155770K761951K328755K682965K597705
$$ 40701920 42584697 44623389 46650392 48806162 51568113 53896868 56579833 59177538
16744E9177538L198876L282905L685515L852288L772680M021517M521753M672424
$$ 59177538 62376414 65659319 69344834 73197122 76969802 80991319 85513072 90185496
16736I0185496N214897N185726N383315N736420N925518O234233N905301O979313
$$ 90185496 95400393 100586119 105969434 111705854 117631372 123865605 129770906 136750219
16728A36750219N762064O200806N709996N411859N020332M255049L831155L121793
$$ 136750219 142512283 148713089 154423085 159834944 164855276 169110325 172941480 176063273
16720A76063273J903933J305637R35522l2846j095520p77803k127725k732625
$$ 176063273 177967206 179272843 180208365 180175519 179079999 178302196 176174471 173441846
16712A73441846l136204l240900m233282m844223m907220m947186o053461n542089
$$ 173441846 170305642 167064742 162831460 157987237 153080017 148132831 142079370 136537281
16704A36537281n743648o293478n831138o123426n855079n493358n451853n129325
$$ 136537281 130793633 124500155 118669017 112545591 106690512 101197154 95745301 90615976
16696I0615976m953551m393683m201160m120413m067638l756924l496408k827064
$$ 90615976 85662425 81268742 77067582 72947169 68879531 65122607 61626199 58799135
16688E8799135k982517k458480k951548k462308k788194j760672k090113j962108
$$ 58799135 55816618 53358138 50406590 47944282 45156088 43395416 41305303 39343195
16680C9343195j686172j421278j770694j499598j611670j059440j285233j084788
$$ 39343195 37657023 36235745 34465051 32965453 31353783 30294343 29009110 27924322
16672B7924322j054613j190448j055857p27564j001456r30806n88133p69721p61749
$$ 27924322 26869709 25679261 24623404 23895840 22894384 21963578 21375445 20605724 19843975
16663A9843975p67203l73188q60258m73897n88145n85275o15935o50951Q4665
$$ 19843975 19076772 18703584 17843326 17369429 16781284 16196009 15580074 14929123 15013788
16654A5013788p58539l43037m21477n87038j12583n13412p24704j08274l66354
$$ 15013788 14255249 13912212 13490735 12903697 12791114 12277702 11552998 11444724 11078370
16645A1078370m33927j16813j89987j76302n85803N5139j07203k16904l65215
$$ 11078370 10644443 10527630 10337643 10161341 9575538 9630677 9523474 9306570 8941355
16636H941355l08647l75002r2708L0033m46657N4165n83493L9033q9640k18127
$$ 8941355 8632708 8257706 8164998 8195031 7748374 7802539 7219046 7258079 7168439 6950312
16626F950312j33759k14460j24535j15968k67482k6341J00760j66355l75150j49141
$$ 6950312 6816553 6602093 6477558 6361590 6094108 6067767 6168527 6002172 5627022 5477881
16616E477881j83582J72850P7793l03444k68369J99940j68879k51726r5703J25417
$$ 5477881 5294299 5467149 5544942 5241498 4973129 5173069 5004190 4752464 4656761 4782178
16606D782178l8573m65511p4510J83653o03996J72606J2973j30352r2503j30033
$$ 4782178 4743605 4278094 4203584 4387237 3783241 3955847 3968820 3838468 3745965 3615932
16596C615932k7931K69807l67822k50918K57660j0544m18050M78372k65266J58233
$$ 3615932 3588001 3857808 3489986 3239068 3496728 3486184 3068134 3546506 3281240 3439473
16586C439473m20384j0217Q3497J14922j21811k50568L31560l57263K4548n68101
$$ 3439473 3019089 3008872 3092369 3207291 3085480 2834912 3166472 2809209 2833757 2265656
16576B265656K69560O4678k53903J93190J36740k72654r4508K37562j40214J25472
$$ 2265656 2535216 2599894 2345991 2539181 2675921 2403267 2308759 2546321 2406107 2531579
16566B531579k8216m47303L40764l03926J9084M8817j77653K46140k49973J73464
$$ 2531579 2503363 2056060 2396824 2092898 2111982 2160799 1983146 2229286 1979313 2152777
16556B152777m35062M14360j71120M0456L7772j34935q7647m605R6849k12967
$$ 2152777 1717715 2132075 1960955 2001411 2039183 1904248 1816601 1811996 1908845 1695878
16546A695878k06231M08902o9985m4985j47920K43767m2181m31406L99818l174
$$ 1695878 1489647 1898549 1828564 1783579 1635659 1879426 1837245 1405839 1805657 1802483
16536A802483m18827P2204j54032K66852j64148j9417q3777K6697K41812M4820
$$ 1802483 1383656 1455860 1301828 1568680 1404532 1385115 1301338 1328035 1569847 1614667
16526A614667k35892l56041N49416J73183n29512J23878r8114j38052L20804j99601
$$ 1614667 1378775 1022734 1572150 1745333 1215821 1339699 1241585 1103533 1424337 1224736
16516A224736j8010L3757K05577K7718k40904q0112p2790k2544q1943M75090m58929
$$ 1224736 1206726 1240483 1446060 1473778 1232874 1152762 1079972 1057428 975485 1450575 991646
16505I91646k00207N22335l62790K18292k3745l07196q2419Q978K75593n12963
$$ 991646 791439 1313774 950984 1169276 1145531 838335 755916 764894 1040487 527524
16495E27524L77063L66513m59594P7237l0384j05077K15554K7482J13928l58956
$$ 527524 904587 1271100 811506 888743 858359 753282 968836 996318 1110246 751290
16485G51290Q0554J03913M9521k56137m5056R7804L32362j79198k0263o6024l41346
$$ 751290 831844 935757 985278 729141 684085 781889 1114251 935053 914790 848766 507420
16474E07420j41214N54499m22830N06435q6969o7861N9777l55814q0570j00467
$$ 507420 366206 920705 497875 1004310 917341 849480 909257 553443 472873 372406
16464C72406M80657n1351l73928K4435L59611J19734m29879J71444J08589l89616
$$ 372406 853063 801712 427784 452219 811830 931564 501685 673129 781718 392102
16454C92102L33637j21370j08157L33408r9056j37131K24453k03823M5572o3385
$$ 392102 725739 604369 496212 829620 730564 593433 817886 614063 659635 596250
16444E96250R3977R5458B09425M53234J5340j07651B61491n9891L64219m762B75429
$$ 596250 690227 785685 209425 662659 677999 570348 261491 201600 565819 561057 275429
16432E92057p3344J03560O1138o0719m6599J7258B85086l437J85480J42863j67123
$$ 592057 518713 622273 683411 622692 576093 593351 285086 281649 467129 609992 442869
16421D42869p9287J91181r1184B16242J33109M6117M4385J12726R0280B88922
$$ 442869 363582 554763 463579 216242 349351 395468 439853 552579 642859 288922
16410F55271n1078L6328k19525L86672B65396j27703J08063A14368L84681L852
$$ 655271 604193 640521 420996 807668 265396 137693 245756 114368 499049 502901
16400E02901q5033m9450A47569L45965A93660J63539l0676A57996L49160o4542
$$ 502901 417868 368418 147569 493534 193660 357199 326523 157996 507156 442614
16390D42614B16903M53837B32566K86986B33279M4004A26138J86806I3462J76010
$$ 442614 216903 670740 232566 519552 233279 277283 126138 312944 93462 269472
16380B69472J65920j69081C7384K25578J63552A22030m6816J66337J58184n8533
$$ 269472 435392 266311 37384 262962 426514 122030 75214 241551 399735 341202
16370C41202j44491M48946j76082K2468k01191K83363k74692L2757H7161M42226
$$ 341202 196711 645657 469575 492043 290852 574215 299523 332280 87161 529387
16360E29387n6052A76937M710K52077j0858A30157E6335L61579R8134E4897J11876
$$ 529387 473335 176937 181647 433724 422866 130157 56335 417914 516048 54897 166773
16349A66773O3118d847B95999j4929n467L7484L39548q1183B73539D7631M66858
$$ 166773 229891 -4847 295999 281070 275603 313087 652635 571452 273539 47631 514489
16338E14489a0428F53510B17465K61614j26371H3607G30O0385J03940A9056J45773
$$ 514489 -10428 653510 217465 479079 352708 83607 730 61115 165055 19056 164829
16327A64829K11288a00717j40962d5219E0771P2249J14603b4540F12081A30818
$$ 164829 376117 -100717 -241679 -45219 50771 123020 237623 -24540 612081 130818
16316C00503r7683n2400P0727l6699K23323O8244I17P8201K14173a0477B58834
$$ 300503 202820 150420 221147 184448 407771 476015 917 79118 293291 -10477 258834
16304E06914H6830J36472O6644K3415p9998j14701K19383j37996D9036K64658
$$ 506914 86830 223302 289946 313361 233363 118662 338045 200049 49036 313694
16294C13694i6865A59192J68711J5408A0589M07416l4783j82946q5793a6607B1395
$$ 313694 -96865 159192 327903 343311 10589 418005 383222 200276 114483 -16607 21395
16282B48371j8871q5233K75027A56013R2205q0241l9946A639K30200J67892A01863
$$ 248371 229500 144267 419294 156013 248218 167977 128031 1639 231839 399731 101863
16270C30914j41876K04404o1693h4555H0452f5072B67554N9614p2808a24877A78852
$$ 330914 189038 393442 331749 -84555 80452 -65072 267554 327168 254360 -124877 178852
16258h2909o231j9943A09910K04354C3593n79M22016B25196j03972K88590A6835
$$ -82909 -89140 -109083 109910 314264 33593 33014 455030 225196 121224 409814 16835
16246C02383e1887B98525b47494C7559O5436D6801a49385C1546L50055G7572R936
$$ 302383 -51887 298525 -247494 37559 102995 46801 -149385 31546 381601 77572 87508
16235H7508g5198A73198b78669C33711A05768B158K05075A1986M9699j6253K07377
$$ 87508 -75198 173198 -278669 333711 105768 2158 207233 11986 61685 45432 252809
16224B52809I8076J50830j19279E6229L3391p308L01331J15241B24652q8309L03433
$$ 252809 98076 248906 129627 56229 89620 82312 383643 498884 224652 136343 439776
16213D39776F748K17528a52738A28664J14924j20421a79237Q7991P660B45325
$$ 439776 6748 224276 -152738 128664 243588 123167 -179237 -91246 -83586 245325
16202G3875N3928g6238D92228a55545C57102j42354N0094b9390A60361i1024b4344
$$ 73875 127803 -76238 492228 -155545 357102 214748 264842 -29390 160361 -91024 -24344
16190D803J94933J29211O162I8749G96L8992G983K23137I1093B9517b9474A43960
$$ 4803 199736 328947 335109 98749 796 39788 7983 231120 91093 29517 -29474 143960
16177F695b73824A86601o2119b73166A60801K05502l2253a04474c0797A6471g237
$$ 6695 -273824 186601 124482 -273166 160801 366303 334050 -104474 -30797 16471 -7237
16165A38305k9999j866a94036I3358J96637I1520J33446c26859H9410a1586B25839
$$ 138305 108306 106440 -194036 93358 289995 91520 224966 -326859 89410 -11586 225839
16153c46309A54077L2253d32085E2770A9262c21734J01545a00989E7597a16460
$$ -346309 154077 186330 -432085 52770 19262 -321734 -220189 -100989 57597 -116460
16142E6207b1666C00819c2757A82163L7629I9609a7219B26846a64020H9160k5773
$$ 56207 -21666 300819 -32757 182163 219792 99609 -17219 226846 -164020 89160 63387
16131F3387N1568b19891A37621L02982a07620I7897c04407e0761n7414k37932
$$ 63387 114955 -219891 137621 440603 -107620 97897 -304407 -50761 -108175 -346107
16121c46107f9238a5157r2557q6996A49193C2757K50336H0040h6180A9919e0380
$$ -346107 -69238 -15157 -107714 -194710 149193 32757 283093 80040 -86180 19919 -50380
16109B96322c0053j24257q8264a0881j38704I6185J8660K7073a01713e0327A86863
$$ 296322 -30053 -154310 -242574 -10881 -149585 96185 114845 141918 -101713 -50327 186863
16097b22233C25041d80656C90468A24544B8371J55257c03252J28580o1824j0734
$$ -222233 325041 -480656 390468 124544 28371 183628 -303252 -174672 -236496 -247230
16087b47230A28914M5835J22812a99452A4486b15786p6843B73369j19958g9667
$$ -247230 128914 174749 297561 -199452 14486 -215786 -292629 273369 153411 -79667
16076A78784A6649a78705B7180L66867I336J47302B1230P7176K9056i0256q6719
$$ 178784 16649 -178705 27180 394047 9336 156638 21230 98406 127462 -90256 -176975
16065a76975J4901b7629A69761B4403b17578k8708B17352r2051J47994J979b17018
$$ -176975 -162074 -27629 169761 24403 -217578 -246286 217352 125301 273295 275274 -217018
16053a8559r7285A71679d1402b0466j58837a2531C0318J50559R8384D6539A4837
$$ -18559 -115844 171679 -41402 -20466 -179303 -12531 30318 180877 279261 46539 14837
16041a09477N699D9032e2535o7134R690q574e6660A97059J02646G8613b54175
$$ -109477 -103778 49032 -52535 -119669 -109979 -118553 -56660 197059 299705 78613 -254175
16029H881J62108b08395g1358L1787a8111r8158M5130H9955d33157f1419d322
$$ 8881 170989 -208395 -71358 -39571 -18111 -116269 -71139 89955 -433157 -61419 -4322
16017a16213J5736L6847C1326a06546l08474F6689R9847J941M6141b85679A98804
$$ -116213 -100477 -63630 31326 -106546 -415020 66689 166536 168477 214618 -285679 198804
16005G8327j8846B703c09156B14101g950r1000H3288a1508B01194a34766e8934
$$ 78327 59481 2703 -309156 214101 -7950 -98950 83288 -11508 201194 -134766 -58934
15993B59900b60734i4596A36149a358k52632B23748Q838d6642B46158E1366P3516
$$ 259900 -260734 -94596 136149 -1358 -253990 223748 232586 -46642 246158 51366 124882
15982A24882K68121r6088J58461k11601A3342L85950A23290e3213l9851B20025
$$ 124882 393003 296915 455376 243775 13342 399292 123290 -53213 -93064 220025
15971b84179a17284A57138J21538I05M3005K84183c20740H0548b77855I0910k8908
$$ -284179 -117284 157138 278676 905 43910 328093 -320740 80548 -277855 90910 62002
15960F2002l0085a07136a2484j44934A38174n3955b24099L4204P1214c8787j43431
$$ 62002 31917 -107136 -12484 -157418 138174 84219 -224099 -189895 -118681 -38787 -182218
15949a82218I1252d8912B36086A5213P833g5055B23638D5696b90552G9056a23090
$$ -182218 91252 -48912 236086 15213 23046 -75055 223638 45696 -290552 79056 -123090
15937A43826j4070c9356j16202l0605E5697a14632J4959A8315J55690J983k5424
$$ 143826 129756 -39356 -155558 -186163 55697 -114632 -99673 18315 174005 175988 150564
15926A50564a3051E2193N6532c24896a05636K622A908b23134B15955a3514j34325
$$ 150564 -13051 52193 108725 -324896 -105636 -103014 1908 -223134 215955 -13514 -147839
15915a47839A1853e5858m200m6350A7521b87359G8823O3173h8464j01951l4809
$$ -147839 11853 -55858 -60058 -106408 17521 -287359 78823 141996 -88464 -190415 -225224
15904b25224h5231L0589l317l13469A77772k4701b51658A71696c2267B8780K64677
$$ -225224 -85231 -54642 -57959 -371428 177772 153071 -251658 171696 -32267 28780 293457
15893B93457A17760b94947C3195b01708R8462j20440A82347N4970E0991Q2572
$$ 293457 117760 -294947 33195 -201708 -103246 -223686 182347 237317 50991 133563
15883A33563a74091j54029A77596E3497a1761A07398a10505l33253F9066i5570
$$ 133563 -174091 -328120 177596 53497 -11761 107398 -110505 -443758 69066 -95570
15872A5422L5673k2042J24826O6683n3141f7062A63341b34138B2412d1748k3741
$$ 15422 51095 29053 153879 220562 167421 -67062 163341 -234138 22412 -41748 -65489
15861f5489K8642A2544a70129M4385L1787A00154a82661C01213a60590E6238a76163
$$ -65489 -36847 12544 -170129 -125744 -93957 100154 -182661 301213 -160590 56238 -176163
15849C9979b03477E60974b40810B39217b66393i7933j27933B72198d1955j65693
$$ 39979 -203477 560974 -240810 239217 -266393 -97933 -225866 272198 -41955 -207648
15839b07648m0936A04343E1908b10988H59a88179f5352A56165a15271K5362k57162
$$ -207648 -248584 104343 51908 -210988 859 -188179 -65352 156165 -115271 -89909 -347071
15828c47071A3002L5438g991G3797b39826q9043a30479H4839b44277R8565o8482
$$ -347071 13002 48440 -7991 73797 -239826 -328869 -130479 84839 -244277 -145712 -214194
15817b14194K4839B38915K8428a26551e2151B24089a93075j27073L9604I9098
$$ -214194 -189355 238915 267343 -126551 -52151 224089 -193075 -320148 -280544 99098
15806A79622B1086M7870a80440A61212g9077m2069B47276C3947a56141J9486A41120
$$ 179622 21086 68956 -180440 161212 -79077 -121146 247276 33947 -156141 -136655 141120
15794G8826J49959b6158E59943b82796e8300A28765c09324a37986j83780A02838
$$ 78826 228785 -26158 559943 -282796 -58300 128765 -309324 -137986 -321766 102838
15783b88544c4425l33840J02624b6976k27607e861E5570c4441C8255J12668a58970
$$ -288544 -34425 -368265 -265641 -26976 -254583 -5861 55570 -34441 38255 150923 -158970
15771b39475B14344h8230A684d0913B37383a46216A75884A9747K4333a33380A09258
$$ -239475 214344 -88230 1684 -40913 237383 -146216 175884 19747 44080 -133380 109258
15759A86663b36992G290a06309d2857k4906k9516D23309B1905K56692J07768e0221
$$ 186663 -236992 7290 -106309 -42857 -67763 -97279 423309 21905 278597 386365 -50221
15747E8231J16867c8792j74676C20964J17542k15082e3496o8553A9809b15462
$$ 58231 175098 -38792 -213468 320964 438506 223424 -53496 -122049 19809 -215462
15736A78252E933J54991b48732A01846i74l7133B00507l4170b1546m14035g0477
$$ 178252 5933 160924 -248732 101846 -974 -38107 200507 166337 -21546 -435581 -70477
15724A24803J47795j28302m0560L0892b37911g930H4114a8505A9711b7014H7285
$$ 124803 272598 144296 103736 134628 -237911 -7930 84114 -18505 19711 -27014 87285
15712b95937d2610r646A63466A4690f6658B5263K133i4526j44735C20327g7566
$$ -295937 -42610 -52256 163466 14690 -66658 25263 27396 -94526 -239261 320327 -77566
15700A11810C760a28206A00439C4627d37436I0347a03239P550A73406a5613A29041
$$ 111810 3760 -128206 100439 34627 -437436 90347 -103239 -95689 173406 -15613 129041
15688E8807b12680d956A66442a24201A50822C3071J13730o3438b20531i1738E7069
$$ 58807 -212680 -4956 166442 -124201 150822 33071 146801 83363 -220531 -91738 57069
15676b02389A06891J79252A17941C5721N3177J69578l2271F2608i1608c6360A73144
$$ -202389 106891 286143 117941 35721 88898 258476 226205 62608 -91608 -36360 173144
15664A00435m9250i4573l6734B9491d74782b20874k456d3096j2638K6310j13632
$$ 100435 51185 -94573 -131307 29491 -474782 -220874 -223330 -43096 -55734 -29424 -143056
15653a43056o4519g381p0558j80618B21291b57989A02723L1174j3857E5932J48506
$$ -143056 -207575 -7381 -77939 -258557 221291 -257989 102723 133897 120040 55932 204438
15642B04438i6300d0536A02747R5957L8610b83158b08k19708O1053d0150j95575
$$ 204438 -96300 -40536 102747 198704 237314 -283158 -208 -219916 -158863 -40150 -235725
15631b35725P764H4013j4823c48823J19849m0834A76425E4658a63926A51654k9119
$$ -235725 -227961 84013 69190 -348823 -228974 -269808 176425 54658 -163926 151654 122535
15620A22535J48898G8755J29543b50580I5818P6530o8335K42029b05266j9241
$$ 122535 271433 78755 208298 -250580 95818 172348 104013 346042 -205266 -224507
15610b24507d5707N142H8185k2983b32437A05231a15223m9985A65334b27693A26592
$$ -224507 -45707 -40565 88185 65202 -232437 105231 -115223 -165208 165334 -227693 126592
15598b95619A3851L69548a13982j00307A09795b5679J1120A52447d772j23094
$$ -295619 13851 383399 -113982 -214289 109795 -25679 -14559 152447 -4772 -127866
15588a27866A06944m861b19430A75588c5808j06A03348B4232h2633L7138b1760
$$ -127866 106944 102083 -219430 175588 -35808 -35914 103348 24232 -82633 -45495 -21760
15576h8912c1269j14460k5237A66475D0731a63552q6735h4879j05070J3830k05602
$$ -88912 -31269 -145729 -170966 166475 40731 -163552 -250287 -84879 -189949 -176119 -381721
15565c81721B8012b25146A19305d08772a52802q3336d0801D4511k1662b30389
$$ -381721 28012 -225146 119305 -408772 -152802 -236138 -40801 44511 22849 -230389
15554G8761f1999A67122C5261m372a39075E1462M5284a61597A59343b8980I4252
$$ 78761 -61999 167122 35261 30889 -139075 51462 96746 -161597 159343 -28980 94252
15542h517k39783m3825i2622j01956A01175a291A28095D598O9551N4518H578J06983
$$ -8517 -248300 -292125 -92622 -194578 101175 -1291 128095 4598 74149 128667 8578 115561
15530A15561C2016g0148D9120j7930b1904j28959H6837J90164E0769J85732P9248
$$ 115561 32016 -70148 49120 31190 -21904 -150863 86837 277001 50769 236501 315749
15519C15749a10402L7360j94881C80b1972l75753M5268A174K76058E0866i3874
$$ 315749 -110402 -73042 -267923 380 -21972 -397725 -352457 1174 277232 50866 -93874
15507b89952I5555b42028A59163o1245Q5073J87419a03314j97457d6066L629A42925
$$ -289952 95555 -242028 159163 97918 182991 370410 -103314 -300771 -46066 -42437 142925
15495a15517A25521b84746J38581A07536b9327r2253B68386A01494b59970H6200
$$ -115517 125521 -284746 -146165 107536 -29327 -121580 268386 101494 -259970 86200
15484B55807l2336p3916a08944k24151A29984Q6018n7088D8236L33599c03869
$$ 255807 223471 149555 -108944 -333095 129984 216002 158914 48236 381835 -303869
15473e7051H9712A9348f6319B9927R4620d857j11863J0663I8762a72129B9826
$$ -57051 89712 19348 -66319 29927 124547 -4857 -116720 -106057 98762 -172129 29826
15461A6102K21108k7771F5116L37662j87375J70714d4688j86126D2611J88433
$$ 16102 237210 209439 65116 402778 215403 386117 -44688 -230814 42611 231044
15451B31044b17167m6577B99774A43067D299P3266g5028K7502G3614d6507B7072
$$ 231044 -217167 -263744 299774 143067 4299 77565 -75028 -47526 73614 -46507 27072
15439I0180B4179J75236A6615J23033a19302D02761c68472B17154b03485B01009
$$ 90180 24179 199415 16615 139648 -119302 402761 -368472 217154 -203485 201009
15428A20866O257a77009G3604a04796k4418E2771a17124A96469a15755m2125B70112
$$ 120866 127123 -177009 73604 -104796 -129214 52771 -117124 196469 -115755 -157880 270112
15416c6771B67932f9576D70557A75950b16605L6144A34281i4966F1207h2547J9290
$$ -36771 267932 -69576 470557 175950 -216605 -180461 134281 -94966 61207 -82547 -63257
15405f3257B805N0106a53647b7300E6168b64019O0319L7579B70277h3261I4678
$$ -63257 2805 52911 -153647 -27300 56168 -264019 -203700 -166121 270277 -83261 94678
15393A7617g2624A36381a08481n6767B94749d04481J64354k884a9137A69582E8080
$$ 17617 -72624 136381 -108481 -165248 294749 -404481 -240127 -243011 -19137 169582 58080
15381f2572A30131Q4818a04097j45348B91295a61625B76612G5886h4268a6256
$$ -62572 130131 214949 -104097 -249445 291295 -161625 276612 75886 -84268 -16256
15370a04633A41614a68764B7675N6565g694B71115a5120j19816F8859a6600A24600
$$ -104633 141614 -168764 27675 84240 -7694 271115 -15120 -134936 68859 -16600 124600
15358I4927J68394D6492N1026a92444A41697R2722a4803C70571f9311A2111K2604
$$ 94927 263321 46492 97518 -192444 141697 234419 -14803 370571 -69311 12111 34715
15347C4715K7030c12637j03465C26869h6957B4h4208B11833o3966N8616E7871
$$ 34715 61745 -312637 -416102 326869 -86957 24 -84208 211833 147867 206483 57871
15335a49580C44371A63607K198d7857o2976M3778J0049o4858C9894A4692b20926
$$ -149580 344371 163607 165805 -47857 -110833 -67055 -57006 -121864 39894 14692 -220926
15323A89981B3144p24J3099R7007A926J27028n5995P8302l9380L7528N3957g0535
$$ 189981 23144 22420 35519 132526 1926 128954 72959 151261 111881 149409 203366 -70535
15310B15913b0616A45923k270A7632J17465A9657a75251A67655a7285A05208a26888
$$ 215913 -20616 145923 143653 17632 135097 19657 -175251 167655 -17285 105208 -126888
15298c30001F9389O1Q022a00940a6598F8562a45199B76499f4044A84829o3215
$$ -330001 69389 69450 77472 -100940 -16598 68562 -145199 276499 -64044 184829 121614
15287A21614g0272q5323C7194J95240e1379D3238a17722A16494L4477B8565L84442
$$ 121614 -70272 -155595 37194 232434 -51379 43238 -117722 116494 150971 28565 413007
15276D13007B2238a60395A77810C2774J93944H2254d5599a1037k08427L3021B26733
$$ 413007 22238 -160395 177810 32774 226718 82254 -45599 -11037 -219464 -186443 226733
15264B10769B975b46925D31319L199c9405B72537A03481l297M8346K10687a39245
$$ 210769 2975 -246925 431319 434518 -39405 272537 103481 100184 148530 359217 -139245
15252a68175D4312K02385A4985N64803K80991L73727j4822K49196J43223k01641
$$ -168175 44312 246697 14985 579788 860779 1234506 1219684 1468880 1612103 1410462
15242A410462p1773o51369j73166r2659A5280K50968K18274B30010p5933C4782
$$ 1410462 1338689 687320 514154 421495 15280 266248 484522 230010 154077 34782
15231A812h9260H5484L09327f5704C0624R2292a0376G608g6369C22321j29851
$$ 1812 -89260 85484 394811 -65704 30624 122916 -10376 7608 -76369 322321 192470
15220A92470p9942b561I1936J31434c6956D7560a48425P0736n9722O044B19169
$$ 192470 112528 -2561 91936 223370 -36956 47560 -148425 -77689 -137411 -131367 219169
15208A35582K3052A3941K39051j01814J43774g3263E22384b5390A59372L1014
$$ 135582 158634 13941 252992 151178 294952 -73263 522384 -25390 159372 190386
15198A90386b1973B53372a27637H4948b8446D2110j6679J08987b2889j28174L665
$$ 190386 -21973 253372 -127637 84948 -28446 42110 25431 134418 -22889 -151063 -147398
15187a47398A86289b05567B9717L52608d8582A73883m0640J02244H8935J79476
$$ -147398 186289 -205567 29717 382325 -48582 173883 133243 235487 88935 268411
15177B68411m4427J02959I2931a38534h622B34650f9033K1038r5032B51413j7599
$$ 268411 223984 326943 92931 -138534 -8622 234650 -69033 -47995 -143027 251413 233814
15166B33814j1045A04979m1646a69597C8334a3675C76131h0910N195C24281J67636
$$ 233814 222769 104979 63333 -169597 38334 -13675 376131 -80910 -75715 324281 491917
15155D91917j69929A11967e0272B37905J55168C9720F998L15715j03851d366k44821
$$ 491917 321988 111967 -50272 237905 393073 39720 6998 322713 218862 -4366 -249187
15144b49187A37117J27504j32041m2901k9665P7509l9813c43309C00101A41298
$$ -249187 137117 264621 132580 89679 60014 137523 97710 -343309 300101 141298
15133G983K6631K11826K79512B38284j14608D5102L81397A95645a2044B43308
$$ 7983 34614 246440 525952 238284 123676 45102 426499 195645 -12044 243308
15122H1702K01765Q283J28821F359c1096D23347J50998j30312A2326K42592d3380
$$ 81702 283467 291750 420571 6359 -31096 423347 574345 444033 12326 254918 -43380
15110B80909I7246m1638K93989a65727o0529A20157o842d2322A76842C5195J15814
$$ 280909 97246 55608 349597 -165727 -226256 120157 113315 -42322 176842 35195 151009
15099A51009N6897L0164F5433K4043a31151K7188A62797e4029D2407P2771J68608
$$ 151009 207906 238070 65433 89476 -131151 -103963 162797 -54029 42407 115178 283786
15088B83786o9169J17362a9631A29116L11668A62716J57494a93132B43963J1891
$$ 283786 214617 331979 -19631 129116 440784 162716 320210 -193132 243963 255854
15078B55854C8264K08163A6486J27512P4630P5998n5390n3636l9804K09353A65822
$$ 255854 38264 246427 16486 143998 218628 294626 239236 185600 145796 355149 165822
15066C58992j23592e7240A82417Q6498j12793K29143A66166A5107Q4088B0461
$$ 358992 235400 -57240 182417 268915 156122 385265 166166 15107 99195 20461
15055B08715o2667j3182l5288M8911K65969O1297J4099A98810I2239B1342R2842
$$ 208715 146048 132866 97578 146489 412458 473755 487854 198810 92239 21342 114184
15044A14184K53127j03409d9914A43569o5998r744K62532a31646D1883K79755
$$ 114184 367311 263902 -49914 143569 77571 67827 330359 -131646 41883 321638
15034C21638h718a234F1636k4232e2410D10452A79398p1471K28615J57541j38863
$$ 321638 -8718 -1234 61636 37404 -52410 410452 179398 107927 336542 494083 355220
15023C55220J2868j10085k5107o3258F0995J7361K17578B3067J07738L25406k7452
$$ 355220 368088 258003 232896 169638 60995 78356 295934 23067 130805 456211 428759
15012D28759B00348M11557B15221m0910Q1594m4456B2303H883M85900k14199K2456
$$ 428759 200348 611905 215221 174311 255905 211449 22303 8883 494783 280584 303040
15001C03040M7135A55550l0533O77461C5149L35065G2340J56271l9480L39497
$$ 303040 350175 155550 125017 802478 35149 370214 72340 228611 189131 528628
14991E28628G5907J94442m2726d2061A68024N2732o8510F7466P7889J04009J5558
$$ 528628 75907 270349 227623 -42061 168024 220756 152246 67466 145355 249364 264922
14980B64922A9408K73191l3571O736b4143B72966K12950r2125o9786A06785O3024
$$ 264922 19408 292599 259028 265764 -24143 272966 485916 393791 324005 106785 169809
14969A69809M8123H5215K08255a04235C52492A31362o361h5530A42070F2827J86010
$$ 169809 217932 85215 293470 -104235 352492 131362 125001 -85530 142070 62827 248837
14958B48837J26211A72024K33338j24694A21555J26005l8370l5974J7428N30423
$$ 248837 375048 172024 405362 280668 121555 247560 209190 173216 190644 721067
14948G21067B71337L9108m0259A26152C8724L75393h0721C11233j3797K4079n9836
$$ 721067 271337 310445 270186 126152 38724 414117 -80721 311233 297436 321515 261679
14937B61679P9078R695j51483D6377L95548A98956l4019Q0227r4199L75L52937
$$ 261679 340757 350452 198969 46377 441925 198956 164937 245164 150965 151340 504277
14926E04277j70966k2594M633K2070j24454J58910j00147K97865j33924j55905
$$ 504277 333311 310717 315350 337420 212966 371876 271729 569594 435670 279765
14916B79765k8813P523K6157J24139J6870R7073Q3631r6505j96423K77939B29877
$$ 279765 250952 258475 284632 408771 425641 522714 606345 509840 313417 591356 229877
14904A61563L08685J55901N0164A35322L45588J95433Q7307k24943B33306O8655
$$ 161563 470248 626149 676313 135322 480910 676343 763650 538707 233306 301961
14894C01961J6664o0783J20385A72985J71432K28909k45045R6779L663J41196
$$ 301961 318625 257842 378227 172985 344417 573326 328281 425060 428723 569919
14884E69919A49982J67536L15430B13328J64147J71875B26752K18436k12646A02912
$$ 569919 149982 317518 632948 213328 377475 549350 226752 445188 232542 102912
14873C88141J52469B62900F918L64073A69113K95002k093J63578j79064O9885
$$ 388141 540610 262900 6918 370991 169113 464115 462022 625600 446536 516421
14863E16421J36557B45145L98914J87199j18906C20258J47619o852J99490C22608
$$ 516421 652978 245145 644059 831258 712352 320258 467877 461025 660515 322608
14852E86010k25396j4604J31689A02123M49385j3429L1553Q9985l16283O7102
$$ 586010 360614 346010 477699 102123 551508 538079 569632 659617 343334 410436
14842D10436K66694p6814J92482G8352M22495j68934l2370J54832j16321A51321
$$ 410436 677130 600316 792798 78352 500847 331913 299543 454375 338054 151321
14831C01282K82237j34361P5509j12018L9944K0638K41967B66776j2349L18285
$$ 301282 583519 449158 524667 412649 452593 473231 715198 266776 254427 572712
14821E72712N7254p4828J88411k45764R99J52065L7549k85000P823J84730j52125
$$ 572712 629966 555138 743549 497785 498784 650849 688398 403398 411221 595951 443826
14810D43826N9336K2715r0923J45000k16942K7226M29645C17537N95393m16089
$$ 443826 503162 525877 434954 579954 363012 390238 819883 317537 912930 496841
14800D96841k2736n5518K74786k08855K72967o2126K5532K40525m07002J5877
$$ 496841 474105 418587 693373 484518 757485 695359 720891 961416 554414 570291
14790E70291j48263K10640j08736K16839j97761p8693N9273Q7189K74911k33517
$$ 570291 422028 632668 523932 740771 543010 464317 523590 610779 885690 652173
14780F52173k4874L0753j61920J56679K7641j75131p99K74455o3332j58357j37523
$$ 652173 627299 658052 496132 652811 680452 505321 504522 778977 715645 557288 419765
14769D19765L98544k83682l2042K04580l45934K14121k20624L19850J22627l89956
$$ 419765 818309 534627 502585 707165 361231 575352 354728 674578 797205 407249
14759D07249L5471J5438J3059K52373J02877j01905J21057k70375L54803l42768
$$ 407249 442720 458158 471217 723590 826467 724562 845619 575244 930047 587279
14749E87279k37315L46526O6357K49309j98731O8754O0401q1002J56582l00004
$$ 587279 349964 696490 762847 1012156 813425 882179 942580 861578 1018160 718156
14739G18156M4568J60591L0723k31100M61901j42672C81899O19234j77007L171
$$ 718156 762724 923315 954038 722938 1184839 1042167 381899 1001133 824126 827297
14729H27297K25226l07808M55135l64718m7628J19556K16348n1663K7864j14563
$$ 827297 1052523 744715 1199850 835132 787504 907060 1123408 1071745 1099609 985046
14719I85046j37446J81628j06168j06624J58196L7565r9204C21027K73655M03950
$$ 985046 847600 1029228 923060 816436 974632 1012197 912993 321027 594682 998632
14709I98632M8412m98488N65989k43414M2038k16430N07737J18529m02945J47733
$$ 998632 1047044 548556 1114545 871131 913169 696739 1204476 1323005 920060 1067793
14699A067793J76252r5866P33P4980j00641l80058K05827j18075L31829m58930
$$ 1067793 1244045 1148179 1148912 1223892 1123251 743193 949020 830945 1162774 703844
14689G03844K18316K13565K1304q1006M490J08913M8205l04534K00253K7180k90270
$$ 703844 922160 1135725 1157029 1076023 1080513 1189426 1237631 933097 1133350 1160530 870260
14678H70260K36268P6700n3729k87990K93592j21994P5636N5479K45752k69345
$$ 870260 1106528 1183228 1129499 841509 1135101 1013107 1088743 1144222 1389974 1120629
14668A120629J8762L06065l20035Q2752j7862n9509o462N6051j05566l4815L39992
$$ 1120629 1139391 1445456 1125421 1208173 1190311 1130802 1124340 1180391 1074825 1040010 1380002
14657A380002j75081Q3659j70990J95124j00279k4190p4225J70568K12532J09227
$$ 1380002 1204921 1288580 1117590 1312714 1212435 1188245 1114020 1284588 1497120 1606347
14647A606347k87252Q2538Q2870m11986k9932J41618Q2652L57396l43376P9368
$$ 1606347 1319095 1401633 1484503 1072517 1042585 1184203 1266855 1624251 1280875 1360243
14637A360243J23833K02383j67464O1281l08648J92166j10516K6837N4576Q6267
$$ 1360243 1484076 1686459 1518995 1580276 1271628 1463794 1353278 1380115 1434691 1520958
14627A520958J49093K077k35782L62508m79107K50559k98124N88115o39978M36792
$$ 1520958 1670051 1672128 1436346 1798854 1319747 1570306 1272182 1860297 1220319 1657111
14617A657111J39512l90681J93045o1423K33492l22238M60852j52121k85688J48478
$$ 1657111 1796623 1405942 1598987 1537564 1771056 1448818 1909670 1757549 1471861 1620339
14607A620339K4807K48088J20206m9454K7705m67057M97857m41363J51065K64917
$$ 1620339 1645146 1893234 2013440 1963986 1991691 1524634 2022491 1581128 1732193 1997110
14597A997110J11458j82368o8779n2970L09350j62003J90070j09340l52131L38837
$$ 1997110 2108568 1926200 1857421 1804451 2113801 1951798 2141868 2032528 1680397 2019234
14587B019234Q2623J60700J05027j06393l43993n5978r2653N56417k37451r588
$$ 2019234 2101857 2262557 2367584 2261191 1917198 1861220 1768567 2324984 2087533 2077945
14577B077945L42871j79748L8019J89861k76087K50050J57411j22694j74428J46558
$$ 2077945 2420816 2241068 2279087 2468948 2192861 2442911 2600322 2477628 2303200 2449758
14567B449758J64844J56782j5748J93402k5604k61874N00207l85685K80172J87868
$$ 2449758 2614602 2771384 2755636 2949038 2923434 2661560 3161767 2776082 3056254 3244122
14557C244122l8523M30816J75857q3414O81131J50763N83365Q28148J895533L825676
$$ 3244122 3205599 3636415 3812272 3728858 4409989 4560752 5144117 5972265 7867798 11693474
14547A1693474Q824872J9205501J0549209B4886508A1551238n534295j169615
$$ 11693474 20518346 39723847 50273056 24886508 11551238 6016943 4847328
14540D847328k55151j322051m97771o15098M2771J00701j12900M02445j95119
$$ 4847328 4592177 3270126 2772355 2157257 2200028 2300729 2187829 2590274 2395155
14531B395155o0134M81371k58594j04477K554j57604R8391M30597m04897L69162
$$ 2395155 2335021 2816392 2557798 2453321 2455875 2298271 2396662 2827259 2422362 2791524
14521B791524K77618k18904k3173q605L24787l043k55617M1869J8908L05396j15500
$$ 2791524 3069142 2850238 2827065 2818460 3143247 3140204 2884587 2926456 2945364 3250760 3135260
14510C135260j23356J03564O5598k04403L88279j74922O6510K75639m5625K2808
$$ 3135260 3011904 3115468 3181066 2976663 3364942 3190020 3256530 3532169 3486544 3509352
14500C509352l39143J84519K34506L22420o7914l25399M20794j2732n63496N33183
$$ 3509352 3170209 3354728 3589234 3911654 3843740 3518341 3939135 3926403 3362907 3896090
14490C896090j8173l6813r222L00025L5066j24133J64781K0616J63489j4202m4182
$$ 3896090 3877917 3841104 3831882 4131907 4166973 4042840 4207621 4228237 4391726 4377524 4333342
14479D333342K12359j45057q9954K30059p5560p6014J27593K53267j24778K01127
$$ 4333342 4545701 4400644 4310690 4540749 4465189 4389175 4516768 4770035 4645257 4846384
14469D846384N02178j04473m13004J21899M24373l57082L40343L98675m88645
$$ 4846384 5348562 5244089 4831085 4952984 5377357 5020275 5360618 5759293 5270648
14460E270648j72597P87408k24530P2900p3365K06298Q7813k7928J19979j11283
$$ 5270648 5098051 5885459 5660929 5733829 5660464 5866762 5954575 5926647 6046626 5935343
14450E935343J12103j28490K84767J50266j83311K73288J14522p1218Q4543Q9678
$$ 5935343 6047446 5918956 6203723 6353989 6170678 6443966 6558488 6487270 6571813 6661491
14440F661491O6742M23486j22071N97510n51326M42265l26207J26800L00691j72969
$$ 6661491 6728233 7151719 7029648 7627158 7075832 7518097 7191890 7318690 7619381 7446412
14430G446412K22585K32342J37988K2556J91002R0072J22205R5867K67434k46627
$$ 7446412 7668997 7901339 8039327 8061883 8252885 8342957 8465162 8561029 8828463 8581836
14420H581836N51985j94327M76238M2554j62795K23579J56588j02508L10993K96220
$$ 8581836 9133821 8939494 9415732 9458286 9295491 9519070 9675658 9573150 9884143 10180363
14410A0180363J11315O1690K61109K3920K85925Q208N71870j45780O09181k74397
$$ 10180363 10291678 10353368 10614477 10638397 10924322 10932530 11504400 11358620 11967801 11693404
14400A1693404J93960o68K42429J95242K90308N6139L55175M43052P5784M54591
$$ 11693404 11887364 11886696 12129125 12324367 12614675 12670814 13025989 13469041 13544825 13999416
14390A3999416n9943K76447k062O76204q0677L87593P701M38486L92690k9477
$$ 13999416 13939473 14215920 14213858 14890062 14809385 15196978 15204679 15643165 16035855 16006378
14380A6006378M94205M88956K14208K11484M06685L67923M15561o932N81845O32695
$$ 16006378 16500583 16989539 17203747 17415231 17821916 18189839 18605400 18598468 19180313 19813008
14370A9813008K68172L26226K01817P48557K12576O69533K51479N57281O28438
$$ 19813008 20081180 20407406 20609223 21357780 21570356 22239889 22491368 23048649 23677087
14361B3677087M24056K49758O44861J004347P0862J038634J68433N41280O69526
$$ 23677087 24101143 24350901 24995762 26000109 26070971 27109605 27278038 27819318 28488844
14352B8488844J209036K36979P48222N48338R13643P97037R22824Q44192J170071
$$ 28488844 29697880 29934859 30683081 31231419 32145062 32942099 33864923 34709115 35879186
14343C5879186N43711J187230Q09593Q34349J367103J001093J181886J464074
$$ 35879186 36422897 37610127 38419720 39254069 40621172 41622265 42804151 44268225
14335D4268225J134859J275834J100905J804332J309567J337440K009163J627588
$$ 44268225 45403084 46678918 47779823 49584155 50893722 52231162 54240325 55867913
14327E5867913J668239K081317J413151K481425K027526J995641K903660J948016
$$ 55867913 57536152 59617469 61030620 63512045 65539571 67535212 70438872 72386888
14319G2386888K878249K856083K838943L073821L089787L050551L564785M080022
$$ 72386888 75265137 78121220 80960163 84033984 87123771 90174322 93739107 97819129
14311I7819129L857338M300222M176637M398331N117591N213765N571830N665871
$$ 97819129 101676467 105976689 110153326 114551657 119669248 124883013 130454843 136120714
14303A36120714N942535O306066P141085P047550P586774P912223Q906113Q540863
$$ 136120714 142063249 148369315 155510400 162557950 170144724 178056947 186963060 195503923
14295A95503923R999532R715404J0384698J1104090J1463858J2095735J2770884
$$ 195503923 205503455 215218859 225603557 236707647 248171505 260267240 273038124
14288B73038124J2768071J4044828J3920250J4638997J4469633J4729933J4705980
$$ 273038124 285806195 299851023 313771273 328410270 342879903 357609836 372315816
14281C72315816J4899579J4502098J4047580J3142267J2371633J0923293R418275
$$ 372315816 387215395 401717493 415765073 428907340 441278973 452202266 461620541
14274D61620541P706664M215775P01923l39038j346610p59067o851295m264641
$$ 461620541 469327205 473542980 474244903 473905865 472559255 471800188 464948893 460684252
14266D60684252n988653q588023j0256485j1893502j3611944j4407780j5300814
$$ 460684252 454695599 446107576 435851091 423957589 410345645 395937865 380637051
14259C80637051j5155009j5747226j5539569j4952339j5104378j3958219j3878382
$$ 380637051 365482042 349734816 334195247 319242908 304138530 290180311 276301929
14252B76301929j3128090j1850320j2160238j1506651j0820093j0296696j0096315
$$ 276301929 263173839 251323519 239163281 227656630 216836537 206539841 196443526
14245A96443526r458267p989511q347875p959902p389558o955771o236816o141811
$$ 196443526 186985259 178995748 170647873 162687971 155298413 148342642 142105826 135964015
14237A35964015n537857n641614n382467m885329m803599m335064l666581m186531
$$ 135964015 130426158 124784544 119402077 114516748 109713149 105378085 101711504 97524973
14229I7524973l221458m362255l163189l009685l375583k710004k626133l231651
$$ 97524973 94303515 89941260 86778071 83768386 80392803 77682799 75056666 71825015
14221G1825015j925312k006760k311293k321485k016531k300853j854419j416410
$$ 71825015 69899703 67892943 65581650 63260165 61243634 58942781 57088362 55671952
14213E5671952j439021j795212j410839j834789j305728r39231j313383j437108
$$ 55671952 54232931 52437719 51026880 49192091 47886363 46947132 45633749 44196641
14205D4196641j483952j120432j022265j099306j071494q21404j269906q28761
$$ 44196641 42712689 41592257 40569992 39470686 38399192 37577788 36307882 35479121
14197C5479121p70495j254978m35735q02241o13756j026005p29065n54897j087849
$$ 35479121 34708626 33453648 33017913 32215672 31601916 30575911 29846846 29291949 28204100
14188B8204100n02739o53538k09162r53414q96518l01331o53315m92041o43246
$$ 28204100 27701361 27047823 26838661 25885247 24988729 24687398 24034083 23542042 22898796
14179B2898796j22387r02011k79737n73623k26839k82561l74690l20717o07603
$$ 22898796 22776409 21874398 21594661 21021038 20794199 20511638 20136948 19816231 19208628
14170A9208628k49732l01773l58443p72372l10709o0550m73834j31839n5048n72636
$$ 19208628 18958896 18657123 18298680 17526308 17215599 17155049 16681215 16549376 16494328 15921692
14160A5921692q6180k55880k77806l37593l48303j24011o60244J50970k42381
$$ 15921692 15835512 15579632 15301826 14964233 14615930 14491919 13831675 13982645 13740264
14151A3740264k11834m26660L9804k62943j9561m75917j39403q6373l40519o5589
$$ 13740264 13528430 13101770 13141574 12878631 12859070 12383153 12243750 12157377 11816858 11751269
14141A1751269k70879j80883l43233L5727k24660j48066K0064m57173J33812l23863
$$ 11751269 11480390 11299507 10956274 10992001 10767341 10619275 10639339 10182166 10315978 9992115
14131I992115j88711Q7313k96931j15521l5360k87353p914m46229l23068O03177
$$ 9992115 9803404 9890717 9593786 9478265 9442905 9155552 9147638 8701409 8378341 8981518
14121H981518k44739n21967L37942n64081Q5804J61517o39894O25841m62313j56729
$$ 8981518 8736779 8214812 8552754 7988673 8074477 8235994 7596100 8221941 7759628 7602899
14111G602899j65573J92683p24171N00994j79950j30589k18549L17551k36408
$$ 7602899 7437326 7630009 6905838 7406832 7226882 7096293 6877744 7195295 6958887
14102F958887j69626j7854j07278K9235n14555P5791O7386j01346r1583o0335
$$ 6958887 6789261 6771407 6664129 6693364 6178809 6254600 6321986 6220640 6129057 6068722
14092F068722r1621K60438j45534j12550l10241o400J04095k20917m6511o8681
$$ 6068722 5977101 6237539 6092005 5979455 5669214 5662814 5766909 5545992 5499481 5430800
14082E430800l11417Q7402K17294m7136N3039k64432P5964k92192J17711j43280
$$ 5430800 5119383 5206785 5424079 5376943 5429982 5165550 5241514 4949322 5067033 4923753
14072D923753k55030n9863L36685k33180L2159J6444m8388j25131k33043k0326
$$ 4923753 4668723 4608860 4945545 4712365 4744524 4760968 4712580 4587449 4354406 4334080
14062D334080L8254k35558k4740Q8853p6010Q6373l8734l49091K34453O255q508
$$ 4334080 4372334 4136776 4112036 4200889 4124879 4211252 4172518 3823427 4057880 4064135 4055627
14051D055627k2521m1346K76673n15343o8687L4200J59004J5668k51066k7183
$$ 4055627 4033106 3991760 4268433 3753090 3684403 3718603 3877607 3893275 3642209 3615026
14041C615026q626l0449j4560j26515o6925J48050k42385j41120K91299o1596
$$ 3615026 3606400 3575951 3561391 3434876 3367951 3516001 3273616 3132496 3423795 3362199
14031C362199q6330O8806n5797L670j81908L811Q0631m43188K33454r6675j35608
$$ 3362199 3275869 3344675 3288878 3292548 3110640 3114451 3195082 2751894 2985348 2888673 2753065
14020B753065J10491j4535L3362Q1341J49619j19358j17005k37726M61478m60893
$$ 2753065 2863556 2849021 2882383 2963724 3113343 2993985 2876980 2639254 3100732 2639839
14010B639839p3142j29835J80037R6153l50724K47549j97056k9868K27278j47698
$$ 2639839 2566697 2436862 2616899 2713052 2362328 2609877 2412821 2382953 2610231 2462533
14000B462533K5610J12912l4848l19745k17937K94333k17924k4498K16041L32423
$$ 2462533 2488143 2601055 2566207 2246462 2028525 2322858 2104934 2080436 2296477 2628900
13990B628900m5313J318922K053251O421481J8599292J9450306j9645312j4771710
$$ 2628900 2583587 3902509 5955760 12377241 30976533 50426839 30781527 16009817
13982A6009817o627966k953197j034167p57159m94425n64063k00848j45735k1977
$$ 16009817 9381851 6428654 5394487 4637328 4142903 3578840 3377992 3232257 3210280
13973C210280k22026r8931Q295m18019K54101j78144M16318l70808J28642j29316
$$ 3210280 2988254 2889323 2897618 2479599 2733700 2555556 2971874 2601066 2729708 2600392
13963B600392M5366l97439j0372J55466k4164p5109Q5049J64436l95496K50302
$$ 2600392 2645758 2248319 2237947 2393413 2369249 2294140 2379189 2543625 2148129 2398431
13953B398431k70779K38835j85262J08160k96215P0870Q8142J00172l18994m9690
$$ 2398431 2127652 2366487 2181225 2289385 1993170 2064040 2152182 2252354 1933360 1883670
13943A883670J45229J38411l40355M43515l24954K28556k45481j61617M85342
$$ 1883670 2028899 2167310 1826955 2270470 1945516 2174072 1928591 1766974 2252316
13934B252316m09755M28613n52815K98123k24479j29080N47866k21507l81052
$$ 2252316 1842561 2271174 1718359 2016482 1792003 1662923 2210789 1989282 1608230
13925A608230M47471m46808J99106k14543l7589K43720l6153j91219k57935J02326
$$ 1608230 2055701 1608893 1807999 1593456 1555867 1799587 1763434 1572215 1314280 1416606
13915A416606K68815j36784J23030n8624P378k53023l4894K52776n7153K5319
$$ 1416606 1685421 1548637 1671667 1613043 1620421 1367398 1332504 1585280 1528127 1553446
13905A553446j75516L8326k0209N4009J41962k78727p8469J93192j42636j3874
$$ 1553446 1377930 1416256 1396047 1450056 1592018 1313291 1234822 1428014 1285378 1271504
13895A271504J64253J02686r1425J42371l09614O0036J44512m59041N18744M0859
$$ 1271504 1435757 1538443 1447018 1589389 1279775 1339811 1484323 1025282 1544026 1584885
13885A584885j01003k19371J64288J4993Q4636R5428l18251p2237J63854J15864
$$ 1584885 1483882 1264511 1428799 1443792 1528428 1623856 1305605 1233368 1397222 1513086
13875A513086l17967J65241K06580k89858O9763p7515J24318O4030k84236k75559
$$ 1513086 1195119 1360360 1566940 1277082 1346845 1269330 1393648 1457678 1173442 897883
13865H97883O70040j63540K04169l59036m8075L83933p00904J16934k0505L40779
$$ 897883 1567923 1404383 1608552 1249516 1201441 1585374 884470 1001404 980899 1321678
13855A321678k54430K22447l01212K54603O1250j81203O7449p5171j40542J03399
$$ 1321678 1067248 1289695 988483 1243086 1304336 1123133 1190582 1115411 974869 1078268
13845A078268N305N1288q580n1294K55432j12578j54687k16290J72473J19266
$$ 1078268 1083573 1134861 1126281 1074987 1330419 1217841 1063154 846864 1019337 1138603
13835A138603j45697j61906K12098O5504K22277j75107o9900j80136O9632K0782
$$ 1138603 992906 831000 1043098 1108602 1330879 1155772 1085872 905736 975368 996150
13825I96150J10862p9017l32178J7003K52491j52422L08148k66055J88802J12695
$$ 996150 1107012 1027995 695817 712820 965311 812889 1121037 854982 1043784 1156479
13815A156479n6052j98146P4665j80773R7297k26273N22527j29013k87860L00286
$$ 1156479 1100427 902281 976946 796173 893470 667197 1189724 1060711 772851 1073137
13805A073137l83063K69814M753L79729j20697l55975j00063N1921q7644L20647
$$ 1073137 690074 959888 964641 1344370 1223673 867698 767635 819556 731912 1052559
13795A052559j37364J07971l73097L33163l86795J6210L00481l1588L26470l68984
$$ 1052559 915195 1023166 650069 983232 596437 612647 913128 881540 1208010 839026
13785H39026o1778n3313M75682k37268k72447Q1373J62243k33732J14474r7696
$$ 839026 777248 723935 1199617 962349 689902 771275 933518 699786 814260 716564
13775G16564L85279k74516L02679m78086j78488L00983Q7162J49397j46658J13309
$$ 716564 1101843 827327 1130006 651920 473432 774415 861577 1010974 864316 977625
13765I77625k28678N5800j18459J88101r4356k680j70022O2031o5184J39049O0909
$$ 977625 748947 804747 686288 874389 780033 777353 607331 669362 604178 743227 804136
13754H04136J48038n6481k86235J50646J11564R4990m03735J91471j7491m6513
$$ 804136 952174 895693 609458 760104 871668 966658 562923 754394 736903 690390
13744F90390r8600K73617l60329Q7641B60317L57423K31066k10437J12453k4277
$$ 690390 591790 865407 505078 592719 260317 617740 848806 638369 750822 726545
13734G26545k26847L87781B96175N37363k49414n4857K74399j71039R7450J88228
$$ 726545 499698 887479 296175 833538 584124 529267 803666 632627 730077 918305
13724I18305j28335k52692J84814q1875k01533M6100J73929j90732K33776j97834
$$ 918305 789970 537278 722092 640217 438684 484784 658713 467981 701757 503923
13714E03923N5198K89455j76697j58893k22005P50900m57472J7901k18767L20871
$$ 503923 559121 848576 671879 512986 290981 1041881 584409 602310 383543 704414
13704G04414k99040K98699j32631J52616j29225J6989j122j29131B33382N68207
$$ 704414 405374 704073 571442 724058 594833 611822 610700 481569 233382 801589
13694H01589j4439A83089L92968P7490j90460P8384q6044o9766L6997M4511k3615
$$ 801589 787150 183089 576057 653547 463087 541471 455427 385661 422658 467169 443554
13683D43554M30565p1446C05568L62426C26012L02410B49477R1800K86533k55118
$$ 443554 874119 802673 305568 667994 326012 628422 249477 341277 627810 372692
13673C72692J26652R8151M830Q0185K1395B57070L76568o7114k81297K64202L29238
$$ 372692 499344 597495 602325 682510 703905 257070 633638 566524 285227 549429 878667
13662H78667k74979J23825r5140j43158m041M2607O4328K27925k47729m7467j60312
$$ 878667 603688 727513 632373 489215 485174 527781 592109 820034 572305 524838 364526
13651C64526J90344q9816O0383k39156J40603k840J82613L8472B92019L63094
$$ 364526 554870 465054 525437 286281 426884 424044 606657 645129 292019 655113
13641F55113k3442j02016k25825K89220k68620K90878j51364J7219K13393k27821
$$ 655113 631671 529655 303830 593050 324430 615308 463944 481163 694556 466735
13631D66735A84737J75269J36854k39093k376j3348M72898l20393O5969A20000
$$ 466735 184737 360006 496860 257767 255391 242043 714941 394548 460517 120000
13620E55232j15589q3902O0712p6846n63q6533J65155M47238k29676k3681m7189
$$ 555232 439643 355741 416453 339607 339044 252511 417666 864904 635228 611547 564358
13609E64358P1889O6355l25684J73006a9795D83417m7632e7463E11935N9959J7309
$$ 564358 636247 702602 376918 549924 -19795 483417 435785 -57463 511935 571894 589203
13598E89203k73230L4139A14851K21722J20928q5389j01557J13439L8356F2495
$$ 589203 315973 350112 114851 336573 457501 372112 270555 383994 422350 62495
13587D21987P795o8608K26489B79850J81771j95782M3769A33111M12053A59420
$$ 421987 429782 361174 587663 279850 461621 265839 309608 133111 545164 159420
13576C80663E5522K42665M2090Q0964j48897P6675r3079P0066j28782J28253A60023
$$ 380663 55522 298187 340277 421241 272344 349019 255940 326006 197224 325477 160023
13564B87042A02921R0917L39871o8207n0418j27684P9135r5033O595M5081L0029
$$ 287042 102921 193838 533709 465502 415084 287400 366535 271502 278097 323178 353207
13553C53207J32631o4208A16472J35547M24216r2404B83194e8783B08456K82367
$$ 353207 485838 421630 116472 252019 676235 583831 283194 -58783 208456 490823
13543D90823A35078J7788K4625K55796j41469A14922K32227H5463M44102k39994
$$ 490823 135078 152866 177491 433287 291818 114922 347149 85463 529565 289571
13533B89571A11534g1886G16654C57100p0236k8534p5973L41729B57974K0472
$$ 289571 111534 -71886 716654 357100 286864 258330 182357 524086 257974 278446
13523B78446L638N7890A45277R5316O9415o616r0837R3681j31631L27819k02862
$$ 278446 282084 339974 145277 240593 310008 303392 212555 306236 174605 502424 299562
13512B99562J22165j67520j7443J3718n2794J63273j14638L2854J4335R3899I3748
$$ 299562 421727 254207 236764 250482 197688 360961 246323 279177 293512 387411 93748
13500A29080J81250I3793k8111L05559n2810C9475L11969A32032A7239M48049
$$ 129080 310330 93793 65682 371241 318431 39475 351444 132032 17239 465288
13490D65288L8949A65678N3147J1019J83599J4500j11144A29108L16064k12229
$$ 465288 504237 165678 218825 229844 413443 427943 316799 129108 445172 232943
13480B32943r2905M58544B4297L86370r1971J7675c9841A88883J72042f035A84937
$$ 232943 140038 598582 24297 410667 318696 336371 -39841 188883 360925 -6035 184937
13468g5606C22799a6724E66663p2801A40537K02829F0524K76824q8263D4907K52233
$$ -75606 322799 -16724 566663 493862 140537 343366 60524 337348 249085 44907 297140
13457B97140M57532C32836I7938J36197K34490j77181a05591A05235J10084J38644
$$ 297140 754672 332836 97938 234135 468625 291444 -105591 105235 215319 353963
13447C53963N5711j3246A65137G7462Q580P4122K95856k27174H7172L60435J8935
$$ 353963 409674 396428 165137 77462 86042 160164 456020 228846 87172 447607 466542
13436D66542j06144n9533m2375l5463G0695P3607G1547L43222j79095q2103J45650
$$ 466542 360398 300865 258490 223027 70695 144302 71547 414769 235674 153571 299221
13425B99221K25984h6667B53455j945q0720K90213A68861P3989K92584j36927
$$ 299221 525205 -86667 253455 251510 170790 461003 168861 242850 535434 398507
13415C98507H2653J01807Q543K09829a93114E0783h429B44572O7454K93180A30962
$$ 398507 82653 184460 193003 402832 -193114 50783 -8429 244572 312026 605206 130962
13403H9764K49673J5334A30322K02131a47376B90307h8376A69256K1294D3785
$$ 89764 339437 354771 130322 332453 -147376 290307 -88376 169256 190550 43785
13392F15024g9525C55366k0277m0683I8939J49335N2025p3560C622a02480l4217
$$ 615024 -79525 355366 335089 294406 98939 248274 300299 226739 3622 -102480 -136697
13381a36697C06268A25480J22786A06570J24371K75849h855I5888J85447q2931
$$ -136697 306268 125480 248266 106570 230941 506790 -8855 95888 281335 198404
13371A98404A5324K98523J23075A0730B279L14130J18981b93296B1934J45012
$$ 198404 15324 313847 436922 10730 2279 316409 435390 -293296 21934 166946
13361A66946J72247p237E9173p241M35758A17003J8339B5059L07275L12566k97542
$$ 166946 339193 331956 59173 51932 487690 117003 135342 25059 332334 644900 347358
13350C47358n1045m9587n2357a86493B86689j04744L2504o308a3204m6253C41248
$$ 347358 296313 246726 194369 -186493 286689 181945 214449 208141 -13204 -59457 341248
13338D60803o5682j42025Q7902A40619N8568K53417A87599L79627A55151L0694
$$ 460803 395121 253096 340998 140619 199187 452604 187599 567226 155151 185845
13328A85845J90231A33400J25781J99209j58226m3433j04398n8834K22102I1967
$$ 185845 376076 133400 259181 458390 300164 256731 152333 93499 315601 91967
13317D46511D8153L38862j48225a74362D8876P9455j1818K08078q381h8735B81632
$$ 446511 48153 387015 238790 -174362 48876 128331 116513 324591 316210 -88735 281632
13305D6980L09357p1316I2701J91362M0875J93554o8122A98531o7476E6050a11453
$$ 46980 356337 285021 92701 284063 324938 518492 450370 198531 131055 56050 -111453
13293A21381n4443K7557J73389b0593C56759e8961C4907A4830L02881n1529k2068
$$ 121381 66938 94495 267884 -20593 356759 -58961 34907 14830 317711 266182 244114
13282B44114m3729E7431J47548L5110q4757K6377b51883B81686G5547L08834R5708
$$ 244114 200385 57431 204979 240089 155332 181709 -251883 281686 75547 384381 480089
13271D80089k34405r447g0767I5796Q649A6488P0832b0091A62775n2951J82804
$$ 480089 245684 236237 -70767 95796 104445 16488 87320 -20091 162775 109824 292628
13260B92628j12833i2908B61381F695b889B01864J80834I1178K0309j1500O0958
$$ 292628 179795 -92908 261381 6695 -2889 201864 382698 91178 111487 99987 160945
13249A60945e1815A65654R0379a14991C18277D6067J13709a06079C21667K25988
$$ 160945 -51815 165654 256033 -114991 318277 46067 159776 -106079 321667 547655
13239E47655b2824b35B46765I2153b29581O3937B09619a25348A52152E3516a5965
$$ 547655 -22824 -235 246765 92153 -229581 -165644 209619 -125348 152152 53516 -15965
13227b3847n4051A55206n8348O670K58587A79302Q7083A30518J25089K25575B09081
$$ -23847 -77898 155206 96858 103528 362115 179302 266385 130518 255607 481182 209081
13215E9268O734J507b95944A82414b585B34535c2354N530A85609b70143E75782
$$ 59268 66002 67509 -295944 182414 -2585 234535 -32354 -26824 185609 -270143 575782
13203A0312M14770A99459K32783j89484q2842J11340R3935I6489d6115l5327C33641
$$ 10312 425082 199459 432242 242758 159916 271256 365191 96489 -46115 -81442 333641
13191E05992D1086K00696J83940d7341B96751L2373B515h7549D96403B5211J02615
$$ 505992 41086 241782 425722 -47341 296751 329124 2515 -87549 496403 25211 127826
13180A27826h671A33527m0603J31485n6643Q8886R9968H4141n36J69813r2723
$$ 127826 -8671 133527 92924 224409 167766 256652 356620 84141 83605 253418 160695
13169A60695J3843e9400j16747B24171N1076j35239A7194J26364Q4106q8001a38695
$$ 160695 174538 -59400 -176147 224171 275247 140008 17194 143558 227664 139663 -138695
13157B17413j07192B194J29429c26572A88974G2658a73687G9400q47A4888f5124
$$ 217413 110221 2194 131623 -326572 188974 72658 -173687 79400 78553 14888 -65124
13145C46760B1019K16077D2167K51810O4333f4758A82425D5037i6168B1858L06764
$$ 346760 21019 237096 42167 293977 358310 -64758 182425 45037 -96168 21858 328622
13134C28622F3049a49106C5806j5141J9372c9925C42120F2814g1018E179P794
$$ 328622 63049 -149106 35806 20665 40037 -39925 342120 62814 -71018 5179 12973
13123A2973M3811i2751A33414f975A91145f9633a5416E43011A73423J5785C7307
$$ 12973 56784 -92751 133414 -6975 191145 -69633 -15416 543011 173423 189208 37307
13111h2953p4795A03827K72085j16965P2978h1272j8446D2921A9442M4477f5218
$$ -82953 -157748 103827 375912 258947 331925 -81272 -99718 42921 19442 63919 -65218
13099C25868c4296A29767J37029F7345A4427b48060D2355e030B48529b1419I1165
$$ 325868 -34296 129767 266796 67345 14427 -248060 42355 -5030 248529 -21419 91165
13087A33881b08292A31856j0944b0271m2900A83922g7737o2057c5564j4101B07426
$$ 133881 -208292 131856 120912 -20271 -63171 183922 -77737 -139794 -35564 -49665 207426
13075C22883F1387d3148A49828K30368A08975K3204N0582g2809m1975a4198A85287
$$ 322883 61387 -43148 149828 380196 108975 132179 182761 -72809 -114784 -14198 185287
13063B77786j2067a22699H6163h7380B32098J32082j05621j04682c444A77131
$$ 277786 265719 -122699 86163 -87380 232098 364180 258559 153877 -3444 177131
13052a12270E86875A18849B6116J23443K40788f5795A70621b696o9562m5247d1018
$$ -112270 586875 118849 26116 149559 390347 -65795 170621 -2696 -72258 -117505 -41018
13040B8726q493L29656A57131M8583b18565N3279D93943A90611E6769J59194a81067
$$ 28726 20233 349889 157131 205714 -218565 -165286 493943 190611 56769 215963 -181067
13028B27870o4118i2144D06405a97235I8142e7015A7400L73636j23880P4176a87078
$$ 227870 163752 -92144 406405 -197235 98142 -57015 17400 391036 267156 341332 -187078
13016H9501P4324G2555R6621J28480A34387J72733e6228B8592L05599N7109A26357
$$ 89501 163825 72555 169176 297656 134387 307120 -56228 28592 334191 391300 126357
13004A22795a9370l1401p1199A28836a47435N5395B31172a2525F0002L619d18661
$$ 122795 -19370 -50771 -121970 128836 -147435 -92040 231172 -12525 60002 63621 -418661
12992i9557B91832a05681B40582A04902K3717K47614j30703i4739c9853C83548
$$ -99557 291832 -105681 240582 104902 128619 376233 245530 -94739 -39853 383548
12981A46001p1831a82597a3845j12010C934Q2166J16547l3240i0265p3777I1639
$$ 146001 74170 -182597 -13845 -125855 3934 86100 202647 169407 -90265 -164042 91639
12969b536B60151j02027e3073j20410m6164Q5157p708d1448A16735i0696B45670
$$ -2536 260151 158124 -53073 -173483 -219647 -134490 -142198 -41448 116735 -90696 245670
12957C141L10552A6738a80204A28117c1468B32055p3130a03409A03100L7870k5832
$$ 3141 313693 16738 -180204 128117 -31468 232055 158925 -103409 103100 140970 115138
12946A15138j504a46211d1519B5233O4204J1086e1286j57836B34492O4922a61286
$$ 115138 113634 -146211 -41519 25233 89437 100523 -51286 -209122 234492 299414 -161286
12934a36990B07512a09347j18735Q4641A05342a2011A93394B694L07258A26236
$$ -136990 207512 -109347 -228082 -143441 105342 -12011 193394 2694 309952 126236
12923a79596B50547K50138b14442C9190K21166p7100b97088F4031J33369F922
$$ -179596 250547 500685 -214442 39190 260356 183256 -297088 64031 197400 6922
12912B01268a28978A36485O5624i2939B10333J1101H5156a32805C42333E2383
$$ 201268 -128978 136485 202109 -92939 210333 221434 85156 -132805 342333 52383
12901A08008R2171k0935m7759D6894J55587j7381Q9965q1709O5851F2059J73794
$$ 108008 200179 179244 131485 46894 202481 185100 275065 193356 259207 62059 235853
12890B35853j1657g8087l602E941c4178h147j79744B31014b32650F4901e9917
$$ 235853 224196 -78087 -81689 5941 -34178 -8147 -187891 231014 -232650 64901 -59917
12878I1729K532f12178B81766A26396j7587l6373O5353E5069L2301d50279e1539
$$ 91729 94261 -612178 281766 126396 108809 72436 137789 55069 87370 -450279 -51539
12866b31515A06533g0660G013N2494O3177c04630B62076j15544c5005B88392i0210
$$ -231515 106533 -70660 7013 59507 122684 -304630 262076 146532 -35005 288392 -90210
12854A54J28786R7759L48030a35342A16020D2540a39216A38818F2043k6850g3405
$$ 154 128940 226699 574729 -135342 116020 42540 -139216 138818 62043 35193 -73405
12842A3855g9689A17029b4951A92774b90972C04586a73645D8520i0504B6938J42245
$$ 13855 -79689 117029 -24951 192774 -290972 304586 -173645 48520 -90504 26938 169183
12831A69183j5004c36141a9732k27490A96567G5728B9836J16909B6360j981f1227
$$ 169183 154179 -336141 -19732 -247222 196567 75728 29836 146745 26360 24379 -61227
12819A41230J49571j4996d3983A62581c98871D4438a0670B36520G915J16480J55970
$$ 141230 290801 275805 -43983 162581 -398871 44438 -10670 236520 7915 124395 280365
12808B80365a39629O5265A51756d6376A66656h8044j81032D7086a62860C19300
$$ 280365 -139629 -74364 151756 -46376 166656 -88044 -269076 47086 -162860 319300
12797A82902c6532C81079b77434d4445A0057Q8183c6397j29107A33207b879q1706
$$ 182902 -36532 381079 -277434 -44445 10057 98240 -36397 -165504 133207 -2879 -84585
12786h4585A123b0821O950A67015L4763i9267B34228a22575B64585C0477c8025
$$ -84585 1123 -20821 -13871 167015 201778 -99267 234228 -122575 264585 30477 -38025
12774C70549M3753a69174A58803G4698j5349J82054I9542K18997b11799A50460
$$ 370549 414302 -169174 158803 74698 59349 241403 99542 318539 -211799 150460
12763a2590A10800a73560B88535i4201B23269F7888k2038f4558m2078B24938a92613
$$ -12590 110800 -173560 288535 -94201 223269 67888 45850 -64558 -106636 224938 -192613
12751D5762K62317D8109b22290A60548O5661g2326j50488A54865n8042B345J94929
$$ 45762 308079 48109 -222290 160548 226209 -72326 -222814 154865 96823 2345 197274
12740A97274b43023J17820F2401K66920G5574f7182a1642A84821i3619B18887
$$ 197274 -243023 -125203 62401 329321 75574 -67182 -11642 184821 -93619 218887
12729b48684b8377C58792A40068D8800J24548K90751H6723B8405Q8644A9400P9274
$$ -248684 -28377 358792 140068 48800 173348 464099 86723 28405 117049 19400 98674
12718I8674P3270a65284b9615l94755a28798C4333a18517j0667C97451A55114
$$ 98674 171944 -165284 -29615 -424370 -128798 34333 -118517 -129184 397451 155114
12707D04210e8584B87450r5471J46489j20088m3442R2839G5166R5133a04441F1884
$$ 404210 -58584 287450 191979 338468 218380 174938 267777 75166 170299 -104441 61884
12695A1388O0376a50127j24422A70334p9732J05589D2858C762L07680j49418J87460
$$ 11388 71764 -150127 -274549 170334 90602 196191 42858 3762 311442 162024 349484
12684C49484D9481A0159M7572J26107O0965n4268M1382C6404A3084c65567C3854
$$ 349484 49481 10159 57731 183838 244803 190535 231917 36404 13084 -365567 33854
12672C43256J02760k16090K3073b9092B51168A23009D1467a16343G4908f010C84393
$$ 343256 446016 229926 252999 -29092 251168 123009 41467 -116343 74908 -6010 384393
12660A22001b24705d4926E9262b5814A30764J2443L7103a45646A49259l5386K56394
$$ 122001 -224705 -44926 59262 -25814 130764 143207 180310 -145646 149259 113873 370267
12649C70267j18372L9773A41175F2382k633d9844B84937C8622a33644J1534M1384
$$ 370267 251895 291668 141175 62382 59749 -49844 284937 38622 -133644 -122110 -80726
12638h0726A61107a1778A38934a56339C57479b10391c7084B17333J9489K70431
$$ -80726 161107 -11778 138934 -156339 357479 -210391 -37084 217333 236822 507253
12628E07253B01269J01684P5824j38009J79303l498i5019B44633f0716B7770J50380
$$ 507253 201269 302953 378777 240768 420071 416573 -95019 244633 -60716 27770 178150
12617A78150H7131l1647a79881d5306D8820c4468E6656K40961C2978a92655A16197
$$ 178150 87131 55484 -179881 -45306 48820 -34468 56656 297617 32978 -192655 116197
12605A00893K56341A6311b65386g2660A65564B7139J13838d5929G7098a44870
$$ 100893 357234 16311 -265386 -72660 165564 27139 140977 -45929 77098 -144870
12594I818a23148A47193B3993b72282B1862J70193F709J38395l0534l5508j5217
$$ 9818 -123148 147193 23993 -272282 21862 192055 6709 145104 114570 79062 63845
12583F3845m092d2294A46760J6443l6812a10283N3216A35066Q797b52967R1524
$$ 63845 59753 -42294 146760 163203 126391 -110283 -57067 135066 143863 -252967 -161443
12572a61443A05297Q9648a40174C6088A6764K51723c35888A16173k0686g9262
$$ -161443 105297 194945 -140174 36088 16764 268487 -335888 116173 95487 -79262
12561B62489c5440C5891f6386C7292a94053L3448D7133K56a11608D0369J17518
$$ 262489 -35440 35891 -66386 37292 -194053 -160605 47133 47389 -111608 40369 157887
12550A57887h8242J1316J3778k8207j79575E474a40375j14998G9958K13398J2209
$$ 157887 -88242 -76926 -63148 -91355 -270930 5474 -140375 -255373 79958 293356 305565
12539C05565A43337a71020O5891j88924e9396q9656r4695E1543a27928N8240A01693
$$ 305565 143337 -171020 -105129 -294053 -59396 -149052 -243747 51543 -127928 -69688 101693
12527C1102K42480c43613I139K48956j6097F8259L0891K53575j68149a15957q8828
$$ 31102 273582 -343613 9139 258095 241998 68259 99150 352725 184576 -115957 -204785
12516b04785j03111c7317C5655O4500a50282m4688i3183I7112b6210D3642a68761
$$ -204785 -307896 -37317 35655 100155 -150282 -194970 -93183 97112 -26210 43642 -168761
12504a1282C4678J20500c0547j20879j79958a22660m855k08920C32025A17083
$$ -11282 34678 155178 -30547 -151426 -331384 -122660 -127515 -336435 332025 117083
12493E2181O5105h828A81652E024q91M7562g7299B13589c35276H8242e56068g50
$$ 52181 117286 -8828 181652 5024 4133 51695 -77299 213589 -335276 88242 -556068 -750
12480c23329a58616B62655A2207b8371F7150c13080A17438L7408e5329p2959B03234
$$ -323329 -158616 262655 12207 -28371 67150 -313080 117438 154846 -55329 -128288 203234
12468a50606H7202c15722d0484C6040J58058J43166d6288C5505J15153a67980
$$ -150606 87202 -315722 -40484 36040 194098 337264 -46288 35505 150658 -167980
12457B4241K69268A15468a96079B77854K6180A24512g4985b0182A61773C0498
$$ 24241 293509 115468 -196079 277854 304034 124512 -74985 -20182 161773 30498
12446B13275m7582f1186a0156p9136A13470C0833N2771A4281M1419b5518j64852
$$ 213275 165693 -61186 -10156 -89292 113470 30833 83604 14281 55700 -25518 -190370
12435a90370Q5154J1750p3825A04100K408i5991J9215j58769f0144j20685g9751
$$ -190370 -105216 -93466 -167291 104100 106508 -95991 -76776 -235545 -60144 -180829 -79751
12423c44208A2079O30381A50402a99116B90260b4296A24100J57553I2871l1891
$$ -344208 12079 642460 150402 -199116 290260 -24296 124100 281653 92871 60980
12413F0980a2949j44756J3631D3162k1073J92484J04373a78274j90438a43835
$$ 60980 -12949 -157705 -144074 43162 22089 214573 318946 -178274 -368712 -143835
12402a47923O7968F5967b00539c2108B92161d02980a40767l35560h4868A4284
$$ -147923 -79955 65967 -200539 -32108 292161 -402980 -140767 -476327 -84868 14284
12391A65797c4093C27874j8092a44252l6801B37593a44461K1377a2758j73697
$$ 165797 -34093 327874 309782 -144252 -181053 237593 -144461 -123084 -12758 -186455
12381a86455B33235a62800N3331A70896a01578G005c07523a33665L0360j4526
$$ -186455 233235 -162800 -109469 170896 -101578 7005 -307523 -133665 -103305 -117831
12371a17831N2280C7129L21983j07246A1661L31487a7688A03559A9201J5938c83921
$$ -117831 -65551 37129 359112 251866 11661 343148 -17688 103559 19201 35139 -383921
12359a53146C7214h7834A65303a25875j79117A42810b75649B35914c21498A16037
$$ -153146 37214 -87834 165303 -125875 -304992 142810 -275649 235914 -321498 116037
12348a01351j29389q2689C4328L09856j16868a99289d0072A26485l0404a34231
$$ -101351 -230740 -313429 34328 344184 227316 -199289 -40072 126485 96081 -134231
12337a803A86212L3567N6344A27951a49862A94033a25182B20376c39550H6675
$$ -1803 186212 219779 276123 127951 -149862 194033 -125182 220376 -339550 86675
12326a72765I5203R3851d9223A16930e8371I023a00084A50779b02390B28346a00362
$$ -172765 95203 189054 -49223 116930 -58371 9023 -100084 150779 -202390 228346 -100362
12314A05358c30987B12482K6953a8985A40133E6233J29034B7275h8979r5168p6020
$$ 105358 -330987 212482 239435 -18985 140133 56233 185267 27275 -88979 -184147 -260167
12303b60167L9247J04852G9952M7937l9297a8306j32794K6883n4396G970b8680
$$ -260167 -220920 -116068 79952 127889 88592 -18306 -151100 -124217 -178613 7970 -28680
12291A68698q961B5892Q4237b28053R1904A46127J5365j4583f6086b2796H9662
$$ 168698 159737 25892 110129 -228053 -136149 146127 161492 146909 -66086 -22796 89662
12279B24855r1923J24748N3162I8682Q8093l1117N3361I1178Q1249M4338Q270
$$ 224855 132932 257680 310842 98682 186775 155658 209019 91178 172427 216765 225035
12268B25035D9543e9884A93980r1844l2506l1199R869a0163A9286a06723C40874
$$ 225035 49543 -59884 193980 102136 69630 38431 48300 -10163 19286 -106723 340874
12256A92770e5697B13931Q9093A8170h9216B61789P395c17078B45778q873M3144
$$ 192770 -55697 213931 303024 18170 -89216 261789 269184 -317078 245778 236905 280049
12245B80049d2087B85005a47181N0169a4216B58334b03207R4525k2889A36883
$$ 280049 -42087 285005 -147181 -97012 -14216 258334 -203207 -108682 -131571 136883
12234B2343J90878i6867B65190a84688B92837C6011a68I7327B7427K17943l2013
$$ 22343 213221 -96867 265190 -184688 292837 36011 -168 97327 27427 245370 213357
12223B13357J77829j02739H7343M23676a29789A42332J02036K03194I0180C9397
$$ 213357 391186 288447 87343 511019 -129789 142332 244368 447562 90180 39397
12212H7914L13074m9180I9454P9874b59790q4548B20983r1234M5361i763B16774
$$ 87914 400988 351808 99454 179328 -259790 -344338 220983 129749 175110 -9763 216774
12200A90631K65856A13483J32519a49855C48438E7816j1988i6093L1328B80832
$$ 190631 456487 113483 246002 -149855 348438 57816 45828 -96093 -64765 280832
12189B79969m8745R4972j10481p4344L7420H217K48413B385J85768D7581K8651
$$ 279969 231224 326196 215715 141371 178791 8217 256630 2385 188153 47581 76232
12178G6232J98314q0274K35565B01960Q0794n8502r6966j6760K35400D1106A5973
$$ 76232 274546 194272 429837 201960 282754 224252 127286 110526 345926 41106 15973
12166a738D0668K60296k2189a5745D31323j65680r0577H5505l8071J42156b4177
$$ -1738 40668 300964 278775 -15745 431323 265643 175066 85505 47434 189590 -24177
12154B68344a15221b0606D5444E046a87205c8429C04297a65136A67629a81330
$$ 268344 -115221 -20606 45444 5046 -187205 -38429 304297 -165136 167629 -181330
12143a06834B34276l2634a3195j87972g6101B68000a25211A0114d0267A2787c4305
$$ -106834 234276 201642 -13195 -201167 -76101 268000 -125211 10114 -40267 12787 -34305
12131b11253p4686A61163B7014j356P4900b09428c0718C4482J89598F6230r08
$$ -211253 -285939 161163 27014 25658 100558 -209428 -30718 34482 224080 66230 65322
12120F5322b63591d7299j54630I4378a32275C23007G6447K07865A40154N2235
$$ 65322 -263591 -47299 -201929 94378 -132275 323007 76447 284312 140154 192389
12110A92389b77161e4872k55B71956a30962l7365F7477k881R3269J16920e9109
$$ 192389 -277161 -54872 -55127 271956 -130962 -168327 67477 64596 157865 274785 -59109
12098a39792C95639p0942j8086b79671A92020a34524m9459j53566a09900A39265
$$ -139792 395639 324697 306611 -279671 192020 -134524 -183983 -337549 -109900 139265
12087E4716a41373N0446c4062C3100e4553b63l69629G5261b72155B07472a29676
$$ 54716 -141373 -90927 -34062 33100 -54553 -263 -369892 75261 -272155 207472 -129676
12075c8440f482D8878P25481Q3694M03981N6794k63959B35520L91012A79555K68926
$$ -38440 -6482 48878 774359 858053 1262034 1318828 1054869 235520 626532 179555 448481
12064D48481b3809H4903K09153q2053F4202Q6794d08254J25624b8413B15614H0573
$$ 448481 -23809 84903 294056 212003 64202 150996 -408254 -282630 -28413 215614 80573
12052F3082a17810j66334B94348h2346C14087G2346O4222d6752k8194k09026H0417
$$ 63082 -117810 -284144 294348 -82346 314087 72346 136568 -46752 -74946 -283972 80417
12040B09429n1964a65764j31750B2195a89633f0867A45474e8830H8713Q8106b17829
$$ 209429 157465 -165764 -297514 22195 -189633 -60867 145474 -58830 88713 176819 -217829
12028a09000n8525g4806A78362c7449A5949b45270D07821f3087A9622J99412d4850
$$ -109000 -167525 -74806 178362 -37449 15949 -245270 407821 -63087 19622 219034 -44850
12016g7823C81663g398j73963p9891A32076D136c08724B49940I3145C0007Q0788
$$ -77823 381663 -7398 -181361 -261252 132076 4136 -308724 249940 93145 30007 110795
12005A10795B601i964l82108A84242H4498d03614e5355A76385D8676L6111a557
$$ 110795 2601 -9964 -392072 184242 84498 -403614 -55355 176385 48676 84787 -1557
11993a29960e5642Q418j19654O6806r981j11865c854A53209B7002a53194A81664
$$ -129960 -55642 -47224 -166878 -100072 -110053 -221918 -3854 153209 27002 -153194 181664
11981c01379n1795h5491m1573C7982a87022D7682i2975E1051M2291b60602A44451
$$ -301379 -353174 -85491 -127064 37982 -187022 47682 -92975 51051 93342 -260602 144451
11969B32109M0745c03068B00648C2705J69441e0053A86352h0768A29145g2508
$$ 232109 272854 -303068 200648 32705 202146 -50053 186352 -80768 129145 -72508
11958G8337b57430L7191C645J37427d2362E7326a13099k08200G9141r64a25704
$$ 78337 -257430 -220239 3645 141072 -42362 57326 -113099 -321299 79141 78177 -125704
11946c42586B24693M7819h0822I4956a12065j27353Q3245l7777O0500d8544A91787
$$ -342586 224693 272512 -80822 94956 -112065 -239418 -156173 -193950 -133450 -48544 191787
11934A46539b52987D01965p3654g0288A35347O4940d01370a11914k53271A64877
$$ 146539 -252987 401965 328311 -70288 135347 200287 -401370 -111914 -365185 164877
11923b75423d0011A07230b26290A03112f3010j32249O0357k59125D08746A80533
$$ -275423 -40011 107230 -226290 103112 -63010 -195259 -134902 -394027 408746 180533
11912B4128P1651K18830Q2401a45071B5786E854a6453G7011e7401F4946J9735
$$ 24128 95779 314609 397010 -145071 25786 5854 -16453 77011 -57401 64946 84681
11901H4681a12481l7059g1317n3010A7356K7952N2882C2743a53759B77280a85110
$$ 84681 -112481 -149540 -71317 -124327 17356 45308 98190 32743 -153759 277280 -185110
11889a17207D08339A09153j9419J68435c63679a70812N6186o3884m7919M8548
$$ -117207 408339 109153 89734 258169 -363679 -170812 -114626 -178510 -226429 -177881
11879a77881B67413b00805I796J81689C241J92251R527j7622E488c52634C3133
$$ -177881 267413 -200805 9796 191485 3241 195492 205019 187397 5488 -352634 33133
11867a19480C74883A19839K3815h229I0806l8492d8327p3253M7321B03390p4703
$$ -119480 374883 119839 143654 -8229 90806 52314 -48327 -121580 -74259 203390 128687
11856A28687J77951b03548C08900b40826d1570l3297R054r6341e9436k21406D6927
$$ 128687 306638 -203548 308900 -240826 -41570 -74867 -65813 -162154 -59436 -280842 46927
11844B35987c5184j45112A2780J83582F0974J00992F538a33743p0336P5201D8588
$$ 235987 -35184 -180296 12780 196362 60974 161966 6538 -133743 -204079 -128878 48588
11832d19980B25404h7943k7607l6950c4869a568F7420f108B49132b48956B88777
$$ -419980 225404 -87943 -115550 -152500 -34869 -1568 67420 -6108 249132 -248956 288777
11820b76586d3673m6368k83770a37517F4738j9346a01096H7662f2584J1218l42369
$$ -276586 -43673 -90041 -373811 -137517 64738 45392 -101096 87662 -62584 -51366 -393735
11809c93735J35814b4486k51830f168B1929J95953b86726A34986c65260G1496
$$ -393735 -257921 -24486 -276316 -6168 21929 217882 -286726 134986 -365260 71496
11798a04560B98970B9486P8271b64021J3755B3813a60625K6790o0406i6904f67
$$ -104560 298970 29486 107757 -264021 -250266 23813 -160625 -133835 -194241 -96904 -667
11786a37447A16900c9473J3304A31010C5785a57948Q686F9138b1762j51323N9107
$$ -137447 116900 -39473 -26169 131010 35785 -157948 -149262 69138 -21762 -173085 -113978
11775a13978I5295J02609c95656G8813c611A62907B834J38909d32686A08136D0498
$$ -113978 95295 197904 -395656 78813 -3611 162907 2834 141743 -432686 108136 40498
11763H0504i5276B25672g4167l5174j46505G8124N1235e44603a66934H3414b67410
$$ 80504 -95276 225672 -74167 -109341 -255846 78124 129359 -544603 -166934 83414 -267410
11751a10984m5429A0923b10501b2959o3634a6059A02196O9386e1620C2880a20553
$$ -110984 -156413 10923 -210501 -22959 -86593 -16059 102196 171582 -51620 32880 -120553
11739b26484M9040B53986c71831B02564a46397f9329r8045E862K5801J98231f9580
$$ -226484 -177444 253986 -371831 202564 -146397 -69329 -167374 5862 31663 229894 -69580
11727a55074j15687A1443N2454c03698i2000D9238L09368G1545K3645i8801D301
$$ -155074 -270761 11443 63897 -303698 -92000 49238 358606 71545 95190 -98801 4301
11715a7317D19252b7636A99576e5345K928n946A28200b29040A20474k6228J08675
$$ -17317 419252 -27636 199576 -55345 -52417 -58363 128200 -229040 120474 94246 202921
11704B02921f7697F0014L92863A64208e961l4720j36001A5623J25164a45341d9367
$$ 202921 -67697 60014 452877 164208 -5961 -40681 -176682 15623 140787 -145341 -49367
11692C6750J76555a06914j41255E6186b0417B47315l7973I2615J15429C543N9841
$$ 36750 213305 -106914 -248169 56186 -20417 247315 209342 92615 208044 3543 63384
11681F3384j5209K31132l2876K0636c7719D1261K21409a14787l6161O768A89834
$$ 63384 48175 279307 246431 267067 -37719 41261 262670 -114787 -150948 -144180 189834
11669C2965p614c8575l53633G4629a18680A20075J16443a38032A09815g1146j95134
$$ 32965 25351 -38575 -392208 74629 -118680 120075 236518 -138032 109815 -71146 -266280
11658b66280L6917q0666B68789a49714A22198a8388A37056R6825F6188a52032
$$ -266280 -229363 -310029 268789 -149714 122198 -18388 137056 233881 66188 -152032
11647I0982a53343A05860J18347c1305A32337J03846m7335a20448c5853q7318
$$ 90982 -153343 105860 224207 -31305 132337 236183 188848 -120448 -35853 -123171
11637a23171G7191b23284N7749H5076j2513a44319f4775A26746b16209H7919f7952
$$ -123171 77191 -223284 -165535 85076 72563 -144319 -64775 126746 -216209 87919 -67952
11625A4128b12983j26273A97088O2234C9302A8822c0234G8084H365J7144a21766
$$ 14128 -212983 -339256 197088 259322 39302 18822 -30234 78084 8365 25509 -121766
11613B23301b50520e9437B16542e3953E5348b17767B09636p8997b51199G0461
$$ 223301 -250520 -59437 216542 -53953 55348 -217767 209636 130639 -251199 70461
11602c48975E42037f1896H1816c3824B55051a2366j94287B89439A16743a21983
$$ -348975 542037 -61896 81816 -33824 255051 -12366 -206653 289439 116743 -121983
11591A07345Q0032a14369C62370C9390N5909R0773c33956C5282P1253f2217Q727
$$ 107345 187377 -114369 362370 39390 95299 186072 -333956 35282 106535 -62217 -53490
11580e3490K3808j19452B0957L2690O9941a72901C1743J17972b07355A45460C3649
$$ -53490 -29682 -149134 20957 53647 123588 -172901 31743 149715 -207355 145460 33649
11568h9179A83956b28593C10292a71025H269R8255i4147D1819i328H6383e6984
$$ -89179 183956 -228593 310292 -171025 8269 106524 -94147 41819 -9328 86383 -56984
11556D16492G230J16322a89198b4830j1287C73898j66512d8703k25482r8443J69128
$$ 416492 7230 123552 -189198 -24830 -36117 373898 207386 -48703 -274185 -372628 -203500
11545b03500K5446A01022d0544j23595H4598J13978a03029H4415a49375C07052
$$ -203500 -178054 101022 -40544 -164139 84598 198576 -103029 84415 -149375 307052
11534C16991a21601B26276c1073B68622e3884j5333A35466J66585c16539B43481
$$ 316991 -121601 226276 -31073 268622 -53884 -69217 135466 302051 -316539 243481
11523C61622A47429l200f2078A92954H2988J0622O948K02530I1048e0436D8096
$$ 361622 147429 144229 -62078 192954 82988 93610 100558 303088 91048 -50436 48096
11511C18065A53129a04116M8025C8002N34240A47153G0884J10110j0053h7081
$$ 318065 153129 -104116 -56091 38002 572242 147153 70884 180994 170941 -87081
11500I2109A785a22291N9007B41628L57016a38641L5715A3885a82433h0461I0005
$$ 92109 1785 -122291 -63284 241628 598644 -138641 -102926 13885 -182433 -80461 90005
11488B82840a1615c643n0934A6037K98433F5027M6351q905Q5319J66795a8818
$$ 282840 -11615 -3643 -54577 16037 314470 65027 111378 102473 187792 354587 -18818
11476C26072c90392A76518n2475n6739K58613A30425e5535D23170D5423a93468
$$ 326072 -390392 176518 124043 67304 325917 130425 -55535 423170 45423 -193468
11465B74798A34480J2825Q892o0007e9048B69831l3887h8867C05838a20915J8884
$$ 274798 134480 147305 156197 96190 -59048 269831 235944 -88867 305838 -120915 -102031
11454a02031k2120O1511C01033A00492a2493m1204A38587F9138J36204B7630a13913
$$ -102031 -124151 -62640 301033 100492 -12493 -53697 138587 69138 205342 27630 -113913
11442B32124E3757b11740J04170A08049a53541A30756i1143a5083n0481A12137
$$ 232124 53757 -211740 -107570 108049 -153541 130756 -91143 -15083 -65564 112137
11431a14971B22892a87365C97860a578A09799E3082a84839I932l464K46160f3814
$$ -114971 222892 -187365 397860 -1578 109799 53082 -184839 9932 6468 252628 -63814
11419c64953d8063j76011i2051B10727j8453J77167a39084G304J22047A439M0742
$$ -364953 -48063 -224074 -92051 210727 192274 369441 -139084 7304 129351 1439 42181
11408D2181K2395a45141j19133i0043r4276Q6829k7198A04102c5718j44999k11504
$$ 42181 64576 -145141 -264274 -90043 -184319 -97490 -124688 104102 -35718 -180717 -392221
11397c92221h8250j22464h2446l6108A21782J5469d34524A79043a81997B50099
$$ -392221 -88250 -210714 -82446 -118554 121782 137251 -434524 179043 -181997 250099
11386c52489B66455a67596E1764c46514A53372d6327G3239J61952b83350f1466
$$ -352489 266455 -167596 51764 -346514 153372 -46327 73239 235191 -283350 -61466
11375G682g8063A7197h90A89862J10773g3724A21263B458L6821A6759J97692c4957
$$ 7682 -78063 17197 -890 189862 300635 -73724 121263 2458 39279 16759 214451 -34957
11362F9068J89571E4601b50385h5433E9199b37693C9759c25808a20490p5463A03658
$$ 69068 258639 54601 -250385 -85433 59199 -237693 39759 -325808 -120490 -195953 103658
11350C6892c71119e023b442k01170k2292B8991h5346F9559J58314A12561K40773
$$ 36892 -371119 -5023 -2442 -203612 -225904 28991 -85346 69559 227873 112561 353334
11339C53334G4445K00978g1318j59594M1711D4366Q112c0634j57612r3392B46008
$$ 353334 74445 275423 -71318 -230912 -189201 44366 52478 -30634 -188246 -281638 246008
11327B09b8772F0873L1444a78020F3540b35083E4660r665c0831k17814d2828A69609
$$ 209 -28772 60873 92317 -178020 63540 -235083 54660 44995 -30831 -248645 -42828 169609
11314a88206c3974A73800P9184j17487b26233R5074c282H6231a84772N463L6351
$$ -188206 -33974 173800 252984 135497 -226233 -131159 -3282 86231 -184772 -179309 -142958
11303a42958A57942a00931j06017b0678B17967c50902B7809h9539b7443A62466
$$ -142958 157942 -100931 -206948 -20678 217967 -350902 27809 -89539 -27443 162466
11292A40254c0164G6671J9219R0565e4986D6791e61970b14477i4063L9390A21673
$$ 140254 -30164 76671 95890 186455 -54986 46791 -561970 -214477 -94063 -54673 121673
11280A58935A2289e45420H8560C2153a01493A61094a80419J8247j4110j9812K6018
$$ 158935 12289 -545420 88560 32153 -101493 161094 -180419 -162172 -176282 -196094 -170076
11269a70076F0161j1922e4671k1220A12424b16087f9647B1142h0822A46661C2193
$$ -170076 60161 48239 -54671 -75891 112424 -216087 -69647 21142 -80822 146661 32193
11257b31387h605r005D3550G560M9168J49380D039J61418a10150A71347a20688
$$ -231387 -8605 -17610 43550 7560 56728 206108 4039 165457 -110150 171347 -120688
11245A4072m498h9844q1631p6441D8454M4584l4254f4414B29957b01668k46691
$$ 14072 9574 -89844 -171475 -247916 48454 93038 58784 -64414 229957 -201668 -448359
11234d48359a90656p7496A13714P736J85320j16711a14571M6225j47118n2939
$$ -448359 -190656 -268152 113714 121450 306770 190059 -114571 -68346 -215464 -268403
11224b68403D2716A2130b8678F9678K7801m3009p658K202a21213A98360A9593
$$ -268403 42716 12130 -28678 69678 97479 54470 46812 49014 -121213 198360 19593
11212B7057L17715E6853J15113i5245q8796A63367J15847D8100M45717a20185
$$ 27057 344772 56853 171966 -95245 -184041 163367 279214 48100 493817 -120185
11201E7905J63142r4321a59798O1972E1046b96632E8812L9807b33218f0201A87080
$$ 57905 221047 126726 -159798 -97826 51046 -296632 58812 98619 -233218 -60201 187080
11189a0724k25740A37438a4688j93053Q8244a8431B80830a21730j10980k18B6934
$$ -10724 -236464 137438 -14688 -207741 -119497 -18431 280830 -121730 -232710 -232928 26934
11177a55718a901j2033m8477A0377a79641j8164a84B1906a91399M2368A4137K13590
$$ -155718 -1901 -13934 -62411 10377 -179641 -197805 -184 21906 -191399 -149031 14137 227727
11165B27727g1150k2177m5849k15282O2831h7802B10329A9467J7047J08456B9571
$$ 227727 -71150 -93327 -139176 -354458 -291627 -87802 210329 19467 36514 144970 29571
11153c01349a41850J7126O969A8651k691b6785G6305e7124H8565i2934j7225n0036
$$ -301349 -141850 -124724 -117755 18651 15960 -26785 76305 -57124 88565 -92934 -110159 -160195
11141a60195A77510F6107e837B46460A03248D0360J28749a3748r5571r5606C03633
$$ -160195 177510 66107 -5837 246460 103248 40360 169109 -13748 -109319 -204925 303633
11129G5733b0012C9281M47230n9992F9917a88796G6611e4777C90779a16201e3783
$$ 75733 -20012 39281 486511 426519 69917 -188796 76611 -54777 390779 -116201 -53783
11117A6899Q0184k3394d07B80281a43301P0733A50787l8238P6979p2359N4267
$$ 16899 97083 73689 -407 280281 -143301 -72568 150787 112549 189528 117169 171436
11106A71436D3177J46051a23511D35457A53713G0222Q7625a1808m8103D61178
$$ 171436 43177 189228 -123511 435457 153713 70222 157847 -11808 -59911 461178
11095D78578A38014o0309J17102E6588a19025A27963J57496e6628b6465B14585
$$ 478578 138014 77705 194807 56588 -119025 127963 285459 -56628 -26465 214585
11084H4139B4728K03012r4852p170K58162j9170A52147J21732m8746J77893J16243
$$ 84139 24728 227740 132888 125718 383880 364710 152147 273879 225133 403026 519269
11073E19269j58638A64761K31746A18927M4943K21832j20595n456J21459R5659
$$ 519269 360631 164761 396507 118927 163870 385702 265107 259651 381110 476769
11063D76769k11832L0434I3127L19982J43866J17569A82719J58720M68642n1659
$$ 476769 264937 295371 93127 413109 556975 674544 182719 341439 810081 758422
11053G58422q0580l3646l17712L54546k15107K28898J97451m776k02568l3036
$$ 758422 677842 644196 326484 681030 465923 694821 892272 887496 684928 651892
11043F51892J19826k25447K38969n4565J01628k98569L57242j39311j44298K06690
$$ 651892 771718 546271 785240 730675 832303 533734 890976 751665 607367 814057
11033H14057C32084N48521D31685K121O5169J82677o4972J69856R1044p8624O4484
$$ 814057 332084 880605 431685 433806 498975 681652 616680 786536 877580 798956 863440
11022H63440j73051j34395L28096p8925K4037k74581j10582j50625L47820L3821
$$ 863440 690389 555994 884090 805165 829202 554621 444039 293414 641234 675055
11012F75055j09935l7651K92118j13143p3198q5775J92002j14780Q9681k63698
$$ 675055 565120 527469 819587 706444 633246 547471 739473 624693 714374 450676
11002D50676K12860J27773J18832m22472J19434L19591j97946j40807L52867j54420
$$ 450676 663536 791309 910141 487669 607103 926694 728748 587941 940808 786388
10992G86388n5433K66482J23783l64382K1671l0896J4785J77968K27894Q0357
$$ 786388 730955 997437 1121220 756838 778509 747613 762398 940366 1168260 1248617
10982A248617m9128J6004L00772n20577N2789K84953M23082q2516N32146M95103
$$ 1248617 1199489 1215493 1516265 995688 1048477 1333430 1756512 1673996 2206142 2701245
10972B701245k48747j16864N49601k29182n0383m6421p6310j10824k87059n00605
$$ 2701245 2452498 2335634 2885235 2656053 2605670 2559249 2482939 2372115 2085056 1584451
10962A584451j3176r7964J44175q5666K57889j39072K21664m15635L3598J15096
$$ 1584451 1571275 1473311 1617486 1531820 1789709 1650637 1872301 1456666 1490264 1605360
10952A605360k04628K7039o05196j49375l08090M39242k35756j18698A93174K85913
$$ 1605360 1400732 1427771 822575 673200 365110 804352 568596 449898 193174 479087
10942D79087K10808A75948O792D8962R9630a26269A35487K19259K7206A5484L23600
$$ 479087 689895 175948 182740 48962 148592 -126269 135487 354746 381952 15484 339084
10931C39084j29145l7052D1505d54268D3746L10583d5866l15298C07956A3101
$$ 339084 209939 172887 41505 -454268 43746 354329 -45866 -361164 307956 13101
10920b16943r0634g4350r2914d0657K873H3465M2979M00648C9033f4261l27439
$$ -216943 -307577 -74350 -167264 -40657 -37784 83465 126444 527092 39033 -64261 -391700
10909c91700N3801a49990a2800A72714E4475B6749a85865f9683l858m7026A25045
$$ -391700 -337899 -149990 -12800 172714 54475 26749 -185865 -69683 -73541 -120567 125045
10897C65786A42957J14792b0601A70529J38126p4226R1798A49694c2333j26213
$$ 365786 142957 257749 -20601 170529 308655 234429 326227 149694 -32333 -158546
10887a58546E2646A9029f8482C00218H8643a54255r9311A52371m5296M3952J03132
$$ -158546 52646 19029 -68482 300218 88643 -154255 -253566 152371 107075 151027 254159
10876B54159E3328a59614I6967L5098f0151j23465A30944m3223a11235l70293
$$ 254159 53328 -159614 96967 132065 -60151 -183616 130944 87721 -111235 -481528
10866d81528B22234E7863j7691c22685d121k84004J43234d5630m50546h2376a4252
$$ -481528 222234 57863 40172 -322685 -4121 -288125 -144891 -45630 -496176 -82376 -14252
10854H8075p643k8646K51618F2990c58358B9667b49681B26024a98458A17886h4772
$$ 88075 80432 51786 303404 62990 -358358 29667 -249681 226024 -198458 117886 -84772
10842D7138J89552a09020G0227c03516A69136b41327M8822e149A93137G192K81366
$$ 47138 236690 -109020 70227 -303516 169136 -241327 -192505 -5149 193137 7192 288558
10831B88558e604D2496c14658D4506e1236D11147C5446c80874e1512b5099j01787
$$ 288558 -5604 42496 -314658 44506 -51236 411147 35446 -380874 -51512 -25099 -126886
10820a26886p0576a4722A73610h4937b8730E2414c12520A29042R3438C8679I198
$$ -126886 -197462 -14722 173610 -84937 -28730 52414 -312520 129042 222480 38679 9198
10808e8708k58167I3264h3847n5836L6622l28956a2239A40224f6257E8424k99
$$ -58708 -316875 93264 -83847 -139683 -103061 -432017 -12239 140224 -66257 58424 58125
10797E8125b6755A99785r4593m7036b93578A0760a04621G8394c55474a66674m2199
$$ 58125 -26755 199785 105192 58156 -293578 10760 -104621 78394 -355474 -166674 -208873
10786b08873h3492L8611a7331A59533d11203d1620m3106k9015A17135J07917a87333
$$ -208873 -83492 -44881 -17331 159533 -411203 -41620 -84726 -113741 117135 225052 -187333
10774b33840a5510E9358c07819F5141j9406M5382b06198j3274r4609B02957a01176
$$ -233840 -15510 59358 -307819 65141 45735 91117 -206198 -219472 -314081 202957 -101176
10762d69770b1489k13014A11298a38649J1993l3658c3685k05836O3536j24417
$$ -469770 -21489 -234503 111298 -138649 -126656 -160314 -33685 -239521 -175985 -300402
10752c00402H195c0605A68146a14995d630j13035q7213I0680K0084l9818K98270
$$ -300402 8195 -30605 168146 -114995 -4630 -117665 -204878 90680 110764 70946 369216
10741C69216I4051h6721k25542H1328M4565D2887N505K18545A04476g2419c0192
$$ 369216 94051 -86721 -312263 81328 125893 42887 48392 266937 104476 -72419 -30192
10729a83711d6828b2543p6220d8356a0054A65733j0154l9271b57742a12079B23763
$$ -183711 -46828 -22543 -98763 -48356 -10054 165733 155579 116308 -257742 -112079 223763
10717B46494b33415A24318i7559j69272F0090a64178A90934G5522a17604m5609
$$ 246494 -233415 124318 -97559 -266831 60090 -164178 190934 75522 -117604 -163213
10707a63213A33359n9764d941B15450b99759A29685C0324a6040j50054a4966I8629
$$ -163213 133359 73595 -4941 215450 -299759 129685 30324 -16040 -166094 -14966 98629
10695a61092d3891C25224g6399D3460b16253A9963K8390I80N3330J58757a9192
$$ -161092 -43891 325224 -76399 43460 -216253 19963 48353 980 54310 213067 -19192
10683F6956f777m59970A74620i2933j02509e7473j54757K5802j25783F766d30690
$$ 66956 -6777 -466747 174620 -92933 -195442 -57473 -212230 -186428 -312211 6766 -430690
10671a22850d0220B23731G2811L41224D3395K07769c12769E5573f4910k48976
$$ -122850 -40220 223731 72811 414035 43395 251164 -312769 55573 -64910 -313886
10661c13886A08840d70763B6549b44249a12664j70060f138p2024D4940b29084
$$ -313886 108840 -470763 26549 -244249 -112664 -282724 -6138 -78162 44940 -229084
10650g3530q0967j66443a2480q0185A3841g7683b1064f974A00633a11837A56428
$$ -73530 -154497 -320940 -12480 -92665 13841 -77683 -21064 -6974 100633 -111837 156428
10638e2655r7695C1059O4521a27436d8138j63299F9909O6571b99765c1867j30970
$$ -52655 -150350 31059 95580 -127436 -48138 -211437 69909 136480 -299765 -31867 -162837
10627a62837A26261b3119l84168b2674A44920c6328k78561D5742a4380j74275
$$ -162837 126261 -23119 -407287 -22674 144920 -36328 -314889 45742 -14380 -188655
10617a88655D4134j3137a66329a1060j00740C5917M5075J34355c77195B02753
$$ -188655 44134 30997 -166329 -11060 -111800 35917 80992 215347 -377195 202753
10606c5188A26007B4769a86804b7930d472j51142c1218A87624b8995j51063D7723
$$ -35188 126007 24769 -186804 -27930 -4472 -155614 -31218 187624 -28995 -180058 47723
10594e11877A57012p0795a51948k6022M9987F1289b1942j79986j1807B4991a44000
$$ -511877 157012 86217 -151948 -177970 -127983 61289 -21942 -201928 -213735 24991 -144000
10582b98013I6449b3579j15175a8628o0762m3339F1779b81005j10848J82248H75
$$ -298013 96449 -23579 -138754 -18628 -79390 -122729 61779 -281005 -391853 -209605 875
10570B54480b33468A08841a29588d2908k5952E7351G357K3140l120b54124b1837
$$ 254480 -233468 108841 -129588 -42908 -68860 57351 7357 30497 27377 -254124 -21837
10558A96625b8605a113o7973J3693m7805j85594m1340J57627A96629G3110P6082
$$ 196625 -28605 -1113 -69086 -55393 -103198 -288792 -330132 -172505 196629 73110 149192
10547A49192a96951d1967k13275A89908e4342H1703j8916B2836K7502f8007B22488
$$ 149192 -196951 -41967 -255242 189908 -54342 81703 62787 22836 50338 -68007 222488
10535B98950J3181f9218D6680d01515B74252d14609d9253B03998g6893C11568
$$ 298950 312131 -69218 46680 -401515 274252 -414609 -49253 203998 -76893 311568
10524B0186Q3861c02542C6448e0970o0386D5577a28635A17944b9163n03629K26396
$$ 20186 104047 -302542 36448 -50970 -111356 45577 -128635 117944 -29163 -532792 -306396
10513c06396e7794A5358N6451b14862N8131A14722a29753C996J10162e5415N989
$$ -306396 -57794 15358 71809 -214862 -156731 114722 -129753 3996 114158 -55415 -49426
10502d9426A17787a95830l30243a56909j03974A56229p3830K03155a32789G4699
$$ -49426 117787 -195830 -526073 -156909 -260883 156229 82399 285554 -132789 74699
10491b25253k54353b16675J06242h312j68946B9245K41942n8748J2981a44786
$$ -225253 -479606 -216675 -110433 -8312 -177258 29245 271187 212439 225420 -144786
10480A04503k3547e5789B83692N7237c55801B97585a74782e6803a6014D35345
$$ 104503 80956 -55789 283692 340929 -355801 297585 -174782 -56803 -16014 435345
10469A02596a36718C94258a58312I9252J25480E9343M8891J14038n4796p4729
$$ 102596 -136718 394258 -158312 99252 224732 59343 108234 222272 167476 92747
10459I2747J45617e0449j45285A99933b7539B87801p9437h6225F9583R3913b28984
$$ 92747 238364 -50449 -195734 199933 -27539 287801 208364 -86225 69583 163496 -228984
10447f9234B6392d47534C43910c38766a1665o2712H1382M0983E2814K5336b07156
$$ -69234 26392 -447534 343910 -338766 -11665 -74377 81382 122365 52814 78150 -207156
10435D6154J97393b36355a09815J4358E6689a75994j83433l469a64715g9985D9678
$$ 46154 243547 -236355 -109815 -95457 56689 -175994 -359427 -362896 -164715 -79985 49678
10423i6820G8807a48262o460C70090A78644h7954G022c5419C8206M3192a49246
$$ -96820 78807 -148262 -154722 370090 178644 -87954 7022 -35419 38206 81398 -149246
10411F6246b67289B71388i2478C0269c31905h9124k01982b2265o6811a525l6325
$$ 66246 -267289 271388 -92478 30269 -331905 -89124 -291106 -22265 -89076 -1525 -37850
10400c7850j27397f0561n38340A92612b82694B23404b24834B02860J9901c51068
$$ -37850 -165247 -60561 -598901 192612 -282694 223404 -224834 202860 222761 -351068
10389F8589J62858p4530d8867H5300Q6312a97834A27989B5586J75040N3051B3238
$$ 68589 231447 156917 -48867 85300 171612 -197834 127989 25586 200626 253677 23238
10377D5024H156e5631C22912d3077C64156f6299E51786F4716M90628k50904j47402
$$ 45024 8156 -55631 322912 -43077 364156 -66299 551786 64716 555344 304440 157038
10366A57038J92212K31496j35858k06900p3378J42057j7666M41659A44688o8731
$$ 157038 349250 580746 444888 237988 164610 306667 289001 730660 144688 75957
10356G5957J3770N8170p186O3364J05768K25611A33085K65713J58829k43367q6753
$$ 75957 89727 147897 140711 204075 309843 535454 133085 398798 557627 314260 227507
10345B27507K23112l5788j78657M66290B47757J59753j63586a44570A5265K51656
$$ 227507 450619 414831 236174 702464 247757 407510 243924 -144570 15265 266921
10335B66921I7631a53802A05864D3283j7407J91138m2842q6064b55735C40872
$$ 266921 97631 -153802 105864 43283 25876 217014 174172 88108 -255735 340872
10324c93492c1935A12204Q230c713D12216n0396j59067q3G0022L5982N7834h9551
$$ -393492 -31935 112204 120434 -3713 412216 361820 202753 202670 70022 106004 163838 -89551
10311B32897i6300K296A09822a26455B87308b17023A3825a13018M4467p1146e1675
$$ 232897 -96300 -94004 109822 -126455 287308 -217023 13825 -113018 -68551 -139697 -51675
10299B8511b05633A30694a19095D1980P7147Q7482a76205f0494B30800d6350j21870
$$ 28511 -205633 130694 -119095 41980 119127 206609 -176205 -60494 230800 -46350 -168220
10288a68220b5723l07404E3150i890o030j50120N6421B4918a88452b936q4730
$$ -168220 -25723 -333127 53150 -9890 -15920 -166040 -109619 24918 -188452 -2936 -87666
10277h7666o0577k845F7988a50723G354a52699d4929J8338G9065R0769M9735l5249
$$ -87666 -148243 -151088 67988 -150723 7354 -152699 -44929 -26591 79065 169834 219569 184320
10265A84320R2534M074k2527b03968B29028g5081G7794M1142K6860K21062K13238
$$ 184320 276854 280928 258401 -203968 229028 -75081 77794 118936 145796 366858 580096
10254E80096B52208j7680r6376O873J01952a94578A2297O7526a56986A7355a29213
$$ 580096 252208 234528 138152 145025 246977 -194578 12297 79823 -156986 17355 -129213
10242A30709k3346D773g1959A5089a63244R38f6404a4217q6982j90206e232l62172
$$ 130709 107363 4773 -71959 15089 -163244 -162306 -66404 -14217 -101199 -291405 -5232 -367404
10230c67404J56452g6965O235k13550a26720c9295k29093D47354b8815A0611J88622
$$ -367404 -210952 -76965 -70730 -284280 -126720 -39295 -268388 447354 -28815 10611 199233
10219A99233d7149k15820a26057A08594a72377b358j15536l05026G9611d29631
$$ 199233 -47149 -262969 -126057 108594 -172377 -2358 -117894 -422920 79611 -429631
10208b56114a27372C7025a61229P988G1994l4693A5541e9655j20120M0656f1857
$$ -256114 -127372 37025 -161229 -153241 71994 37301 15541 -59655 -179775 -139119 -61857
10196D23341a01920a2285k44170J4587F8443h8425j85859e2052m469a0996q7061
$$ 423341 -101920 -12285 -256455 -241868 68443 -88425 -274284 -52052 -56521 -10996 -98057
10185i8057A45435a71213B3927g940B25921A08456L3284a15200c965p2302a3211
$$ -98057 145435 -171213 23927 -7940 225921 108456 141740 -115200 -3965 -76267 -13211
10173d41727Q4460R2898N1264r996G6489h5874j14594j24156a31135A59215a34321
$$ -441727 -357267 -264369 -213105 -223101 76489 -85874 -200468 -324624 -131135 159215 -134321
10161c90485a2980B9800J59702i745q7482n3969A01836a59342A88731r825b75316
$$ -390485 -12980 29800 189502 -9745 -97227 -151196 101836 -159342 188731 178906 -275316
10149F8J56387m3121a10102A47011i4760E2147b71026J00368k52491J23595p0332
$$ 68 156455 113334 -110102 147011 -94760 52147 -271026 -170658 -423149 -299554 -369886
10138c69886J48124A4237J1485a3872I074a32689o9843b9504J4584q1487F3086
$$ -369886 -221762 14237 25722 -13872 9074 -132689 -202532 -29504 -14920 -96407 63086
10126a12993l27179a86387g4847C848I9a15275k30968a72232P8926B4400e1074
$$ -112993 -440172 -186387 -74847 3848 99 -115275 -346243 -172232 -93306 24400 -51074
10114A10297A5537Q7612f5287G6110e9460C4185a76154Q0917R7k50801e2716A65588
$$ 110297 15537 103149 -65287 76110 -59460 34185 -176154 -95237 -95140 -345941 -52716 165588
10101b38240E8954J714P1976b6990a3447E23284F7275a40794L2713B9313O6255
$$ -238240 58954 60668 132644 -26990 -13447 523284 67275 -140794 -108081 29313 95568
10090I5568i8816H8830a20500K4304D9269c50708J56857k63334J49151i8768M3777
$$ 95568 -98816 88830 -120500 -96196 49269 -350708 -193851 -457185 -308034 -98768 -54991
10079e4991j36889A29357P2091b34492H9141b67014b1438C65851d54723J89640
$$ -54991 -191880 129357 201448 -234492 89141 -267014 -21438 365851 -454723 -265083
10069b65083J01073f3283j34492Q2058C8883K5620b24952J00018k7170P4664l4701
$$ -265083 -164010 -63283 -197775 -115717 38883 64503 -224952 -124934 -152104 -77440 -112141
10058a12141A83240p5202a88976n9503J15923A48549c0142j82211k113L6850d7793
$$ -112141 183240 108038 -188976 -248479 -132556 148549 -30142 -212353 -214466 -177616 -47793
10046D4869Q2787N2653D2021M6138M5202a14850K4174D5164c54427C50698j27975
$$ 44869 127656 180309 42021 88159 133361 -114850 -90676 45164 -354427 350698 222723
10035B22723A9781a43588q5193A4550c63952d8321A7996a62430j05828R3012C17517
$$ 222723 19781 -143588 -228781 14550 -363952 -48321 17996 -162430 -268258 -175246 317517
10023a29108j04627a0170E6266C208b06320j74081D8836b39834d7210K0807A26026
$$ -129108 -233735 -10170 56266 3208 -206320 -380401 48836 -239834 -47210 -26403 126026
10011d49973E5935a46236K0668j14709L0580j05911e8813A6526b59965F2115O2609
$$ -449973 55935 -146236 -125568 -240277 -209697 -315608 -58813 16526 -259965 62115 124724
10000A24724a46003f5664D269J15433K41978j37359a84085C7242e3742A62890
$$ 124724 -146003 -65664 4269 119702 361680 224321 -184085 37242 -53742 162890
9989C7409a66958j68858B91806A6512a18362A89308b38153f124A46797a87707
$$ 37409 -166958 -335816 291806 16512 -118362 189308 -238153 -6124 146797 -187707
9978a77555o3120p1301M4819a29332e7888l76266a56019k11239D8646a30276B76985
$$ -177555 -240675 -311976 -267157 -129332 -57888 -434154 -156019 -367258 48646 -130276 276985
9966b50136I890a278B25876p8523b76315p579c1694A83150J817J0388a36004j7731
$$ -250136 9890 -1278 225876 147353 -276315 -283894 -31694 183150 184967 195355 -136004 -153735
9954a53735e7196B05345F1203O5816F3334O3612b67852F1364k2996e1189P487
$$ -153735 -57196 205345 61203 127019 63334 126946 -267852 61364 38368 -51189 -43702
9943d3702q1722A21431b55120C14941A53929a05484A34075b16932j13475b4738
$$ -43702 -125424 121431 -255120 314941 153929 -105484 134075 -216932 -330407 -24738
9932B8836a86023M6149n8319G5181a65483L2314j24637P77Q8413f4877j65278
$$ 28836 -186023 -139874 -198193 75181 -165483 -133169 -257806 -257029 -168616 -64877 -230155
9921b30155c1981l05101J26287B94662b19598i685j17308E5795h6092j9230A73094
$$ -230155 -31981 -337082 -210795 294662 -219598 -9685 -126993 55795 -86092 -105322 173094
9909c9200j79103h0401j03104O8253B8576K0630b25389D9674c54483O7758A88243
$$ -39200 -218303 -80401 -183505 -115252 28576 49206 -225389 49674 -354483 -286725 188243
9897A29980b13279q8701A88687R7496a21687j72178K4262B16049a3291k42121
$$ 129980 -213279 -301980 188687 286183 -121687 -293865 -269603 216049 -13291 -255412
9887b55412A68625K14412F4273J7187b23725K0848A99933a6001m54312A21486
$$ -255412 168625 383037 64273 81460 -223725 -202877 199933 -16001 -470313 121486
9876g5788A07621K53321A26920K1359d12960a11189B90365I3299c00774j1791
$$ -75788 107621 360942 126920 148279 -412960 -111189 290365 93299 -300774 -312565
9866c12565J52369g2176j88188K0295l16719H1971N457A2308a0606p561j14798
$$ -312565 -160196 -72176 -260364 -240069 -556788 81971 87428 12308 -10606 -18167 -132965
9855a32965q4397n1723k66915b26741C6094a60742a6604m7129j50624j8005O9257
$$ -132965 -217362 -269085 -536000 -226741 36094 -160742 -16604 -63733 -214357 -232362 -163105
9844a63105e6822j30729j29948D5867J02864b34140j64374d5176j75238K4206
$$ -163105 -56822 -187551 -317499 45867 148731 -234140 -398514 -45176 -220414 -196208
9834a96208p6302B73419j0461b13539o7942J18030B19793D1414c45848h4688A69141
$$ -196208 -272510 273419 262958 -213539 -281481 -163451 219793 41414 -345848 -84688 169141
9822d6255j12868A28780h3385n9981j01485j95128D2982m051a16471A15400L5551
$$ -46255 -159123 128780 -83385 -143366 -244851 -439979 42982 38931 -116471 115400 150951
9811A50951b19745B06210a48960j81857i5559I5378d42358O32J47573a26680j04901
$$ 150951 -219745 206210 -148960 -330817 -95559 95378 -442358 -441726 -294153 -126680 -231581
9800b31581N1987m2505J08473r165N5650l4116j80126B76773c55976a43943A72661
$$ -231581 -179594 -222099 -113626 -122791 -67141 -101257 -281383 276773 -355976 -143943 172661
9788a49469D20268B3714O4593K3525a70773B66889B4304a88875r8556A74265a5814
$$ -149469 420268 23714 88307 111832 -170773 266889 24304 -188875 -287431 174265 -15814
9776a62743A09375A819J50706c8685j22241D2701K60171A9975a87573p3131I0678
$$ -162743 109375 1819 152525 -38685 -160926 42701 302872 19975 -187573 -260704 90678
9764H114c2426j1358q5235J814O868A06328d7008j12448d7956A58891E0197b26230
$$ 8114 -32426 -43784 -129019 -127205 -120337 106328 -47008 -159456 -47956 158891 50197 -226230
9751F515L0400a31198L0288B4922a24588k13333A15842D7683P0915D2186b72475
$$ 6515 36915 -131198 -100910 24922 -124588 -337921 115842 47683 118598 42186 -272475
9739b6476O217j28295A7367L94402a34598j54177a33452k11540g755n0130k05126
$$ -26476 -20259 -148554 17367 411769 -134598 -288775 -133452 -344992 -7755 -57885 -263011
9728b63011g1200p0403k44613J44904c6829j0677A91466c70328C0970a7139D0850
$$ -263011 -71200 -141603 -386216 -241312 -36829 -47506 191466 -370328 30970 -17139 40850
9716b9485j19315B86328b65308A9804C85d4308E9032J54232a3823l52981d2517
$$ -29485 -148800 286328 -265308 19804 385 -44308 59032 213264 -13823 -366804 -42517
9704d66113i392q0661R159k57828J21832B60048a11292c8230D1027b03063j68414
$$ -466113 -9392 -90053 -80894 -338722 -216890 260048 -111292 -38230 41027 -203063 -371477
9693c71477P7405i2651B13792a47704j17617j19881C0373Q4473a05356c8565j07813
$$ -371477 -294072 -92651 213792 -147704 -265321 -385202 30373 114846 -105356 -38565 -146378
9682a46378a0599C9099e9278o8719B2391a85430A0970a45211c4148G9389K7764
$$ -146378 -10599 39099 -59278 -127997 22391 -185430 10970 -145211 -34148 79389 107153
9671A07153B786O9961e5347j74395l6607B57832a8950j96422j41643C2755K1377
$$ 107153 2786 72747 -55347 -229742 -266349 257832 -18950 -215372 -357015 32755 54132
9660E4132R0526k3714g6496j62684N081F0378a41788e8696j8585G4591B2608b90405
$$ 54132 144658 120944 -76496 -239180 -234099 60378 -141788 -58696 -77281 74591 22608 -290405
9647a00478B23385b17097C11070A01183l1875A6877b0465k33715d6292j10470
$$ -100478 223385 -217097 311070 101183 69308 16877 -20465 -254180 -46292 -156762
9637a56762n4014A95858b4179C3956b55541C09887a30408E5860g2496h196p3315
$$ -156762 -210776 195858 -24179 33956 -255541 309887 -130408 55860 -72496 -8196 -81511
9626h1511D8621b53180N5508E3942a12312j2416A12672i1774C7432b86235D92313
$$ -81511 48621 -253180 -197672 53942 -112312 -124728 112672 -91774 37432 -286235 492313
9614a35032B713c46001a56026A66850p9291c56871H051K31614C2196q975b36901
$$ -135032 2713 -346001 -156026 166850 87559 -356871 8051 239665 32196 23221 -236901
9602B4951a89205I1916J2902b35982F2020K5122b7433n6994b3398j58971D28568
$$ 24951 -189205 91916 104818 -235982 62020 87142 -27433 -84427 -23398 -182369 428568
9590h7344B36490a37641G6959a26479b3331A51188P7629a14902E5281c1498D4047
$$ -87344 236490 -137641 76959 -126479 -23331 151188 228817 -114902 55281 -31498 44047
9578c40441C05993O4970A20647a3210o0271A01126c67375a29517a5312j59222
$$ -340441 305993 370963 120647 -13210 -73481 101126 -367375 -129517 -15312 -174534
9568a74534K0674e170j83409g0381C1823a58477A13900L089K7031c44805F3997
$$ -174534 -153860 -5170 -188579 -70381 31823 -158477 113900 116989 144020 -344805 63997
9556h6392j52928j66528J69896M9393p3936a08705k43199C78546b29432A79776
$$ -86392 -239320 -405848 -235952 -186559 -260495 -108705 -351904 378546 -229432 179776
9545b62932A35843b65472D8502P4306b9084j43811f7518B49761a01534a0286B12263
$$ -262932 135843 -265472 48502 122808 -29084 -172895 -67518 249761 -101534 -10286 212263
9533a08212K0293k19323J51102I1610A4280K14519c37170a3646j276k11232I5436
$$ -108212 -87919 -307242 -156140 91610 14280 228799 -337170 -13646 -14922 -226154 95436
9521a81467j29344a45512B05030h8099J0866j28108d8211A21185a72249A39841
$$ -181467 -310811 -145512 205030 -88099 -77233 -205341 -48211 121185 -172249 139841
9510A74096c09784G1687f1676l61539a67165N3933C23710b00440q8240J24051
$$ 174096 -309784 71687 -61676 -423215 -167165 -113232 323710 -200440 -288680 -164629
9500a64629j01509A6221a89180J6468A00953c06605a27366e5445j74312A88091
$$ -164629 -266138 16221 -189180 -172712 100953 -306605 -127366 -55445 -229757 188091
9489i2622k40363C50147g9045L4287m65571K04703a160D2960O1634m3453d8707
$$ -92622 -332985 350147 -79045 -44758 -510329 -305626 -1160 42960 104594 61141 -48707
9477a47548B48054f6501e79n42491d5099n0973A17857l7230N7809J08057q4305
$$ -147548 248054 -66501 -579 -543070 -45099 -96072 117857 80627 138436 246493 162188
9466A62188c26468a35624C67910b89943A9652a18786a1004k9414r8595e4425B7112
$$ 162188 -326468 -135624 367910 -289943 19652 -118786 -11004 -40418 -139013 -54425 27112
9454e7662o3120k442G5628c12405g4696E4263J67104a415C092d81704B14160I8056
$$ -57662 -120782 -123224 75628 -312405 -74696 54263 221367 -1415 3092 -481704 214160 98056
9441b75801r0839b7134m38170B31204J50811g1344n6944A28839a59646k97174
$$ -275801 -366640 -27134 -465304 231204 382015 -71344 -128288 128839 -159646 -456820
9431d56820g6800C09921a66620J8507P396j84998A6347a23577B21666r3953a49170
$$ -456820 -76800 309921 -166620 -148113 -140717 -325715 16347 -123577 221666 127713 -149170
9419B87405I9393b09410G8374f06787B330K4671b78665h9481B84699a75113A51205
$$ 287405 99393 -209410 78374 -606787 2330 27001 -278665 -89481 284699 -175113 151205
9407b50852A97819i4212H1930N3327c33336g1750C7972a87798I3607C1854c88874
$$ -250852 197819 -94212 81930 135257 -333336 -71750 37972 -187798 93607 31854 -388874
9395A0061b21944J0285i1966A60530E1480K032d0805k99604a9488j30724B2518
$$ 10061 -221944 -211659 -91966 160530 51480 53512 -40805 -340409 -19488 -150212 22518
9383e3906j08773A64350a60860j9900A95305N3227c23582G8904A5452N7951K4149
$$ -53906 -162679 164350 -160860 -180760 195305 248532 -323582 78904 15452 73403 97552
9372I7552M3383b52235k3154r9249J81335j13233Q2490l71973K69192I5465a65691
$$ 97552 140935 -252235 -275389 -374638 -193303 -306536 -224046 -596019 -326827 95465 -165691
9360b22672j21606a44744j030k90803a55275B88683c80391e1150l0934B66449
$$ -222672 -344278 -144744 -145774 -436577 -155275 288683 -380391 -51150 -82084 266449
9349c35850g041n5181j13454L9894A45319p0683h6043j22434C60896c14378O7562
$$ -335850 -7041 -62222 -175676 -135782 145319 74636 -86043 -208477 360896 -314378 -246816
9338b46816C43539a48318r017e9506a7573j86632F655J08920E3839a62096k4691
$$ -246816 343539 -148318 -157335 -59506 -17573 -204205 6655 115575 53839 -162096 -186787
9327a86787D6491e304j31662b0184j7351D3772J17000H063a87405B43093a37116
$$ -186787 46491 -5304 -136966 -20184 -37535 43772 160772 8063 -187405 243093 -137116
9315H5342a63955E0501K0737a4949j10543r2138I4921m1727d7338o9599L8098
$$ 85342 -163955 50501 71238 -14949 -125492 -217630 94921 53194 -47338 -116937 -78839
9304g8839k9625C35882e2900j43488O3923A95026a20011k12852B31984D2063b9805
$$ -78839 -108464 335882 -52900 -196388 -132465 195026 -120011 -332863 231984 42063 -29805
9292h5523J1193F2743a35899j49010J4558L1710h3609j21805e5736k29022O9031
$$ -85523 -74330 62743 -135899 -284909 -270351 -238641 -83609 -205414 -55736 -284758 -215727
9281b15727e943m23194c5532j06383A30010e9839k1000p8607P2882B08681c45393
$$ -215727 -5943 -429137 -35532 -141915 130010 -59839 -80839 -159446 -86564 208681 -345393
9269B7599d1197j84604P8488H6525c79457B88442b39239C2944b45945j09110g8935
$$ 27599 -41197 -225801 -147313 86525 -379457 288442 -239239 32944 -245945 -355055 -78935
9257a36419K9756L0669q8911j95419n2918B8780g0742B21645a33340M2647k295
$$ -136419 -106663 -75994 -164905 -360324 -413242 28780 -70742 221645 -133340 -90693 -92988
9246i2988l85459e5643j24523B99429j43481J95933A68641R873h5525B88834d7412
$$ -92988 -478447 -55643 -180166 299429 155948 351881 168641 178514 -85525 288834 -47412
9234a68623A5113c14407J19236g9602E6794I138c3325j78902m517J9154a3240
$$ -168623 15113 -314407 -195171 -79602 56794 9138 -33325 -212227 -216744 -197590 -13240
9222e40949E2554b1880C2916J09686d20006a80592A83216F1721i174q5582C96280
$$ -540949 52554 -21880 32916 142602 -420006 -180592 183216 61721 -9174 -94756 396280
9210A06459a74064j00817B70471I6462a44307j23177h1995A02984a15462l0291
$$ 106459 -174064 -274881 270471 96462 -144307 -267484 -81995 102984 -115462 -145753
9200a45753k48949I4654b03346q2031a34877m9350j0812c5178l94308B663J96265
$$ -145753 -394702 94654 -203346 -285377 -134877 -184227 -195039 -35178 -429486 2663 198928
9189A98928H658K96881H5442M6545N9852b37969a13961F1725a29781j04500j2355
$$ 198928 8658 305539 85442 131987 191839 -237969 -113961 61725 -129781 -234281 -246636
9178b46636a4913j86330A0210h2241A93989j1836a85654k31826a7922k38722E852
$$ -246636 -14913 -201243 10210 -82241 193989 182153 -185654 -417480 -17922 -256644 5852
9166b0465G3262c08846o4359k0223J23051B3195L9270d3675j44385g4603J4187
$$ -20465 73262 -308846 -373205 -393428 -270377 23195 62465 -43675 -188060 -74603 -60416
9155f0416O608A0946b1902F0435g5949h775j53364f9183J825k6244q5000D5455
$$ -60416 -53808 10946 -21902 60435 -75949 -8775 -162139 -69183 -67358 -93602 -178602 45455
9142a04284C90110a40982j94487d2256k1626a0299A46025J09293c2449j82404
$$ -104284 390110 -140982 -335469 -42256 -63882 -10299 146025 255318 -32449 -214853
9132b14853C3239c4727r2152j96575F7801J13076a13915r082d0374j78550A60835
$$ -214853 33239 -34727 -126879 -323454 67801 180877 -113915 -122997 -40374 -218924 160835
9120b88592D992b82674A82790o506E6393K78848a43137j01002B4697J18180c97826
$$ -288592 4992 -282674 182790 176284 56393 335241 -143137 -244139 24697 142877 -397826
9108I3173J00733b53631c3850A04764O7613f2173A54434a97619B46661D1820N43494
$$ 93173 193906 -253631 -33850 104764 172377 -62173 154434 -197619 246661 41820 585314
9097E85314d88505I1964c11029A15008n2653g6008F1225b72186N6417F081J95084
$$ 585314 -488505 91964 -311029 115008 62355 -76008 61225 -272186 -215769 6081 201165
9086B01165f8747o6956N8550B73150a66613A3928a24540q5442A58217p7300j8069
$$ 201165 -68747 -135703 -77153 273150 -166613 13928 -124540 -209982 158217 80917 62848
9075F2848b914j67208j51643Q362B55205I4264b61305O2398M6050G09f2452A30279
$$ 62848 -2914 -170122 -321765 -313403 255205 94264 -261305 -198907 -152857 709 -62452 130279
9062A01141B2260J99189D9102b45759E31599a2312A69078E3221D590a48438j40563
$$ 101141 22260 221449 49102 -245759 531599 -12312 169078 53221 4590 -148438 -289001
9051b89001a09726m4577B46830a63843j116P2785j44384J15646d3220k1190l56919
$$ -289001 -109726 -154303 246830 -163843 -164959 -92174 -236558 -120912 -43220 -64410 -421329
9040d21329N4326b9587D6921J60207e1918B05978O2098F660g8697B18999L5401
$$ -421329 -367003 -29587 46921 207128 -51918 205978 268076 6660 -78697 218999 254400
9029B54400a46047p7799f1806G6010d65900K07228A39945b17378K7607a8728k5058
$$ 254400 -146047 -223846 -61806 76010 -465900 -258672 139945 -217378 -189771 -18728 -43786
9018d3786j53953n2628l7319a0074b302G8063d1755l60645L660C76800a7538j46519
$$ -43786 -197739 -250367 -287686 -10074 -2302 78063 -41755 -402400 -398740 376800 -17538 -164057
9006a64057l8160A80613E074K3284J67951a86351H8796K16990e42636J75944J60332
$$ -164057 -202217 180613 5074 28358 196309 -186351 88796 305786 -542636 -366692 -206360
8995b06360l1555n0253D7530q79h5217b4949D0637a17507M5966l16333I5405a81622
$$ -206360 -237915 -288168 47530 46651 -85217 -24949 40637 -117507 -71541 -387874 95405 -181622
8982C7827c59404A79467a36749A6111Q3253b69850B9305a72592J0523n5389A19626
$$ 37827 -359404 179467 -136749 16111 99364 -269850 29305 -172592 -162069 -217458 119626
8970a53898q794e3952j35030n8845K9196O4568B5904b67077e0601j89452C0433
$$ -153898 -162692 -53952 -188982 -247827 -218631 -154063 25904 -267077 -50601 -240053 30433
8958A08851B8522f9300B7337A1191j747b50299H4725d7821m8505I3159a30094
$$ 108851 28522 -69300 27337 11191 9444 -250299 84725 -47821 -96326 93159 -130094
8946b78180p215R9354a3887j65170l0753G3591a00507c207A44712h9447D18110
$$ -278180 -285395 -186041 -13887 -179057 -209810 73591 -100507 -3207 144712 -89447 418110
8934C15698C253N77007j3692B54511r4569J84853l9866N2120k1876J197758J190073
$$ 315698 3253 580260 566568 254511 159942 344795 304929 357049 335173 1532931 2723004
8923B723004M552476K079956j092844L633164n609186B809991I98908m70535n5911
$$ 2723004 7275480 9355436 8262592 11895756 6286570 2809991 998908 528373 472462
8914D72462A76024a2178A92605J23040j00924n5654R7035J22724e122B15683b08912
$$ 472462 176024 -12178 192605 315645 214721 159067 256102 378826 -5122 215683 -208912
8902c52191f1479J1521F2313J42625b56008J02019k16605B53325F2286P6897b13319
$$ -352191 -61479 -49958 62313 204938 -256008 -153989 -370594 253325 62286 139183 -213319
8890f5694K4325j26581l9921O15A4534a38042E1141J2624B9479p093a09310q0015
$$ -65694 -41369 -167950 -207871 -207256 14534 -138042 51141 63765 29479 22386 -109310 -189325
8878a89325C3007K49645C5481d6654F8802c59622N3141I964a10336D9931P5033
$$ -189325 33007 282652 35481 -46654 68802 -359622 -306481 9964 -110336 49931 124964
$$ [...]
##END NTUPLES=NMR SPECTRUM
##END=
