
##TITLE=UV1217_M5_1296-1170_30_7229326_oI9TZXSJEr
##JCAMPDX= 6.0         $$ Bruker NMR JCAMP-DX V2.0
##DATA TYPE= NMR SPECTRUM
##DATA CLASS= NTUPLES
##ORIGIN= BRUKER
##OWNER= Administrator
$$ 1.72 TOPSPIN		Version 2.1
$$ 2013-01-18 02:05:34.430 -0500  Administrator@X
$$ Compression mode = diff/dup
##.OBSERVE FREQUENCY= 400.02188249412
##.OBSERVE NUCLEUS= ^1H
##.ACQUISITION MODE= SIMULTANEOUS (DQD)
##.ACQUISITION SCHEME= undefined
##.AVERAGES= 64
##.DIGITISER RES= 22
##SPECTROMETER/DATA SYSTEM= spect
##.PULSE SEQUENCE= noesygpps1d.comp
##.SOLVENT NAME= COFFEE_meoh
##.SHIFT REFERENCE= INTERNAL, COFFEE_meoh, 1, 14.96168
##AUDIT TRAIL= $$ (NUMBER, WHEN, WHO, WHERE, PROCESS, VERSION, WHAT)
$$ ##TITLE= Audit trail, TOPSPIN		Version 2.1
$$ ##JCAMPDX= 5.01
$$ ##ORIGIN= Bruker BioSpin GmbH
$$ ##OWNER= Administrator
$$ $$ E:\/data/COFFEE/nmr/UV1217_M5_1296-1170_30_7229326_oI9TZXSJEr/32/pdata/1/auditp.txt
$$ ##AUDIT TRAIL=  $$ (NUMBER, WHEN, WHO, WHERE, PROCESS, VERSION, WHAT)
(   1,<2013-01-18 02:05:28.649 -0500>,<Administrator>,<X>,<go>,<TOPSPIN 2.1>,
      <created by zg
	started at 2013-01-18 01:53:58.961 -0500,
	POWCHK enabled, PULCHK disabled,
       configuration hash MD5:
       86 BA 57 50 F2 9D 5C 9B 26 00 A9 28 5F 66 2E 89
       data hash MD5: 64K
       FF 2B 25 F7 0B 1F E8 A2 99 1E E4 35 5D CA F7 8F>)
(   2,<2013-01-18 02:05:31.696 -0500>,<Administrator>,<X>,<proc1d>,<TOPSPIN 2.1>,
      <Start of raw data processing
       efp LB = 0.3 FT_mod = 6 PKNL = 1 PHC0 = 0 PHC1 = 0 SI = 128K 
       data hash MD5: 128K
       4C 0D 48 2F 30 D7 5B 46 D5 10 1C F7 A2 BA 40 4C>)
(   3,<2013-01-18 02:05:32.711 -0500>,<Administrator>,<X>,<proc1d>,<TOPSPIN 2.1>,
      <pk PHC0 = -81.54602 PHC1 = 0 
       data hash MD5: 128K
       23 02 FC CE B3 C3 A2 ED D9 F9 21 73 0F 37 8B 01>)
(   4,<2013-01-18 02:05:33.367 -0500>,<Administrator>,<X>,<proc1d>,<TOPSPIN 2.1>,
      <abs ABSG = 1 
       data hash MD5: 128K
       09 F8 C9 2F 37 DE B2 71 92 4D C7 10 AF 4F 05 C7>)
(   5,<2013-01-18 02:05:33.539 -0500>,<Administrator>,<X>,<proc1d>,<TOPSPIN 2.1>,
      <abs ABSG = 2 
       data hash MD5: 128K
       6A 00 B3 7D 6A C9 1D 69 6E 71 AA 25 B7 58 64 69>)
(   6,<2013-01-18 02:05:33.711 -0500>,<Administrator>,<X>,<proc1d>,<TOPSPIN 2.1>,
      <abs ABSG = 3 
       data hash MD5: 128K
       EE D7 B7 C6 99 64 41 FC EC 71 4A 7D F6 6A 49 4D>)
(   7,<2013-01-18 02:05:33.899 -0500>,<Administrator>,<X>,<proc1d>,<TOPSPIN 2.1>,
      <abs ABSG = 4 
       data hash MD5: 128K
       2F 4C 89 42 89 1C DA B9 3C A5 F7 B7 73 AC 10 A6>)
(   8,<2013-01-18 02:05:34.086 -0500>,<Administrator>,<X>,<proc1d>,<TOPSPIN 2.1>,
      <abs ABSG = 5 
       data hash MD5: 128K
       1C 3F 46 D1 40 C6 CD 52 CC 5F FB 9D 2A 23 87 7A>)
$$ ##END=
$$ 
$$ $$ hash MD5
$$ $$ 18 E3 B9 5D D7 C4 31 49 52 63 38 EE B6 CC 5E 63
##$RELAX= 
##$RELAX= 
##$RELAX= 
##$RELAX= 
##$RELAX= 
##$RELAX= 
##$RELAX= 
##$RELAX= 
$$ Bruker specific parameters
$$ --------------------------
##$DU= <E:\>
##$EXPNO= 32
$$ [...]
150 150 150 150 150 150 150 150
##$TP07= 0
##$TPNAME0= <>
##$TPNAME1= <>
##$TPNAME2= <>
##$TPNAME3= <>
##$TPNAME4= <>
##$TPNAME5= <>
##$TPNAME6= <>
##$TPNAME7= <>
##$TPOAL= (0..7)
0.5 0.5 0.5 0.5 0.5 0.5 0.5 0.5
##$TPOFFS= (0..7)
0 0 0 0 0 0 0 0
##$TUNHIN= 0
##$TUNHOUT= 0
##$TUNXOUT= 0
##$USERA1= <user>
##$USERA2= <user>
##$USERA3= <user>
##$USERA4= <user>
##$USERA5= <user>
##$V9= 5
##$VALIST= <valist>
##$VCLIST= <CCCCCCCCCCCCCCC>
##$VD= 0
##$VDLIST= <DDDDDDDDDDDDDDD>
##$VPLIST= <PPPPPPPPPPPPPPP>
##$VTLIST= <TTTTTTTTTTTTTTT>
##$WBST= 1024
##$WBSW= 4
##$XGAIN= (0..3)
0 0 0 0
##$XL= 0
##$YL= 0
##$YMAX_a= 6501063
##$YMIN_a= -14051951
##$ZGOPTNS= <>
##$ZL1= 120
##$ZL2= 120
##$ZL3= 120
##$ZL4= 120
##$ABSF1= 14.96168
##$ABSF2= -5.596501
##$ABSG= 5
##$ABSL= 3
##$ALPHA= 0
##$AQORDER= 0
##$ASSFAC= 0
##$ASSFACI= 0
##$ASSFACX= 0
##$ASSWID= 0
##$AUNMP= <proc_prof1d_extract.lims>
##$AXLEFT= 0
##$AXNAME= <>
##$AXNUC= <1H>
##$AXRIGHT= 0
##$AXTYPE= 0
##$AXUNIT= <>
##$AZFE= 0.1
##$AZFW= 0.1
##$BCFW= 0
##$BC_mod= 0
##$BYTORDP= 0
##$COROFFS= 0
##$CY= 15
##$DATMOD= 1
##$DC= 0
##$DFILT= <>
##$DTYPP= 0
##$F1P= 0
##$F2P= 0
##$FCOR= 0.5
##$FTSIZE= 131072
##$FT_mod= 6
##$GAMMA= 0
##$GB= 0
##$INTBC= 1
##$INTSCL= 1
##$ISEN= 128
##$LB= 0.3
##$LEV0= 0
##$LPBIN= 0
##$MAXI= 10000
##$MC2= 0
##$MEAN= 0
##$ME_mod= 0
##$MI= 0
##$NCOEF= 0
##$NC_proc= -2
##$NLEV= 6
##$NOISF1= 0
##$NOISF2= 0
##$NSP= 0
##$NTH_PI= 0
##$NZP= 0
##$OFFSET= 14.96168
##$PC= 1
##$PHC0= -81.54602
##$PHC1= 0
##$PH_mod= 1
##$PKNL= yes
##$PPARMOD= 0
##$PPDIAG= 0
##$PPIPTYP= 0
##$PPMPNUM= 2147483647
##$PPRESOL= 1
##$PSCAL= 4
##$PSIGN= 0
##$PYNMP= <proc.py>
##$REVERSE= no
##$SF= 400.0200093642
##$SI= 131072
##$SIGF1= 0
##$SIGF2= 0
##$SINO= 400
##$SIOLD= 131072
##$SPECTYP= <>
##$SREGLST= <1H.CDCl3>
##$SSB= 0
##$STSI= 131072
##$STSR= 0
##$SW_p= 8223.68421052631
##$SYMM= 0
##$S_DEV= 0
##$TDeff= 65536
##$TDoff= 0
##$TI= <>
##$TILT= no
##$TM1= 0
##$TM2= 0
##$TOPLEV= 0
##$USERP1= <user>
##$USERP2= <user>
##$USERP3= <user>
##$USERP4= <user>
##$USERP5= <user>
##$WDW= 1
##$XDIM= 131072
##$YMAX_p= 441897497
##$YMIN_p= -23404
##$CURPLOT= <Network HP LaserJet P1505>
##$CURPRIN= <$Network HP LaserJet P1505>
##$DFORMAT= <normdp>
##$LAYOUT= <+/1D_H.xwp>
##$LFORMAT= <normlp>
##$PFORMAT= <normpl>
##$SURQMSG= 1
$$ End of Bruker specific parameters
$$ ---------------------------------
##NTUPLES= NMR SPECTRUM
##VAR_NAME=  FREQUENCY,     SPECTRUM/REAL,   SPECTRUM/IMAG
##SYMBOL=    X,             R,               I
##VAR_TYPE=  INDEPENDENT,   DEPENDENT,       DEPENDENT
##VAR_FORM=  AFFN,          ASDF,            ASDF
##VAR_DIM=   131072,        131072,          131072
##UNITS=     HZ,            ARBITRARY UNITS, ARBITRARY UNITS
##FACTOR=    0.0627417313425164, 1,          1
##FIRST=     8223.62146879497, 3674,         -74189
##LAST=      0,             5688,            -74331
##MIN=       0,             -23404,          0
##MAX=       8223.62146879497, 441897497,    0
$$ Real data points
##PAGE= N=1
##DATA TABLE= (X++(R..R)), XYDATA
$$ [...]
61555C40895J823Q48J2j44J26K32J79N85J701K864L144K308R35j82o40m73J06
61538C54319R08J723K253K338K201K197K355K393K252K207K330K253J741J071
61524C82541N52M4n80r14n99j45m49j538k468k565k119j727j538j434j408j403
61508C64250j085k18Q66J490J251L93l99n96l64l89r60j425j040j59Q4o00j133
61491C59966m88R73K040K037J258L85j7K16N65K02q64j419m75J249K132J753J206
61474C70719J261J295N58m20n06M12J362J604J306R20O43N57P34R45P71K07j75
61457C82193l1K10k5n66p01p7R38J754J966J437M42k64j1J023J921K043J619J231
61439C95102J234J751K824M130N002N056M640M307M138L931L747L788L920L802
$$ y = [340895, 342718, 343566, 343578, 343434, 343560, 343792, 343971, 344556, 346257, 349121, 352265, 354573, 355508, 355326, 354686, 354213, 354319, 355227, 356950, 359203, 361541, 363742, 365939, 368294, 370687, 372939, 375146, 377476, 379729, 381470, 382541, 383093, 383137, 382557, 381643, 381044, 380899, 380450, 378912, 376444, 373879, 371760, 370033, 368495, 367061, 365653, 364250, 363165, 362947, 363813, 365303, 366554, 366947, 366548, 365952, 365588, 365199, 364239, 362814, 361774, 361615, 361699, 361099, 359966, 359478, 360451, 362491, 364528, 365786, 366171, 366154, 366370, 366935, 367137, 366273, 364854, 364379, 365628, 367760, 369513, 370719, 371980, 373275, 373833, 373413, 372907, 373319, 374681, 376285, 377591, 378511, 379154, 379711, 380445, 381390, 382161, 382368, 382193, 382162, 382372, 382347, 381781, 381080, 381003, 381941, 383695, 385661, 387098, 387540, 387276, 387265, 388288, 390209, 392252, 393871, 395102, 396336, 398087, 400911, 405041, 410043, 415099, 419739, 424046, 428184, 432115, 435862, 439650, 443570, 447372]
61425D47372L370K828K271J808J822K522L328L302K347J341R94J080J034P54L88
61410D76561j53j036k068k844l185l142k725k011j391j337j851k382k430k098
61396D47908j932k255k787k926k358j305k09N63P41K41n40q42l20N25J026J164
61380D36694J267J191N93j37l4J043K069K228J956K042K293J928R91N32J255K602
61364D58513L418L190K396J824J844K289K867L397L693L553L184L358M653O632
61350E04811Q247R022R356R652R891J0197J0957J1949J2125J0886Q965P394O145
61337F29597M662L162K345J961R76p90k248k679k751l371m327m832m791m654m420
61322F07840l672k512j570j016k91R18K076K537K381K139K037K086K495L414M400
$$ y = [447372, 450742, 453570, 455841, 457649, 459471, 461993, 465321, 468623, 470970, 472311, 473305, 474385, 475419, 476173, 476561, 476408, 475372, 473304, 470460, 467275, 464133, 461408, 459397, 458006, 456669, 454818, 452436, 450006, 447908, 445976, 443721, 440934, 438008, 435650, 434345, 434136, 434699, 435440, 435681, 435141, 434299, 433979, 434504, 435530, 436694, 437961, 439152, 439745, 439608, 439574, 440617, 442686, 444914, 446870, 448912, 451205, 453133, 454124, 454656, 455911, 458513, 461931, 465121, 467517, 469341, 471185, 473474, 476341, 479738, 483431, 486984, 490168, 493526, 498179, 504811, 513058, 522080, 531436, 541088, 550979, 561176, 572133, 584082, 596207, 607093, 616058, 623452, 629597, 634259, 637421, 639766, 641727, 642703, 641913, 639665, 636986, 634235, 630864, 626537, 621705, 616914, 612260, 607840, 604168, 601656, 600086, 599070, 598779, 599697, 601773, 604310, 606691, 608830, 610867, 612953, 615448, 618862, 623262]
61307F23262M891N187O292Q489J0762J1982J2205J2247J2393J2115J0845Q409
61295G39079M855N27l688o781q480r332r870j0132j0017r608r007q285p705p502
61281F44054p349o564n060l524k494j746r48k70J52Q07K169L814M842N101N315
61266F38299N941O515O435N954O007P129Q922J0683J2288J4023J5742J6711J6651
61253G71300J6261J6031J5046J1979P163K618k08j781l269n045o886q719j0313
61240H04177j1020j0630r915r495q814p153n116l983l934m042l785l445l035k063
61226G17747n61O86J320J916K979M164M929N234N229M852M223L834L932M111L981
61211G68576L768L831M016L937L613L249K689J614K39o70m85Q38K943N351P557
$$ y = [623262, 628153, 633340, 639632, 648121, 658883, 670865, 683070, 695317, 707710, 719825, 730670, 739079, 743934, 744461, 740773, 733992, 725512, 716180, 706310, 696178, 686161, 676553, 667546, 659261, 651556, 644054, 636705, 630141, 625081, 621557, 619063, 617317, 616369, 616099, 616251, 617058, 619227, 623041, 627883, 632984, 638299, 644240, 650755, 657190, 663144, 669151, 676280, 685202, 695885, 708173, 722196, 737938, 754649, 771300, 787561, 803592, 818638, 830617, 837780, 840398, 840190, 838409, 835140, 830095, 823209, 814490, 804177, 793157, 782527, 772612, 763117, 754303, 747150, 742034, 738051, 734117, 730075, 726290, 722845, 719810, 717747, 717186, 717872, 719192, 721108, 724087, 728251, 733180, 738414, 743643, 748495, 752718, 756552, 760484, 764595, 768576, 772344, 776175, 780191, 784128, 787741, 790990, 793679, 795293, 795532, 794862, 794377, 795215, 798158, 803509, 811066]
61196H11066R221J0526J2114J4440J7190J9536K0964K1629K1784K1165J9329J6430
61184A015394J3204J0117P075M098J712K74o41j719l082m478n925p606r378j0889
61170A008156j2077j3087j3870j4345j4731j5255j5726j5961j6305j7080j7801
61159H41918j7693j6837j5981j5303j4267j2665j0890r079o903m492k554j255
61147G13999K01K311M427N641N800N065L171j5l662o473p839p999p402o435n477
61132F95313m592l350j454P19K665M550O849R380J1409J2742J4043J5922J8164
61119G82360K0122K1539K2693K3934K5259K6386K7113K7569K7963K8119K7545
61108A060602K6075K4198K2490K0908J8998J6641J4166J1730R009N656J838j979
$$ y = [811066, 820287, 830813, 842927, 857367, 874557, 894093, 915057, 936686, 958470, 979635, 998964, 1015394, 1028598, 1038715, 1045790, 1049888, 1051600, 1051874, 1051233, 1049514, 1046432, 1041954, 1036029, 1028423, 1019045, 1008156, 996079, 982992, 969122, 954777, 940046, 924791, 909065, 893104, 876799, 859719, 841918, 824225, 807388, 791407, 776104, 761837, 749172, 738282, 729203, 722300, 717808, 715254, 713999, 714200, 716511, 720938, 726579, 732379, 737444, 740615, 740600, 736938, 730465, 722626, 714627, 707225, 700790, 695313, 690721, 687371, 685917, 686636, 689301, 693851, 700700, 710080, 721489, 734231, 748274, 764196, 782360, 802482, 824021, 846714, 870648, 895907, 922293, 949406, 976975, 1004938, 1033057, 1060602, 1086677, 1110875, 1133365, 1154273, 1173271, 1189912, 1204078, 1215808, 1224817, 1230473, 1232311, 1230332]
61096A230332n611r283j3219j7362k1479k5299k8366l0094l0313k9611k8797k8044
61084I62854k7001k5655k4452k3452k2096k0162j8297j7035j5937j4292j2234
61073G42241j0357q674o858n199m272l799k801r79R25K266L108L619L699L508
61059G16427L516L848M296N125O878R206J0831J1219J1320J2223J3901J5876J8130
61046H42796K0608K2622K3664K4279K5284K6604K7658K8470K9558L1011L2375
61035A134929L3294L3661L3503L3193L3421L4308L5019L4911L4636L5315L6945
61024A513135L8555L9696M0836M2327M3946M5656M8070N1844N7131O3887P2221
61013B057304Q2175R3466J05734J19078J34450J53783J79524K13577K56608L08763
$$ y = [1230332, 1224721, 1215438, 1202219, 1184857, 1163378, 1138079, 1109713, 1079619, 1049306, 1019695, 990898, 962854, 935853, 910198, 885746, 862294, 840198, 820036, 801739, 784704, 768767, 754475, 742241, 731884, 723210, 716352, 711153, 706881, 703082, 700281, 699302, 700227, 702493, 705601, 709220, 712919, 716427, 719943, 723791, 728087, 733212, 740090, 749296, 760127, 771346, 782666, 794889, 808790, 824666, 842796, 863404, 886026, 909690, 933969, 959253, 985857, 1013515, 1041985, 1071543, 1102554, 1134929, 1168223, 1201884, 1235387, 1268580, 1302001, 1336309, 1371328, 1406239, 1440875, 1476190, 1513135, 1551690, 1591386, 1632222, 1674549, 1718495, 1764151, 1812221, 1864065, 1921196, 1985083, 2057304, 2139479, 2232945, 2338679, 2457757, 2592207, 2745990, 2925514, 3139091, 3395699, 3704462]
61003C704462L71032M44684N27687O11245O81846P29663P56179P73005P93688
60994I393491Q28409Q84536R63566J050091J108631J105292J040522R56600R08306
60985A8239444R29373J026303J185467J361284J458047J356814R97171M43295
60977B6997198j41754n96921q44241q89109p76280n70947l70533k92718m15220
60968B2099475p18423j095151j422801j630318j709850j686761j591236j450055
60960A0794880j286996j120636r62390q18496o92365n84435m92556m14481l49291
60951D073234k95989k52478k16825j88052j64926j45440j28475j14534j03711
60942B462804r4264q4451p4626o6120n8927n2068m5616m0748l7908l6217l4729
$$ y = [3704462, 4075494, 4520178, 5047865, 5659110, 6340956, 7070619, 7826798, 8599803, 9393491, 10221900, 11106436, 12070002, 13120093, 14228724, 15334016, 16374538, 17331138, 18239444, 19168817, 20195120, 21380587, 22741871, 24199918, 25556732, 26553903, 26997198, 26855444, 26258523, 25414282, 24525173, 23748893, 23177946, 22807413, 22514695, 22099475, 21381052, 20285901, 18863100, 17232782, 15522932, 13836171, 12244935, 10794880, 9507884, 8387248, 7424858, 6606362, 5913997, 5329562, 4837006, 4422525, 4073234, 3777245, 3524767, 3307942, 3119890, 2954964, 2809524, 2681049, 2566515, 2462804, 2368540, 2284089, 2209463, 2143343, 2084416, 2032348, 1986732, 1945984, 1908076, 1871859, 1837130]
60931A837130l3176l1419k9150k6446k3907k2039k0929k0565k0937k1763k2578
60920A564221k3202k3840k4766k6086k7676k9028k9443k8745k7631k6903k6533
60909A270368k5893k4745k3435k2239k1067j9916j9105j8832j8798j8460j7579
60898A040299j6398j5349j4629j4089j3544j3159j3272j3810j4141j3736j2819
60887H85353j2176j2382j3261j3964j3613j2111j0366r479r586r822r376q302
60875G50915p162o398o278o954q145r068r153q724q514q667q604p909o975o573
60861F41791o955p534p489o666n675n119m904m557l972l460l138k776k252j721
60847E75573j221n93N8K98k1n47r68j406j999k550k894l276l964m742n113m775
$$ y = [1837130, 1803954, 1772535, 1743385, 1716939, 1693032, 1670993, 1650064, 1629499, 1608562, 1586799, 1564221, 1541019, 1517179, 1492413, 1466327, 1438651, 1409623, 1380180, 1351435, 1323804, 1296901, 1270368, 1244475, 1219730, 1196295, 1174056, 1152989, 1133073, 1113968, 1095136, 1076338, 1057878, 1040299, 1023901, 1008552, 993923, 979834, 966290, 953131, 939859, 926049, 911908, 898172, 885353, 873177, 860795, 847534, 833570, 819957, 807846, 797480, 788001, 778415, 768593, 759217, 750915, 743753, 737355, 731077, 724123, 715978, 706910, 697757, 689033, 680519, 671852, 663248, 655339, 648364, 641791, 634836, 627302, 619813, 613147, 607472, 602353, 597449, 592892, 588920, 585460, 582322, 579546, 577294, 575573, 574352, 573759, 573817, 574115, 574094, 573547, 572579, 571173, 569174, 566624, 563730, 560454, 556490, 551748, 546635, 541860]
60831E41860l810k615j836j953k638k915k213r69Q3P84J387J974K447K822L070
60816E35478K969K485K037J912J718R68k4m42j09K26j37j024j700j733j394j316
60800E39914j849k707l348l610l801m107m276m076l779l794m104m335m296m144
60786D87688m128m316m564m581m241l836l784l958l733k912k200k388l332m136
60772D35579m107l183j680m1J266K026K445K771K903K666K292K288K836L554L854
60757D55469L507K913K868L786N071N659N227M503M189M140L914L570L403L282
60743E11501K831J972P48j046l501n993p613q100p962p729p573p486p374p017
60729D45658o343n697n426n389n216m889m633m430m083l631l229k767k093j450
$$ y = [541860, 538050, 535435, 533599, 531646, 529008, 526093, 523880, 522911, 522994, 523778, 525165, 527139, 529586, 532408, 535478, 538447, 540932, 542969, 544881, 546599, 547567, 547543, 547101, 546992, 547218, 547081, 546057, 544357, 542624, 541230, 539914, 538065, 535358, 532010, 528400, 524599, 520492, 516216, 512140, 508361, 504567, 500463, 496128, 491832, 487688, 483560, 479244, 474680, 470099, 465858, 462022, 458238, 454280, 450547, 447635, 445435, 443047, 439715, 435579, 431472, 428289, 426609, 426568, 427834, 429860, 432305, 435076, 437979, 440645, 442937, 445225, 448061, 451615, 455469, 458976, 461889, 464757, 468543, 473614, 479273, 484500, 489003, 493192, 497332, 501246, 504816, 508219, 511501, 514332, 516304, 517052, 516006, 512505, 506512, 498899, 490799, 482837, 475108, 467535, 460049, 452675, 445658, 439315, 433618, 428192, 422803, 417587, 412698, 408065, 403635, 399552, 395921, 392692, 389925, 387832, 386382]
60715C86382j157j022o42j92k14o34p35j90M74P35P74J013J390J486J128N92L26
60698C89514N91J256J872K117K097K124K238K245K110K053K283K812L491M029
60684D20832M236M372N007O188P128P156O644O427O589O525O032N591N483N318
60670E03528M649L536K349J350N70j80j124k103k580k388k214k772l836m731n348
60655D88706n906o027n133l634k625k294j741n73M72P60N76K47m16j325j840j951
60639D57296k701m563o348o696n835m867m033k890j635q75m26L86J331J474Q30
60624D20448N32J085J590J231N69O42J490K210K135J437Q01Q31J481J882J145
60609D39509m17j378q94K31O43J93j63N6L41K55K37P88J500J535Q72L58N01P80
$$ y = [386382, 385225, 384203, 383561, 383369, 383155, 382521, 381786, 381596, 382070, 382805, 383579, 384592, 385982, 387468, 388596, 389188, 389514, 390105, 391361, 393233, 395350, 397447, 399571, 401809, 404054, 406164, 408217, 410500, 413312, 416803, 420832, 425068, 429440, 434447, 440635, 447763, 454919, 461563, 467990, 474579, 481104, 487136, 492727, 498210, 503528, 508177, 511713, 514062, 515412, 515982, 515802, 514678, 512575, 509995, 507607, 505393, 502621, 498785, 494054, 488706, 482800, 476773, 471640, 468006, 465381, 463087, 461346, 460773, 461245, 462005, 462581, 462828, 462412, 461087, 459247, 457296, 454595, 450032, 443684, 436988, 431153, 426286, 422253, 419363, 417728, 416853, 416427, 416813, 418144, 419618, 420448, 420980, 422065, 423655, 424886, 425455, 426097, 427587, 429797, 431932, 433369, 434170, 435001, 436482, 438364, 439509, 439092, 437714, 436820, 437051, 437694, 437887, 437724, 437780, 438121, 438376, 438613, 439401, 440901, 442436, 443308, 443666, 444167, 444947]
60591D44947N44Q5K64J218K102K268K130K503L363L827L332K363J856K183K934
60576D75919L520L732L709L643L675L977M735N914P100P798P937Q006Q560R591
60562E57816J0523J0855J0661J0420J0424J0490J0241R586Q811Q301Q166Q067
60550F74361P376N669L183O95j110k099k461k290j629o44O08K437M994P584R177
60535G05851R779J0564J2264J4084J4846J4665J4685J5412J6163J6215J5738J5274
60523H75540J4787J3614J1168P566L614J10k881n832q700j0582j0864j0193r561
60510H67786q853p247m907l052k172j220J010M560Q772J3134J7096J9953K1766
60497I26626K3837K7313L1687L5495L8124M0169M2188M4057M5512M6519M6993
$$ y = [444947, 445491, 445576, 445840, 447058, 449160, 451428, 453558, 456061, 459424, 463251, 466583, 468946, 470802, 472985, 475919, 479439, 483171, 486880, 490523, 494198, 498175, 502910, 508824, 515924, 523722, 531659, 539665, 548225, 557816, 568339, 579194, 589855, 600275, 610699, 621189, 631430, 641016, 649827, 658128, 666294, 674361, 681737, 687406, 690589, 691284, 690174, 688075, 685614, 683324, 681695, 681051, 681659, 684096, 689090, 696674, 705851, 715630, 726194, 738458, 752542, 767388, 782053, 796738, 812150, 828313, 844528, 860266, 875540, 890327, 903941, 915109, 922675, 926289, 926399, 923518, 917686, 908986, 898404, 887540, 877347, 867786, 858933, 851686, 846779, 843727, 841555, 840335, 841345, 845905, 854677, 867811, 884907, 904860, 926626, 950463, 977776, 1009463, 1044958, 1083082, 1123251, 1165439, 1209496, 1255008, 1301527, 1348520]
60486A348520M6784M6014M4827M2736L8848L2971K5935J8610J1072L026n444j3915
60474A639984k2119l0016l7495m4322n0304n5339n9365o2288o3835o3447o0679
60463A090775n5952n0668m6195m2716l9306l5209l0801k7164k4860k3344k1589
60452F92971j9155j6475j4191j2414j0815r316q283p962p955p557o538n285m206
60439E62819l357k831l008l960m880m748l543k290j730j587j334j055j071j230
60425E26195j220j203j496j878j912j741j781j762r32O47J913K144J776J562J577
60410E21889J508J288R75N01K4N9P40J302R51p9q00o34J53R68J417J460J470K034
60392E35226L235M303M344L309K040J450J892L014L940L892L058K513K892L522
$$ y = [1348520, 1395304, 1441318, 1486145, 1528881, 1567729, 1600700, 1626635, 1645245, 1656317, 1659343, 1653899, 1639984, 1617865, 1587849, 1550354, 1506032, 1455728, 1400389, 1341024, 1278736, 1214901, 1151454, 1090775, 1034823, 984155, 937960, 895244, 855938, 820729, 789928, 762764, 737904, 714560, 692971, 673816, 657341, 643150, 630736, 619921, 610605, 602322, 594360, 586405, 578848, 572310, 567025, 562819, 559462, 556631, 553623, 549663, 544783, 540035, 536492, 534202, 532472, 530885, 529551, 528496, 527425, 526195, 524975, 523772, 522276, 520398, 518486, 516745, 514964, 513202, 512270, 512917, 514830, 516974, 518750, 520312, 521889, 523397, 524685, 525660, 526161, 526185, 526244, 526984, 528286, 529237, 529158, 528358, 527724, 527877, 528845, 530262, 531722, 533192, 535226, 538461, 542764, 547108, 550417, 552457, 553907, 555799, 558813, 562753, 566645, 569703, 572216, 575108, 578630]
60378E78630L415K758K564L114L583L367K881K809L126L312L047K348J420P16
60364F17090Q53J993L444M268M215L839L688L749L760L856M526N921P447Q367
60350F77016Q640Q826R224R581R701R811J0070J0236J0181J0222J0453J0243R058
60337H03262P312N617L591M29l502o819q973j0812j2877j4270j4016j2660j1505
60324G24777j0791r711p972o340n517n306n105m639l908k919j808q43l7R95K593
60309F63469M667O931R219J1391J3189J4509J5625J6794J7799J8201J7916J7229
60297H26939J6311J5210J4320J4223J4697J4331J1701O838J122m223r102j4036
60285I08331j9146k3808k7096k8346k7542k5379k2813k0399j8053j5542j3082
$$ y = [578630, 582045, 584803, 587367, 590481, 594064, 597431, 600312, 603121, 606247, 609559, 612606, 614954, 616374, 617090, 617943, 619936, 623380, 627648, 631863, 635702, 639390, 643139, 646899, 650755, 655281, 661202, 668649, 677016, 685656, 694482, 703706, 713287, 722988, 732799, 742869, 753105, 763286, 773508, 783961, 794204, 803262, 810574, 816191, 819782, 820211, 816709, 809890, 800917, 790105, 777228, 762958, 748942, 736282, 724777, 713986, 704275, 696303, 689963, 684446, 679140, 674035, 669396, 665488, 662569, 660761, 659918, 659881, 660876, 663469, 668136, 675067, 684286, 695677, 708866, 723375, 739000, 755794, 773593, 791794, 809710, 826939, 843250, 858460, 872780, 887003, 901700, 916031, 927732, 934570, 935692, 931469, 922367, 908331, 889185, 865377, 838281, 809935, 782393, 757014, 734201, 713802, 695749, 680207, 667125]
60274F67125j1308j0682j0884j0876r715p473n234m007l753l716l432l019k622
60261E80404k175j770j660j707j350m30M15N41J31j79j07K31P49J382J791J621
60245E77887J002M06Q2j10l06m87n86n62m01k56m34r59j318r78jJ052J794K213
60227E78038K457K669L022L567M067M242M103L862L628L453L430L535L573L493
60213F27139L536L748L773L514L628M736O373P355P139O203N260M692M675N120
60199F96891N390M757L337J993J211O51m9p04j097j473k102k788l226l456l659
60184F95676l749l566l247l076l066k903k257j132n9K21m46j209j135m21q4l66
60168F69181l14P23J928K080J241N84P97J368J492J019L91M4R0L19M03J16n85
$$ y = [667125, 655817, 645135, 634251, 623375, 613660, 606187, 600953, 596946, 593193, 589477, 586045, 583026, 580404, 578229, 576459, 574799, 573092, 571742, 571312, 571727, 572268, 572399, 572220, 572113, 572344, 573093, 574475, 576266, 577887, 578889, 579295, 579377, 579267, 578961, 578474, 577888, 577326, 576925, 576669, 576235, 575276, 573958, 572980, 572979, 574031, 575825, 578038, 580495, 583164, 586186, 589753, 593820, 598062, 602165, 606027, 609655, 613108, 616538, 620073, 623646, 627139, 630675, 634423, 638196, 641710, 645338, 650074, 656447, 663802, 670941, 677144, 682404, 687096, 691771, 696891, 702281, 707038, 710375, 712368, 713579, 714230, 714181, 713477, 712380, 710907, 708805, 706017, 702791, 699335, 695676, 691927, 688361, 685114, 682038, 678972, 676069, 673812, 672680, 672621, 672842, 672396, 671187, 670052, 669631, 669547, 669181, 668867, 669590, 671518, 673598, 674839, 675423, 676220, 677588, 679080, 680099, 680490, 680534, 680624, 680943, 681346, 681462, 680877]
60151F80877j673k937l732l241j398O95J818J944K078K879L936M559M736N011
60137F95552N692O524P064P099O742O289N987N834N655N382N191N188N082M414
60123G77695L142J768P46P4m12o12m48k49l73m95k3Q12R96K04o08o12l67q74j941
60104G78423k571k677l132m073m318l025r48M77P33K49n11j333j944k126j935
60089G51289j472n89O65J616J559P32J35L30R06J222J279J518J950J861O21j407
60073G62215l085l828m386n883q260j0238j0879j0553j0114r771r195q345p575
60060F60103p051o624o170n691n131m385l546k805k175j531r07n22m78n75m48
60045F12064J79J240K224K588K342K066K188K496K597K534K542K475J908P25p66
$$ y = [680877, 679204, 676267, 672535, 669294, 667896, 668591, 670409, 672353, 674431, 677310, 681246, 685805, 690541, 695552, 701244, 707768, 714832, 721931, 728673, 734962, 740949, 746783, 752438, 757820, 763011, 768199, 773281, 777695, 780837, 782605, 783351, 783425, 783013, 782401, 781953, 781704, 781331, 780836, 780813, 781625, 782621, 782825, 782217, 781605, 781238, 780364, 778423, 775852, 773175, 770043, 765970, 761652, 758627, 757679, 758156, 758889, 759138, 758627, 757294, 755350, 753224, 751289, 749817, 749228, 749893, 751509, 753068, 753800, 753935, 754265, 755171, 756393, 757672, 759190, 761140, 763001, 763622, 762215, 759130, 755302, 750916, 745033, 736773, 726535, 715656, 705103, 694989, 685218, 676023, 667678, 660103, 653052, 646428, 640258, 634567, 629436, 625051, 621505, 618700, 616525, 614994, 614087, 613565, 613087, 612512, 612064, 612243, 613483, 615707, 618295, 620637, 622703, 624891, 627387, 629984, 632518, 635060, 637535, 639443, 640168, 639402]
60030F39402k303l799n021n606n525n176m875m544m155m058m554n325n749n644
60016E73068n334m914m007k527j236j040j835k575k533k011j608j377j021o14
60002E40436n17q16j178j261q95l6J107K065K564K840L145L201K687J972J717
59987E57031J817J590R56N78P00O89P8p59j341j764k131k044j368q37j168j953
59971E50074k266j931j469j022k95N62R01O18M77J128K353L564M545N298N538
59956E68075M877L564K498K319K565K162Q01n36q02l37m67j703k968k971j801
59941E75276o85n49j182j728j578r23n38q72j395j185j73P75J197J687K821M140
59925E75088M826M863M846N021N226N502O045O758P413P987Q340P961O737N564
$$ y = [639402, 637099, 633300, 628279, 622673, 617148, 611972, 607097, 602553, 598398, 594340, 589786, 584461, 578712, 573068, 567734, 562820, 558813, 556286, 555050, 554010, 552175, 549600, 547067, 545056, 543448, 542071, 541050, 540436, 539919, 539103, 537925, 536664, 535769, 535733, 536840, 538905, 541469, 544309, 547454, 550655, 553342, 555314, 557031, 558848, 560438, 561394, 561972, 562672, 563361, 563439, 562680, 561339, 559575, 557444, 555400, 554032, 553195, 552027, 550074, 547808, 545877, 544408, 543386, 543091, 543653, 544554, 545172, 545649, 546777, 549130, 552694, 557239, 562537, 568075, 572952, 576516, 579014, 581333, 583898, 586060, 586861, 586325, 585523, 585186, 584719, 583016, 580048, 577077, 575276, 574591, 574042, 572860, 571132, 569554, 568631, 568093, 567221, 565826, 564641, 564468, 565243, 566440, 568127, 570948, 575088, 579914, 584777, 589623, 594644, 599870, 605372, 611417, 618175, 625588, 633575, 641915, 649876, 656613, 662177]
59911F62177N349N649N244L846K257R24n24k113l042k915k535k851l747m460m696
59896F58563m628m205l138j577j72O04R15J282K005K955L818M456M962N505O253
59881F77598P360Q719R677R489Q257O959O189N380L791J764K72m44r76j641k157
59866G40237k365k540k899l489m521o006p131o942n801n150n564n984n401m256
59852F72188l483l028k241j138k13O49K025L730M707M402L568L363M022M827N156
59837F98534N202N537O327P173P768Q275Q838Q966P943N796L352J361j4p88r09
59822G73361o28o40j439k884m659o692q812j0329j0580r705q567p928p927q222
59808F84349q360q118p673p369p222o774n586l822k225j632k334l679m422l879
$$ y = [662177, 667526, 673175, 678419, 682265, 684522, 685446, 684922, 682809, 679767, 676852, 674317, 671466, 667719, 663259, 658563, 653935, 649730, 646592, 645015, 644843, 645447, 646362, 647644, 649649, 652604, 656422, 660878, 665840, 671345, 677598, 684958, 693677, 703354, 712843, 721100, 728059, 734248, 739628, 743419, 745183, 745455, 745011, 744035, 742394, 740237, 737872, 735332, 732433, 728944, 724423, 718417, 711286, 704344, 698543, 693393, 687829, 681845, 676444, 672188, 668705, 665677, 663436, 662298, 662085, 662734, 664759, 668489, 673196, 677598, 681166, 684529, 688551, 693378, 698534, 703736, 709273, 715600, 722773, 730541, 738816, 747654, 756620, 764563, 770359, 773711, 775072, 775058, 774270, 773361, 772733, 772093, 770654, 767770, 763111, 756419, 747607, 737278, 726698, 716993, 708426, 700498, 692571, 684349, 675989, 667871, 660198, 652829, 645607, 638833, 633247, 629425, 627200, 625568, 623234, 619555, 615133, 611254]
59794F11254k696k098k426k919k880k342j516l81P86J280Q70K53J32L22L20J84
59778E98143J71L5n35j079p96K76J258J588J533J558J777K025J916R26r08k416
59762F05472k159k18J623J911J216J217K535M158M952M949M856M924M894M879
59748F45209N455O669P573P308O253N497N349N125M301L126J966Q45j18n53n66
59733G03439q79j723k293j941j276j295j917k337k418k691l109k915j907q36k91
59718F75611K6M47N47k39j614k625k694k076j343q31m94j62K24O19J089J799K604
59701F70888K990K747K417K615L059K947K210J721K060K710K792K135J295Q85
59687G03471J187K008K631K237P80q36j812k300k858l417l466l086l083l908n039
$$ y = [611254, 608558, 606460, 604034, 601115, 598235, 595893, 594377, 593996, 594782, 596062, 596932, 597185, 597317, 597639, 597959, 598143, 598314, 598349, 597814, 596735, 595939, 596215, 597473, 599061, 600594, 602152, 603929, 605954, 607870, 608796, 607888, 605472, 603313, 603095, 604718, 606629, 607845, 609062, 611597, 615755, 620707, 625656, 630512, 635436, 640330, 645209, 650664, 657333, 664906, 672214, 678467, 683964, 689313, 694438, 698739, 701865, 703831, 704676, 704558, 704005, 703439, 702560, 700837, 698544, 696603, 695327, 694032, 692115, 689778, 687360, 684669, 681560, 678645, 676738, 675902, 675611, 675637, 676084, 676631, 676392, 674778, 672153, 669459, 667383, 666040, 665209, 664715, 664553, 664777, 665396, 666485, 668284, 670888, 673878, 676625, 679042, 681657, 684716, 687663, 689873, 691594, 693654, 696364, 699156, 701291, 702586, 703471, 704658, 706666, 709297, 711534, 712314, 711478, 709666, 707366, 704508, 701091, 697625, 694539, 691456, 687548, 682509]
59672F82509n731n894n842n564m838l978l778m443n093m776l690k831k540k056
59658F21455p41Q96J850J955J951K343K757K621K038J693J989K503K384J203n59
59643F46338k017k737k986l156l305l392l549l819l844l231k113j025l13n3l06
59628F10492j083k041k659k757k592k474k605l176m081m654m149k670j173m30
59614E73948l74n69q67j305j748j946j768j159j07J154K135K548K599K647K720
59599E77908K569K071J378P73M54L92L34L5m87j009j384j615j697j585j248o13
59583E76276L56J253J217j44j913k645j979r22m45n28p70j161j753k174k097j785
59567E60786j674j732j697j554j393j160r79j241j818j770n21J052J624J159P30
$$ y = [682509, 676778, 670884, 665042, 659478, 654640, 650662, 646884, 642441, 637348, 632572, 628882, 626051, 623511, 621455, 620714, 621610, 623460, 625415, 627366, 629709, 632466, 635087, 637125, 638818, 640807, 643310, 645694, 646897, 646338, 644321, 641584, 638598, 635442, 632137, 628745, 625196, 621377, 617533, 614302, 612189, 611164, 610851, 610798, 610492, 609409, 607368, 604709, 601952, 599360, 596886, 594281, 591105, 587024, 582370, 578221, 575551, 574378, 573948, 573574, 573005, 572138, 570833, 569085, 567139, 565371, 564212, 564105, 565259, 567394, 569942, 572541, 575188, 577908, 580477, 582548, 583926, 584699, 585153, 585545, 585879, 585914, 585427, 584418, 583034, 581419, 579722, 578137, 576889, 576276, 576632, 577885, 579102, 578958, 577045, 574400, 572421, 571499, 571054, 570526, 569756, 568595, 566842, 564668, 562571, 560786, 559112, 557380, 555683, 554129, 552736, 551576, 550597, 549356, 547538, 545768, 545247, 546299, 547923, 549082, 549812]
59552E49812Q11Q53N80O56J584K934M051M898N690O362O896P602Q477Q838Q311
59537F18355P757Q395J0097J1368J1177J0241J0127J1425J3013J3066J0685O666
59525G42372K755K27q38j045r19p73r16j518k380l181l989n152o760q425r715
59510F99743j0542j1078j1428j1494j1105j0250r215q348p648o720n318l791k772
59497E90034k467k433k029r98K83J005N87o24j508j292l84K50L74O19J434K420
59481E85271K947L035L306M246N633O604O395N213M270M543N579O125N843N661
59467F54671O149O450N458L480J843J244J307J603K221L182M163N016O063P440
59453G10290Q673R314R668J0363J1351J1712J0661Q398N866L712J785k60k197
$$ y = [549812, 550623, 551476, 552056, 552712, 554296, 557230, 561281, 566179, 571869, 578231, 585127, 592729, 601206, 610044, 618355, 626112, 634507, 644604, 655972, 667149, 677390, 687517, 698942, 711955, 725021, 735706, 742372, 745127, 745354, 744516, 743471, 742552, 741779, 740863, 739345, 736965, 733784, 729795, 724643, 717883, 709458, 699743, 689201, 678123, 666695, 655201, 644096, 633846, 624631, 616283, 608635, 601915, 596597, 592806, 590034, 587567, 585134, 583105, 582107, 582390, 583395, 583982, 583358, 581850, 580558, 580174, 580424, 580798, 581417, 582851, 585271, 588218, 591253, 594559, 598805, 604438, 611042, 617437, 622650, 626920, 631463, 637042, 643167, 649010, 654671, 660820, 667270, 672728, 676208, 678051, 679295, 680602, 682205, 684426, 687608, 691771, 696787, 702850, 710290, 718963, 728277, 737945, 748308, 759659, 771371, 782032, 790430, 796296, 800008, 801793, 801533, 799336]
59440G99336l479m192n112o605q061q844r192r516r332p901n677l959l116k261
59426G12089r02L29J131K465N120Q227J0454J2045J4347J7541K0074K0586J9424
59413H42930J7928J6961J6412J5516J3393R907O295M368M602N349M316N63m932
59400I53608j0166j3231j3322j1329r268q387p885n966k318R32J016k835q751
59387H62098j4020j7229j8608j8795j7883j5791j2930r963p124m309j710J91J251
59374G25178J794K055K006J768J689J877K239K994M516O408P504P219O228N425
59360G78900M968M798N332O656P839Q064P966Q655R883J0532J0712J1801J4173
59347H90279J6373J7209J7243J7509J7829J7455J6366J4950J3024J0267P031L785
$$ y = [799336, 795857, 791665, 786553, 779948, 771887, 763043, 753851, 744335, 735003, 727102, 721425, 717466, 714350, 712089, 711187, 711516, 712647, 715112, 720232, 728459, 738913, 750958, 765305, 782846, 802920, 823506, 842930, 860858, 877819, 894231, 909747, 923140, 933047, 939342, 943710, 948312, 953661, 957977, 958540, 953608, 943442, 930211, 916889, 905560, 896292, 887905, 880020, 874054, 871736, 872668, 873684, 870849, 862098, 848078, 830849, 812241, 793446, 775563, 759772, 746842, 736879, 729755, 725446, 723736, 723927, 725178, 726972, 729027, 731033, 732801, 734490, 736367, 738606, 741600, 746116, 752524, 760028, 767247, 773475, 778900, 783868, 788666, 793998, 800654, 808493, 816557, 824523, 833178, 843061, 853593, 864305, 876106, 890279, 906652, 923861, 941104, 958613, 976442, 993897, 1010263, 1025213, 1038237, 1048504, 1055535, 1059320]
59335A059320K26l937p856j0394j1802j3321j5291j6864j7601j7968j8068j7265
59323I09179j5538j3996j3377j3041j2177j1049j0263r576q425p005n862m927
59311G83943l881l115l273m062m471m205l924l970l742k655j092P3M97N88Q71
59296G47582J351J536J034J91j30L98J120J242Q19M60N32J273L257O720J0404
59281G77789J2023J0273N952J078k538l969l292j444N82K701N316Q064R807J0211
59267H32553J0271J0744J0877R532O929M296K205K27j982m240o469q846j1100
59254H54997j2424j2468j1826j1176j0450r258p751o415n237l678j624K03J068
59241G63961J181J429K345L735N265O872Q379R204Q892P712O299M889L380J936
$$ y = [1059320, 1059546, 1055609, 1047753, 1037359, 1025557, 1012236, 996945, 980081, 962480, 944512, 926444, 909179, 893641, 879645, 866268, 853227, 841050, 830001, 819738, 810162, 801737, 794732, 788870, 783943, 780062, 776947, 773674, 769612, 765141, 760936, 757012, 753042, 749300, 746645, 745553, 745626, 746123, 746711, 747582, 748933, 750469, 751503, 751694, 751564, 751962, 753082, 754324, 755143, 755603, 756135, 757408, 760665, 767385, 777789, 789812, 800085, 806037, 807115, 804577, 800608, 797316, 795872, 796454, 799155, 804471, 812535, 822342, 832553, 842824, 853568, 864445, 873977, 880906, 885202, 887407, 887634, 885652, 881412, 874943, 866097, 854997, 842573, 830105, 818279, 807103, 796653, 787395, 779644, 773229, 767992, 764314, 762690, 762893, 763961, 765142, 766571, 768916, 772651, 777916, 784788, 793167, 802371, 811263, 818975, 825274, 830163, 833543, 835479]
59227H35479Q72l5j488l685n896p289p732p579p066o305n597n320n545n915n892
59212G61007n183m090l364l417l813l909l851m230m918n072m498m013m086m013
59198G02550l125k019j680j951j870j165m57q6L13R74J550J758J892K398L273
59183G02355M075M337L979L501L634M509N378N545N258N287N806O341O689P198
59169G73892Q026Q781R162R404R867J0439J0618J0002Q577O654M581K364k71l312
59155H68784o160q244r729j1186j2666j3674j4021j4092j4136j3851j2929j1645
59143G26451j0547r832r265q592p780o955o253n766n521n447n274m618l401k146
59129F35054j478j200m38J055K421K984L430M795O696P702P435P225Q294J0214
$$ y = [835479, 836351, 836316, 834828, 831143, 825247, 817958, 810226, 802647, 795581, 789276, 783679, 778359, 772814, 766899, 761007, 755824, 751734, 748370, 744953, 741140, 737231, 733380, 729150, 724232, 719160, 714662, 710649, 706563, 702550, 699425, 697406, 695726, 693775, 691905, 690740, 690283, 690197, 690510, 691484, 693034, 694792, 696684, 699082, 702355, 706430, 710767, 714746, 718247, 721881, 726390, 731768, 737313, 742571, 747858, 753664, 760005, 766694, 773892, 781918, 790699, 799861, 809265, 819132, 829571, 840189, 850191, 858768, 865422, 870003, 872367, 872096, 868784, 862624, 854380, 844651, 833465, 820799, 807125, 793104, 779012, 764876, 751025, 738096, 726451, 715904, 706072, 696807, 688215, 680435, 673480, 667227, 661461, 655940, 650493, 645219, 640601, 637200, 635054, 633576, 632376, 631938, 632993, 635414, 638398, 641828, 646623, 653319, 661021, 668456, 675681, 683975, 694189]
59115F94189J1745J2435J2716J2877J2778J2468J2322J2408J2193J1202R692Q357
59103H35382P486O697N576M236K984J685n3k119l859m910n575o114o216n632m822
59088H24746m384m129l376k055r75r75k232m279o375p935q896r611j0178j0247
59074G49099r727r151q830q216o754m993l971l794l686l264k855k578k122j477
59060F77681j150j386j867k244k373k156j807k110l479m828m482k387l39K69j51
59045F47191n28n93n44l09Q7J04n21j142j003k25N71J162J651K028K383L139M446
59028F57897N752O615P483R034J1001J2421J2946J3151J3613J4136J4097J3176
59016G91322J1517R333O516K865j176m302n416m938m397m657n120m891l929k646
$$ y = [694189, 705934, 718369, 731085, 743962, 756740, 769208, 781530, 793938, 806131, 817333, 827025, 835382, 842868, 849565, 855141, 859377, 862361, 864046, 863993, 861874, 858015, 853105, 847530, 841416, 835200, 829568, 824746, 820362, 816233, 812857, 810802, 809827, 808852, 806620, 802341, 795966, 788031, 779135, 769524, 759346, 749099, 739372, 730221, 721391, 713175, 706421, 701428, 697457, 693663, 689977, 686713, 683858, 681280, 679158, 677681, 676531, 675145, 673278, 671034, 668661, 666505, 664698, 662588, 659109, 654281, 649799, 647412, 647073, 647342, 647191, 646663, 646070, 645526, 645217, 645304, 645408, 644887, 643745, 642742, 642517, 643088, 644250, 645901, 647929, 650312, 653451, 657897, 663649, 670264, 677747, 686781, 697782, 710203, 723149, 736300, 749913, 764049, 778146, 791322, 802839, 812172, 818688, 821553, 820377, 816075, 810659, 805721, 801324, 796667, 791547, 786656, 782727, 780081]
59002G80081j058R96L213N090O548P703Q251P696O175M578L729L636L547K682
58988H42867R44j056k764m272n873p258p744p260o429n585m425k807j214J9J295
58973G88438L146N432P564R160J0163J0696J1118J1834J2809J3646J4245J4863
58961I13114J5433J5384J4430J2870J0891Q181M551L62l951q210j2098j5119j7179
58948I38659j8521j8986j8160j6484j5166j4584j3838j2370j0911j0127r440q104
58936G71968o475n176l918k204n54J93J22k08q95k269l813m637m672m404l901
58921G29157l077k467k601k966k752k207k137k418k164j238l18M13J431K733L708
58906G13097M228M883O000P337Q798J0529J2282J3544J4364J5180J5914J6163
$$ y = [780081, 779023, 780019, 783232, 788322, 794870, 802573, 810824, 818520, 824695, 829273, 833002, 836638, 840185, 842867, 843811, 842755, 839991, 835719, 829846, 822588, 814844, 807584, 801155, 795570, 791145, 788338, 787124, 787143, 788438, 791584, 797016, 804580, 813740, 823903, 834599, 845717, 857551, 870360, 884006, 898251, 913114, 928547, 943931, 958361, 971231, 982122, 990303, 994854, 995216, 991265, 983055, 970957, 955838, 938659, 920138, 901152, 882992, 866508, 851342, 836758, 822920, 810550, 799639, 789512, 780072, 771968, 765493, 760317, 756399, 754195, 753641, 753834, 753956, 753748, 752853, 750584, 746771, 742134, 737462, 733058, 729157, 726080, 723613, 721012, 718046, 715294, 713087, 710950, 708532, 706368, 705130, 704812, 705225, 706656, 709389, 713097, 717325, 722208, 728208, 735545, 744343, 754872, 767154, 780698, 795062, 810242, 826156, 842319]
58894H42319J6247J7054J8736K0463K1680K2705K3940K5260K6345K6875K6366
58883A087990K4515K1699J8405J4366R210L785m08l219o057r807j3666j6514j8307
58870A111992j9414j9556j8306j6166j4341j3533j3368j2952j1839j0574j0191
58859I51752j0968j1954j2195j1926j1945j2145j1715j0593r686r530r681r554
58847H19860q990p959o714o269p580r961j1416j0991r842r501r998j0383j0230
58834G00026r771r106q024o562n088l944l142k381j355k24M19L66K95R02J891
58819F54302K501K683K911L151L043K875L261L895L860L150K686K703K527K024
58805F95572J860J921J122o38j773j252j79j18r46j561j799k396l541m659n244
$$ y = [842319, 858566, 875620, 894356, 914819, 936499, 959204, 983144, 1008404, 1034749, 1061624, 1087990, 1112505, 1134204, 1152609, 1166975, 1176185, 1179970, 1179562, 1176343, 1170286, 1160479, 1146813, 1130299, 1111992, 1092578, 1073022, 1054716, 1038550, 1024209, 1010676, 997308, 984356, 972517, 961943, 951752, 940784, 928830, 916635, 904709, 892764, 880619, 868904, 858311, 848625, 839095, 829414, 819860, 810870, 802911, 796197, 789928, 782348, 772387, 760971, 749980, 740138, 730637, 720639, 710256, 700026, 690255, 681149, 673125, 666563, 661475, 657531, 654389, 652008, 650653, 650429, 650848, 651214, 651509, 652411, 654302, 656803, 659486, 662397, 665548, 668591, 671466, 674727, 678622, 682482, 685632, 688318, 691021, 693548, 695572, 697432, 699353, 700475, 699837, 698064, 696812, 696633, 696515, 695569, 694008, 692209, 689813, 686272, 681613, 676369]
58790F76369n148m371l249k406j982j367k14R74J738K433L385M081M052L834M151
58775F82280M677M606L906L099K114M07j993m407o309p530p881p365o566o079
58761F52959n775n186m376l647k667p96J678L447L595K564J539J247J570K040
58747F48192K467L051L862M528M731M920N860P432Q568Q668Q340Q318Q399Q080
58733G35416P664P868Q672R305R311Q966Q762Q818Q817Q274P050N755N250N630
58719H45558O129O265O453P153Q061Q631Q857Q901Q438P073N045K884O16k107
58705I27957n275q424j1124j3212j4742j6085j7785j9947k2010k3381k3922k3610
58693G28440k2219j9820j7099j4673j2437j0088p888o385n675n397n262n218n330
$$ y = [676369, 671221, 666850, 663601, 661195, 659213, 657846, 657632, 658606, 660344, 662777, 666162, 670243, 674295, 678129, 682280, 686957, 691563, 695469, 698568, 700682, 701089, 699096, 694689, 688380, 680850, 672969, 665604, 659038, 652959, 647184, 641998, 637622, 633975, 631308, 630512, 632190, 635637, 639232, 641796, 643335, 644582, 646152, 648192, 650659, 653710, 657572, 662100, 666831, 671751, 677611, 685043, 693611, 702279, 710619, 718937, 727336, 735416, 743080, 750948, 759620, 768925, 778236, 787202, 795964, 804782, 813599, 821873, 828923, 834678, 839928, 845558, 851687, 857952, 864405, 871558, 879619, 888250, 897107, 906008, 914446, 921519, 926564, 929448, 930064, 927957, 922682, 914258, 903134, 889922, 875180, 859095, 841310, 821363, 799353, 775972, 752050, 728440, 706221, 686401, 669302, 654629, 642192, 632104, 624216, 617831, 612156, 606759, 601497, 596279, 590949]
58680E90949n731o332o407n129k811r24k98l1J156L057M453M998N687P414R924
58665E99975J2350J4247J5780J7039J7455J6052J2515P786L256m83l609o074p585
58652F98704q504r682j1074j1580j0641r024p514n926m072k633k137j903j016
58639F12998L02J253J713K058K255K111J948K164K371J839M77j202k730l729l926
58624F19902l697m023n206o277o314n581m606l025l24K915N589P405Q605R061
58610F14424Q579P604O571N111K928Q40j87m73r61j668k040k239k703k907k052
58595F30827o69o1k95k10O84J734K631L928N840P849R660J1474J3041J3671J3401
58580G13505J3101J3141J2907J1925J0477Q943P405O166N785O262P019P883R330
$$ y = [590949, 585218, 578886, 572479, 567350, 564539, 563615, 563317, 563286, 564442, 567499, 571952, 576950, 582637, 590051, 599975, 612325, 626572, 642352, 659391, 676846, 692898, 705413, 713199, 716455, 715972, 712363, 706289, 698704, 690200, 680518, 669444, 657864, 647223, 638199, 630685, 624759, 620687, 618054, 615917, 614014, 612998, 613300, 614553, 616266, 618324, 620579, 622690, 624638, 626802, 629173, 631012, 631489, 630287, 627557, 623828, 619902, 616205, 612182, 606976, 600699, 594385, 588804, 584198, 581173, 580849, 583764, 589353, 596758, 605363, 614424, 623003, 630607, 637178, 642289, 645217, 646057, 645870, 645397, 644436, 642768, 640728, 638489, 635786, 632879, 630827, 630158, 630097, 629802, 629592, 630276, 632010, 634641, 638569, 644409, 652258, 661918, 673392, 686433, 700104, 713505, 726606, 739747, 752654, 764579, 775056, 783999, 791404, 797570, 803355, 809617, 816636, 824519, 833849]
58567H33849J1551J4043J6354J8597K1040K3658K6254K8415K9443K8829K6745
58556A078778K3599J9389J4142Q565L445j239n748r467j1404j1657j1332j1112
58544A085959j0898j0764j1216j2391j3925j5581j7353j8997k0233k1205k1966
58533I11430k1853k0294j7861j5533j3282j0542p649n469l882k020K4J177J129
58520G95375P64P95J108J540K040K063J027n72j696k332l238m280m578m311m620
58505G79085n536n710m659l585l331l075j931n56j61r22k097k956k979k007o45
58490G38935K52P74J734L155M158M593N465P290R238J0488J1316J2308J3527J4910
58476H38143J6404J7234J6195J3201R529O041K292k075o294r499j1687j3015j3111
$$ y = [833849, 845400, 859443, 875797, 894394, 915434, 939092, 965346, 993761, 1023204, 1052033, 1078778, 1102377, 1121766, 1135908, 1144473, 1147918, 1146679, 1140931, 1131464, 1120060, 1108403, 1097071, 1085959, 1075061, 1064297, 1053081, 1040690, 1026765, 1011184, 993831, 974834, 954601, 933396, 911430, 889577, 869283, 851422, 835889, 822607, 812065, 804416, 798947, 795065, 793045, 793069, 794246, 795375, 796139, 796934, 798042, 799582, 801622, 803685, 804712, 804140, 802444, 800112, 796874, 792594, 788016, 783705, 779085, 773549, 767839, 763180, 759595, 756264, 753189, 751258, 750702, 750541, 749619, 747522, 744566, 741587, 739580, 738935, 739187, 739961, 741695, 744850, 749008, 753601, 759066, 766356, 775594, 786082, 797398, 809706, 823233, 838143, 854547, 871781, 887976, 901177, 910706, 916747, 919039, 916964, 910670, 901171, 889484, 876469, 863358]
58463H63358j1833r818p679n389k947p05J394L919O876R422J1082J2179J2728
58450H82587J2005R773O806L706L47l090n728p285q486r567r597q040n820m005
58436H53606k562j198k66Q6O80K188M086N519O473P332Q166R080J0367J1667J1943
58421I27167J0928R592Q518O877L872J81k954n126o530p156p165p168p433p519
58407I16084p269p253p630p629o851n933n240m065k010k1R51J324J933K687L120
58392H72198L357L545L217K189J231R46Q69N75P28J959L528M197L859L316L132
58377I08846L450M294N262N643N481N731O700P372P048O601P123Q322R269R950
58363A001092J0917J2056J2725J2722J2330J1845J1517J1366J0720Q744N847L548
$$ y = [863358, 851525, 841707, 834028, 828639, 825692, 824987, 826381, 830300, 837176, 846598, 857680, 869859, 882587, 894592, 904365, 911171, 914877, 915224, 912134, 906406, 899121, 890635, 881068, 871471, 863431, 857611, 853606, 851044, 849846, 849580, 849666, 850346, 852534, 856620, 862139, 868612, 875944, 884110, 893190, 903557, 915224, 927167, 938095, 947687, 956205, 963082, 966954, 967135, 964181, 959055, 952525, 945369, 938204, 931036, 923603, 916084, 908815, 901562, 893932, 886303, 879452, 873519, 868279, 864214, 862204, 862183, 863134, 864458, 866391, 869078, 872198, 875555, 879100, 882317, 884506, 885737, 886683, 887552, 888127, 888855, 890814, 894342, 898539, 902398, 905714, 908846, 912296, 916590, 921852, 927495, 932976, 938707, 945407, 952779, 959827, 966428, 973551, 981873, 991142, 1001092, 1012009, 1024065, 1036790, 1049512, 1061842, 1073687, 1085204, 1096570, 1107290, 1116034, 1121881, 1125429]
58351A125429K572K114J453J053J481K426L488M756O074O871P330Q445J0308J1811
58337A195611J2648J4033J6575J8974J9837J9425J8658J7712J6554J5486J4251
58326A379764J1940Q627N709L892K370Q13L47J579L338M512N466O663P566P957
58312A450543Q645R835J0622J1056J2623J5510J7584J7527J6857J7308J8326J8786
58300A625222J9067J9675J9784J8940J8285J8415J8066J6663J5996J7400J9400
58289A826913K0265K0820K2589K5036K6856K8145K9302K9652K9135K9323L0837
58278B118873L1975L1829L2329L4931L7913L9410M0615M3242M6292M8242N0061
58267B555712N3164N6471N8460O0005O2329O4448O5355O6354O8427O9741O8792
$$ y = [1125429, 1128001, 1130115, 1131568, 1132621, 1134102, 1136528, 1140016, 1144772, 1150846, 1157717, 1165047, 1173492, 1183800, 1195611, 1208259, 1222292, 1238867, 1257841, 1277678, 1297103, 1315761, 1333473, 1350027, 1365513, 1379764, 1391704, 1400331, 1406040, 1409932, 1412302, 1413115, 1413462, 1415041, 1418379, 1422891, 1428357, 1435020, 1442586, 1450543, 1459188, 1469023, 1479645, 1490701, 1503324, 1518834, 1536418, 1553945, 1570802, 1588110, 1606436, 1625222, 1644289, 1663964, 1683748, 1702688, 1720973, 1739388, 1757454, 1774117, 1790113, 1807513, 1826913, 1847178, 1867998, 1890587, 1915623, 1942479, 1970624, 1999926, 2029578, 2058713, 2088036, 2118873, 2150848, 2182677, 2215006, 2249937, 2287850, 2327260, 2367875, 2411117, 2457409, 2505651, 2555712, 2608876, 2665347, 2723807, 2783812, 2846141, 2910589, 2975944, 3042298, 3110725, 3180466, 3249258]
58256C249258O7331O7220O7150O5748O4985O7028P0666P4274P9249Q6694R4007
58245D053610R8897J03524J10446J17766J22899J27681J34945J43249J50142J57284
58235E320443J67103J77723J86721J96540K10381K26093K40109K53981K70924
58226G250018K89441L06933L25915L49881L76810M03808M34045M71553N13569
58217A0721973N56069O02416O57897P20626P87225Q62426R52870J056748J170419
58208A8088669J299760J453389J631286J833536K073782K369627K727753L155800
58200C4633602L681352M340493N156949O154898P381845Q893133J0731014J2961820
58192I3935106J5725715J9197192K3486257K8598805L4401715M0382972M5259290
$$ y = [3249258, 3316589, 3383809, 3450959, 3516707, 3581692, 3648720, 3719386, 3793660, 3872909, 3959603, 4053610, 4152507, 4256031, 4366477, 4484243, 4607142, 4734823, 4869768, 5013017, 5163159, 5320443, 5487546, 5665269, 5851990, 6048530, 6258911, 6485004, 6725113, 6979094, 7250018, 7539459, 7846392, 8172307, 8522188, 8898998, 9302806, 9736851, 10208404, 10721973, 11278042, 11880458, 12538355, 13258981, 14046206, 14908632, 15861502, 16918250, 18088669, 19388429, 20841818, 22473104, 24306640, 26380422, 28750049, 31477802, 34633602, 38314954, 42655447, 47812396, 53967294, 61349139, 70242272, 80973286, 93935106, 109660821, 128858013, 152344270, 180943075, 215344790, 255727762, 300987052]
58185C00987052M6929960M3214516L3106301J7659668j96665j6843197k9417211
58178C95440424l6720627l9213532l8299618l5474753l1828334k7981089k4228967
58171A61693504k0686363j7390131j4369369j1653581r248352p167947n514162
58164G5663599m460231m087953m245962m609812m886380m948849m809419m526198
58156C9088795m153041l734292l304638k888327k504352k167120j879749j635083
58148A6822193j426526j251546j104890r77705q65565p69965o90480o22257n62230
58139H551029n11103m68128m29979l95516l66111l40793l16361k92429k71157
58130E159452k52246k33217k14328j97987j83722j68907j54146j42795j35314
$$ y = [300987052, 347917012, 391131528, 424237829, 441897497, 441700832, 424857635, 395440424, 358719797, 319506265, 281206647, 245731894, 213903560, 185922471, 161693504, 141007141, 123617010, 109247641, 97594060, 88345708, 81177761, 75663599, 71203368, 67115415, 62869453, 58259641, 53373261, 48424412, 43614993, 39088795, 34935754, 31201462, 27896824, 25008497, 22504145, 20337025, 18457276, 16822193, 15395667, 14144121, 13039231, 12061526, 11195961, 10425996, 9735516, 9113259, 8551029, 8039926, 7571798, 7141819, 6746303, 6380192, 6039399, 5723038, 5430609, 5159452, 4907206, 4673989, 4459661, 4261674, 4077952, 3909045, 3754899, 3612104, 3476790]
58121C476790j29019j23118j19061j16155j11798j06042j01212r7179r1628q4935
58111B396643p9880p6558p2315o6953o3171o1412n8967n4938n1611m9899m7693
58100A713246m3970m0736l9463l8981l8074l7193l6516l5085l2838l0922k9401
58089A310067k7092k4109k1974k0847j9306j7237j6240j6772j7447j7643j8301
58078A093099j9684k0737k1098k1585k2299k2390k1822k1376k0834j9317j7322
58067H64635j6237j5900j4885j3076j1660j0676r022o834n513n377n489n746o773
58054G37447p971q139p859q688j0146j0160q613p575p812p820o822n999o136o368
58040F27339o121n998o189o025n637n984o855o878n929n446n982o523o647p204
$$ y = [3476790, 3347771, 3224653, 3105592, 2989437, 2877639, 2771597, 2670385, 2573206, 2481578, 2396643, 2316763, 2240205, 2167890, 2100937, 2037766, 1976354, 1917387, 1862449, 1810838, 1760939, 1713246, 1669276, 1628540, 1589077, 1550096, 1512022, 1474829, 1438313, 1403228, 1370390, 1339468, 1310067, 1282975, 1258866, 1236892, 1216045, 1196739, 1179502, 1163262, 1146490, 1129043, 1111400, 1093099, 1073415, 1052678, 1031580, 1009995, 987696, 965306, 943484, 922108, 901274, 881957, 864635, 848398, 832498, 817613, 804537, 792877, 782201, 773179, 766345, 760832, 755455, 749966, 744220, 737447, 729476, 721337, 713478, 704790, 694644, 684484, 675871, 668296, 660484, 652664, 645842, 639843, 633707, 627339, 621218, 615220, 609031, 603006, 597369, 591385, 584530, 577652, 571723, 566277, 560295, 553772, 547125, 539921]
58026E39921q386r147r016q576p934o683n598o009p248p047n005l267l158l508
58012D49339l154k760l071l371k874k042j517j156q00o35l92L15P09k81j797j760
57996D24753l3J253R91M01N33Q49J008J708K779K722J207j37m38r23k371l529
57980D30773l460l308m221n333n532n403n784n885m696k909j801j340r34r06j670
57965C77591k365j924o83K80P05Q64O29m6m67j18M00K72m49j329k300l108l057
57948C64895k065j067n91j9J047J835J690J254J419K127L016M238N797P147Q162
57933C98885R434J0882J1433J0861J0466J0868J0661Q589N666L664K665J675O23
57920D96372N5l00j084k002k385k564l344m563n356n447n120m429l472k934l295
$$ y = [539921, 531535, 522388, 513372, 504796, 496862, 490179, 484581, 478572, 471324, 464277, 459272, 456005, 452847, 449339, 446185, 443425, 440354, 436983, 434109, 432067, 430550, 429394, 428594, 427959, 427567, 427882, 428591, 428310, 426513, 424753, 424720, 425973, 426964, 427365, 427898, 428747, 429755, 431463, 434242, 436964, 438171, 438034, 437596, 436673, 434302, 430773, 427313, 424005, 419784, 414451, 408919, 403516, 397732, 391847, 387151, 384242, 382441, 381101, 380167, 379261, 377591, 375226, 373302, 372619, 372899, 373604, 374468, 375097, 375051, 374584, 374466, 374866, 375138, 374689, 373360, 371060, 367952, 364895, 362830, 361763, 361172, 361153, 362200, 364035, 365725, 366979, 368398, 370525, 373541, 377779, 383576, 390723, 398885, 408319, 419201, 430634, 441495, 451961, 462829, 473490, 482079, 487745, 491409, 494074, 495749, 496372, 496427, 496127, 495043, 493041, 490656, 488092, 484748, 480185, 474829, 469382, 464262, 459833, 456361, 453427, 450132]
57905D50132m016m404m687n362o182o724p224p868q013p194o118n542m980l705
57891C68113k297j798j967j733r23k03K53P73J276J530J955K917L702L386K358
57876C77342J682J386P59k9q2N22P08J33m09m03j99l8L04O38L15o16j212r72m47
57857C79382j09M36J608K874L301K718J837J376J326J056J37j004j408o97M14
57842C93247R07L81r40k547l731l971l645l774m571n049m551l824l730l828l316
57827C47058k597k574k905k464j222k73J1L98J169J499Q99J25KK80K73j4j03R7
57809C39659K11o8p16j490k035k145k012k008k176k236k057j867j912k152k348
57794C14648k204j512l80P53J537K026K368K504K424K448K844L325L413L163L082
$$ y = [450132, 446116, 441712, 437025, 431663, 425481, 418757, 411533, 403665, 395652, 388458, 382340, 376798, 371818, 368113, 365816, 364018, 362051, 360318, 359395, 359192, 359445, 360218, 361494, 363024, 364979, 367896, 371598, 374984, 377342, 379024, 380410, 381169, 381140, 381058, 381580, 382288, 382421, 382012, 381609, 381410, 381372, 381676, 382314, 382629, 382013, 380801, 379829, 379382, 379273, 379709, 381317, 384191, 387492, 390210, 392047, 393423, 394749, 395805, 395942, 394938, 393530, 392833, 393247, 394154, 394535, 393595, 391048, 387317, 383346, 379701, 375927, 371356, 366307, 361756, 357932, 354202, 350374, 347058, 344461, 341887, 338982, 336518, 335296, 335023, 335034, 335432, 336601, 338100, 338999, 339124, 339126, 339406, 339679, 339665, 339562, 339659, 339870, 339802, 339086, 337596, 335561, 333416, 331404, 329396, 327220, 324984, 322927, 321060, 319148, 316996, 314648, 312444, 310932, 310552, 311305, 312842, 314868, 317236, 319740, 322164, 324612, 327456, 330781, 334194, 337357, 340439]
57779C40439L448M058M524M533L915K907K154K108K498K759K803K904L003K645
57765C84698J729Q22M71M71P0j062k348k902k614k215k229k216j450j5J304J914
57749C74428J675M83j547l758n513o904q092q309o728m177k504k163j875j040
57735C23976p22j625k718k876k501k367k126j255m15m64r63j006p58r52j480j725
57719C00023j718j752j535r02o74j524k630k769k171j969k384k827l237l818l988
57704B66125l186k263k448l252l093j811p87p33j054j380j908k173j317J14N16
57689B41350k88o29L68J490J564J198J363J722J549J296K073M206P195J0550J4036
57674B89043J7690K1944K7052L2110L5554L7038L7841L9015M0151M0483M0110
$$ y = [340439, 343887, 347945, 352469, 357002, 360917, 363824, 365978, 368086, 370584, 373343, 376146, 379050, 382053, 384698, 386427, 387249, 387720, 388191, 388261, 387199, 384851, 381949, 379335, 377120, 374891, 372675, 371225, 371210, 372514, 374428, 376103, 376586, 375039, 371281, 365768, 358864, 350772, 342463, 335735, 331558, 329054, 326891, 325016, 323976, 323254, 321629, 318911, 316035, 313534, 311167, 309041, 307786, 307371, 306907, 305944, 304938, 304180, 303228, 301748, 300023, 298305, 296553, 295018, 294116, 293442, 291918, 289288, 286519, 284348, 282379, 279995, 277168, 273931, 270113, 266125, 262939, 260676, 258228, 254976, 251883, 250072, 249285, 248552, 247498, 246118, 244210, 242037, 240720, 240834, 241350, 241062, 240433, 240801, 242291, 243855, 245053, 246416, 248138, 249687, 250983, 253056, 257262, 264457, 275007, 289043, 306733, 328677, 355729, 387839, 423393, 460431, 498272, 537287, 577438, 617921, 658031]
57663F58031L9427L8339L6649L4098K9203J9364L639j5126l2091m4127n1050n3983
57651F62373n3853n1353m7197m1970l6196l0523k5474k1119j7358j4313j2105
57640C10912j0505r150p927o777n507m115l030k548k335j885j309j233j880k616
57626B50095k495j225L99J164O60l09p83p98j000j447j577j226q85q29p78o23
57610B38343p08j128j466j534j692k077k205j710r66n25m22m04l86l41j65Q1J27
57593B22822j42o37j403k410l062k708j758j424k083k794k750k342k215k199j844
57578A93051j352j201j381j589j803k046k072j754j413j284j139q20o09o47n53
57563A73388j77j08p63j484j307k98N60O25J44l00m24l53m17p27q92m67K70O02
$$ y = [658031, 697458, 735797, 772446, 806544, 835747, 855111, 858750, 843624, 811533, 767406, 716356, 662373, 608520, 557167, 509970, 468000, 431804, 401281, 375807, 354688, 337330, 323017, 310912, 300407, 291257, 283330, 276553, 271046, 266931, 263901, 261353, 259018, 257133, 255824, 254591, 252711, 250095, 247600, 246375, 246774, 247938, 248598, 248289, 247506, 246708, 245708, 244261, 242684, 241458, 240573, 239744, 238966, 238343, 237635, 236507, 235041, 233507, 231815, 229738, 227533, 225823, 224857, 224332, 223910, 223506, 223120, 222779, 222614, 222695, 222822, 222680, 222043, 220640, 218230, 215168, 212460, 210702, 209278, 207195, 204401, 201651, 199309, 197094, 194895, 193051, 191699, 190498, 189117, 187528, 185725, 183679, 181607, 179853, 178440, 177156, 176017, 175197, 174588, 173941, 173388, 173211, 173103, 172340, 170856, 169549, 169251, 169811, 170436, 170580, 170280, 169856, 169503, 169086, 168359, 167467, 167000, 167270, 167872]
57545A67872M95P16J559K297K324K082K183K436K416K339K549K650K057R96J64
57530A95135l29q92j595k079k183k046j758j426j311j416j289p51l85p00j233
57515A75742j161m67K26O57J009J226J131J013J409K256K914K990K623K036J348
57500A94952O75k4j013k177k777k334j469j125j244j047l78M5k23q34j299j455
57484A78273j261p98n49r89j701j637n01O91Q11m8q41q83n03m26q19j096p24L2
57466A67031M72M04L09N22Q20J016J307J648J505P73L17Q90J955K351J789R38
57450A84047L78K08M62J118J786K064K044J917J381J51j217j837j567r08mJ270
57434A91293K466K797K278J732J603J569J421J420J577J427P96J27k05k72j16
$$ y = [167872, 168367, 169083, 170642, 172939, 175263, 177345, 179528, 181964, 184380, 186719, 189268, 191918, 193975, 194971, 195135, 194806, 193914, 192319, 190240, 188057, 186011, 184253, 182827, 181516, 180100, 178811, 178060, 177675, 176975, 175742, 174581, 174114, 174340, 174997, 176006, 177232, 178363, 179376, 180785, 183041, 185955, 188945, 191568, 193604, 194952, 195627, 195603, 194590, 192413, 189636, 187302, 185833, 184708, 183464, 182417, 182039, 182084, 181861, 181027, 179728, 178273, 177012, 176214, 175665, 174676, 172975, 171338, 170837, 171528, 172339, 172291, 171450, 170567, 170064, 169638, 168819, 167723, 166999, 167031, 167503, 167907, 168216, 168738, 169558, 170574, 171881, 173529, 175034, 175807, 176124, 177014, 178969, 181320, 183109, 184047, 184425, 184633, 185095, 186213, 187999, 190063, 192107, 194024, 195405, 195556, 194339, 192502, 190935, 190027, 190023, 191293, 193759, 196556, 198834, 200566, 202169, 203738, 205159, 206579, 208156, 209583, 210379, 210506, 210301, 210029, 209913]
57419B09913M53J286J756J518R37N84O38R06J058Q07K23j99j97j14j08N30K289
57402B22280M046M065K406J020J172K023K252J829J460J316J255J467J997K279
57388B50867J909J425J535J980K019J619J398J635K136K812L699M506M738M256
57374B86534L313K165J092N53Q25J564K132K271K159K068K264K957L841M050L117
57359C20905J825J415K145L142L640L659L484L188K922L126L995N079N717N693
57345C69935N289M922M900N261N651N520M730L842L460L462L200K519K139K755
57331D27585M057N046N215M930M721M658M672M955N609O198O095N267M310L806
57317D97124L970M763N907O836P036O600O088N845N725N526N338N375N710O290
$$ y = [209913, 210366, 211652, 213408, 214926, 215863, 216447, 217085, 217991, 219049, 219856, 220079, 219880, 219683, 219569, 219461, 219991, 222280, 226326, 230391, 232797, 233817, 234989, 237012, 239264, 241093, 242553, 243869, 245124, 246591, 248588, 250867, 252776, 254201, 255736, 257716, 259735, 261354, 262752, 264387, 266523, 269335, 273034, 277540, 282278, 286534, 289847, 292012, 293104, 293657, 294482, 296046, 298178, 300449, 302608, 304676, 306940, 309897, 313738, 317788, 320905, 322730, 324145, 326290, 329432, 333072, 336731, 340215, 343403, 346325, 349451, 353446, 358525, 364242, 369935, 375224, 380146, 385046, 390307, 395958, 401478, 406208, 410050, 413510, 416972, 420172, 422691, 424830, 427585, 431642, 436688, 441903, 446833, 451554, 456212, 460884, 465839, 471448, 477646, 483741, 489008, 493318, 497124, 501094, 505857, 511764, 518600, 525636, 532236, 538324, 544169, 549894, 555420, 560758, 566133, 571843, 578133]
57303E78133O939P358P355P059O772O616O657P073P864Q507Q451P906P647P986
57289F82323Q470Q632Q533Q451Q513Q775R189R438R275R095R521J0429J1002J1013
57275H12659J1199J2064J3144J3914J4719J6001J7237J7534J6936J6307J6057
57264I77771J5836J5451J5344J5918J6955J7859J8205J7971J7540J7476J7951
57253A164277J8462J8435J8054J8023J8513J8891J8685J8293J8373J8857J9046
57242A367909J8560J7776J7294J7371J7924J8752J9536J9898J9812J9828K0464
57231A575124K1518K2376K2992K3973K5498K6864K7497K7810K8418K9075K9111
57220A860256K8620K8259K8148K7898K7646K7984K8721K8871K8255K8019K8955
$$ y = [578133, 585072, 592430, 599785, 606844, 613616, 620232, 626889, 633962, 641826, 650333, 658784, 666690, 674337, 682323, 690793, 699425, 707958, 716409, 724922, 733697, 742886, 752324, 761599, 770694, 780215, 790644, 801646, 812659, 823858, 835922, 849066, 862980, 877699, 893700, 910937, 928471, 945407, 961714, 977771, 993607, 1009058, 1024402, 1040320, 1057275, 1075134, 1093339, 1111310, 1128850, 1146326, 1164277, 1182739, 1201174, 1219228, 1237251, 1255764, 1274655, 1293340, 1311633, 1330006, 1348863, 1367909, 1386469, 1404245, 1421539, 1438910, 1456834, 1475586, 1495122, 1515020, 1534832, 1554660, 1575124, 1596642, 1619018, 1642010, 1665983, 1691481, 1718345, 1745842, 1773652, 1802070, 1831145, 1860256, 1888876, 1917135, 1945283, 1973181, 2000827, 2028811, 2057532, 2086403, 2114658, 2142677, 2171632]
57209B171632L0294L1028L1596L3130L5545L7566L8587L9369M0698M2190M2936
57198B574571M2819M2676M3197M4081M4398M3680M2447M1477M0857M0156L9334
57187C039693L8823L8584L7817L6077L4077L2831L2357L1864L0934K9925K9275
57176C412257K8977K8814K8700K8706K8882K9140K9246K9061K8776K8599K8273
57165C729431K7392K6255K5698K5847K5759K4783K3518K2789K2402K1746K1096
57154C996716K1206K1998K2724K3289K4290K5678K6596K6798K7203K8628L0771
57143D275897L2976L5133L7182L8399L8050L6489L4771L3278L1299K8047K3574
57132D645095J8569J3685R417O369N135N800P863J0920J5211K1127K8328L5911
$$ y = [2171632, 2201926, 2232954, 2264550, 2297680, 2333225, 2370791, 2409378, 2448747, 2489445, 2531635, 2574571, 2617390, 2660066, 2703263, 2747344, 2791742, 2835422, 2877869, 2919346, 2960203, 3000359, 3039693, 3078516, 3117100, 3154917, 3190994, 3225071, 3257902, 3290259, 3322123, 3353057, 3382982, 3412257, 3441234, 3470048, 3498748, 3527454, 3556336, 3585476, 3614722, 3643783, 3672559, 3701158, 3729431, 3756823, 3783078, 3808776, 3834623, 3860382, 3885165, 3908683, 3931472, 3953874, 3975620, 3996716, 4017922, 4039920, 4062644, 4085933, 4110223, 4135901, 4162497, 4189295, 4216498, 4245126, 4275897, 4308873, 4344006, 4381188, 4419587, 4457637, 4494126, 4528897, 4562175, 4593474, 4621521, 4645095, 4663664, 4677349, 4686766, 4693135, 4698270, 4704070, 4711933, 4722853, 4738064, 4759191, 4787519, 4823430]
57120D823430M3458N1229N9109O6136P1633P6279Q1381Q7665R5528J05997J20373
57109E682218J39132J62184J90081K23865K63825L09748L62952M27119N06778
57100H267902O06186P30294Q85867J080602J321673J615467J967456K380561K853101
57091B1709109L377999L942659M528559N111596N663568O152994O545394O806689
57083F3838567O909281O832064O550228O028982N240560M198922K977941J687784
57075A04264329M25918p55592j845242k846216l756428m563102n244565n774252
57067G9904850o128244o294688o278939o101844n794553n393299m934370m449591
57059C4529322l964408l498509l066223k675502k327880k021009j751754j517315
$$ y = [4823430, 4866888, 4918117, 4977226, 5043362, 5114995, 5191274, 5272655, 5360320, 5455848, 5561845, 5682218, 5821350, 5983534, 6173615, 6397480, 6661305, 6971053, 7334005, 7761124, 8267902, 8874088, 9604382, 10490249, 11570851, 12892524, 14507991, 16475447, 18856008, 21709109, 25087108, 29029767, 33558326, 38669922, 44333490, 50486484, 57031878, 63838567, 70747848, 77579912, 84130140, 90159122, 95399682, 99598604, 102576545, 104264329, 104690247, 103934655, 102089413, 99243197, 95486769, 90923667, 85679102, 79904850, 73776606, 67481918, 61202979, 55101135, 49306582, 43913283, 38978913, 34529322, 30564914, 27066405, 24000182, 21324680, 18996800, 16975791, 15224037, 13706722]
57051A3706722j314902j141569r94292q69725p64242o74603n98398n33471m77474
57042F338046m28432l85335l47653l14520k84868k58018k33639k11358j90829
57033C683394j71895j54266j37451j21485j07273r5526q5618p6150o6511n7134
57023B610085m8349l9866l1578k4333j9560j8206j9806k2168k2271j8085r574
57012B336289K540J8122L6034N0791N2869L4910j469m5515q4438j10938j24872
57001B164323j29500j27565j20629j10340r8824q7617p7089o7137n7974m9897
56991A237751m2768l6192l0035k4322j8821j3120p092j081M188P644Q124N024
56979A089300j219r435j8201k5953l1185l3214l2615l0505k7581k4137k0605j7367
$$ y = [13706722, 12391820, 11250251, 10255959, 9386234, 8621992, 7947389, 7348991, 6815520, 6338046, 5909614, 5524279, 5176626, 4862106, 4577238, 4319220, 4085581, 3874223, 3683394, 3511499, 3357233, 3219782, 3098297, 2991024, 2895498, 2809880, 2733730, 2667219, 2610085, 2561736, 2521870, 2490292, 2465959, 2446399, 2428193, 2408387, 2386219, 2363948, 2345863, 2336289, 2338829, 2356951, 2392985, 2443776, 2496645, 2531555, 2530086, 2484571, 2400133, 2289195, 2164323, 2034823, 1907258, 1786629, 1676289, 1577465, 1489848, 1412759, 1345622, 1287648, 1237751, 1194983, 1158791, 1128756, 1104434, 1085613, 1072493, 1065401, 1064320, 1068508, 1076152, 1084276, 1089300, 1088081, 1078646, 1060445, 1034492, 1003307, 970093, 937478, 906973, 879392, 855255, 834650, 817283]
56967H17283j4306j1167q216n817l501k37M305R508J4820K0218K5357K8945K9422
56954I06614K5878J8158O770o774j9890k9926l5469l6801l5263l2207k8280k3533
56942G09277j8233j3259r426o547l707k92L771Q623J4603K1609K9010L6121M2011
56929H13561M4638M1225L0406J3810m802k1734l4633m2514m5541m4823m1897l8072
56917F69624l4085l0064k5784k1302j7405j4956j3730j2462j0361q003o388n700
56905D69384n432n197m810m056l003k234k058j748l35K040M313N984P597R570
56891D70015J1436J2748J4079J6444J9909K3433K5949K6955K5918K1815J4028
56880F82729L651o701j4592j9141k0838k0547j9041j6870j4146j0517n898j013
$$ y = [817283, 802977, 791810, 783594, 777777, 774276, 774039, 778344, 787852, 802672, 822890, 848247, 877192, 906614, 932492, 950650, 957420, 950646, 930756, 900830, 865361, 828560, 793297, 761090, 732810, 709277, 691044, 677785, 668359, 661812, 658105, 657813, 661584, 670207, 684810, 706419, 735429, 771550, 813561, 858199, 899424, 929830, 943640, 938838, 917104, 882471, 839957, 794416, 749593, 707696, 669624, 635539, 605475, 579691, 558389, 540984, 526028, 512298, 499836, 489475, 481472, 475084, 469384, 463952, 458755, 453945, 449889, 446886, 444652, 442594, 440846, 440511, 442551, 446864, 452848, 460445, 470015, 481451, 494199, 508278, 524722, 544631, 568064, 594013, 620968, 646886, 668701, 682729, 686380, 679679, 665087, 645946, 625108, 604561, 585520, 568650, 554504, 543987, 538089, 537076]
56868E37076L231O861J0789J5703K1598K8338L5995M4353N2607N9626O3927O3171
56856I43275N4735L7751J4670r585l0125m4026n0704n1328m7804m1877l4727k7096
56844G13159j9349j1428l191N075J2990K1004L0417M2093N5648P0087Q4510R7389
56832A098404J05565J04773R1569O5163K8385j2432m9319p6091r0805r5253r2482
56821A077477q5073p4992o3753n2276m0986l0235k0279j0927j614Q100J8444K9630
56809G53516M1678N3967O5153P3299P5668O8992N1297K4180p103l6213n8532p2039
56797A033863p6840p4724o8577o1064n3332m5178l6384k7594j9817j3470q088
56786E48795k801L123R989J7577K5196L1941L6897L8885L6234K7523J3143m022
$$ y = [537076, 540307, 547168, 557957, 573660, 595258, 623596, 659591, 703944, 756551, 816177, 880104, 943275, 998010, 1035761, 1050431, 1040846, 1010721, 966695, 915991, 864663, 816859, 774982, 740255, 713159, 693810, 682382, 679191, 684266, 697256, 718260, 748677, 790770, 846418, 916505, 1001015, 1098404, 1203969, 1308742, 1400311, 1465474, 1493859, 1481427, 1432108, 1356017, 1265212, 1169959, 1077477, 992404, 917412, 853659, 801383, 760397, 730162, 709883, 698956, 697342, 705442, 723886, 753516, 795194, 849161, 914314, 987613, 1063281, 1132273, 1183570, 1207750, 1200647, 1164434, 1105902, 1033863, 957023, 882299, 813722, 752658, 699326, 654148, 617764, 590170, 570353, 556883, 548795, 545994, 549117, 559106, 576683, 601879, 633820, 670717, 709602, 745836, 773359, 786502, 782480]
56774G82480k0068l2379m0340m4295m4699m2395l8798l5051l1294k7240k3132
56763D02789j9584j6747j4197j1689r495p926o940o329n990n871n783n470m769
56750B81999l749k748k178k127k234k113j798j614j654j641j356r94r25j156j211
56735B54501o86J55N79K48l61o34n82n95o58m17R8L89K44J1l9o2j46j3M73R56
56715B53461J058R03P86P92R30J244J451J035P6n11r6P23R53N48K41L40M53L26
56697B64713J89J64j6n15j122j613j973k180k116j820j481j115n33K14P00O66
56681B52162L78K18O9n17j479j948j141N64J870K018J534J265J209R06N42P68
56665B58418J493J945J999K469L631M434L861K429J517J713K457K996K996K555
$$ y = [782480, 762412, 730033, 689693, 645398, 600699, 558304, 519506, 484455, 453161, 425921, 402789, 383205, 366458, 352261, 340572, 331077, 323151, 316211, 309882, 303892, 298021, 292238, 286768, 281999, 278250, 275502, 273324, 271197, 268963, 266850, 265052, 263438, 261784, 260143, 258787, 257793, 256868, 255712, 254501, 253815, 253970, 254549, 254797, 254436, 253802, 253220, 252625, 251967, 251550, 251648, 252037, 252281, 252292, 252253, 252191, 252045, 252032, 252505, 253461, 254519, 255422, 256208, 257000, 257930, 259174, 260625, 261660, 261736, 261225, 261129, 261852, 262805, 263353, 263594, 263934, 264387, 264713, 264902, 265066, 265050, 264535, 263413, 261800, 259827, 257647, 255531, 253711, 252230, 251115, 250582, 250796, 251496, 252162, 252540, 252758, 252827, 252310, 250831, 248883, 247742, 248306, 250176, 252194, 253728, 254993, 256202, 257108, 257650, 258418, 259911, 261856, 263855, 266324, 269955, 274389, 278250, 280679, 282196, 283909, 286366, 289362, 292358, 294913]
56651B94913K139K316L119L864L954L529K981K358J698J373J529J611J103L15
56637C26802j81n40j324k532l629m266m460m292m004m093m721n299n245m750m335
56622B73131m032l646l281l008k511j805j677k535l468l377k541j956j712j217
56608B36365o36o48r96o80L96J221J231Q88O57N08N24Q98J256J036N77O64J070
56591B44331Q21j9k95K74O00J46j23N93J648K094J977J729J295O97N10R45J283
56574B58506R83N41M95M51lk89L18J470K318K772L235L571L322K680K363K647
56558B85380L190L674M093M573N272O262P094O936N562L829K716K245J821J249
56544C43896Q20O76O33N09K35k02o19o95m04j89m88j274k179k816k893k422j863
$$ y = [294913, 297052, 299368, 302487, 306351, 310305, 313834, 316815, 319173, 320871, 322244, 323773, 325384, 326487, 326802, 326621, 326081, 324757, 322225, 318596, 314330, 309870, 305578, 301574, 297481, 292760, 287461, 282216, 277466, 273131, 269099, 265453, 262172, 259164, 256653, 254848, 253171, 250636, 247168, 243791, 241250, 239294, 237582, 236365, 235729, 235081, 234085, 233405, 233801, 235022, 236253, 237141, 237798, 238306, 238830, 239728, 240984, 242020, 242597, 243261, 244331, 245152, 245133, 244838, 245112, 245712, 245858, 245735, 246328, 247976, 250070, 252047, 253776, 255071, 255768, 256278, 257223, 258506, 259489, 260030, 260525, 260976, 260973, 260684, 261002, 262472, 264790, 267562, 270797, 274368, 277690, 280370, 282733, 285380, 288570, 292244, 296337, 300910, 306182, 312444, 319538, 326474, 332036, 335865, 338581, 340826, 342647, 343896, 344716, 345392, 346025, 346534, 346769, 346567, 345948, 345253, 344849, 344660, 344172, 342898, 340719, 337903, 335010, 332588, 330725]
56527C30725j734k101k764l703m751n198m581l715l760m407m174k693j317j117
56513B84710j548j725j651j530j095l92j83o10o58K03R15N32j00L35J518K073
56497B80794J660J094P90M73J33O3R3j91o15p22o85j001j502j536r94l60K4P4
56479B77592l41j040j260n74L45O38N72J008J949K506K119R81m13j399j281j31
56463B81271R34J080Q25R57J112N76k25l92k15o11j221p68P24J710J315L83p2
56446B87383r3NL94J121J609J398P37Q2l49l72Q3N55M21j55l43J52P67R90Q63
56427B95248N44J46P9O64J434J578J104P18O03L89K06O16J356J417O31oL7J00
56409C06864k91n09J8P79J104J198J447J584J338J231J792K553K689K220J734
$$ y = [330725, 328991, 326890, 324126, 320423, 315672, 310474, 305893, 302178, 298418, 294011, 289837, 287144, 285827, 284710, 283162, 281437, 279786, 278256, 277161, 276769, 276586, 275976, 275318, 275521, 276436, 276968, 276868, 277203, 278721, 280794, 282454, 283548, 284338, 284811, 284944, 285007, 285100, 284909, 284294, 283572, 282887, 281886, 280384, 278848, 277854, 277494, 277518, 277592, 277251, 276211, 274951, 274377, 274722, 275360, 275932, 276940, 278889, 281395, 283514, 284495, 284082, 282683, 281402, 281271, 282205, 283285, 284110, 285067, 286179, 286755, 286530, 286138, 285923, 285312, 284091, 283323, 284047, 285757, 287072, 287455, 287383, 287290, 287295, 287689, 288810, 290419, 291817, 292554, 292636, 292287, 291915, 291998, 292553, 292974, 292819, 292476, 292628, 293395, 294385, 295248, 295792, 295938, 296017, 296681, 298115, 299693, 300797, 301515, 302118, 302507, 302713, 303329, 304685, 306102, 306733, 306727, 306764, 306864, 306573, 306064, 306082, 306861, 307965, 309163, 310610, 312194, 313532, 314763, 316555, 319108, 321797, 324017, 325751]
56394C25751J282M33p41j517j469j043j028j757k874l812m472n311o626p963q546
56379B80307q121o901m934k317K23J843K741L805M987N234M329L633M179N104
56365B94112M912L578K289J688J457J325J381J454J162O72O37J153J470J024K00
56350C18514k11Q1P69J429J778J704J374J209J490K003K272K122J801J610J662
56335C39607K070K954L974M284L408J994J115R10O29n0n04k62K31M16N11R79J649
56318C63915J968J831J571J477J773K640L759M258L666K534J656J151Q44R34J538
56303C95515K180K468K772L471M097M115L952M265M713M573M058L872L911L660
56289D47622L462M029M962N155M586M241M432M529M467M944N984O727O894P102
$$ y = [325751, 327033, 327466, 326725, 325208, 323739, 322696, 321668, 319911, 317037, 313225, 308753, 303442, 296816, 288853, 280307, 272186, 265285, 260351, 258034, 258257, 260100, 262841, 266646, 271633, 276867, 281196, 284829, 289008, 294112, 299024, 302602, 304891, 306579, 308036, 309361, 310742, 312196, 313358, 314030, 314667, 315820, 317290, 318314, 318514, 318303, 318384, 319153, 320582, 322360, 324064, 325438, 326647, 328137, 330140, 332412, 334534, 336335, 337945, 339607, 341677, 344631, 348605, 352889, 356297, 358291, 359406, 360316, 360945, 360895, 360391, 360129, 360360, 360776, 361287, 362266, 363915, 365883, 367714, 369285, 370762, 372535, 375175, 378934, 383192, 386858, 389392, 391048, 392199, 393043, 393977, 395515, 397695, 400163, 402935, 406406, 410503, 414618, 418570, 422835, 427548, 432121, 436179, 440051, 443962, 447622, 451084, 455113, 460075, 465230, 469816, 474057, 478489, 483018, 487485, 492429, 498413, 505140, 512034, 519136]
56275E19136P459P293O650O625P638Q717R155R615J0868J2575J4085J5416J6678
56262F51910J7475J7754J8503K0696K4077K7674L1075L4622L8684M3248M7991
56251I73709N2571N7083O2160O8155P4496Q0438Q6095R1831R7014J00641J02930
56240A847123J04893J06329J05721J02345R7035R0482Q2277P2068O0326M7379
56230B715978L2933J7187J161j4474k9800m4407n7177o7812p7174q5464r1522
56219B299429r4671r5874r6157r5262r2855q9707q6552q2904p8178p2972o8148
56208A346149o3584n8882n4444n0718m7205m3258l9146l5405l1888k8358k5278
56197H67983k3115k1482j9789j8058j6363j4272j1633r182p642o880o494o408
$$ y = [519136, 526595, 533888, 540538, 547163, 554801, 563518, 572673, 582288, 593156, 605731, 619816, 635232, 651910, 669385, 687139, 705642, 726338, 750415, 778089, 809164, 843786, 882470, 925718, 973709, 1026280, 1083363, 1145523, 1213678, 1288174, 1368612, 1454707, 1546538, 1643552, 1744193, 1847123, 1952016, 2058345, 2164066, 2266411, 2363446, 2453928, 2536205, 2608273, 2668599, 2715978, 2748911, 2766098, 2767259, 2752785, 2722985, 2678578, 2621401, 2553589, 2476415, 2390951, 2299429, 2204758, 2108884, 2012727, 1917465, 1824610, 1734903, 1648351, 1565447, 1487269, 1414297, 1346149, 1282565, 1223683, 1169239, 1118521, 1071316, 1028058, 988912, 953507, 921619, 893261, 867983, 844868, 823386, 803597, 785539, 769176, 754904, 743271, 734089, 726447, 719567, 713073, 706665]
56185G06665o325n584m164k906k159j287p4O10K99k18l00m90j158j495q70kL48
56168F80890O34J450K322K766L329M409N174M912M393M622N337N958O859Q413
56154G41468R848J0551J1377J3269J5564J7141J8275J9831K1649K3370K5961L0621
56142I58925L6826M3059M8863N4629N9976O4118O7491P1394P6173Q1079Q5658
56131A648191R0147R4685R8986J02510J04266J03048R8592R1715Q2771P1177N7308
56120B643396M3513L2046K3022J5365Q351J045q201j9942l2374m3216n1767n8072
56108B553166o1753o3400o5506p0091p6469q2818q8513r3113r4842r2399q7052
56097A677210q0759p3457o4352n4599m6204l9197l2304k5594k0145j5907j2045
$$ y = [706665, 700340, 694756, 690592, 687686, 685527, 684240, 684166, 684776, 685075, 684857, 684557, 684067, 682909, 681414, 680544, 680542, 680890, 681524, 682974, 685296, 688062, 691391, 695800, 700974, 705886, 710279, 714901, 720238, 726196, 733055, 741468, 751316, 761867, 773244, 786513, 802077, 819218, 837493, 857324, 878973, 902343, 928304, 958925, 995751, 1038810, 1087673, 1142302, 1202278, 1266396, 1333887, 1405281, 1481454, 1562533, 1648191, 1738338, 1833023, 1932009, 2034519, 2138785, 2241833, 2340425, 2432140, 2514911, 2586088, 2643396, 2686909, 2718955, 2741977, 2757342, 2765693, 2766738, 2758537, 2738595, 2706221, 2663005, 2611238, 2553166, 2491413, 2428013, 2362507, 2292416, 2215947, 2133129, 2044616, 1951503, 1856661, 1764262, 1677210, 1596451, 1522994, 1458642, 1404043, 1357839, 1318642, 1286338, 1260744, 1240599, 1224692, 1212647]
56086A212647q715o459m679k657j092n94J29K362M969O131O321P112Q285Q741
56072A232501Q978J0047J1182J1320J1689J3918J6750J7778J7406J7783J8762
56061A388114J8479J7204J6967J7688J7218J5191J3508J3014J2735J2463J3032
56050A555613J4117J4581J4874J6361J8573J9914K0615K2125K4201K5488K6319
56039A772781K7903K9578L0074L0475L2499L4939L5520L5277L6982M0142M1924
56028B148094M2293M3779M6567M8459M9425N1562N4604N6143N6247N7303N9302
56017B713778O0029N9888O1647O5337O8311P0481P4407P9997Q4335Q7133R1144
56006C516487R6779J01520J05132J10100J16550J22142J27191J34304J42775J49320
$$ y = [1212647, 1203932, 1197473, 1192794, 1190137, 1189045, 1188451, 1188580, 1190942, 1195911, 1202042, 1208363, 1215475, 1223760, 1232501, 1241479, 1251526, 1262708, 1274028, 1285717, 1299635, 1316385, 1334163, 1351569, 1369352, 1388114, 1406593, 1423797, 1440764, 1458452, 1475670, 1490861, 1504369, 1517383, 1530118, 1542581, 1555613, 1569730, 1584311, 1599185, 1615546, 1634119, 1654033, 1674648, 1696773, 1720974, 1746462, 1772781, 1800684, 1830262, 1860336, 1890811, 1923310, 1958249, 1993769, 2029046, 2066028, 2106170, 2148094, 2190387, 2234166, 2280733, 2329192, 2378617, 2430179, 2484783, 2540926, 2597173, 2654476, 2713778, 2773807, 2833695, 2895342, 2960679, 3028990, 3099471, 3173878, 3253875, 3338210, 3425343, 3516487, 3613266, 3714786, 3819918, 3930018, 4046568, 4168710, 4295901, 4430205, 4572980, 4722300]
55996D722300J54476J62093J72314J81732J90590K02659K17593K30992K42643
55987F477392K56940K74320K90632L06028L25875L51474L78626M06766M40273
55978I508326M79283N19122N60677O10950O71437P36864Q07531Q90960R89049
55969A5774199J096598J215531J356868J525520J718500J942240K215393K550607
55961B9395456K952746L441005M052518M818229N759174O913552Q339116J0082403
55953G5754199J2188507J4762458J7974051K1962749K6762750L2296590L8237098
55946B39938402M3612128M6526520M4620013L6312738K2011810M288658j3177500
55939D24132769k7167583l6037409l9883516l9920458l7620377l4135607l0177178
$$ y = [4722300, 4876776, 5038869, 5211183, 5392915, 5583505, 5786164, 6003757, 6234749, 6477392, 6734332, 7008652, 7299284, 7605312, 7931187, 8282661, 8661287, 9068053, 9508326, 9987609, 10506731, 11067408, 11678358, 12349795, 13086659, 13894190, 14785150, 15774199, 16870797, 18086328, 19443196, 20968716, 22687216, 24629456, 26844849, 29395456, 32348202, 35789207, 39841725, 44659954, 50419128, 57332680, 65671796, 75754199, 87942706, 102705164, 120679215, 142641964, 169404714, 201701304, 239938402, 283550530, 330077050, 374697063, 411009801, 433021611, 437310269, 424132769, 396965186, 360927777, 321044261, 281123803, 243503426, 209367819, 179190641]
55932A79190641k6159975k2343904j8881336j5838109j3230514j1047729r249268
55925F2439806p772605o559118n564945m749057m069569l496903l016586k614808
55917B4596215k273045j979211j731010j524042j347287j193529j063480r55799
55909A2528812q62687p78950p06361o45358n90814n39516m93982m55380m19871
55900G035893l85189l54009l27680l03129k78837k57603k40460k23956k06319
55891D458711j90479j78137j66417j53274j40962j31248j22164j12205j03084
55882C160741r5703q7984p9138p1677o6765o2030n6294n2143n1163n0816m8671
55871B438357m5931m4154m2188l8984l6359l6486l9342m4341n1470n9219o4653
$$ y = [179190641, 153030666, 130686762, 111805426, 95967317, 82736803, 71689074, 62439806, 54667201, 48108083, 42543138, 37794081, 33724512, 30227609, 27211023, 24596215, 22323170, 20343959, 18612949, 17088907, 15741620, 14548091, 13484611, 12528812, 11666125, 10887175, 10180814, 9535456, 8944642, 8405126, 7911144, 7455764, 7035893, 6650704, 6296695, 5969015, 5665886, 5387049, 5129446, 4888986, 4665030, 4458711, 4268232, 4090095, 3923678, 3770404, 3629442, 3498194, 3376030, 3263825, 3160741, 3065038, 2977054, 2897916, 2826239, 2759474, 2697444, 2641150, 2589007, 2537844, 2487028, 2438357, 2392426, 2348272, 2306084, 2267100, 2230741, 2194255, 2154913, 2110572, 2059102, 1999883, 1935230]
55860A935230o7059o8413o9072o6737o1215n6091n3586n1492m7501m3011m0107
55849A310946l8065l5537l3390l2696l2411l1315l0049k9176k7624k5009k3062
55838I72612k2811k2692k1262j9458j8364j7218j5518j4570j4947j4807j2797
55827G78168j0395r293q712p416o298o690p975q893r646j0739j1387j0877r973
55814F59874r377q475o961n917n730m910k567j02J192K312M550P182Q946J0074
55800F50091J1094J1326J0266Q793P347M706K72m300p540j0308j3699j6713j8042
55787F33293j8300j8340j7223j4280j1419j0673j0838r275n915k852q86P79J995
55774E16066J631p6j450j747j703j702j242l02L60L46j20j052k747n109p790j0630
$$ y = [1935230, 1868171, 1799758, 1730686, 1663949, 1602734, 1546643, 1493057, 1441565, 1394064, 1351053, 1310946, 1272881, 1237344, 1203954, 1171258, 1138847, 1107532, 1077483, 1048307, 1020683, 995674, 972612, 949801, 927109, 905847, 886389, 868025, 850807, 835289, 820719, 805772, 790965, 778168, 767773, 758480, 749768, 742352, 736054, 729364, 721389, 712496, 702850, 692111, 680724, 669847, 659874, 650497, 642022, 635061, 629144, 623414, 618504, 615937, 615835, 617027, 619339, 623889, 631071, 640017, 650091, 661185, 672511, 682777, 691570, 698917, 703623, 703895, 699595, 692055, 681747, 668048, 651335, 633293, 614993, 596653, 579430, 565150, 553731, 543058, 532220, 522945, 517030, 514178, 513292, 514071, 516066, 517697, 517621, 516171, 514424, 512721, 511019, 509777, 509475, 509835, 510181, 510061, 509009, 506262, 501153, 493363, 482733]
55758D82733j3163j4443j4282j3882j4185j4469j3707j2347j1406j0622r005o626
55746C34596m522l256k730k891l488l709l136k539k729l271l333k964k556j857
55732B91615p14P9j17o41o75o75j417k462k972l281m134n052m983m072l263k572
55716B54664j271N23J762J902J314N41J29P27K247L349K906J624J060J444J612
55701B74533P88p41k444l992n006n348n439n586n341m319l120k588k591k407j798
55686B24601r37K03J484K256K258K222K752L291L178K924L274L805L622K809J932
55671B59674P82j066k941l718l392k732j860m93P82R48J36m65k12N72J589K802
55655B50406L786M000L682L586L868M007L619K608Q85j220k809l524m328o134
$$ y = [482733, 469570, 455127, 440845, 426963, 412778, 398309, 384602, 372255, 360849, 350227, 341222, 334596, 330074, 326818, 324088, 321197, 317709, 314000, 310864, 308325, 305596, 302325, 298992, 296028, 293472, 291615, 290901, 290980, 290863, 290222, 289547, 288872, 287455, 284993, 282021, 278740, 274606, 269554, 264571, 260499, 257236, 254664, 253393, 253916, 255678, 257580, 258894, 259435, 259564, 260291, 262538, 265887, 268793, 270417, 271477, 272921, 274533, 275321, 274580, 272136, 268144, 263138, 257790, 252351, 246765, 241424, 237105, 233985, 231397, 228806, 226399, 224601, 223664, 223867, 225351, 227607, 229865, 232087, 234839, 238130, 241308, 244232, 247506, 251311, 254933, 257742, 259674, 260456, 259390, 256449, 252731, 249339, 246607, 244747, 244254, 245036, 245984, 246120, 245655, 245443, 246015, 247604, 250406, 254192, 258192, 261874, 265460, 269328, 273335, 276954, 279562, 280447, 279227, 276418, 272894, 268566, 262432]
55641B62432q221r163q801q100p448o427n094m146l862l837l708l297k412j329
55627A86587r77j599j885p32Q23Q86m94j515j424j306j972k687k519j648p80k48
55611A68510j46m75r04r83q42r56j278j367j276j473j878j848j129j57O03R09
55595A55310N05n16j396j468j053q73r03o35j94p9j77k7J62j28n77m00L44Q37
55577A48732Q33Q03R26J020J277J987K680K704K499K980L813L695K439J360J343
55562A79091J803J911J696J435J013L47l24r33j687k465k827k654k185j474n94
55547A72153j81p77j710j694n65N66R58R59R80Q39L64j86n69p30n14N7L65j46
55529A70169j030j394j191j026r95p57n45r20j650k000j913j748j184K98K025
$$ y = [262432, 254211, 245048, 236247, 228147, 220699, 214272, 209178, 205032, 201170, 197333, 193625, 190328, 187916, 186587, 185610, 184011, 182126, 181394, 182217, 183103, 182609, 181094, 179670, 178364, 176392, 173705, 171186, 169538, 168758, 168510, 168364, 167889, 166985, 166002, 165160, 164204, 162926, 161559, 160283, 158810, 156932, 155084, 153955, 153798, 154401, 155310, 155815, 155299, 153903, 152435, 151382, 150509, 149606, 148971, 148777, 148698, 148521, 148494, 148656, 148528, 147951, 147551, 147895, 148732, 149565, 150368, 151294, 152314, 153591, 155578, 158258, 160962, 163461, 166441, 170254, 173949, 176388, 177748, 179091, 180894, 182805, 184501, 185936, 186949, 187296, 186972, 186039, 184352, 181887, 179060, 176406, 174221, 172747, 172153, 171972, 171195, 169485, 167791, 167226, 167792, 168750, 169709, 170689, 171528, 171892, 171706, 171137, 170407, 169893, 169950, 170315, 170169, 169139, 167745, 166554, 165528, 164533, 163776, 163231, 162311, 160661, 158661, 156748, 155000, 153816, 154114, 156139]
55514A56139K766K577K538K768K370J247K07q84l098o221q418q694q031p462o776
55499A21028n794n217n301n180m403l649l169k100k72R65Q36N82J499K872L326
55484I6023K925K513J977Q05l68m18N04J188J047N10L6k62l52l84p11j165r26
55467A02942K25J314J510J296J397J416O85l26o78n10o59j120j105m74L5N0J8
55450A06016L43Q20R91N69l94j311j337l36P55J011O03K84K59L13N60J203J754
55433A12103J409J98r09j063l05O63J126Q92M56N02J026J331J095R10J421K438
55417A23293L259L523L250K582J869J590J806K040K005J948J988J787J239Q08
55403A52987P11M33m11j448k262l014l760l919l204k342k117k245k037j604j529
$$ y = [156139, 158905, 161482, 164020, 166788, 169158, 170405, 170612, 169728, 166630, 160409, 151991, 143297, 135266, 127804, 121028, 115234, 110017, 104716, 99536, 95133, 91484, 88315, 86215, 85943, 86908, 87744, 88326, 89825, 92697, 96023, 98948, 101461, 103438, 104243, 103875, 103457, 103961, 105149, 106196, 106706, 106742, 106480, 106128, 105744, 105033, 103868, 102942, 103167, 104481, 105991, 107287, 108684, 110100, 110785, 110459, 109781, 109271, 108612, 107492, 106387, 105913, 105948, 105998, 106016, 106359, 107179, 108170, 108739, 108345, 107034, 105697, 105361, 106116, 107127, 107730, 108014, 108273, 108586, 109146, 110349, 112103, 113512, 113710, 112801, 111738, 111433, 112096, 113222, 114114, 114570, 115072, 116098, 117429, 118524, 119434, 120855, 123293, 126552, 130075, 133325, 135907, 137776, 139366, 141172, 143212, 145217, 147165, 149153, 150940, 152179, 152987, 153698, 154131, 153720, 152272, 150010, 146996, 143236, 139317, 136113, 133771, 131654, 129409, 127372, 125768, 124239]
55388A24239j802j997k076k222k178j560n67K85Q68J247J258Q80O20Q32J092R24
55372A19843O15O43P50M60j8k50m73j119j826j933j586j458j579j473j210j269
55356A08117j461j020J13J035J082N82K31K95N64O50L25j76l47j08N5m7Q5O35
55338A10610Q78L21k43R6Q02O60k81q48o10k61j39L01J213J766J293K08o40r08
55320A14218p22k89J01J92K6k22n35q26o66J30R21R96O12M65L95k77j281j497
55302A11741p13k8j80n48l77O6K09K48O69J254J412J124R12R80J012P72M48L45
55284A19346L94J64n93j363j180K16J736J974P36q72j772j804j354p33j31L48
55268A15112P56J135J267R08K51k60n79r64j328j191m70K55L72j58r03j333j111
$$ y = [124239, 122437, 120440, 118364, 116142, 113964, 112404, 111837, 112122, 112990, 114237, 115495, 116375, 116995, 117827, 118919, 119843, 120458, 121101, 121851, 122311, 122293, 122043, 121570, 120451, 118625, 116692, 115106, 113648, 112069, 110596, 109386, 108117, 106656, 105636, 105749, 106784, 107866, 108448, 108679, 108974, 109538, 110188, 110513, 110337, 109990, 109882, 109937, 109890, 109975, 110610, 111488, 111809, 111566, 111662, 112464, 113124, 112843, 111995, 111385, 111124, 110985, 111286, 112499, 114265, 115558, 115766, 115126, 114218, 113496, 113207, 113308, 113500, 113526, 113304, 112769, 111943, 111277, 111407, 112328, 113324, 113936, 114401, 114796, 114519, 113238, 111741, 111028, 111000, 110820, 110272, 109895, 109961, 110170, 110418, 111087, 112341, 113753, 114877, 115789, 116769, 117781, 118553, 119001, 119346, 119740, 119904, 119311, 117948, 116768, 116984, 118720, 120694, 121430, 120558, 118786, 116982, 115628, 114895, 114764, 115112, 115868, 117003, 118270, 119178, 119429, 119169, 118590, 117626, 116298, 115107, 114637, 114892, 115264, 115106, 114203, 112870, 111759]
55251A11759l50M11Q03J034J380J500Q60l05j097r87k84M49Q19N89j58q17q03
55234A14803l16l3r6j9L96P99R80J131J275J076M41k06m38k01L06O85L69p06j577
55215A18669j166K40J251J166O33L26%p08j404j484j008m96k18j34j14J7L19M75
55197A16364K06q9K60J050J316Q12L77N18O49K67n6K43O08K83l43m19j57m45j199
55178A20245j382o33J85L67L13O06R27N60m49j230j109k98M52O67M85K57Q9q4
55160A19968o2M80J319J548N84q81j442n02J062J880J491N77Jj39l93j027j518
55143A22946j195j71O88P13K2q38j423j406n58Q95K083K125J047j66n30M1P61
55126A25034Q62L75KJ72M96L72o7j19L56N75j17j254j782j372o26j22K62Q54J514
$$ y = [111759, 111409, 111820, 112623, 113657, 115037, 116537, 117397, 117092, 115995, 115008, 114724, 115173, 115992, 116581, 116423, 115606, 114803, 114487, 114454, 114358, 114339, 114735, 115534, 116514, 117645, 118920, 119996, 120437, 120231, 119793, 119592, 119898, 120583, 120952, 120246, 118669, 117503, 117743, 118994, 120160, 120793, 121119, 121119, 120411, 119007, 117523, 116515, 116019, 115801, 115667, 115553, 115570, 115889, 116364, 116570, 116481, 116741, 117791, 119107, 119919, 120296, 120814, 121463, 121730, 121674, 121917, 122525, 122808, 122465, 122046, 121889, 121444, 120245, 118863, 118230, 118415, 118782, 119095, 119701, 120628, 121188, 120739, 119509, 118400, 118102, 118554, 119221, 119706, 119963, 120052, 119968, 119906, 120386, 121705, 123253, 123837, 122956, 121514, 121012, 122074, 123954, 125445, 126022, 126023, 125884, 125491, 124464, 122946, 121751, 121580, 122268, 122981, 123003, 122165, 120742, 119336, 118778, 119673, 121756, 123881, 124928, 124762, 124232, 124273, 125034, 125896, 126271, 126273, 126445, 126941, 127313, 127246, 127127, 127483, 128058, 127941, 126687, 124905, 123533, 122907, 122785, 123047, 123901, 125415]
55107A25415J790J507R00K27l60o23l42K20M18M4k70J29R49J365J141P40M73K70
55089A33993K80P70J294R00l80j277j088p27j121j543p93O26J072K50l34M11J784
55072A34117K482K095R97l27j304j403p63j90j22j56J21M71N13L28J61rk75n37
55054A36199p02p37m28L31R53N93n65j262q01OP8m84q83r19r16q00k13N66P38
55035A30754J24n12n05q4K10L89Q14J321J185J54r39j034k24L45m6q26j081p12
55017A29333j58L81P86N58n22j559j367q8R30R03L37l4j37j35l8K0j09p5N71J402
54997A30999J545J174J376K225K383J230J2k2N65N45K9j1N19Q76Q20P58Q02P31
54979A46556O64Q28R05M43k76o85q67j230j524j184l93J81N00J009J548J469Q76
$$ y = [125415, 127205, 128712, 129612, 129839, 129479, 128856, 128514, 128734, 129152, 129196, 128926, 129055, 130004, 131369, 132510, 133250, 133723, 133993, 134273, 135043, 136337, 137237, 136857, 135580, 134492, 133765, 132644, 131101, 130308, 130934, 132006, 132256, 131922, 132333, 134117, 136599, 138694, 139691, 139364, 138060, 136657, 135894, 135704, 135582, 135426, 135547, 136018, 136531, 136859, 137020, 137011, 136736, 136199, 135497, 134760, 134332, 134663, 135616, 136209, 135644, 134382, 133581, 133587, 133665, 133181, 132298, 131379, 130463, 129663, 129450, 130016, 130754, 130878, 130366, 129861, 129777, 129987, 130376, 131190, 132511, 133696, 133850, 132911, 131877, 131653, 131998, 131952, 131126, 130045, 129333, 129175, 129556, 130342, 130900, 130378, 128819, 127452, 127364, 128294, 129197, 129534, 129500, 129363, 129228, 129190, 129210, 129101, 129026, 129597, 130999, 132544, 133718, 135094, 137319, 139702, 140932, 140944, 140922, 141487, 142032, 142061, 142050, 142569, 143445, 144265, 145023, 145825, 146556, 147220, 148048, 148953, 149396, 149120, 148435, 147568, 146338, 144814, 143630, 143237, 143418, 143918, 144927, 146475, 147944, 148820]
54962A48820N97Q01P52J59k33J32P47Q85O13M05L01m5p64j635k248k130j164k1
54944A45972M06J18M7P01J414J387Q91P75J245J734J770J342N85k55n85J16J526
54927A59189K606K838K880L640N075O346O998P336P671P741P208O267N309M297
54913B35401K879J025r08k639m097n183n843o325o905p323p012n953m836m228
54899A78053m037l861l451k683j605o31k47l61l85l8M39Q91J460K042K256K196
54883A70038K415K970L242L064L187M108N363O512P786R063R152P311M615K662
54869B41488J419l13k767m886o044o698p260p484p220o801o352n556m397l375
54855A73754k786k421k161k155k315k260j985j858j864j532p85j98j63m37p32
$$ y = [148820, 149417, 150218, 150970, 151129, 150896, 151028, 151775, 152660, 153273, 153678, 153979, 153934, 153170, 151535, 149287, 147157, 145993, 145972, 146378, 146496, 146543, 147244, 148658, 150045, 150936, 151711, 152956, 154690, 156460, 157802, 158387, 158132, 157547, 157663, 159189, 161795, 164633, 167513, 171153, 176228, 182574, 189572, 196908, 204579, 212320, 219528, 225795, 231104, 235401, 238280, 239305, 238397, 235758, 231661, 226478, 220635, 214310, 207405, 200082, 193070, 187117, 182281, 178053, 174016, 170155, 166704, 164021, 162416, 161785, 161538, 161177, 160792, 160754, 161193, 162084, 163544, 165586, 167842, 170038, 172453, 175423, 178665, 181729, 184916, 189024, 194387, 200899, 208685, 217748, 226900, 234211, 238826, 241488, 242907, 242594, 239827, 234941, 228897, 222199, 214939, 207455, 200235, 193434, 187082, 181526, 177129, 173754, 170968, 168547, 166386, 164231, 161916, 159656, 157671, 155813, 153949, 152417, 151632, 151434, 151271, 150834, 150102]
54840A50102j071j352j175m77K15M37K97J31O2J05K16J70j47l32J1L92n4j113
54822A46417j545r05k37m02p41k72O00P10n1o95o79m22k10K92J173J776J534P93
54804A47136L12K76K85J20M6K92O10N70J81m7L70J323K213K441J801N29p81j419
54786A56258j041l0Q21J083R89R22R00P74P15J148K157L221L688L417K865K629
54770A80516L014L975N237O454P400Q102Q646Q823Q250O908N285L678J776o81
54756B57383l170m891n780o327o564o134n269m796m880m804m284m049m472m659
54742A87304l747k355j702j883j992j594r89l54L76R13Q89P04J169K269L190L644
54726A85842M265N424O473O566N750M829M472M704N003M813M006K798J186j069
$$ y = [150102, 149031, 147679, 146504, 146027, 146242, 146679, 146976, 147107, 147169, 147274, 147490, 147660, 147513, 147181, 147192, 147584, 147530, 146417, 144872, 143967, 143730, 143328, 142587, 142315, 142915, 143625, 143574, 142879, 142200, 141778, 141568, 141860, 143033, 144809, 146343, 147136, 147448, 147724, 148009, 148129, 148175, 148467, 149077, 149647, 149828, 149781, 150151, 151474, 153687, 156128, 157929, 158458, 157677, 156258, 155217, 155187, 156008, 157091, 158080, 159002, 159902, 160676, 161391, 162539, 164696, 167917, 171605, 175022, 177887, 180516, 183530, 187505, 192742, 199196, 206596, 214698, 223344, 232167, 240417, 247325, 252610, 256288, 258064, 257383, 254213, 249322, 243542, 237215, 230651, 224517, 219248, 214452, 209572, 204768, 200484, 196435, 191963, 187304, 183557, 181202, 179500, 177617, 175625, 174031, 173042, 172688, 173064, 173977, 174866, 175570, 176739, 179008, 182198, 185842, 190107, 195531, 202004, 208570, 214320, 219149, 223621, 228325, 233328, 238141, 242147, 244945, 246131, 245062]
54712B45062l692n737o661o954p127o791n613m496m585n492n745m796l395k184
54698A71794j194o52q91j332r19K46R49P52M53M19o0j150j763j286p07j032j698
54681A61929j622r25m33l09k04k08o28j197j383j134o65k6N75O10P4k31K1o4j120
54662A53060k129j675o1J072R38K01l44n59m34R5O98Q20M48N5j69l33k58L05R41
54643A52671R53M24J11K89M85M37L79L39mm90l99M08J045P22k53j018j185r02
54625A54012l80J20K25j48n17l68J93O08N94L75K70L51N09O03N43K83j49o26q57
54606A55641n04M88J579J925J125k50j064o37N73J380J075J09n25m29o8N3nP4
54588A60540L06M29K68q2l47k43K15N75M21K1J9M13M17l58j157j087m03j16n68
$$ y = [245062, 241370, 235633, 228972, 222018, 214891, 208100, 202487, 197991, 193406, 187914, 182169, 177373, 173978, 171794, 170600, 169948, 169057, 167725, 166806, 167052, 168001, 168753, 169206, 169625, 169565, 168415, 166652, 165366, 164659, 163627, 161929, 160307, 159382, 158949, 158640, 158436, 158228, 157600, 156403, 155020, 153886, 153221, 153195, 153770, 154380, 154454, 154223, 154244, 154180, 153060, 150931, 149256, 149195, 150267, 151205, 151406, 151062, 150503, 150069, 150164, 150862, 151682, 152130, 152185, 152016, 151683, 151425, 151730, 152671, 153624, 154048, 154159, 154448, 154933, 155370, 155749, 156088, 156084, 155594, 155195, 155603, 156648, 157370, 157117, 156099, 154914, 154012, 153632, 153752, 153977, 153829, 153312, 152944, 153137, 153745, 154339, 154714, 154984, 155335, 155844, 156447, 156990, 157273, 157124, 156498, 155641, 155137, 155625, 157204, 159129, 160254, 160004, 158940, 158303, 158876, 160256, 161331, 161440, 160915, 160486, 160418, 160471, 160466, 160540, 160846, 161275, 161543, 161461, 161114, 160871, 161086, 161661, 162082, 162103, 162122, 162535, 162952, 162594, 161437, 160350, 159947, 159831, 159263]
54569A59263j066r55m23q0r8p3L86J118J492J112L19j54m1K19J49k61p77j217
54551A58913j348r47j90L59M49M20N46N99M09L35O74J015Q19L33K72Q09J403J578
54533A66448J360J018P83P76Q93Q94P68P89R56Q20J64n80j000j345j920k300j800
54516A66724m93Q52J628J653R21k46j071j066o99p13j044j101q07n75m52j78J4
54499A63347l44r51r73l42M4k99q02p69k24M65J051J260Q55K08L7L51L65j60l89
54480A62730K80J194J408J040R28J323J743J801J554J167P91O65Q36R26O11K25
54464A79222L22P76Q39J68o97j052q63n96m86k89J97O53N52j02o12l96K87O76
54446A78599M56N1k3K57N23L91k70j175j659j227j55O73O63Np13j092j029o34
$$ y = [159263, 158197, 157242, 156819, 156739, 156641, 156568, 156954, 158072, 159564, 160676, 160995, 160841, 160800, 161019, 161168, 160907, 160130, 158913, 157565, 156618, 156428, 156787, 157236, 157656, 158202, 158801, 159210, 159545, 160219, 161234, 162053, 162386, 162658, 163467, 164870, 166448, 167808, 168826, 169609, 170385, 171278, 172172, 172940, 173729, 174685, 175505, 175669, 175089, 174089, 172744, 170824, 168524, 166724, 166231, 167083, 168711, 170364, 171285, 171039, 169968, 168902, 168203, 167490, 166446, 165345, 164538, 163963, 163511, 163333, 163347, 163003, 162052, 161079, 160737, 160781, 160482, 159680, 158911, 158687, 159152, 160203, 161463, 162318, 162526, 162563, 162914, 163279, 163119, 162730, 163010, 164204, 165612, 166652, 167580, 168903, 170646, 172447, 174001, 175168, 175959, 176624, 177460, 178386, 178997, 179222, 179544, 180320, 181159, 181327, 180630, 179578, 178715, 178119, 177633, 177344, 177541, 178194, 178746, 178644, 178032, 177636, 177923, 178599, 179055, 179106, 179083, 179340, 179863, 180254, 179984, 178809, 177150, 175923, 175768, 176441, 177104, 177109, 176396, 175304, 174275, 173641]
54428A73641k60k69n57n72j3O76P83J96m86o14r7O32J150J377J442J298P87K5
54410A79139m85l84J23O10R04R43N79m1k05N40J539J735J120O39N83J59r33j595
54392A84970q27O14J094L28l35J39J219J785J574J124P54K66m66j140j407j223
54376A88469p31l7O53R33N37j93n66l07J69L78L27L30N13P80J071J388J720K065
54358A97499K390K386J665M68j54N44J930K620K109J221R06J133J193O69j68p61
54342B15650q74p65q16j011j037q97j027j562j999j955j806j985k142j725j088
54327A94961j048j580j874j698j618j780j514n69K74L29l7j40K2J33K74N81O38
54310A85354k0j082j802j937j769j386n78M97J128P68l34j353j673j401j074r40
$$ y = [173641, 173381, 173112, 172555, 171983, 171970, 172646, 173429, 173625, 173139, 172525, 172428, 173060, 174210, 175587, 177029, 178327, 179114, 179139, 178654, 178270, 178393, 179003, 179907, 180850, 181429, 181388, 181183, 181723, 183262, 184997, 186117, 186756, 187339, 187498, 186565, 184970, 184143, 184757, 185851, 186179, 185844, 185983, 187202, 188987, 190561, 191685, 192439, 192705, 192239, 191099, 189692, 188469, 187738, 187701, 188354, 189287, 189824, 189631, 189065, 188758, 188927, 189305, 189632, 189962, 190475, 191255, 192326, 193714, 195434, 197499, 199889, 202275, 203940, 204408, 204254, 204798, 206728, 209348, 211457, 212678, 213584, 214717, 215910, 216579, 216411, 215650, 214776, 214011, 213195, 212184, 211147, 210250, 209223, 207661, 205662, 203707, 201901, 199916, 197774, 196049, 194961, 193913, 192333, 190459, 188761, 187143, 185363, 183849, 183280, 183554, 183883, 183846, 183706, 183728, 183861, 184135, 184716, 185354, 185334, 184252, 182450, 180513, 178744, 177358, 176780, 177277, 178405, 179173, 178839, 177486, 175813, 174412, 173338, 172398]
54294A72398o86k9P30J100J144J286J503J402J072J103J571J731J086J23m28m62
54278A84644k68N4L89L59j36n22k32N11J064J159R48N91L10M58J078J624J588
54261A93619J139P12L70K6j08R7K14j91p71q02k31L37N35M72K11l21r09j193j205
54242A92001j236j142m94N41J084N84n06j300j330o55L89J252J404Q16M6m34p09
54225A90311j042j249r07q4N49M44j80o69p27n99m85j90M09R06Q66N42N29P45
54207A89169N09k65p25l51K08J30l20l18J58M00J82jM1j77q64j345r00K53J223
54188A87007J437R76K05n38r21p32j68J70j06o56p08l4O13L41o93j387j025j05
54170A83676L73J22l08l41J0K48r6r54j645j526p75k11j81q6O67J704K110J573
$$ y = [172398, 171712, 171683, 172413, 173513, 174657, 175943, 177446, 178848, 179920, 181023, 182594, 184325, 185411, 185534, 185106, 184644, 184376, 184430, 184819, 185178, 185042, 184520, 184288, 184799, 185863, 187022, 187970, 188561, 188871, 189329, 190407, 192031, 193619, 194758, 195470, 195840, 195866, 195758, 195855, 196069, 195878, 195107, 194305, 194074, 194411, 194946, 195418, 195629, 195308, 194399, 193206, 192001, 190765, 189623, 189129, 189670, 190754, 191338, 190832, 189532, 188202, 187547, 187936, 189188, 190592, 191408, 191454, 191020, 190311, 189269, 188020, 187113, 187029, 187578, 188022, 187842, 187173, 186446, 185847, 185362, 185172, 185581, 186487, 187353, 187895, 188424, 189169, 189678, 189413, 188688, 188337, 188545, 188675, 188355, 188037, 188195, 188595, 188777, 188776, 188817, 188640, 187776, 186431, 185531, 185784, 187007, 188444, 189420, 189625, 189087, 188166, 187434, 187266, 187436, 187330, 186674, 185966, 185932, 186545, 186886, 186193, 184806, 183781, 183676, 184049, 184171, 183863, 183522, 183532, 183780, 183684, 182730, 181085, 179559, 178784, 178573, 178392, 178306, 178973, 180677, 182787, 184360]
54152A84360O09j81n92p01o53n93n29l29n5l6l86p38p58n98m48l9Q94J858K011
54133A83096J237K93j22N7N28J000J254J219J076R75Q28N80N32R19J402J440J055
54116A97369P07N33L22J79M83J170J624J452Q88K94k27n94o49m85l90l41J8O56
54098B03009J001P54M20N66R29P30k46j319j684j227m78R1N54J193J788J667O68
54081B08416l12k29Q20J766J999K065K760M054N232N775N806N809O087O418O201
54066B62667N116L681K849K958L224K430P4l110n690o685o347n731n491n292m614
54051B40039l634k841k167j110K94J315J400P79J35J7O19J656K482K753K908L547
54035B48192M457M868M657M549M998N581N835N975O335O622O281N304M209L434
$$ y = [184360, 184969, 184788, 184196, 183495, 182842, 182249, 181720, 181391, 181336, 181300, 180914, 180176, 179418, 178820, 178372, 178333, 179227, 181085, 183096, 184333, 184626, 184504, 184561, 185089, 186089, 187343, 188562, 189638, 190613, 191441, 192021, 192553, 193472, 194874, 196314, 197369, 198076, 198609, 198931, 199110, 199593, 200763, 202387, 203839, 204727, 205021, 204794, 204200, 203551, 203066, 202676, 202335, 202353, 203009, 204010, 204764, 205184, 205750, 206679, 207409, 207163, 205844, 204160, 202933, 202455, 202546, 203100, 204293, 206081, 207748, 208416, 208104, 207875, 208695, 210461, 212460, 214525, 217285, 221339, 226571, 232346, 238152, 243961, 250048, 256466, 262667, 267783, 271464, 274313, 277271, 280495, 282925, 282999, 279889, 274199, 267514, 261167, 255436, 249945, 244653, 240039, 236405, 233564, 231397, 230287, 230581, 231896, 233296, 234075, 234210, 234227, 234846, 236502, 238984, 241737, 244645, 248192, 252649, 257517, 262174, 266723, 271721, 277302, 283137, 289112, 295447, 302069, 308350, 313654, 317863, 321297]
54021C21297L093L131L387L603L572L230K528J467L41l96o25o60p22o31k02L76
54005C42789P80Q91P20K77l50j005j713k661l873n104o163o999p425p134o148
53990B96882m966m078l610l501l669l934m056m047m089m083l653k719j712j069
53976B47696q74j056j517j934j885j331o14P8P27J049O67j18n15l90m73j041j270
53959B37199l93J125K225K481K092J260L38J02R79K250K785K397J825J649J841
53944B60155K233K777L322L700L963M178M215M136M405N159N654N192M314M236
53930C17639N281O702P890Q814R289Q856P691O743O543O608O409O213O467O934
53916D18079P034O729O510O783P664R086J0640J1434J0621Q117M645J183j510
$$ y = [321297, 324390, 327521, 330908, 334511, 338083, 341313, 343841, 345308, 345649, 345253, 344628, 343968, 343246, 342615, 342413, 342789, 343569, 344460, 345180, 345457, 345107, 344102, 342389, 339728, 335855, 330751, 324588, 317589, 310164, 303030, 296882, 291916, 287838, 284228, 280727, 277058, 273124, 269068, 265021, 260932, 256849, 253196, 250477, 248765, 247696, 246822, 245766, 244249, 242315, 240430, 239099, 238485, 238563, 239290, 240339, 241006, 240888, 240373, 239983, 239510, 238469, 237199, 236806, 237931, 240156, 242637, 244729, 245989, 246327, 246429, 247408, 249658, 252443, 254840, 256665, 258314, 260155, 262388, 265165, 268487, 272187, 276150, 280328, 284543, 288679, 293084, 298243, 303897, 309089, 313403, 317639, 322920, 329622, 337512, 346326, 355615, 364471, 372162, 378905, 385448, 392056, 398465, 404678, 411145, 418079, 425113, 431842, 438352, 445135, 452799, 461885, 472525, 483959, 494580, 502697, 507342, 508525, 507015]
53903E07015l024l365k967k509k599l499m936o150o427n739m750m136m081m470
53889D48363n244o313p310p714p352o583n992n903o139o303o232o100o042n894
53875C59242n488n053n011n395n788n802n398m724m027l704m014m621m772m216
53861B91229l528l299l324k998k315j889k034k275k024j363q76q43r62q57n78
53846B62064m41n27o23n75m97n62p16p81p33p44r72j380j691j523p23K67O21p0
53828B50394j250j906j611q13j45K39M89N76L63K2J7N23J087J120N97R6J12N55
53810B50465J040J445J924K480K817K732K396K190K417L197M401N556O042N646
53796B94748M839M344M475M989N406N344M671L569K492J900J948K412K819K723
$$ y = [507015, 503991, 500626, 497659, 495150, 492551, 489052, 484116, 477966, 471539, 465800, 461050, 456914, 452833, 448363, 443119, 436806, 429496, 421782, 414430, 407847, 401855, 395952, 389813, 383510, 377278, 371178, 365136, 359242, 353754, 348701, 343690, 338295, 332507, 326705, 321307, 316583, 312556, 308852, 304838, 300217, 295445, 291229, 287701, 284402, 281078, 278080, 275765, 273876, 271842, 269567, 267543, 266180, 265304, 264461, 263499, 262642, 262064, 261623, 261096, 260473, 259898, 259401, 258839, 258123, 257342, 256609, 255865, 254893, 253513, 251822, 250299, 249576, 249843, 250464, 250394, 249144, 247238, 245627, 244814, 244669, 244908, 245397, 245973, 246336, 246358, 246375, 246898, 247985, 249105, 249702, 249798, 249910, 250465, 251505, 252950, 254874, 257354, 260171, 262903, 265299, 267489, 269906, 273103, 277504, 283060, 289102, 294748, 299587, 303931, 308406, 313395, 318801, 324145, 328816, 332385, 334877, 336777, 338725, 341137, 343956, 346679]
53782C46679J989R38O0m24o51q08r89j315j919k717l391l786m037m253m350m347
53766C16679m428m577m525m267m172m304m122l277k313j936j941j608r47p67j443
53751B72052k352k719k492k091j755j477j296j351j728k321k759k549j540k10
53737B45412P58J137J106P78K05k75k54J46L96L74M66Q02R87Q25P23J041J578
53720B56205J980K195K127J426J18r82j131o02j55R5O03J399J956K103K282K745
53704B72364L100K985K631K407K246J984J852K193K825L233L319L493L882L970
53690C12484L258K044J125P97N53q1p76q05j05N88O68L50J47N9k34o32o88m79
53672C18273o82j486k034j474k66L11j53p44n85JJ48l06p41o99l07K11Q55J535
$$ y = [346679, 348668, 349606, 349666, 349242, 348591, 347783, 346794, 345479, 343560, 340843, 337452, 333666, 329629, 325376, 321026, 316679, 312251, 307674, 303149, 298882, 294710, 290406, 286284, 283007, 280694, 278758, 276817, 275209, 274262, 273495, 272052, 269700, 266981, 264489, 262398, 260643, 259166, 257870, 256519, 254791, 252470, 249711, 247162, 245622, 245412, 246170, 247307, 248413, 249191, 249396, 249121, 248867, 249013, 249409, 249783, 250249, 251051, 252038, 252863, 253586, 254627, 256205, 258185, 260380, 262507, 263933, 264051, 263069, 261938, 261336, 261181, 261276, 261879, 263278, 265234, 267337, 269619, 272364, 275464, 278449, 281080, 283487, 285733, 287717, 289569, 291762, 294587, 297820, 301139, 304632, 308514, 312484, 315742, 317786, 318911, 319708, 320261, 320180, 319404, 318599, 318494, 319082, 319750, 320100, 320247, 320306, 320072, 319440, 318752, 318273, 317591, 316105, 314071, 312597, 312331, 312642, 312489, 311745, 311160, 311161, 311309, 311003, 310262, 309563, 309256, 309467, 310322, 311857]
53654C11857J874J593Q97K40j32k20o3K39L98O7p37j523j733j262m84K27Q68J572
53636C13678K152K248J885J564J566J520J040M64M98J225J978K219K054J825J716
53621C37632J867K395L054L267K800K082J683J789K335L164L838L810L185K868
53607C75769L534M769N665N920N849N669N327M865M362L673K742K030K085K754
53593D35013L308L270K703J852J045P94J356K204K490K018J231L81o28j616k125
53578D53296k134k103k143j897j409j306j763k065j656j012q86j231j489j533
53564D30669j657j936k137k109j811j176l95J6j54l66q8M05N12L54N83J291J878
53547D23879K027K056K245K436K571K908L393L429K714J812J464J621J788K017
$$ y = [311857, 313731, 315324, 316221, 316461, 316329, 316109, 316046, 316285, 316683, 316750, 316013, 314490, 312757, 311495, 311011, 311238, 312106, 313678, 315830, 318078, 319963, 321527, 323093, 324613, 325653, 326117, 326615, 327840, 329818, 332037, 334091, 335916, 337632, 339499, 341894, 344948, 348215, 351015, 353097, 354780, 356569, 358904, 362068, 365906, 369716, 372901, 375769, 379303, 384072, 389737, 395657, 401506, 407175, 412502, 417367, 421729, 425402, 428144, 430174, 432259, 435013, 438321, 441591, 444294, 446146, 447191, 447985, 449341, 451545, 454035, 456053, 457284, 457665, 457037, 455421, 453296, 451162, 449059, 446916, 445019, 443610, 442304, 440541, 438476, 436820, 435808, 434922, 433691, 432202, 430669, 429012, 427076, 424939, 422830, 421019, 419843, 419448, 419464, 419310, 418944, 418856, 419261, 419773, 420127, 420710, 422001, 423879, 425906, 427962, 430207, 432643, 435214, 438122, 441515, 444944, 447658, 449470, 450934, 452555, 454343, 456360]
53533D56360K873M456O024O826O896O789O808O803O643O570O958P879Q990R935
53519E50810J0730J1682J2876J3929J4408J4453J4702J5584J6879J8101J9073
53508G13227J9880K0513K0881K1167K1724K2551K3158K3158K2784K2582K2815
53497I54440K3235K3390K3007K2255K1670K1644K1904K1847K1475K1510K2232
53486A198609K2742K1968K0141J8533J7858J7608J7131J6547J6325J6451J6484
53475A400397J6082J5189J3920J2558J1400J0378R127P599O234N225M009J971
53463A514089o63l090m981o661q345r807j0934j2132j3750j5474j6601j6875j6733
53450A378043j6793j7293j8009j8584j8861j8955j9081j9213j8999j8125j6770
$$ y = [456360, 459233, 463689, 469713, 476539, 483435, 490224, 497032, 503835, 510478, 517048, 524006, 531885, 540875, 550810, 561540, 573222, 586098, 600027, 614435, 628888, 643590, 659174, 676053, 694154, 713227, 733107, 753620, 774501, 795668, 817392, 839943, 863101, 886259, 909043, 931625, 954440, 977675, 1001065, 1024072, 1046327, 1067997, 1089641, 1111545, 1133392, 1154867, 1176377, 1198609, 1221351, 1243319, 1263460, 1281993, 1299851, 1317459, 1334590, 1351137, 1367462, 1383913, 1400397, 1416479, 1431668, 1445588, 1458146, 1469546, 1479924, 1489051, 1496650, 1502884, 1508109, 1512118, 1514089, 1513426, 1510336, 1505355, 1498694, 1490349, 1480542, 1469608, 1457476, 1443726, 1428252, 1411651, 1394776, 1378043, 1361250, 1343957, 1325948, 1307364, 1288503, 1269548, 1250467, 1231254, 1212255, 1194130, 1177360]
53439A177360j5476j4543j3748j2838j2037j1681j1503j0726q991o788m782l099
53427A051148j528j6J383K747M012M784M896N021O068Q054J0143J1831J3453J5367
53413A137363J7240J8566J9477K0607K2340K4458K6389K7651K8196K8502K9176
53402A399965L0480L2334L4606L7088L9292M0804M1908M3254M4878M6155M6935
53391A837699M7962M9697N1467N2445N2872N3480N4053N3606N1982N0338M9704
53380B405305M9722M9249M7724M5520M3147M0588L7490L3704K9535K5402K1404
53369B828790J7341J3070Q693M296j79m720r134j3360j7631k2108k6527l0571
53357B747960l4336l8144m1947m5347m8046m9948n0862n0663m9813m9235m9442
$$ y = [1177360, 1161884, 1147341, 1133593, 1120755, 1108718, 1097037, 1085534, 1074808, 1065817, 1059029, 1054247, 1051148, 1049620, 1049604, 1050987, 1053734, 1057746, 1062530, 1067426, 1072447, 1078515, 1086569, 1096712, 1108543, 1121996, 1137363, 1154603, 1173169, 1192646, 1213253, 1235593, 1260051, 1286440, 1314091, 1342287, 1370789, 1399965, 1430445, 1462779, 1497385, 1534473, 1573765, 1614569, 1656477, 1699731, 1744609, 1790764, 1837699, 1885661, 1935358, 1986825, 2039270, 2092142, 2145622, 2199675, 2253281, 2305263, 2355601, 2405305, 2455027, 2504276, 2552000, 2597520, 2640667, 2681255, 2718745, 2752449, 2781984, 2807386, 2828790, 2846131, 2859201, 2867894, 2872190, 2872011, 2867291, 2858157, 2844797, 2827166, 2805058, 2778531, 2747960, 2713624, 2675480, 2633533, 2588186, 2540140, 2490192, 2439330, 2388667, 2338854, 2289619, 2240177]
53346B240177n0049n0279m9744m8530m6836m4882m3001m1472m0222l8961l7681
53335A748520l6774l6452l6216l5214l3210l0864k8888k7235k5364k3179k1159
53324A413965j9627j8325j6883j5306j3815j2521j1507j0938j0787j0624j0055
53313A263577r188q446p973p494o667n434m050k907k146j405j29J762L789N604
53299A218893P330R095J0667J1928J3258J4895J6295J6751J6550J6844J8315K0465
53287A391286K2268K3090K2950K2310K1702K1323K0918K0240J9462J8850J8171
53276A622570J6963J5189J3138J0776P861M692K049J44j717m190p149j0178j3148
53263A657000j5893j7848j8649j8853j9463k0900k2812k4725k6357k7489k8041
$$ y = [2240177, 2190128, 2139849, 2090105, 2041575, 1994739, 1949857, 1906856, 1865384, 1825162, 1786201, 1748520, 1711746, 1675294, 1639078, 1603864, 1570654, 1539790, 1510902, 1483667, 1458303, 1435124, 1413965, 1394338, 1376013, 1359130, 1343824, 1330009, 1317488, 1305981, 1295043, 1284256, 1273632, 1263577, 1254389, 1245943, 1237970, 1230476, 1223809, 1218375, 1214325, 1211418, 1209272, 1207867, 1207738, 1209500, 1213289, 1218893, 1226223, 1235318, 1245985, 1257913, 1271171, 1286066, 1302361, 1319112, 1335662, 1352506, 1370821, 1391286, 1413554, 1436644, 1459594, 1481904, 1503606, 1524929, 1545847, 1566087, 1585549, 1604399, 1622570, 1639533, 1654722, 1667860, 1678636, 1686497, 1691189, 1693238, 1693382, 1691665, 1687475, 1680326, 1670148, 1657000, 1641107, 1623259, 1604610, 1585757, 1566294, 1545394, 1522582, 1497857, 1471500, 1444011, 1415970]
53252A415970k8356k8862k9422k9502k9041k8723k9064k9665k9723k9026k8045
53241A096541k7140k6192k5057k3992k3338k2983k2533k1795k0875j9899j8919
53230H43818j8122j7698j7444j6838j5751j4719j4228j3976j3258j1957j0716
53219F79111j0107j0056j0241j0673j1573j2735j3418j2969j1577j0208r710j0048
53207E45796j0543j0775j0894j1086j1127j0774j0183r653r126q383p525o842
53195D28885o328n747n160m947n269n805o154o085n545m706m067m101m701n292
53181C54978n534n492n138m244k942j906j558j504j191p87r68j902k896l122k420
53166C13374j394q74j263k222k963k893k053r50j85j71r25j899k321j964j429
$$ y = [1415970, 1387614, 1358752, 1329330, 1299828, 1270787, 1242064, 1213000, 1183335, 1153612, 1124586, 1096541, 1069401, 1043209, 1018152, 994160, 970822, 947839, 925306, 903511, 882636, 862737, 843818, 825696, 807998, 790554, 773716, 757965, 743246, 729018, 715042, 701784, 689827, 679111, 669004, 658948, 648707, 638034, 626461, 613726, 600308, 587339, 575762, 565554, 555844, 545796, 535253, 524478, 513584, 502498, 491371, 480597, 470414, 460761, 451635, 443252, 435727, 428885, 422557, 416810, 411650, 406703, 401434, 395629, 389475, 383390, 377845, 373139, 369072, 364971, 360270, 354978, 349444, 343952, 338814, 334570, 331628, 329722, 328164, 326660, 325469, 324682, 323714, 321812, 318916, 315794, 313374, 311980, 311106, 309843, 307621, 304658, 301765, 299712, 298762, 298577, 298406, 297481, 295582, 293261, 291297, 289868]
53151B89868j409j846k107j868j396r50l64N14J243J102M4j035j187m97J00N4
53135B80266j26L27J312J972J802J137M66j19n74m47N87J978K618J957N45o15
53119B93086r11l40O80J512J581Q20k14q91j129j265j400j214n13L58Q79R42P99
53102B92780N49Nr16j972k821l198k860j782n33j9n04j206j205n03J80L89K48
53085B76632kk02j51J95L57j79j080j351o01M52J028J219J459J576J020j58j223
53068B78991j601j416j106r14p89n86k20J76L14N5l70n97n32l92l99o02r23j209
53050B67880j257r29k84M82J125J338Q76j06r88j146m67O81J793K380K065R52
53034B74395k47q33q73r53j230j257q16l05j02k0J74J87l01q61p37O6P54Q34O15
$$ y = [289868, 288459, 286613, 284506, 282638, 281242, 280292, 279928, 280442, 281685, 282787, 282831, 281796, 280609, 280112, 280212, 280266, 280140, 280467, 281779, 283751, 285553, 286690, 287156, 287037, 286463, 286016, 286603, 288581, 291199, 293156, 293701, 293086, 292175, 291835, 292515, 294027, 295608, 296428, 296214, 295323, 294194, 292929, 291529, 290315, 289802, 290160, 291039, 291981, 292780, 293329, 293334, 292418, 290446, 287625, 284427, 281567, 279785, 279252, 279233, 278729, 277523, 276318, 275815, 275995, 276384, 276632, 276630, 276428, 276277, 276472, 276829, 276650, 275570, 274219, 273618, 274070, 275098, 276317, 277776, 279352, 280372, 280214, 278991, 277390, 275974, 274868, 273954, 273165, 272579, 272359, 272535, 272849, 272904, 272534, 271937, 271405, 271013, 270614, 270012, 269089, 267880, 266623, 265694, 265410, 265892, 267017, 268355, 269231, 269125, 268137, 266991, 266524, 267205, 268998, 271378, 273443, 274395, 274148, 273315, 272442, 271489, 270259, 269002, 268186, 267881, 267779, 267759, 267933, 268120, 267819, 266958, 266221, 266287, 267041, 267875, 268490]
53015B68490M39R9n70j080q27L0P48R43R05R86J159J172Q25J69m01l89J72N29
52997B73399J30n49o32j90j63q78j444r53M32J902K893L102K268O30q37j319j008
52980B76783o27m36k44mL28J150K621L919L930K711J469J038J140J179J084R85
52964B97026P47K34l67p72q50o05j68Q6j29n62p25o55q27j333j697j686j591j521
52946B84605j140m15k7m74j324j825j836j618j163l42M82O52M7p20r51n00K51
52929B73702P77Q46O62N30M33J65j42j25J26%p96j771k252k028j189P5J166J253
52911B71432K99n35k40P32J134O16q7m17n55p11p04m83m38q18j315j463j138m51
52893B64858M72J362J807J651J231R62Q36N89K27O5K29L65P9m81p62n62l39n28
$$ y = [268490, 268929, 269028, 268458, 267378, 266551, 266581, 267329, 268272, 269177, 270163, 271322, 272494, 273319, 273488, 273087, 272698, 272870, 273399, 273529, 272980, 272348, 272158, 271995, 271117, 269673, 268720, 269152, 271054, 273947, 277049, 279317, 279947, 279110, 277791, 276783, 276156, 275720, 275476, 275472, 275800, 276950, 279571, 283490, 287420, 290131, 291600, 292638, 293778, 294957, 296041, 297026, 297773, 298007, 297640, 296868, 296018, 295413, 295245, 295331, 295202, 294640, 293915, 293260, 292433, 291100, 289403, 287717, 286126, 284605, 283465, 283050, 283023, 282549, 281225, 279400, 277564, 275946, 274783, 274441, 274923, 275575, 275622, 274902, 273951, 273451, 273702, 274479, 275325, 275987, 276517, 276950, 277115, 276973, 276848, 276974, 276974, 276178, 274407, 272155, 270127, 268938, 269013, 270179, 271432, 271731, 271196, 270956, 271688, 272822, 273438, 273351, 272934, 272379, 271668, 270964, 270481, 270043, 269225, 267910, 266447, 265309, 264858, 265330, 266692, 268499, 270150, 271381, 272343, 273179, 273768, 273995, 274060, 274289, 274654, 274733, 274252, 273490, 272928, 272589, 272061]
52875B72061q30o13J01O12N82M84P78J153J078O62N00Q16J290J599J689J572J267
52858B84801R61Q65R23Q78O08J90k99q52j447k099k820l416l487k856j807q20
52842B69323k03k07j047k457l556l614k805j842j089m68MJ34j2q6J96R02J933
52825B55106K825K820J664J81n39l93j55k85n37o99r09j039n86N17J549J870J694
52808B63084J621J826K067K132J930J408P25K08p0m43j109j761k087k260k543
52793B64728k704k320j545j041j125j441j501j223p52j68M48Q74R46P86O80P04
52777B55346P43P60Q96J197J412J176L96o72j561j817j250j62P11Q03K29m25p75
52760B57007p96n02J52Q79J102N85k48p76o99rJ039J779J534N56K7O01J461J490
$$ y = [272061, 271231, 270618, 270719, 271331, 271913, 272397, 273175, 274328, 275406, 276068, 276568, 277384, 278674, 280273, 281962, 283534, 284801, 285762, 286627, 287550, 288428, 289036, 289226, 288927, 288075, 286628, 284529, 281709, 278293, 274806, 271950, 270143, 269323, 269120, 268913, 267866, 265409, 261853, 258239, 255434, 253592, 252503, 252035, 252039, 252173, 252161, 252075, 252271, 253173, 255106, 257931, 260751, 262415, 262596, 262057, 261664, 261509, 261224, 260687, 259988, 259079, 258040, 257454, 257971, 259520, 261390, 263084, 264705, 266531, 268598, 270730, 272660, 274068, 274793, 275001, 274931, 274488, 273379, 271618, 269531, 267271, 264728, 262024, 259704, 258159, 257118, 255993, 254552, 253051, 251828, 251076, 250908, 251356, 252230, 253176, 253962, 254642, 255346, 256089, 256849, 257745, 258942, 260354, 261530, 261926, 261254, 259693, 257876, 256626, 256464, 257175, 257978, 258207, 257782, 257007, 256211, 255709, 255861, 256740, 257842, 258427, 258179, 257403, 256704, 256695, 257734, 259513, 261047, 261603, 261630, 262231, 263692, 265182]
52742B65182Q72O65J102J330Q43K02J00M60P99Q61N89nn90o52j58L61O01Q63J326
52723B74751J545J182O75O54R14P09j48j054j480j503j442j428j457j544j608
52708B68766j464j045n47j94n2r7k83m11j54N73J398J837J769J401P81k10j287
52691B70781j647q50M16R74N52j6J6M33O61O34N94M73P1l53k60M12J118J387J206
52672B76602P64K25j95k77n0K34M31N40M77J53k04j43M00Q85P77K25r2K37Q36
52653B81825J020P32P24J467K247J895M21q26q93k85Q7K19N26P18K19o42r52o17
52635B87885m16o39o80j48M87P51Q16R93J173J243J401J730J892J659J232P56
52619C00135m8j309k467k733j970q76m17j071k332l004k359r85m5J50K47N36M65
$$ y = [265182, 266054, 266719, 267821, 269151, 269994, 270196, 270296, 270756, 271555, 272416, 273005, 273000, 272410, 271758, 271600, 271961, 272562, 273425, 274751, 276296, 277478, 278153, 278807, 279721, 280430, 280282, 279228, 277748, 276245, 274803, 273375, 271918, 270374, 268766, 267302, 266257, 265710, 265516, 265464, 265367, 265084, 264673, 264519, 265092, 266490, 268327, 270096, 271497, 272278, 272068, 270781, 269134, 268284, 268700, 269674, 270226, 270210, 270226, 270659, 271320, 271954, 272548, 273021, 273092, 272739, 272479, 272891, 274009, 275396, 276602, 277366, 277591, 277396, 277119, 277069, 277303, 277734, 278274, 278751, 278904, 278700, 278557, 278957, 279842, 280619, 280844, 280752, 280989, 281825, 282845, 283577, 284301, 285768, 288015, 289910, 290331, 289505, 288612, 288327, 288414, 288633, 289159, 289877, 290096, 289454, 288502, 287885, 287469, 286830, 286150, 286002, 286489, 287240, 288056, 289049, 290222, 291465, 292866, 294596, 296488, 298147, 299379, 300135, 300087, 298778, 296311, 293578, 291608, 290732, 290315, 289244, 286912, 283908, 281549, 280564, 280519, 280669, 280916, 281452, 281917]
52602B81917k57r16o88K29R49R87O26M12O57J182J362P15m41j205j042j30J103
52585B85460K236K680K079J009M81N40J64j080k183k019p36O88J573J686J023
52570B93601J33n6N97J036M62n22r58r84j212j344o56M72P72j03j115j279p62
52553B88082k21J51N76J097J425J171K65p55j099o10QJ41o6k88o95j382j720j149
52535B84931k55j32q26j346j111n80l51m11l64J06J097K240K749K223J260P26
52519B89956O58N34L63N47R66J118J148J692K707L390L422L266L084K388J136
52504C16375J49m5P2k9r8J49K16m78j552k086j779j175r08j175j646j719j127
52487C03144m52n48j259j356j71J340J769R89O8j81J15N10Q24J094J296J285Q82
$$ y = [281917, 281660, 280744, 280056, 280285, 281234, 282221, 282847, 283259, 283916, 285098, 286460, 287175, 286734, 285529, 284487, 284357, 285460, 287696, 290376, 292455, 293464, 293945, 294485, 294649, 293569, 291386, 289367, 288631, 289319, 290892, 292578, 293601, 293734, 293678, 294275, 295311, 295773, 295251, 294293, 293309, 292097, 290753, 290097, 290569, 291341, 291238, 290123, 288844, 288082, 287861, 288012, 288588, 289685, 291110, 292281, 292546, 291791, 290692, 290082, 290090, 290231, 290165, 289877, 289182, 287800, 286080, 284931, 284676, 284544, 283718, 282372, 281261, 280681, 280330, 279919, 279555, 279661, 280758, 282998, 285747, 287970, 289230, 289956, 290614, 291148, 291511, 292058, 293024, 294142, 295290, 296982, 299689, 303079, 306501, 309767, 312851, 315239, 316375, 316524, 316479, 316551, 316522, 316424, 316573, 316789, 316311, 314759, 312673, 310894, 309719, 308811, 307636, 305990, 304271, 303144, 302692, 302144, 300885, 299529, 299358, 300698, 302467, 303456, 303524, 303343, 303458, 303968, 304792, 305886, 307182, 308467, 309349]
52470C09349J45l99j63P57J567J799J832K074K190J700R32O50R19J020M70m71
52454C24371j286j714j652j158o49o98j350k002k127j865j657j599j451j146r24
52439C03093r33r94q48m92j17J71L46K38l10r92j100l38O58R31K36q34j533j408
52421B95774l78J080J906J376J97o5J093K396K456J558J156J969L294M103M160
52406C22075L953M003M444M960N070M646M129M030M317M551M514M365M123L392
52392C82572J929R5j467k549l484m573n636o220o089n363m280l060j936j122n64
52377C38253K0P96J577K125K412K453K153J610J324J627K098K064J588J320J388
52362C62808J172M11k67l43l11q34j515j320p6J243J758J564J250J154J306J636
$$ y = [309349, 309494, 309095, 308932, 309689, 311256, 313055, 314887, 316961, 319151, 320851, 321783, 322433, 323352, 324372, 324842, 324371, 323085, 321371, 319719, 318561, 317912, 317214, 315864, 313862, 311735, 309870, 308213, 306614, 305163, 304017, 303093, 302160, 301166, 300318, 299826, 299709, 299880, 300226, 300464, 300154, 299162, 298062, 297724, 298382, 299313, 299549, 298715, 297182, 295774, 295396, 296476, 298382, 299758, 299955, 299890, 300983, 303379, 305835, 307393, 308549, 310518, 313812, 317915, 322075, 326028, 330031, 334475, 339435, 344505, 349151, 353280, 357310, 361627, 366178, 370692, 375057, 379180, 382572, 384501, 384596, 383129, 380580, 377096, 372523, 366887, 360667, 354578, 349215, 344935, 341875, 339939, 338817, 338253, 338273, 339069, 340646, 342771, 345183, 347636, 349789, 351399, 352723, 354350, 356448, 358512, 360100, 361420, 362808, 363980, 364391, 364124, 363781, 363470, 362636, 361121, 359801, 359725, 360968, 362726, 364290, 365540, 366694, 368000, 369636]
52346C69636J944J945J651J439J559J769J694J357J147J464K446L834M910M989
52332D01784M217L650M133N361O493P306Q142Q867Q841Q091P706Q477R834J0796
52318E03698J1372J2186J3083J3141J2114J0962J0628J1019J1518J1938J2453
52307F34112J3051J3488J3628J3532J3410J3632J4434J5522J6316J6659J6824
52296G94608J6704J5747J3968J2340J1550J1077J0129Q931Q209P805O843N196
52284I23107L821L454L705L684L045K179J675J777K161K306K144K063K186K120
52270I59427J770J807K672L655L766L102K471K111J817J989L243M978N711N157
52256A003676M733N561P041Q011Q289Q360Q386Q379Q696R488J0131R928R096Q345
$$ y = [369636, 371580, 373525, 375176, 376615, 378174, 379943, 381637, 382994, 384141, 385605, 388051, 391885, 396795, 401784, 406001, 409651, 413784, 419145, 425638, 432944, 441086, 449953, 458794, 466885, 474591, 483068, 492902, 503698, 515070, 527256, 540339, 553480, 565594, 576556, 587184, 598203, 609721, 621659, 634112, 647163, 660651, 674279, 687811, 701221, 714853, 729287, 744809, 761125, 777784, 794608, 811312, 827059, 841027, 853367, 864917, 875994, 886123, 895054, 903263, 911068, 917911, 923107, 926928, 930382, 934087, 937771, 940816, 942995, 944670, 946447, 948608, 950914, 953058, 955121, 957307, 959427, 961197, 963004, 965676, 969331, 973097, 976199, 978670, 980781, 982598, 984587, 987830, 992808, 998519, 1003676, 1008409, 1013970, 1021011, 1029022, 1037311, 1045671, 1054057, 1062436, 1071132, 1080620, 1090751, 1100679, 1109775, 1118120]
52242A118120P821P097O039N101M643M459M016L107K214K094K759L083K019P7
52228A172649j205j297j254j950k803k908k504k448k801k958k845k987l495l769
52214A137425l309k272j229p80j314k668l942m087k788o94J090J746J308P15J033
52199A120234K375L837M582M566M139L525L058L289M299N318N599N302N054M965
52185A180142M628L786K486P60j309l358m967n962o331o117n665n530n804n929
52171A140830n509m853m407m158l946l832l661k918j558m15j39k85j28J98J85
52156A105404k5N5K99K17j38l27k97k50n3L86N84J38l54k8Q74J407J410J565K051
52137A112918K277J948J428R42L81l3J89R69J778K603L940N671P012P742Q596
$$ y = [1118120, 1125941, 1133038, 1139077, 1144178, 1148821, 1153280, 1157296, 1160403, 1162617, 1164711, 1167470, 1170553, 1172572, 1172649, 1171444, 1170147, 1168893, 1166943, 1164140, 1161232, 1158728, 1156280, 1153479, 1150521, 1147676, 1144689, 1141194, 1137425, 1134116, 1131844, 1130615, 1129835, 1128521, 1125853, 1121911, 1117824, 1115036, 1114342, 1115432, 1117178, 1118486, 1119201, 1120234, 1122609, 1126446, 1131028, 1135594, 1139733, 1143258, 1146316, 1149605, 1153904, 1159222, 1164821, 1170123, 1175177, 1180142, 1184770, 1188556, 1191042, 1191802, 1190493, 1187135, 1182168, 1176206, 1169875, 1163758, 1158093, 1152563, 1146759, 1140830, 1135321, 1130468, 1126061, 1121903, 1117957, 1114125, 1110464, 1107546, 1105988, 1105573, 1105434, 1105149, 1105021, 1105219, 1105404, 1105379, 1105434, 1105733, 1105950, 1105812, 1105485, 1105188, 1104938, 1104885, 1105271, 1105855, 1105993, 1105639, 1105611, 1106485, 1107892, 1109302, 1110867, 1112918, 1115195, 1117143, 1118571, 1119513, 1119894, 1119861, 1120050, 1121019, 1122797, 1125400, 1129340, 1135011, 1142023, 1149765, 1158361]
52122A158361J0131J1966J3468J4427J4911J5061J5237J5679J5944J5380J4125
52111A314690J2814J1471R777Q348Q398R819J0997J1050J0977J1881J3281J4165
52099A447668J4616J5239J5742J5324J4083J2800J1562R677P007M499L044K362
52087A573623J378n25k831m488n090n204n415n442m750l724l381l936m553m630
52073A521032m435m269l920l339k971k909k543j601p59o00o78k33P66J914L083
52058A498538M272N302O221P371Q575R015Q401P497O798N711L850K042J048K04
52044A574845j315k800l141k962l793n386n846m587l263l222l701l476k898l160
52030A525295m459n990p210q148q799r116r384r985j0819j1517j2101j2886j3783
$$ y = [1158361, 1168492, 1180458, 1193926, 1208353, 1223264, 1238325, 1253562, 1269241, 1285185, 1300565, 1314690, 1327504, 1338975, 1348752, 1357100, 1365498, 1375317, 1386314, 1397364, 1408341, 1420222, 1433503, 1447668, 1462284, 1477523, 1493265, 1508589, 1522672, 1535472, 1547034, 1556711, 1563718, 1568217, 1571261, 1573623, 1575001, 1574476, 1571645, 1567157, 1562067, 1556863, 1551448, 1546006, 1541256, 1537532, 1534151, 1530215, 1525662, 1521032, 1516597, 1512328, 1508408, 1505069, 1502098, 1499189, 1496646, 1495045, 1494286, 1493686, 1493008, 1492775, 1493541, 1495455, 1498538, 1502810, 1508112, 1514333, 1521704, 1530279, 1539294, 1547695, 1555192, 1561990, 1567701, 1571551, 1573593, 1574641, 1574845, 1573530, 1570730, 1567589, 1564627, 1560834, 1555448, 1549602, 1545015, 1541752, 1538530, 1534829, 1531353, 1528455, 1525295, 1520836, 1514846, 1507636, 1499488, 1490689, 1481573, 1472189, 1462204, 1451385, 1439868, 1427767, 1414881, 1401098]
52017A401098j4181j3672j2586j1634j1249j1295j1393j1297j0947j0341r611
52006A272892r201r625j0890j2453j3897j5333j6876j8141j8698j8763j8834j8817
51994A091364j8122j6637j5076j4233j4246j4772j5463j6149j6793j7382j7811
51983I14680j7917j7769j7654j7616j7309j6696j6433j6933j7419j6723j4946
51972G27265j3357j2515j1479r307o536m458l345k183j08K478M379M889M416L861
51958F84000L539K900J386p02k532l732m607n441o070o255n997n278l903j891
51944F45417K55K004L348M700O338Q125R733J1002J2001J2731J2825J1770R612
51931G49861P113M983L115J006j351l462n177o862q716j0360j1342j1581j1209
$$ y = [1401098, 1386917, 1373245, 1360659, 1349025, 1337776, 1326481, 1315088, 1303791, 1292844, 1282503, 1272892, 1263691, 1254066, 1243176, 1230723, 1216826, 1201493, 1184617, 1166476, 1147778, 1129015, 1110181, 1091364, 1073242, 1056605, 1041529, 1027296, 1013050, 998278, 982815, 966666, 949873, 932491, 914680, 896763, 878994, 861340, 843724, 826415, 809719, 793286, 776353, 758934, 742211, 727265, 713908, 701393, 689914, 680607, 674071, 669613, 666268, 664085, 663977, 666455, 670834, 675723, 680139, 684000, 687539, 690439, 691825, 691123, 688591, 684859, 680252, 674811, 668741, 662486, 656489, 651211, 647308, 645417, 645672, 647676, 651024, 655724, 662062, 670187, 679920, 690922, 702923, 715654, 728479, 740249, 749861, 756974, 761957, 765072, 766078, 764727, 761265, 756088, 749226, 740510, 730150, 718808, 707227, 696018]
51918F96018j0387r353q230o703m353j481R61K522L801N511P484R075J0162J1163
51904G06190J2295J3245J3487J2498R757N085r28p057j2192j5991j8849k1330
51892F96210k3486k4738k4544k3103k1094j8817j6028j2791r804p527n509l108
51880E05661m90J709L387M908O185O676O444O428P215Q099P951O682N198M047
51866E80100K716N02k360m879o352o856o745o148n131l949k782j477K1J156J167
51851E38983J17r74j261j065j449k984n118o690o992o347n711n618n675n275m527
51836D79414l990l616k687j032M18P94M49M13R83J594J769J564J071K18q02j426
51820D75134j402j210j505k210k443j393O97K512K832J804Q24R33J707J901R13
$$ y = [696018, 685631, 676278, 668048, 661345, 656992, 655511, 656472, 658994, 662795, 668306, 675790, 684865, 695027, 706190, 718485, 731730, 745217, 757715, 767472, 772557, 771629, 764572, 752380, 736389, 717540, 696210, 672724, 647986, 623442, 600339, 579245, 560428, 544400, 531609, 521805, 514278, 508769, 505661, 505171, 506880, 510267, 515175, 521360, 528036, 534480, 540908, 548123, 556222, 564173, 570855, 576053, 580100, 582816, 583318, 580958, 576079, 569727, 562871, 556126, 549978, 544847, 540898, 538116, 536639, 536660, 537816, 538983, 539100, 538126, 536865, 535800, 534351, 531367, 526249, 519559, 512567, 506220, 500509, 494891, 489216, 483941, 479414, 475424, 471808, 469121, 468089, 468507, 469301, 469750, 470163, 471146, 472740, 474509, 476073, 477144, 477362, 476560, 475134, 473732, 472522, 471017, 468807, 466364, 464971, 465668, 468180, 471012, 472816, 473640, 474573, 476280, 478181, 479094]
51805D79094q31k528l459l122j688l89n30j939k978k479j028pQ1k17l21j50J47
51788D57656M47O05N53M34M31N19O22O93M89m49k138l670l910k609n69J241K360
51771D52705K891L324M269N856P429Q215Q212P950P527O534M951L330J859M8k274
51756E22826m343n354n484n421n339m981m442m066l773l194k435k002k002k020
51742D67970j818j521j029L5J591K912L496L581L484L062K204J362J082J328J727
51727D89466K119K349J962P10p80j536j298n47L69J428K330K428J568L84m91j075
51711D99386j646k109k107j456l30P99J236N80o35j253p95J4M16P56J722K861
51695D97439K855J352l86j005n73j18k19n87p55n91l10l12r83k204l249l537l348
$$ y = [479094, 478263, 475735, 472276, 469154, 467466, 467077, 466547, 464608, 461630, 459151, 458123, 458116, 458197, 457980, 457659, 457509, 457656, 458103, 458708, 459261, 459695, 460126, 460645, 461267, 461960, 462449, 462000, 459862, 456192, 452282, 449673, 449104, 450345, 452705, 455596, 458920, 463189, 469045, 476474, 484689, 492901, 500851, 508378, 514912, 519863, 523193, 525052, 525100, 522826, 518483, 513129, 507645, 502224, 496885, 491904, 487462, 483396, 479623, 476429, 473994, 471992, 469990, 467970, 466152, 464631, 463602, 463637, 465228, 468140, 471636, 475217, 478701, 481763, 483967, 485329, 486411, 487739, 489466, 491585, 493934, 495896, 496606, 495826, 494290, 492992, 492445, 492814, 494242, 496572, 499000, 500568, 500952, 500461, 499386, 497740, 495631, 493524, 492068, 491738, 492537, 493773, 494353, 493718, 492465, 491670, 491684, 492100, 492856, 494578, 497439, 500294, 501646, 501260, 500255, 499682, 499564, 499345, 498758, 498003, 497412, 497102, 496790, 495807, 493603, 490354, 486817, 483469]
51678D83469l321l351k742j458m97n50r94p87N5O22N15L06N55J076J477J822K387
51661D78584L118L795M436N117N567N346M463L411K531J634M67o77j094m30Q82
51646E17150K043K592K620K344J824J129M57j85j218l004n134o708p331p473p697
51631D91409p889p541o496n105l774k678j858j329j094j108j222j188q66m76m06
51616D48379o93r84j068j195j614k071k034j293j89O45P39K25j43J80P54P71M69
51599D40878J122L116M972N124L988L230L445L774L637L484L676L815L719L950
51585D91930M752N298M774L542K454J608O57o1L42K057M212N877O956Q067R893
51570E52358J2658J5830J8350J9539J9786K0096K1140K3002K5555K8426L0746
$$ y = [483469, 480148, 476797, 474055, 472597, 472100, 471550, 470556, 469769, 469824, 470446, 470961, 471267, 471822, 472898, 474375, 476197, 478584, 481702, 485497, 489933, 495050, 500617, 505963, 510426, 513837, 516368, 518002, 518469, 517792, 516698, 516268, 517150, 519193, 521785, 524405, 526749, 528573, 529702, 530159, 529974, 528756, 525752, 520618, 513910, 506579, 499106, 491409, 483520, 475979, 469483, 464378, 460604, 457926, 456068, 454739, 453645, 452537, 451315, 450127, 449261, 448785, 448379, 447686, 446702, 445634, 444439, 442825, 440754, 438720, 437427, 437238, 437883, 438622, 438847, 438704, 438884, 439638, 440409, 440878, 442000, 445116, 450088, 455212, 459200, 462430, 465875, 469649, 473286, 476770, 480446, 484261, 487980, 491930, 496682, 501980, 506754, 510296, 512750, 514358, 515015, 514954, 515296, 517353, 521565, 527442, 534398, 542465, 552358, 565016, 580846, 599196, 618735, 638521, 658617, 679757, 702759, 728314, 756740, 787486]
51559G87486L1702L1549L1546L2564L4216L5494L5745L4636L1689K6555J9655
51548A132837J1962M001m438j3500k2512l0321l6243m0424m3341m5167m5660m4544
51536H22650m1946l8479l4858l1405k8004k4568k1333j8517j5822j2740r368o539
51524E39071m922m331m156m123m228m181l572k559j864j879k149j968j178j79
51510D97782N73Q90Q56O90N29J81o56j889l027l747m179m493m550m229l743l333
51494D67655k897k345k050k415l095l178k294j215j042j999l192l498k656j454
51480D34325q99j302k170k921l352l455l177k602k058j743j500j184r99j130j275
51465D04558j044n82l55l89k62J74O41R48J114R76L58k48R9J475K737K936K528
$$ y = [787486, 819188, 850737, 882283, 914847, 949063, 984557, 1020302, 1054938, 1086627, 1113182, 1132837, 1144799, 1148800, 1144362, 1130862, 1108350, 1078029, 1041786, 1001362, 958021, 912854, 867194, 822650, 780704, 742225, 707367, 675962, 647958, 623390, 602057, 583540, 567718, 554978, 545610, 539071, 534149, 529818, 525662, 521539, 517311, 513130, 509558, 506999, 505135, 503256, 501107, 499139, 497961, 497782, 498355, 499245, 500101, 500791, 501320, 501501, 500845, 498956, 495929, 492182, 488003, 483510, 478960, 474731, 470988, 467655, 464758, 462413, 460363, 457948, 454853, 451675, 449381, 448166, 447124, 445125, 441933, 438435, 435779, 434325, 433426, 432124, 429954, 427033, 423681, 420226, 417049, 414447, 412389, 410646, 409146, 407962, 406963, 405833, 404558, 403514, 402932, 402577, 402188, 401926, 402100, 402741, 403689, 404803, 405779, 406137, 405889, 405988, 407463, 410200, 413136, 415664]
51448D15664K519L060L641M276N430O925P967Q391Q918R845J0456J0188R499Q850
51434E15629P616N087K018l2q24j660l285m716m807m038l858m735n885o669p275
51419D82566p815p654o225m052k408j983k244k141j234J5R26J400J855K549L170
51404D56725L291K957K568K330K133J933J924K224K688L151L634M203M710M917
51390D99388M809M746N254O696R073J2175J5828J9887K3962K7556L0657L3951
51378F93982L8011M2445M6289M9203N1696N3986N5134N3786M9532M3211L5932
51367A213207K8006J8900Q074m191j6706k8081l7470m4688m9885n3314n5230n5666
51355I22956n4420n1535m7646m3495l9207l4509k9609k5261k1889j9221j6919
$$ y = [415664, 418183, 421243, 424884, 429160, 434590, 441515, 449482, 457873, 466791, 476636, 487092, 497280, 506779, 515629, 523245, 528332, 530350, 530318, 529494, 527834, 524549, 519833, 515026, 510988, 507130, 502395, 496510, 489841, 482566, 474751, 467097, 460872, 456820, 454412, 452429, 450185, 448044, 446810, 446825, 447751, 449151, 451006, 453555, 456725, 460016, 462973, 465541, 467871, 470004, 471937, 473861, 476085, 478773, 481924, 485558, 489761, 494471, 499388, 504197, 508943, 514197, 520893, 529966, 542141, 557969, 577856, 601818, 629374, 660031, 693982, 731993, 774438, 820727, 869930, 921626, 975612, 1030746, 1084532, 1134064, 1177275, 1213207, 1241213, 1260113, 1268187, 1263996, 1247290, 1219209, 1181739, 1137051, 1087166, 1033852, 978622, 922956, 868536, 817001, 769355, 725860, 686653, 652144, 622535, 597274, 575385, 556164, 539245]
51344E39245j5002j3413j1771r911q245p146o455n893n529n371n080m506m113
51331D36810m228m357l861k997k483k371k176j868j852k001j674p96m6J87K32
51316D06519L20J78j88j28O82J643K172K559L245L869L892L666L935M512M450
51301D41326L486K354J477L21j509l362m366m697n145n810n939n152m081l490
51287D05413l243k595j253K57J247J556J491J383J337J319J314J407J769K492
51273D13894L406M183M670M929M843L973K190K66o98n03o5j75n15l20M10R98J179
51256D42665J289J282M55j367l017l193k145j325j459j759j301l34K58K13m8k56
51240D29958m96p12o45l66l34p47j265j538j727k138k609k597j861q40k20k05
$$ y = [539245, 524243, 510830, 499059, 489148, 480903, 473757, 467302, 461409, 455880, 450509, 445429, 440923, 436810, 432582, 428225, 424364, 421367, 418884, 416513, 414337, 412469, 410617, 408616, 406942, 406146, 406100, 406287, 406519, 406839, 407017, 406829, 406701, 407383, 409026, 411198, 413757, 417002, 420871, 424763, 428429, 432364, 436876, 441326, 444812, 447166, 448643, 448964, 447455, 444093, 439727, 435030, 429885, 424075, 418136, 412984, 408903, 405413, 402170, 399575, 398322, 398579, 399826, 401382, 402873, 404256, 405593, 406912, 408226, 409633, 411402, 413894, 417300, 421483, 426153, 431082, 435925, 439898, 442088, 442354, 441656, 441153, 441088, 440913, 440398, 440078, 440488, 441486, 442665, 443954, 445236, 445691, 444324, 441307, 438114, 435969, 434644, 433185, 431426, 430125, 429791, 430049, 430262, 430214, 429958, 429462, 428750, 428105, 427739, 427405, 426658, 425393, 423855, 422128, 419990, 417381, 414784, 412923, 412083, 411863, 411658]
51224D11658l10l4M30M25j95p22m87L22J051J492J856K127K131K115K626L633
51208D28118M462M682M490M115L472K675K218K278K341J926J212O05J81j16k14
51193D62445k80p24j424j590r61m16p05j201r35k73l46j109j290l85O08P49L75
51176D52538K20K55Q3k18l76n63j009j396j304r89j035j336j124j60P61P64k4
51159D45087p10p34l33j0L7j92p05j236j107K9J488K182K006J788J786J222k03
51142D50395j380j243l94j53o40j016j210j898k878l080k440k227k967l425k525
51127D22919r70O5P54J881L088L339K716K306K428K338J826J815K908M300M784
51112D56497M190L268K641K394K450K713K970L008K875K755K621K260J653J148
$$ y = [411658, 411348, 411314, 411744, 412169, 411974, 411252, 410765, 411087, 412138, 413630, 415486, 417613, 419744, 421859, 424485, 428118, 432580, 437262, 441752, 445867, 449339, 452014, 454232, 456510, 458851, 460777, 461989, 462594, 462775, 462659, 462445, 462165, 461441, 460017, 458427, 457466, 457050, 456345, 455144, 454209, 453936, 453590, 452481, 451191, 450806, 451414, 452163, 452538, 452758, 453013, 453096, 452878, 452502, 451939, 450930, 449534, 448230, 447241, 446206, 444870, 443746, 443586, 444347, 445111, 445087, 444377, 443643, 443310, 443300, 443337, 443145, 442440, 441204, 440097, 440126, 441614, 443796, 445802, 447590, 449376, 450598, 450395, 449015, 447772, 447378, 447225, 446585, 445569, 444359, 442461, 439583, 436503, 434063, 431836, 428869, 425444, 422919, 421949, 422014, 422768, 424649, 427737, 431076, 433792, 436098, 438526, 440864, 442690, 444505, 447413, 451713, 456497, 460687, 463955, 466596, 468990, 471440, 474153, 477123, 480131, 483006, 485761, 488382, 490642, 492295, 493443]
51098D93443J142J648K220K280J534K02j106j742j570j193j393k197k705k156
51084D88407r45j45j77n09o21o39p82p70k42O63J496K002K096J663Q15R3M8P70
51066D93223J974L341M444M808M494M284M828N824O562P020P764Q930R991J0692
51052E78179J1503J2895J4560J5699J5807J4926J3398J1668J0231R487R455R553
51040G27361Q830O691L555N56j582l196n046p363r818j2040j3662j4052j2727
51027F67507j0129p557o131o021o645p198o990n773l953k220q31N49K256M160
51013F11024N841O939P394P573Q141R372J0597J0811R932Q955Q728R067R377R605
50999G33356J0098J0881J1581J1922J1828J1188R884Q155O546N402M596L838L098
$$ y = [493443, 494585, 496233, 498453, 500733, 502267, 502469, 501363, 499621, 498051, 496858, 495465, 493268, 490563, 488407, 487462, 487317, 487140, 486631, 486010, 485371, 484589, 483819, 483577, 484240, 485736, 487738, 489834, 491497, 492312, 492405, 492453, 493223, 495197, 498538, 502982, 507790, 512284, 516568, 521396, 527220, 533782, 540802, 548566, 557496, 567487, 578179, 589682, 602577, 617137, 632836, 648643, 663569, 676967, 688635, 698866, 708353, 717808, 727361, 736191, 742882, 746437, 746993, 745411, 742215, 737169, 729806, 719988, 707948, 694286, 680234, 667507, 657378, 649821, 643690, 637669, 631024, 623826, 616836, 611063, 607110, 604890, 604059, 604608, 606864, 611024, 616865, 623804, 631198, 638771, 646912, 656284, 666881, 677692, 687624, 696579, 705307, 714374, 723751, 733356, 743454, 754335, 765916, 777838, 789666, 800854, 810738, 818893, 825439, 830841, 835437, 839275, 842373]
50986H42373K578K317J966J125k4o35p0J277K427L177M429O945J0224J3168J5469
50971I06746J7800K0670K3798K6691K9281L1695L3826L5515L7001L8793M1206
50960A243022M4137M7208M9923N1774N2525N2457N2122N1770N1057M9421M6609
50949A792025M2898L8871L5080L1808K8964K6136K2886J9111J5223J1850R309
50938B074161P309N411L665K627K453K178K88l860r355j4598j8629k1554k4004
50925B006092k6534k9407l2589l5775l8580m0811m2599m4323m6403m8881n1103
50914A569087n2054n1320m9534m7500m5185m2080l8396l5103l2669l0465k7884
50903A116897k5383k3820k3031k1847j9485j6441j3870j2412j1707j0870r395
$$ y = [842373, 844951, 847268, 849234, 850359, 850335, 849700, 849630, 850907, 853334, 856511, 860940, 867885, 878109, 891277, 906746, 924546, 945216, 969014, 995705, 1024986, 1056681, 1090507, 1126022, 1163023, 1201816, 1243022, 1287159, 1334367, 1384290, 1436064, 1488589, 1541046, 1593168, 1644938, 1695995, 1745416, 1792025, 1834923, 1873794, 1908874, 1940682, 1969646, 1995782, 2018668, 2037779, 2053002, 2064852, 2074161, 2081470, 2086881, 2090546, 2093173, 2095626, 2097804, 2098092, 2094232, 2084877, 2070279, 2051650, 2030096, 2006092, 1979558, 1950151, 1917562, 1881787, 1843207, 1802396, 1759797, 1715474, 1669071, 1620190, 1569087, 1517033, 1465713, 1416179, 1368679, 1323494, 1281414, 1243018, 1207915, 1175246, 1144781, 1116897, 1091514, 1067694, 1044663, 1022816, 1003331, 986890, 973020, 960608, 948901, 938031, 928636]
50892I28636p681o606o435o409n621m070k507j364l99O68J607K015J923J810K169
50877H97736L142M451N644O475P105P870Q871R994J1183J2509J3965J5462J6980
50864A021387J8521J9919K1035K2166K3993K6877L0490L4238L7865M1579M5731
50853A343801N0594N6164O2009O7467P2328P7256Q3196R0237R7278J03017J07145
50842B210492J10370J13378J16016J17586J17671J16402J13999J10409J05392
50833C231715R8724R0200P9802O8068N6059M4637L3942K3830J4664P184J592k747
50821C747670o451r311j0678j0547r844r518r680j0023j0912j3594j9033k6870
50809C601209l5866m5227n5031o5452p6112q6309r5449j03008j08539j11977j13647
$$ y = [928636, 920955, 914349, 907914, 901505, 895884, 891814, 889307, 887943, 887544, 888212, 889819, 891834, 893757, 895567, 897736, 900878, 905329, 910973, 917448, 924553, 932423, 941294, 951288, 962471, 974980, 988945, 1004407, 1021387, 1039908, 1059827, 1080862, 1103028, 1127021, 1153898, 1184388, 1218626, 1256491, 1298070, 1343801, 1394395, 1450559, 1512568, 1580035, 1652363, 1729619, 1812815, 1903052, 2000330, 2103347, 2210492, 2320862, 2434240, 2550256, 2667842, 2785513, 2901915, 3015914, 3126323, 3231715, 3330439, 3420639, 3500441, 3568509, 3624568, 3669205, 3703147, 3726977, 3741641, 3748825, 3750417, 3747670, 3741219, 3731908, 3721230, 3710683, 3700839, 3691321, 3681641, 3671618, 3660706, 3647112, 3628079, 3601209, 3565343, 3520116, 3465085, 3399633, 3323521, 3237212, 3141763, 3038755, 2930216, 2818239, 2704592]
50798B704592j13676j11818j08051j02926r6879q9646q0989p1601o2656n4621
50788A811729m7106l9782l2757k6168k0114j5015j1320q749o492m344k942k618
50776A594322k822l093l930n957q732j1129j2678j3797j4876j5856j6802j8110
50764A466540j9785k1056k1297k1027k1397k2614k3490k2910k1246j9754j8843
50753A233121j7711j5715j3312j1126q926o252l472j283O12L261O905J0656J3910
50740A190668J7141K0908K4932K8789L2703L6988M1300M5180M8921N3058N7311
50729A597899O0816O3277O5148O6681O7499O7236O5954O3726O0406N6133N1697
50718B286472M7896M4667M1084L6204K9826K2559J5233Q312J818m277r804j4574
$$ y = [2704592, 2590916, 2479098, 2371047, 2268121, 2171242, 2081596, 2000607, 1929006, 1866350, 1811729, 1764623, 1724841, 1692084, 1665916, 1645802, 1630787, 1619467, 1610718, 1604226, 1599882, 1596940, 1594322, 1591500, 1588407, 1584477, 1578520, 1569788, 1558659, 1545981, 1532184, 1517308, 1501452, 1484650, 1466540, 1446755, 1425699, 1404402, 1383375, 1361978, 1339364, 1315874, 1292964, 1271718, 1251964, 1233121, 1215410, 1199695, 1186383, 1175257, 1166331, 1160079, 1156607, 1155324, 1155936, 1159197, 1166102, 1176758, 1190668, 1207809, 1228717, 1253649, 1282438, 1315141, 1352129, 1393429, 1438609, 1487530, 1540588, 1597899, 1658715, 1721992, 1787140, 1853821, 1921320, 1988556, 2054510, 2118236, 2178642, 2234775, 2286472, 2334368, 2379035, 2420119, 2456323, 2486149, 2508708, 2523941, 2532253, 2534071, 2529794, 2519990, 2505416]
50706B505416j8455k1028k1490j9446j5739j2042r478p910o672n635n327o205
50694B355989q144j0747j3942j8138k3681l0215l6755m2440m7032n0572n2875
50683B021448n3672n3059n1384m8645m4387l8369l1111k3666j6917j1120n969
50672A643149r81L949Q354J1699J4183J6834K0518K4960K8917L1329L2145L2042
50660A867098L1594L0776K9181K6554K3154J9711J6986J5237J4097J3015J1894
50649B099297J1126J1013J1362J1811J2292J2975J3858J4793J5889J7548K0028
50638B251992K3215K6746L0107L2714L4360L5692L7653M0193M2024M1981M0134
50627B636811L7150L3242K8520K3926K0570J8081J4835J0271N913L130N75m894
$$ y = [2505416, 2486961, 2465933, 2444443, 2424997, 2409258, 2397216, 2387738, 2379828, 2373156, 2367521, 2362194, 2355989, 2347845, 2337098, 2323156, 2305018, 2281337, 2251122, 2214367, 2171927, 2124895, 2074323, 2021448, 1967776, 1914717, 1863333, 1814688, 1770301, 1731932, 1700821, 1677155, 1660238, 1649118, 1643149, 1642168, 1646117, 1654471, 1666170, 1680353, 1697187, 1717705, 1742665, 1771582, 1802911, 1835056, 1867098, 1898692, 1929468, 1958649, 1985203, 2008357, 2028068, 2045054, 2060291, 2074388, 2087403, 2099297, 2110423, 2121436, 2132798, 2144609, 2156901, 2169876, 2183734, 2198527, 2214416, 2231964, 2251992, 2275207, 2301953, 2332060, 2364774, 2399134, 2434826, 2472479, 2512672, 2554696, 2596677, 2636811, 2673961, 2707203, 2735723, 2759649, 2780219, 2798300, 2813135, 2823406, 2829319, 2832449, 2833024, 2828130]
50615B828130j4659k6651l7231m3956m6314m4896m0929l6113l1792k8008k4003
50604B453578j9818j6687j5570j5936j6602j7380j9139k2475k7044l2269l7968
50593B212690m3928m9490n3924n7033n8925n9525n8753n6970n4783n2417m9678
50582A617264m6524m3234l9942l6410l2533k8731k5553k3035k0827j8735j6740
50571A285000j4579j1820q588n646l375j020K392O601J0253J2602J4324J6356
50559A302500J8592K0331K1500K2756K4512K6531K8469L0238L1829L3245L4647
50548A595150L6091L7102L7092L6278L5761L6379L7863L9211L9673L9248L8687
50537B008535L9121M1281M4857M8904N2870N6948O1375O6037P0838P5895Q1063
$$ y = [2828130, 2813471, 2786820, 2749589, 2705633, 2659319, 2614423, 2573494, 2537381, 2505589, 2477581, 2453578, 2433760, 2417073, 2401503, 2385567, 2368965, 2351585, 2332446, 2309971, 2282927, 2250658, 2212690, 2168762, 2119272, 2065348, 2008315, 1949390, 1889865, 1831112, 1774142, 1719359, 1666942, 1617264, 1570740, 1527506, 1487564, 1451154, 1418621, 1389890, 1364337, 1341302, 1320475, 1301740, 1285000, 1270421, 1258601, 1250013, 1244367, 1240992, 1239972, 1242364, 1248965, 1259218, 1271820, 1286144, 1302500, 1321092, 1341423, 1362923, 1385679, 1410191, 1436722, 1465191, 1495429, 1527258, 1560503, 1595150, 1631241, 1668343, 1705435, 1741713, 1777474, 1813853, 1851716, 1890927, 1930600, 1969848, 2008535, 2047656, 2088937, 2133794, 2182698, 2235568, 2292516, 2353891, 2419928, 2490766, 2566661, 2647724]
50526B647724Q5819Q9951R3837R7770J01420J04338J06449J07685J07594J05769
50516C648356J02170R6634Q8680P8429O7069N5641M3786L0512J5909J071j3377
50505D214880k7627m1486n3947o4267p2646p9290q3523q4460q2173p7601p1535
50494C476325o4117n5289m5360l5059k5198j6346q784k740J533L858M143K169
50482C235135k384r450j8457k8989m1262n5491p0886q5671r8055j06933j12054
50471B605503j14036j13984j12496j09159j03467r6041q8217q0698p3330o6136
50461A647939n9545n3490m7336m1035l5470l1149k7350k3205j8916j5215j2168
50450A283060r273o384l801j675LJ008J200J106J618L011M782O394P680Q514Q767
$$ y = [2647724, 2733543, 2823494, 2917331, 3015101, 3116521, 3220859, 3327308, 3434993, 3542587, 3648356, 3750526, 3847160, 3935840, 4014269, 4081338, 4136979, 4180765, 4211277, 4227186, 4228257, 4214880, 4187253, 4145767, 4091820, 4027553, 3954907, 3875617, 3792094, 3707634, 3625461, 3547860, 3476325, 3412208, 3356919, 3311559, 3276500, 3251302, 3234956, 3226172, 3223432, 3224965, 3228823, 3232966, 3235135, 3232751, 3223301, 3204844, 3175855, 3134593, 3079102, 3008216, 2922545, 2824490, 2717557, 2605503, 2491467, 2377483, 2264987, 2155828, 2052361, 1956320, 1868103, 1787405, 1714075, 1647939, 1588394, 1534904, 1487568, 1446533, 1411063, 1379914, 1352564, 1329359, 1310443, 1295228, 1283060, 1273787, 1267403, 1263602, 1261927, 1261930, 1262938, 1264138, 1265244, 1266862, 1269873, 1274655, 1281049, 1288729, 1297243, 1306010]
50435A306010Q726R095J0136J1246J1699J1558J1512J1926J2478J2810J3165J4046
50423A444407J5467J6863J7873J8816K0199K2021K3885K5617K7386K9274L1190
50412A692998L3207L5579L8376M1446M4812M8594N2402N5309N6730N7014N6794
50401B213261N6125N4559N1791M7890M3076L7607L1640K4933J7051Q176o26q454
50389B577029j5625k3139l1235l9088m5824n1206n5249n7747n8446n7298n4369
50378B087803m9783m3967l7617l1260k5089j9260j4058r653o024l263j561q14
50366A845454p10j463l918q504j4516k0930k7535l4498m1153m6191m9201n1085
50354A545750n2600n3299n2443n0252m7445m4119m0035l5798l2553l0371k7957
$$ y = [1306010, 1314736, 1323831, 1333967, 1345213, 1356912, 1368470, 1379982, 1391908, 1404386, 1417196, 1430361, 1444407, 1459874, 1476737, 1494610, 1513426, 1533625, 1555646, 1579531, 1605148, 1632534, 1661808, 1692998, 1726205, 1761784, 1800160, 1841606, 1886418, 1935012, 1987414, 2042723, 2099453, 2156467, 2213261, 2269386, 2323945, 2375736, 2423626, 2466702, 2504309, 2535949, 2560882, 2577933, 2586109, 2585483, 2577029, 2561404, 2538265, 2507030, 2467942, 2422118, 2370912, 2315663, 2257916, 2199470, 2142172, 2087803, 2038020, 1994053, 1956436, 1925176, 1900087, 1880827, 1866769, 1857116, 1851092, 1847829, 1846268, 1845454, 1844744, 1843281, 1839363, 1830859, 1816343, 1795413, 1767878, 1733380, 1692227, 1646036, 1596835, 1545750, 1493150, 1439851, 1387408, 1337156, 1289711, 1245592, 1205557, 1169759, 1137206, 1106835, 1078878]
50343A078878k4320j9965j5887j2297q965o243m663l740k246K87K980M741N403
50330I93963N515N499N273M398K493k84l100n176o598p917q980q838p047m440
50316I64761k208o47P01K072L238M021M506M827N073N352N632N660N294M890M999
50301A018171N733O688P349P366O579N187L859L271L444L827M079M453N263O229
50287A091498O625O076M965L907K839Q96k514o616r688j0736j0316r496q522o985
50273A051933m852k498L7K983N872P578P750P510Q050R007R004P599N926N250
50259A121149N592O005N828N242M895N305O461P782Q613Q910R249R975J0700J0951
50245A226657J1066J1830J3373J5026J6303J7412J8648J9840K0805K1725K2569
$$ y = [1078878, 1054558, 1034593, 1018706, 1006409, 997444, 991201, 986538, 982798, 980552, 980839, 983819, 988560, 993963, 999478, 1004977, 1010250, 1014648, 1017141, 1016857, 1013757, 1008581, 1001983, 994066, 985086, 976248, 969201, 964761, 962553, 961906, 962607, 964679, 967917, 971938, 976444, 981271, 986344, 991696, 997328, 1002988, 1008282, 1013172, 1018171, 1023904, 1030592, 1037941, 1045307, 1051886, 1057073, 1060932, 1064203, 1067647, 1071474, 1075553, 1080006, 1085269, 1091498, 1098123, 1104199, 1109164, 1113071, 1115910, 1116806, 1114292, 1107676, 1097988, 1087252, 1076936, 1067440, 1058918, 1051933, 1047081, 1044583, 1044620, 1047603, 1053475, 1061053, 1068803, 1076313, 1084363, 1093370, 1102374, 1109973, 1115899, 1121149, 1126741, 1132746, 1138574, 1143816, 1148711, 1154016, 1160477, 1168259, 1176872, 1185782, 1195031, 1205006, 1215706, 1226657, 1237723, 1249553, 1262926, 1277952, 1294255, 1311667, 1330315, 1350155, 1370960, 1392685, 1415254]
50234A415254K2607K1186J8830J6735J5328J3921J1881R433P134N088L018O85
50222A561100k113n626r816j4203j8254k1823k4956k7466k8903k8871k7325k4750
50210A326994k2116k0351j9597j9284j9050j9379k0990k3831k6920k9026k9388
50199A077062k8037k5757k3552k1795k0049j7943j5944j4877j4714j4409j3016
50188H66969j0726q616p527p352p307o794n925n205m777m252l278k100j278j007
50174G90825r67p82m08J6N01J251K291L149L092J935M63j54M92J711K568K809
50158H08792K884L276M049M901N517N823N974O014N794N326N053N377O053O461
50144H81294O377O002N320M240L356L721N421P220Q167Q876J0522J3175J6029
$$ y = [1415254, 1437861, 1459047, 1477877, 1494612, 1509940, 1523861, 1535742, 1545175, 1552309, 1557397, 1560415, 1561100, 1558987, 1553361, 1543545, 1529342, 1511088, 1489265, 1464309, 1436843, 1407940, 1379069, 1351744, 1326994, 1304878, 1284527, 1264930, 1245646, 1226596, 1207217, 1186227, 1162396, 1135476, 1106450, 1077062, 1049025, 1023268, 999716, 977921, 957872, 939929, 923985, 909108, 894394, 879985, 866969, 856243, 847627, 840100, 832748, 825441, 818647, 812722, 807517, 802740, 798488, 795210, 793110, 791832, 790825, 789858, 789076, 788668, 788684, 789185, 790436, 792727, 795876, 798968, 800903, 801366, 801212, 801704, 803415, 805983, 808792, 811676, 814952, 819001, 823902, 829419, 835242, 841216, 847230, 853024, 858350, 863403, 868780, 874833, 881294, 887671, 893673, 898993, 903233, 906589, 910310, 915731, 922951, 931118, 939994, 950516, 963691, 979720]
50131I79720J8790K1824K5145K8254L1096L4241L7909M1509M4417M6661M8580
50120A358146N0300N1752N2765N2891N1536M8585M4576M0155L5612L1035K6539
50109A843892K2125J7586J2715P341J118o291j4705k3359l1512l8808m4989m9718
50097A695395n2913n4844n5598n4823n2368m8824m5011m1128l6897l2461k8611
50086A191917k5933k4127k2390k0301j8088j6153j4588j3278j2186j1292j0328
50075A003253q914p075n357m230l551k886k162j630j288p27K77J394K111K346
50061I71561K433K580K638K423K145K260K796L081K455J209L68M60Q90Q05K10
50046I98314k12j10K00L09J71J0P3N10J225J975K758L938N616P120P663P387P274
$$ y = [979720, 998510, 1020334, 1045479, 1073733, 1104829, 1139070, 1176979, 1218488, 1262905, 1309566, 1358146, 1408446, 1460198, 1512963, 1565854, 1617390, 1665975, 1710551, 1750706, 1786318, 1817353, 1843892, 1866017, 1883603, 1896318, 1903659, 1904777, 1898486, 1883781, 1860422, 1828910, 1790102, 1745113, 1695395, 1642482, 1587638, 1532040, 1477217, 1424849, 1376025, 1331014, 1289886, 1252989, 1220528, 1191917, 1165984, 1141857, 1119467, 1099166, 1081078, 1064925, 1050337, 1037059, 1024873, 1013581, 1003253, 994339, 987264, 981907, 977677, 974126, 971240, 969078, 967448, 966160, 965433, 965710, 967104, 969215, 971561, 973994, 976574, 979212, 981635, 983780, 986040, 988836, 991917, 994372, 995581, 995949, 996409, 997299, 998104, 998314, 998102, 997992, 998192, 998501, 998672, 998682, 998755, 999265, 1000490, 1002465, 1005223, 1009161, 1014777, 1021897, 1029560, 1036947, 1044221]
50029A044221P957R078R862R967R631R358R425R530R025P845O904P051P841Q104
50015A165799P570P164P606Q606R638J0650J1574J1982J1878J2190J3805J6551
50003A295013J9625K2586K5247K7124K7831K7805K7824K7903K7276K5463K2612
49992A576309J8900J4346R330M572K06m489j0066j6059k1682k6964l2617l8850
49980A472936m4880m9644n2565n3466n2266m9196m5073m0888l7057l3386k9776
49969I84739k6505k3643k0670j7141j3460j0475q447o904n527m539m028l374j871
49956H38155L89K601M184N302O512Q071R690J0843J1256J1001J0140Q519O102
49943I32765L320P68j361l213m755n771o407p276q851j1045j3405j5310j6021
$$ y = [1044221, 1052178, 1061256, 1071118, 1081085, 1090716, 1100074, 1109499, 1119029, 1128054, 1135899, 1142803, 1149854, 1157695, 1165799, 1173369, 1180533, 1188139, 1196745, 1206383, 1217033, 1228607, 1240589, 1252467, 1264657, 1278462, 1295013, 1314638, 1337224, 1362471, 1389595, 1417426, 1445231, 1473055, 1500958, 1528234, 1553697, 1576309, 1595209, 1609555, 1618885, 1623457, 1623663, 1619174, 1609108, 1593049, 1571367, 1544403, 1511786, 1472936, 1428056, 1378412, 1325847, 1272381, 1220115, 1170919, 1125846, 1084958, 1047901, 1014515, 984739, 958234, 934591, 913921, 896780, 883320, 872845, 864398, 857494, 851967, 847428, 843400, 840026, 838155, 838544, 841145, 845329, 850631, 857143, 865214, 874904, 885747, 897003, 908004, 918144, 926663, 932765, 936085, 936853, 935492, 932279, 927524, 921753, 915346, 908070, 899219, 888174, 874769, 859459, 843438]
49930H43438j5175j3505j2520j2997j4122j4511j3684j2155j0433q593o687m983
49918G04073l613k362r54N31J649K067K124K809M721P122Q520Q431P955Q333R492
49903G60898J0594J1383J2189J2883J2877J2163J1464J1109J0464Q875O607M362
49891H85868K335J96k226m760p263r705j1780j2945j3056j2747j2905j3758j4707
49878G72547j5004j4386j3025j1187r166p302n804m658l933l864m278m215k856
49865F72869o89R91J810K711M392O286P595Q513R526J0273J0169R771J0341J2040
49851G66598J3559J3722J2624J0978R159P302N581L879J741r21l444n199o325
$$ y = [843438, 828263, 814758, 802238, 789241, 775119, 760608, 746924, 734769, 724336, 715743, 709056, 704073, 700460, 698098, 697144, 697675, 699324, 701391, 703515, 706324, 711045, 718167, 726687, 735118, 743073, 751406, 760898, 771492, 782875, 795064, 807947, 820824, 832987, 844451, 855560, 866024, 874899, 881506, 885868, 888203, 888399, 886173, 881413, 874150, 864445, 852665, 839720, 826664, 813917, 801012, 787254, 772547, 757543, 743157, 730132, 718945, 709779, 702477, 696673, 692015, 688082, 684218, 679940, 675725, 672869, 672180, 673171, 674981, 677692, 682084, 688370, 695965, 704478, 714004, 724277, 734446, 744217, 754558, 766598, 780157, 793879, 806503, 817481, 826640, 833942, 839523, 843402, 845143, 844222, 840778, 835579, 829254]
$$ [...]
##END NTUPLES=NMR SPECTRUM
##END=
