
##TITLE=UV1217_M5_1296-1170_30_7229326_oI9TZXSJEr
##JCAMPDX= 6.0         $$ Bruker NMR JCAMP-DX V2.0
##DATA TYPE= NMR SPECTRUM
##DATA CLASS= NTUPLES
##ORIGIN= BRUKER
##OWNER= Administrator
$$ 1.72 TOPSPIN		Version 2.1
$$ 2013-01-23 22:06:06.148 -0500  Administrator@X
$$ Compression mode = diff/dup
##.OBSERVE FREQUENCY= 400.02188249412
##.OBSERVE NUCLEUS= ^1H
##.ACQUISITION MODE= SIMULTANEOUS (DQD)
##.ACQUISITION SCHEME= undefined
##.AVERAGES= 8
##.DIGITISER RES= 22
##SPECTROMETER/DATA SYSTEM= spect
##.PULSE SEQUENCE= zg30
##.SOLVENT NAME= COFFEE_meoh
##.SHIFT REFERENCE= INTERNAL, COFFEE_meoh, 1, 14.98509
##AUDIT TRAIL= $$ (NUMBER, WHEN, WHO, WHERE, PROCESS, VERSION, WHAT)
$$ ##TITLE= Audit trail, TOPSPIN		Version 2.1
$$ ##JCAMPDX= 5.01
$$ ##ORIGIN= Bruker BioSpin GmbH
$$ ##OWNER= Administrator
$$ $$ E:\/data/COFFEE/nmr/UV1217_M5_1296-1170_30_7229326_oI9TZXSJEr/40/pdata/1/auditp.txt
$$ ##AUDIT TRAIL=  $$ (NUMBER, WHEN, WHO, WHERE, PROCESS, VERSION, WHAT)
(   1,<2013-01-23 22:05:58.039 -0500>,<Administrator>,<X>,<go>,<TOPSPIN 2.1>,
      <created by zg
	started at 2013-01-23 22:04:52.039 -0500,
	POWCHK enabled, PULCHK disabled,
       configuration hash MD5:
       86 BA 57 50 F2 9D 5C 9B 26 00 A9 28 5F 66 2E 89
       data hash MD5: 64K
       E6 34 10 87 7E BC 5E 50 C5 CB 57 EB FD 5D 2C AA>)
(   2,<2013-01-23 22:06:01.085 -0500>,<Administrator>,<X>,<proc1d>,<TOPSPIN 2.1>,
      <Start of raw data processing
       efp LB = 0 FT_mod = 6 PKNL = 1 PHC0 = 0 PHC1 = 0 SI = 32K 
       data hash MD5: 32K
       17 CF 9B C4 02 AE A6 53 9D 54 0A 83 2F BE 39 05>)
(   3,<2013-01-23 22:06:01.539 -0500>,<Administrator>,<X>,<proc1d>,<TOPSPIN 2.1>,
      <pk PHC0 = 98.37158 PHC1 = 0 
       data hash MD5: 32K
       DE 44 97 93 D7 49 D6 F4 11 38 BE D9 86 69 43 44>)
(   4,<2013-01-23 22:06:01.789 -0500>,<Administrator>,<X>,<proc1d>,<TOPSPIN 2.1>,
      <abs ABSG = 1 
       data hash MD5: 32K
       DC CE D6 F6 27 2B 33 7C C6 F3 77 0D 0B 11 9A DE>)
(   5,<2013-01-23 22:06:01.929 -0500>,<Administrator>,<X>,<proc1d>,<TOPSPIN 2.1>,
      <abs ABSG = 2 
       data hash MD5: 32K
       E8 24 1E 6D 1A E4 DC 15 81 0E 2C 83 4B B7 F7 C1>)
(   6,<2013-01-23 22:06:02.085 -0500>,<Administrator>,<X>,<proc1d>,<TOPSPIN 2.1>,
      <abs ABSG = 3 
       data hash MD5: 32K
       0E 84 A7 16 E1 12 5D 83 45 22 73 87 C5 F6 40 23>)
(   7,<2013-01-23 22:06:02.226 -0500>,<Administrator>,<X>,<proc1d>,<TOPSPIN 2.1>,
      <abs ABSG = 4 
       data hash MD5: 32K
       4E 18 4C 7B 22 D1 54 C0 35 18 D3 8F DD 98 68 88>)
(   8,<2013-01-23 22:06:02.382 -0500>,<Administrator>,<X>,<proc1d>,<TOPSPIN 2.1>,
      <abs ABSG = 5 
       data hash MD5: 32K
       F3 69 45 62 58 DE A8 CE B7 64 8D 40 F7 91 8D DD>)
$$ ##END=
$$ 
$$ $$ hash MD5
$$ $$ FB 36 4F 88 76 EA 8D AC F7 B1 D1 C0 79 97 B5 27
##$RELAX= 
##$RELAX= 
##$RELAX= 
##$RELAX= 
##$RELAX= 
##$RELAX= 
##$RELAX= 
$$ Bruker specific parameters
$$ --------------------------
##$DU= <E:\>
##$EXPNO= 40
$$ [...]
150 150 150 150 150 150 150 150
##$TP07= 0
##$TPNAME0= <>
##$TPNAME1= <>
##$TPNAME2= <>
##$TPNAME3= <>
##$TPNAME4= <>
##$TPNAME5= <>
##$TPNAME6= <>
##$TPNAME7= <>
##$TPOAL= (0..7)
0.5 0.5 0.5 0.5 0.5 0.5 0.5 0.5
##$TPOFFS= (0..7)
0 0 0 0 0 0 0 0
##$TUNHIN= 0
##$TUNHOUT= 0
##$TUNXOUT= 0
##$USERA1= <user>
##$USERA2= <user>
##$USERA3= <user>
##$USERA4= <user>
##$USERA5= <user>
##$V9= 5
##$VALIST= <valist>
##$VCLIST= <CCCCCCCCCCCCCCC>
##$VD= 0
##$VDLIST= <DDDDDDDDDDDDDDD>
##$VPLIST= <PPPPPPPPPPPPPPP>
##$VTLIST= <TTTTTTTTTTTTTTT>
##$WBST= 1024
##$WBSW= 4
##$XGAIN= (0..3)
0 0 0 0
##$XL= 0
##$YL= 0
##$YMAX_a= 630662
##$YMIN_a= -538394
##$ZGOPTNS= <>
##$ZL1= 120
##$ZL2= 120
##$ZL3= 120
##$ZL4= 120
##$ABSF1= 14.98509
##$ABSF2= -5.573092
##$ABSG= 5
##$ABSL= 3
##$ALPHA= 0
##$AQORDER= 0
##$ASSFAC= 0
##$ASSFACI= 0
##$ASSFACX= 0
##$ASSWID= 0
##$AUNMP= <proc_prof1d_extract_pilot.lims>
##$AXLEFT= 0
##$AXNAME= <>
##$AXNUC= <1H>
##$AXRIGHT= 0
##$AXTYPE= 0
##$AXUNIT= <>
##$AZFE= 0.1
##$AZFW= 0.1
##$BCFW= 0
##$BC_mod= 0
##$BYTORDP= 0
##$COROFFS= 0
##$CY= 15
##$DATMOD= 1
##$DC= 0
##$DFILT= <>
##$DTYPP= 0
##$F1P= 0
##$F2P= 0
##$FCOR= 0.5
##$FTSIZE= 32768
##$FT_mod= 6
##$GAMMA= 0
##$GB= 0
##$INTBC= 1
##$INTSCL= 1
##$ISEN= 128
##$LB= 0
##$LEV0= 0
##$LPBIN= 0
##$MAXI= 10000
##$MC2= 0
##$MEAN= 0
##$ME_mod= 0
##$MI= 0
##$NCOEF= 0
##$NC_proc= -8
##$NLEV= 6
##$NOISF1= 0
##$NOISF2= 0
##$NSP= 0
##$NTH_PI= 0
##$NZP= 0
##$OFFSET= 14.98509
##$PC= 1
##$PHC0= 98.37158
##$PHC1= 0
##$PH_mod= 1
##$PKNL= yes
##$PPARMOD= 0
##$PPDIAG= 0
##$PPIPTYP= 0
##$PPMPNUM= 2147483647
##$PPRESOL= 1
##$PSCAL= 4
##$PSIGN= 0
##$PYNMP= <proc.py>
##$REVERSE= no
##$SF= 400.02
##$SI= 32768
##$SIGF1= 0
##$SIGF2= 0
##$SINO= 400
##$SIOLD= 32768
##$SPECTYP= <>
##$SREGLST= <1H.CDCl3>
##$SSB= 0
##$STSI= 32768
##$STSR= 0
##$SW_p= 8223.68421052631
##$SYMM= 0
##$S_DEV= 0
##$TDeff= 65536
##$TDoff= 0
##$TI= <>
##$TILT= no
##$TM1= 0
##$TM2= 0
##$TOPLEV= 0
##$USERP1= <user>
##$USERP2= <user>
##$USERP3= <user>
##$USERP4= <user>
##$USERP5= <user>
##$WDW= 1
##$XDIM= 32768
##$YMAX_p= 482057979
##$YMIN_p= -844958
##$CURPLOT= <Network HP LaserJet P1505>
##$CURPRIN= <$Network HP LaserJet P1505>
##$DFORMAT= <normdp>
##$LAYOUT= <+/1D_H.xwp>
##$LFORMAT= <normlp>
##$PFORMAT= <normpl>
##$SURQMSG= 1
$$ End of Bruker specific parameters
$$ ---------------------------------
##NTUPLES= NMR SPECTRUM
##VAR_NAME=  FREQUENCY,     SPECTRUM/REAL,   SPECTRUM/IMAG
##SYMBOL=    X,             R,               I
##VAR_TYPE=  INDEPENDENT,   DEPENDENT,       DEPENDENT
##VAR_FORM=  AFFN,          ASDF,            ASDF
##VAR_DIM=   32768,         32768,           32768
##UNITS=     HZ,            ARBITRARY UNITS, ARBITRARY UNITS
##FACTOR=    0.250966925370066, 1,           1
##FIRST=     8223.43324360094, 151693,       -223216
##LAST=      0,             17294,           -281319
##MIN=       0,             -844958,         0
##MAX=       8223.43324360094, 482057979,    0
$$ Real data points
##PAGE= N=1
##DATA TABLE= (X++(R..R)), XYDATA
$$ [...]
19558a94029j14001c0389o1641A43919b809k14685a6782k6098o9104k5180j96596
19547c33760a55275d9323j02559j49437G1592c5173B17565b32281B31882a31911
19536B484a94259A98514g2855D2976K26343a40298F8929b11661J05184j8097b4707
19524g3597I1387J7762d68092A9142J14540b57932J3647Q6800l221B32706J27187
19513C59893h4472o7575A98680a39739H0424b58297j969d1083A16749b00338A96136
19501c3381j07458d4595I5908i050B27930B2513a17909q2889k16008J46370C14655
19489d76553a24022d7345A0484g712B618J59044j9751b54328D6337a77910D03303
19477c89507B23862a49502n0940k31127A16612a40408k06764h8887l8250c0476
$$ y = [-194029, -308030, -30389, -92030, 143919, -2809, -217494, -16782, -42880, -111984, -137164, -333760, -155275, -49323, -151882, -301319, 71592, -35173, 217565, -232281, 231882, -131911, 2484, -194259, 198514, -72855, 42976, 269319, -140298, 68929, -211661, -106477, -124574, -24707, -73597, 91387, 109149, -468092, 19142, 133682, -257932, -244285, -157485, -160706, 232706, 359893, -84472, -152047, 198680, -139739, 80424, -258297, -260266, -41083, 116749, -200338, 196136, -33381, -140839, -44595, 95908, -9050, 227930, 22513, -117909, -200798, -416806, -270436, 314655, -476553, -124022, -47345, 10484, -7712, 2618, 161662, 141911, -254328, 46337, -177910, 403303, -389507, 223862, -149502, -200442, -431569, 116612, -140408, -347172, -88887, -127137, -30476]
19466A10063L08681a48264G0623M7332b3324j82488G1642d52968h41k11711K236
19455b10316B86788J1289h2083h716k25366I6073a12826L8949A32742b7796I3161
19443G80c57106e6168k00681b8407A16563b0289k24241D9118j2999L0916b72195
19431b88374A64425a24181C75616b13164A89076n3438h4071r1003K2197F7257
19420G4805b84182b2476q2692j98311D08014c9984k1524B09889E8213l217a76326
19408B45171a34205I2193a54141D3148e9679B51597b31054e7586j40589n7718
19398b55893i8828l9003A16946R1835a98149j06195J43346B1461a05447j60608
19388b66055I7081a2499k05847B0089L27972A6496c09483E9585g8648I7800a27744
$$ y = [110063, 418744, -148264, 70623, 117955, -23324, -205812, 71642, -452968, -841, -212552, -210316, 286788, 298077, -82083, -8716, -234082, 96073, -112826, -73877, 132742, -27796, 93161, 780, -357106, -56168, -256849, -28407, 116563, -20289, -244530, 49118, 36119, 67035, -272195, -288374, 164425, -124181, 375616, -213164, 189076, 135638, -84071, -175074, -152877, 67257, 74805, -284182, -22476, -105168, -303479, 408014, -39984, -61508, 209889, 58213, 54996, -176326, 245171, -134205, 92193, -154141, 43148, -59679, 251597, -231054, -57586, -198175, -255893, -98828, -137831, 116946, 208781, -198149, -304344, -160998, 21461, -105447, -266055, 97081, -12499, -218346, 20089, 348061, 16496, -309483, 59585, -78648, 97800, -127744]
19376c424l41341C2122M2390B9276a57587f2688j527k40014J30857O6178b9016
19364C19222b70332a14418A93756b214G5016a95921j35958c959l6752k4847N046
19353f0512q005E56002c3492k66554j63806g798G5583a11064m921c414G9955j1208
19341F8747R6909c27108k5619J12932B47089o8378b76477A26680a55085A57213
19330e9994k48732i2738A59725c6569A01038a56975e2280k10256I3684B754b7898
19318i6967k07458a42444K0985A54790E0067g949l71401A70004l6846I15J39521
19307A40436a4384C4917b55573k5393B18039a21502j07285C82201c88722e1108
19296i9936n7710k28609e044A58346a50800k5432o6242m6241i0539D07013d508
$$ y = [-3424, -344765, 32122, 74512, 29276, -157587, -62688, -64215, -304229, -173372, -107194, -29016, 319222, -270332, -114418, 193756, -2214, 75016, -195921, -331879, -3959, -40711, -65558, -60512, -68517, 556002, -33492, -300046, -463852, -7798, 75583, -111064, -115985, -3414, 79955, 68747, 165656, -327108, -352727, -239795, 247089, 178711, -276477, 126680, -155085, 157213, -59994, -308726, -92738, 159725, -36569, 101038, -156975, -52280, -262536, 93684, 2754, -27898, -96967, -304425, -142444, -121459, 154790, 50067, -7949, -379350, 170004, 133158, 915, 140436, -14384, 34917, -255573, -280966, 218039, -121502, -228787, 382201, -388722, -51108, -99936, -157646, -386255, -5044, 158346, -150800, -176232, -242474, -288715, -90539, 407013, -4508]
19284g5158L4280o7622l7409F8836R668Q6329o5938b55398N1223P3485o0993E7072
19271d73370G9972Q5995g9477j08335a8444C23551b41152f7264j84368h9640L9506
19260e0134A58291e0650l52989b0145k45243g9921K845C54701C9528d96402B33594
19248a68598A87809F4973B7632b4646j01516A14172b23249a10805A23385a88742
19237f4209j72588A50962h4234j57904a15849c4360A44988J46166A07103b17284
19226f0944C17374D8342j2578J885d5109j91145j86895B918J32124B2883d16283
19214C6683h9844A77545D5637K12262a35276B0316J19156J13495b1442m84924
19204e06366b23985c75k99848k8895l9343A33413a56386m12285h6925A74594E6077
$$ y = [-75158, -40878, -108500, -145909, 68836, 78504, 164833, 98895, -255398, -204175, -130690, -191683, 57072, -473370, 79972, 165967, -79477, -187812, -18444, 323551, -241152, -67264, -251632, -89640, -50134, 158291, -50650, -403639, -20145, -265388, -79921, -77076, 354701, 39528, -496402, 233594, -168598, 187809, 64973, 27632, -24646, -126162, 114172, -223249, -110805, 123385, -188742, -64209, -236797, 150962, -84234, -242138, -115849, -34360, 144988, 291154, 107103, -217284, -60944, 317374, 48342, 35764, 37649, -45109, -236254, -423149, 2918, 135042, 22883, -416283, 36683, -89844, 177545, 45637, 257899, -135276, 20316, 139472, 252967, -21442, -506366, -223985, -375, -300223, -329118, -368461, 133413, -156386, -568671, -86925, 174594, 56077]
19192B47493I4898g2175j22395p4122j13666J88389h7789A317P4536L13157d6700
19180B78603A04095K08655a17683m8496e8242F6198J32527A7561g4186A8068i9463
19168c51944o1543b01289B28389C9967a43553k10545B28737b04329e7446J7963
19158c9483C15364F6668a43008p8815a3389k40212G6261i055j52086A45549e5857
19146a17441k63568A84375c28857A70604b10634b3494q1178j12881A11218Q2707
19136A93925A3157L9118h7492A82002d44194a7726q6010I1119K27128f0724p0071
19125a30795n3136k2799A71798a44495I9015J48208D4309Q6775a1656A87247c3654
19113f8969A05469b40292A1949K50377c3435n5700A5M199a41573n5290R6915A22743
$$ y = [247493, 94898, -72175, -194570, -268692, -382358, -193969, -87789, 1317, 75853, 389010, -46700, 278603, 104095, 312750, -117683, -166179, -58242, 66198, 198725, 17561, -74186, 18068, -99463, -351944, -413487, -201289, 228389, 39967, -143553, -354098, 228737, -204329, -57446, -39483, 315364, 66668, -143008, -221823, -13389, -253601, 76261, -9055, -161141, 145549, -55857, -117441, -381009, 184375, -328857, 170604, -210634, -23494, -104672, -217553, 111218, 193925, 13157, 52275, -87492, 182002, -444194, -17726, -103736, 91119, 318247, -60724, -130795, -183931, -206730, 171798, -144495, 99015, 247223, 44309, 131084, -11656, 187247, -33654, -68969, 105469, -240292, 11949, 262326, -33435, -89135, 15, 4214, -141573, -196863, -99948, 122743]
19100e498j24658A18639c01584J37553B42028j12122E1140b0569m9000L2384A7016
19088B499J8484c44752a15780j93959a07398E9396J9137a7967A63596D6144a54325
19076a8701A00076a21806j5831k02388D8614b16732D63574a5925A56947b00188
19065i6803M2961B29241b2587I8368a1853k2299G6538j1062b0101I9753b1632
19053e3651l6946p2020J4749b011j26458C67387a02405d938j05195A28281a46833
19041A68444b52453C87076A83512b75598A9009c39678J54029E8784c56203a3653
19030e7172D6050L4137b21857P02e0505B8327a60711k06860A99801a02989j26171
19019b29160g2378A96524i2294B22126c5224B19479q6469c62265G0205e7749J8554
$$ y = [-5498, -130156, 118639, -301584, -164031, 242028, 129906, 51140, -20569, -69569, -37185, 17016, 2499, 20983, -344752, -115780, -309739, -107398, 59396, 78533, -17967, 163596, 46144, -154325, -18701, 100076, -121806, -137637, -340025, 48614, -216732, 463574, -15925, 156947, -200188, -96803, -53842, 229241, -22587, 98368, -11853, -34152, 76538, 65476, -20101, 99753, -21632, -53651, -90597, -162617, -147868, -2011, -128469, 367387, -102405, -4938, -110133, 128281, -146833, 168444, -252453, 387076, 183512, -275598, 19009, -339678, -185649, 58784, -356203, -13653, -57172, 46050, 80187, -221857, -221155, -50505, 28327, -160711, -367571, 199801, -102989, -229160, -72378, 196524, -92294, 222126, -35224, 219479, 133010, -362265, 70205, -57749, -39195]
19008c9195m6063A36031c93119a89973N6870N8377F916R1059C4702b90747a22468
18996e36156J91526J25882R2427A16799K503b66935j40801A12130G717h6595I4188
18984G93R1679G122h4705L6915G8551b41270b7404q3993n6545d8256j54355m3470
18972b46081l3309I9554b57272J19992Q771j26476R1577j93750c9369k8541C30701
18960A44543a82474A89809b03322A95241K8314a32931k15994a56261L8881L3376
18950h4004p1116m6807f2237R770k2219f839j0541j2620B01481a6981H336B056
18937A03836a3955l16628E5093P6848b44512B3397K92213d590E6384J91b59507
18925A42812d06788J91493O6240M8451c2820A92095b62708H8669J87017J27808
$$ y = [-39195, -85258, 136031, -393119, -189973, -133103, -74726, 6916, 97975, 34702, -290747, -122468, -536156, -344630, -218748, -126321, 116799, 119302, -266935, -407736, 112130, 7717, -86595, 94188, 793, 92472, 7122, -84705, -47790, 78551, -241270, -27404, -111397, -167942, -48256, -202611, -246081, -279390, 99554, -257272, -137280, -128509, -254985, -163408, -357158, -39369, -67910, 330701, 144543, -182474, 189809, -203322, 195241, 223555, -132931, -348925, -156261, -117380, -84004, -155120, -201927, -62237, -52467, -74686, -6839, -17380, -30000, 201481, -16981, 8336, 2056, 103836, -13955, -330583, 55093, 131941, -244512, 23397, 315610, -4590, 56384, 56575, -259507, 142812, -406788, -215295, -149055, -100604, -32820, 192095, -262708, 88669, 275686, 403494]
18915D03494e7549k88242G9878h9360A49106a57362L8646l69098J94409J32880
18905a60525M6995n3701c5566H35b2337C0600N6245b25277R2601f3972j43646
18894b07618a0628F9329M2572b2451A31105a74229l038h0175m7975j33339P166
18883b54323g9970k13182d9281G4923a38215c4703m2203j79329F9831J7530e4360
18871B57064h6373E4912J71196R4701G7032M4407g6075m7824k41403F9867a3723
18859B52587A09774e9891j21160j80535R8648B16206Q3831b21068N6379C23555
18848A78198q1620C7360K76330b11280A72040g2126p4793o3355A86101c2255A60037
18836E4447a12408G9536M2662J8376a01077n9019L9490b164l64905a16122P125
$$ y = [403494, -57549, -345791, 79878, -89360, 149106, -157362, -118716, -487814, -293405, -160525, -113530, -167231, -35566, 835, -22337, 30600, 86845, -225277, -132676, -63972, -207618, -10628, 69329, 111901, -22451, 131105, -174229, -177267, -80175, -128150, -261489, -254323, -79970, -293152, -49281, 74923, -138215, -34703, -76906, -256235, 69831, 87361, -54360, 257064, -86373, 54912, 226108, 320809, 77032, 121439, -76075, -123899, -365302, 69867, -13723, 252587, 109774, -59891, -181051, -361586, -262938, 216206, 300037, -221068, -164689, 323555, 178198, 96578, 37360, 313690, -211280, 172040, -72126, -146919, -210274, 186101, -32255, 160037, 54447, -112408, 79536, 122198, 140574, -101077, -160096, -120606, -2164, -367069, -116122, -108997]
18825a08997e4422c343q7998M4755A53258b48119C0733a1147Q31B87009B4296
18813A24644k2811h6129K1823L1252B99299j09242c1343k26714C81267e7100A699
18801a60100A10691i9657L2596o3734B32908r2073a2888A36123d08756b7735p6269
18790a04004l4114q0248l1000A44858J31326A3483J24769o1691J68515A02159
18779c80551P1188O822a47107o4097B7108c65822g8575m1855e7911b6152A36697
18767C69547a08607M1503k26378O8333b4923B3640i8448j42411E6751j3582c29520
18755h7574C05814a12951K4134c5981j90380A53377b37926M3948n6558o05P9243
18744a71898d7789A26808c3441r3843A23781n1738f8566j50868l3597a04732j63592
$$ y = [-108997, -54422, -3343, -91341, -46586, 153258, -248119, 30733, -11147, -10316, 287009, 24296, 124644, 101833, -86129, -64306, -33054, 299299, 190057, -31343, -258057, 381267, -57100, 1699, -160100, 110691, -99657, -67061, -130795, 232908, 140835, -12888, 136123, -408756, -27735, -104004, -138118, -218366, -249366, 144858, 276184, 13483, 138252, 76561, 245076, 102159, -380551, -309363, -302541, -147107, -211204, 27108, -365822, -78575, -120430, -57911, -26152, 136697, 369547, -108607, -67104, -293482, -225149, -24923, 23640, -98448, -240859, 56751, 43169, -329520, -87574, 305814, -112951, -88817, -35981, -226361, 153377, -237926, -193978, -250536, -251141, -171898, -47789, 126808, -33441, -127284, 123781, 72043, -68566, -219434, -253031, -104732, -268324]
18733b68324E0915j7290K83687b27781J0150A79604a40004B5104b87911L1874
18723b56037O6094f3024a135A55581c77588a51344A00955K558o791o350O111O0838
18711A57321i4996A93472a31689A99396f5409j46296d0890k7308k73011c0348
18700B5322R2937c64522a24558C14997i4686p3978B10305j04709i4046l8426f90
18688C3037J82726b90960h1468a8582C38624j28741N237B548g1165C7429f1296
18676a6969l40004i0712l1952k23116A15764b0852F8516e4189j78799k1123c330
18664A38187n825g14613b8305n2973p1490k07535g0246k2787A08588a21031N0129
18653g0902A0627f7341B43539a06288e2844j00256g6260B90014b30553A19835
$$ y = [-268324, 50915, 33625, 317312, -227781, -217631, 179604, -140004, 25104, -287911, -256037, -189943, -63024, -1135, 155581, -377588, -151344, 100955, 103513, 96722, 90372, 96483, 157321, -94996, 193472, -131689, 199396, -65409, -211705, -40890, -68198, -341209, -30348, 25322, 118259, -364522, -124558, 314997, -94686, -168664, 210305, 105596, -94046, -132472, -690, 33037, 215763, -290960, -81468, -18582, 338624, 209883, 215120, 2548, -71165, 37429, -61296, -16969, -356973, -90712, -122664, -345780, 115764, -20852, 68516, -54189, -232988, -254111, -3330, 138187, 132362, -714613, -28305, -81278, -152768, -360303, -70246, -93033, 108588, -121031, -70902, 10627, -67341, 243539, -106288, -52844, -153100, -76260, 290014, -230553, 119835]
18642I4036P7375b02333c3428o2390A51261d6865j14001A09130m745a4324j11003
18631a25327B11590e3621j56850A03382a21627A93815m7639d9765G3477j8209
18621E5268j8742a76687f5690k23984P8317g041n35215b22488Q2630A78016H5976
18609G611c63431B16351D3825d6873b676q5212J9267l785m59170C9333K10530
18598B49863b20571m46579F9060B4878a02776r7787e7021C11055e0617m8634l9132
18587a38383n0634M2168B2073J38628c39206A42024C5612a28836j931A75090a6259
18575a04126p2564Q7732d1990C3977J53117e6876j03816B5003b511j01198B0889
18563A84314B3425a62618b8180N99j69351c3127k07450b4936m94258b35059a170
$$ y = [94036, 171411, -202333, -33428, -95818, 151261, -46865, -160866, 109130, 104385, -14324, -125327, 211590, -53621, -210471, 103382, -121627, 193815, 146176, -49765, 73477, 55268, 36526, -176687, -65690, -289674, -211357, -7041, -542256, -222488, -139858, 178016, 85976, 7611, -363431, 216351, 43825, -46873, -2676, -87888, -68621, -72406, -531576, 39333, 249863, -220571, -667150, 69060, 24878, -102776, -200563, -57021, 311055, -50617, -99251, -138383, -189017, -146849, 22073, 160701, -339206, 142024, 35612, -128836, -130767, 175090, -16259, -104126, -176690, -88958, -41990, 33977, 187094, -56876, -160692, 25003, -2511, -103709, 20889, 184314, 23425, -162618, -28180, -27581, -196932, -33127, -240577, -24936, -519194, -235059, -1170]
18551B08729b12335Q5747D5125K4016d6289C7831n47a14192J5138k72944D7332
18539a06035N1613m8299Q714E3989k3288a52751E0969a18383G4052L833a50972
18527B6223P1619c952o180C1827K0262a77245f2411B24884M2222d18391J34994
18516b83397J29073m7100b1284r6512n3465K5230r2085B02524K9106c23358g1616
18504D5955b16747A17813b98848a17214A57862K3650Q0569a65674A65395b90615
18493a26424l06701a31551b3666j13917A41676A4097g4284K5016j38436J3878
18483a73826d6714k673j21310Q4368k49889f6945k59502E2009N2068e9040J244
18472e7796M474k03471C7485O5218L0111a61003f0274B73468q079C0432J24694
$$ y = [208729, -212335, -126588, 45125, 69141, -46289, 37831, 37284, -114192, -99054, -371998, 47332, -106035, -54422, -102721, -94007, 53989, 30701, -152751, 50969, -118383, 74052, 77885, -150972, 26223, 97842, -3952, -10132, 31827, 52089, -177245, -62411, 224884, 267106, -418391, -283397, -154324, -201424, -21284, -117796, -171261, -146031, -238116, 202524, 231630, -323358, -71616, 45955, -216747, 117813, -298848, -117214, 157862, 181512, 262081, -165674, 165395, -290615, -126424, -433125, -131551, -23666, -137583, 141676, 14097, -74284, -49268, -187704, -173826, -46714, -49387, -170697, -86329, -336218, -66945, -326447, 52009, 104077, -59040, -57796, -53322, -256793, 37485, 102703, 132814, -161003, -60274, 273468, 265389, 30432, 155126]
18461A55126b33199r1038J57794F9050J84566r98H0042b44070B67321a09180c8826
18449a88577P4859h042k24084r6551A3170c07382a19371k04473j4356f0128E7473
18437b98625F5186b31409C75034i3961F8396c80024G6256h8496c9428A81326a07653
18425h017A25944a32963a4886k14737O7228B124b91000L8360P5279k71771g0548
18413D6144a85267F4316K44269F6250f6205j71889h1791A57475l2545J81294e4508
18401A91531c3421j07868J1867J1624C79817g3871a9454C24452j12269a43766
18390a02595k16497A04054Q0222e2351J196k07521b9318J2070B80112a05743p3198
18379a78941I1204b17421i3407A23967R2341c3828r5440G4432a5289k45849k7943
$$ y = [155126, -233199, -324237, -166443, 69050, 253616, 252618, 80042, -244070, 267321, -109180, -38826, -188577, -113718, -8042, -232126, -328677, 13170, -307382, -119371, -323844, -338200, -60128, 57473, -298625, 65186, -231409, 375034, -93961, 68396, -380024, 76256, -88496, -39428, 181326, -107653, -8017, 125944, -132963, -14886, -229623, -162395, 2124, -291000, -252640, -177361, -449132, -70548, 46144, -185267, 64316, 308585, 66250, -66205, -238094, -81791, 157475, 124930, 306224, -54508, 191531, -33421, -141289, -129422, -117798, 379817, -73871, -19454, 324452, 212183, -143766, -102595, -319092, 104054, 184276, -52351, -51155, -258676, -29318, -17248, 280112, -105743, -178941, 91204, -217421, -93407, 123967, 216308, -33828, -129268, 74432, -15289, -261138, -289081]
18368b89081A97323a9144j57325G9265b4932C26323A41429K63295C7964R1371
18358A29335c7076I5072c31275I2749b20874C00369b66784a1584A13703f8222
18347F2094B0299M4058a21089c1343j13810d2499J5517j98314B17406q6663a67303
18335A43039d3663A15772J6744a87338B9996e7438A78419a53967O912b9545k53094
18324b82639B21765a27827B70082k4530h0767B17232a40290p54j53532A28288
18313A74860D3393R243N9783l1969b5338A6368J37603l5930b41771N0628b1359
18301a3026o5473B20498b5106H7414d15195A05783b6801j9649B06308R4837C7218
18289A96893a14715d8982o7877D5900N8401m178b00463B82751b19271K8761A0320
$$ y = [-289081, 197323, -19144, -176469, 79265, -24932, 326323, 141429, 404724, 37964, 129335, -37076, 95072, -331275, 92749, -220874, 300369, -266784, -11584, 113703, -68222, 62094, 20299, 64357, -121089, -31343, -145153, -42499, -26982, -225296, 217406, 130743, -167303, 143039, -43663, 115772, 132516, -187338, 29996, -57438, 178419, -153967, -147055, -29545, -282639, 221765, -127827, 270082, 245552, -80767, 217232, -140290, -141044, -294576, 128288, 174860, 43393, 52636, 112419, 80450, -25338, 16368, 153971, 118041, -241771, -191143, -21359, -13026, -78499, 220498, -25106, 87414, -415195, 105783, -26801, -46450, 206308, 301145, 37218, 196893, -114715, -48982, -116859, 45900, 104301, 100123, -200463, 282751, -219271, -190510, 10320]
18277a33330K952n05852a96980A9137c05559g8249G9590J3836b7430d097D98497
18265a3925C4410f9768A1698c15650C90636H2712a16803o932N3893j41831l2015
18254b43688i5330B8574a7998A17227i9558C8269e54989G5440j8305c08110a05472
18242a67133j57098Q2189d5445a9323C5657K01164b9772E8315K65218b71343C77216
18230b26093l6947R2106p7954B33330c17119E5443Q4090i1580E5614i0622I2442
18218B8781b6982j6172o4002m6883f2783j67844g6514L3139p4653J1178C25481
18206G599d8052o2027k06275E1782P4959k4033g8941k1775B63919a61745K9409
18195a32336B64657a08889d960j98361e6650B5828f4193j68653B48833D8448b49368
$$ y = [-133330, -130378, -636230, -196980, 19137, -305559, -78249, 79590, 93426, -27430, -4097, 498497, -13925, 34410, -69768, 11698, -315650, 390636, 82712, -116803, -123735, -69842, -211673, -243688, -95330, 28574, -17998, 117227, -99558, 38269, -554989, 75440, 57135, -308110, -105472, -167133, -324231, -242042, -45445, -19323, 35657, 236821, -29772, 58315, 323533, -271343, 377216, -226093, -263040, -170934, -248888, 233330, -317119, 55443, 139533, -91580, 55614, -90622, 92442, 28781, -26982, -43154, -107156, -154039, -62783, -230627, -76514, -43375, -118028, -106850, 325481, 7599, -48052, -110079, -316354, 51782, 126741, 102708, -78941, -100716, 263919, -161745, -132336, 264657, -108889, -4960, -203321, -56650, 25828, -64193, -232846, 248833, 48448, -249368]
18183a90201A82843O398b42320L7324L8098j68891A19901a19563k33163A84983
18172A2884a281B7239N1493j4025a49352q9699A2600J49324l4129a08241G9081
18160I1775c773j30961A40837K56455A35334j3948a67528H8806b29899A16333
18149a14868A198a48728A57864A4963a30349N0025l9235I5177A6500f4265A5541
18137g7340A0335a57940P5993A98991C8553P1441l2747i8159j22983A98874a80450
18125G051J35969K9195q3804D1545J62587k1410E8810e8270G6412a2935A56166
18113b37670d1692A44562a33707D1210c20258j72111a05310j76592M6101d1065
18102f4536E1485A3002g7229j00457L1845F073e60H6694a67736l9758O0040b698
$$ y = [-190201, 182843, 189241, -242320, -204996, -166898, -335789, 119901, -119563, -352726, 184983, 12884, -1281, 27239, 78732, 64707, -149352, -239051, 12600, 161924, 127795, -108241, 79081, 91775, -3773, -134734, 140837, 397292, 135334, 121386, -167528, 88806, -229899, 116333, -114868, 1198, -148728, 157864, 14963, -130349, -80324, -119559, 95177, 16500, -64265, 15541, -77340, 10335, -157940, -81947, 198991, 38553, 109994, 77247, -98159, -221142, 198874, -180450, 7051, 143020, 172215, 88411, 41545, 204132, 182722, 58810, -58270, 76412, -12935, 156166, -237670, -41692, 144562, -133707, 41210, -320258, -492369, -105310, -281902, -235801, -41065, -64536, 51485, 13002, -77229, -177686, -145841, 6073, -560, 86694, -167736, -207494, -147454, -2698]
18089a07006N158k20480R2033A66095a99459N8236j32726A54071a70484b2249
18078a23768B8508K35090c02034B56273A11017g6172l2253I3575l897a17208N4339
18067f2869m7750L7845D8671g413A56381j5670O1918e6377p9303j48443B67410
18055G0714j4340a01536k71436d8677m24152a12422A06538O644d21C9741J19931
18044A59672h3066A74316J19117a24541B1504N9671m241a31829k3102A27711D6864
18032b3411B82296o5834d2840C4988c01637C1281a53343E9467f9268A44426L4943
18021A79369C8857J79658b10601R8064p2247A72708m6698c2818k20176h8214A22122
18009A57272k5311a95400N7026B41548a38055r1402K0577H4464B870a30124A22830
$$ y = [-107006, -101848, -322328, -230295, 166095, -199459, -141223, -273949, 154071, -170484, -22249, -123768, 28508, 263598, -302034, 256273, 111017, -76172, -108425, 93575, 89678, -117208, -62869, -110619, -72774, 48671, -7413, 156381, 140711, 202629, -56377, -135680, -284123, 267410, 70714, 56374, -101536, -372972, -48677, -472829, -112422, 106538, 113182, -421, 39741, 159672, -83066, 174316, 293433, -124541, 21504, 81175, 76934, -131829, -154931, 127711, 46864, -23411, 282296, 216462, -42840, 34988, -301637, 31281, -153343, 59467, -69268, 144426, 179369, 38857, 218515, -210601, -112537, -184784, 172708, 126010, -32818, -252994, -88214, 122122, 157272, 131961, -195400, -138374, 241548, -138055, -229457, -208880, 84464, 2870, -130124, 122830]
17997A4578h9822k4608j7948H2044a30307k9856A78700a35686A68834O3610D8622
17985B9805J99374C6462J76647g8403G9558J30201j5023L4684a90730B9496b33245
17973b2604l65599M4041R9319c0020k45524a34268M4399B17081E6593J49697O6836
17962B73126e5426l1389M1318C90588H1947K95636A15666f8900D2057b70334e7425
17950b1926I0451J3466l0170J35314a24396m1333A7416i5847g809E8561J85979
17939B44540e3464E9385N359a71368j056j52339d7128j85800C47248g7809A21030
17927A22273c40371h1085o3032j33942F3349K78356A03835K12890j51875e9900
17916a2787C48309j18306b59008d6101E3880i7652j7513A68267F2577j8199J05410
$$ y = [14578, -89822, -114430, -132378, 82044, -130307, -160163, 178700, -135686, 168834, 232444, 48622, 29805, 229179, 36462, 213109, -78403, 79558, 209759, 194736, 229420, -190730, 29496, -233245, -22604, -388203, -344162, -244843, -30020, -275544, -134268, -89869, 217081, 56593, 206290, 273126, -55426, -86815, -45497, 390588, 81947, 377583, 115666, -68900, 42057, -270334, -57425, -21926, 90451, 103917, 73747, 209061, -124396, -165729, 17416, -95847, -7809, 58561, 244540, -53464, 59385, 64744, -171368, -172424, -324763, -47128, -232928, 347248, -77809, 121030, 122273, -340371, -81085, -144117, -278059, 63349, 341705, 103835, 316725, 164850, -59900, -12787, 348309, 230003, -259008, -46101, 53880, -97652, -115165, 168267, 62577, 44378, 149788]
17905A49788a640l2599H9046R9149a99541Q9336j6844F8801g7783K2663A23214
17893A61743J93437c24654a0352H2993b26967g8298P892B5379b46253A2568L432
17882A6000P1021M1600m7268n147b4194j09148F5044R5577J24848d489B89838
17870c20901B32930b77761A088a12413A81111p982a75116p1285A86500o683J9036
17859A98853a19373j09389A01960b18277c8484C42807b17645A29260e0631k44008
17849b94639f4077k9401M4393m5904A7355d5133j38363k74178i1553l9011j22572
17838b53136j0056A06537a93801A7513O9006h467j37591O8501C84210a40195J1076
17827a29119A6391N4962J26678m1047B9648H347c1313B73971f0537j33319q4550
$$ y = [149788, -1640, -34239, 89046, 188195, -199541, -110205, -127049, 68801, -77783, -55120, 123214, 161743, 355180, -324654, -10352, 82993, -226967, -78298, -70406, 25379, -246253, 12568, 16000, 87021, 128621, 81353, 76206, -24194, -133342, 65044, 160621, 285469, -4489, 289838, -320901, 232930, -277761, 1088, -112413, 181111, 173129, -175116, -246401, 186500, 179817, 198853, -119373, -228762, 101960, -218277, -38484, 342807, -217645, 129260, -50631, -294639, -64077, -93478, -49085, -94989, 17355, -45133, -183496, -457674, -91553, -130564, -253136, -263192, 106537, -193801, 17513, 86519, -8467, -146058, -77557, 384210, -140195, -129119, 16391, 71353, 198031, 156984, 29648, 8347, -31313, 273971, -60537, -193856, -278406]
17816b78406h078j17069A79740a61678E8000K12676I2042K24542j31252G2542
17805B34715a36155C40152a6461C33780f8021K2757j9735k37736a19050k96002
17795d15052J74996C41613A57711a2622A34691l5571d4492C60751A00177J53325
17785B53502E6306a21105A77391l264q4161K80248b55963A17499j6353c16416
17774a52401P1798a0535A37354d3735j21900e5484B64965k4461b1060k66158B55015
17762A93066C5615R53J12124b20450B32129a77447A02591c87482J84830h9956
17751a2728k33645b206H7414g2611H356b99286f0992A62265K8060M9149b73870
17739i4661K4262K1990E9980L12048G0338M9321A1100J91294Q7733G4774a05425
$$ y = [-278406, -8078, -125147, 179740, -161678, 58000, 270676, 92042, 316584, 185332, 72542, 234715, -136155, 340152, -16461, 333780, -68021, -45264, -64999, -302735, -119050, -415052, -240056, 341613, 157711, -12622, 134691, 99120, -44492, 360751, 100177, 253502, 56306, -121105, 177391, 174127, 89966, 370214, -255963, 117499, 101146, -316416, -152401, -80603, -10535, 137354, -43735, -165635, -55484, 264965, 240504, -21060, -287218, 255015, 193066, 35615, 36568, 148692, -220450, 232129, -177447, 102591, -387482, -202652, -89956, -12728, -246373, -2206, 87414, -72611, 8356, -299286, -60992, 162265, 190325, 239474, -273870, -94661, -70399, -48409, 59980, 372028, 70338, 119659, 11100, 202394, 290127, 74774, -105425]
17727i6408B1479b80411p4J03286D28096k09969G0574a48280q6816A49484G0332
17715A0818L5353J45900Q4294b56848j99496b3363I2107b41795B75982G5045d8846
17703b11063A73545a27121H309J2731K85345d9157D6934k3439J19920D2473c36393
17691B07197a60246G364a53435I613a07313j9252A84491j0934g0958A98662p9976
17680A18686b8782m00726h0032B05997r3235g6825j79843H0145a64409A02246
17669B81117G8292M6063e4594o8641A51321P5763b3815o203n3419A15353D2612
17657c85465a01866D9583R327B3966b64492a04877A57984F1037J85633a53207
17646E6944K15924b13021R769A7830K15901B0326Q4704a03900B41882A14820l1623
$$ y = [-96408, 21479, -280411, -280485, -177199, 428096, 218127, 70574, -148280, -235096, 149484, 70332, 10818, 46171, 192071, 276365, -256848, -456344, -23363, 92107, -241795, 275982, 75045, -48846, -211063, 173545, -127121, 8309, 21040, 306385, -49157, 46934, 23495, 143415, 42473, -336393, 207197, -160246, 7364, -153435, 9613, -107313, -126565, 184491, 173557, -70958, 198662, 118686, -28782, -429508, -80032, 205997, 112762, -76825, -256668, 80145, -164409, 102246, 281117, 78292, 124355, -54594, -123235, 151321, 227084, -23815, -30018, -83437, 115353, 42612, -385465, -101866, 49583, 58910, 23966, -264492, -104877, 157984, 61037, 246670, -153207, 56944, 272868, -213021, -203252, 17830, 233731, 20326, 105030, -103900, 241882, 114820, 83197]
17635H3197b1778D47037A46687n0017J73648k556b2286r5758E8735a4233F9056
17623A95023D124a06876A80889q5411O7603a34072E0313b75505c0833k11256h0498
17611B334h999A445a59485C40022A06195d09308C40919j40498c0020j31792m4206
17600b06018j30856d3178G1103m778a08434g916j49111P6582a3815D24904B03729
17588H0404j197a44866M3578A00882m6838J56691a90627D0581K55834p0918q7711
17577A37786m2411N1540a08081C09895H1942e8878j3489F6789k2686L00127A35531
17565F7444R6957b7323A33322o5937a05091E0178b03121A43039m8298j5216a89091
17553C26153j55047K2413l7099i2659J0236c5821l918m95195d848j29451j38176
$$ y = [83197, -21778, 447037, 146687, 96670, 270318, 267762, -22286, -118044, 58735, -14233, 69056, 195023, 4124, -106876, 180889, 95478, 163081, -134072, 50313, -275505, -30833, -242089, -80498, 2334, -8999, 1445, -159485, 340022, 106195, -409308, 340919, 200421, -30020, -161812, -206018, -336874, -43178, 71103, 66325, -108434, -7916, -157027, -80445, -13815, 424904, 203729, 80404, 79207, -144866, -101288, 100882, 54044, 210735, -190627, 40581, 296415, 225497, 137786, 95375, 146915, -108081, 309895, 81942, -58878, -72367, 66789, 44103, 344230, 135531, 67444, 164401, -27323, 133322, 67385, -105091, 50178, -203121, 143039, 94741, 79525, -189091, 326153, 171106, 193519, 156420, -92659, -82423, -35821, -39739, -534934, -4848, -134299, -272475]
17542b72475J31864f9246B99763b48601F4779K40859I8527N7008Q2960J08417
17532C46912A02645j4656k8914a61402H0852K12227c36338p6477F1916g1250A76218
17520H2299C1924K6612a80097A71333c50903D14531A68076B2527J0861J5131L45136
17509C93655D5232K75998b3774l9687k258p2141c9506m9700r2239b8659H9744
17497A945O6809A6857P5033c40269B84796a43534C20287J15688j79603d349A58234
17485D8870J59220q5424M8730D5621e6383A16551g0179C6671R5860a7604D19407
17473D00757o876A8361O7621L85788k17089P8948c467A61046m6360A7262O6781
17462H4043J1007a79799E9709G356J23651l2511J4743m5006j0985J63202F6579
$$ y = [-272475, -140611, -69246, 299763, -248601, 64779, 305638, 98527, 155535, 238495, 346912, 102645, 87989, 59075, -161402, 80852, 293079, -336338, -412815, 61916, -71250, 176218, 82299, 31924, 58536, -180097, 171333, -350903, 414531, 168076, 22527, 33388, 48519, 393655, 45232, 321230, -23774, -63461, -65719, -137860, -39506, -89206, -181445, -28659, 89744, 1945, 68754, 16857, 91890, -340269, 284796, -143534, 320287, 435975, 256372, -4349, 158234, 48870, 208090, 122666, 171396, 45621, -56383, 116551, -70179, 36671, 132531, -17604, 419407, 400757, 393881, 18361, 85982, 471770, 254681, 333629, -3467, 161046, 114686, 17262, 84043, 95050, -179799, 59709, 7356, 131007, 98496, 113239, 68233, 57248, 220450, 66579]
17450D12189j09346B4456J53454J81631g446D4382O5460P5846Q9647m6347M9905
17439B78893B8671M24061C8687K5807K33929j28065L86223j80830k6360N7869
17429D07260A79021L20543C1854M8506J64695N8853J2883j4444A26794J84518
17419C11312j53444G3384P720d7801D68498A85686a21581A09672M59834A90288
17408B63727Q9660E0008K35336A13942a6844H0184R3787F3424e6605A0843J4361
17397B5204a19308e5821iB02061E534J7841J64580d7117C48774d4066A59560E685
17384D6136b34812B56024K00876A46083m4318a62476A409c9999C39886l5777H1135
17372b03026B14322R056C0058a01335E2911D537K0400J03642b9935j60172A36142
$$ y = [412189, 302843, 24456, 177910, 359541, -7446, 44382, 109842, 185688, 275335, 228988, 278893, 28671, 452732, 38687, 64494, 298423, 170358, 556581, 375751, 349391, 407260, 179021, 499564, 31854, 80360, 245055, 303908, 316791, 302347, 126794, 311312, 157868, 73384, 81104, -47801, 468498, 185686, -121581, 109672, 569506, 190288, 263727, 353387, 50008, 285344, 113942, -16844, 80184, 173971, 63424, -56605, 10843, 25204, -119308, -55821, -9, 202061, 5534, 23375, 187955, -47117, 348774, -44066, 159560, 5685, 46136, -234812, 256024, 456900, 146083, 101765, -162476, 1409, -39999, 339886, 304109, 81135, -203026, 214322, 223378, 30058, -101335, 52911, 4537, 24937, 128579, -29935, -190107, 136142]
17360A27101h5257n7613A53031o2820b14725A84760o0518K323J04716a32306B32191
17348A98852C9855K65791I8281J50122A20266J29338D3991J40609l562F672f8684
17336C73139I8537K5983J61266j29671e379A61L4646M10049h013H3123N4763B6101
17323C71285j49201m7324a0156k24491A56869C7022a39957D36882E8899K597J75283
17312B36779b970p1965A17626M60459c1976C29367R6090j70177K7759N3034J25650
17301D61723E3771B2137Q7591C7722L87737f8854K8808b058B93112R9699o9523
17290C23288l3928J75589E5404M7382K53709I302K42472K66691j78142F9135K7150
17279I6285K38722j60638K1866K04885c2827A04266K13443A9161K65660B3743
$$ y = [127101, -85257, -142870, 153031, 90211, -214725, 184760, 124242, 126565, 231281, -132306, 232191, 198852, 39855, 305646, 98281, 248403, 120266, 249604, 43991, 184600, 181038, 6672, -68684, 373139, 98537, 124520, 285786, 156115, -5379, 161, 34807, 444856, -8013, 83123, 137886, 26101, 371285, 222084, 174760, -10156, -234647, 156869, 37022, -139957, 436882, 58899, 61496, 236779, -2970, -74935, 117626, 578085, -31976, 329367, 425457, 255280, 283039, 336073, 461723, 53771, 22137, 109728, 37722, 425459, -68854, -40046, -2058, 293112, 392811, 323288, 289360, 464949, 55404, 102786, 356495, 9302, 251774, 518465, 340323, 69135, 96285, 335007, 174369, 196235, 401120, -32827, 104266, 317709, 19161, 284821, 23743]
17268i7391b9229A9870d2291B40617J07014M3685A90951J5129H7556c1206B79312
17256E39832b30342O6020B58970k0815a74813E3440K15151P534D2727M18852A44177
17244C19667F1096K92117m7653J70259k21481l5068a80516G7556f225B59519j19939
17233A39580J03072r3285K4691a38937a7123A67914F5934L34970r0189b86619
17222a78616A47363n1216L3783J93355C9011a8074B00719q1699M41907k21216
17212C39711B1720O4453J55163j4911f8130D16872j49255H9851J55129k7521G8602
17200B07242J57818K71767k73968o0903J47410p8677q2188J60594A19797J21640
17190B41437r9120L87523i309B82533J50987q1597F4887K38987L616j04394K8979
$$ y = [-97391, -29229, 19870, -42291, 240617, 347631, 391316, 190951, 206080, 87556, -31206, 279312, 539832, -230342, -164322, 258970, 238155, -174813, 53440, 268591, 276125, 42727, 461579, 144177, 319667, 61096, 353213, 305560, 475819, 254338, 219270, -180516, 77556, -6225, 259519, 139580, 242652, 149367, 174058, -138937, -17123, 167914, 65934, 400904, 310715, -286619, -178616, 147363, 96147, 129930, 323285, 39011, -18074, 200719, 119020, 560927, 339711, 21720, 86173, 241336, 226425, -68130, 416872, 267617, 89851, 244980, 217459, 78602, 207242, 365060, 636827, 362859, 301956, 449366, 370689, 288501, 449095, 119797, 241437, 142317, 529840, -9309, 282533, 433520, 351923, 64887, 303874, 307490, 203096, 232075]
17179B32075K95605A53162N07821C29902j04363P3619L61563A78788n4241M88737
17169F13284j00620k51000J929J83738j49122l5446r3685a22823D93057j84175
17159C08882J20070J19135o1076B05350M87074o8287k76854A37311K48833p9061
17149C07083A07513M60997j79329q4267p2484O2575e2485D18767A53580L8677
17139A92257J17473J54650j35068p425k4533L77008B91437L71636I619L53286
17129C62905A57520K25099K96705a5914E97430k67797N6801o9195K22075j87874
17119C51440r4644j08008K82122J28353B22457l4011O2720j2520K49103j53304
17109C34445l4354F1863L47760m5902p6191K13300k9250j50743j13813Q3461K91878
$$ y = [232075, 527680, 153162, 660983, 329902, 225539, 299158, 660721, 178788, 124547, 613284, 512664, 261664, 263593, 447331, 298209, 262763, 169078, -122823, 493057, 308882, 428952, 548087, 487011, 205350, 692424, 624137, 347283, 137311, 386144, 307083, 107513, 568510, 389181, 304914, 232430, 295005, -52485, 418767, 153580, 192257, 309730, 464380, 329312, 321887, 297354, 674362, 291437, 663073, 9619, 362905, 157520, 382619, 679324, -15914, 597430, 329633, 386434, 317239, 539314, 351440, 256796, 148788, 430910, 559263, 222457, 188446, 251166, 238646, 487749, 334445, 300091, 61863, 409623, 363721, 287530, 500830, 471580, 320837, 207024, 290485, 582363]
17098E82363l755k10465J86862L2132k12554J42551k57294N099N31460B86003
17087D11212J31874j36170G3521R0129N6638J96752J81447R2045B93508A12432
17076a4863C46976Q6574l6149l372j2741m3052L8795K708P1468j64862L2747L44718
17064F63810k62760D3477L67443r717L91083l64067q0718N08844l11820k71541
17054B72984L11352j90686K96048k31577J76774j1165j47590R3769k27599K51058
17044E93368A3712L48594J96341L79366C95682K47589j67313A45532J69865o4532
17034B50865M2869J40509P4671N8690K90444D25723M79711k55272L2216j28171
17024E54207M2764J20634j6460L37229m57102K6516K62970j57561J88935k06539
$$ y = [582363, 578608, 368143, 555005, 587137, 374583, 517134, 259840, 264939, 796399, 286003, 411212, 543086, 406916, 73521, 163650, 220288, 417040, 598487, 690532, 293508, 112432, -14863, 346976, 433550, 397401, 394029, 381288, 338236, 377031, 379739, 451207, 286345, 319092, 663810, 401050, 43477, 410920, 401203, 792286, 428219, 347501, 856345, 544525, 272984, 584336, 393650, 689698, 458121, 634895, 623730, 476140, 569909, 342310, 593368, 13712, 362306, 558647, 938013, 395682, 643271, 475958, 145532, 315397, 250865, 293734, 434243, 508914, 567604, 858048, 425723, 905434, 650162, 682378, 554207, 596971, 717605, 701145, 1038374, 581272, 607788, 870758, 713197, 902132, 695593]
17014F95593p2360q6373M289j07416K39174k76276M22681C83735M19096k94547
17004E08284j4545K42782k14319J01317P1468O9825r3204K63459j58677k83066
16994D93324L33105l47074O24610m00459j22055K98574J06997N012j60859k5361
16984H05814K7546J00345r7255J00081D35897J82689j5282o327Q9472k2319J24979
16973G89109j07812K83872L32077k80266J77711k21179j44667L14312j16005P9002
16963A106154l81103K35042M2755k63451L22705j19700L01162m93839K51259R8279
16953A099263K2128j76207J65172m65441K90504K10391K38022m39048L6729J96647
16943A178160l04478R8302J57352m52j293o5642K04472j99773K40344k14001J67271
$$ y = [695593, 623233, 536860, 541149, 433733, 672907, 396631, 819312, 383735, 802831, 508284, 493739, 736521, 522202, 623519, 694987, 764812, 671608, 935067, 776390, 493324, 826429, 479355, 1103965, 703506, 581451, 880025, 987022, 992034, 831175, 805814, 833360, 933705, 836450, 936531, 435897, 618586, 603304, 596977, 686449, 664130, 789109, 681297, 965169, 1297246, 1016980, 1194691, 973512, 828845, 1143157, 1027152, 1106154, 725051, 960093, 1002848, 739397, 1062102, 942402, 1243564, 749725, 1000984, 1099263, 1121391, 945184, 1110356, 644915, 935419, 1145810, 1383832, 944784, 981513, 1178160, 873682, 971984, 1129336, 1128884, 1127591, 1061949, 1266421, 1066648, 1306992, 1092991, 1260262]
16932A260262J25205j68459J3158J63316J9812l25733M45911K3651k10168n6724
16922A290231J50006R2051k08732j02628K12631l6997J56622K35134l22102k26668
16912A239548O0612K44210k29056K32865K08505j69196l01063M08566J09782j07735
16902A697038j0739R206j9944l9237K24581m135l5420N0260r8579J38392j06459
16891A804964M7769k44486L61969p8372j07074N03486l9868m00966P5984K50932
16881B174338M9826j51799j55673L07719N2546j61767L67172k35134l1434J61139
16871B376933r8296R2160K12536j93623q4300M82955l35247J64033L63196K482
16861B982829m40891L70235l79026K47787L6790J09540j28878K30383l1646L21749
$$ y = [1260262, 1385467, 1217008, 1230166, 1393482, 1413294, 1087561, 1533472, 1557123, 1346955, 1290231, 1440237, 1532288, 1323556, 1220928, 1433559, 1396562, 1553184, 1788318, 1466216, 1239548, 1300160, 1544370, 1315314, 1548179, 1756684, 1587488, 1286425, 1694991, 1804773, 1697038, 1686299, 1695505, 1675561, 1636324, 1860905, 1856770, 1821350, 1871610, 1773031, 1911423, 1804964, 1852733, 1608247, 1970216, 1891844, 1784770, 2288256, 2248388, 1847422, 1923406, 2174338, 2224164, 2072365, 1916692, 2224411, 2276957, 2115190, 2482362, 2247228, 2215794, 2376933, 2278637, 2370797, 2583333, 2389710, 2305410, 2788365, 2453118, 2617151, 2980347, 2982829, 2541938, 2912173, 2533147, 2780934, 2817724, 2927264, 2798386, 3028769, 2997123, 3318872]
16851C318872k00845j189K23762j37248M8567R9974n8532J66661O875O425P2068
16840C545390J19847p0615L04110l6234j9419K5248J19998K26535k46591L17303
16830D285572J62144j74942M96791m99428L71844k22993L56995j92458L3889K91690
16820D909104K78958L6692J79777J27001j1601J04288L0077O2162L13958m450
16810F025966J53163J59245L14330j81732P8635J83764L51792J02463l918J61366
16800G345074P3049K71573R7358J44288N35560Q2125N40161p7362Q3322M60235
16790I555383k5100N28495K88642j02584M07375K95490O9813J71448R71617k63327
16780A1897252N21016O31760P05560L15944J71851O07539L94490Q6020Q40199
$$ y = [3318872, 3118027, 3116838, 3340600, 3203352, 3251919, 3351893, 3293361, 3460022, 3466897, 3473322, 3545390, 3665237, 3594622, 3898732, 3862498, 3843079, 3868327, 3988325, 4214860, 3968269, 4285572, 4447716, 4272774, 4769565, 4270137, 4641981, 4418988, 4775983, 4583525, 4617414, 4909104, 5188062, 5224754, 5404531, 5531532, 5519931, 5624219, 5654296, 5716458, 6030416, 6025966, 6179129, 6338374, 6652704, 6470972, 6549607, 6733371, 7085163, 7187626, 7183708, 7345074, 7418123, 7689696, 7787054, 7931342, 8466902, 8549027, 9089188, 9011826, 9095148, 9555383, 9530283, 10058778, 10347420, 10244836, 10652211, 10947701, 11017514, 11188962, 12160579, 11897252, 12418268, 13050028, 13755588, 14071532, 14243383, 14850922, 15245412, 15331432, 16171631]
16771A6171631L46648M49511P34381N69800P61952N58832Q77401P32937Q42368
16762B2045461O07922R66563Q83157Q53173J455503R59286J043978J454755J054651
16753C1324449J571065J222885J879599J529271J953831J737346K014396J812612
16745D5045454K718146K119879K876977K830458L204437K981516L469917L606533
16737F8853317L683282M591524M223956M452972N301078N605843N567117N779846
16729A08058935O341106O236396O911973O521520O778004O808610O367560O174353
16721A60198457N727904M954926M504992L579121K193921J288383K97919q57804
16713A81887819k161564l286465m034863m973977n393937o466872o332205o532555
$$ y = [16171631, 16518279, 16967790, 17702171, 18271971, 19033923, 19592755, 20470156, 21203093, 22045461, 22653383, 23619946, 24503103, 25356276, 26811779, 27771065, 28815043, 30269798, 31324449, 32895514, 34118399, 35997998, 37527269, 39481100, 41218446, 43232842, 45045454, 47763600, 49883479, 52760456, 55590914, 58795351, 61776867, 65246784, 68853317, 72536599, 77128123, 81352079, 85805051, 91106129, 96711972, 102279089, 108058935, 114400041, 120636437, 127548410, 134069930, 140847934, 147656544, 154024104, 160198457, 165926361, 170881287, 175386279, 178965400, 181159321, 182447704, 182745623, 181887819, 179726255, 176439790, 172404927, 167430950, 162037013, 155570141, 149237936, 142705381]
16705A42705381o796784p105582o558960o421999o369921o293121n723849n692843
16697I1742322m861518n053807m496711m358051m193949l565501l469686l457678
16689E8285421l326588k395819k646950k807315k364490k128459k290103j542260
16681C8783437j702033j625121j722534j268283j423390j829367r42388j439217
16673B6831104o43988j155906j266432q40220r70551p11357n29333j023765p50097
16664A8939455r31860l92516n15670n47436o21553k20467j068331j81660o92053
16655A3767909j27098n82036l95789p36554k05090L8407j05914p27607j72657
16646A0753571n07998k76640m8420m43835l53045M5511m62270J35360m55682j26744
$$ y = [142705381, 135908597, 128803015, 122244055, 115822056, 109452135, 103159014, 97435165, 91742322, 86880804, 81826997, 77330286, 72972235, 68778286, 65212785, 61743099, 58285421, 54958833, 52563014, 49916064, 47108749, 44744259, 42615800, 40325697, 38783437, 37081404, 35456283, 33733749, 32465466, 31042076, 29212709, 28270321, 26831104, 26187116, 25031210, 23764778, 22924558, 21954007, 21242650, 20713317, 19689552, 18939455, 18007595, 17615079, 17099409, 16551973, 15930420, 15709953, 14641622, 14459962, 13767909, 13640811, 13058775, 12662986, 11926432, 11721342, 11759749, 11653835, 10926228, 10753571, 10245573, 9968933, 9920513, 9476678, 9123633, 9169144, 8706874, 8842234, 8386552, 8259808]
16636H259808k72960n09235J54333j06936k72128j35730O1126l40877k54453J9210
16626F602158n2624m87004k57514L38220m18011o7055M8731l60523M60627n63181
16616E243824J15958m24979m30553K63719j01578j02743j07921J39297j58760
16607D436264m19752L60944J35011n34898l00057J99882J05995k33441j12112
16598C637836N14761m46566m59407M31433k62488m567m88958N69661n88190J9656
16588B923171j25397K23411Q1829J53474p15468L50081l92003J97821l42754K30234
16578B584399N9955J52197j37808k07987k17963K21063j64915J37233j19456j51836
16568B154882L47523j19877q6363k80985o2389n1473p3989K66424l14314L3888
$$ y = [8259808, 7986848, 7477613, 7631946, 7525010, 7252882, 7117152, 7178278, 6837401, 6582948, 6602158, 6549534, 6062530, 5805016, 6143236, 5725225, 5658170, 5706901, 5346378, 5807005, 5243824, 5359782, 4934803, 4504250, 4767969, 4666391, 4563648, 4455727, 4595024, 4436264, 4016512, 4377456, 4512467, 3977569, 3677512, 3877394, 3983389, 3749948, 3637836, 4152597, 3706031, 3246624, 3678057, 3415569, 3411002, 2922044, 3491705, 2903515, 2923171, 2797774, 3021185, 3103014, 3256488, 2541020, 2891101, 2499098, 2696919, 2354165, 2584399, 2644354, 2796551, 2658743, 2450756, 2232793, 2453856, 2288941, 2426174, 2306718, 2154882, 2502405, 2382528, 2296165, 2015180, 1952791, 1901318, 1827329, 2093753, 1779439, 1813327]
16558A813327J89568L25324m31190k56421J34113k77828N28570j11924J78627
16549B092166k77076J21748l59383L17386k62226J07288K0683p9848j8055P7480
16539A740163l88081M52757l56181K4901l70614N25371m44063j23620K15824r0780
16529A185677M52826k80809J29792k73183R3546J84377o9757l5693R3431k22932
16519A257275L3035O5650j98449o488m8272q6488K35301m40696M39801q9314O6005
16508A227360o6495j90381n9919j95859M61713j61186k04077L88366p6683o7010
16498A055829N6185m2757J30050j88035k87258J54218L14771l74472k1777J19944
16488I16698J67734m16130K04892J06063k21594L07152p3150M5890J9622o13j69500
$$ y = [1813327, 2002895, 2328219, 1897029, 1640608, 1774721, 1496893, 2025463, 1913539, 2092166, 1815090, 1936838, 1577455, 1894841, 1632615, 1739903, 1760586, 1680738, 1662683, 1740163, 1352082, 1804839, 1448658, 1473559, 1102945, 1628316, 1184253, 1060633, 1276457, 1185677, 1638503, 1357694, 1487486, 1214303, 1307849, 1492226, 1422469, 1386776, 1480207, 1257275, 1290310, 1355960, 1157511, 1151023, 1102751, 1016263, 1251564, 810868, 1250669, 1161355, 1227360, 1160865, 970484, 910565, 714706, 1176419, 1015233, 811156, 1199522, 1122839, 1055829, 1112014, 1069257, 1199307, 1011272, 724014, 878232, 1193003, 818531, 796754, 916698, 1084432, 668302, 873194, 979257, 757663, 1064815, 991665, 1037555, 1057177, 1056564, 887064]
16477H87064q8924m1790n5346K30003j24649Q9133k70794L70450K47392n12941
16467G29598J93159l97523J10424B74088J91293J25651J62290k03186K4548K71855
16457H46539k97571J20064j76226K51488p5457j52829O7144K78722k35673j72789
16447D53412A60091Q06027D38554l9920m8427R9233R2788P7315L9845J11240l02028
16436D68600k15183K04329K17622l3780j2649l7377l269n7690j29455n1562K12953
16425E62539o2500K25041l06192J68113j5368j08802L37160r0728f611B05040
16414H97138j84442k4925q8728B84303J74050L8979B29984L4871L06268o3774
16404E07349A00875L29560J29679j42984J10499B21320J50617K2284L65054k96351
$$ y = [887064, 798140, 756350, 701004, 931007, 806358, 895491, 624697, 995147, 1242539, 729598, 922757, 525234, 635658, 274088, 465381, 591032, 753322, 550136, 574684, 846539, 548968, 669032, 492806, 744294, 668837, 516008, 583152, 861874, 626201, 453412, 160091, 966118, 438554, 398634, 350207, 449440, 542228, 619543, 659388, 770628, 468600, 253417, 457746, 675368, 641588, 628939, 591562, 588293, 530603, 401148, 349586, 562539, 500039, 725080, 418888, 587001, 571633, 462831, 799991, 709263, -6611, 205040, 897138, 712696, 687771, 599043, 284303, 458353, 497332, 229984, 264855, 571123, 507349, 100875, 430435, 560114, 417130, 527629, 221320, 371937, 394221, 759275, 462924]
16394D62924j13032A27674J34519p5425K623l6815M36778J3127A41738J47440
16384B89178r7502L57704n3405B14733J76503J137j09019R0627A75453L47853
16374E23306j7969B29093L28239B25686D8301M62979j74653j01772L28478A91263
16363F21249G8469K67051q5286K24586C9741J47780J1047J67418J18890j44672
16353C40204n2661K0001R2480J11090B02189M14710A34099l7295m782C5437M05906
16342D41343D2855J45705b1549A88338r957L0853L1066N0962k5688p5797J07258
16331B97035J51557J87980B31246q3045i2141E93647B38069l416M9003K14956
16321D98612b806E7856J48678F1205K3758K66819J24199b9187A46954k0861O790
$$ y = [462924, 349892, 127674, 262193, 186768, 189391, 152576, 589354, 602481, 141738, 289178, 191676, 549380, 495975, 214733, 391236, 392373, 283354, 373981, 175453, 523306, 505337, 229093, 557332, 225686, 48301, 511280, 336627, 234855, 563333, 191263, 621249, 78469, 345520, 260234, 484820, 39741, 187521, 198568, 365986, 484876, 340204, 287543, 307544, 400024, 511114, 202189, 616899, 134099, 96804, 92022, 35437, 441343, 42855, 188560, -21549, 188338, 178381, 209234, 240300, 291262, 265574, 189777, 297035, 448592, 636572, 231246, 148201, -92141, 593647, 238069, 234653, 283656, 498612, -2806, 57856, 206534, 61205, 84963, 351782, 475981, -29187, 146954, 126093, 132883]
16310A32883Q9959q466B9425J44343a10453A3992O7185a4651B10292F1069J17374
16299A78443l4594J28420C7217a63439B66158j32715a33695D11420j86160a21108
16288A04565J75136J97455j61354j812n9211a62557D09318A57631O5424I3126
16277I2904K12835m0736J2986K3258b7001A76994l0068J52459j15177a6828B85426
16265C8681d6770D58217q9667j38497q2052a67324F0195K00831O9382a80296C4245
16253B16607B3828L72781f5709B57354O7327C3776c0594C61920j27743k7636J25528
16242C32069A57714f3003A15810K0728j6036J43667a95155a2612D00423j06558
16232B93865c4392G1537B0104M5433P1662n8440J45076j4124C1810P2394L3644
$$ y = [132883, 222842, 214376, 29425, 173768, -110453, 13992, 81177, -14651, 210292, 61069, 178443, 143849, 272269, 37217, -163439, 266158, 133443, -133695, 411420, 225260, -121108, 104565, 279701, 477156, 315802, 313990, 254779, -162557, 409318, 157631, 223055, 93126, 92904, 305739, 265003, 277989, 301247, -27001, 176994, 146926, 299385, 184208, -16828, 285426, 38681, -46770, 458217, 368550, 230053, 148001, -167324, 60195, 261026, 330408, -180296, 34245, 216607, 23828, 396609, -65709, 257354, 324681, 33776, -30594, 361920, 234177, 206541, 332069, 157714, -63003, 115810, 136538, 120502, 264169, -195155, -12612, 400423, 293865, -34392, 71537, 20104, 65537, 137199, 78759, 223835, 209711, 31810, 104204, 137848]
16221A37848a7442A51979h4994B20091J34289G3629J54545H4375a17869r7238
16211b15107g5995b7829k90246A61837L42J09697Q149F5743J55906k5915P0766
16200B66500H6708l7916g9871A74394D4288R3696J44426j19003b41642C9253a45231
16188B45277A01556F534K32701a18914A64533E4749K13093c56099B62529k6725
16178B35804J32585d2777r2475F8631N4372B3752K95771r4821g02B8422a03249
16166e4618K847D9375c95601H1609e57744B56517a1251n7942I6652J47315J58812
16155D02779e08096B75280Q8341a67061A55842a9927B1897J6860b17749a05499
16144A67898c03210A73530E1886c01761C3073L74824E8166h739k40322B77827
$$ y = [137848, -17442, 151979, -84994, 220091, 354380, 73629, 228174, 84375, -117869, -215107, -75995, -27829, -318075, 161837, 162179, 271876, 280025, 65743, 221649, 195734, 266500, 86708, 48792, -79871, 174394, 44288, 137984, 282410, 163407, -241642, 39253, -145231, 245277, 101556, 6534, 239235, -118914, 164533, 54749, 267842, -356099, 262529, 235804, 368389, -42777, -135252, 68631, 123003, 23752, 319523, 224702, -702, 28422, -103249, -54618, -51771, 49375, -395601, 81609, -557744, 256517, -11251, -69193, 96652, 243967, 402779, -508096, 275280, 363621, -167061, 155842, -19927, 21897, 38757, -217749, -105499, 167898, -303210, 173530, 51886, -301761, 33073, 407897, 58166, -8739, -249061, 277827]
16133b73118E5400b74567A62872R7811E2341j9770a03339A69893a1134A64741
16122a34354C04766a62820K7614b0291B47671E8630L5668h2808A62753D8473J9099
16111F7572a3594k19126D9044j7520a74781q0818A22149J96283j05416o812K45
16100B06449a10680A64283K9627k9728J34386B0575e8152n8480j60639R7546h67
16088B249R7385J659a18701I5802m6883O3840J83797r2437m6107E7766O7181K44727
16076C69674n1626j24974e0490k37104B01955e9221B68720d0994B32315A07503
16065C2184a41342B681Q4135B1420b30744j0761e4171J6797g497j88617b2215
16053C50112j08343m5413h9911A78706e88238a86595B22271a08594A9179b46449
$$ y = [-273118, 55400, -274567, 162872, 260683, 52341, 32571, -103339, 169893, -11134, 164741, -134354, 304766, -162820, -135206, -20291, 247671, 58630, 94298, -82808, 162753, 48473, 67572, -13594, -232720, 49044, 31524, -174781, -255599, 122149, 318432, 213016, 206204, 206449, -110680, 164283, 193910, 164182, 298568, 20575, -58152, -116632, -277271, -179725, -867, 2249, 99634, 101293, -118701, 95802, 48919, 112759, 296556, 204119, 158012, 57766, 124947, 369674, 318048, 193074, -50490, -287594, 201955, -59221, 268720, -40994, 232315, 107503, 32184, -141342, 2681, 86816, 21420, -230744, -241505, -54171, -37374, -7497, -196114, -22215, 350112, 241769, 196356, -89911, 178706, -588238, -186595, 222271, -108594, 19179, -246449]
16042B8855f1068I9270b87308G1754b05366C08939a4449j08353F04597a6794A32767
16030b01228b8321k89238A16176f9109I981b83882A41226b8918A32911D0977a66646
16018F5029O2692J61468a12388a489l28143K4213q8059A22206D5372C477i301
16006G8222a14425n1312L7804L1227m0289r5790F9332b14392B36990r3051a86601
15994B543K62026a24121A30301h8179A44239b77062B87647D6239B89g5946B46582
15982c4415A08813j4445j5583b14460D29161A01346l4902b79050H310N2861a45096
15970G8986b50658A75952n319a53393e2956p4630c4549j8737n8269A4071b5050
15958A51184f4773A77423h6995B48405c4502n7131D15205a09211c3403B07439
$$ y = [28855, -61068, 99270, -287308, 71754, -205366, 308939, -14449, -122802, 604597, -16794, 132767, -201228, -28321, -317559, 116176, -69109, 9981, -283882, 141226, -28918, 132911, 40977, -166646, 65029, 127721, 289189, -112388, -1489, -329632, -305419, -393478, 122206, 45372, 3477, -9301, 78222, -114425, -165737, -127933, -96706, -136995, -232785, 69332, -214392, 236990, 143939, -186601, 2543, 264569, -124121, 130301, -88179, 144239, -277062, 287647, 46239, 289, -75946, 246582, -34415, 108813, 94368, 78785, -214460, 429161, 101346, 66444, -279050, 8310, 61171, -145096, 78986, -250658, 175952, 170633, -153393, -52956, -127586, -34549, -53286, -111555, 14071, -25050, 151184, -64773, 177423, -86995, 248405, -34502, -91633, 415205, -109211, -33403, 207439]
15947D787h340m5440D3098K74137d2660B76207a23048A94438b02617n5988C59
15935a99012M726a6873p3183k25627A55268d34908A2868N3218g9124F440K73391
15924B79831b22577G7071b35855k6131R250Q9026D9751J00351E0832a83133c3456
15912a28921e5974k2698A75209a10240A7386J4458O9765b30264B20515c82520
15901b50030a6226A60959A7222K98709A18561a55933a0924l08927B1972J46228
15891A68200a19277F2685J94858f9561A47837a53935d1423j425G236b35204k34511
15880d69715a49390A75078a56486O1850A9001K2793b77243B08705D5689j9624
15870B6065c1930k03860j50333c1660C1034L4668J32305b87768A04514d9800j18261
$$ y = [4787, -8340, -53780, 43098, 317235, -42660, 276207, -123048, 194438, -202617, -258605, 359, -199012, -194286, -16873, -90056, -315683, 155268, -434908, 12868, 66086, -79124, 6440, 279831, -222577, 77071, -235855, -261986, -252736, -163710, 49751, 150102, 50832, -183133, -33456, -128921, -55974, -78672, 175209, -110240, 17386, 31844, 101609, -230264, 220515, -382520, -250030, -16226, 160959, 17222, 315931, 118561, -155933, -10924, -319851, 21972, 168200, -119277, 62685, 257543, -69561, 147837, -153935, -41423, -42848, 7236, -235204, -469715, -149390, 175078, -156486, -94636, 19001, 41794, -277243, 208705, 45689, 26065, -31930, -235790, -386123, -31660, 31034, 65702, 198007, -287768, 104514, -49800, -168061]
15859a68061J7555d4854j65589H879b24347O6023o7047P4663l46735C51104A25114
15847C0494b5567A83491a9529k01352c1713D55421a89640A62053K57112k05545
15837B13620e1201A29062h1062k58417J37313F52519A5184a54039r9167B80192
15826b31592a0440j36482M6059A42784a20288p4923O5202J4526o4903F4525J02070
15815A66595c75592a18988e7239p1915C17542D3929P1750a07152l5421G650a34338
15803b27542n8491a05207C2720K26683E8807b6307k97980A72814c51994a07870
15792C25076g7239a8924m1887A43353j6374O6400b23206A22709a74768A31809
15781B24257c7239B1794b6791j07827E2574b88392c8965A5226b31837q3138g0401
$$ y = [-168061, -150506, -44854, -210443, 8879, -224347, -158324, -225371, -150708, -497443, 351104, 125114, 30494, -25567, 183491, -19529, -220881, -31713, 455421, -189640, 162053, 419165, 213620, -51201, 129062, -81062, -339479, -202166, 652519, 15184, -154039, -253206, 280192, -231592, -10440, -146922, -100863, 142784, -120288, -195211, -130009, -115483, -180386, 64525, 166595, -375592, -118988, -57239, -129154, 317542, 43929, 115679, -107152, -142573, 7650, -134338, -227542, -286033, -105207, 32720, 259403, 58807, -26307, -324287, 172814, -351994, -107870, 325076, -77239, -18924, -60811, 143353, 126979, 193379, -223206, 122709, -174768, 131809, 224257, -37239, 21794, -26791, -134618, 52574, -288392, -38965, 15226, -231837, -314975, -70401]
15769a05831B19256a18704A37990Q689C6173a02735F739g8554A86770a90436r9146
15758b89582A31125J61732A08525j1058a65424k37515i3548A16825D1642a68523
15747A0959K10168o8087a54294A6389b3710A13113M9650b26167M8388r2106d4411
15735H629M5712b59678A07263i0031E4043J03799Q8580G6579b47959A86609p3313
15724A13296b5090j62216h4108H0122b91480B71572b41720A31992B3108L8818
15714F1926b98334B14351C3426J32533B3108J12880a56935C45870E4294R0936
15704A45230C4008c02287k8763J55622L2293j62314J023a452j54410a8744I1212
15692A34769O5275I7842C3194J71833J5561a77387A35414a48563j51023N6683
$$ y = [-105831, 219256, -118704, 137990, 146679, 36173, -102735, 6739, -78554, 186770, -190436, -289582, 131125, 292857, 108525, 97467, -165424, -402939, -93548, 116825, 41642, -168523, 10959, 221127, 153040, -154294, 16389, -23710, 113113, 162763, -226167, -177779, -269885, -44411, 8629, 54341, -259678, 107263, -90031, 54043, 157842, 246422, 76579, -247959, 186609, 113296, -25090, -187306, -84108, 80122, -291480, 271572, -241720, 131992, 23108, 61926, -298334, 214351, 33426, 165959, 23108, 135988, -156935, 345870, 54294, 145230, 34008, -302287, -331050, -175428, -143135, -305449, -304426, -1452, -155862, -18744, 91212, 134769, 200044, 97842, 33194, 205027, 220588, -177387, 135414, -148563, -299586, -242903]
15682b42903O5826L4190K7210j73626C1666c32709A50223g1896C946L56038B8367
15670f0635k62491A17952Q0296i8792q2639A34842F7109J33089b75669g8062I6780
15658A05484a01487k31844g5607E1493k1027c33126B6642L1964a58624A5059a79426
15646a96737N9851i364D09495b0846B89220A30494a78805j89137Q6597B6083a18978
15634A87111C8609J56138J5342a01806i768C15665b63423N6517A34377a39576
15623b60925B6932g305o09602B64528g2799l16879a82563O3845q6130a7809k13899
15612b31708J09106O313F7056K02681j7554i944j81111A2444a09480J3582G574
15600I6442b70440i8994j50274j08432j7015C14899H954c41188J8073M9638A84842
$$ y = [-242903, -177077, -142887, -115677, -289303, 31666, -332709, 150223, -71896, 3946, 359984, 28367, -60635, -323126, 117952, 198248, -98792, -181431, 134842, 67109, 200198, -275669, -78062, 96780, 105484, -101487, -333331, -75607, 51493, 30466, -333126, 26642, 58606, -158624, 15059, -179426, -196737, -136886, -9364, 409495, -20846, 289220, 130494, -178805, -367942, -281345, 26083, -118978, 187111, 38609, 194747, 210089, -101806, -9768, 315665, -263423, -206906, 134377, -139576, -260925, 26932, -7305, -616907, 264528, -72799, -389678, -182563, -118718, -204848, -17809, -231708, -122602, -116289, 67056, 269737, 252183, -9944, -191055, 12444, -109480, -95898, 7574, 96442, -270440, -98994, -249268, -357700, -374715, 314899, 8954, -341188, -323115, -273477, 184842]
15588a54433C06277b53942R7887O0824B0758c6194E7922J10920a2719m6814A65977
15576A47137F561K16629b62320A57453m6641E4414M4291A4617g9229j23052i930
15564A10686M8839a44344C42982j15862A9245N7529a68847j62017O4430M9076
15554b17358j5105B35310c3301r29A00814a47406A25062a55946E075K18071h9733
15542c3495B85497a49441k31132d5403F4652a79186j6102A2870L5905L1145a21389
15530A81728H4304d1279G8073c24635g7946I3385a40079j40245C4540f0460b650
15518E3075J15972a09902l41945A60914f7352C56462j07513m0343a67554f6347
15507e20539a61337C19512r4420K58592a0720k7739A53322a7418A31853m0080
$$ y = [-154433, 306277, -253942, -156055, -95231, 20758, -36194, 57922, 168842, -12719, -59533, 165977, 147137, 6561, 223190, -262320, 157453, 110812, 54414, 98705, 14617, -79229, -202281, -9930, 110686, 159525, -144344, 342982, 227120, 19245, 76774, -168847, -330864, -266434, -217358, -232463, 235310, -33301, -34230, 100814, -147406, 125062, -155946, 5075, 223146, -89733, -33495, 285497, -149441, -380573, -45403, 64652, -179186, -195288, 12870, 48775, 79920, -121389, 181728, 84304, -41279, 78073, -324635, -77946, 93385, -140079, -280324, 34540, -60460, -2650, 53075, 169047, -109902, -451847, 160914, -67352, 356462, 248949, 208606, -167554, -66347, -520539, -161337, 319512, 225092, 483684, -10720, -38459, 153322, -17418, 131853, 91773]
15497I1773K0932K74571R962I7765d5826q374C5308L2909c42950J01767j22152
15486c63335O8350A28706N4246j7262A2808J30208e4082B96585b92263C3310a04043
15474a80791B61743q7830P6379B4052M44128I3780b75175L2420G5933l1152a93043
15462A05721b58630d7274F8625P4797B1679a53124E96J09943l4211J31393a80947
15450a82352D209c1353A10470C1678Q411R363c6678q2591K231D3760F237d16667
15437A30106E098c793A70930b08735A50068D8852g9746b263l79553A18e13804
15425a92745A93340i1757o8093N4580M3375F4145R4048c4291A4736K2167i7416
15413a42733F986P9858a67204C799P2452a95750B52972j22450E1063J07041d10843
$$ y = [91773, 112705, 387276, 397238, 97765, -45826, -54200, 35308, 68217, -342950, -241183, -363335, -294985, 128706, 182952, 165690, 12808, 143016, -54082, 296585, -292263, 33310, -104043, -180791, 261743, 173913, 250292, 24052, 468180, 93780, -275175, -242755, 75933, 44781, -193043, 105721, -258630, -47274, 68625, 143422, 21679, -153124, 596, 110539, 76328, 207721, -180947, -182352, 4209, -31353, 110470, 31678, 40089, 49452, -36678, -119269, -117038, 43760, 6237, -416667, 130106, 5098, -3793, 170930, -208735, 150068, 48852, -79746, -2263, -381816, 118, -513804, -192745, 193340, -91757, -159850, -105270, -61895, 64145, 158193, -34291, 14736, 36903, -97416, -142733, 6986, 86844, -167204, 3799, 76251, -195750, 252972, 130522, 51063, 158104, -410843]
15401A80861A5263a16728B13542j8480a07420c5437j2570H0069c82842B11186
15390C90876F0044L21695a99313a9242B99427a47526j2579b7747k14258C8960
15379f47329C1074g0114A75821G0166j4368M3938j592a34121C93818j53729p863
15368B32226c2002I2425a04300C68621I4995b42038A69687B0273J50139F793b5161
15356I7659J5352a65625E51596i8367C5782a36394B68811F2142a09052A12267
15345d36075A97827a64667b2264n5332B7087J7022b45339k57726A58966D8084
15334A61022C5824g7736B32991H271e2486F3253b37096A52951J29694a22159A32384
15322B03572a26115R635M2645J625G5516K749k182J24199m043b43964I203b50373
$$ y = [180861, 15263, -116728, 213542, 195062, -107420, -35437, -48007, 80069, -382842, 211186, 390876, 60044, 381739, -199313, -19242, 299427, -147526, -160105, -27747, -242005, 38960, -647329, 31074, -70114, 175821, 70166, 55798, 99736, 98144, -134121, 393818, 240089, 232226, -32002, 92425, -104300, 368621, 94995, -242038, 169687, 20273, 170412, 6793, -25161, 97659, 113011, -165625, 551596, -98367, 35782, -136394, 268811, 62142, -109052, 112267, -436075, 197827, -164667, -22264, -77596, 27087, 44109, -245339, -503065, 158966, 48084, 161022, 35824, -77736, 232991, 8271, -52486, 63253, -237096, 152951, 282645, -122159, 132384, 203572, -126115, -116480, -73835, -72210, 75516, 78265, 76083, 200282, 196239, -243964, 9203, -250373]
15309d0696n2539C01679a30638a1539D2716R0848K9101a58171d8488j8809D00392
15297a82497B38606R2804j63669J71982G015J22624b15459N9960d023A71240J07479
15286B78719a79386j57599b6355k31656d0477q3275K0623j71957i7430I0997J5876
15275A06873l7306g50340a7921o3131J7114m2545C44865a98732D38180H1273b3258
15263G4058J38344g1105j98864c3913n5179l916A46563B9040L14106r0653p9416
15252A73077D0573J80121L64713r2992O82582O28422j82288J06015k99858E24144
15241H6860a04620I2833J41621I6417a24565B42646c88974A32428a29878I1043
15230i4757A71358Q9219K463a12687c9871E3766k1484A5252h6160B14728l8659
$$ y = [-40696, -93235, 301679, -130638, -11539, 42716, 133564, 162665, -158171, -48488, -67297, 400392, -182497, 238606, 331410, 167741, 339723, 7015, 129639, -215459, -155499, -4023, 171240, 278719, -179386, -336985, -26355, -258011, -40477, -123752, -103129, -275086, -97430, 90997, 106873, 69567, -750340, -17921, -81052, -63938, -106483, 344865, -198732, 438180, 81273, -23258, 74058, 212402, -71105, -269969, -33913, -89092, -93008, 146563, 29040, 343146, 252493, 173077, 40573, 220694, 585407, 492415, 1174997, 1803419, 1621131, 1727146, 1427288, 524144, 86860, -104620, 92833, 234454, 96417, -124565, 242646, -388974, 132428, -129878, 91043, -94757, 171358, 260577, 263040, -112687, -39871, 53766, 32282, 15252, -86160, 214728, 176069]
15219A76069j4805a32816N1245D18398a3485D22132h126j01252A25390c963k7245
15208c1208J1455B75327I0680f4423A15368b62526B83157I5438B2855J80384J48502
15197C51741A01787B6571b77003D9921b99786h8369p1855A87174H6170a87864
15186A32360f0C16320E0999K13065g102j15166B71435j33280b5161A65299g2392
15174A4117M28303A9279M3608O1742J93151E2159J76808a38830A01696K6351m0543
15163H7504b59384r7031A12629e15657a32224B11231c1993A00783e0506A88402
15152A90720J1289a74621B91786k9153A13584B9366J75477K28418B09939l7227
15142A72712a13942B13968J02357j33801d5347C3959b70590C76768b11123A09103
$$ y = [176069, 161264, -132816, -81571, 418398, -13485, 422132, -8126, -109378, 125390, -3963, -31208, -19753, 275327, 90680, -64423, 115368, -262526, 283157, 95438, 22855, 203239, 351741, 101787, 26571, -277003, 49921, -299786, -88369, -160224, 187174, 86170, -187864, 132360, -60, 316320, 50999, 264064, -7102, -122268, 271435, 138155, -25161, 165299, -72392, 14117, 442420, 19279, 62887, 124629, 317780, 52159, 228967, -138830, 101696, 128047, 87504, -259384, -356415, 112629, -515657, -132224, 211231, -31993, 100783, -50506, 188402, 190720, 202009, -174621, 291786, 262633, 113584, 29366, 204843, 433261, 209939, 172712, -113942, 213968, 316325, 182524, -45347, 33959, -270590, 376768, -211123, 109103]
15131H93L0265b02078O7652A03766l7661A2991R8728i8955F2848K21585A19546
15119E0094K70652m3903p7770f4949F608N2132J33104r4811a37620B90388b9719
15107A43764J66229A31449i3876C74177M3518a49750B87111m4671D6668J428R0436
15096A38532m3116i214j14868C10373f2889A97441h2244k74780B22668A02371
15085I9954J37465e4174A94826c1945C8257j0594K45159p1019G0800O7688E6656
15073B41966o6737R9721F4055Q1429O1508a1554q0714E2545j8756M4703K33553
15062C12045h2019A4327J01854J96693b91456D26335L232D5815K32877J75606
15052D54298j40994a47587B81447b49283B21153N515r7163J74686A33563f9323
$$ y = [893, 31158, -202078, -134426, 103766, 66105, 12991, 111719, -98955, 62848, 284433, 119546, 50094, 320746, 276843, 199073, -64949, 6608, 58740, 191844, 97033, -137620, 290388, -29719, 143764, 309993, 131449, -93876, 374177, 417695, -149750, 287111, 242440, 46668, 48096, 138532, 95416, -9214, -124082, 310373, -62889, 197441, -82244, -357024, 222668, 102371, 99954, 237419, -54174, 194826, -31945, 38257, 27663, 272822, 201803, 70800, 138488, 56656, 241966, 175229, 274950, 64055, 145484, 206992, -11554, -92268, 52545, 33789, 78492, 312045, -82019, 14327, 116181, 312874, -291456, 426335, 429567, 45815, 278692, 454298, 313304, -147587, 281447, -249283, 221153, 226668, 129505, 304191, 133563, -69323]
15041D927b08211E12867A75739i1092B84353P4568A9626L3150M5849M23900A01140
15029B92669k5884C6757P0336L29173F2361K8117b0662H8166J18986Q787J70744
15018C86683A85279Q7859C8165N4631J62864l4917g7551D18737R0055j69192d3448
15006A5163J24411M31129q2843B1882L84745j88071J90600F2829K10188j12115
14996A60902a57220g2730A78073K48177c69582B06507l0957g7780C37313b04703
14985B78087N2227k8083G9431L20613j73709H3958J10835C2212J77027g7741C2821
14973B50806L2369m4445b25365B27844L5776J27681n7084H0373A8581Q580J29334
14962A56495l8831J34818K21715j91711j2062L8738J8446Q6275j1932j30003J13474
$$ y = [4927, -208211, 512867, 175739, -91092, 284353, 358921, 19626, 52776, 98625, 522525, 101140, 292669, 266785, 36757, 107093, 436266, 62361, 90478, -20662, 88166, 207152, 215939, 386683, 185279, 273138, 38165, 92796, 255660, 220743, -77551, 418737, 508792, 339600, -43448, 15163, 139574, 570703, 487860, 21882, 406627, 218556, 409156, 62829, 273017, 160902, -157220, -72730, 178073, 426250, -369582, 206507, 175550, -77780, 337313, -204703, 278087, 330314, 302231, 79431, 400044, 226335, 83958, 194793, 32212, 209239, -77741, 32821, 250806, 283175, 238730, -225365, 227844, 263620, 391301, 334217, 80373, 18581, 27161, 156495, 117664, 252482, 474197, 282486, 270424, 309162, 327608, 413883, 401951, 271948, 385422]
14951C85422q5049J0667K02a27051l7331B53131K51430B11674d7120b1349D97918
14939E7285M70686j57087m4525O1862j72605K98539J1753j50267o0516A08811
14928A38120K86954j01375J05984o0936D016J70009K40155q3927L538O9547d1763
14916C7589J10829M6055J93661q5494d5833C93826d8541D63883K04084B09577
14905D61790j75151O1629A31704K02813k6513L0608k0690J58131k35481M727N432
14894B50731K73961c6749B23688D5577J97137J23913l5853f3031B79552p6331
14884B03221M7367j00532K68309k07068n7631L89424j91495j57945l4929K22647
14874C81368o2655J57771B06969J15763A40072L39612j45806n7255j32818K03642
$$ y = [385422, 300373, 311040, 311242, -127051, -164382, 253131, 504561, 211674, -47120, -21349, 497918, 57285, 527971, 370884, 326359, 388221, 215616, 514155, 525908, 375641, 315125, 108811, 138120, 425074, 323699, 429683, 368747, 4016, 174025, 414180, 330253, 333791, 403338, -41763, 37589, 148418, 194473, 388134, 302640, -45833, 393826, -48541, 463883, 667967, 209577, 461790, 286639, 348268, 131704, 334517, 308004, 338612, 317922, 476053, 240572, 245299, 250731, 524692, -36749, 223688, 45577, 242714, 366627, 330774, -63031, 279552, 203221, 250588, 150056, 418365, 211297, 153666, 543090, 351595, 193650, 158721, 381368, 318713, 476484, 206969, 322732, 140072, 479684, 333878, 276623, 143805, 347447]
14864C47447J66416R5708k77601J23356Q2430j69653L2875K38739A65516L05440
14854D70956j00082J88722A84226K57874k03316j09562K13253J25567B33009M53
14844B33462J93076J31065A90758K50471J17755q0627n6796L5416M1889n4538
14834D44328n1896j01920J63376j02863J1076K42486A96848J79431l9886J34037
14824D70430B21495J23218L16391k02775J38622B63619M7724K30201c4174E39382
14813G97773C47231J32600n9354p6371o3143K06267P2157l8042A72164J74297
14803C46461j1753K7840K2723J35733o2932o1821J0830m1985L95531C15201L04961
14792F20162j2975q0252J60581k92098J47252k02297n9099K06628k06271L17497
$$ y = [347447, 513863, 609571, 331970, 455326, 537756, 368103, 400978, 639717, 165516, 470956, 370874, 559596, 184226, 442100, 238784, 129222, 342475, 468042, 233009, 233462, 426538, 557603, 190758, 441229, 558984, 478357, 421561, 456977, 498866, 444328, 392432, 290512, 453888, 351025, 362101, 604587, 196848, 376279, 336393, 470430, 221495, 344713, 661104, 458329, 596951, 263619, 311343, 541544, -34174, 539382, 797773, 347231, 479831, 420477, 344106, 280963, 487230, 559387, 521345, 172164, 346461, 334708, 362548, 385271, 521004, 458072, 396251, 407081, 365096, 760627, 315201, 620162, 607187, 526935, 687516, 395418, 542670, 340373, 281274, 487902, 281631, 599128]
14782E99128K66153k45468j33310K43397r8614n7638j78654L34865k70256L41414
14772H01017k15088j85154L09721J6607J47046k85774R2440j37792j72893Q5531
14762D55661I9003M80987A20993O49866B86497K06064L23610A48817K41869J21191
14752E11877J17751K3549l20752L57602R6644C05598n4665J52416M50568C99847
14741G16286L415J7447j37213J03875j33975k1644M92494C11802J28001M94613
14731I34416n5267C35454K52459k16925l6711K95307Q4867j00358m2837M32165
14721A003421r3239l00619q7144K98469k8492K4027J73751l04664L2182j64953
14711E52739K30685j51433K45299k33907K88643r7366k25976M2720K14893K92492
$$ y = [599128, 865281, 619813, 486503, 729900, 631286, 573648, 394994, 729859, 459603, 801017, 585929, 400775, 710496, 727103, 874149, 588375, 680815, 543023, 370130, 455661, 99003, 579990, 120993, 770859, 286497, 492561, 816171, 148817, 390686, 511877, 629628, 653177, 332425, 690027, 786671, 305598, 250933, 403349, 853917, 399847, 716286, 719701, 737148, 599935, 703810, 569835, 548191, 1040685, 311802, 439803, 934416, 879149, 335454, 587913, 370988, 334277, 629584, 714451, 614093, 571256, 1003421, 910182, 609563, 522419, 820888, 792396, 816423, 990174, 685510, 717692, 552739, 783424, 631991, 877290, 643383, 932026, 834660, 608684, 651404, 866297, 1158789]
14701A158789m29060L37357n14561J55941K65125m9913j57146N7523R2473j07578
14691H08950L0752l54310N24002j3724M6527k22944J68120j34054j61658J28996
14681H20657q8823J27024K9307J93145j50850Q9276j96512J89292j97225k8708
14671G86583M69298n44311O44706F66620K13889J46209q7680M8478J22395k79473
14661H30438l06933P11730k11440m2320j74100M41986k27009J71217q2594J34592
14651A245567k11309J03162j41022N4876M2686L19100k65268n4060p4402q6991
14641I32339L83338l6292k20642j7775n3487K71843l33438J83568k4122J8234
14631A103566J03048j44684j18446O0705N01347j43028J14125l26581Q3782J32073
$$ y = [1158789, 729729, 1067086, 552525, 708466, 973591, 923678, 766532, 824055, 916528, 808950, 839702, 485392, 1009394, 995670, 1042197, 819253, 987373, 853319, 691661, 820657, 731834, 858858, 888165, 1081310, 930460, 1019736, 823224, 1012516, 815291, 786583, 1255881, 711570, 1356276, 666620, 880509, 1026718, 939038, 987516, 1109911, 830438, 523505, 1235235, 1023795, 981475, 807375, 1249361, 1022352, 1193569, 1110975, 1245567, 1034258, 1137420, 996398, 1051274, 1093960, 1413060, 1147792, 1093732, 1019330, 932339, 1315677, 1279385, 1058743, 1040968, 987481, 1259324, 925886, 1109454, 1085332, 1103566, 1206614, 1061930, 943484, 1004189, 1505536, 1362508, 1476633, 1150052, 1233834, 1365907]
14621A365907K5848k30119J80218k46501J84676J86516m08957K14630o0193J0794
14611A222819M32818l09468J02994r5047M9305J48816M4130k8582k2862K3366
14601A568289J8845J45535k50068L42798l19622O6567m25897O94804l14118M74996
14591B002129l44110K44019k30021rJ77649j42875K41335k77140j92444K3303
14581A501836N63097k83393M4006q9136L41503k13283J26944j19479j33503J49027
14571A887619o754Q2213K2081R775J7843J61021p4789K44245j18349J58872R916
14560B393693J18959P4781k12729L81225j76825L37509K02306K70405k3536P81595
14550D147383P65105J545617L253872Q629493K2055654R042898B2042437A0426881
$$ y = [1365907, 1391755, 1161636, 1341854, 1095353, 1280029, 1466545, 1057588, 1272218, 1212025, 1222819, 1655637, 1346169, 1449163, 1354116, 1403421, 1552237, 1596367, 1567785, 1544923, 1568289, 1587134, 1732669, 1482601, 1825399, 1505777, 1572344, 1146447, 1841251, 1527133, 2002129, 1658019, 1902038, 1672017, 1672008, 1849657, 1706782, 1948117, 1670977, 1478533, 1501836, 2064933, 1781540, 1825546, 1736410, 2077913, 1864630, 1991574, 1872095, 1738592, 1887619, 1880865, 1963078, 1985159, 1994934, 2012777, 2173798, 2099009, 2343254, 2224905, 2383777, 2393693, 2512652, 2587433, 2374704, 2755929, 2579104, 2916613, 3118919, 3389324, 3365788, 4147383, 4912488, 6458105, 9711977, 18341470, 40397124, 49440022, 22042437, 10426881]
14541D562940k079624k49186j96000j07707m1104J24384m36751J37487J18076
14532A832515M3969j54083L91985l87124L89251j11279K53186K1206l79559K26620
14522B126687O1714m3456K05743j31301J42919k30369J02776O3931N6024p2469
14512B282199M08392L4453l58403K59728l6169M2615J01705k19820M98714m7666
14502B965748j65697M3659R5139J79051j25993k04150K5862L09788j14626J25875
14492C134656N7724r1580j04244J30185J73088m34386M40926J8254M03151k88327
14482C439447m8101J27607j09106L65829J51780k10904K1241R5932k97346P8724
14472C615103K41215j5978M31951m09729J56932L24394q699k47837l47222O56808
$$ y = [4562940, 2483316, 2234130, 2038130, 1930423, 1889319, 2013703, 1576952, 1714439, 1832515, 1876484, 1722401, 2114386, 1727262, 2116513, 2005234, 2258420, 2279626, 1900067, 2126687, 2188401, 2144945, 2350688, 2219387, 2362306, 2131937, 2234713, 2298644, 2354668, 2282199, 2690591, 2725044, 2366641, 2626369, 2590200, 2632815, 2734520, 2514700, 3013414, 2965748, 2800051, 2843710, 2938849, 3117900, 2991907, 2787757, 2813619, 3123407, 3008781, 3134656, 3192380, 3100800, 2996556, 3126741, 3299829, 2865443, 3306369, 3324623, 3727774, 3439447, 3391346, 3518953, 3409847, 3775676, 3927456, 3716552, 3737793, 3833725, 3536379, 3615103, 3856318, 3840340, 4272291, 3862562, 4019494, 4343888, 4335189, 4087352, 3740130, 4396938]
14462D396938l26029J54900K36374K44538p3074j75497J77329K02403K2120M4285
14452D904287k58639L54512k68J30203j48430K40763l01587N83991O4702k73222
14442E296312K36037o8350J36118o726J40553l5004J26234J02947R5766L78263
14432F402150j2554k41365M89033J09321k43713J95533Q5608K70037L4187j82105
14422F906132K61226Q9614M11367l65518J56905L99442j6869l9562M84983l71769
14412G915951M30149J75933j53040K96359j93015J35319L39180L30979k27984
14403I049831J67505J86147J82073m6530L89027M89474n6386l44076L96604O48841
14393A1062510p4082N1877K30740j2645M44419M55677n33261N77416k9123O08478
$$ y = [4396938, 4070909, 4225809, 4462183, 4706721, 4633647, 4458150, 4635479, 4837882, 4860002, 4904287, 4645648, 5000160, 4999892, 5130095, 4981665, 5222428, 4920841, 5504832, 5569534, 5296312, 5532349, 5463999, 5600117, 5593391, 5733944, 5698940, 5825174, 5928121, 6023887, 6402150, 6389596, 6148231, 6637264, 6746585, 6502872, 6698405, 6784013, 7054050, 7088237, 6906132, 7167358, 7256972, 7668339, 7302821, 7459726, 7859168, 7842299, 7802737, 8287720, 7915951, 8346100, 8522033, 8368993, 8665352, 8472337, 8607656, 8946836, 9277815, 9049831, 9217336, 9403483, 9585556, 9539026, 9928053, 10417527, 10361141, 10017065, 10413669, 11062510, 10988428, 11040305, 11271045, 11258400, 11702819, 12158496, 11625235, 12202651, 12173528, 12782006]
14383A2782006k8698N84260k07510J66637J84620M67872K20251J53314K25009
14374A4547761J16749N95075L24503j00284N83208N99051M33578K2868N94217
14365A7716726M25490J4355N78843N42908M0950N31998Q36269M4033O40185K4172
14355B1395929J027574J30026P28191O41328M32293Q48075J66854Q21245P90576
14346B6982091M42809R65901O34012R78240O07180R78319R57944N04936Q83965
14337C3935397R21909J229745Q85010J377187J269982R50568J214667J006586
14329D2791051J683455J449024J376588J561029J737391J572913J811015J726264
14321E5708730K067622K224621K145591K387634K411569K308997L010102K680700
$$ y = [12782006, 12753308, 13337568, 13130058, 13296695, 13481315, 13949187, 14169438, 14322752, 14547761, 14664510, 15259585, 15584088, 15483804, 16067012, 16666063, 17099641, 17122509, 17716726, 18142216, 18156571, 18735414, 19278322, 19319272, 19851270, 20687539, 20731572, 21371757, 21395929, 22423503, 22553529, 23281720, 23923048, 24355341, 25203416, 25370270, 26191515, 26982091, 27424900, 28390801, 29024813, 30003053, 30610233, 31588552, 32546496, 33051432, 33935397, 34857306, 36087051, 36972061, 38349248, 39619230, 40569798, 41784465, 42791051, 44474506, 45923530, 47300118, 48861147, 50598538, 52171451, 53982466, 55708730, 57776352, 60000973, 62146564, 64534198, 66945767, 69254764, 72264866, 74945566]
14313G4945566L270866K861076L658742L439948L634563M219494M277894M399067
14305A04707216M770308M962015N700667N663045N958763O582427P023608P352014
14297A52720063P773886Q475648Q610931R663652J0569149J0408636J1366019
14290B19587984J1862283J2875455J3383730J4252263J4730456J5264540J6038639
14283C17995350J6472480J6465335J7121870J7037295J6530090J6380406J4899264
14276D32902090J4177300J2429899J0302616P580027M107117N58930k322684k467526
14268D77267769k125143m888442p131511j0964254j3393799j4625652j5625321
14261D08513647j6558156j7123436j7277460j6741385j7431023j6394279j5739133
$$ y = [74945566, 78216432, 81077508, 84736250, 88176198, 91810761, 96030255, 100308149, 104707216, 109477524, 114439539, 120140206, 125803251, 131762014, 138344441, 145368049, 152720063, 160493949, 168969597, 177580528, 187244180, 197813329, 208221965, 219587984, 231450267, 244325722, 257709452, 271961715, 286692171, 301956711, 317995350, 334467830, 350933165, 368055035, 385092330, 401622420, 418002826, 432902090, 447079390, 459509289, 469811905, 477391932, 481499049, 482057979, 479735295, 477267769, 475142626, 470254184, 463122673, 452158419, 438764620, 424138968, 408513647, 391955491, 374832055, 357554595, 340813210, 323382187, 306987908, 291248775]
14254B91248775j4062311j4070614j4139847j3311477j2232972j1927103j1134893
14247B00369558j0209231j0183892q751503q179644p968509p767939o951121o799764
14239A33557955o261408n472069n467957n340801n114392m579792m037796m090057
14231I3193683l625492l824392l545986l200076l198508k788390k694263k825573
14223F7491003k467185k228096k302996j931150j851476k258746j620356j994432
14215E0836566j846400j123615r77921j824157j608920j210100j466009r23068
14207C9856376l13533r89949j645644j084144j259126j008967n01347p05989q21305
14198C1526372j282329q07955q16390n11413r45099j58534o82723j208670k46861
$$ y = [291248775, 277186464, 263115850, 248976003, 235664526, 223431554, 211504451, 200369558, 190160327, 179976435, 171224932, 163045288, 155076779, 147308840, 140357719, 133557955, 127296547, 121824478, 116356521, 111015720, 105901328, 101321536, 97283740, 93193683, 89568191, 85743799, 82197813, 78997737, 75799229, 73010839, 70316576, 67491003, 65023818, 62795722, 60492726, 58561576, 56710100, 54451354, 52830998, 50836566, 48990166, 47866551, 46888630, 45064473, 43455553, 42245453, 40779444, 39856376, 39542843, 38552894, 36907250, 35823106, 34563980, 33555013, 33053666, 32347677, 31526372, 30244043, 29436088, 28619698, 28108285, 27163186, 27004652, 26321929, 25113259, 24866398]
14189B4866398q66727l75448p32028p44774j89297m64427n19823n60835l80102
14180B0032937o53089k87813k35266m48958l31020o19666K3149o22925j85314
14171A6672035o74371K7043M2974m82289q46744l03527K04197o27131R391o13523
14161A3408055k52350p4344k01080J04455q81014L3612J48412l66457l43109J64157
14151A1740337m81685m60603J10081o43450J68098K24553k59355l5857m35235
14142I926884l64200L56495m43038j55226j97202m04190K47827l05729n5591k40846
14132H365184l7994r2219l04613R7963j28733k94225J5502q3580j53612K06618
14122G590291m01792J12943R0691q04602L48788o9681r5579k34631k64176Q7435
$$ y = [24866398, 23999671, 23624223, 22892195, 22147421, 21958124, 21493697, 20973874, 20413039, 20032937, 19379848, 19092035, 18856769, 18407811, 18076791, 17457125, 17480274, 16857349, 16672035, 15997664, 16024707, 16067681, 15585392, 14738648, 14435121, 14639318, 14012187, 14021578, 13408055, 13155705, 13081361, 12880281, 12984736, 12103722, 12137334, 12285746, 11919289, 11576180, 11740337, 11258652, 10798049, 10908130, 10264680, 10432778, 10657331, 10397976, 10362119, 9926884, 9562684, 9919179, 9476141, 9320915, 9123713, 8719523, 8967350, 8661621, 8606030, 8365184, 8327190, 8234971, 7930358, 8028321, 7899588, 7605363, 7620865, 7537285, 7383673, 7590291, 7188499, 7301442, 7392133, 6587531, 6936319, 6866638, 6771059, 6536428, 6272252, 6359687]
14112F359687j18473Q5557n2450k76735P1008k51409N917l85062K48158O0978
14102E747176L377l28106J36717k93780R491j25953Q5138J23871R1227m6156k97323
14091E105679M9142j87074k90586q5386L09016n34452L0649K26637j40999l25262
14081D157364M95448j75020k04002K19762k41650J20853k45950j60898J91930
14072D157837k74654M27083j96463k34092k47406j9775P6412N27902j60506n84770
14062C471568K89408j47252J09100L3704p2869j29271J7593j25939l6067J81369
14052C591344l32810k02367J06586K48949k65666k1242R4572l74671J44351M53694
14042C442740m79063K84385k34162J06162m82823j04056N14183o7427k96557J04886
$$ y = [6359687, 6241214, 6326771, 6274321, 5997586, 6068594, 5817185, 5823102, 5438040, 5686198, 5747176, 5750553, 5422447, 5559164, 5265384, 5274875, 5148922, 5234060, 5357931, 5449158, 5403002, 5105679, 5154821, 4967747, 4677161, 4591775, 4900791, 4366339, 4396988, 4623625, 4482626, 4157364, 4652812, 4477792, 4273790, 4493552, 4251902, 4372755, 4126805, 3965907, 4157837, 3883183, 4310266, 4113803, 3879711, 3632305, 3612530, 3688942, 4216844, 4056338, 3471568, 3760976, 3613724, 3722824, 3756528, 3683659, 3554388, 3571981, 3446042, 3409975, 3591344, 3258534, 3056167, 3162753, 3411702, 3146036, 3124794, 3219366, 2844695, 2989046, 3442740, 2963677, 3248062, 3013900, 3120062, 2637239, 2533183, 3047366, 2979939, 2683382, 2788268]
14032B788268N90640o26558J17627K0601o55471K24510J22028r2894O4420k61001
14022B292170K56419k35791J44724O6520j46623K688J59300o9757k64948J31871
14012B336573o2854k32551L44200m11270M15669j36912K80408j86555j73051J18555
14002B292212j78950o8294l249J79172l21923L0151J72179Q4905j81158l31962
13992A673083M6234L15378J96561M90625J980654O538922K1062550J8431446k3884707
13983B6850746A2391561n190549j740271j142919p21497M1387n30233j21072m35652
13974B550755O8991K6810j38638k3743q6173j51147k29927m0459l17916M12653
13964B071206k30980M53974k47269k42582K12118p3916j79936J92286K00025l44018
$$ y = [2788268, 3378908, 2752350, 2869977, 2890578, 2235107, 2459617, 2581645, 2488751, 2553171, 2292170, 2548589, 2312798, 2457522, 2524042, 2377419, 2380107, 2539407, 2469650, 2204702, 2336573, 2273719, 2041168, 2385368, 1974098, 2389767, 2252855, 2533263, 2346708, 2173657, 2292212, 2113262, 2044968, 2041719, 2220891, 1898968, 1929119, 2101298, 2186203, 2005045, 1673083, 1719317, 2034695, 2231256, 2721881, 4702535, 11241457, 32304007, 50735453, 26850746, 12391561, 7201012, 5460741, 4317822, 3596325, 3637712, 3107479, 2986407, 2550755, 2619746, 2646556, 2507918, 2484175, 2398002, 2246855, 2016928, 1976469, 1658553, 2071206, 1840226, 2294200, 2046931, 1804349, 2016467, 1942551, 1762615, 1954901, 2154926, 1810908]
13954A810908M3905q2799j71814L76717k39615r8725J01232R0937k69391n5596
13944A505759N4887J23339k32720j5693J28151k54133K68178q6867M9372Q7655
13934A627928k29526l70392Q27642l32518k02248L30534j32027k69062K84823
13925A535154n9281J81241p951o3206n38599N70165l08156L27580k08909j2616
13915A415422j39255j60817O6615J56978l98354L727J89659J30616j63148N9561
13905A161004Q790Q2570n0564P9656l22706J16061M0032J38584j21806J73980
13895A305601k66948m367P8160k57362J12600J03862L40917j10005J47489j82613
13885A267334j82981J8736p9052J98439j91838L0089j14162K58700E88165L95467
$$ y = [1810908, 1854813, 1772014, 1600200, 1976917, 1737302, 1638577, 1739809, 1830746, 1561355, 1505759, 1560646, 1683985, 1451265, 1435572, 1563723, 1309590, 1577768, 1490901, 1540273, 1627928, 1398402, 1028010, 1855652, 1523134, 1320886, 1651420, 1519393, 1250331, 1535154, 1475873, 1657114, 1649163, 1585957, 1047358, 1617523, 1309367, 1636947, 1428038, 1415422, 1276167, 1115350, 1181965, 1338943, 940589, 944316, 1133975, 1264591, 1101443, 1161004, 1169794, 1252364, 1201800, 1281456, 958750, 1074811, 1114843, 1253427, 1131621, 1305601, 1038653, 1034286, 1112446, 855084, 967684, 1071546, 1412463, 1302458, 1449947, 1267334, 1084353, 1103089, 1024037, 1222476, 1030638, 1060727, 946565, 1205265, 588165, 983632]
13875I83632L42926m30194R9939j72693K74995J38091L3650k06587J34493k46192
13865I52060l4939L32808j75111j87071J87145n2660K44694k06692j95597k41792
13855F22845J73374K97965J13796k68157n6948l1496K13053N2060K69901m69496
13845I16897D28333N43643j65477J02162j4428K1353p1006p0885j6689J77665
13835I34671k42643L0772N30960D99259L40791K22650k73148K17161k53258C33062
13824I55503k39696j6542J0160j71137Q2541K66160m13432M18740k19623J4048
13814F86722J57314l95120N66860m06235L09245m07950J47132K26348l75086Q7333
13804E96563K57319l37616J56695q6808K38138C47916J03148J09720L56743k00929
$$ y = [983632, 1326558, 896364, 996303, 823610, 1098605, 1236696, 1270346, 1063759, 1198252, 952060, 917121, 1249929, 1074818, 887747, 1074892, 1022232, 1266926, 1060234, 864637, 622845, 796219, 1094184, 1207980, 939823, 882875, 851379, 1064432, 1116492, 1386393, 916897, 428333, 971976, 806499, 908661, 894233, 915586, 844580, 773695, 757006, 934671, 692028, 722800, 1253760, 499259, 840050, 1062700, 789552, 1006713, 753455, 333062, 955503, 715807, 699265, 709425, 538288, 620829, 886989, 473557, 892297, 672674, 686722, 844036, 448916, 1015776, 609541, 918786, 510836, 657968, 884316, 509230, 596563, 853882, 516266, 672961, 586153, 824291, 347916, 451064, 560784, 917527, 716598]
13794G16598j86014L05352j20042j43914j64898K61422Q6450P6284k93751k05077
13784C32410k8207O72648l97045j0557M7905k89372O05535o741l0865C84255L08004
13773F92259n8632J33701j02118J9393k63096J71893J17637k40712r9056K87861
13763F59130J08898J2453o9838C06056N21317l34713M18989D41817L53523l23726
13753D71614K52504C11063K18157M9252k46349L60609l5355Q2276j43653B95435
13742E51776q630P2796k82078N9306K57278j26257P9751J00303l22201J23164
13732E05208J20821j28914A18029K92728J59452K29395j20214l08008K21359j48484
13722D44257q7709L56221j96741j32378M36790m00084j18276Q7390J94590K8444
$$ y = [716598, 530584, 835936, 715894, 571980, 407082, 668504, 754954, 831238, 537487, 332410, 304203, 976851, 579806, 569249, 617154, 327782, 933317, 926576, 895711, 384255, 692259, 633627, 767328, 665210, 684603, 421507, 593400, 711037, 470325, 371269, 659130, 768028, 780481, 710643, 306056, 827373, 492660, 911649, 441817, 795340, 471614, 724118, 311063, 529220, 578472, 332123, 692732, 657377, 739653, 596000, 295435, 551776, 543146, 615942, 333864, 393170, 650448, 524191, 603942, 704245, 382044, 505208, 626029, 497115, 118029, 410757, 570209, 799604, 679390, 371382, 592741, 444257, 356548, 712769, 516028, 383650, 820440, 420356, 302080, 389470, 584060, 612504]
13712F12504B74942P7117J16435P4295R1115r9200j12550A93212L12266r7789
13702D07689K21252B58312N01716l53862p8944K04790A94303N93939G8062L31948
13692D10010j48514N23703B36663L01026k03804R3618J1574M6035K2744j18419
13682C89437N8548k12614O517B3856L76256j4022o3139J89218n8954J78954P6943
13671G09112l01737A68986L22942O3296r6622j18180l1548K28125A2800J28835
13661A41635J43753K23514A01639M78608A05635D6238O84510B71978I2431K69263
13651C61694Q5267B12102L43759j99203k6514J42205B31767L04589A61454J94906
13641C56360J4858K35520k26776j11495p5054M67015k04280P3953j86359J08540
$$ y = [612504, 274942, 352059, 468494, 542789, 633904, 534704, 422154, 193212, 505478, 407689, 628941, 258312, 760028, 406166, 327222, 532012, 194303, 788242, 78062, 410010, 261496, 785199, 236663, 537689, 333885, 427503, 439077, 485112, 507856, 389437, 447985, 235371, 241888, 23856, 400112, 386090, 322951, 512169, 453215, 632169, 709112, 407375, 168986, 491928, 555224, 458602, 340422, 308874, 536999, 12800, 141635, 285388, 508902, 101639, 580247, 105635, 46238, 730748, 271978, 92431, 361694, 446961, 212102, 555861, 356658, 330144, 472349, 231767, 536356, 161454, 356360, 371218, 606738, 379962, 268467, 193413, 660428, 456148, 530101, 343742, 452282]
13631D52282q5598F9871L30278A54543M22881q3040A43407K18367Q2986j95387
13621B49373K4759J89189j58130K90147B74881j01976N7862L54511B09990j6118
13611A93872L37173A32836J57401M9386a59069A03806K29171A06423g5140A53211
13600D65371H3296L92359B4482K69190q4095K7689l590B883K05749K78753A63369
13588C02814K43776F9769R3884e8377E46576B16437q765L88654f8028C75864A29878
13576B51843F1456K92474J3469A70176p574J44548J12073j78251L7045N3118j32088
13565A99047K13694A40260K65582B00206M58731B00365L22932B54477j07521B5197
13554C35047j29247M7201d7246B72559C8896M83225k02269f9461L0549E16856
$$ y = [452282, 366684, 69871, 400149, 154543, 577424, 494384, 143407, 361774, 444760, 249373, 274132, 463321, 305191, 595338, 274881, 172905, 230767, 585278, 209990, 193872, 531045, 132836, 290237, 339623, -159069, 103806, 332977, 106423, -75140, 153211, 465371, 83296, 475655, 24482, 293672, 209577, 237266, 233676, 2883, 208632, 487385, 163369, 302814, 546590, 69769, 163653, -58377, 546576, 216437, 207672, 596326, -68028, 375864, 129878, 251843, 61456, 353930, 367399, 170176, 162602, 307150, 419223, 240972, 278017, 331135, 199047, 412741, 140260, 405842, 200206, 658937, 200365, 523297, 254477, 146956, 25197, 335047, 205800, 253001, -47246, 272559, 38896, 522121, 319852, -69461, -38912, 516856]
13543h6792b0806B36388l3880A4742L37553J3432l901A18142J1528K40385n3654
13532C16401J50218q0306B0947K91610j22244K4196j06708Q9347J64228A54257
13521B94315A08198L48110k07357K39904B26236j6533q3849M5376J6878A3599
13510A75323l8579j2887L90753A71170J31595A44920e0596C01383D4376L73226
13500D17602A18310O7914K46587b0832B05561j0433J95404A20154E7896J59659
13490B17555k7960F6548K68448d7665C32542q0743b3142B17662j00108J57387
13480B74941H6083K61686M1199G5419R6047j2841o4015K65824q305F3882J93703
13469B57585l0253a77746E2503J22808J25792j03485A9314J82865R2616j17658
$$ y = [-86792, -20806, 236388, 202508, 14742, 352295, 365727, 361826, 118142, 129670, 370055, 316401, 466619, 386313, 20947, 312557, 190313, 214509, 107801, 197148, 361376, 154257, 294315, 108198, 456308, 248951, 488855, 226236, 209703, 125854, 171230, 188108, 13599, 175323, 136744, 123857, 514610, 171170, 302765, 144920, -50596, 301383, 44376, 417602, 118310, 186224, 432811, -20832, 205561, 195128, 390532, 120154, 57896, 217555, 189595, 66548, 334996, -47665, 332542, 251799, -23142, 217662, 117554, 274941, 86083, 347769, 388968, 75419, 171466, 158625, 94610, 360434, 352129, 63882, 257585, 227332, -177746, 52503, 175311, 301103, 197618, 19314, 202179, 294795, 177137]
13459A77137K23547B9730n501J47769E718a09777B67833M1994K01675B12836c8544
13447C54785j62068l8980O572O7386Q4439N2991J70883A5260f8361K8747l9C08199
13434a83420B11279p9182a750I5034O8868j7786a16478B11290k6538p1299m0477
13423G2976a07737E18316j94109j61429k0559J74188K35812p0303g1715B82575
13412B21949R9392A12146J01049a9617H0426L78038a06926B29968a0422A83417
13401F2573M36550j49712m2511J46021B6837K1692K5509J9850K58213e7779H2652
13389A77549J07026A10317N0500N7822J15582d1695D07693a00136B63692N7187
13379C20879b07402B45121b1077C26598K7036j50287A0398L78759A93155a8163
$$ y = [177137, 400684, 29730, 24229, 171998, 5718, -109777, 267833, 309827, 511502, 212836, -38544, 354785, 192717, 153737, 160309, 227695, 312134, 365125, 536008, 15260, -68361, -39614, -39653, 308199, -183420, 211279, 132097, -1750, 95034, 163902, 146116, -116478, 211290, 184752, 113453, 72976, -107737, 518316, 324207, 162778, 142219, 316407, 552219, 481916, -71715, 282575, 221949, 321341, 112146, 213195, -19617, 80426, 458464, -106926, 229968, -10422, 183417, 62573, 499123, 349411, 306900, 452921, 26837, 48529, 74038, 93888, 352101, -57779, 82652, 177549, 284575, 110317, 160817, 218639, 334221, -41695, 407693, -100136, 263692, 320879, -207402, 245121, -21077, 326598, 353634, 203347, 10398, 389157, 193155, -18163]
13368B19831R3083j51333o846L81287j47852D6394J50661b96970A10133a54350
13357A74309K8946q553b05511D70392A41158M2321h6139A30523N6591Q990H1225
13345b09223A58087K7762N715J21689D7599L97035k7050j52961J32164A98123
13334A14533K47258a33039B31866n5240L9033J94709A45970J34614k5739A0422
13323A1276L99514A16021J18989J53114A49085B1869J96232k3382H2679a28312
13312e9128A03136N1870p2429L16763m0165L68083D1672J17618J64212f508o4543
13301g1051C66202o2450f6543C01201M8179A30824c3649A20189c5849o7421D8728
13289g54F3472J9932L55467A00543J11305N8351A17671A9487L21894d1577C17359
$$ y = [219831, 312914, 161581, 154735, 536022, 388170, 46394, 197055, -296970, 110133, -154350, 174309, 203255, 194702, -205511, 470392, 141158, 183479, -86139, 130523, 187114, 196104, 81225, -209223, 158087, 185849, 191564, 313253, 47599, 444634, 417584, 264623, 396787, 198123, 114533, 361791, -133039, 231866, 176626, 215659, 410368, 145970, 280584, 254845, 10422, 11276, 410790, 116021, 235010, 388124, 149085, 21869, 218101, 194719, 82679, -128312, -59128, 103136, 155006, 82577, 399340, 359175, 727258, 41672, 159290, 323502, -6508, -71051, 366202, 303752, -66543, 301201, 349380, 130824, -33649, 120189, -35849, -103270, 48728, -754, 63472, 83404, 438871, 100543, 211848, 270199, 117671, 19487, 341381, -41577, 317359]
13277B69139I2019a76924H0737B5608J41379e6516A77170G5924Q6175N3670r1439
13266A24330h9090F13003A13676b4891q1395A29196F4504b01004A336K46851K6637
13255B74824j01564K03643h5820g388C7872Q8577O1816m6289n8191J50230a48588
13243A10730J83237a14812I6508M310r028A6773h1417I7899c33069f6681A06916
13231f0337C52961a23183j0277B38066F3156J39407K1001J01913e2635k09693
13221b62328b8495H8206i1726C67578A10883r002M061f579j43684A54972a05772
13209e9709k94165A14807a5844j93945j83009h1596B788J13812K35605a94964
13198G6613K36972a8185j30813d9720A40109M25253e8719A72488o5807a13645
$$ y = [269139, 92019, -176924, 80737, 25608, 166987, -56516, 177170, 75924, 162099, 215769, 124330, -89090, 613003, 113676, -24891, -106286, 129196, 64504, -201004, 1336, 248187, 274824, 173260, 376903, -85820, -7388, 37872, 126449, 188265, 141976, 83785, 234015, -148588, 110730, 293967, -114812, 96508, 100818, 91790, 16773, -81417, 97899, -333069, -66681, 106916, -60337, 352961, -123183, -133460, 238066, 63156, 202563, 223564, 325477, -52635, -262328, -28495, 88206, -91726, 367578, 110883, 101881, 105942, -6579, -150263, 154972, -105772, -59709, -353874, 114807, -15844, -209789, -392798, -81596, 2788, 116600, 352205, -194964, 76613, 313585, -18185, -148998, -49720, 140109, 565362, -58719, 172488, 106681, -113645]
13187a0939A1550J6892J7523O0185J04446a1959I8915a6913G0041b69189h1586
13175B3476L6689b6465k26654A45094b41662e6897B93506G9196b7035b775A22894
13163B38932G5829a46746A41634a88312f7757B82006j23757R9026a29592k880
13153a32472C4445i0299A60513E997K85031H0155M7278K44905c859B27418K7719
13142B55137D1395R8759K82073a9156p2518D781J46453R1768A6513L03400A54887
13130C13468f4840C32507A34305c09289A42685c20862A59325K26401j22774b3113
13119H1470K64779p0104a8799m7632b0407J795j5320e474A08916j1497a44210
13107b82870a07366j75619a27677A86514b4662n5585B83732j18881p2554a2524
$$ y = [-10939, 11550, 28442, 45965, 106150, 210596, -11959, 98915, -16913, 70041, -269189, -81586, 23476, 60165, -26465, -253119, 145094, -241662, -56897, 293506, 79196, -27035, -2775, 122894, 238932, 75829, -146746, 141634, -188312, -67757, 282006, 158249, 257275, -129592, -132472, 34445, -90299, 160513, 5997, 291028, 80155, 127433, 372338, -3859, 227418, 255137, 41395, 140154, 422227, -19156, -91674, 4781, 151234, 243002, 16513, 319913, 154887, 313468, -64840, 332507, 134305, -309289, 142685, -320862, 159325, 385726, 262952, -23113, 81470, 346249, 276145, -18799, -66431, -20407, -18612, -33932, -5474, 108916, 97419, -144210, -282870, -107366, -282985, -127677, 186514, -24662, -80247, 283732, 164851, 92297, -12524]
13096a8220j17355C40385a96133b8744k36934B43164O4468n4913a48373A15032
13085A12247o438E2490J61740M7983j9697C0294P1471O6306b06937A54859K9172
13074A84031J6362p1900J56657A37834K13380H8275b15875A53758k5570F2546
13063a2550e529B9148K8005J7575a01776A95836F4086a49023M2979A06908k5097
13052H1811n669K6372a90432B75386i7355C4834J14921I91b9238A80633H6646
13040a57954B5714M2696M7921m9179b16857j8193B6068b97202f9635B51812A6283
13028B43911o6572o4310a63740l7540F8748c95083G3859a81619E20369e5703B63493
13016H4313c0648q9289A3536J22848h0366P247r7190f8582k33225J24260b6092
$$ y = [-18220, -135575, 340385, -196133, -28744, -265678, 243164, 307632, 252719, -148373, 115032, 112247, 105809, 52490, 214230, 262213, 242516, 30294, 101765, 168071, -206937, 154859, 184031, 200393, 128493, 285150, 137834, 351214, 88275, -215875, 153758, 128188, 62546, -12550, -5529, 29148, 57153, 74728, -101776, 195836, 64086, -149023, -106044, 106908, 81811, 76142, 102514, -190432, 275386, -97355, 34834, 149755, 991, -29238, 180633, 86646, -157954, 25714, 68410, 116331, 67152, -216857, -235050, 26068, -297202, -69635, 251812, 16283, 243911, 177339, 113029, -163740, -201280, 68748, -395083, 73859, -181619, 520369, -55703, 263493, 84313, -30648, -119937, 13536, 136384, -80366, -73119, -170309, -68582, -301807, -177547, -26092]
13004a1700A92413O3226b37824B25563J2054r0372a70152f8876E0895g4854c858
12992h6206D4263J34611i2090c3296l1618k4429F6267f3211A3378e6819j8787
12981g5606I6361C3883K82335F1037R9990J19610H9287J25706a40507F0859b99045
12969E5737J66093l3440n1863J3349h3685J1984L37B04751E0963N8835J48918
12958B58716J7584K2339b1499G7644b51013a2218A39825g681q965F7183A4012
12946b66606c5387A08763e5049A97459J43543a3775C12031a29493j16485Q0373
12936a65605d9565L061r6408j58375b8607j24975b0235H0111K8142a70730H3589
12924a7234o8000n3873B51763b27296a0996A13916b2649e904A528c5412C9133
$$ y = [-11700, 192413, 255639, -237824, 225563, 237617, 147245, -170152, -68876, 50895, -74854, -3858, -86206, 44263, 178874, -92090, -33296, -64914, -89343, 66267, -63211, 13378, -56819, -75606, 96361, 33883, 316218, 61037, 161027, 280637, 89287, 214993, -140507, 60859, -299045, 55737, 221830, 188390, 136527, 149876, -83685, -71701, -71364, 204751, 50963, 109798, 258716, 276300, 298639, -21499, 77644, -251013, -12218, 139825, -7681, -16646, 67183, 14012, -266606, -35387, 108763, -55049, 197459, 341002, -13775, 312031, -129493, -245978, -165605, -49565, -46504, -142912, -301287, -28607, -153582, -20235, 80111, 108253, -170730, 83589, -17234, -85234, -139107, 251763, -227296, -10996, 113916, -22649, -5904, 1528, -35412, 39133]
12912B997H41K74900F7037b17934N6652A14484b12644A48828d6361J7315C29186
12900A23144C0982c32816B20967e8758r7035A80950E100d26339A96269e4077G3671
12888b3363B4927P1880b95385B33150b14520C41802a60251A85182K3977a60629
12877a04541l699r99C16671c55151d2467j91148C07871n3712a9890G8301c11681
12865a2000n9138D9622c8183a951F4105c546A35595a46157B6135L25275b22061
12853A71238b47527A87842Q6A1125c36591J01051I5038D0302L2269a60643A33340
12841A11028g6394j5558m186q4461A49459k5995b75725D05805h5216G9706a89780
12829C92579A71766n3350c2626B64629A17088a61545D4919L85153p2160d4228
$$ y = [2997, 841, 275741, 67037, -217934, -161282, 114484, -212644, 148828, -46361, -29046, 329186, 123144, 30982, -332816, 220967, -58758, -155793, 180950, 5100, -426339, 196269, -54077, 73671, -23363, 24927, 96807, -295385, 233150, -214520, 341802, -160251, 185182, 209159, -160629, -104541, -108240, -109239, 316671, -355151, -42467, -233615, 307871, 254159, -19890, 78301, -311681, -12000, -71138, 49622, -38183, -1951, 64105, -3546, 135595, -146157, 26135, 351410, -222061, 171238, -247527, 187842, 187928, 11125, -336591, -235540, 95038, 40302, 72571, -160643, 133340, 111028, -76394, -91952, -96138, -180599, 149459, 123464, -275725, 405805, -85216, 79706, -189780, 392579, 171766, 118416, -32626, 264629, 117088, -161545, 44919, 430072, 357912, -44228]
12818A51521a27742G6594M8823a48100a0642F387i5844c2639o4439A00749c36044
12806b14753A25068C7788b12226B09942a4174k98117F2269a9863G619J48865p600
12795A48884E172b45994B43950D0534J55979q7441R8528a92894A15841J39842
12785B55683a84421B59944C355J00054a94857Q9448j20520H8339a77760A956a42767
12773d55008A80064b00374A86510M4680K3805H9976A3004f888A02502c4952B24268
12761A58319p8944R3427g5384E1618a52632A73208f0214m78009a68580I6740g247
12749c93690J77750E6538c21848A97488g4400A43362A6845h4564B75116G7515
12738A32732b36298J07372a648B31787g8274D8910M69511a18774e894r348o4242
$$ y = [151521, -127742, 76594, 125417, -148100, -10642, 6387, -95844, -32639, -97078, 100749, -336044, -214753, 125068, 37788, -212226, 209942, -14174, -312291, 62269, -19863, 7619, 156484, 148884, 5172, -245994, 243950, 40534, 196513, 109072, 207600, -192894, 115841, 255683, -184421, 259944, 3355, 103409, -194857, -105409, -225929, 88339, -177760, 1956, -142767, -455008, 180064, -200374, 186510, 231190, 254995, 89976, 13004, -6888, 102502, -34952, 224268, 158319, 79375, 172802, -75384, 51618, -152632, 173208, -60214, -538223, -168580, 96740, -7247, -393690, -215940, 56538, -321848, 197488, -74400, 143362, 16845, -84564, 275116, 77515, 132732, -236298, -128926, -1648, 231787, -78274, 48910, 518421, -118774, -5894, -15242, -79484]
12727g9484I2859b85145B33256a76927j34563I1031J57188h0436A23694J03699
12717B27393I5011a90901A58375a15680P04D7291a63130j0646A03761K72624j63200
12706B13185G5239d6133C10273n662j10649i0019a5702C25524a22444C1463R4660
12695A26123R0340d8037q3481C53881a3192A53020b6012j23580A12269a05073
12684A67455P7695n8147i4380C1360O6026K67594j42410F3062M85053C9241b46316
12672F5042J20083Q7039I939b4937q6945A40889C9303J29657B85h5557n0007A98299
12659A29666E1930f2688j02643O3982P992l5593C86617R6160B2021J29151c05347
12647A95781f0519A9706L09451b17651C7248J80644J5117a38037b0582K538j72723
$$ y = [-79484, 92859, -285145, 233256, -176927, -311490, 91031, 248219, -80436, 123694, 227393, 95011, -190901, 158375, -115680, -114976, 47291, -163130, -173776, 103761, 376385, 213185, 75239, -46133, 310273, 304611, 193962, -90019, -15702, 325524, -122444, 31463, 126123, 216463, -48037, -131518, 353881, -13192, 153020, -26012, -149592, 112269, -105073, 167455, 245150, 187003, -94380, 31360, 97386, 364980, 222570, 63062, 548115, 39241, -246316, 65042, 185125, 272164, 9939, -24937, -111882, 140889, 39303, 168960, 285, -85557, -135564, 198299, 129666, 51930, -62688, -165331, -101349, -93357, -128950, 386617, 482777, 22021, 151172, -305347, 195781, -60519, 19706, 329157, -217651, 37248, 217892, 233009, -138037, -20582, -18044, -190767]
12636a90767c3520B09867p4800A6426J70486k3851e3280B82708E1314K06101R2339
12625C49754A62508b12564E89305k84939A21342R5782j05828M00035A28824n1396
12615G7428K18085m3091j21785E5814a82356N105a8555j42286A91109d6973j7144
12604f4117C74506j36352c2859A73554n6746E3681Q1830i3496I972d16387B06401
12592h195k61673B3633K4154K60831i6501C697a20451K0931A2511a84191D8074
12580E4526c4019j63617B01439b14669R3564l55388J87196C2903a27992I5319
12569B7144K38922a48630A69052j4596b15947B60903c0336A13067J86597b49288
12558B45621r4954Q0701a2079E2724J14686P9767a45270A86499d094k03118a00911
$$ y = [-190767, -33520, 209867, 135067, 16426, 186912, 163061, -53280, 282708, 51314, 257415, 349754, 162508, -212564, 589305, 304366, 121342, 217124, 111296, 511331, 128824, 77428, 295513, 252422, 130637, 55814, -182356, -177251, -18555, -160841, 191109, -46973, -64117, 374506, 238154, -32859, 173554, 116808, 53681, 135511, -93496, 9972, -416387, 206401, -8195, -269868, 23633, 47787, 308618, -96501, 3697, -120451, -99520, 12511, -184191, 48074, 54526, -34019, -197636, 201439, -214669, -121105, -476493, -289297, 32903, -127992, 95319, 27144, 266066, -148630, 169052, 154456, -215947, 260903, -30336, 113067, 299664, -249288, 245621, 150667, 231368, -12079, 52724, 167410, 247177, -145270, 186499, -4094, -207212, -100911]
12546B19748m0661Q8770a46755A78885a65753B08668F86c1210j74979j20980g5412
12534B89497a50089A22790g5136J5043B99112C4971O9615a37777C63450j56137
12524B07313b34066j4972f1928A39375a87190B7164a55836j79346h7345d0515
12513A54390E6037F599a2459A60688b87877a5803j26392c1304B71327d98063a46570
12501A44815b47669e2854j05744O2102r1297c9926D6475J34308b20070M9069L9250
12490a31751G2113a50749A04589b32672C7715a02177A19858j7742J7177i0301
12479b60830a25051O58c2375j76556B39219e9527C57221f8867k7365E4192b5182
12467a7648j50578j06645H1144n799k5403K63890b1542C60904b7369J1464B52225
$$ y = [219748, 179087, 267857, -146755, 178885, -165753, 208668, 686, -31210, -206189, -327169, -75412, 289497, -150089, 122790, -75136, -60093, 299112, 34971, 104586, -137777, 363450, 207313, -234066, -249038, -61928, 139375, -187190, 27164, -155836, -335182, -87345, -40515, 154390, 56037, 6599, -12459, 160688, -287877, -15803, -142195, -31304, 271327, -498063, -146570, 144815, -247669, -52854, -158598, -96496, -187793, -39926, 46475, 180783, -220070, -171001, -131751, 72113, -150749, 104589, -232672, 37715, -102177, 119858, 102116, 119293, -90301, -260830, -125051, -124393, -32375, -208931, 239219, -59527, 357221, -68867, -96232, 54192, -25182, -17648, -168226, -274871, 81144, 75345, 49942, 313832, -21542, 360904, -27369, -15905, 252225]
12455D7192M6369C9286e441j0844A55834h0700a5827D7123K13748E1743J58283
12444B10026a04038j9004j58054a40495G3295E695J12812e3808E4460a36055D41006
12432A79590c17284P3884H3456b8191H1088F820f0689k31799E4092a34935L8349
12421i6586r1434A54609a79839A6262m692f6844l4059q4451O880k45762J71809
12410b52427B63387d47172H0208J50665D148P0857d63954i1651n658k5925c9505
12398b23906L8339j71347A25547D8858h6180j15286F83527A15571J02556f4728
12387g5458B3814O9699a11700I1255N2489c89705a11045B47028j05139a22995
12376b44601E2327c05185C1280c52300B54827q0959a6010k40978B22017a731j95386
$$ y = [47192, 93561, 39286, -5441, -16285, 155834, -80700, -15827, 47123, 260871, 51743, 210026, -104038, -123042, -281096, -140495, 73295, 5695, 118507, -53808, 54460, -136055, 441006, 179590, -317284, -243400, 83456, -28191, 81088, 6820, -60689, -292488, 54092, -134935, -96586, -188020, 154609, -179839, 16262, 11570, -66844, -100903, -185354, -178474, -424236, -252427, 263387, -447172, 80208, 230873, 4148, 75005, -463954, -91651, -97309, -123234, -39505, -223906, -185567, -356914, 125547, 48858, -86180, -201466, 683527, 115571, 218127, -64728, -75458, 23814, 93513, -111700, 91255, 143744, -389705, -111045, 247028, 141889, -122995, -244601, 52327, -305185, 31280, -352300, 254827, 173868, -16010, -256988, 222017, -1731, -197117]
12365a97117b0494B03607q6370a97250j15589a00668A50176b44640A57376o8641
12355H8735J53523E0410K12834H6795J0606K76573A7434b8579k9969B33661D5939
12343A39727N0412a25739o9227g895j8976A89025J09894E2348a01141c7937B75847
12331D43429d1889j79868M0697e7179A1404K12114H9988m1381b38646c1035a2377
12319c5132F4116G16d1055A14480Q1838i8585j08110M2239Q049O6216B20542B8491
12306B9633c62852D43739j82344A9046M6737i3833E7976a10282A99451g5674a3004
12294H8461g748o4175B7480f458A27598a10294D72177j55138I0324a19316l1313
12283a50629H3287J09229A7869M3301a20633k66062A67993b7770C35206a16244
$$ y = [-197117, -20494, 203607, 117237, -197250, -312839, -100668, 150176, -244640, 157376, 88735, 242258, 50410, 263244, 86795, 97401, 373974, 17434, -28579, -58548, 233661, 45939, 139727, 190139, -125739, -194966, -7895, -26871, 189025, 298919, 52348, -101141, -37937, 275847, 443429, -41889, -221757, -181060, -57179, 11404, 223518, 89988, 48607, -238646, -31035, -12377, -35132, 64116, 716, -41055, 114480, 196318, -98585, -206695, -164456, -156407, -90191, 220542, 28491, 29633, -362852, 443739, 261395, 19046, 65783, -93833, 57976, -110282, 199451, -75674, -13004, 88461, -7748, -71923, 27480, -6458, 127598, -110294, 472177, 317039, 90324, -119316, -150629, 83287, 192516, 17869, 61170, -120633, -386695, 167993, -27770, 335206, -116244]
12272a90636j71972a26305k41068C21393j51896K66012o6880L866b09779n9095
12262b68874C42421a20369k0295j07754a9550q1239l2868A02935a22660k370B07478
12250a3273j29849J4629e8418B14162a32709A54211J3347r798J0574a08762B46554
12238E6645P2080k3249K3296N0961C7023J42165p6316M6965a91341D68638b6448
12226d652q8865C55633O3541j69441a7414j87871B78324i268A03481i89n2868
12215e3857A68111a01148H7271K7894B7875J7365D302b21047b0146A11643a94846
12203f8230K8246C10776f7783j53779L0976B92715b4417a1811D70646j66432c6015
12191B54805a91591b5954j16333r1073G5069B7762K18771M9052l684A06174a92707
$$ y = [-190636, -362608, -126305, -367373, 321393, 169497, 435509, 368629, 372495, -209779, -268874, 342421, -120369, -140664, -248418, -19550, -100789, -133657, 102935, -122660, -125030, 207478, -13273, -143122, -128493, -58418, 214162, -132709, 154211, 167558, 157760, 168334, -108762, 246554, 56645, 128725, 105476, 128772, 179733, 37023, 179188, 102872, 149837, -191341, 468638, -26448, -4652, -93517, 355633, 419174, 249733, -17414, -205285, 278324, -9268, 103481, -989, -53857, 168111, -101148, 87271, 115165, 27875, 45240, 4302, -221047, -20146, 111643, -194846, -68230, -39984, 310776, -67783, -221562, -190586, 292715, -24417, -11811, 470646, 304214, -36015, 254805, -191591, -25954, -142287, -233360, 75069, 27762, 246533, 295585, 291901, 106174, -192707]
12179d3354C22778r3346a00894b7654A36298F3187K14066I5704g4417A54671D4953
12167c40492a26102h222k90I80K62398M785K53307A31425c63147a9827B87741
12155H0366a77790e6592D37086F3747g6150m923B79988a6482j7669I8129r323
12144H8806L0134L09732A24544l3418J23392A8420L6907M5760k277c7886A27920
12132a01509B4748b88575B9845J13803n3835a65463q5445G6251R8149m0587J33279
12121B67092i4496B6111a32984A32665l9997K55137a55019K3773I2658J66801
12111B59459a3695B6417b90715A1477J59492i7158d6329l7050p5829B1774a16282
12099a79708B05940E7130a42426A13104d68642a21393A21356J82396A21058b3767
$$ y = [-43354, 322778, 229432, -100894, -27654, 136298, 63187, 277253, 95704, -74417, 154671, 44953, -340492, -126102, -8222, -8512, 980, 263378, 268163, 521470, 131425, -363147, -19827, 287741, 80366, -177790, -56592, 437086, 63747, -76150, -81073, 279988, -16482, -34151, 98129, 88806, 118940, 428672, 124544, 91126, 214518, 18420, 55327, 101087, 98810, -37886, 127920, -101509, 24748, -288575, 29845, 143648, 89813, -165463, -250908, 76251, 174400, 133813, 267092, -94496, 26111, -132984, 132665, 92668, 347805, -155019, -131246, 92658, 259459, -13695, 26417, -290715, 11477, 170969, -97158, -46329, -83379, -159208, 21774, -116282, -179708, 205940, 57130, -142426, 113104, -468642, -121393, 121356, 303752, 121058, -23767]
12088d06089H9017a15020k11224a41302b5971B68953b21859B5076a76037G7444
12077c13001A80022a29459k1819j51704F50572j25660J314026q85940H1776e0379
12066F9081K03366c83108e0795p5824A56736a15467m8463A38105A0540K4919a57873
12054C58434a48470J1945K3451B2349d8381q7150A33507d009A15691b65223i2779
12042b71198C10836a24668I0008c22991g1410B74820I2596h6272B45093m3031
12032B02062a2990F7722c29516d1025k39155A7744b79598C4901J59483p7769f1679
12020E1122d37136a68726Q594M6689r9980a038B33211M7787l9542n1922j1912
12009A77622Q4867b12803r9489C98931A26408a16119B94092g9373j64430M1017
$$ y = [-406089, 89017, -115020, -326244, -141302, -25971, 268953, -221859, 25076, -176037, 77444, -313001, 180022, -129459, -151278, -302982, 650572, 524912, 1838938, 952998, 81776, -50379, 69081, 272447, -383108, -50795, -126619, 156736, -115467, -163930, 138105, 10540, 35459, -157873, 358434, -148470, -136525, -113074, 22349, -48381, -135531, 133507, -4009, 115691, -265223, -92779, -271198, 310836, -124668, 90008, -322991, -71410, 274820, 92596, -86272, 245093, 202062, -12990, 67722, -329516, -41025, -280180, 17744, -279598, 34901, 194384, 116615, -61679, 51122, -437136, -168726, -160132, -113443, -213423, -1038, 233211, 280998, 241456, 189534, 177622, 262489, -212803, -312292, 398931, 126408, -116119, 294092, -79373, -243803, -202786]
11999b02786f4981K2455p9447o6729I0999a19432j22004J15244j8605f9378C05742
11987a27022c7615p3375B34645g1324l89944D833J87659p4048K90981f4652D7286
11975B57576G9915a27266A4930K9382J68833b99422A34712E4414K1110h8980H6532
11963A72898b186m660A03543O2089b61458a27942l136A02503J42426A19052d6817
11951B0715K8727h3791F3912d8072A2920a44368A37259A6035i9859j14210A6756
11939a96305A69949k4031F32a37064A59530d1228A65455G7772a37616e0462m0231
11928i0693A5434K60094a33752d6093k60547I6098O6472a10880A519b03179E8063
11916G2203b9123I2494a85733Q6613A50733a63869a4719j39763K6605H1589k1135
$$ y = [-202786, -64981, -42526, -121973, -188702, 90999, -119432, -241436, -126192, -144797, -69378, 305742, -127022, -37615, -110990, 234645, -71324, -461268, 4833, 192492, 118444, 409425, -64652, 47286, 257576, 79915, -127266, 14930, 44312, 213145, -299422, 134712, 54414, 75524, -88980, 86532, 172898, -2186, -6846, 103543, 165632, -261458, -127942, -131078, 102503, 244929, 119052, -46817, 20715, 49442, -83791, 63912, -48072, 12920, -144368, 137259, 16035, -99859, -214069, 16756, -196305, 169949, 145918, 632, -137064, 159530, -41228, 165455, 77772, -137616, -50462, -90693, 15434, 275528, -133752, -46093, -306640, 96098, 162570, -110880, 1519, -203179, 58063, 72203, -29123, 92494, -185733, -99120, 150733, -163869, -14719, -154482, -127877, 81589, 60454]
11905F0454K3161a13311r2601j25487b8861p2266l6371E3631L2425J39001b29716
11893B1521a51741E3822J31152a25895k04816A4449L0608b60362A2244P1049b23399
11881E913d2306A1704f2319j51501A31868A3022M2005A5818b06828L6568c9666
11869B81524c55474H6841a70144A55874d0497H6182a24162M5895D0065b56720
11858a73752a0231B045a7647F4228M10722a94236A6787K51355A07411d27856F3186
11846g2844j82041B24272o2770G1769a40605B42389a22608j68468A83274a99448
11835A05151b71158q134f4092j9716k61272A38241H500b2477n4451B68021a94547
11823a3767j27017A17151N6380N215P3917A14819a49982I2797a7063m8849J9884
$$ y = [60454, 83615, -113311, -205912, -331399, -28861, -101127, -137498, 53631, 86056, 225057, -229716, 21521, -151741, 53822, 184974, -125895, -330711, 14449, 45057, -260362, 12244, 83293, -223399, 5913, -42306, 11704, -62319, -213820, 131868, 13022, 55027, 15818, -206828, -170260, -39666, 281524, -355474, 86841, -170144, 155874, -40497, 86182, -124162, -78267, 40065, -256720, -173752, -10231, 2045, -17647, 64228, 474950, -194236, 16787, 268142, 107411, -427856, 63186, -72844, -254885, 224272, 161502, 71769, -140605, 242389, -122608, -291076, 183274, -199448, 105151, -271158, -279292, -64092, -83808, -345080, 138241, 8500, -22477, -76928, 268021, -194547, -13767, -140784, 117151, 173531, 178746, 252663, 114819, -149982, 92797, -17063, -65912, -46028]
11812d6028b1214C0321a68151c0808m2216j48578k96441a52432M339A34626J83857
11801C18483b20435g0486O446C4669I16a93862F5918d14556A40582o6408f8244
11789A66920l0688h9258A39311c26314J04527E5492a7675G7632a90698A76858
11778d5561j23331H7876a27241B1020c94338A31376F3416A2989a10110C53602
11767c68974L7787Q6369A08620b65410e5796k3262k79885A45715C1138a39401
11756F5529l574a45720b5745o7559B6069R6295j0211d7632j04264J5471A97056
11744I7066b03044B48589c67601G5839a45288f3415b9236B59650p6851q8178D7245
11732a85935I1738M3729b74248b6583A9224K4429a60836a323j14504k30313J68710
$$ y = [-46028, -21214, 30321, -168151, -30808, -73024, -221602, -518043, -152432, -148093, 134626, 318483, -220435, -70486, -64040, 34669, 916, -193862, 65918, -414556, 140582, 74174, -68244, 166920, 136232, -89258, 139311, -326314, -221787, 55492, -17675, 77632, -190698, 176858, -45561, -168892, 87876, -127241, 21020, -394338, 131376, 63416, 12989, -110110, 353602, -368974, -331187, -244818, 108620, -265410, -55796, -79058, -358943, 145715, 31138, -139401, 65529, 61955, -145720, -25745, -93304, 26069, 122364, 112153, -47632, -151896, -136425, 197056, 97066, -203044, 248589, -367601, 75839, -145288, -63415, -29236, 259650, 182799, 94621, 47245, -185935, 91738, 135467, -274248, -26583, 19224, 43653, -160836, -1323, -115827, -346140, -177430]
11721a77430A78221o0172m1676J02408i9179j63267H7353P7392a34772H9908P9271
11710A69179e8288A76996C9604J20584a63303j45705h8108m07156A01240a7562
11699A55137p0988i2190E9507c8593j90245B01831o7094J58531h4702A48209O1724
11688B09933I5794b51051A44918J45l5631c7950j30372A26817b10720A02501R2318
11677A94819a67812h2774o9401K7123h653A59847c3466C7991b782A88997h2445
11665a52942A60836E2419a43381L4496A48416J71635b55157l6704a8855B42307
11654a18001A02788a13437m1255B9059a30806A13052K67822a62910E3166N032
11644E8198L2657A6747A687b03173a4715A96496f548B38877a18366A89694J7311
$$ y = [-177430, 178221, 118049, 76373, 178781, -99179, -262446, 87353, 164745, -134772, 89908, 169179, -58288, 176996, 39604, 160188, -163303, -309008, -88108, -495264, 101240, -17562, 155137, 84149, -92190, 59507, -38593, -228838, 201831, 134737, 293268, -84702, 148209, 209933, 95794, -251051, 144918, 145063, 109432, -37950, -168322, 126817, -210720, 102501, 194819, -167812, -82774, -152175, -125052, -8653, 159847, -33466, 37991, -2782, 188997, -82445, -152942, 160836, 52419, -143381, -108885, 148416, 320051, -255157, -291861, -18855, 242307, -118001, 102788, -113437, -154692, 29059, -130806, 113052, 380874, -162910, 53166, 58198, 90855, 16747, 1687, -203173, -14715, 196496, -6548, 238877, -118366, 189694, 207005]
11633B07005D7501K01713n0853a1277A64319n613N658R5453a60305M744H1301
11621b12966c413B06698a7758D74229B15062b56749j040e5737A2757f9303o565
11610g5868m13799B38029b15458C5773K4820e2361A51931a95484b638A50410J53393
11599C03803j48397m7849J32350b4180I4302c41958G7497K68469A9329K1577h941
11587A58104a01024A89836a77871c1336j64039A53556k5554K53494A41121i3980
11576A87732R9713n627B2655h0770B22019p6541a83463f1992A07881q757i9407
11564D06882f0173D4648f4228B47251a93845q7957A36097J89373P625A47001J63095
11553C10096f0936j25961D8940h5818A12949K3039J92119K12422a19827B05895
$$ y = [207005, 47501, 249214, 198361, -11277, 164319, 158706, 164364, 259817, -160305, -155561, 81301, -212966, -3413, 206698, -17758, 474229, 215062, -256749, -257789, -55737, 12757, -69303, -75868, -489667, 238029, -215458, 35773, 60593, -52361, 151931, -195484, -2638, 150410, 303803, 155406, 107557, 239907, -24180, 94302, -341958, 77497, 345966, 19329, 40906, -8941, 158104, -101024, 189836, -177871, -31336, -195375, 153556, 128002, 381496, 141121, -93980, 187732, 287445, 281818, 22655, -80770, 222019, 145478, -183463, -61992, 107881, 99124, -99407, 406882, -60173, 44648, -64228, 247251, -193845, -281802, 136097, 325470, 333095, 147001, 310096, -60936, -186897, 48940, -85818, 112949, 135988, 328107, 540529, -119827, 205895]
11542a29142E6864b04478J5937G0959J67234c2319A78277a99743E39005G1282
11531C05148A19140a85147d5391J658I7657L00340j11765a3032C40138j48688
11521A91450c30775B24554j04906a6960I7138k3469k7217c3655A5898J73702d8268
11509C0948R7849j0476j9555M2933F061d9361B8763L53588p6046Q4137M0893A81603
11496B81160H8558e2983A6853O5332A2907Q3319K69393r3500A09582n0262J03570
11485A62890N1577H2886J65994b10531h9612A04910a63597d5139D5005K44710
11475B89715j08517b4979C96021o1715k3106j22769K52025C7766J0213q139R5901
11464A35741J10355C596A005J94638E7423K8229O4421a97576A54285F2090g6643
$$ y = [-129142, 56864, -204478, -188541, 70959, 238193, -32319, 178277, -199743, 539005, 71282, 305148, 119140, -185147, -45391, -43733, 97657, 397997, 286232, -13032, 340138, 191450, -330775, 224554, 119648, -16960, 97138, 73669, 46452, -33655, 15898, 189600, -48268, 30948, 128797, 118321, 98766, 141699, 6061, -49361, 28763, 382351, 306305, 390442, 431335, 181603, 281160, 88558, -52983, 16853, 82185, 12907, 96226, 365619, 272119, 109582, 59320, 162890, 214467, 82886, 248880, -210531, -89612, 104910, -163597, -45139, 45005, 289715, 181198, -24979, 396021, 334306, 311200, 188431, 440456, 37766, 47979, 39840, 135741, 246096, 3596, 1005, 195643, 57423, 85652, 150073, -197576, 154285, 62090, -76643]
11452B56660q445l0165a32015F8064f342k51680r082B43540H2969J02435G9179
11440A61891j4889b7786D5784b19383M8903d4814k33887h6803A21105l4720J60156
11429B46541i0080k1345r480j86411A25953c57668k21198M1602A01764g178D248
11417A8080O3259a15999A75570f5867b9835n6320j58337d3710F7692J65850G3072
11405b3117k56962B25848h3116n9640A2312J21973l9158a95414A4807c41484a44070
11393A18119K93774b8012j22923j38199a0899A06293a25200e6918k29055E03857
11382a3780o2641n8927C15502q5604D7527c6781p5306G8919K1209k8277p469J11002
11370A75384R6338D8198J40517E8146J9340j3722K1755b37473g4254J2953l4846
$$ y = [256660, 248215, 218050, -132015, 68064, -6342, -258022, -267104, 243540, 82969, 185404, 79179, 161891, 147002, -27786, 45784, -219383, -170480, -44814, -278701, -86803, 121105, 86385, 246541, -90080, -111425, -120905, -307316, 125953, -357668, -578866, -537264, 101764, -7178, 4248, 18080, 81339, -115999, 175570, -65867, -29835, -86155, -244492, -43710, 67692, 233542, 73072, -23117, -280079, 225848, -83116, -142756, 12312, 134285, 95127, -195414, 14807, -341484, -144070, 118119, 411893, -28012, -150935, -289134, -10899, 106293, -125200, -56918, -285973, 503857, -13780, -76421, -135348, 315502, 229898, 47527, -36781, -112087, 78919, 100128, 71851, 64382, 175384, 271722, 48198, 188715, 58146, 77486, 63764, 85519, -237473, -74254, -61301, -96147]
11359i6147A12791a15504C81610b83193j06211A03508b87231J01142f1474H506
11348c88869a55749c3106B66332o7277J4621J9457A3167L3934b8736j53979b9721
11336i0914o3705c3586j85944n9920i2099M2041B79735e709B0694b12462K880
11325b09582q442o3198C47a013j84116A3683b62358J27081e6853A14838C3676
11313a26770d7782A00214c62502A55839G2439k4936c53924A07913g4495j19533
11303a94028l0041A22571c09045A18370a42917E9762K4736d02802A09252f5078
11292a8541j66224d862j65714H2433Q4328a08671n3954B07744a5969m3488B06218
11280a44463B56103r6232a91271G4361b2692k96342e5155B4422b38652A62318
$$ y = [-96147, 112791, -115504, 381610, -283193, -389404, 103508, -287231, -186089, -61474, 8506, -388869, -155749, -33106, 266332, 199055, 213676, 233133, 13167, 47101, -28736, -182715, -29721, -90914, -154619, -33586, -219530, -279450, -92099, -50058, 279735, -5709, 20694, -212462, -209582, -218024, -281222, 347, -1013, -185129, 13683, -262358, -135277, -56853, 114838, 33676, -126770, -47782, 100214, -362502, 155839, 72439, 47503, -353924, 107913, -74495, -194028, -224069, 122571, -309045, 118370, -142917, 59762, 84498, -402802, 109252, -65078, -18541, -184765, -4862, -170576, 82433, 166761, -108671, -162625, 207744, -15969, -59457, 206218, -144463, 256103, 159871, -191271, 74361, -22692, -319034, -55155, 24422, -238652, 162318]
11269a30820a2548j92358A4600f9288C3130d9038J6558j33248p2980D32302p382
11258D24920b5416j16473f7469B74953a16416k07908a42829a7920k12843C539
11247h3374j99927a39560A83778g1767k91427G2243R9175b9507B75084f042A63023
11235e3944Q600k02962a4232l0315j71530b8253q5782c0567l54776C6128Q2761
11224A18889J08780g4629k31904J45912N5962N072d2106k00075J2820l9166a32185
11212C61390f7959F3105a46785B3234K54109a11164A50355J3520J05895E0692
11201c3901l41142a76689L7387o0573I3265b59535R6906C77171E0721K47388a63119
11189i2608E1665c30592J34888D6320b86489B4155B549N4933b88820B6484d2655
$$ y = [-130820, -12548, -204906, 14600, -69288, 33130, -49038, -32480, -165728, -238708, 432302, 424920, -25416, -141889, -67469, 274953, -116416, -324324, -142829, -17920, -230763, 3539, -83374, -283301, -139560, 183778, -71767, -363194, 72243, 171418, -29507, 275084, -6042, 163023, -53944, -45344, -248306, -14232, -44547, -216077, -28253, -114035, -30567, -385343, 36128, 118889, 227669, -74629, -306533, -160621, -104659, -99587, -42106, -242181, -229361, -268527, -132185, 361390, -67959, 63105, -146785, 23234, 277343, -111164, 150355, 163875, 269770, 50692, -33901, -375043, -176689, -139302, -199875, 93265, -259535, -162629, 377171, 50721, 298109, -163119, -92608, 51665, -330592, -195704, 46320, -286489, 24155, 2549, 57482, -288820, 26484, -42655]
11177e54810E8150g8518k07379A73751a05611C39599A60840F5910A5157c2281
11166b24294A30939k4635a65557d5447F6987b97528A11336D4807J2427e1353p9471
11155a30824A04385e061l6322k36178l05976a691k3759A65362B6190e520j89482
11144a95002B11160a23212j57717O0419B14272j0010a21757A17880b9476j48579
11134a78055B01116A0970f5351j29047a0402A20738a68857B14404p9431E8798
11123A29493C8374q542O2466g3121B58801n293h3011B07071E71K5201K66354A09028
11110C17945j2658l5132b63714N1869f7165A66026M9533p2728F093K27422a2277
11098A60924A8208a27598E1605J18565c1359A54908c4808B51537b75758A51053
$$ y = [-554810, 58150, -78518, -285897, 173751, -105611, 339599, 160840, 65910, 15157, -32281, -224294, 130939, 106304, -165557, -45447, 66987, -297528, 111336, 44807, 57234, -51353, -130824, 104385, -5061, -41383, -277561, -583537, -1691, -25450, 165362, 26190, -5520, -195002, 211160, -123212, -280929, -220510, 214272, 204262, -121757, 117880, -29476, -178055, 201116, 10970, -65351, -194398, -10402, 120738, -168857, 214404, 134973, 58798, 129493, 38374, 29832, 92298, -73121, 258801, 253508, -83011, 207071, 571, 25772, 292126, 109028, 317945, 305287, 270155, -263714, -211845, -67165, 166026, 215559, 142831, 6093, 233515, -12277, 160924, 18208, -127598, 51605, 170170, -31359, 154908, -34808, 251537, -275758, 151053]
11087h0500H8601L75107j49402p2610m1834J68837F7469L28352D0764K64213m0442
11076B64535j02098a65450A60468Q2506K5413j12209a36252C72342j20549K76824
11066E28617A31844J84221L10182j08296J03106j92607K18588l10847K47024n2604
11056E30611k38891L25804J9658R1324j98868N16106m05762J68523j04493j41213
11046E62799R7561J36823k59077K31939A47832N66341r7281m5758J9450K66562
11036H57146k27908L517k4581B26269J57897L68565J7888k26354B02663L44592
11026E47255m6415o3976j2548K03429K6781j69866K37606l56040N68938C76790
11015D25214J14243r456L7794l032j28368p535B08756K10299A01599M33858j85843
$$ y = [-80500, 88601, 463708, 314306, 241696, 199862, 368699, 67469, 395821, 40764, 304977, 264535, 162437, -165450, 160468, 242974, 268387, 156178, -136252, 372342, 251793, 528617, 131844, 316065, 626247, 517951, 621057, 428450, 647038, 336191, 583215, 530611, 291720, 617524, 637182, 728506, 529638, 1045744, 639982, 808505, 704012, 562799, 660360, 797183, 538106, 770045, 147832, 714173, 616892, 571134, 590584, 857146, 629238, 632755, 608174, 226269, 384166, 752731, 770619, 544265, 202663, 547255, 500840, 436864, 424316, 627745, 654526, 484660, 722266, 366226, 935164, 376790, 425214, 539457, 530001, 567795, 564763, 436395, 428860, 208756, 419055, 101599, 535457, 349614]
11004C49614J73382B54677M27897q1353Q8624C13083L39445r8525o9168j85549
10994B99286J21640P1493J69853k84560K0218J14723K60673j32711r0802K79403
10984H29216j36321N20779j07550q3989J16911M26827k52543P0806k9386N59572
10974A914322J11908K52542j24272K57572J48057n67408K99744m00600p4019k29340
10964A588506j26469l54446L8271J86569k6003K1478L62700j64560j37717j1151
10954A377178l63285J45879J09397n21352J5883j69420L6957D2044L01816K7660
10944C71520j65134k9000o7720m5390J2843K37459G2329k6216N9926J92413p6383
10933B22069N2554I9260K11000C9475K78055A05023e4349B31588b16383J03863
$$ y = [349614, 522996, 254677, 682574, 601221, 689845, 313083, 652528, 554003, 484835, 299286, 420926, 492419, 662272, 377712, 397930, 512653, 773326, 640615, 549813, 829216, 692895, 1213674, 1106124, 1022135, 1139046, 1565873, 1313330, 1384136, 1354750, 1914322, 2026230, 2278772, 2154500, 2412072, 2560129, 1992721, 2292465, 1891865, 1817846, 1588506, 1462037, 1107591, 1145862, 1332431, 1306428, 1327906, 1690606, 1526046, 1388329, 1377178, 1013893, 1159772, 1269169, 747817, 763700, 594280, 631237, 42044, 343860, 371520, 206386, 177386, 109666, 64276, 77119, 314578, 72329, 46113, 106039, 298452, 222069, 274623, 99260, 310260, 39475, 317530, 105023, -54349, 231588, -216383, -112520]
10923a12520j45419C32089G0883K136L1704f1028A5110a68238h991A07297a00900
10911i5588k2158A9528a90611I1907b44015A66294l2323O42255a05530l55098
10901d60628a58148A92734o6808L76798A18421D6085d9961H7345J67283a19413
10890B5242R5106a23394m72j54334b9032r6921j5664j07180H5526e8656I5537
10878A6369o827b63250a02808d9088C3294a87095C0164K6661J09527f0452B12785
10866I7896a0831E4515a22157B86957a91610A89782a58521A53205b47444A32844
10855I4974J34945b20696B26193G4115d19998F5152e0975a3921C1956a85909B40855
10843B77682A4082a0866A4065i9150M4295A88860g4450o3496B68435a19477j08323
$$ y = [-112520, -257939, 332089, 70883, 73019, 104723, -61028, 15110, -168238, -8991, 107297, -100900, -95588, -117746, 19528, -190611, 91907, -244015, 166294, 133971, 776226, -105530, -460628, -158148, 192734, 125926, 502724, 118421, 46085, -49961, 87345, 254628, -119413, 25242, 120348, -123394, -123866, -278200, -29032, -125953, -141617, -248797, 85526, -58656, 95537, 16369, 9542, -263250, -102808, -49088, 33294, -187095, 30164, 56825, 166352, -60452, 212785, 97896, -10831, 54515, -122157, 286957, -191610, 189782, -158521, 153205, -247444, 132844, 94974, 229919, -220696, 226193, 74115, -419998, 65152, -50975, -13921, 31956, -185909, 240855, 277682, 14082, -10866, 14065, -99150, -54855, 188860, -74450, -137946, 268435, -119477, -227800]
10832b27800h725A04105J10631d1254l5785k11986a26969k14945B51050j15375
10822A35675c61607B25682E4681K02920f9968F9479a30880o5412L9817C63215
10811b51329A69563a74458g4815G6559a46634F7631C312J66186g6132o2299j93865
10800c32296A12597c02270a37778A5672a85295B13279d01811A41238c89241a11802
10789A84573A5583J29632b35155A96710J33587b6111A44325E2738c05973J14748
10779a91225g1498k47279B06655B6659a00709A10719J55744a36784A91420b92309
10768d804p0220I5508b02984A21415a19224j24139A15005i8933L2239k46565j35861
10757d49120K13135N1228b0577j28599f6992j41685P5828B7986O7914e0084j54129
$$ y = [-227800, -8725, 104105, 214736, -41254, -77039, -289025, -126969, -341914, 251050, 135675, -361607, 225682, 54681, 257601, -69968, 69479, -130880, -196292, -156475, 363215, -251329, 169563, -174458, -74815, 76559, -146634, 67631, 3312, 169498, -76132, -138431, -332296, 112597, -302270, -137778, 15672, -185295, 213279, -401811, 141238, -389241, -111802, 184573, 15583, 145215, -235155, 196710, 330297, -26111, 144325, 52738, -305973, -191225, -71498, -318777, 206655, 26659, -100709, 110719, 266463, -136784, 191420, -292309, -4804, -75024, 95508, -202984, 121415, -119224, -243363, 115005, -98933, -66694, -313259, -449120, -235985, -184757, -20577, -149176, -66992, -208677, -132849, 27986, 95900, -50084, -204213]
10746b04213A14571b0818B5417J2983K17227b31584H0620J9135c85950C27513
10735f0251J9717k63727K131J50629E2154f4950j95514J29889e1977A7149b43607
10723E3275f4805C9130J5428r455a51740d6905F5695c34652B21675F8400a36488
10711A49399c06143A35101d27399a8222h056l215n0062r6483C8565i3380c1940
10699a25523r9922c0746j61813G9523C6618K4069a83290B5748J46126h8288a756
10687A58769a50525g4411j6755C536b72523J29099m27422a69286B081c10730F2239
10675b78771K598k26857E0156g0309A40558a54604B31134C542K65610l5392a37056
10663D9869J02354g651q1817l54776E358c85470A33285a12645K0503j6546k80978
$$ y = [-204213, 114571, -20818, 25417, 38400, 255627, -231584, 80620, 99755, -385950, 327513, -60251, -40534, -304261, -302130, -151501, 52154, -64950, -260464, -130575, -51977, 17149, -243607, 53275, -64805, 39130, 54558, 45103, -151740, -46905, 65695, -334652, 221675, 68400, -136488, 149399, -306143, 135101, -427399, -18222, -8056, -11271, -61333, -157816, 38565, -93380, -31940, -125523, -225445, -30746, -192559, 79523, 36618, 60687, -183290, 25748, 171874, -88288, -1756, 158769, -150525, -74411, -91166, 3536, -272523, -143424, -570846, -169286, 2081, -310730, 62239, -278771, -276173, -503030, 50156, -70309, 140558, -154604, 231134, 3542, 269152, 233760, -137056, 49869, 152223, -7651, -89468, -444244, 5358, -385470, 133285, -112645, -92142, -108688, -389666]
10652c89666A62707h6528L2110A46456c10284i6263F8358b35719d3319F440c8793
10640B92924H8554M544O295e4287m4174D8915d2807k46794I1492a03495o187c0265
10627a68857I3270a5303F296c7403p5687j00198h4891b4109q3860a961l69447
10616c71408a60032A39471N4729b26419j21142G6185a83917A63810b48369A50700
10605B86291c47249g3033A4245C796M5190b92794D5727g1960l37492B06605G9670
10593c1111k38569F6566i3941j06657a7012j72489j19575L2088J23591P3181A24906
10581A00018d79048R2570J39074f7626F7604J44490C3076d9070O364A66735c5807
10569a33175A88689a44457k6151k26924D10575d0013q6262A33782o4193d1009
$$ y = [-389666, 162707, -86528, -54418, 146456, -310284, -96263, 68358, -235719, -43319, 6440, -38793, 292924, 88554, 93098, 99393, -54287, -98461, 48915, -42807, -289601, 91492, -103495, -109682, -30265, -168857, 93270, -15303, 6296, -37403, -113090, -213288, -84891, -24109, -107969, -1961, -371408, -160032, 139471, 194200, -226419, -347561, 76185, -183917, 163810, -248369, 150700, 286291, -347249, -73033, 14245, 3796, 48986, -292794, 45727, -71960, -409452, 206605, 79670, -31111, -269680, 66566, -93941, -200598, -17012, -189501, -309076, -276988, -153397, -80216, 124906, 100018, -479048, -386478, -247404, -67626, 67604, 212094, 33076, -49070, -42706, 166735, -35807, -133175, 188689, -144457, -170608, -397532, 410575, -40013, -126275, 133782, 69589, -41009]
10558F6940J60870O1943D5866c9580G3158a74678e190A18199J60815c39864a38353
10546B92621e9924C622a5760B30793C7342a24965j39393R4532r2799R4016c46
10534c46166f1537K209A36238a26479b2241p370j75372Q6690j05673P0803c1497
10522b55141I0318a15503J7225J2691A8703c68936c6074j56333b9749E61194A12204
10510h9277C630K12440g6531c6706o88253A93696J07197b3902H7271b41973a10859
10498h1206P372A72575a68229f0565A54076A4128L48403a90224k923M3512j28183
10487b77818D6370J15738C8307K9066h9240i519A10132M05747o7865e0476B16787
10475H8670h7251C7459N1280g9918p2308M839A3972N7300l541f3671L1621A51147
$$ y = [66940, 227810, 289753, 45866, -39580, 73158, -174678, -5190, 118199, 279014, -339864, -138353, 292621, -59924, 3622, -15760, 230793, 37342, -124965, -264358, -169826, -262625, -168609, -346, -346166, -61537, -59328, 136238, -126479, -22241, -29611, -204983, -118293, -223966, -153163, -31497, -255141, 90318, -115503, -98278, -85587, 18703, -368936, -36074, -192407, -29749, 561194, 112204, -89277, 3630, 216070, -76531, -36706, -724959, 193696, 300893, -23902, 87271, -241973, -110859, -81206, -73834, 172575, -168229, -60565, 154076, 14128, 362531, -190224, -193147, -149635, -277818, 46370, 162108, 38307, 67373, -89240, -9519, 110132, 515879, 448014, -50476, 216787, 88670, -87251, 37459, 88739, -79918, -152226, -147387, 13972, 71272, 67731, -63671, -32050, 151147]
10462A9267K12765a39226j03122a4142k14177P8610k59011A77087b48226I3126
10451a27076J2824A65759A8142K4969b91530O4029f7879B59099h5433j31538B58070
10439b45771A15378K51313B9700K15361F8656M54565a04055E9194o452h2279j26443
10428b08722G4135a60874A10499e386H8616b94027A6753c71749C4427J62450i8867
10416c18036I7486i0713B6673a25343N9200p2966e7530a5044l86662A0057c12995
10404A09741g2072l2447q1656O5772G1844l0328b3068R3C7935J75130p1122l906
10392A38037E4415K7821k895Q6751J07510B3526L6721b8947Q139B71649p8971
10381A92678J4850M0479G9286L16671j59129M5670b80577A16169A2412L09474
$$ y = [19267, 232032, -139226, -242348, -14142, -228319, -149709, -408720, 177087, -248226, 93126, -127076, -114252, 165759, 18142, 43111, -291530, -227501, -67879, 259099, -85433, -216971, 258070, -245771, 115378, 366691, 29700, 245061, 68656, 523221, -104055, 59194, 52742, -82279, -208722, 74135, -160874, 110499, -5386, 88616, -294027, 16753, -371749, 34427, 196877, -98867, -318036, 97486, -90713, 26673, -125343, -66143, -139109, -57530, -15044, -401706, 10057, -312995, 109741, -72072, -104519, -186175, -120403, 71844, 41516, -23068, -22975, 37935, 213065, 141943, 138037, 54415, 82236, 79341, 166092, 273602, 23526, 60247, -28947, -20808, 271649, 192678, 207528, 248007, 79286, 395957, 236828, 282498, -280577, 116169, 12412, 321886]
10371C21886c9496C18045A247L15755J22226L13068K7194C23594k519E1987K66794
10360C18781G6464K96260I5165N658E0330J36632L14713e0199A49127K82089L6453
10349D67669J6373k35926J55918N8201A89378K50040A45075K08171E6553N43226
10339E99779A17941B4080N3481J15769H4071b4803A42811K43477A03599N5399
10329A58998e2654E85M1132M9328M5013k7941Q4028P5175N4235o1790J0487L4750
10317C05002m2142n5239H766Q5667K8818O709d33442f8592j50820a05895l9939
10306a45834J6825B86197B7853P1960j7343a16873c5713J7207A85034H5003a96755
10294c6017j2495p1373A08987b48145F0175c56896a7082n47B3905c13397a05877
$$ y = [321886, -39496, 318045, 1247, 317002, 439228, 752296, 779490, 323594, 321075, 51987, 318781, 76464, 372724, 95165, 100823, 50330, 186962, 501675, -50199, 149127, 431216, 467669, 484042, 248116, 404034, 462235, 189378, 439418, 145075, 353246, 56553, 599779, 117941, 24080, 77561, 193330, 84071, -24803, 142811, 386288, 103599, 158998, -52654, 585, 41717, 91045, 136058, 108117, 192145, 267320, 321555, 259765, 270252, 305002, 262860, 207621, 8766, 94433, 123251, 129960, -433442, -68592, -219412, -105895, -145834, -129009, 286197, 27853, 99813, 82470, -116873, -35713, -18506, 185034, 85003, -196755, -36017, -48512, -119885, 108987, -248145, 60175, -356896, -17082, -17629, 23905, -313397, -105877]
10282a43825a4709j08166B9970a45746b4586k5027J2914p8356B24738F2944d53812
10270d9452j93570F196e1650A83916c39882B29800b58677I6288b28144D96285
10259B04867m893M32454l07825j01645K9673A14422C5974Q5220a47266c0811k7915
10248e8726r2530j34901D7353c9931j40076B25310j00475c195a133G7417i757
10236B59790A14520K6113b54927j00151d4916n85606d9684j69327g9027j84019
10226b63046M4211K1477H062J01007a667G751L44041l0219j38467F2594f0835
10214h4192c9162B39918E0502N2494a65084k7382h9700a1591A78902a40673D47123
10202a3475A40301a06318j67337P05K7392h6511j21206l0097L0724k57408h84
$$ y = [-143825, -14709, -122875, 29970, -145746, -24586, -49613, -36699, -115055, 224738, 62944, -453812, -49452, -243022, 6196, -51650, 183916, -339882, 229800, -258677, 96288, -228144, 496285, 204867, 199974, 632428, 324603, 222958, 252631, 114422, 35974, 121194, -147266, -30811, -58726, -151256, -286157, 47353, -39931, -180007, 225310, 124835, -3195, -1133, 77417, -9757, 259790, 114520, 140633, -254927, -355078, -44916, -630522, -49684, -219011, -79027, -263046, -218835, -197358, 8062, 109069, -1667, 7751, 351792, 321573, 183106, 62594, -60835, -84192, -39162, 239918, 50502, 102996, -165084, -192466, -89700, -11591, 178902, -140673, 447123, -13475, 140301, -106318, -273655, -272950, -245558, -86511, -207717, -237814, -207090, -464498, -884]
10190b84967R7072M1915j6485c2671j222j40918A43680a75288o6556D3915k755
10179D1160a86855A19937D5617K8772a18518j1092H136d0531C7957a05507l2825
10168a38332A74456a74330c1576A20216a8167l09492a34165N3239q8258k4756
10158a93940N2586G6589h4060q4477F739a64789A50827b923r6811k3900h092j10827
10146a18919j67527D439c73577a49650l6024C4401b58536J00404l0256C4575b61868
10134a4598B69380b03163B5731d10934H6557i6200j88608J26029c4561j9494E4053
10122B30934B3389J12098b00358C87082C8963J42328c46629j04669D6390c06253
10111e7581A29321a28151k22578f907A16706f6573k4582A01541a44999E31b35705
$$ y = [-284967, -187895, -145980, -162465, -32671, -33893, -174811, 143680, -175288, -241844, 43915, 41160, -186855, 119937, 45617, 74389, -118518, -129610, 8136, -40531, 37957, -105507, -138332, 174456, -174330, -31576, 120216, -18167, -327659, -134165, -80926, -169184, -193940, -141354, 76589, -84060, -168537, 6739, -164789, 150827, -2923, -99734, -123634, -8092, -118919, -286446, 4439, -373577, -149650, -185674, 34401, -258536, -158132, -188388, 34575, -261868, -14598, 269380, -203163, 25731, -410934, 86557, -96200, -284808, -158779, -34561, -54055, 54053, 230934, 23389, 135487, -200358, 387082, 38963, 181291, -346629, -451298, 46390, -306253, -57581, 129321, -128151, -350729, -6907, 116706, -66573, -91155, 101541, -144999, 531, -235705]
10099E6848a99718A98397h0717j18954i1194H8713J81569a01582H0150d126l2543
10088c6669j89853A0234b5235A0408g924j62008h4292p9319D8564J24908l0986
10077A42486c94642a71376l1240j6079A28911k2878C6721a96263H5627L3854h823
10065a69654C5274c12294F491G84K41193c46550J23213a00947K4304r6306k26366
10054c99315a30353c2090A31343a68687L1623N0549l25818A1725b71827e3722
10043H8396b51748e7436j18798A53351p5047a41228A82514k0038j7413D2521a49816
10031e2647f659o5011m0085j29376a2960o0835j8305p5525C25808b0395j92311
10020b12706A31681b78214e5665B77813r0639E6J80552e4520J574M256m4516j28745
$$ y = [56848, -199718, 198397, -80717, -199671, -91194, 88713, 270282, -101582, 80150, -4126, -36669, -226522, 10234, -25235, 10408, -7924, -169932, -84292, -163611, 48564, 173472, 142486, -394642, -171376, -202616, -218695, 128911, 106033, 36721, -196263, 85627, 119481, -8823, -169654, 35274, -312294, 6491, 784, 241977, -346550, -223337, -100947, -76643, -172949, -399315, -130353, -32090, 131343, -168687, -137064, -86515, -412333, 11725, -271827, -53722, 88396, -251748, -57436, -176234, 153351, 78304, -141228, 182514, 162476, 145063, 42521, -149816, -52647, -6659, -71670, -111755, -241131, -12960, -73795, -92100, -167625, 325808, -20395, -212706, 131681, -278214, -55665, 277813, 187174, 56, 180608, -54520, -52946, -48690, -93206, -221951]
10008b21951F6279a90747F8352c9156A67873E7636k7617a99655J8596I8718b71572
9996G7838f2250b7865k37774J19029j17074i2556A10948b15426A12319J77426
9986B89745b37514r858B13365h7775M416A84439a42355L6904K9993B24557A03364
9974a09473I7185a0077l91051A53935a85474A28658g9613B61592m8164a7781B5128
9962A20149a34831E5257M4585J68404d6502A36368J824b23000P7119j93856a02159
9950a11503m51280F3729b48267H078J98507f4996D0640a49254f0151p3483A81001
9938d1791B07822E6778d03557A17245b56059j0294F337b22815j12408a65426C3538
9926c05544e8710l52640E9807A7728p292K2435J29105a35902k84577B28507a76977
$$ y = [-221951, 66279, -190747, 68352, -39156, 167873, 57636, 30019, -199655, -181059, 98718, -271572, 77838, -62250, -27865, -265639, -146610, -263684, -92556, 110948, -215426, 112319, 289745, -237514, -247372, 213365, -87775, -83359, 184439, -142355, -105451, -75458, 224557, 103364, -109473, 97185, -10077, -401128, 153935, -185474, 128658, -79613, 261592, 213428, -17781, 25128, 120149, -134831, 55257, 99842, 268246, -46502, 136368, 138192, -223000, -145881, -339737, -102159, -111503, -562783, 63729, -248267, 8078, 206585, -64996, 40640, -149254, -60151, -133634, 181001, -41791, 207822, 56778, -403557, 117245, -256059, -266353, 6337, -222815, -335223, -165426, 33538, -305544, -58710, -411350, 59807, 17728, 10436, 32871, 161976, -135902, -420479, 228507, -176977]
9914a29598G3219c14357M3699F2776b36186k11042p712g4191j48083M2094c1031
9902b42241B23846B7679M3265M6374e6288D3954d27790h2573j1997j28179C74124
9890c25782k02140i8014k51745B40200a33130d0967l1643k84685d3655m326P255
9879d0726j37815N6213p5273B564a6841a626k5095I2741a13973J0317K6436H773
9866A46560a36640H4248K6616b00448J0740j99538c7689j5439M836q0399m9201
9855a77892h4789B64700B5069d84515D4156K31569H9955j6755b6652j00891B11219
9843A90996f3372A06374k7382b11853E2722b05539d2308a5535o2572E6820J2277
9832F9097l1136d44707G696a83589A65092a11478c2345A63035N2548b5299j4742
$$ y = [-129598, 73219, -314357, -270658, 62776, -236186, -447228, -454940, -74191, -222274, -180180, -31031, -242241, 223846, 27679, 70944, 117318, -56288, 43954, -427790, -82573, -94570, -222749, 374124, -325782, -527922, -98014, -349759, 240200, -133130, -40967, -72610, -357295, -43655, -47981, -40726, -178541, -122328, -197601, 2564, -16841, -1626, -26721, 92741, -113973, -103656, -77220, 8773, 146560, -136640, 84248, 110864, -200448, -189708, -389246, -37689, -53128, -48292, -128691, -177892, -84789, 264700, 25069, -484515, 44156, 275725, 89955, 73200, -26652, -127543, 211219, 190996, -63372, 106374, 78992, -211853, 52722, -205539, -42308, -15535, -78107, 56820, 69097, 37961, -444707, 7696, -183589, 165092, -111478, -32345, 163035, 215583, -25299, -40041]
9821d0041G0624J65752d5371k43581P142a10532A00900f3267a2344l92754J37176
9810b67922a19210A31077h53D8207J57964b07372K5257A16910f0526B22308a24852
9798A60064b02666A11375j8788f5595A27317k3399f3982B90928a36328n7511j40070
9787c33909a30061k51244J23537n9545P5931Q5464K8613j92002J26806A3146J94759
9776B07905c17540A25711h4472r5207A53882J68905g0343A95442A9523M680L32873
9765C57076c87796B62164b22937D8290b39754N0122k00655C25409a61834A48496
9754c0796n1646j23127h1698k32173g4845c3581C598J1746d4133k59939a26350
9742f0556k66937L1575h6229B3567k339c09709q0205B01737a58211J7012m6452
$$ y = [-40041, 70624, 236376, -45371, -288952, -281810, -110532, 100900, -63267, -12344, -405098, -267922, -119210, 131077, -853, 48207, 206171, -207372, -182115, 116910, -60526, 222308, -124852, 160064, -202666, 111375, 92587, -65595, 127317, 103918, -63982, 290928, -136328, -193839, -333909, -130061, -381305, -257768, -317313, -241382, -155918, -127305, -319307, -192501, 13146, 207905, -317540, 125711, -84472, -179679, 153882, 322787, -70343, 195442, 19523, 24203, 357076, -387796, 262164, -222937, 48290, -239754, -189632, -390287, 325409, -161834, 148496, -30796, -82442, -205569, -81698, -313871, -74845, -33581, 3598, 15344, -44133, -304072, -126350, -60556, -327493, -295918, -86229, 23567, 21228, -309709, -389914, 201737, -158211, -141199, -187651]
9731a87651J7259M1998A2614b68943h1899b6393A67130A5000K45893M0538a16772
9719f2550B23863D9886c2092C26646c2699l16309E9694a21910L2089B4346d99264
9707C04469C2754b42934c7947A92177c574k24987C2815a60254A38034a05800j134
9696a06934L969r9565k48055J95602A09735a04244B0965c56978D2991a65124r0178
9685b55302i4572G3239O1109o6489A365a87609o4921K9908e224j18280k69118
9674c92622b5182C1345L7975K1637a33838c9137k7902I6631L499B7250O0667B8488
9661b2938B03990g0431A87862b04507C01737c50214a10647l4432b9281j84922
9651b14203e7427A9162a22553F463a74413j31578i4481F5355a36334m417N1157
$$ y = [-187651, -170392, -128394, 12614, -268943, -81899, -26393, 167130, 15000, 260893, 301431, -116772, -62550, 223863, 49886, -32092, 326646, -32699, -349008, 59694, -121910, -89821, 24346, -499264, 304469, 32754, -242934, -37947, 192177, -3574, -228561, 32815, -160254, 138034, -105800, -106934, -102965, -202530, -450585, -254983, 109735, -104244, 20965, -356978, 42991, -165124, -255302, -94572, 73239, 134348, 67859, 1365, -187609, -252530, -222622, -5224, -123504, -392622, -25182, 31345, 69320, 90957, -133838, -39137, -67039, 96631, 100130, 27250, 87917, 28488, -22938, 203990, -70431, 187862, -204507, 301737, -350214, -110647, -145079, -29281, -214203, -57427, 19162, -122553, 6463, -174413, -305991, -94481, 65355, -136334, -140751, -89594]
9640h9594m7620H2045e1710b2220j09972B13489a64315a3981q2138c9737j7630
9629e7367A8504a48409m0148B97336f44152b66696c0203k0908j94261g6631p8073
9618a54704N9790j40489a5045m8202G0986c37587a3717m1316l87047d361j49674
9607a54035A20296b2545j71431B86941a00416j3234m0650G2504a06859A46061
9596b12031E7980h4373m3939k61040B66632A10717c11761G7091c56592J60187
9586a96405k15341i2271A28130b61514j03200A84273N2684b10042d7828j03957
9576a51785D4687a35270m1490Q7014k52301K9230J34161f9864D0383J30684l54
9565A70713b0353B48209a70148K0856f5044j08001e8074A05660c47465A28650
$$ y = [-89594, -137214, 82045, -51710, -22220, -132192, 213489, -164315, -13981, -96119, -39737, -57367, 18504, -148409, -188557, 297336, -644152, -266696, -30203, -51111, -245372, -76631, -154704, -94914, -235403, -15045, -63247, 70986, -337587, -13717, -55033, -442080, -4361, -154035, 120296, -22545, -193976, 286941, -100416, -113650, -154300, 72504, -106859, 146061, -212031, 57980, -84373, -128312, -389352, 266632, 110717, -311761, 77091, -356592, -196405, -411746, -92271, 128130, -261514, -364714, 184273, 236957, -210042, -47828, -151785, 44687, -135270, -176760, -89746, -342047, -312817, -178656, -69864, 40383, 171067, 170713, -20353, 248209, -170148, -149292, -65044, -173045, -58074, 105660, -347465, 128650]
9554C3592K32j2512a46302F2329a34886h273p9477A28418f4581j86963a04445
9542A60003h2324p1747L2942D8929a80058r5870K226a9769m06889J47025i3950
9530d9237l99410G7763a21948k66196A40556C9608d5560j7612A55461d7035j82925
9519b29960A75185j4434c30007C9602a06171B63570r0485a6495C29338f0021F707
9507e21047C12247e0237G6643a38611A33536b98918c3883F6881M904b29338f3262
9495B562e36835g8970j9331M5782A60887C347O0921k6233c07672b0413H8700B1566
9482D7216b82404B21532H3885a24003K4082j44676D4126a99042j64562a04975
9471D1538i088k75997b249A31239l5681M2587A1069d621E1168f5181A59086b29094
$$ y = [33592, 33824, 21312, -146302, 62329, -134886, -8273, -87750, 128418, -64581, -251544, -104445, 160003, -82324, -154071, -121129, 48929, -180058, -275928, -273702, -19769, -426658, -279633, -93950, -49237, -448647, 77763, -121948, -388144, 140556, 39608, -45560, -63172, 155461, -47035, -229960, 175185, 160751, -330007, 39602, -106171, 263570, 173085, -16495, 329338, -60021, 6707, -521047, 312247, -50237, 76643, -138611, 133536, -298918, -33883, 66881, 71785, -229338, -63262, 2562, -536835, -78970, -98301, -52519, 160887, 3347, 64268, 38035, -307672, -20413, 88700, 21566, 47216, -282404, 221532, 83885, -124003, -99921, -244597, 44126, -199042, -363604, -104975, 41538, -9088, -285085, -2249, 131239, 95558, 138145, 11069, -4621, 51168, -65181, 159086, -229094]
9458a96506C6203b46913B81592A15935A9713c97630a3391k60995r4416a32077
9447a84782B7599b63190b1122j94599B79126b42937A42356a33748P813k3218f691
9435B975b34306A9399o193J47437b43699C31365C1c39116A15229c46923i4877
9423B722d4648D26280e24878a59878B7898J14583h0948a2098k12687a04085j16706
9412b20791I8785J50993a59464n8648M5927B182f4160E0776b11431i7030l08112
9401d05142F5256c4598k26438A58671d65100d7827D3444J77931a651j06703A34459
9389b75775g8704k09586D414a0286H0327d5895B42907b38610J11581A12970d8123
9377b57545q9624N4917c2152j65656j20507A21977b34475A11188J28266c34668
$$ y = [-196506, 36203, -246913, 281592, 115935, 19713, -397630, -13391, -274386, -368802, -132077, -184782, 27599, -263190, -21122, -215721, 279126, -242937, 142356, -133748, -125935, -149153, -6691, 2975, -234306, 19399, 13206, 160643, -243699, 331365, 31, -339116, 115229, -346923, -94877, 2722, -44648, 426280, -524878, -159878, 27898, 142481, -80948, -12098, -224785, -104085, -220791, 98785, 249778, -159464, -218112, -172185, 2182, -64160, 50776, -211431, -97030, -405142, 65256, -34598, -261036, 158671, -465100, -47827, 43444, 221375, -1651, -108354, 134459, -275775, -78704, -288290, 4414, -10286, 80327, -45895, 242907, -238610, -127029, 112970, -48123, -257545, -347169, -292252, -32152, -197808, -318315, 121977, -234475, 111188, 239454, -334668]
9366f2278K7982k39871D11098k7131a65060A8607d42887B46662j13948K22555
9356C55269g0520j79515C02220a18032A16915e768A20469c41645R9237J05566
9346a36842L3161J9795A3001b23543A14448b78615j55347a25079I7994b25808
9335B9470J35385d18795a2072j87515L3932g1719q0142m7129B63153E5024a43491
9323a45676A47934j5494a06501b741A06654b0945A19089n4591k3842a05748B2671
9311a75178C9750a38496j20967e2518k21517B61396A5034N041K16209F6125b88035
9299B66254a0001m6868l810l39930B37377b92825N4327c3308H7758L9503D0950
9287c93909a0773j08581j40435k0886d321l76819J79824i2332L4857k60144a42745
$$ y = [-62278, -34296, -274167, 411098, 383967, -165060, 18607, -442887, 246662, 132714, 355269, -70520, -250035, 302220, -118032, 116915, -5768, 120469, -341645, -242408, -136842, -103681, -83886, 13001, -223543, 114448, -278615, -433962, -125079, 97994, -225808, 29470, 164855, -418795, -12072, -199587, -165655, -71719, -151861, -198990, 263153, 55024, -143491, -145676, 147934, 132440, -106501, -2741, 106654, -20945, 119089, 64498, 40656, -105748, 22671, -175178, 39750, -138496, -259463, -52518, -274035, 261396, 15034, 20075, 236284, 66125, -288035, 266254, -10001, -56869, -60679, -400609, 237377, -292825, -238498, -33308, 87758, 127261, 40950, -393909, -10773, -119354, -259789, -280675, -4321, -381140, -201316, -92332, -57475, -317619, -142745]
9275A4160c12585n2613a01229k73925B03406J41165j987h1170E5629K35902a12844
9263a37432d4672j3115J6682A75220m0253J84974b82926B41427a29188N1371A59461
9251b31033B22611a20362B32632f6064h567j5578B10393a18745B20176F9852b7273
9239I6631c39173a33387o84549D15267A13409f4793F0241c15174M3206C5685J41492
9228A77177F730d8186A28407l6952a00414o0968a9977r283B98425a13606k33788
9217c47394M2693B21431o3263i4257p2043B66028c61727B1236h0968j22311M6558
9206a56721A16924c00304a03014J1051q7712A95919b09604O3994A59140a4104
9195B57059F9759M286a61530j12465A02499b49991K9042C25939g2471j17913E6135
$$ y = [14160, -312585, -365198, -101229, -375154, 203406, 344571, 342584, -81170, 55629, 291531, -112844, -137432, -44672, -57787, -41105, 175220, 134967, 319941, -282926, 241427, -129188, -77817, 159461, -231033, 222611, -120362, 232632, -66064, -8567, -24145, 210393, -118745, 220176, 69852, -27273, 96631, -339173, -133387, -817936, 415267, 113409, -64793, 60241, -315174, -271968, 35685, 177177, 6730, -48186, 128407, 91455, -100414, -161382, -19977, -29260, 298425, -113606, -347394, -304701, 221431, 158168, -94257, -166300, 266028, -361727, 21236, -80968, -203279, -156721, 116924, -300304, -103014, -91963, -179675, 195919, -209604, -145610, 159140, -14104, 257059, 69759, 74045, -161530, -273995, 102499, -249991, -220949, 325939, -72471, -190384, 56135]
9183C8593c18960B82716a39281B5691a24891J6278m2874L218A8101J10295l281
9172A25115a03001o6447D5902e4985A28431d0028B95143i1211j56202L7043B14451
9160a92624j02633Q2755A52615a13828F8503b57851a22478A53578Q9263a37347
9149a1345G5877g8557l00166N0828A68006d19293A12921a80531d2090j15005g5834
9137a16205k02980A38339a96483b071j28948q8403j42447A17927a23682L993j10248
9126b29937Q2358f6163k6211l36072A21171m0828e5554O70K2222m6388B15238
9114b1223i624k80635i3253A27851b8013l342h054j11265k09865f1292B1665c4109
9101A64159E9667J37188g8372p7666A25212b32107J03237k1035g4147P927n6575
$$ y = [38593, -318960, 282716, -139281, 25691, -124891, -108613, -151487, -148269, 18101, 128396, 125115, -103001, -169448, 45902, -54985, 128431, -40028, 295143, -91211, -247413, -210370, 214451, -192624, -295257, -212502, 152615, -113828, 68503, -257851, -122478, 153578, 242841, -137347, -11345, 75877, -78557, -378723, -327895, 168006, -419293, 112921, -180531, -42090, -157095, -75834, -116205, -319185, 138339, -196483, -2071, -131019, -219422, -361869, 117927, -123682, -119689, -229937, -147579, -66163, -92374, -428446, 121171, 80343, -55554, -54884, -32662, -79050, 215238, -21223, -9624, -290259, -93253, 127851, -28013, -31355, -8054, -119319, -329184, -61292, 21665, -34109, 164159, 59667, 196855, -78372, -156038, 125212, -232107, -128870, -149905, -74147, -66220, -122795]
9090a22795A43022G1441A4193d65435c6306A16137d31150J70095a432B06078D1800
9078e7966l34259g4245p458b3391m55559G3883a27121r9505I461O0217a70294
9066a09089j12378A118c56178A4795a87123K9029P949c9022j95246A41828I969
9054B19804r4577b04980i6985k39394a31377F4296a57137B41558b16601q3364
9044b99965A95730c10432k2435i8693C5466K87303e48468B07503a10114C88534
9033B33585b51614C11125A45040A5601J48580n7850b86992a35249k8769B3491
9022a02611o0094f841k73283J24581A22964d9061L634k70240O4574O2845c7805
9010b14620r276A85846G751b37876B33836l7015e7508A56896a08290B627a20482
$$ y = [-122795, 143022, 71441, 14193, -465435, -36306, 116137, -431150, -261055, -1432, 206078, 41800, -57966, -392225, -74245, -81703, -23391, -478950, 73883, -127121, -226626, 9461, 69678, -170294, -109089, -221467, 1118, -356178, 14795, -187123, -158094, -150145, -39022, -234268, 141828, 9969, 219804, 125227, -204980, -96985, -336379, -131377, 64296, -157137, 241558, -216601, -299965, 195730, -310432, -332867, -98693, 35466, 322769, -548468, 207503, -110114, 388534, 233585, -251614, 311125, 145040, 15601, 164181, 106331, -286992, -135249, -164018, 23491, -102611, -162705, -6841, -280124, -155543, 122964, -49061, -45427, -315667, -251093, -188248, -37805, -214620, -223896, 185846, 7751, -237876, 233836, 196821, -57508, 156896, -108290, 2627, -120482]
8998A06297b57109A74125a17313n3213k03925C13130g0314K5215I7260a19342
8987a2228A06548g0110H9847a01340j60980B37305j05989c2907o2550J549c7771
8975E9225b76359M1403B8086J87027h4159A91499f0926m9508H3782Q4835c3019
8963h2264k44202J46342j27235a22736C05609A29344J09282b35792a05593j92958
8953b98551a09141B40437H9229b34626b8386A6030L12281a31743r4175D5748f1784
8941C6990J33399D5557a59912A64923p3717c85744A41591K47220m4482A15776
8930a76613B5349d29757d7752I7116L11050n7705M00898K027027J1920982M138515
8920A8837883D868022A356688D52866B20651J97719i239n0153H1456n586a50662
$$ y = [106297, -257109, 174125, -117313, -170526, -374451, 313130, -70314, -45099, 97260, -119342, -12228, 106548, -70110, 89847, -101340, -262320, 237305, 131316, -32907, -95457, -93908, -37771, 59225, -276359, -234956, 28086, 215113, -84159, 191499, -60926, -110434, 83782, 168617, -33019, -82264, -326466, -180124, -307359, -122736, 305609, 129344, 238626, -235792, -105593, -298551, -109141, 240437, 89229, -234626, -28386, 16030, 328311, -131743, -225918, 45748, -61784, 36990, 170389, 45557, -159912, 164923, 91206, -385744, 141591, 388811, 344329, 115776, -176613, 25349, -429757, -47752, 97116, 408166, 350461, 751359, 2778386, 14699368, 18837883, 4868022, 1356688, 452866, 220651, 418370, -9239, -59392, 81456, 75870, -150662]
8909a67449Q723F16937a3931j7472B7589b14446b8947k548A27579c64846C0322
8897H7771b60270M9675J01316d7752D2586b875j72216L9423F1810b3324k935A72775
8884G166a85170g589j41328E5230B5642J99054a2235A7056i6867G2637J95011
8873B67648b5659n6578c9060B09979c02452D5502N9671a87395f2147j37539A68031
8861a80984A77107l0028a38807j49196A7919f2515k21701a20155k44711E1041
$$ y = [-167449, -158726, 616937, -13931, -31403, 27589, -214446, -28947, -31495, 127579, -364846, 30322, 87771, -260270, -210595, -109279, -47752, 42586, -2875, -175091, -135668, 61810, -23324, -26259, 172775, 7166, -185170, -7589, -148917, 55230, 25642, 224696, -12235, 17056, -96867, 72637, 267648, -25659, -82237, -39060, 209979, -302452, 45502, 105173, -187395, -62147, -199686, 168031, -180984, 177107, 147079, -138807, -288003, 17919, -62515, -284216, -120155, -364866, 51041]
$$ [...]
##END NTUPLES=NMR SPECTRUM
##END=
