
##TITLE=UV1219_M5_1296-1170_70_7229600_jnX9vRKcGx
##JCAMPDX= 6.0         $$ Bruker NMR JCAMP-DX V2.0
##DATA TYPE= NMR SPECTRUM
##DATA CLASS= NTUPLES
##ORIGIN= BRUKER
##OWNER= Administrator
$$ 1.72 TOPSPIN		Version 2.1
$$ 2013-01-23 20:16:15.703 -0500  Administrator@X
$$ Compression mode = diff/dup
##.OBSERVE FREQUENCY= 400.02188249412
##.OBSERVE NUCLEUS= ^1H
##.ACQUISITION MODE= SIMULTANEOUS (DQD)
##.ACQUISITION SCHEME= undefined
##.AVERAGES= 8
##.DIGITISER RES= 22
##SPECTROMETER/DATA SYSTEM= spect
##.PULSE SEQUENCE= zg30
##.SOLVENT NAME= COFFEE_meoh
##.SHIFT REFERENCE= INTERNAL, COFFEE_meoh, 1, 14.98509
##AUDIT TRAIL= $$ (NUMBER, WHEN, WHO, WHERE, PROCESS, VERSION, WHAT)
$$ ##TITLE= Audit trail, TOPSPIN		Version 2.1
$$ ##JCAMPDX= 5.01
$$ ##ORIGIN= Bruker BioSpin GmbH
$$ ##OWNER= Administrator
$$ $$ E:\/data/COFFEE/nmr/UV1219_M5_1296-1170_70_7229600_jnX9vRKcGx/40/pdata/1/auditp.txt
$$ ##AUDIT TRAIL=  $$ (NUMBER, WHEN, WHO, WHERE, PROCESS, VERSION, WHAT)
(   1,<2013-01-23 20:16:07.672 -0500>,<Administrator>,<X>,<go>,<TOPSPIN 2.1>,
      <created by zg
	started at 2013-01-23 20:15:01.657 -0500,
	POWCHK enabled, PULCHK disabled,
       configuration hash MD5:
       86 BA 57 50 F2 9D 5C 9B 26 00 A9 28 5F 66 2E 89
       data hash MD5: 64K
       65 99 41 2B C6 8A 4C D3 EB A0 5E 8B 49 19 A9 B8>)
(   2,<2013-01-23 20:16:10.703 -0500>,<Administrator>,<X>,<proc1d>,<TOPSPIN 2.1>,
      <Start of raw data processing
       efp LB = 0 FT_mod = 6 PKNL = 1 PHC0 = 0 PHC1 = 0 SI = 32K 
       data hash MD5: 32K
       D8 B6 52 F4 31 D0 A0 5D 38 58 E9 B4 5D 94 C3 32>)
(   3,<2013-01-23 20:16:11.172 -0500>,<Administrator>,<X>,<proc1d>,<TOPSPIN 2.1>,
      <pk PHC0 = 100.8105 PHC1 = 0 
       data hash MD5: 32K
       12 51 59 D8 70 8C 88 61 27 EB 5B 1B BC 8F 99 1A>)
(   4,<2013-01-23 20:16:11.391 -0500>,<Administrator>,<X>,<proc1d>,<TOPSPIN 2.1>,
      <abs ABSG = 1 
       data hash MD5: 32K
       6D DB 2A 45 4A B0 90 2D 99 CB 44 6C 89 32 39 FC>)
(   5,<2013-01-23 20:16:11.532 -0500>,<Administrator>,<X>,<proc1d>,<TOPSPIN 2.1>,
      <abs ABSG = 2 
       data hash MD5: 32K
       E4 B0 49 A5 3B E6 55 58 C3 20 CA CC F9 B9 FB 36>)
(   6,<2013-01-23 20:16:11.672 -0500>,<Administrator>,<X>,<proc1d>,<TOPSPIN 2.1>,
      <abs ABSG = 3 
       data hash MD5: 32K
       ED C0 20 E5 05 B5 53 C1 A5 70 9E B3 D2 19 CF 64>)
(   7,<2013-01-23 20:16:11.828 -0500>,<Administrator>,<X>,<proc1d>,<TOPSPIN 2.1>,
      <abs ABSG = 4 
       data hash MD5: 32K
       6A 32 FA 04 9F DA E2 8E 08 54 BD 94 EC 75 2E 52>)
(   8,<2013-01-23 20:16:11.985 -0500>,<Administrator>,<X>,<proc1d>,<TOPSPIN 2.1>,
      <abs ABSG = 5 
       data hash MD5: 32K
       0D 42 51 7C 73 41 94 13 67 79 B1 F4 6A A8 A0 80>)
$$ ##END=
$$ 
$$ $$ hash MD5
$$ $$ F7 23 75 D3 01 CE FF 5D F5 D5 73 4C 88 01 93 2D
##$RELAX= 
##$RELAX= 
##$RELAX= 
##$RELAX= 
##$RELAX= 
##$RELAX= 
##$RELAX= 
$$ Bruker specific parameters
$$ --------------------------
##$DU= <E:\>
##$EXPNO= 40
$$ [...]
150 150 150 150 150 150 150 150
##$TP07= 0
##$TPNAME0= <>
##$TPNAME1= <>
##$TPNAME2= <>
##$TPNAME3= <>
##$TPNAME4= <>
##$TPNAME5= <>
##$TPNAME6= <>
##$TPNAME7= <>
##$TPOAL= (0..7)
0.5 0.5 0.5 0.5 0.5 0.5 0.5 0.5
##$TPOFFS= (0..7)
0 0 0 0 0 0 0 0
##$TUNHIN= 0
##$TUNHOUT= 0
##$TUNXOUT= 0
##$USERA1= <user>
##$USERA2= <user>
##$USERA3= <user>
##$USERA4= <user>
##$USERA5= <user>
##$V9= 5
##$VALIST= <valist>
##$VCLIST= <CCCCCCCCCCCCCCC>
##$VD= 0
##$VDLIST= <DDDDDDDDDDDDDDD>
##$VPLIST= <PPPPPPPPPPPPPPP>
##$VTLIST= <TTTTTTTTTTTTTTT>
##$WBST= 1024
##$WBSW= 4
##$XGAIN= (0..3)
0 0 0 0
##$XL= 0
##$YL= 0
##$YMAX_a= 679214
##$YMIN_a= -579592
##$ZGOPTNS= <>
##$ZL1= 120
##$ZL2= 120
##$ZL3= 120
##$ZL4= 120
##$ABSF1= 14.98509
##$ABSF2= -5.573092
##$ABSG= 5
##$ABSL= 3
##$ALPHA= 0
##$AQORDER= 0
##$ASSFAC= 0
##$ASSFACI= 0
##$ASSFACX= 0
##$ASSWID= 0
##$AUNMP= <proc_prof1d_extract_pilot.lims>
##$AXLEFT= 0
##$AXNAME= <>
##$AXNUC= <1H>
##$AXRIGHT= 0
##$AXTYPE= 0
##$AXUNIT= <>
##$AZFE= 0.1
##$AZFW= 0.1
##$BCFW= 0
##$BC_mod= 0
##$BYTORDP= 0
##$COROFFS= 0
##$CY= 15
##$DATMOD= 1
##$DC= 0
##$DFILT= <>
##$DTYPP= 0
##$F1P= 0
##$F2P= 0
##$FCOR= 0.5
##$FTSIZE= 32768
##$FT_mod= 6
##$GAMMA= 0
##$GB= 0
##$INTBC= 1
##$INTSCL= 1
##$ISEN= 128
##$LB= 0
##$LEV0= 0
##$LPBIN= 0
##$MAXI= 10000
##$MC2= 0
##$MEAN= 0
##$ME_mod= 0
##$MI= 0
##$NCOEF= 0
##$NC_proc= -8
##$NLEV= 6
##$NOISF1= 0
##$NOISF2= 0
##$NSP= 0
##$NTH_PI= 0
##$NZP= 0
##$OFFSET= 14.98509
##$PC= 1
##$PHC0= 100.8105
##$PHC1= 0
##$PH_mod= 1
##$PKNL= yes
##$PPARMOD= 0
##$PPDIAG= 0
##$PPIPTYP= 0
##$PPMPNUM= 2147483647
##$PPRESOL= 1
##$PSCAL= 4
##$PSIGN= 0
##$PYNMP= <proc.py>
##$REVERSE= no
##$SF= 400.02
##$SI= 32768
##$SIGF1= 0
##$SIGF2= 0
##$SINO= 400
##$SIOLD= 32768
##$SPECTYP= <>
##$SREGLST= <1H.CDCl3>
##$SSB= 0
##$STSI= 32768
##$STSR= 0
##$SW_p= 8223.68421052631
##$SYMM= 0
##$S_DEV= 0
##$TDeff= 65536
##$TDoff= 0
##$TI= <>
##$TILT= no
##$TM1= 0
##$TM2= 0
##$TOPLEV= 0
##$USERP1= <user>
##$USERP2= <user>
##$USERP3= <user>
##$USERP4= <user>
##$USERP5= <user>
##$WDW= 1
##$XDIM= 32768
##$YMAX_p= 476215785
##$YMIN_p= -734217
##$CURPLOT= <Network HP LaserJet P1505>
##$CURPRIN= <$Network HP LaserJet P1505>
##$DFORMAT= <normdp>
##$LAYOUT= <+/1D_H.xwp>
##$LFORMAT= <normlp>
##$PFORMAT= <normpl>
##$SURQMSG= 1
$$ End of Bruker specific parameters
$$ ---------------------------------
##NTUPLES= NMR SPECTRUM
##VAR_NAME=  FREQUENCY,     SPECTRUM/REAL,   SPECTRUM/IMAG
##SYMBOL=    X,             R,               I
##VAR_TYPE=  INDEPENDENT,   DEPENDENT,       DEPENDENT
##VAR_FORM=  AFFN,          ASDF,            ASDF
##VAR_DIM=   32768,         32768,           32768
##UNITS=     HZ,            ARBITRARY UNITS, ARBITRARY UNITS
##FACTOR=    0.250966925370066, 1,           1
##FIRST=     8223.43324360094, -10325,       -253930
##LAST=      0,             -82194,          149553
##MIN=       0,             -734217,         0
##MAX=       8223.43324360094, 476215785,    0
$$ Real data points
##PAGE= N=1
##DATA TABLE= (X++(R..R)), XYDATA
$$ [...]
19517D3013a66994n9838A27984m0517J1310f4004j09917k4006O3014a0749F5053
$$ 43013 -166994 -226832 127984 87467 98777 -64004 -173921 -197927 -134913 -10749 65053
19505b92339J28036j6469f4977B59195r0123a82425A84094b59029l0565K4387
$$ -292339 -164303 -180772 -64977 259195 169072 -182425 184094 -259029 -289594 -265207
19495b65207e7788J3236M625A31021a20223k03630A08000c8562k29565k13499
$$ -265207 -57788 -44552 -39927 131021 -120223 -323853 108000 -38562 -268127 -481626
19485d81626e9937k58804E577J3716J01915B3065b021k37124H9661a27548C490
$$ -481626 -59937 -318741 5577 19293 121208 23065 -2021 -239145 89661 -127548 3490
19473f6333l81994F5530J19910a1231E0172a27626c9880A15951c0521A37388A0804
$$ -66333 -448327 65530 185440 -11231 50172 -127626 -39880 115951 -30521 137388 10804
19461b5257B03462D2182M9127h6676r3218A74922b4538A4840i5089b6372n1712
$$ -25257 203462 42182 91309 -86676 -179894 174922 -24538 14840 -95089 -26372 -78084
19450g8084J3577B40323d03095F5445L0858e2105A15075h442j23546A33879a02816
$$ -78084 -64507 240323 -403095 65445 96303 -52105 115075 -8442 -131988 133879 -102816
19438b1737G8093a08820L899C4308M37547k20360d0336C7602a55107K321N7555
$$ -21737 78093 -108820 -104921 34308 471855 251495 -40336 37602 -155107 -152786 -95231
19427i5231A26895a87031h4769k24998J1289F5190B1104a75457A75397g4059q6201
$$ -95231 126895 -187031 -84769 -309767 -298478 65190 21104 -175457 175397 -74059 -160260
19416a60260D54140f2966n9542p904C39919c21487D9314a03A58665d1654J7822
$$ -160260 454140 -62966 -122508 -130412 339919 -321487 49314 -103 158665 -41654 -23832
19405b3832h686A02093j7961a30177A14793i644r1811H9920a54983C5647P044
$$ -23832 -8686 102093 84132 -130177 114793 -9644 -101455 89920 -154983 35647 42691
19394D2691a41259f7505D21190c20724Q6480e965E5897b7738p4238N076G8164
$$ 42691 -141259 -67505 421190 -320724 -234244 -5965 55897 -27738 -101976 -96900 78164
19382c38277d7887R833j2297R191o9210F8595A3607c52479c6168C8734K30926
$$ -338277 -47887 -38054 -50351 -41160 -110370 68595 13607 -352479 -36168 38734 269660
19371B69660c96632a38682C7581a00277j9396r1705H7254d26375a5831o6655C15919
$$ 269660 -396632 -138682 37581 -100277 -119673 -211378 87254 -426375 -15831 -82486 315919
19359h1311G5968a48398j7938A33928o4955a27877C73728b89374a04227r916B9869
$$ -81311 75968 -148398 -166336 133928 68973 -127877 373728 -289374 -104227 -114143 29869
19347C05866B2400P370a86781a5778k27900P8666h141k7548E0880c02483J34078
$$ 305866 22400 29770 -186781 -15778 -243678 -165012 -8141 -35689 50880 -302483 -168405
19336a68405r7301A54522l9065h5251j50432K1213m3045C7374M3260J20181b38247
$$ -168405 -265706 154522 115457 -85251 -235683 -214470 -257515 37374 80634 200815 -238247
19324B1659a04088I2612c32207d7741B42814j21378b92188D6406a58733b2924
$$ 21659 -104088 92612 -332207 -47741 242814 121436 -292188 46406 -158733 -22924
19313c4099j99236D622K17926g2215K8776c945A39252C8533e8598B60324H0826
$$ -34099 -233335 4622 222548 -72215 -43439 -3945 139252 38533 -58598 260324 80826
19301c0784F1220b9507l5573A343J92217b46878J20762c8314N381k13883Q6991
$$ -30784 61220 -29507 -65080 1343 193560 -246878 -126116 -38314 -32933 -246816 -159825
19290a59825N9197j08382f9362C8281a0842j25433n5972J7872c7301D7822f6059
$$ -159825 -100628 -209010 -69362 38281 -10842 -136275 -192247 -174375 -37301 47822 -66059
19278c02676D56708A5537b05664c3856C0652R8117b90139l37661c00898A77169
$$ -302676 456708 15537 -205664 -33856 30652 128769 -290139 -627800 -300898 177169
19267C64430a23320q2783A35085i9054d6837k38632m1235i2175k18944J26204
$$ 364430 -123320 -206103 135085 -99054 -46837 -285469 -326704 -92175 -311119 -184915
19257a84915l7697e398j25579j20408e8672B1839K32706g7073l99415A01009a08791
$$ -184915 -222612 -5398 -130977 -251385 -58672 21839 254545 -77073 -476488 101009 -108791
19245g7739o2998J7347o8595D1470a56042k5312A69627b58747J18726k52532h4302
$$ -77739 -140737 -123390 -191985 41470 -156042 -181354 169627 -258747 -140021 -392553 -84302
19233A1919J73868a26906a0559p0189n0784B16730c041k20811C1196P7840b75047
$$ 11919 185787 -126906 -10559 -80748 -131532 216730 -3041 -223852 31196 109036 -275047
19221B45746a09646l16696J52795E6074b090k37425J07779A22292b72205L7405
$$ 245746 -109646 -426342 -273547 56074 -2090 -239515 -131736 122292 -272205 -234800
19211b34800H7551c34997a27751C31548G4340J67231a27712A42091n1316d6740
$$ -234800 87551 -334997 -127751 331548 74340 241571 -127712 142091 90775 -46740
19200a48368L9136I9595C603K07994G3771L84870b61336b9650j80367E7096a39014
$$ -148368 -109232 99595 3603 211597 73771 458641 -261336 -29650 -210017 57096 -139014
19188B69652b6228B1782L6240a88044E2229b68361j76402a43931j47348a21108
$$ 269652 -26228 21782 58022 -188044 52229 -268361 -444763 -143931 -291279 -121108
19177b42678F6319g2496c1838j78104A80443b58516g3694A6460L64404r4814c12393
$$ -242678 66319 -72496 -31838 -209942 180443 -258516 -73694 16460 380864 286050 -312393
19165a24136B51758h8729j94651G651J08927i1814K8834A78746D256K1794a19317
$$ -124136 251758 -88729 -283380 7651 116578 -91814 -62980 178746 4256 26050 -119317
19153D6275c6931E5527d27018h5841j46392I2407b34820b3414r1667q030A22828
$$ 46275 -36931 55527 -427018 -85841 -232233 92407 -234820 -23414 -115081 -123111 122828
19141a561q7204j70007C0117I96J97519Q3349N0926G6005b56488P7779N2624b2342
$$ -1561 -88765 -258772 30117 996 198515 281864 332790 76005 -256488 -178709 -126085 -22342
19128b62154B34236j6506i2918D629P487b32674O3691k18263e4782j65603c8634
$$ -262154 234236 217730 -92918 4629 12116 -232674 -168983 -387246 -54782 -220385 -38634
19116F2293a32909j60496g2227J7805B299J52422A0939N0439d05037D1228P1969
$$ 62293 -132909 -293405 -72227 -54422 2299 154721 10939 61378 -405037 41228 113197
19105A13197b39351h77m20970a13389L2981F8582C1317A1476N5788A7057L9542
$$ 113197 -239351 -877 -421847 -113389 -80408 68582 31317 11476 67264 17057 56599
19094E6599h3354J2777H8319B4776a29293j65599A43782A1717a41137n9356C0088
$$ 56599 -83354 -70577 88319 24776 -129293 -294892 143782 11717 -141137 -200493 30088
19082f75923L30854a02941b6346k10334E1338K19821b47353h6646j00060N2054
$$ -675923 -345069 -102941 -26346 -236680 51338 271159 -247353 -86646 -186706 -134652
19072a34652A5611J16759a53792A39874a11699A79190a58984A38738b41901B69326
$$ -134652 15611 132370 -153792 139874 -111699 179190 -158984 138738 -241901 269326
19061c74902J43310D3927K37271I8109c64296A12184c1165I7661e42089a19982
$$ -374902 -231592 43927 281198 98109 -364296 112184 -31165 97661 -542089 -119982
19050d7589k45684D2282J16138D2291a55525A71494b0634j7457j94534A17679
$$ -47589 -293273 42282 158420 42291 -155525 171494 -20634 -38091 -232625 117679
19039D4450f9048F3873a88379A85990a01737I6555K13526e9993B37922c5351o0781
$$ 44450 -69048 63873 -188379 185990 -101737 96555 310081 -59993 237922 -35351 -96132
19028i6132B7278M23251k05916a85921c5521B10942a9697m0420g379C062b41930
$$ -96132 27278 450529 244613 -185921 -35521 210942 -19697 -60117 -7379 3062 -241930
19016C90339b04706e4731A89979c57207F9247g5809m6195b3852r3007B33756a20354
$$ 390339 -204706 -54731 189979 -357207 69247 -75809 -122004 -23852 -116859 233756 -120354
19004C11081e9564A29713a11426c2558j99188j9384n3324I143J49848a66504K302
$$ 311081 -59564 129713 -111426 -32558 -231746 -251130 -304454 9143 158991 -166504 -164202
18993a64202B09226a54074p5808l354C6830d17924h5914n1518L4686D8304b25917
$$ -164202 209226 -154074 -229882 -233236 36830 -417924 -85914 -137432 -102746 48304 -225917
18981b29844K3887p2627A72446g8966D0124c91576c1527j50209A45299E5181N9506
$$ -229844 -205957 -278584 172446 -78966 40124 -391576 -31527 -181736 145299 55181 114687
18970A14687I391b5009A76122e6515A96770b06559e889k65041A71639F6347e915
$$ 114687 9391 -25009 176122 -56515 196770 -206559 -5889 -270930 171639 66347 -5915
18958c5036J6852k65419A91806b63455B0397a48737L9402l95025D3818J83113
$$ -35036 -18184 -283603 191806 -263455 20397 -148737 -109335 -504360 43818 226931
18948B26931a80833m1585G6785K7398c19987n2442c2738j85011A03813b26767
$$ 226931 -180833 -222418 76785 104183 -319987 -372429 -32738 -217749 103813 -226767
18937a86926d2262p6140k2472a4113k84464D7447a96054J3863L6532B57075d31304
$$ -186926 -42262 -118402 -140874 -14113 -298577 47447 -196054 -182191 -145659 257075 -431304
18925b52192O9730A02487K73485A30621i5930A50520b91453h4980k9097b6552
$$ -252192 -182462 102487 375972 130621 -95930 150520 -291453 -84980 -114077 -26552
18914a01691A2515J57742h6422A83581b67710c9626l44266D1778d78741H4273
$$ -101691 12515 170257 -86422 183581 -267710 -39626 -383892 41778 -478741 84273
18903A37410j0919e0130k79667J12083f839C69756j83879d64752A34765K3993
$$ 137410 126491 -50130 -329797 -217714 -6839 369756 185877 -464752 134765 158758
18893A58758n1926a80405Q2153o77j80152A48976E537a54436b841j09515B13116
$$ 158758 106832 -180405 -98252 -98929 -279081 148976 5537 -154436 -2841 -112356 213116
18881a04753H369k18h7297l59215a73083j84255A95979J65558b4002q6352p4568
$$ -104753 8369 8151 -87297 -446512 -173083 -357338 195979 361537 -24002 -110354 -184922
18870a84922C38572A03270f5530C508a21804a8477A25676a40726g074j24657n7694
$$ -184922 338572 103270 -65530 3508 -121804 -18477 125676 -140726 -7074 -131731 -189425
18859a89425J1629f431l03068F7215a44256j32713b9753m22725D7670b621r4738
$$ -189425 -177796 -6431 -309499 67215 -144256 -276969 -29753 -452478 47670 -2621 -97359
18848i7359H878a16658B01320c2395F225g3222k6517K6195H7439a17371J8183
$$ -97359 8878 -116658 201320 -32395 6225 -73222 -99739 -73544 87439 -117371 -99188
18837i9188A38751b43270E8958c83465A11386e0891h019A8072N433b2416A7256
$$ -99188 138751 -243270 58958 -383465 111386 -50891 -8019 18072 23505 -22416 17256
18825d0173p7241G8895l2324J33333m5057c80731a81660a1203C9064a17362j0087
$$ -40173 -117414 78895 46571 179904 134847 -380731 -181660 -11203 39064 -117362 -127449
18814a27449P403A19668J79650a45653G0228b2818B11859r4889b02112A24874
$$ -127449 -120046 119668 299318 -145653 70228 -22818 211859 116970 -202112 124874
18803c02821J9814d2952l3042j54159B42055c29121c3617C1427c2878E1791J3137
$$ -302821 -283007 -42952 -75994 -230153 242055 -329121 -33617 31427 -32878 51791 64928
18792F4928d06728a05322j06406l34663J48836a05250p3730G1105a80256L0634
$$ 64928 -406728 -105322 -211728 -546391 -397555 -105250 -178980 71105 -180256 -149622
18782a49622A88016H4390a95267F068d9333A85655E9497a33843K1558k2131d4133
$$ -149622 188016 84390 -195267 6068 -49333 185655 59497 -133843 -112285 -134416 -44133
18770a25216C930g6038A72617b216A27895I12J99815a45032r6681A72794F5822
$$ -125216 3930 -76038 172617 -2216 127895 912 200727 -145032 -241713 172794 65822
18758b72861R3016j37150j72346b40604A08157h5606k2682q8346E6593R1971b72247
$$ -272861 -179845 -316995 -489341 -240604 108157 -85606 -108288 -196634 56593 148564 -272247
18746a83499b397j51718N7881l2711n4053j85046a50477M0086o152E6783k6348
$$ -183499 -2397 -154115 -96234 -128945 -182998 -368044 -150477 -110391 -116543 56783 30435
18735C0435R0997l3940J4692g8325j49752j28013J01295k50284e8366a9585r483
$$ 30435 121432 87492 102184 -78325 -228077 -356090 -254795 -505079 -58366 -19585 -29068
18724b9068p5311C12537b29096m2308A8936f4361c1024A3494K50886c4667H7074
$$ -29068 -104379 312537 -229096 -271404 18936 -64361 -31024 13494 264380 -34667 87074
18712a24203A21433D2359K83298c864j72797j40372b3699j9774j20434F5047K18974
$$ -124203 121433 42359 325657 -3864 -176661 -317033 -23699 -43473 -163907 65047 284021
18701B84021p0402G3183c16289B09061i9933A46524p2130r90L3525K34201q6959
$$ 284021 213619 73183 -316289 209061 -99933 146524 74394 73404 106929 341130 254171
18690B54171b81723G0817J20649i293l11099B5788a09081j19938D7338J24783
$$ 254171 -281723 70817 191466 -9293 -320392 25788 -109081 -229019 47338 172121
18680A72121b39030f0742j20776c090j65341O7357j54377m080a05913r4416A19484
$$ 172121 -239030 -60742 -181518 -3090 -168431 -101074 -255451 -259531 -105913 -200329 119484
18668d2547j61551A00031l7955J14577L4559h3098C4036c953E0497c30340f3606
$$ -42547 -204098 100031 62076 176653 211212 -83098 34036 -3953 50497 -330340 -63606
18656b01784A14574E4233b72580J0808B99109C1568J65328E2826k557a50571f193
$$ -201784 114574 54233 -272580 -261772 299109 31568 196896 52826 50269 -150571 -6193
18644A11328a80437A12819c46778a65686k03064A86168b77179E3744b7948q5168
$$ 111328 -180437 112819 -346778 -165686 -368750 186168 -277179 53744 -27948 -113116
18634a13116m6349b9174k46258P1213A88493m4507a35867d5047m76466K55855
$$ -113116 -159465 -29174 -275432 -204219 188493 143986 -135867 -45047 -521513 -265658
18624b65658f6444j93920e2146a7191m3251j23328D587b3241j43668G9272J00451
$$ -265658 -66444 -260364 -52146 -17191 -60442 -183770 4587 -23241 -166909 79272 179723
18613A79723o7502p88a26257b5465j20830k53250c565l48503B19473f7040A09554
$$ 179723 112221 111433 -126257 -25465 -146295 -399545 -3565 -352068 219473 -67040 109554
18601c63555a70929B08079a27988C442a61796e4684j06110g8698A02371g58A10486
$$ -363555 -170929 208079 -127988 3442 -161796 -54684 -160794 -78698 102371 -758 110486
18589A72848c45862f7477k63797c5862D85009k32589a44852B1038K43700b55833
$$ 172848 -345862 -67477 -331274 -35862 485009 252420 -144852 21038 264738 -255833
18578b77662A0690a70689p9063M1803B419R0426k5062B4126j0751K29147a59574
$$ -277662 10690 -170689 -249752 -207949 2419 92845 67783 24126 13375 242522 -159574
18566a22324q756D0768K39241b22282E0375b60852A56082a51624B08324a19929
$$ -122324 -131080 40768 280009 -222282 50375 -260852 156082 -151624 208324 -119929
18555B0863a00254C4935E354f5773K1956k73074a56729i284j45406e2799m4115
$$ 20863 -100254 34935 5354 -65773 -43817 -316891 -156729 -9284 -154690 -52799 -96914
18544i6914i32I9828C9923A4969J76856a30721f4205a7175l01760B11752b61876
$$ -96914 -932 99828 39923 14969 191825 -130721 -64205 -17175 -318935 211752 -261876
18532A5125b3458j10450A7480a7119A3156b17989f8590A20758Q2518J07694a00859
$$ 15125 -23458 -133908 17480 -17119 13156 -217989 -68590 120758 203276 310970 -100859
18520B77347g1281j32263R643c3972r8719A7085J66345H5755c86481a69601I7763
$$ 277347 -71281 -203544 -193901 -33972 -132691 17085 183430 85755 -386481 -169601 97763
18508a28678J1178M9512m3406q6591j8680B6531c16278J54242j29978j7318d6150
$$ -128678 -117500 -67988 -111394 -197985 -216665 26531 -316278 -162036 -292014 -309332 -46150
18496a44371L4048M4969K9355p1749B26169d73576B5171b6830I5072c48504Q7903
$$ -144371 -110323 -65354 -35999 -107748 226169 -473576 25171 -26830 95072 -348504 -260601
18485b60601b8805k79019j03008f6260A59769b19447C85868c83062c7506n4931
$$ -260601 -28805 -307824 -410832 -66260 159769 -219447 385868 -383062 -37506 -92437
18475i2437I7961J67631m1265c31850E6690K66504a69170k47795c7562J3979k32899
$$ -92437 97961 265592 224327 -331850 56690 323194 -169170 -416965 -37562 -23583 -256482
18464b56482a11967J368L0248k94848C77315a32212n9182H7003f1823I4442a93701
$$ -256482 -111967 -110599 -80351 -375199 377315 -132212 -191394 87003 -61823 94442 -193701
18452a92422i1025B20020F3588b79827P3672B97937b88862B36236b67414J23701
$$ -192422 -91025 220020 63588 -279827 -206155 297937 -288862 236236 -267414 -143713
18442a43713j48194r039A66161e2058j37023l37165R0744J85467a19768M5712
$$ -143713 -291907 -300946 166161 -52058 -189081 -526246 -435502 -250035 -119768 -74056
18432g4056A81171n5712b9315I2409h8478o0136n4302A98076B3121a23866j75465
$$ -74056 181171 125459 -29315 92409 -88478 -148614 -202916 198076 23121 -123866 -299331
18421b99331m3751A94695R337B5273h785j7560A38174L2865a71002D992c03694
$$ -299331 -343082 194695 204032 25273 -8785 -26345 138174 171039 -171002 4992 -303694
18409f3484m8480C005a20594P784A34760n2268P439a20593j37707M3454D1091
$$ -63484 -111964 3005 -120594 -112810 134760 82492 89931 -120593 -258300 -214846 41091
18397b22661b2735j95968J09118N2618C19727a05376A61961c00094a38884j59512
$$ -222661 -22735 -218703 -109585 -56967 319727 -105376 161961 -300094 -138884 -298396
18387b98396B31207a80067G2801R025a21596B26262J38532a25718L1970j16220
$$ -298396 231207 -180067 72801 81826 -121596 226262 364794 -125718 -93748 -209968
18377b09968e0747A59127c43986a12229j42111A308J27591d17768d6742l27608
$$ -209968 -50747 159127 -343986 -112229 -254340 1308 128899 -417768 -46742 -374350
18367c74350A7288E705a65159d0484p0505A43356J36552M6253a84344q4082d1294
$$ -374350 17288 5705 -165159 -40484 -110989 143356 279908 326161 -184344 -268426 -41294
18355A32057a8866k1278A18033f0097j50061b5924j52465c4677q3983j82867C48436
$$ 132057 -18866 -40144 118033 -60097 -210158 -25924 -178389 -34677 -118660 -301527 348436
18343G1509r314q199b28831C9700a43466M4677B1252J55513b22998A81556L9778
$$ 71509 62195 53996 -228831 39700 -143466 -98789 21252 176765 -222998 181556 221334
18332B21334b70667A17441d46234J80981B4751K2988K8691b43758A77713b02385
$$ 221334 -270667 117441 -446234 -265253 24751 47739 76430 -243758 177713 -202385
18321a08814d1011A79196C2330P3353k4121e8981A2387K12135M8263g3657k07304
$$ -108814 -41011 179196 32330 105683 81562 -58981 12387 224522 272785 -73657 -280961
18310b80961k32405h7022j25182N9847B80200a73494O2498C8256b00666G2519
$$ -280961 -513366 -87022 -212204 -152357 280200 -173494 -110996 38256 -200666 72519
18299a58446f699A20394b53075j05768A91135n716n1234a6952A60971a31475N167
$$ -158446 -6699 120394 -253075 -358843 191135 185419 134185 -16952 160971 -131475 -126308
18288a26308A1961a00563j43958L993a1939j27436m6259O0840G9149b25310J08386
$$ -126308 11961 -100563 -244521 -240528 -11939 -139375 -185634 -124794 79149 -225310 -116924
18277a16924B4383b67640a18916A74300h8662B54270o9261D1725i7751A79791
$$ -116924 24383 -267640 -118916 174300 -88662 254270 185009 41725 -97751 179791
18266a29809M1986a7407A18691d93358B35912b4962B2044J00967J27668j22025
$$ -129809 -87823 -17407 118691 -493358 235912 -24962 22044 123011 250679 128654
18256A28654J42832K41A2565O4050k3400b11981A20917b19881F9884c36083J57667
$$ 128654 271486 271727 12565 76615 53215 -211981 120917 -219881 69884 -336083 -178416
18245a78416C3998J679g8097j1885l88504i1516k72137c8098G6520f6060K8005
$$ -178416 33998 35677 -78097 -89982 -478486 -91516 -363653 -38098 76520 -66060 -38055
18234c8055l23828A13236b74126G0217a20899k04422O3478f5400I4546c09737
$$ -38055 -361883 113236 -274126 70217 -120899 -325321 -261843 -65400 94546 -309737
18223D7334c15397A38170c44999A03387a03928b6059r5588L6189q409d1488o8142
$$ 47334 -315397 138170 -344999 103387 -103928 -26059 -121647 -85458 -93867 -41488 -109630
18212a09630B52895i602k26106e8373D1501a07518k61906J40861l5098B92353
$$ -109630 252895 -9602 -235708 -58373 41501 -107518 -369424 -228563 -263661 292353
18201c47086J03680D14563j89805j12203M6916a62704O6190A2224b0377m1474
$$ -347086 -243406 414563 224758 112555 159471 -162704 -96514 12224 -20377 -61851
18191f1851j69582A10396b0346H9350J4157m5915a9292j7953j09327f1080G6246
$$ -61851 -231433 110396 -20346 89350 103507 57592 -19292 -37245 -146572 -61080 76246
18179A40384b19062g7411j80110A72236c89508R8969R1675G2694K64317A57459
$$ 140384 -219062 -77411 -257521 172236 -389508 -290539 -198864 72694 337011 157459
18168I8596a66273j85546J35877a06868d4504A03099g8529I1281i1787B48516
$$ 98596 -166273 -351819 -215942 -106868 -44504 103099 -78529 91281 -91787 248516
18157a22024K8198B935L3297a14717a9931o7796B446e1906b1662B2497M0773O313
$$ -122024 -93826 2935 36232 -114717 -19931 -87727 2446 -51906 -21662 22497 63270 69583
18145F9583a74359p2848B20714N5242b8752C5603J48322a96304j27382H5334b04803
$$ 69583 -174359 -247207 220714 275956 -28752 35603 183925 -196304 -323686 85334 -204803
18133A02917G390a08287G4683P832i1793q3695D4087a78195m04k8957j91539a21613
$$ 102917 7390 -108287 74683 82515 -91793 -175488 44087 -178195 -178599 -207556 -399095 -121613
18120b98631a32503O5000m3223I9620c26469J08249j06352J26743n3226A34114
$$ -298631 -132503 -67503 -110726 99620 -326469 -218220 -324572 -197829 -251055 134114
18109D64969a649A16114a17154E5698J05341E4773g6514o4727m0261A41289E2403
$$ 464969 -1649 116114 -117154 55698 161039 54773 -76514 -141241 -181502 141289 52403
18097a15744A14935l1287J36532C5427b35932A1086c7222a954k5464B76825B0089
$$ -115744 114935 83648 220180 35427 -235932 11086 -37222 -1954 -27418 276825 20089
18085b2457q9656A68340J13678b00865A27552J7939b02237F2532c68280E4854
$$ -22457 -112113 168340 282018 -200865 127552 145491 -202237 62532 -368280 54854
18074A56012J598M128b811C0746K75972c15211A31096d4413A478d87990B52909
$$ 156012 157610 161738 -2811 30746 306718 -315211 131096 -44413 1478 -487990 252909
18062i9670F7887R3433h0998j10820D0697B0263L2520d67694A31335E1205f5262
$$ -99670 67887 161320 -80998 -191818 40697 20263 52783 -467694 131335 51205 -65262
18050a92996i1532A19554a18931c2318m0818L6458H4834a57876C6281J06996a00087
$$ -192996 -91532 119554 -118931 -32318 -73136 -36678 84834 -157876 36281 143277 -100087
18038a87826a5675B40600C8225a13924j81591A33942E8545c41657c2777q7824
$$ -187826 -15675 240600 38225 -113924 -295515 133942 58545 -341657 -32777 -120601
18028a20601B32461A01863k8245a92923B41964b1404H7292a42683j89466G0583
$$ -120601 232461 101863 73618 -192923 241964 -21404 87292 -142683 -332149 70583
18017g5074K4544q64m5380G7418M1914l7137h6226k31684A08688B2156L4135d40522
$$ -75074 -50530 -51394 -96774 77418 119332 82195 -86226 -317910 108688 22156 56291 -440522
18004b11542r414p4584b0548k77748a34126b4836p3296B72218b16634G6093C5480
$$ -211542 -220956 -295540 -20548 -298296 -134126 -24836 -98132 272218 -216634 76093 35480
17992b72869F7293a46677A98352F0845J95974A5070R9149b94960N2180P1197B6565
$$ -272869 67293 -146677 198352 60845 256819 15070 114219 -294960 -242780 -171583 26565
17980a42k01985b6093o5422j7780a1220A10741J92477A03614J28135I393J60253
$$ -142 -202127 -26093 -91515 -109295 -11220 110741 303218 103614 231749 9393 169646
17969A69646c46223f6577e819j33150q411B41970c18974A40304C7536a26291C26711
$$ 169646 -346223 -66577 -5819 -138969 -147380 241970 -318974 140304 37536 -126291 326711
17957A72487c63943a3937j82282A02375c12977E7939N1612p199b59157C8646a70034
$$ 172487 -363943 -13937 -196219 102375 -312977 57939 109551 102352 -259157 38646 -170034
17945A44282F8953K38669h9611j53010D18956f7690c1793l9667A25580c4542G6035
$$ 144282 68953 307622 -89611 -242621 418956 -67690 -31793 -71460 125580 -34542 76035
17933B68615A9654a40493A05603d2759J7775K757k7870B42080a3332A26915c70872
$$ 268615 19654 -140493 105603 -42759 -24984 -22227 -50097 242080 -13332 126915 -370872
17921e0697A54694d38806J55997E3690L0414a54585C9425a7460n4295m54660c8187
$$ -50697 154694 -438806 -282809 53690 84104 -154585 39425 -17460 -71755 -526415 -38187
17909g6011F1443i6374L3555a86A58183G0340a88450D26476a09078M4791n5681
$$ -76011 61443 -96374 -62819 -186 158183 70340 -188450 426476 -109078 -64287 -119968
17898a19968N357A7801K24591n8778d312I7570N2594a71446r8392B07276G3588
$$ -119968 -114611 17801 242392 183614 -4312 97570 150164 -171446 -269838 207276 73588
17886A56538a38155l4918B29448J44853C1202J14959h6015I6717c93899c8855
$$ 156538 -138155 -173073 229448 374301 31202 146161 -86015 96717 -393899 -38855
17875c330j01751B4957c15215F0609J44164d5655A09654L360C7664g5636n53574
$$ -3330 -105081 24957 -315215 60609 204773 -45655 109654 113014 37664 -75636 -629210
17864f29210D8168A4623a00213d6497j07717d1773l7375n5415p0387O3275c3426
$$ -629210 48168 14623 -100213 -46497 -154214 -41773 -79148 -134563 -204950 -141675 -33426
17852c78169A51059b79842F4751L99571a89296n6004j50267A13315c10096D1727
$$ -378169 151059 -279842 64751 464322 -189296 -245300 -395567 113315 -310096 41727
17841A30158i609E2190L96257A23796a75052A83533e5267b6849B7915R7782J58557
$$ 130158 -9609 52190 448447 123796 -175052 183533 -55267 -26849 27915 125697 284254
17830B84254i0655B1880a57456f9801B5552O7737P8779J41181A38509b05395N57
$$ 284254 -90655 21880 -157456 -69801 25552 93289 172068 313249 138509 -205395 -204838
17819b04838p4085A95488a63800A12115L091b81395A20582J5682h4628C68827
$$ -204838 -278923 195488 -163800 112115 115206 -281395 120582 136264 -84628 368827
17808A82274a85407A10991n1067O7186J22560d464A04199a71462n1094D5982K54167
$$ 182274 -185407 110991 59924 127110 249670 -4464 104199 -171462 -222556 45982 300149
17797C00149j2335c7139n1859A57571a86562G674J8112d2058j15410P2528j3787
$$ 300149 287814 -37139 -88998 157571 -186562 7674 25786 -42058 -157468 -84940 -98727
17786i8727B07126c89942B38914a98878B050g9908j73228A61281c06134C36191
$$ -98727 207126 -389942 238914 -198878 2050 -79908 -253136 161281 -306134 336191
17775C25181f554j64423B39650b6168B27275C1844P8872J74005c26560G0553j4088
$$ 325181 -6554 -170977 239650 -26168 227275 31844 110716 284721 -326560 70553 56465
17764E6465a03850I5263h195j83086C064L3871K19175I0861l3725C739a76786
$$ 56465 -103850 95263 -8195 -191281 3064 36935 256110 90861 57136 3739 -176786
17752B12395e17713A52189a38925A42093c4521B78133a37414k3605o4624R7240
$$ 212395 -517713 152189 -138925 142093 -34521 278133 -137414 -161019 -225643 -128403
17742a28403a1441j55148C82745j36129O626a10138A84649m7771a73204A32091
$$ -128403 -11441 -166589 382745 246616 253242 -110138 184649 136878 -173204 132091
17731a21709C2044b00971M1828B36959a70326A55671c0153l1590A29431m5271
$$ -121709 32044 -200971 -159143 236959 -170326 155671 -30153 -61743 129431 84160
17721H4160J4415i9681G4967e5271b6194A48695n9602A2699a79747f6130L2548
$$ 84160 98575 -99681 74967 -55271 -26194 148695 89093 12699 -179747 -66130 -33582
17710c3582G9226J28715a43012B07297P4341a69910D5838a46922r5204a6562E2553
$$ -33582 79226 207941 -143012 207297 281638 -169910 45838 -146922 -242126 -16562 52553
17698b2035k02772q1425B46454a59585C1354K80989b84969g2871j89112A98253
$$ -22035 -224807 -306232 246454 -159585 31354 312343 -284969 -72871 -261983 198253
17687A66328b19238A4560c50704a9721C5800i08D3091L79313a04908k46858g3105
$$ 166328 -219238 14560 -350704 -19721 35800 -908 43091 422404 -104908 -351766 -73105
17675C30931h4166H5935J31938b02156K0182A04182J20346b58868o0318B07368
$$ 330931 -84166 85935 217873 -202156 -181974 104182 224528 -258868 -319186 207368
17664A60971e46492A81270P5182D8569N3868j8278K07985P5360B9852J45102e0704
$$ 160971 -546492 181270 256452 48569 102437 84159 292144 367504 29852 174954 -50704
17652b82078C43154c7358j90738a3142D0961e05112a37121B40743a30260b9734
$$ -282078 343154 -37358 -228096 -13142 40961 -505112 -137121 240743 -130260 -29734
17641f91j86031f5678D7723L4482B413M1544j2833L4610g6310E49890b15656P2108
$$ -691 -186722 -65678 47723 82205 2413 43957 31124 65734 -76310 549890 -215656 -143548
17629a43548j01158b9627j51230d96l9421F7438a00862E5177K67197k2082b22122
$$ -143548 -244706 -29627 -180857 -496 -39917 67438 -100862 55177 322374 300292 -222122
17617A16265Q6576a41227G540J22912e3760I5697J85466E842a9007l66216i1366
$$ 116265 202841 -141227 7540 130452 -53760 95697 281163 5842 -19007 -385223 -91366
17605A08278b97598B66550a8129D6105P1353i2761B48598J93521a01869j96350
$$ 108278 -297598 266550 -18129 46105 117458 -92761 248598 442119 -101869 -298219
17595b98219H283M0030L69837A15139m3626R5514p8881J22776I689J60980a71942
$$ -298219 8283 48313 418150 115139 71513 167027 88146 210922 9689 170669 -171942
17583B60025p7521f8086a3867k44298B463i0894B55479q8415q3359F685L8559
$$ 260025 182504 -68086 -13867 -258165 2463 -90894 255479 167064 83705 6685 45244
17572D5244J3509J4375c9935B03496b623I9655a51684b5319B6259j0821a5304
$$ 45244 58753 73128 -39935 203496 -2623 99655 -151684 -25319 26259 15438 -15304
17560B17690c16858d2855l77123A15567a32395a7462n40249I093J2089b66066
$$ 217690 -316858 -42855 -419978 115567 -132395 -17462 -557711 9093 21182 -266066
17549B49535H1148J45161G5361K62851A31748a25599D60605A3105K4850J48459
$$ 249535 81148 226309 75361 338212 131748 -125599 460605 13105 37955 186414
17539A86414K07769k3529j84969N0686J43737h2462B00938R5164a45671f9235
$$ 186414 394183 370654 185685 236371 380108 -82462 200938 296102 -145671 -69235
17528b54721A61237j3749i1049A91249a28310B01156d896A38219P3730J80793
$$ -254721 161237 147488 -91049 191249 -128310 201156 -4896 138219 211949 392742
17518C92742e4966j45415B77284A04521K4773b19492R8518C10441H7993P2495
$$ 392742 -54966 -200381 277284 104521 129294 -219492 -120974 310441 87993 160488
17508A60488J296K83615b5426l72976A6149O4774K1856i8821G5584R9385J85609
$$ 160488 161784 445399 -25426 -398402 16149 80923 102779 -98821 75584 174969 360578
17497C60578A34160O331J97684j23545n544C2737a53543A17122b41967m0467C6160
$$ 360578 134160 140491 338175 214630 209086 32737 -153543 117122 -241967 -282434 36160
17485B01350J13126q9684Q6711b10771P0488A02944J87363B3423d26641A49541
$$ 201350 314476 224792 311503 -210771 -140283 102944 290307 23423 -426641 149541
17474b4770A55977a17355B40998A06928b21889A70429o3957J1977K79029n8614
$$ -24770 155977 -117355 240998 106928 -221889 170429 106472 118449 397478 338864
17464C38864J22692G4768A1326g6993p2272m4496B22819j5722R9106R5504a07307
$$ 338864 461556 74768 11326 -76993 -149265 -193761 222819 207097 306203 401707 -107307
17452B89214b27381B24763l2750K37903j15249m4815a0281C61629K04331A76181
$$ 289214 -227381 224763 192013 429916 314667 269852 -10281 361629 565960 176181
17441A62093J26609b3466A49779N7141J05207J53793a83793B7222M34988j81105
$$ 162093 288702 -23466 149779 206920 312127 465920 -183793 27222 462210 281105
17431B81105j27740P677R4645f0951n1041A13220a34070B97434J33561A78383
$$ 281105 153365 161042 255687 -60951 -111992 113220 -134070 297434 430995 178383
17420A60987J61322H2009a04445A33127M4072n4035J74811p7137o8542C8132J86850
$$ 160987 322309 82009 -104445 133127 177199 123164 297975 220838 152296 38132 224982
17409B24982r8347C6743M1448C4070N9901c50179g7399A29673o1347J80390j4285
$$ 224982 126635 36743 78191 34070 93971 -350179 -77399 129673 68326 248716 234431
17398B34431j1840J98522f642B81423A25767K69559c08901E3304K31394a893B4152
$$ 234431 222591 421113 -6642 281423 125767 395326 -308901 53304 284698 -1893 24152
17386D18786j87357E7636L52802j14443J00046j67482m4207o3441P4052B2722
$$ 418786 231429 57636 410438 295995 396041 228559 184352 120911 194963 22722
17375C61344A76320D334L01203A42264J12256J46125n3169a74515H2707a1472
$$ 361344 176320 4334 305537 142264 254520 400645 347476 -174515 82707 -11472
17364I9687k7322K04612j33397J58732a32955M6965H2200l8112J60233J4580J62784
$$ 99687 72365 276977 143580 302312 -132955 -85990 82200 44088 204321 218901 381685
17353C81685M0183L6401E6092a6555A67853K73887j55689j38646R8347a23552
$$ 381685 421868 458269 56092 -16555 167853 441740 286051 147405 245752 -123552
17342c5266n1817L2825A37741r072k4539J56864O7671A13000b05758a2143A20103
$$ -35266 -87083 -54258 137741 128669 104130 260994 328665 113000 -205758 -12143 120103
17330A11332E2928R8830P7531a17102A00989J33715L88238A73316K03708a25434
$$ 111332 52928 151758 229289 -117102 100989 234704 622942 173316 377024 -125434
17319A65185J38601j30691q0984K7472j3496J53592b54662D23604A47950c10350
$$ 165185 303786 173095 92111 119583 106087 259679 -254662 423604 147950 -310350
17308A19224J13317q6450D0393M0981R6354c01014D2355J4896K08726E9347h5319
$$ 119224 232541 146091 40393 81374 177728 -301014 42355 57251 265977 59347 -85319
17296B63448b26188A42893L62907I8057B928O851L8875K47993j15403b5188j6489
$$ 263448 -226188 142893 505800 98057 2928 9779 48654 296647 181244 -25188 -41677
17285d1677m8237b6994G3514L5065b68520A28052J87314a9899E6109O3357i3036
$$ -41677 -89914 -26994 73514 108579 -268520 128052 315366 -19899 56109 119466 -93036
17273A95530L4364k1938L3625k9957p8009J62227o1182J64529L0548m1457I1204
$$ 195530 229894 207956 241581 211624 133615 295842 234660 399189 429737 388280 91204
17261g7709B78511a0267G3473L44352j38088q5572P7853E4616J45006J09326F4385
$$ -77709 278511 -10267 73473 417825 279737 194165 272018 54616 199622 308948 64385
17249B08150I8566J40524L96049B98794e7105B2973J57382H7292j1720K55310
$$ 208150 98566 239090 635139 298794 -57105 22973 180355 87292 75572 330882
17239C30882j49746q2093M8818Q3767J95901k09419J324J8139A04485b303D27102
$$ 330882 181136 99043 147861 231628 427529 218110 219434 237573 104485 -2303 427102
17227D5602K43253A17001J38124J26028J35045E1655J85591l6501R5686L5322
$$ 45602 288855 117001 255125 381153 516198 51655 237246 200745 296431 331753
17217C31753j65133a60051B77961j15729R9073Q502R8951c5223I8942J91849L10468
$$ 331753 166620 -160051 277961 162232 261305 269807 368758 -35223 98942 290791 601259
17206F01259B04842o6643e07A41159K113K86158O6315B25383e9707A38444o6831
$$ 601259 204842 138199 -507 141159 143272 429430 495745 225383 -59707 138444 71613
17195G1613N24031H2636E683J75923J87507j32635F3454H000a9663l6629C43943
$$ 71613 595644 82636 5683 181606 369113 236478 63454 8000 -19663 -56292 343943
17183B84184j06450R5661K05329B0461K08200H7643K45492A6997J79664J07311
$$ 284184 177734 273395 478724 20461 228661 87643 333135 16997 196661 303972
17173C03972J8439k6309J02252b58721C28693r8974G0576M58835B05132J67657
$$ 303972 322411 296102 398354 -258721 328693 229719 70576 529411 205132 372789
17163C72789K50931k6242B20070K26300j29481N3188P422O1966N1993F0930R6132
$$ 372789 623720 597478 220070 446370 316889 370077 377499 439465 491458 60930 157062
17152A57062N0466L22028g219C15896a3627D20707l3813J03516j88724L41005
$$ 157062 207528 529556 -7219 315896 -13627 420707 386894 490410 301686 642691
17142F42691B26457J3102o3764M2327a22390m640C63977m2865n5073J36772A46861
$$ 642691 226457 239559 175795 218122 -122390 -127030 363977 321112 266039 402811 146861
17130C39304K3626J79375A93953J23999N8207m234j05502A16644L48141r2330
$$ 339304 362930 542305 193953 317952 376159 371925 266423 116644 464785 372455
17120C72455A68830L51680j80148J114J84021B37325K02522D894K73832L8354
$$ 372455 168830 520510 340362 341476 525497 237325 439847 4894 278726 317080
17110C17080L9511K16484B06533J16039J25599O4318B50166g6527C80024n975
$$ 317080 356591 573075 206533 322572 448171 512489 250166 -76527 380024 374049
17100C74049J70087j264J1637k01894r0192j02818L90911j02904P8504M848j1963
$$ 374049 544136 542872 554509 352615 262423 159605 550516 447612 526116 530964 519001
17089E19001B49106K30929l8803j57979A19307K75696n2057k827K12078J60866
$$ 519001 249106 480035 441232 283253 119307 395003 342946 340119 552197 713063
17079G13063k39872J16351j70331j4785J44840j55171J59375k75521K32999B15747
$$ 713063 473191 589542 419211 404426 549266 394095 553470 277949 510948 215747
17068D63082M5360K45721j57731R7027o2669B56713P2569L35786N1723j04865
$$ 463082 508442 754163 596432 693459 630790 256713 329282 665068 716791 611926
17058F11926k16674J92782B60308M49291C14421L11477q9327j97961m7871p9750
$$ 611926 395252 588034 260308 709599 314421 625898 536571 338610 290739 210989
17048B10989L99178B21497K77351P5745j80245M4897K69041k85722n6051L80158
$$ 210989 610167 221497 498848 574593 394348 439245 708286 422564 366513 746671
17038G46671k53418p8432j22389L53440l6336j67639r6520M24267B78176K22714
$$ 746671 493253 414821 292432 645872 609536 441897 345377 769644 278176 500890
17028E00890k28328K92045l5727K86520C54196K40943J00971j6273k94354J06148
$$ 500890 272562 564607 528880 815400 354196 595139 696110 679837 385483 491631
17018D91631K29276k14205J18723L4379J70273m05072J93703J23655j54180J62973
$$ 491631 720907 506702 625425 659804 830077 425005 618708 742363 588183 751156
17008G51156P7187j29484r4819J45398L568M5579o160P6000l18477O19693j95847
$$ 751156 828343 698859 604040 749438 753006 798585 792425 868425 549948 1169641 973794
16997I73794r8163k08943L38864l25120J01455n529o979O4690r9344O5939Q3269
$$ 973794 875631 666688 1005552 680432 781887 776358 769379 834069 734725 800664 883933
16986H83933J83234j30832J20527j90318k6078J6712O101R9836j82499K33585
$$ 883933 1067167 936335 1056862 866544 840466 857178 863279 963115 780616 1014201
16976A014201j12965j47046J20233J32400j30685L6232j04708r1589K54119M1497
$$ 1014201 901236 754190 874423 1006823 876138 912370 807662 716073 970192 1011689
16966A011689j48225J86625q5337R3901j31042Q0937L20309k76119k42370M7836
$$ 1011689 863464 1050089 964752 1058653 927611 1008548 1328857 1052738 810368 858204
16956H58204M62729k11290j08551K47037j23646K63787k29872k11166L88504o6421
$$ 858204 1320933 1109643 1001092 1248129 1124483 1388270 1158398 947232 1335736 1269315
16946A269315l3071m69965L10090K34322L7387j82143O5965k05432J8684n2842
$$ 1269315 1236244 766279 1076369 1310691 1348078 1165935 1231900 1026468 1045152 992310
16936I92310m9408L29974K29320m60767J32125j42970M30539m32890N36336m68361
$$ 992310 942902 1272876 1502196 1041429 1173554 1030584 1461123 1028233 1564569 1096208
16926A096208K66832J49912m56515L19283J39465P7715L7657l44389K50807j70734
$$ 1096208 1363040 1512952 1056437 1375720 1515185 1592900 1630557 1286168 1536975 1366241
16916A366241N0019k7707R3684n3062K67816l5689m24620K17809l36240M11304
$$ 1366241 1416260 1388553 1482237 1429175 1696991 1661302 1236682 1454491 1118251 1529555
16906A529555m84386O83304j02711k39145L31386m3300L9892J82560j34187J41435
$$ 1529555 1045169 1728473 1625762 1386617 1718003 1674703 1714595 1897155 1762968 1904403
16896A904403j73031M3080L25497o7835m2954p2915r3083J40695l2273L1078J47343
$$ 1904403 1731372 1774452 2099949 2032114 1989160 1916245 1823162 1963857 1931584 1962662 2110005
16885B110005j11749N04110k35571l25054r179K58723j88130M96243k41460k6008
$$ 2110005 1998256 2502366 2266795 1941741 1932562 2191285 2003155 2499398 2257938 2231930
16875B231930J98340Q8874p3421j45597m7595L97000M6516n77339K16271L54233
$$ 2231930 2430270 2519144 2445723 2300126 2252531 2649531 2696047 2118708 2334979 2689212
16865B689212l56157K87091k8141L47469j78623P2082q3926M40289j24726L6587
$$ 2689212 2333055 2620146 2592005 2939474 2760851 2832933 2749007 3189296 3064570 3101157
16855C101157R0142J17067j20668K61636m68902K72473Q8163K92056j93477J84968
$$ 3101157 3191299 3308366 3187698 3449334 2980432 3252905 3341068 3633124 3439647 3624615
16845C624615K4874m02051P29783j89082j15662K34789K7565k01907L12293J15974
$$ 3624615 3649489 3247438 3977221 3788139 3672477 3907266 3934831 3732924 4045217 4161191
16835D161191K23934j57240J82054j26057K00135K62900N4980l18058K38489J23591
$$ 4161191 4385125 4227885 4409939 4283882 4484017 4746917 4801897 4483839 4722328 4845919
16825D845919K82719O1868j59357j76907L84282M69326J39692k25121J84421K08758
$$ 4845919 5128638 5190506 5031149 4854242 5238524 5707850 5847542 5622421 5806842 6015600
16815F015600j08858k03171K28040M27972J44512L48770k80667K06641J83637
$$ 6015600 5906742 5703571 5931611 6359583 6504095 6852865 6572198 6778839 6962476
16806F962476J06870K51799J05410O03102m29808M04344K31883j38476N26603
$$ 6962476 7069346 7321145 7426555 8029657 7599849 8004193 8236076 8097600 8624203
16797H624203Q8542J11212M68111K07137J70735L85846J46559P8289K13029P18243
$$ 8624203 8712745 8823957 9292068 9499205 9669940 10055786 10202345 10280634 10493663 11211906
16787A1211906J92610K44649K36619N70712j73687P91588j11110O46461L67171
$$ 11211906 11404516 11649165 11885784 12456496 12282809 13074397 12963287 13609748 13976919
16778A3976919M66925N21807M10955L79630N85737N50760M32026J012705K92294
$$ 13976919 14443844 14965651 15376606 15756236 16341973 16892733 17324759 18337464 18629758
16769A8629758O32156N96231N60030Q68731P98590J020205J202216L31384J199584
$$ 18629758 19261914 19858145 20418175 21286906 22085496 23105701 24307917 24639301 25838885
16760B5838885R72342R65037J182225J201174J503734J031650J721737J564415
$$ 25838885 26811227 27776264 28958489 30159663 31663397 32695047 34416784 35981199
16752C5981199J448261J682752K267633J785197K168481K364253K168586K585293
$$ 35981199 37429460 39112212 41379845 43165042 45333523 47697776 49866362 52451655
16744E2451655K915514L052456L385973L147709L607768L880438M177885M315287
$$ 52451655 55367169 58419625 61805598 64953307 68561075 72441513 76619398 80934685
16736H0934685M940811M815932N688812N478750N848892O385905O785756O822910
$$ 80934685 85875496 90691428 96380240 101858990 107707882 114093787 120879543 127702453
16728A27702453O952821P913823O820748P011290P395406O479124O427353N980817
$$ 127702453 134655274 142569097 149389845 156401135 163796541 170275665 176703018 182683835
16720A82683835N009284M042723K786970J458050O38333r02848k129937k813970
$$ 182683835 187693119 191735842 194522812 195980862 196619195 195716347 193586410 190772440
16712A90772440m481331n165309n993154o478357o784310p591670p043545p525858
$$ 190772440 186291109 181125800 175132646 168654289 161869979 154278309 147234764 139708906
16704A39708906p304808o984154o843510o869502o197326n836789n684166n463492
$$ 139708906 132404098 125419944 118576434 111706932 105509606 99672817 93988651 88525159
16696H8525159m927137m533095m565771l955687m090961l326626l512676l366546
$$ 88525159 83598022 79064927 74499156 70543469 66452508 63125882 59613206 56246660
16688E6246660k582029k664414k392128k483856k251431j824176k009423k173863
$$ 56246660 53664631 51000217 48608089 46124233 43872802 42048626 40039203 37865340
16680C7865340j472257j799483j578382j365992j316433j421168q51627j376847
$$ 37865340 36393083 34593600 33015218 31649226 30332793 28911625 28059998 26683151
16672B6683151q94199j050644r50821o44396r04566j089571r12842l44836p85639
$$ 26683151 25788952 24738308 23787487 23143091 22238525 21148954 20236112 19891276 19105637
16663A9105637r47788l33399l37174r41012l33906n93566o08414l03025n83548
$$ 19105637 18157849 17824450 17487276 16546264 16212358 15618792 15010378 14707353 14123805
16654A4123805p30493j65177l92809k66539l87216l74719l95614n43516L01411
$$ 14123805 13393312 13228135 12835326 12568787 12181571 11806852 11411238 10867722 11169133
16645A1169133p92358j23589n13597P6711k14061r4307j29008m51648m09853j76193
$$ 11169133 10376775 10253186 9739589 9816300 9602239 9507932 9378924 8927276 8517423 8341230
16635H341230l81325j19036Q6972n37676K99022l27314j21726j18871m87432L3575
$$ 8341230 7959905 7840869 7927841 7390165 7689187 7361873 7240147 7121276 6633844 6667419
16625F667419k99570o9241n2409L7859l44285j49120J1028j89298k93709J73472
$$ 6667419 6367849 6298608 6246199 6284058 5939773 5790653 5801681 5612383 5318674 5492146
16615E492146l93967M24905m4194m93017o6514j75263j13548l06293n7314J35810
$$ 5492146 5098179 5523084 5478890 4985873 4919359 4744096 4630548 4324255 4266941 4402751
16605D402751k24265r756J61712l78106J80513j95473K24565p69006L30632K98129
$$ 4402751 4178486 4168730 4330442 3952336 4132849 3937376 4161941 3392935 3723567 4021696
16595D021696m87878L35391n06104L00108m54054J79390R7197l53335n6630l4754
$$ 4021696 3533818 3869209 3363105 3663213 3209159 3388549 3485746 3132411 3075781 3041027
16585C041027R043j54811l6910J7599K90571l46996k10418K86747k01335K07734
$$ 3041027 3050070 2895259 2858349 2875948 3166519 2819523 2609105 2895852 2694517 2902251
16575B902251k54301K30564m16220M25940l37556n633o9836k32151j7861N1050
$$ 2902251 2647950 2878514 2462294 2888234 2550678 2545045 2475209 2243058 2225197 2276247
16565B276247L29484n11086K34213p937K4799j69516k79865P417j0748M48514
$$ 2276247 2605731 2094645 2328858 2320921 2345720 2176204 1896339 1903756 1893008 2341522
16555B341522m21493K62980k13880j75167L24362j95832r8882K26521M8551k4956
$$ 2341522 1920029 2183009 1969129 1793962 2118324 1922492 1823610 2050131 2098682 2073726
16545B073726j0708n2703k28080j70937L54323l20259O8209k505l23264J94755
$$ 2073726 2063018 2010315 1782235 1611298 1965621 1645362 1713571 1711066 1387802 1582557
16535A582557j8424k2398k12671J30899N1450L57822n10060q4629K33656J78786
$$ 1582557 1564133 1541735 1329064 1459963 1511413 1869235 1359175 1274546 1508202 1686988
16525A686988j66774k10955K19436m34566L40978j82117L82230l58919q0088j00870
$$ 1686988 1520214 1309259 1528695 1094129 1435107 1252990 1635220 1276301 1196213 1095343
16515A095343K4986J12097o5911Q8979m6544L8615j28149M28394m22862p3637
$$ 1095343 1120329 1232426 1166515 1255494 1208950 1247565 1119416 1547810 1124948 1051311
16505A051311L9418N8408j6525l92110N81489q4484l12787J54730L7799j23227
$$ 1051311 1090729 1149137 1132612 740502 1321991 1237507 924720 1079450 1117249 994022
16495I94022j64056L6717L02264o6089k97233J53588J79891j49661l46503K67842
$$ 994022 829966 866683 1168947 1102858 805625 959213 1139104 989443 642940 910782
16485I10782J76187j84545k8975R7670K6190J25960j93007L10257r8600E26276
$$ 910782 1086969 902424 873449 971119 997309 1123269 930262 1240519 1141919 526276
16474H29725J89532j59558J87289j33227L9575M4796l39984K02419N3021j12483
$$ 829725 1019257 859699 1046988 913761 953336 998132 658148 860567 913588 801105
16464H01105m3838l11955M46068J30572k80651M31400n35281K69100j53672j91390
$$ 801105 757267 445312 891380 1021952 741301 1172701 637420 906520 752848 561458
16454E61458J70795m7802l4513K88206m31134K73871p2102J36692j25132k02602
$$ 561458 732253 684451 649938 938144 507010 780881 708779 845471 720339 517737
16444E17737L53439l59194P487L8308j7346J77767j25216k91179N09736j86714
$$ 517737 871176 511982 519469 557777 540431 718198 592982 301803 811539 624825
16434F24825k28549J7240K64482j91182k1771P5616j4012K80025j9545j35389
$$ 624825 396276 413516 677998 486816 465045 540661 526649 806674 787129 651740
16424F51740j24132L3923n6494L6685J66344j49372j83569M7327j3415J35599
$$ 651740 527608 561531 505037 541722 708066 558694 375125 422452 409037 544636
16414E44636k29673L06137q955K36479k30486r8291B5362N14365j56077J91018
$$ 544636 314963 621100 612145 848624 618138 519847 25362 539727 383650 574668
16404E74668k36764R6549L34299B86855J12350M1213j62988k347K36455k19120
$$ 574668 337904 434453 768752 286855 399205 440418 277430 275083 511538 292418
16394B92418L99084B12216K76417k414k08133M04438q8807p2662P100M8217q4680
$$ 292418 691502 212216 488633 486219 278086 682524 593717 521055 528155 576372 491692
16383D91692m6476R9041P0153k34340K27822k00705M07769l11756R4396k50398
$$ 491692 445216 544257 614410 380070 607892 407187 814956 503200 597596 347198
16373C47198J0963L37552A10045O15767l28619J12359K59300j35814B93510O7388
$$ 347198 358161 695713 110045 725812 397193 509552 768852 633038 293510 360898
16363C60898A21268K9237K10652j18623L68010B59888J96728k25201M21077R5753
$$ 360898 121268 150505 361157 242534 610544 259888 456616 231415 652492 748245
16353G48245B42804J49018J97700j00506N8070B01487m5570M13413k01065N1501
$$ 748245 242804 391822 589522 489016 547086 201487 155917 569330 368265 419766
16343D19766o7273j30843o2930O4465q3378K46701K71878l0646A49295J27534
$$ 419766 352493 221650 158720 223185 139807 386508 658386 627740 149295 276829
16333B76829A31562k0641N3668J65034I2942J73512A08819L63667N6819k12082
$$ 276829 131562 110921 164589 329623 92942 266454 108819 472486 529305 317223
16323C17223O2835J32967A02211M6965M82824B58598J01620J16057g9620F58172
$$ 317223 380058 513025 102211 149176 632000 258598 360218 476275 -79620 658172
16312A57866a60918C18774a85311C66459A59441K76132k11227A09256E4488g6075
$$ 157866 -160918 318774 -185311 366459 159441 435573 224346 109256 54488 -76075
16301E46292r6783A57176L41157A07658N6227K91721i0213D45360H3685L99958
$$ 546292 449509 157176 498333 107658 163885 455606 -90213 445360 83685 483643
16291D83643p0426A91834J01507K15476k5134B34649A6051h0956b7774q2761C0969
$$ 483643 413217 191834 293341 508817 483683 234649 16051 -80956 -27774 -110535 30969
16279g5595C5318M2898K03153b4069C4403L47639n3752A14663J08898h514B64832
$$ -75595 35318 78216 281369 -24069 34403 382042 328290 114663 223561 -8514 264832
16267a60094B46767j20519L23534j98193R1822n0878O5739j04764M6903n4696
$$ -160094 246767 126248 449782 251589 343411 292533 358272 253508 300411 245715
16257B45715p6083i0987A20711M77485H9726a32372D31267a28791A61463j4911
$$ 245715 169632 -90987 120711 598196 89726 -132372 431267 -128791 161463 146552
16247A46552N625k1068K62710f4380k39356E7488b86653B14609L6568b62030E4711
$$ 146552 152177 131109 393819 -64380 -303736 57488 -286653 214609 251177 -262030 54711
16235B8206b217A70630j0793b12460b8205A67608b08730B12825k7341J76662P0914
$$ 28206 -2217 170630 159837 -212460 -28205 167608 -208730 212825 185484 362146 433060
16224D33060j00278A39098J52210I2282J32188n9343p3103K36650n2219J18574
$$ 433060 332782 139098 291308 92282 224470 165127 92024 328674 276455 395029
16214C95029A6814K03497n9411p9987C693J52952b4125D21632G5508i0417D4967
$$ 395029 16814 220311 160900 80913 3693 156645 -24125 421632 75508 -90417 44967
16202a04283d816G6369K31576L2973j48351J3602J35700i8186G3732b222A28860
$$ -104283 -4816 76369 307945 340918 192567 206169 341869 -98186 73732 -2222 128860
16190G2466f934C6905c25603a26593k05605F0231k3558M2888P8056G1677a16032
$$ 72466 -6934 36905 -325603 -126593 -332198 60231 36673 79561 157617 71677 -116032
16178B38440M7445c7516B38978J15941g8137A189K53620A17122J83391c3672C5270
$$ 238440 285885 -37516 238978 354919 -78137 1189 254809 117122 300513 -33672 35270
16166I0348C1033e618j31976B80559a88640A52193f1743l289B69048i8778m3698
$$ 90348 31033 -5618 -137594 280559 -188640 152193 -61743 -65032 269048 -98778 -142476
16155a42476E3716K47209G8726M4187j4048f8945r6153A29127c3583k7014C16284
$$ -142476 53716 300925 78726 122913 108865 -68945 -165098 129127 -33583 -60597 316284
16143G6302J71915D8130d2484A25491K03934j09438H6204h6789B65878c7077k52037
$$ 76302 248217 48130 -42484 125491 329425 219987 86204 -86789 265878 -37077 -289114
16132b89114J33930r0935B04594J18695b10862C34a21913I7556B027J85787b6459
$$ -289114 -155184 -246119 204594 323289 -210862 334 -121913 97556 2027 187814 -26459
16120f1695A47357O0721l3016e3788R410A09757Q5186P9100j17667b55124A10521
$$ -61695 147357 208078 175062 -53788 -44378 109757 194943 274043 156376 -255124 110521
16108E5163O4914K42779A62921j307d8681G3662J56252l3000D7249A9865a42974
$$ 55163 120077 362856 162921 161614 -48681 73662 229914 196914 47249 19865 -142974
16096E6970e6300r8555b154B54809a58168B375b33052A08679a80448B1179i3632
$$ 56970 -56300 -154855 -2154 254809 -158168 2375 -233052 108679 -180448 21179 -93632
16084d0959b987A57791c06781d4228k95636B57373I2428g4984B39950A16945a02133
$$ -40959 -2987 157791 -306781 -44228 -339864 257373 92428 -74984 239950 116945 -102133
16072B19612b24415A36287o7364a07572F928P5493l4412P362c0552q4946M2817
$$ 219612 -224415 136287 68923 -107572 6928 82421 48009 55371 -30552 -115498 -72681
16061g2681j08628E4876O8010c5489B43604A06390g3848A24006K04694m0657j10073
$$ -72681 -181309 54876 122886 -35489 243604 106390 -73848 124006 328700 288043 177970
16050A77970E6335J91648M2002h2460A2546a33197B35256H329a00539L3173j63439
$$ 177970 56335 247983 289985 -82460 12546 -133197 235256 8329 -100539 -67366 -230805
16039b30805C51620c4520j31181k2277G8395i0820A72114N3841k5084a00099B03730
$$ -230805 351620 -34520 -165701 -187978 78395 -90820 172114 225955 200871 -100099 203730
16027d42881D02544a26556r5255n9360J09071M4447i576j91520r7812R4852B6026
$$ -442881 402544 -126556 -221811 -281171 -172100 -127653 -9576 -201096 -298908 -204056 26026
16015D18743a5801F5435k5929K67750A05449a45096q0590B42276a52350j42784
$$ 418743 -15801 65435 39506 307256 105449 -145096 -225686 242276 -152350 -295134
16005b95134e7622B30522b43134C5254a89861B69067a38585K8314H6454N12992
$$ -295134 -57622 230522 -243134 35254 -189861 269067 -138585 -110271 86454 599446
15995E99446b89823G6238b53574F9016a42860H1150B255a31322j81340a08101
$$ 599446 -289823 76238 -253574 69016 -142860 81150 2255 -131322 -312662 -108101
15984A8172h8591B55702a59952B85908m8977H9971J42385a78595H4904M2763a93011
$$ 18172 -88591 255702 -159952 285908 236931 89971 232356 -178595 84904 127667 -193011
15972b19778D0160J54038k2086B9120J78994L9249b51657f5245C83228a69120
$$ -219778 40160 194198 172112 29120 208114 247363 -251657 -65245 383228 -169120
15961b229G0088I362J8621M13505a84561A08618a31044A84948A6414h2507l8912
$$ -2229 70088 9362 27983 441488 -184561 108618 -131044 184948 16414 -82507 -121419
15950a21419c3688A60317d5448N022j03044R018M9707j39102J2556H1074a60057
$$ -121419 -33688 160317 -45448 -40426 -143470 -134452 -84745 -223847 -211291 81074 -160057
15938c39317e4895l15711D79585E8055b84173a00134j60084p0993L8376a36939
$$ -339317 -54895 -370606 479585 58055 -284173 -100134 -260218 -331211 -292835 -136939
15927B4170d9825j03226L4385C44708B820J26098L7561h077B03198a05297K4054
$$ 24170 -49825 -153051 -118666 344708 2820 128918 166479 -8077 203198 -105297 -81243
15916h1243F4647J98702c7580A69156g0950I1052i3594d5503A13313c51432a56660
$$ -81243 64647 263349 -37580 169156 -70950 91052 -93594 -45503 113313 -351432 -156660
15904F3172C0250J90003A9698c6802I9663b68470D86122a19024k93127B8759e9321
$$ 63172 30250 220253 19698 -36802 99663 -268470 486122 -119024 -412151 28759 -59321
15892B71398A31678l0457b38572A40588e5907I9282a29380B52019i5319A81218
$$ 271398 131678 101221 -238572 140588 -55907 99282 -129380 252019 -95319 181218
15881g6586k09316K428J18306Q2134B16470b97450J15841c031B3445K24696d8399
$$ -76586 -285902 -283474 -165168 -83034 216470 -297450 -181609 -3031 23445 248141 -48399
15869b49728A08536C9931b01670A26507a27547l8711J1532D7592a44992g678k22971
$$ -249728 108536 39931 -201670 126507 -127547 -166258 -154726 47592 -144992 -7678 -230649
15858b30649g4725b9600q1523l15145D09835j76234A01705a18980k65391J44210
$$ -230649 -74725 -29600 -111123 -426268 409835 233601 101705 -118980 -384371 -240161
15848b40161C76807A69335q2211e7683A09128a76543f4764D4831c34141J49008
$$ -240161 376807 169335 87124 -57683 109128 -176543 -64764 44831 -334141 -185133
15838a85133D71569a88501E0873i8439A60220K4296j9101k5065h4579G0578a97012
$$ -185133 471569 -188501 50873 -98439 160220 184516 165415 140350 -84579 70578 -197012
15826b83811A37757h7325K81J2699o3418N7539n5253A42808d91896c3408B09780
$$ -283811 137757 -87325 -87044 -74345 -137763 -80224 -135477 142808 -491896 -33408 209780
15814E7641A9735b5452k35943J04853r3185c3130o9509j53804a19296j07260n6628
$$ 57641 19735 -25452 -261395 -156542 -249727 -33130 -102639 -256443 -119296 -226556 -283184
15803b83184p048i6993E3294e27157K04665a01969f895j78776B17176K2084d7590
$$ -283184 -290232 -96993 53294 -527157 -322492 -101969 -6895 -185671 217176 239260 -47590
15791a49212O9419c0300A00918L5897a21648j51385h4235j00425A09019a4716
$$ -149212 -79793 -30300 100918 136815 -121648 -273033 -84235 -184660 109019 -14716
15780C1985J5815P2946d7869F8676a12662e4050l25376A19838m1582J0831h5385
$$ 31985 47800 120746 -47869 68676 -112662 -54050 -379426 119838 78256 89087 -85385
15768b81526P8738p9112A26414b07934e3125A40115M8990C9209b58686a24861
$$ -281526 -202788 -281900 126414 -207934 -53125 140115 189105 39209 -258686 -124861
15757b13767f2751B31463f4975j75557R5765B26899r7087a20594G7467a85492
$$ -213767 -62751 231463 -64975 -240532 -144767 226899 129812 -120594 77467 -185492
15746B8880c07330A36865c14405a6297F8228c44690c6728L785A56802a45694H8981
$$ 28880 -307330 136865 -314405 -16297 68228 -344690 -36728 -32943 156802 -145694 88981
15734C83632a52495A15168c93597D1037c89345a64705N4742H8684J4726K72555
$$ 383632 -152495 115168 -393597 41037 -389345 -164705 -109963 88684 103410 375965
15724C75965n4205e8065E6287A5425a16390A68075b04590B30643b52925J3164
$$ 375965 321760 -58065 56287 15425 -116390 168075 -204590 230643 -252925 -239761
15714b39761A34332b58659C03027a1143B0917K651R472b98982A18617a53749G2494
$$ -239761 134332 -258659 303027 -11143 20917 23568 33040 -298982 118617 -153749 72494
15702E8675a04948k6101I1461a78733G1141b35504R4119F1107a6264G0433e8866
$$ 58675 -104948 -131049 91461 -178733 71141 -235504 -141385 61107 -16264 70433 -58866
15690b20441a9145Q873B84406A32088c04641E987J46149L8004d45572c4491A46694
$$ -220441 -19145 -10272 284406 132088 -304641 5987 152136 190140 -445572 -34491 146694
15678i7619A9528J00216d32026f6840K0262j42499M4664D0170K43393h1594l9982
$$ -97619 19528 119744 -432026 -66840 -46578 -189077 -144413 40170 283563 -81594 -121576
15667a21576I9723a57516E7010N608a3765l31744c417A58738a37555a4633k32223
$$ -121576 99723 -157516 57010 62618 -13765 -345509 -3417 158738 -137555 -14633 -246856
15656b46856E4225a3638C90906d56744A40704c5160B05232E3043a57922B14468
$$ -246856 54225 -13638 390906 -456744 140704 -35160 205232 53043 -157922 214468
15645B31466b7944q3567j88178K4886B9493J17427d4545J1938l72924A05934G351
$$ 231466 -27944 -111511 -299689 -274803 29493 146920 -44545 -32607 -405531 105934 7351
15633A83715H0522a47722A28158L3788f4180j1722j37689I107a31282B54715H7073
$$ 183715 80522 -147722 128158 161946 -64180 -75902 -213591 9107 -131282 254715 87073
15621a1543l9311B79050i5203M0214k78636e5226A12574a62574q2250I9030K52429
$$ -11543 -50854 279050 -95203 -54989 -333625 -55226 112574 -162574 -244824 99030 351459
15610C51459b13384b426F9874a51047C8504b22012E448J7551J07534k7869f6664
$$ 351459 -213384 -2426 69874 -151047 38504 -222012 5448 22999 130533 102664 -66664
15598a25057n8899g3989b2701k30512R6768c8476n4106I9901M1640B657b15847
$$ -125057 -183956 -73989 -22701 -253213 -156445 -38476 -92582 99901 141541 2657 -215847
15586b73967i4748c1099C7995f9717C63830H2259j8789a22756A67203o6540d14882
$$ -273967 -94748 -31099 37995 -69717 363830 82259 63470 -122756 167203 100663 -414882
15574c23932J56769O0625C22643d4192B33503c42641B8802g5920A80391E4865
$$ -323932 -167163 -106538 322643 -44192 233503 -342641 28802 -75920 180391 54865
15563B80659A24388d15154C07731A00308K15396A7389K74573g7471C163K11670
$$ 280659 124388 -415154 307731 100308 315704 17389 291962 -77471 3163 214833
15553B14833i1806o2616A71942o7806d54891b16630F3653g2080A23025a63351
$$ 214833 -91806 -154422 171942 104136 -454891 -216630 63653 -72080 123025 -163351
15542B19122B4262a86461d0296C22156D8276K21403a15081C55919e7631j13067
$$ 219122 24262 -186461 -40296 322156 48276 269679 -115081 355919 -57631 -170698
15532a70698L8417G7616h6693A22354a24793j14859j06670i9075A96973g5924
$$ -170698 -132281 77616 -86693 122354 -124793 -239652 -346322 -99075 196973 -75924
15521d03711A19256d9242D8678b45880A81746q4490M0187D4466c76939a48513
$$ -403711 119256 -49242 48678 -245880 181746 97256 137443 44466 -376939 -148513
15510E1555c24373d1978A02888c61591A1070J38877A1431a24180J8562A89201
$$ 51555 -324373 -41978 102888 -361591 11070 149947 11431 -124180 -105618 189201
15499C13184j02490C2590i5210j13297F0019f0823k864c375A00158c23648A0395
$$ 313184 210694 32590 -95210 -208507 60019 -60823 -63687 -3375 100158 -323648 10395
15487h9148c8152A64653p399F37K04036F2510b554j72133a1075A84788D5447j8006
$$ -89148 -38152 164653 157254 637 204673 62510 -2554 -174687 -11075 184788 45447 27441
15475B7441c000k46826J16911L4053m3137c2728A6750K30575g6716K4079k00367
$$ 27441 -3000 -249826 -132915 -98862 -141999 -32728 16750 247325 -76716 -52637 -253004
15464b53004c7644B9502c19587E7940O0695B6932a7609C81599A64007d2014o9899
$$ -253004 -37644 29502 -319587 57940 118635 26932 -17609 381599 164007 -42014 -111913
15453a11913B17954J25920a10079G5142i6234q3659B27347a1857C90037A53582
$$ -111913 217954 343874 -110079 75142 -96234 -179893 227347 -11857 390037 153582
15442C07911b92257a4221k94167h4089D8784Q3580C9416L0047O0126B2608K3433
$$ 307911 -292257 -14221 -308388 -84089 48784 132364 39416 69463 129589 22608 46041
15431D6041Q476c7629D60162C1334a5747D0480a43267q7692b1736B73225A5342
$$ 46041 54517 -37629 460162 31334 -15747 40480 -143267 -230959 -21736 273225 15342
15419a24966N7140c0453f294n9623B15140Q6468I9205k1445b21696f203r4315
$$ -124966 -67826 -30453 -6294 -65917 215140 301608 99205 77760 -221696 -6203 -100518
15408a00518K7605A6242J28012O6904q7212N4797a0729l8905A26341b05720h9782
$$ -100518 -72913 16242 144254 211158 123946 178743 -10729 -49634 126341 -205720 -89782
15396C0578J57158K7906P3898A31659b7653j32595k35993J36088m4924b0517j72046
$$ 30578 187736 215642 289540 131659 -27653 -160248 -396241 -260153 -305077 -20517 -192563
15385a92563A92748F2503a76321b717l28407A46343F0016c8917k3907m4889f227
$$ -192563 192748 62503 -176321 -2717 -331124 146343 60016 -38917 -62824 -107713 -6227
15373B69215a66160j18877b5843k09944b0412p0370j67556d1971l36409A56054
$$ 269215 -166160 -285037 -25843 -235787 -20412 -90782 -258338 -41971 -378380 156054
15362F2881J8819P413e3540A88712A9921d7830A3900c95300f5628c178F2663J47153
$$ 62881 81700 89113 -53540 188712 19921 -47830 13900 -395300 -65628 -3178 62663 209816
15350B09816p9151b87160a8145A39459K19056i4878D6741a16708B3286J06874
$$ 209816 130665 -287160 -18145 139459 358515 -94878 46741 -116708 23286 130160
15340A30160A4831f8832r4802j4915I4799b61771J14938A27095L4050J36104e0128
$$ 130160 14831 -68832 -163634 -178549 94799 -261771 -146833 127095 161145 297249 -50128
15328A47683b8963l19480p5754A55999j7710J51932d1130B06999q7484J97977
$$ 147683 -28963 -348443 -424197 155999 138289 290221 -41130 206999 119515 317492
15318C17492A13329a46654A6564a97196B31991G6245g101j76242m446L5723m6242
$$ 317492 113329 -146654 16564 -197196 231991 76245 -7101 -183343 -187789 -152066 -198308
15307a98308q3551B5568M77178B39016b57755E0186a5144D4755a89439O8508D25692
$$ -198308 -281859 25568 502746 239016 -257755 50186 -15144 44755 -189439 -120931 425692
15295A65809b00080I17J15432m2804J75463n1661J05427l8202f2094I5142f8759
$$ 165809 -200080 917 116349 73545 249008 197347 302774 264572 -62094 95142 -68759
15283H0255J11234Q1307q7600l7486d79127E7055b7458k2666C7571M6592h87m3601
$$ 80255 191489 272796 185196 147710 -479127 57055 -27458 -50124 37571 84163 -887 -44488
15271d4488C7560Q2137a75848B04448E0954J00779L8480d9637d495k02353d1596
$$ -44488 37560 119697 -175848 204448 50954 151733 190213 -49637 -4495 -206848 -41596
15259a00022b4899B8375D308J00473l6947Q6519J55556r3304L7540J28671b9629
$$ -100022 -24899 28375 4308 104781 67834 154353 309909 216605 254145 382816 -29629
15247A08722N10842J400679L52133n18831N44984o93689E23498A73838a67021
$$ 108722 619564 2020243 2372376 1853545 2398529 1704840 523498 173838 -167021
15237B25116b648l10476a14482A61671E3497P7775J85812J38932G2918K28426
$$ 225116 -2648 -313124 -114482 161671 53497 131272 317084 456016 72918 301344
15227C01344a04949j6781C61141a74635B84275H9775a64008A08215h7888B74260
$$ 301344 -104949 -121730 361141 -174635 284275 89775 -164008 108215 -87888 274260
15216h2280A98978K0829A6350b37553j5838i4698B01180a42847b5063A59535b2823
$$ -82280 198978 219807 16350 -237553 -253391 -94698 201180 -142847 -25063 159535 -22823
15204A46231b19708k73029B8954M03671C9299K25450n5984H1073J51755b146k58752
$$ 146231 -219708 -492737 28954 432625 39299 264749 208765 81073 232828 -2146 -260898
15193b60898Q9945E3217J9542b5744B6248O2393b78892B18751D099J89417b8963
$$ -260898 -170953 53217 72759 -25744 26248 88641 -278892 218751 4099 193516 -28963
15181a18152b0618F3134c6898M894k4976E6858A9703L43591A5767J62384e4649
$$ -118152 -20618 63134 -36898 -32004 -56980 56858 19703 363294 15767 178151 -54649
15169C11530J08156B4614a48511B68964e934D3554Q6620a79027I2065a34260b8317
$$ 311530 419686 24614 -148511 268964 -5934 43554 130174 -179027 92065 -134260 -28317
15157B92438b02207R2912A94372C2841K20624j14056l1179n2571d775A26283J29459
$$ 292438 -202207 -109295 194372 32841 253465 139409 108230 55659 -4775 126283 255742
15146B55742j13732F4230J68724k0383r0266a97767C68726A14996M2298L6542
$$ 255742 142010 64230 232954 212571 122305 -197767 368726 114996 157294 193836
15136A93836P3634a69660B15238J03927j17114C2684J32148a61946m2676L8336
$$ 193836 267470 -169660 215238 319165 202051 32684 164832 -161946 -204622 -166286
15126a66286A64008D3235a5954B91571R3013M0696j20572O1811A7295L22406n2049
$$ -166286 164008 43235 -15954 291571 384584 425280 304708 366519 17295 339701 287652
15115B87652L1135a11215a4611B43612j355a01779k0821B33878A03806c18306
$$ 287652 318787 -111215 -14611 243612 242257 -101779 -122600 233878 103806 -318306
15104E4049Q0965b2863p9593C27115p2018C4440M4911J471j4177O725K27034a30648
$$ 54049 135014 -22863 -102456 327115 255097 34440 79351 80822 66645 73370 300404 -130648
15091a00050B75733m9901j08903f2200A72371M175F3157K17797A32692Q7424N0876
$$ -100050 275733 225832 116929 -62200 172371 176546 63157 280954 132692 220116 270992
15080B70992A07127O6809j0848n5471e5989B41242H6670J64513p1711L27137A15152
$$ 270992 107127 173936 163088 107617 -55989 241242 86670 251183 179472 506609 115152
15068A28838K38217N4547J08247e917C75631l6398k566A64931a44179O6087A79548
$$ 128838 367055 421602 529849 -5917 375631 339233 336667 164931 -144179 -78092 179548
15056a8211B17956q1905J944L4596i1462E63413c22213B41711D4046a90926B01059
$$ -18211 217956 136051 137995 172591 -91462 563413 -322213 241711 44046 -190926 201059
15044C33516j00030K94840A56586J55438j7964j2428k3841j17200M0648o9455
$$ 333516 233486 528326 156586 312024 294060 281632 257791 140591 181239 111784
15034A11784L36539o9132J90717A53286J99222j55758I1616L4039o816L60857
$$ 111784 448323 379191 569908 153286 352508 196750 91616 125655 118839 479696
15024D79696k18228L1924r4809p810A1980K70539n0873g4759I1135L3735n9244
$$ 479696 261468 293392 198583 190773 11980 282519 231646 -74759 91135 124870 65626
15013F5626D09c9344D17870H3455J25693J83775E3633K0298a59421B98242R6411
$$ 65626 409 -39344 417870 83455 209148 392923 53633 73931 -159421 298242 394653
15002C94653a28752A64115Q7418o2134E1507J65372K6661D7760J47493j2648J51468
$$ 394653 -128752 164115 251533 189399 51507 216879 243540 47760 195253 182605 334073
14991C34073q0362j2683l6837K89894m1201j29468B6582K60714K84220M749k72174
$$ 334073 253711 241028 204191 494085 452884 323416 26582 287296 571516 576265 304091
14980C04091K1102A39241R630K5759g279B03672a62181K7836e2649B88968m2015
$$ 304091 325193 139241 148871 174630 -7279 203672 -162181 -134345 -52649 288968 246953
14969B46953N7340j14871P9059j5355A22593l5149L06134Q4949A47873m1700O9529
$$ 246953 304293 189422 268481 253126 122593 87444 393578 478527 147873 106173 175702
14958A75702L67165r9689q5220D9758J68112n5067K72561N9947H232L47734h7580
$$ 175702 542867 443178 357958 49758 217870 162803 435364 495311 8232 355966 -87580
14946d6132A70527J47992i4451B07593E6754L07742N5226n7809A32314K48732
$$ -46132 170527 318519 -94451 207593 56754 364496 419722 361913 132314 381046
14936C81046b178m2127A79137p4051J44399L1519l4182l3671p4416c4369E77022
$$ 381046 -2178 -44305 179137 105086 249485 281004 246822 213151 138735 -34369 577022
14924A83282N0377m8160H6713l3517a74090D1345J78036J16241M82870C51925
$$ 183282 233659 185499 86713 53196 -174090 41345 219381 335622 818492 351925
14913C69319j79546M69890A39677f1237B48544R4880j52662j6522J73918K28990
$$ 369319 189773 659663 139677 -61237 248544 343424 190762 174240 348158 577148
14903E77148B51960a1545A49554j9768L57279B36692K52740j62791J68094A68950
$$ 577148 251960 -11545 149554 129786 487065 236692 489432 326641 494735 168950
14892C26544R2646j05411J91371B06650K79596j46686E1906M22667A71694J11465
$$ 326544 419190 313779 505150 206650 486246 339560 51906 474573 171694 283159
14882B83159j30211J61392P0001A13343L6596K30234K15194k0619A49770K01585
$$ 283159 152948 314340 384341 113343 149939 380173 595367 574748 149770 351355
14872C51355B2950J36240L91973B62271K03168l6392I3584L95161B39118L42200
$$ 351355 22950 159190 551163 262271 465439 429047 93584 488745 239118 581318
14862E81318k49922j8169L1299J10736K19264C04665K42848k73050Q9097J07922
$$ 581318 331396 313227 344526 455262 674526 304665 547513 274463 363560 471482
14852D71482j53880q6341L78611J6281j01445p2546B06750L17370m1190K1434
$$ 471482 317602 231261 609872 626153 524708 452162 206750 524120 482930 504364
14842E04364o180A01506J92543J58008L01257q3748J9791j48719q3809A08096
$$ 504364 498184 101506 294049 452057 753314 669566 689357 540638 456829 108096
14831C00085r1373L35321J35300L2476J08824A49603J32648R0990M6804L00205
$$ 300085 208712 544033 679333 711809 820633 149603 282251 373241 420045 720250
14821G20250k50104P7729l4302J49716k75153J56142J36807B2615M01693p6995
$$ 720250 470146 547875 513573 663289 388136 544278 681085 22615 424308 347313
14811C47313J36527l9761J35825L26995l93787J19440H7675N82453j00733j30389
$$ 347313 483840 444079 579904 906899 513112 632552 87675 670128 569395 439006
14801D39006M98159D03082K5555p6019o3537M70997j37788l9329j03687K35961
$$ 439006 937165 403082 428637 352618 289081 760078 622290 582961 479274 715235
14791G15235l17138J25389J87748r292k06657J50090o8848j40350j45531M56821
$$ 715235 398097 523486 711234 701942 495285 645375 576527 436177 290646 747467
14781G47467J44325k89573Q6849j35245k869k17761N84808q1302k40424O549J05175
$$ 747467 891792 602219 689068 553823 550954 333193 918001 836699 596275 602824 707999
14770G07999q1958R6620k08159J32922J05544k18139Q7266j02674J88272J68905
$$ 707999 626041 722661 514502 647424 752968 534829 622095 519421 707693 876598
14760H76598k87012K95634B87094R5317L49225k6219K93448l63117q8926M55674
$$ 876598 589586 885220 287094 382411 731636 705417 998865 635748 546822 1002496
14750A002496D86575N08096q1531j70677J2772k66514M3198N74185k83549J08262
$$ 1002496 486575 994671 913140 742463 755235 488721 531919 1106104 822555 930817
14740I30817n0643l21315L47585k23672k78754L21646j34998L19314l36434j82900
$$ 930817 880174 558859 906444 682772 404018 725664 590666 909980 573546 390646
14730C90646K05488M36598D70167K82034m0397m2947O03122C41310K96966L69026
$$ 390646 596134 1032732 470167 752201 711804 668857 1271979 341310 638276 1007302
14720A007302k15842K30606L172J09806l28985o2340J56221j21948q0353q8340
$$ 1007302 791460 1022066 1025238 1135044 806059 743719 899940 777992 697639 609299
14710F09299K53968j11097J32235p9232K74343j71224J40396k45041K39617j79826
$$ 609299 863267 752170 884405 805173 1079516 908292 1048688 803647 1043264 863438
14700H63438P4908j08527J98281j74228j2492k95122J8472M86534k57457K52245
$$ 863438 938346 829819 1028100 853872 841380 546258 564730 1051264 793807 1046052
14690A046052j47978J09825j57297K18194j98174M35272n01244L97739n45994
$$ 1046052 898074 1007899 850602 1068796 870622 1305894 804650 1202389 656395
14681F56395N19503k15075Q1063k24218J50588K61672j57694k34140P1215L72279
$$ 656395 1175898 960823 1041886 817668 968256 1229928 1072234 838094 909309 1281588
14671A281588l12495L14901l89022L62678m25944j42823M86027k82954O4484K55838
$$ 1281588 969093 1283994 894972 1257650 831706 688883 1174910 891956 956440 1212278
14661A212278J38481m42323R4562l2496J57707K65326l10156J22497L04782n23231
$$ 1212278 1350759 908436 1002998 970502 1128209 1393535 1083379 1205876 1510658 987427
14651I87427L06831n65296L70488K10576J80675n17066M07189o7778k63113K82566
$$ 987427 1294258 728962 1099450 1310026 1490701 973635 1380824 1313046 1049933 1332499
14641A332499r5630J84545K4620r3657L00261k23286n4146j22973M20863m23510
$$ 1332499 1236869 1421414 1446034 1352377 1652638 1429352 1375206 1252233 1673096 1249586
14631A249586K41894l3280r2962M86660l74008J31807J08386j81482M9268K64292
$$ 1249586 1491480 1458200 1365238 1851898 1477890 1609697 1718083 1536601 1585869 1850161
14621A850161j19078m42103J08104m6003J96604r0064o30n6554j55246K76641
$$ 1850161 1731083 1288980 1397084 1351081 1547685 1457621 1456991 1400437 1245191 1521832
14611A521832L69825j76011k16768j27277L23687K4592o1148l50654N02920l56624
$$ 1521832 1891657 1715646 1498878 1371601 1695288 1719880 1658732 1308078 1810998 1454374
14601A454374K8537J93322L1273J30987k80671J52157l32556J96745J62342j68692
$$ 1454374 1482911 1676233 1707506 1838493 1557822 1709979 1377423 1574168 1736510 1567818
14591A567818R0571K40777k06613L30244j25945J11440q4383j78487L66184J16352
$$ 1567818 1658389 1899166 1692553 2022797 1896852 2008292 1923909 1745422 2111606 2227958
14581B227958l33853J53619L4602J71390l80101K34321n0367n0173O17571m40575
$$ 2227958 1894105 2047724 2082326 2253716 1873615 2107936 2057569 2007396 2624967 2184392
14571B184392J2897r1907k2759O384L83781k20903J92881Q4554j09591K18140
$$ 2184392 2197289 2105382 2082623 2089007 2472788 2251885 2444766 2529320 2419729 2637869
14561B637869j74181J91665J50599J22749K2022J93384K98363M7363K81399O92927
$$ 2637869 2463688 2655353 2805952 2928701 2950723 3144107 3442470 3489833 3771232 4464159
14551D464159M94078O27994J796307L678449Q902867J8839108Q907589B3423770
$$ 4464159 4958237 5586231 7382538 11060987 19963854 38802962 47710551 23423770
14542A0741110l032301Q13575l933106j562760q72771l39240O12001l84495M46968
$$ 10741110 7708809 8522384 4589278 3026518 2153747 1814507 2426508 2042013 2488981
14533B488981n70089M64414o0644M216K48J5944j4928L9093O4894J56676P5323
$$ 2488981 1918892 2383306 2322662 2326878 2327126 2343070 2328142 2367235 2432129 2588805 2664128
14522B664128l60566K29017J66390R1816l91928J46895O0005J44620q7340L9295
$$ 2664128 2303562 2532579 2698969 2790785 2398857 2545752 2605757 2750377 2663037 2702332
14512B702332N8810Q2389M97662j49741m50807N66272K21471n13689J36792j76282
$$ 2702332 2761142 2843531 3341193 3191452 2740645 3306917 3528388 3014699 3151491 2975209
14502B975209K14077p5941m489J70524j18854P0475N57310k65009k26738J84355
$$ 2975209 3189286 3113345 3108856 3279380 3160526 3231001 3788311 3523302 3296564 3480919
14492C480919k12959L18466K4576j87358J83150J94281K22390k95652K7715J15091
$$ 3480919 3267960 3586426 3611002 3423644 3606794 3801075 4023465 3727813 3755528 3870619
14482C870619R6581k44393K67491J87492K1685r8341k34961J71333J41365q9865
$$ 3870619 3967200 3722807 3990298 4177790 4199475 4101134 3866173 4037506 4178871 4089006
14472D089006J61530O2825J31029R4441K3525K82039l30458j510J29308J35574
$$ 4089006 4250536 4313361 4444390 4538831 4562356 4844395 4513937 4512427 4641735 4777309
14462D777309L5522j34844P5296P57838k00676k68632J95744n2245J07914J142
$$ 4777309 4812831 4677987 4753283 5511121 5310445 5041813 5237557 5185312 5293226 5294368
14452E294368J6251N9952K01286O1874n5606O1299L25304K08259j44775R952N85804
$$ 5294368 5310619 5370571 5571857 5633731 5578125 5639424 5964728 6172987 6028212 6038164 6623968
14441F623968m05236J43292J68584k52002J07737J48005L20507k18074L51484
$$ 6623968 6218732 6362024 6530608 6278606 6386343 6534348 6854855 6636781 6988265
14432F988265O3934J8473J88948K56855k22991L44334m9964K4096N1795j23296
$$ 6988265 7052199 7070672 7259620 7516475 7293484 7637818 7587854 7611950 7663745 7540449
14422G540449N52079j04397K47025j77111O15498k46344J30193M55381k05977
$$ 7540449 8092528 7988131 8235156 8058045 8673543 8427199 8557392 9012773 8806796
14413H806796L547M35119K96152l7411j96249M95664P1015K37169L44837q1181
$$ 8806796 8810343 9245462 9541614 9504203 9307954 9803618 9874633 10111802 10456639 10375458
14403A0375458L61369N1501J82198J87301p5659K32128J43846K20451L24710Q1731
$$ 10375458 10736827 10788328 10970526 11157827 11082168 11314296 11458142 11678593 12003303 12085034
14393A2085034K78771j2176P34756m84773O15090J76034N21634k3712P1579K30337
$$ 12085034 12363805 12351629 13086385 12601612 13216702 13392736 13914370 13890658 13962237 14192574
14383A4192574L72491M60474J43347P8474M21632o0511N36676N77065j9955J35181
$$ 14192574 14565065 15025539 15168886 15247360 15668992 15608481 16145157 16722222 16702267 16837448
14373A6837448O80152J74854N86122L9904O0712O34657N03623L45343N83491N04203
$$ 16837448 17517600 17692454 18278576 18318480 18379192 19013849 19517472 19862815 20446306 20950509
14363B0950509M59174J0206Q87787K98330j45455R14490N98279L07257J005156
$$ 20950509 21409683 21419889 22307676 22606006 22460551 23375041 23973320 24280577 25285733
14354B5285733N69859N53900M10641R68309N84004J007486K61779R52076Q59692
$$ 25285733 25855592 26409492 26820133 27788442 28372446 29379932 29641711 30593787 31453479
14345C1453479O26004P91085Q83966R22584N81218J385056O06104J507967J029050
$$ 31453479 32079483 32870568 33754534 34677118 35258336 36643392 37249496 38757463 39786513
14336C9786513Q07439J212198R99311J669839J160783J443902J298710J504007
$$ 39786513 40593952 41806150 42805461 44475300 45636083 47079985 48378695 49882702
14328D9882702J386922K193308J600769J378710K120685J737671K174514K120313
$$ 49882702 51269624 53462932 55063701 56442411 58563096 60300767 62475281 64595594
14320F4595594K105911K551295K331176K840221K913915K710388K829183L382940
$$ 64595594 66701505 69252800 71583976 74424197 77338112 80048500 82877683 86260623
14312H6260623L423880L675886L464080L929461M406791M500272M632543N140269
$$ 86260623 89684503 93360389 96824469 100753930 105160721 109660993 114293536 119433805
14304A19433805N613624N453606O020876O059327O705845P256032P534902Q065888
$$ 119433805 125047429 130501035 136521911 142581238 149287083 156543115 164078017 172143905
14296A72143905Q247376R129846R657437J0000843J0433911J1274803J1740243
$$ 172143905 180391281 189521127 199178564 209179407 219613318 230888121 242628364
14289B42628364J2269002J2809879J3874274J3566424J4572837J4782336J5224136
$$ 242628364 254897366 267707245 281581519 295147943 309720780 324503116 339727252
14282C39727252J5532576J5487327J5333634J5310920J4725690J3860323J2760767
$$ 339727252 355259828 370747155 386080789 401391709 416117399 429977722 442738489
14275D42738489J1516902R783821P422520M000295P53758k42331j054265k131666
$$ 442738489 454255391 464039212 471461732 475462027 476215785 475973454 474919189 472787523
14267D72787523l171368m831716p016120r458447j0927053j2847388j4556489
$$ 472787523 469616155 464784439 457768319 448309872 437382819 424535431 409978942
14260D09978942j4837162j5728102j5869113j6164647j5403429j5526601j5216154
$$ 409978942 395141780 379413678 363544565 347379918 331976489 316449888 301233734
14253C01233734j4482647j2418687j2793733j2943292j2324664j1353436j0933081
$$ 301233734 286751087 274332400 261538667 248595375 236270711 224917275 213984194
14246B13984194j0504044r651439q670639q953424q192071p954712p345143o724387
$$ 213984194 203480150 193828711 185158072 176204648 168012577 160057865 152712722 145988335
14238A45988335o315300n572747o086266n611025n202868m689468m480335m265777
$$ 145988335 139673035 134100288 128014022 122402997 117200129 112510661 108030326 103764549
14230A03764549l923926m049757l995280l461139l348408l021407k767767l409197
$$ 103764549 99840623 95790866 91795586 88334447 84986039 81964632 79196865 75787668
14222G5787668k766867k403583k259058k410521j997784j966204k338164j643402
$$ 75787668 73020801 70617218 68358160 65947639 63949855 61983651 59645487 58002085
14214E8002085j542492j707914j603862k195885j360803j725221j064406p91729
$$ 58002085 56459593 54751679 53147817 50951932 49591129 47865908 46801502 46009773
14206D6009773j383660q65270j940229j293461r04494j244553n15506j087318
$$ 46009773 44626113 43760843 41820614 40527153 39622659 38378106 37862600 36775282
14198C6775282r58657j124497m98031j318964o01894n11183p89942j048940j106317
$$ 36775282 35816625 34692128 34194097 32875133 32273239 31762056 30972114 29923174 28816857
14189B8816857j59481j276474k65562p19302m29375p70406j70825o56938o64604
$$ 28816857 28657376 27380902 27115340 26396038 25966663 25196257 25025432 24368494 23703890
14180B3703890m56167p24326l92219m51618l27573m61384j46713q68053J57207
$$ 23703890 23247723 22523397 22131178 21679560 21351987 20890603 20743890 19875837 20033044
14171B0033044j004126m97575P539n87722r4757m25393n06029j78127k79930k70157
$$ 20033044 19028918 18531343 18538882 17951160 17856403 17431010 16924981 16746854 16466924 16196767
14161A6196767k30642j61722m01268m04140O5185l43250l96897o36175O575n3440
$$ 16196767 15966125 15804403 15403135 14998995 15064180 14720930 14324033 13687858 13694433 13640993
14151A3640993k62462k50373k98977m9489L7129n49523j39753j55918J29243r13244
$$ 13640993 13378531 13128158 12829181 12779692 12816821 12267298 12127545 11971627 12100870 11187626
14141A1187626n5855N8113q396k81983j66101L0323j86994m53276n1426N8126
$$ 11187626 11131771 11189884 11181488 10899505 10733404 10763727 10576733 10123457 10072031 10130157
14131A0130157k16552j78792k77775n110J61245n62726m0969K59462m07437k95912
$$ 10130157 9913605 9734813 9457038 9451928 9613173 9050447 9009478 9268940 8861503 8565591
14121H565591J21906j53551M3300k34456k9632q6850o51920J80351J0300L67606
$$ 8565591 8687497 8533946 8577246 8342790 8313158 8226308 7574388 7754739 7765039 8132645
14111H132645r63733L75974L2536j4808m59088P9961n53819K98829j42754J11682
$$ 8132645 7168912 7544886 7577422 7562614 7103526 7183487 6629668 6928497 6785743 6897425
14101F897425n15996J30884J6345J66879o46887J38787j0581j32848Q5733K01976
$$ 6897425 6381429 6512313 6528658 6695537 6048650 6187437 6176856 6044008 6129741 6331717
14091F331717j47789p0437j10044n6583N8967k18911j57581P8131k77718j73620
$$ 6331717 6183928 6113491 6003447 5946864 6005831 5786920 5629339 5707470 5429752 5256132
14081E256132j9419k19743l8255J87051j51413N3116L17386m24899r8637M0200
$$ 5256132 5236713 5016970 4978715 5165766 5014353 5067469 5384855 4959956 4861319 4901519
14071D901519l24343K77033m00749L63346m19975K31862r7371m35012L37181K80603
$$ 4901519 4577176 4854209 4453460 4816806 4396831 4628693 4531322 4096310 4433491 4714094
14061D714094m64947J05416J64893k11351k55984O27350o16354J49432j72700
$$ 4714094 4249147 4354563 4519456 4308105 4052121 4679471 4063117 4212549 4039849
14052D039849o7374J1713l9540O1409R6406k62718o2592K894j26641R3719r3525
$$ 4039849 3972475 3984188 3944648 4006057 4102463 3839745 3777153 3780047 3653406 3747125 3653600
14041C653600J68783k95230m2955l0874N825l62612J15627n9007J94695j83432
$$ 3653600 3822383 3527153 3484198 3453324 3459149 3096537 3212164 3153157 3347852 3164420
14031C164420L23595j54865O127j72837O3902n4974n8179K51652k00513l99716
$$ 3164420 3488015 3333150 3339277 3166440 3230342 3175368 3117189 3368841 3168328 2768612
14021B768612J48063J08174k41920J19102k34838j4726J58654M0649j01007J69288
$$ 2768612 2916675 3024849 2782929 2902031 2667193 2652467 2811121 2851770 2750763 2920051
14011B920051p82089O63035m08423M3263J46557K3434j87306K6718p2453Q6258
$$ 2920051 2137962 2800997 2392574 2435837 2582394 2605828 2418522 2445240 2372787 2459045
14001B459045r9359J01187k68580k54766O01744j99991j08211N2474q5396J00002
$$ 2459045 2359686 2460873 2192293 1937527 2539271 2339280 2231069 2283543 2198147 2298149
13991B298149J25401L24480N82311K379368O987904J8249029J8706906j9593414
$$ 2298149 2423550 2748030 3330341 5709709 12697613 30946642 49653548 30060134
13983C0060134j4158553o205373k915774j493608p24638m27238k17530m27991
$$ 30060134 15901581 9696208 6780434 5286826 4562188 4134950 3917420 3489429
13975C489429n2572l32053k59200J30657j90869k36504R3903K76800j85690k66163
$$ 3489429 3436857 3104804 2845604 2976261 2785392 2548888 2642791 2919591 2733901 2467738
13965B467738J15910k05756j85611J39984K086K7045o1433Q9700o8387J85k86861
$$ 2467738 2583648 2377892 2192281 2332265 2334351 2361396 2299963 2389663 2321276 2321461 2034600
13954B034600J70355K28357n03382M03588j89352J08846k09091o3491j13300q9710
$$ 2034600 2204955 2433312 1929930 2333518 2144166 2253012 2043921 1980430 1867130 1777420
13944A777420J03276r4444J36779J26972n7072N7508j65051k43313L95807j51968
$$ 1777420 1880696 1786252 1923031 2050003 1992931 2050439 1885388 1642075 2037882 1885914
13934A885914K99206o06937M92030l84635M1343J96735l25747n4508J80779K62814
$$ 1885914 2185120 1578183 2070213 1685578 1726921 1923656 1597909 1543401 1724180 1986994
13924A986994l82352L81585m44774m2773R7039l9754L73313k98399j82808P0159
$$ 1986994 1604642 1986227 1541453 1498680 1595719 1555965 1929278 1630879 1448071 1518230
13914A518230M55109p7921o5419L9669j39947k49298L1528j17917q333J30101
$$ 1518230 1973339 1895418 1829999 1869668 1729721 1480423 1511951 1394034 1385701 1515802
13904A515802r0580J93468m877j07999J49013o1669K14853J58296o26771L70106
$$ 1515802 1425222 1618690 1613813 1505814 1654827 1593158 1808011 1966307 1339536 1709642
13894A709642k36646r2336Q8757n3038j3956j31392n7778j36938l1784P1817J65159
$$ 1709642 1472996 1380660 1469417 1416379 1402423 1271031 1213253 1076315 1044531 1116348 1281507
13883A281507P6767n6225n3794j09008k32087L22631k22105L68803O0435p5871
$$ 1281507 1358274 1302049 1248255 1139247 907160 1229791 1007686 1376489 1436924 1361053
13873A361053k20742K48855m95607L46507O0464k45933O0253K14824N6792J45385
$$ 1361053 1140311 1389166 893559 1240066 1300530 1054597 1114850 1329674 1386466 1531851
13863A531851j2710l81149N2287k60183n6822M13171j18292K62233j35745m07357
$$ 1531851 1519141 1137992 1190279 930096 873274 1286445 1168153 1430386 1294641 887284
13853H87284J34443L58379j7770n4655m50392M39430K6382q4504j27921K6130
$$ 887284 1021727 1380106 1362336 1307681 857289 1296719 1323101 1238597 1110676 1136806
13843A136806J63701k62266j39903L86675j76441J6139j41825j37368M29498p0977
$$ 1136806 1300507 1038241 898338 1285013 1108572 1124711 982886 845518 1275016 1204039
13833A204039o1090j81035Q247K310R9203j29247K54026O6556l09860p1100K89066
$$ 1204039 1142949 961914 970161 972471 1071674 942427 1196453 1263009 953149 882049 1171115
13822A171115k11505L23139k91343j749r5436l5125M7158p056O8833J13338l10324
$$ 1171115 959610 1282749 991406 989657 894221 859096 906254 899198 968031 1081369 771045
13811G71045J97977O58q3250Q578k39414L30657j51758K52142k23484M06312n01668
$$ 771045 969022 969680 886430 895008 655594 986251 834493 1086635 863151 1269463 767795
13800G67795P7072j73452J60870J29974j92941J05899o3126k00565M06579p9080
$$ 767795 844867 671415 832285 962259 769318 875217 812091 611526 1018105 939025
13790I39025j7698l32341J20559k4520R5437K6149k57002J91311P7149j36067
$$ 939025 921327 588986 709545 685025 780462 806611 549609 740920 818069 682002
13780F82002J39038M1268k1430N7367j39141l20571M28578l458j90862K81307
$$ 682002 821040 862308 840878 898245 759104 438533 867111 863653 672791 954098
13770I54098j06245l30772K30430j35996K69942j53412k73507M0143K14530k42373
$$ 954098 847853 517081 747511 611515 881457 728045 454538 494681 709211 466838
13760D66838L56580J06260l72491L90598k64771j06922N15822l83495J56340k67142
$$ 466838 823418 929678 557187 947785 683014 576092 1091914 708419 864759 597617
13750E97617Q9678m9913L90200l54445j61878k34809N05965K9295l78432K40034
$$ 597617 687295 637382 1027582 673137 511259 276450 782415 811710 433278 673312
13740F73312o8237j37514M23846j46926L3552k58369J73276J32217k73607A60436
$$ 673312 605075 467561 891407 744481 778033 519664 692940 825157 551550 160436
13729G26178n6174j5030P0959r0629p3553O8221o3746K68001n3995p6882J8573
$$ 726178 670004 654974 725933 635304 561751 629972 566226 834227 780232 703350 721923
13718G21923j32934J92684B05198K35347K75720j03524A82656N16505B70197M8541
$$ 721923 588989 781673 205198 440545 716265 612741 182656 699161 270197 318738
13708C18738L2360O01833D39733j9639K47151C26347K08362j47168J15191L12831
$$ 318738 351098 952931 439733 420094 667245 326347 534709 387541 502732 815563
13698H15563j86081l02891L92271j69684M12881C59479J45038L70436k43433K2757
$$ 815563 629482 326591 718862 549178 962059 359479 504517 874953 631520 654277
13688F54277o7386K6209K6811K3893B17306P60528B78217L9200d0339C62200K41588
$$ 654277 586891 613100 639911 663804 217306 977834 278217 317417 -40339 362200 603788
13677F03788l9463J64305C31504K60065j5123K23688k7790l74601K02834K15087
$$ 603788 564325 728630 331504 591569 576446 800134 772344 397743 600577 815664
13667H15664r4157k04783J77455R9537C41990M11112L63845k94146k53551B78840
$$ 815664 721507 516724 694179 793716 341990 753102 1116947 822801 569250 278840
13656H47312j5663k94610A62020L03458J19403L31219A63230L05600O8606o179
$$ 847312 831649 537039 162020 465478 584881 916100 163230 468830 537436 531257
13646E31257k07986k0754J03278j76394K10747J22768k4478K0800A80726K03068
$$ 531257 323271 302517 405795 229401 440148 562916 538438 559238 180726 383794
13636C83794K25355B3064Q86072D52622l9812J29686k57092K57955R4381j36366
$$ 383794 609149 23064 909136 452622 412810 542496 285404 543359 637740 501374
13626E01374K66205j50490B18066L41475j20512m4233J63847k59752P7811q1591
$$ 501374 767579 617089 218066 559541 439029 394796 558643 298891 376702 295111
13616B95111K03331j87317K31231j07406Q4209J40190k31572j40752K96849k10566
$$ 295111 498442 311125 542356 434950 519159 659349 427777 287025 583874 373308
13606C73308A73532M408J89383J32258j18623O7396j26500P4251J29302p6339
$$ 373308 173532 177940 367323 499581 380958 448354 321854 396105 525407 449068
13596D49068J04852j09031L0500A62407J50188n6378q8723K62461j39248M9069
$$ 449068 553920 444889 475389 162407 312595 256217 167494 429955 290707 339776
13586C39776l1318N5496m0841A49397L61077L7868j68120j16063L14346k9475
$$ 339776 308458 363954 323113 149397 510474 548342 380222 264159 578505 549030
13576E49030J69552B60172A26867L51484k36452m5111k7140L69530A27245J93314
$$ 549030 718582 260172 126867 478351 241899 196788 169648 539178 127245 320559
13566C20559J872M00266C33312n8376J67804j39617J85547B17762k4649J2045
$$ 320559 322431 722697 333312 274936 442740 303123 488670 217762 193113 205158
13556B05158K62079j64213o0239C0221L71496l9275M8211K65755j71816k32863
$$ 205158 467237 303024 242785 30221 401717 362442 410653 676408 504592 271729
13546B71729F4281J75985N1156J68288k10529L41185k46037r0043B8650O08036
$$ 271729 64281 240266 291422 459710 249181 590366 344329 254286 28650 636686
13536F36686l10990J05465j04190K93922j58092G25J20458L65504j09441i337
$$ 636686 325696 431161 326971 620893 462801 725 121183 486687 377246 -9337
13525C37843L4062N5215A32414N87453C15931R3381p5723n2838j7357J26187j70942
$$ 337843 371905 427120 132414 719867 315931 409312 333589 280751 263394 389581 218639
13514B18639p1587m271K07797j14702P5677J79658A71082K82096k08499q724J54354
$$ 218639 147052 142781 350578 235876 311553 491211 171082 453178 244679 235955 390309
13503C90309q8733K10808C4450O08380A80273J87394j68734K31591A39650P7696
$$ 390309 301576 512384 34450 642830 180273 367667 198933 430524 139650 217346
13493B17346g9312C94047K06505A84352K61419n9350o0014n7001L34404k98410
$$ 217346 -79312 394047 600552 184352 445771 386421 326407 269406 603810 305400
13483C05400P4832J8904l1061K100r2371R8631N9501j23975H8763R3962M7281
$$ 305400 380232 399136 368075 370175 277804 376435 435936 311961 88763 182725 230006
13472B30006K43426q1942c9465n4830A20514K81261m1019m1310A43358d261C10618
$$ 230006 473432 391490 -39465 -94295 120514 401775 360756 319446 143358 -4261 310618
13460A67206L21110k34248O4786o2149m2816K39425D8371O1426L14863j85102
$$ 167206 488316 254068 318854 256705 213889 453314 48371 109797 424660 239558
13450B39558I7542L84065B33994i0364B28889J69598O6715d2116A62179Q8399
$$ 239558 97542 481607 233994 -90364 228889 398487 465202 -42116 162179 250578
13440B50578J00785e324B387d1889B48949c6129B22060K3267K2143j09046Q2903
$$ 250578 351363 -5324 2387 -41889 248949 -36129 222060 245327 267470 158424 241327
13429B41327e5896B36822j02066a5911A39677C0954K66556R33K46159A28418P7509
$$ 241327 -55896 236822 134756 -15911 139677 30954 297510 298443 544602 128418 205927
13418B05927p0727J22338a6059A96675J07748d123H6597L6238j8481B8553N4799
$$ 205927 135200 257538 -16059 196675 304423 -4123 86597 122835 104354 28553 83352
13407H3352J81706K74876k20737q2033J04364n7394K88820J97460l19034j58474
$$ 83352 265058 539934 319197 237164 341528 284134 572954 770414 451380 292906
13397B92906A24909a9891C48231P1833A65002J7594H5447J21960K84978A0599
$$ 292906 124909 -19891 348231 420064 165002 182596 85447 207407 492385 10599
13386A68856d0763C72945i1016B08158Q8962F654P6074K77327m29F2316K56601
$$ 168856 -40763 372945 -91016 208158 297120 6654 82728 360055 359626 62316 318917
13375C18917C8638J34566H2170Q8011l005m4412N29763j12665a24119A35527K24319
$$ 318917 38638 173204 82170 170181 167176 122764 652527 539862 -124119 135527 359846
13364C59846R7962f8017I0751J51477B7288J44618J02400o5010h299A02720L06896
$$ 359846 457808 -68017 90751 242228 27288 171906 274306 209296 -8299 102720 409616
13353D09616B01777N8704A9247R2580J94945A35848K31844j24176L16146d603
$$ 409616 201777 260481 19247 111827 306772 135848 367692 243516 559662 -4603
13342A94944J83268m9596p3018j24539N1193c948B84677B4644K61821D1847N2013
$$ 194944 378212 328616 255598 131059 182252 -3948 284677 24644 286465 41847 93860
13331I3860b6974c60k32334C61871E2927f6536I0891K97051o6736K89261A57462
$$ 93860 -26974 -360 -232694 361871 52927 -66536 90891 387942 321206 610467 157462
13319B52378D6305J45194J38936C7002K71518A18372J9156k9801J84728K8655
$$ 252378 46305 191499 330435 37002 308520 118372 137528 107727 292455 321110
13309C21110M4671P7689m0494A74715L84755A43459e7573A00755b12582A63534
$$ 321110 365781 443470 402976 174715 559470 143459 -57573 100755 -212582 163534
13298B04157O4342j28370J58232I2589l8719J57204L16291H6198O9689a4601C14316
$$ 204157 268499 140129 298361 92589 53870 211074 527365 86198 155887 -14601 314316
13286B58937H0333h9806A56818K25402D9246i8442D76248B32814H4293J33855
$$ 258937 80333 -89806 156818 382220 49246 -98442 476248 232814 84293 218148
13276B18148K59971C9131j6426g7408B5093R9384L7069E2880L79313j11429A17223
$$ 218148 478119 39131 22705 -77408 25093 124477 161546 52880 432193 320764 117223
13264A81057g6553H7865L28420q955H9560L5601E5945L5999O092a12710A00156
$$ 181057 -76553 87865 416285 407330 89560 125161 55945 91944 98036 -112710 100156
13252B35264L8535A07941K5408A6935Q0977R7229a10689A92110B3996J17562h605
$$ 235264 273799 107941 133349 16935 97912 195141 -110689 192110 23996 141558 -8605
13240C66416j22356H75O1027e7893K5555k7389J2897C9792K7831P2317J42785
$$ 366416 244060 875 61902 -57893 -32338 -59727 -46830 39792 67623 139940 282725
13229B82725a37536B45361b0757B20582L9173q670f9376A71379E0037O0468J53996
$$ 282725 -137536 245361 -20757 220582 259755 251085 -69376 171379 50037 110505 264501
13218B64501K78093G3619K32792J41168a28014F2494M9540N7588P0110A11988
$$ 264501 542594 73619 306411 447579 -128014 62494 112034 169622 239732 111988
13207A95561E9133f3959H8208a57676C5044d1578E7604O9719c14A69781J41031
$$ 195561 59133 -63959 88208 -157676 35044 -41578 57604 127323 -314 169781 310812
13196C10812C6779J89985J19538j7572q676K3224D2058K82223j59490a7838F93693
$$ 310812 36779 226764 346302 328730 320054 343278 42058 324281 164791 -17838 693693
13184G3162J59750J06620A0891K3036b32099A72238c0875B81141A31091c1599
$$ 73162 232912 339532 10891 33927 -232099 172238 -30875 281141 131091 -31599
13173I5799C7337L09009A69849f6361C65509j57803L7170r8097d1857C62480a46044
$$ 95799 37337 346346 169849 -66361 365509 207706 244876 146779 -41857 362480 -146044
13161i3049c2680m1624C60969E9842a31378B12629J88997i9386C15985j46038
$$ -93049 -32680 -74304 360969 59842 -131378 212629 401626 -99386 315985 169947
13151A69947h4378m6049b9477C03863D106K34647B1257J6803J50034d7624C57105
$$ 169947 -84378 -130427 -29477 303863 4106 238753 21257 38060 188094 -47624 357105
13139C0178J85549K24073A51572c81581a54622G5098J4369O2386b71302A89468
$$ 30178 215727 439800 151572 -381581 -154622 75098 89467 151853 -271302 189468
13128a46578B26880n7816L9332c7662n2210F069f0053a4799B17488j02352b7796
$$ -146578 226880 169064 208396 -37662 -89872 6069 -60053 -14799 217488 115136 -27796
13116A45563c9141B58928b24815d5797B73633N5356A36904g634C16468k0046D0095
$$ 145563 -39141 258928 -224815 -45797 273633 328989 136904 -7634 316468 296422 40095
13104F9807O4385c63224B06233b6196C9254K29639h7849B00441N264b34177a07096
$$ 69807 134192 -363224 206233 -26196 39254 268893 -87849 200441 205705 -234177 -107096
13092B19414G3377K7937h3948A67959a70383k4379g906F2272L4112b7082k7493
$$ 219414 73377 101314 -83948 167959 -170383 -194762 -7906 62272 96384 -27082 -54575
13081e4575B12854L0734b18941m179C98979j37552A16009P5127D1299L84263a60776
$$ -54575 212854 243588 -218941 -223120 398979 261427 116009 191136 41299 425562 -160776
13069c55936b2524D0671P29110E9869r709b18615G7175a33119c1915q5259C53053
$$ -355936 -22524 40671 769781 59869 50160 -218615 77175 -133119 -31915 -117174 353053
13057A40358f7100C60162A66846H1734g6848L4599D8811J4962a62670A02468J6817
$$ 140358 -67100 360162 166846 81734 -76848 -42249 48811 63773 -162670 102468 119285
13046A19285b22116A91062e9298F0503J49591D8388K13045d8414A50400b31137
$$ 119285 -222116 191062 -59298 60503 210094 48388 261433 -48414 150400 -231137
13035E941L16036E0352M29459c8040H6086l3780J34716J28416r8942e2649A1009
$$ 5941 321977 50352 479811 -38040 86086 52306 187022 315438 216496 -52649 11009
13023D87638E9192K02758d4577A65238a43215B28758n1608a2387j98026B15045
$$ 487638 59192 261950 -44577 165238 -143215 228758 177150 -12387 -210413 215045
13012A14748a21128D871J82939E8865c00448c7274A57208C6303a60867J7620b0759
$$ 114748 -121128 4871 187810 58865 -300448 -37274 157208 36303 -160867 -143247 -20759
13000C58912r1515F2490a19421B05183k6969h997I4276D5146b90570A55539d03366
$$ 358912 267397 62490 -119421 205183 178214 -8997 94276 45146 -290570 155539 -403366
12988B41662D9868J38181d09929a09238N4361I2977l7763J86204a72486H6043
$$ 241662 49868 188049 -409929 -109238 -54877 92977 55214 241418 -172486 86043
12977A68184l1539c4157j10965A13929a41684C83116j59150b8327q3270k1932
$$ 168184 136645 -34157 -145122 113929 -141684 383116 223966 -28327 -111597 -133529
12967a33529G7407Q4177m2831J03053L06815e3584E0891j0525K7100K22926g9404
$$ -133529 77407 161584 118753 221806 528621 -53584 50891 40366 67466 290392 -79404
12955A51117a1530C05012a69731q2208B26440L453o1180P5327K20032I8913a26247
$$ 151117 -11530 305012 -169731 -251939 226440 229893 168713 244040 464072 98913 -126247
12943a27087A91835c57780B60800A8222a1841D16396A87566a4316C59834A13990
$$ -127087 191835 -357780 260800 18222 -11841 416396 187566 -14316 359834 113990
12932a83547B40918A03723g2889H3676d7926k04492a23353C6665Q1822n8335J2977
$$ -183547 240918 103723 -72889 83676 -47926 -252418 -123353 36665 118487 60152 73129
12921G3129i47B16350a69269h3984A92535K08739A34910a32072l2949A75897c078
$$ 73129 -947 216350 -169269 -83984 192535 401274 134910 -132072 -165021 175897 -3078
12909B11204R0511B2206a44070A33698C5638J83990K42721a00510A59954i9078
$$ 211204 301715 22206 -144070 133698 35638 219628 462349 -100510 159954 -99078
12898A9242K66664a46528B8256a40585B11462L2320R4182A27602l0573M8178K10094
$$ 19242 285906 -146528 28256 -140585 211462 243782 337964 127602 97029 145207 355301
12887C55301G8587L35952a1723k41034F690g6338D27586h4868A58976a1426C10973
$$ 355301 78587 414539 -11723 -252757 6690 -76338 427586 -84868 158976 -11426 310973
12875A14195n4921b69101b9919A07206B1082a72075M4929k93410A16071b54633
$$ 114195 59274 -269101 -29919 107206 21082 -172075 -127146 -420556 116071 -254633
12864A27799c72717B94252r217b21106B53624a24483A13263B1110J19114e9138
$$ 127799 -372717 294252 285035 -221106 253624 -124483 113263 21110 140224 -59138
12853A03721a05610A46693i5902C95590A30211F3375K8266J98772c4687q3933
$$ 103721 -105610 146693 -95902 395590 130211 63375 91641 290413 -34687 -118620
12843a18620A12432g4012A7709c5503C57131a07194B09795c9531A98773J37202
$$ -118620 112432 -74012 17709 -35503 357131 -107194 209795 -39531 198773 335975
12833C35975b51500F8677a51954j33084h8318D31658j64014C3155d22620f9122
$$ 335975 -251500 68677 -151954 -285038 -88318 431658 267644 33155 -422620 -69122
12822B35222J3258g5110q3051j15775D9686J24193N963l5892J08249f8893j12153
$$ 235222 248480 -75110 -158161 -273936 49686 173879 179842 143950 252199 -68893 -181046
12811a81046c2572C3078K35008D2976h9847L4840l1047A00321M8023b01192B51802
$$ -181046 -32572 33078 268086 42976 -89847 -55007 -86054 100321 148344 -201192 251802
12799B55389E1096d7377L769k28068A28249B4860K48060D2262J50100A6229G180
$$ 255389 51096 -47377 -43608 -271676 128249 24860 272920 42262 192362 16229 7180
12787c9340C11902b12610h7418G5835b7963m5899j76054b8878j82964c5151A55894
$$ -39340 311902 -212610 -87418 75835 -27963 -73862 -249916 -28878 -211842 -35151 155894
12775A97469l3270g3852A2574N6792J69409D6045L81740b81817b1900A77060a2322
$$ 197469 164199 -73852 12574 69366 238775 46045 427785 -281817 -21900 177060 -12322
12763c0816l1893l3853B08691c1219A91081J18165j16413b3037B07830o6787K16182
$$ -30816 -62709 -96562 208691 -31219 191081 309246 192833 -23037 207830 141043 357225
12752C57225c0638A65127b88683A89945R6972h8261j76711A70971H2167J93088
$$ 357225 -30638 165127 -288683 189945 286917 -88261 -264972 170971 82167 275255
12742B75255m0937C6822K24748b3912E38432b69728C29902E2796K29920c9318
$$ 275255 234318 36822 261570 -23912 538432 -269728 329902 52796 282716 -39318
12731i1341A22665E1096O6126J26381F009a67106C1102L72399j86630b5160p0303
$$ -91341 122665 51096 117222 243603 6009 -167106 31102 403501 216871 -25160 -95463
12720i5463d6564k9431B33617g8223B24762b70903I3896J1431M8075d6169j18830
$$ -95463 -46564 -75995 233617 -78223 224762 -270903 93896 105327 153402 -46169 -164999
12709a64999H5111K6723J87995e10989E620M2103J25668J00280I149K45746L2808
$$ -164999 85111 111834 299829 -510989 5620 47723 173391 273671 9149 254895 287703
12698B87703c55602A26216n5256f3442A52847o3797m1695L17610j68016i1189
$$ 287703 -355602 126216 70960 -63442 152847 89050 47355 364965 196949 -91189
12687A25004F1465F355J84458a34839I1072O3330i4154L6317A08599e6075j6297
$$ 125004 61465 6355 190813 -134839 91072 154402 -94154 -57837 108599 -56075 -72372
12676g2372C44819J9924A74409G2066b69827A93675k655g5766E8029J66437h8868
$$ -72372 344819 364743 174409 72066 -269827 193675 191020 -75766 58029 224466 -88868
12664a15058j27469C16805K91708d9655A27993b76934J09262B13161l0694o2830
$$ -115058 -242527 316805 608513 -49655 127993 -276934 -167672 213161 182467 119637
12654A19637B0305G443h7602A24551g2355A93022e6725l0005F3026Q226J56239
$$ 119637 20305 7443 -87602 124551 -72355 193022 -56725 -86730 63026 71252 227491
12643B27491b09492I3375J09038a3945B70758a8623D8756c8327A93560J45952
$$ 227491 -209492 93375 202413 -13945 270758 -18623 48756 -38327 193560 339512
12633C39512A34551b5105B76745j30199K78179A2473J31587M388N4453A1282K31182
$$ 339512 134551 -25105 276745 146546 424725 12473 144060 148448 202901 11282 242464
12622B42464P5766b20828D5697L76393j73520r4635a17231C7925b25381C98408
$$ 242464 318230 -220828 45697 422090 248570 153935 -117231 37925 -225381 398408
12611D6334b40039B34905I6121a07157D04293A02761k8632M68J25585E2940N9372
$$ 46334 -240039 234905 96121 -107157 404293 102761 74129 74597 200182 52940 112312
12600A12312B4090a2489A97882J73k7900a48224B13213R3014d1183B36847i7767
$$ 112312 24090 -12489 197882 198055 170155 -148224 213213 306227 -41183 236847 -97767
12588A18089J68884E786b4848A67371g5589B08498d9933I3294J7232h6047a5932
$$ 118089 286973 5786 -24848 167371 -75589 208498 -49933 93294 110526 -86047 -15932
12576G9942f2798B6294a2764k6758A15345E5956N6800m0126a2054k8268D10793
$$ 79942 -62798 26294 -12764 -39522 115345 55956 112756 72630 -12054 -40322 410793
12564a525A7255K09572f04274D5292b58840L6973G19K34512a33421A44474h7933
$$ -1525 17255 226827 -604274 45292 -258840 -221867 719 235231 -133421 144474 -87933
12552A51441F9822P8842a53619e7612E0265K02390a30346j05798a0674j04713
$$ 151441 69822 148664 -153619 -57612 50265 252655 -130346 -236144 -10674 -115387
12542a15387j59576A45223M27213a33974l4079h0363p2028A92357a85160B29041
$$ -115387 -274963 145223 572436 -133974 -168053 -80363 -152391 192357 -185160 229041
12531a54916B04441e3190l11921f9102A12735f294C2466e3683R913l4349D190
$$ -154916 204441 -53190 -365111 -69102 112735 -6294 32466 -53683 -43770 -78119 4190
12519D1719P925k1965M7945l2881R7523J31012a46797B94964R6861E1086c24648
$$ 41719 49644 27679 75624 42743 140266 271278 -146797 294964 391825 51086 -324648
12507A83542K11681g6328B27907d9457a1777j62392c586k16369A53127m7239b15022
$$ 183542 395223 -76328 227907 -49457 -11777 -174169 -3586 -219955 153127 105888 -215022
12495A45501k2204i3697j02663B69589I8739a12658G2938a30970F4492k8477a8707
$$ 145501 123297 -93697 -196360 269589 98739 -112658 72938 -130970 64492 36015 -18707
12483D25005a51035D7296K3519k3190J50479B9436L01845a00669A65511a66681
$$ 425005 -151035 47296 70815 47625 198104 29436 331281 -100669 165511 -166681
12472b41211A46835c21052B03889Q801b76743J0483H1139M36532D4787j0142L23812
$$ -241211 146835 -321052 203889 212690 -276743 -266260 81139 517671 44787 34645 358457
12461C58457H8129O4632b63163B50124J873a56265A51831Q003F248h9735j44532
$$ 358457 88129 152761 -263163 250124 251997 -156265 151831 159834 6248 -89735 -234267
12450b34267A67341i353k20643h7926A66958b1038j27090H8277h2964A65814a99407
$$ -234267 167341 -9353 -229996 -87926 166958 -21038 -148128 88277 -82964 165814 -199407
12438B73687o0957I5683a3518D9735J79158c10028a03233j16722B1516b70421
$$ 273687 212730 95683 -13518 49735 228893 -310028 -103233 -219955 21516 -270421
12427a87800H3938K43832a7622E2970J8931j1302O5179K07299j51075H3977R7213
$$ -187800 83938 327770 -17622 52970 71901 60599 125778 333077 182002 83977 181190
12416A81190c4391C88121d9077j2947A56049c7306j2357j96402a13805A05177
$$ 181190 -34391 388121 -49077 -62024 156049 -37306 -49663 -246065 -113805 105177
12405b88623a14419k028B65428e0941C72062b02267j20584D3445a40994m3445
$$ -288623 -114419 -116447 265428 -50941 372062 -202267 -322851 43445 -140994 -184439
12395a84439L733N5105e1152E9417a09327k97201F8879f2005K8917j59483C6826
$$ -184439 -180706 -125601 -51152 59417 -109327 -406528 68879 -62005 -33088 -192571 36826
12383f0697p2203M6168E0469a65565A4208a64381j06387A23885a1453k677B66287
$$ -60697 -132900 -86732 50469 -165565 14208 -164381 -270768 123885 -11453 -14130 266287
12371I699J47722o5773K15771a6285n9423j27628B14472f0121F375a31335q6317
$$ 9699 157421 91648 307419 -16285 -75708 -203336 214472 -60121 6375 -131335 -217652
12360b17652A95784i3730M5827j18121B7844a8030B7512a35233O0011A15308g9587
$$ -217652 195784 -93730 -47903 -166024 27844 -18030 27512 -135233 -75222 115308 -79587
12348a00474D7956B2942a00335C25624k1406a36707B69530a73196F7082Q7165
$$ -100474 47956 22942 -100335 325624 304218 -136707 269530 -173196 67082 154247
12338A54247K6912i1040B55260q0964a18236F3496A9244J2546b63548D9052J52073
$$ 154247 181159 -91040 255260 174296 -118236 63496 19244 31790 -263548 49052 201125
12327B01125b20754A64895c94651A26922L8517b31220f8388B93496f6512j7552
$$ 201125 -220754 164895 -394651 126922 165439 -231220 -68388 293496 -66512 -84064
12317h4064A10548m5932B7222K37760a72779j28844c0844F2549J40688h2561A61226
$$ -84064 110548 64616 27222 264982 -172779 -301623 -30844 62549 203237 -82561 161226
12305F256L53405a22257A51019F2026J04920A7092g3931C441Q3618b49524B28232
$$ 6256 359661 -122257 151019 62026 166946 17092 -73931 3441 87059 -249524 228232
12293B9303i0980j39996M1583A02189a32965A4174M0100b0892H2501a77326D7747
$$ 29303 -90980 -230976 -189393 102189 -132965 14174 54274 -20892 82501 -177326 47747
12281b1920B2120a05811A10152b5899j45594b4552k1653k1442D7634a57167A07927
$$ -21920 22120 -105811 110152 -25899 -171493 -24552 -46205 -67647 47634 -157167 107927
12269A41357k8531c3277C506J02144K577O3580D5196h7897B75520g9344D5938
$$ 141357 112826 -33277 3506 105650 108227 171807 45196 -87897 275520 -79344 45938
12257B10169h7424D8193Q4054J07333o0506K9919j6807P3504J07111a18748C53650
$$ 210169 -87424 48193 132247 239580 179074 208993 192186 265690 372801 -118748 353650
12245A55356J8867m1083d54314A73315c09232J29451A19162a27263C74334A2996
$$ 155356 174223 133140 -454314 173315 -309232 -179781 119162 -127263 374334 12996
12234G6326J26157K6477r7554Q4056E9799J40992c575F3814a76420G8977J96136
$$ 76326 202483 228960 131406 215462 59799 200791 -3575 63814 -176420 78977 275113
12223B75113J11099F4192R3935D641L09307a56108E02227A09686f2591B8731h8392
$$ 275113 386212 64192 158127 4641 313948 -156108 502227 109686 -62591 28731 -88392
12211D26350A68392f3241A92070m2098O4821a85139B78849a21658c6958A92731
$$ 426350 168392 -63241 192070 149972 214793 -185139 278849 -121658 -36958 192731
12200D5899i4243A08412a74094B73105a08159A33267Q5990N5061J02307A58066
$$ 45899 -94243 108412 -174094 273105 -108159 133267 219257 274318 376625 158066
12189D09579c0935A55951M0841p5111P547A5099J99875J43787C4046O791b6731
$$ 409579 -30935 155951 196792 121681 129228 15099 214974 358761 34046 40837 -26731
12177B8985K89192E3884O2169K27720e2153C09977P1100l5733F1174K2851L26954
$$ 28985 318177 53884 116053 343773 -52153 309977 381077 345344 61174 84025 410979
12166D10979j08862D2131b3482p1742B59182J9932a27748I6016N9063G0335J15010
$$ 410979 302117 42131 -23482 -95224 259182 279114 -127748 96016 155079 70335 185345
12155A85345p9632h029E12960A4336b00138k5837A17672K0400c6260m6722B43985
$$ 185345 105713 -8029 512960 14336 -200138 -225975 117672 138072 -36260 -82982 243985
12143F7618a72531E9108M3864a56930D5537b56590D03695a73214E6712A8981F264
$$ 67618 -172531 59108 102972 -156930 45537 -256590 403695 -173214 56712 18981 6264
12131G8516A3053O5811J1549D718K1228h2555j69374h833B0607J60071A0679e5218
$$ 78516 13053 78864 90413 4718 25946 -82555 -251929 -8833 20607 180678 10679 -55218
12118g7805c6558l01108B46509q2312O7980a94172A38268m5336c0106A92554a63215
$$ -77805 -36558 -337666 246509 164197 232177 -194172 138268 92932 -30106 192554 -163215
12106F5155b61640H9196M8946k4227a57242D4787J91465E0272d0343I3828a41193
$$ 65155 -261640 89196 138142 113915 -157242 44787 236252 50272 -40343 93828 -141193
12094F2233P5097a5254L076F8152e3939C45357A56011K75732A6292h118A19689
$$ 62233 137330 -15254 -12178 68152 -53939 345357 156011 431743 16292 -8118 119689
12082D7596a94850A6874p343h5194A10944b9305F851J25071e7023j22019G744
$$ 47596 -194850 16874 9531 -85194 110944 -29305 6851 131922 -57023 -179042 7744
12070G2133J20328E9974d44897C19305a48591e0203A67250O38583R52125G61661
$$ 72133 192461 59974 -444897 319305 -148591 -50203 167250 805833 1757958 761661
12059C90116j09194a47281A1722L50828A489J27393J93600A57862b0836j44273
$$ 390116 280922 -147281 11722 362550 1489 128882 322482 157862 -20836 -165109
12049a65109Q1507C01595b22532A78199c83152B60651p640a04112P61c2294A52286
$$ -165109 -83602 301595 -222532 178199 -383152 260651 253011 -104112 -103351 -32294 152286
12037A62330a17616I6683b42078j82605J64385a5529l465A56087p0846R6563p488
$$ 162330 -117616 96683 -242078 -424683 -260298 -15529 -18994 156087 85241 181804 174316
12026A74316b99826F7997J49294a58518D2409N6026e2492C8122R8099g0243E4190
$$ 174316 -299826 67997 217291 -158518 42409 98435 -52492 38122 136221 -70243 54190
12014A18508B7841h6777B90959a32105B88418b1170k32680j32576a41498B4457
$$ 118508 27841 -86777 290959 -132105 288418 -21170 -253850 -386426 -141498 24457
12003A22144a10478j43935A12206J33796e9776K7753j24929I9929M6512o3368
$$ 122144 -110478 -254413 112206 246002 -59776 -32023 -156952 99929 146441 83073
11993H3073f8399j0800A21018a3793r1367B13227b71594J15084j01745g8679c6745
$$ 83073 -68399 -79199 121018 -13793 -105160 213227 -271594 -156510 -258255 -78679 -36745
11981g544j70292J8156F6780b20898c3027l29992a64502b3107o574F3286H352
$$ -7544 -177836 -159680 66780 -220898 -33027 -363019 -164502 -23107 -29681 63286 8352
11969a96796I9472D0792a88727O237g5256F3385A0181J23537e7147B28995I974
$$ -196796 99472 40792 -188727 -182490 -75256 63385 10181 133718 -57147 228995 9974
11957d9820H7576a6818G220a7445r3367j597K1897j93247a16584A66400J00331
$$ -49820 87576 -16818 7220 -17445 -110812 -112409 -90512 -283759 -116584 166400 266731
11946B66731E3558L18810b89917E2343f2532C08955a33894D7094a5665j7585A57231
$$ 266731 53558 372368 -289917 52343 -62532 308955 -133894 47094 -15665 -33250 157231
11934b3325n7024l2667A65111M030b08472C0728a60994B4129b06939q9839L743
$$ -23325 -80349 -113016 165111 169141 -208472 30728 -160994 24129 -206939 -296778 -293035
11923b93035C3354R718K9908J86327E9084j9779c6520K326j22188D273J61280
$$ -293035 33354 43072 72980 259307 59084 39305 -36520 -34194 -156382 4273 165553
11912A65553a11513n4768A16681M9693g5878A64989b23970B25911a23378b3251
$$ 165553 -111513 -166281 116681 166374 -75878 164989 -223970 225911 -123378 -23251
11901f3442A28298c83917h1671A17070a22892j79699b8804k06044r068G334a98943
$$ -63442 128298 -383917 -81671 117070 -122892 -302591 -28804 -234848 -243916 7334 -198943
11889F4137J63044H7119c44832B36606d6009b710J26k552k21907M1156A27932
$$ 64137 227181 87119 -344832 236606 -46009 -2710 -2584 -5136 -227043 -185887 127932
11877D910R6967F389a27600I5552l6455d8636C6498n519g2841k24246J30323G7111
$$ 4910 101877 6389 -127600 95552 59097 -48636 36498 30979 -72841 -297087 -166764 77111
11864B02009E1467K96081b0508e973r7829j11321H0414b8896o4570q0769E7310
$$ 202009 51467 347548 -20508 -5973 -103802 -215123 80414 -28896 -93466 -174235 57310
11852b46531D4301c0965F39856a09131r9153G8492c954n5908B20062b50391Q5307
$$ -246531 44301 -30965 639856 -109131 -208284 78492 -3954 -59862 220062 -250391 -165084
11841a65084G7233L0495m2945L8198M2508d01432a80280P5029I8068J32115b49408
$$ -165084 77233 107728 64783 102981 145489 -401432 -180280 -105251 98068 230183 -249408
11829B38097a21182A52679E2819a71805A17949m8190a03094d5063l5141k50532
$$ 238097 -121182 152679 52819 -171805 117949 69759 -103094 -45063 -80204 -330736
11819c30736B0544J63569b0797E9629a39104b7414k62670B9662i0548A09073e2466
$$ -330736 20544 184113 -20797 59629 -139104 -27414 -290084 29662 -90548 109073 -52466
11807b9057j01203K1559l8966h253l0832l09085h0946C8654i3257D1654L4631
$$ -29057 -130260 -108701 -147667 -8253 -39085 -348170 -80946 38654 -93257 41654 76285
11796G6285E981P7295K68039f2335F0673B6608Q4098L12416b34123g2622A87277
$$ 76285 5981 83276 351315 -62335 60673 26608 110706 423122 -234123 -72622 187277
11784b00666Q7688k57227A46580b04286C0027K302M1707J63856m0204a52456l9085
$$ -200666 -112978 -370205 146580 -204286 30027 32329 74036 237892 197688 -152456 -191541
11773a91541O9918F0549N5275a46212f6519B32654b15515J00562p6901A8937J38540
$$ -191541 -121623 60549 115824 -146212 -66519 232654 -215515 -114953 -191854 18937 157477
11762A57477b82218C0332K493b8499k00475A19556E8730L02215a59220B1217h0692
$$ 157477 -282218 30332 32825 -28499 -228974 119556 58730 360945 -159220 21217 -80692
11750a81687M617d9885k73805D9992c98054a19138M6092p194A94807o2733b40801
$$ -181687 -177070 -49885 -323690 49992 -398054 -119138 -73046 -80240 194807 132074 -240801
11738f8077l6894B45774b1760E726L27434b27176B28451a4198F8413B1966d72734
$$ -68077 -104971 245774 -21760 5726 333160 -227176 228451 -14198 68413 21966 -472734
11726c20905J12601n0472R1952b9304n5777A05516a96111l9860A64615c75643
$$ -320905 -208304 -258776 -166824 -29304 -85081 105516 -196111 -235971 164615 -375643
11715C73624f4490K9803k20295A10223l4987M8245a92299J3033L7347j23324H4109
$$ 373624 -64490 -34687 -254982 110223 75236 123481 -192299 -179266 -141919 -265243 84109
11703A56313a82020A90867a17055D61359F0049J20614B7395E327J02521a5947
$$ 156313 -182020 190867 -117055 461359 60049 180663 27395 5327 107848 -15947
11692B65399b00278O0454B69536b64560A58531b54292A5443J22820L2832B9748
$$ 265399 -200278 -139824 269536 -264560 158531 -254292 15443 138263 171095 29748
11681B50476A02878b9726m0458J6113B19961k9122Q0747j07004d5019D647J6057
$$ 250476 102878 -29726 -70184 -54071 219961 190839 271586 164582 -45019 4647 20704
11670B0704a0485q6411B12805e6975F04195c7997I9166c9250G8813A2415d36937
$$ 20704 -10485 -96896 212805 -56975 604195 -37997 99166 -39250 78813 12415 -436937
11658a16913F7753b77731G2176i2505D2632b35052g6215D5987A9245Q7568a52851
$$ -116913 67753 -277731 72176 -92505 42632 -235052 -76215 45987 19245 106813 -152851
11646b42026d3299j07646O2495C36202J6038a45686g1396B34575E2120e1307a506
$$ -242026 -43299 -150945 -88450 336202 352240 -145686 -71396 234575 52120 -51307 -1506
11634e5294a677k9423A30942a20530B6350K71990C1182R7270e5698H987c54289
$$ -55294 -1677 -31100 130942 -120530 26350 298340 31182 128452 -55698 8987 -354289
11622g6303E4155O4882a80159a7125l8055j08539F4662a29174H5005l8973a99741
$$ -76303 54155 119037 -180159 -17125 -55180 -163719 64662 -129174 85005 46032 -199741
11610G2040P8326J48289i6633A44452a34118j02964a9865A15118C1982K01650
$$ 72040 150366 298655 -96633 144452 -134118 -237082 -19865 115118 31982 233632
11600B33632a35264e1833j55377g4981F4187J7561J00939A8691b46749i9776C9167
$$ 233632 -135264 -51833 -207210 -74981 64187 81748 182687 18691 -246749 -99776 39167
11588A98019g4971D00738A28132d6768I1660J0336O2810b79793A44601J51897
$$ 198019 -74971 400738 128132 -46768 91660 101996 164806 -279793 144601 296498
11578B96498I8663O3617F8301b8908j84981A49342g8827j22538B07292b0244D3196
$$ 296498 98663 162280 68301 -28908 -213889 149342 -78827 -201365 207292 -20244 43196
11566e537B13712e5552A74739p0143a49673F3655a9499r5419B0778a6817C41417
$$ -5537 213712 -55552 174739 104596 -149673 63655 -19499 -114918 20778 -16817 341417
11554a7151j72654h3334E9063c07r83l0838I6395h4256a1224B05074a64641I3188
$$ -17151 -189805 -83334 59063 -307 -1290 -32128 96395 -84256 -11224 205074 -164641 93188
11541B16364I280i1864A09006K22142a81971j6285L6189J397f6560E985b2673
$$ 216364 9280 -91864 109006 331148 -181971 -198256 -162067 -160670 -66560 5985 -22673
11529B06593I6888J03895I0140c1299F8740O9630b13479A37040f3313M368A26084
$$ 206593 96888 200783 90140 -31299 68740 138370 -213479 137040 -63313 -58945 126084
11517A27787b5096l0711j51094A3924a74559d5342l2070C22942j31609p7554a17836
$$ 127787 -25096 -55807 -206901 13924 -174559 -45342 -77412 322942 191333 113779 -117836
11505a25694C00639c08133F8905M1486k3273b9400j00391C82730j45819g0144
$$ -125694 300639 -308133 68905 110391 87118 -29400 -129791 382730 236911 -70144
11494B05547d22319G7014B3405a1790B66036f4932D4103L55504B437K05098r6839
$$ 205547 -422319 77014 23405 -11790 266036 -64932 44103 399607 2437 207535 110696
11483A10696J675d9009B83231g1336C3392a3210B39319d228A64496k3226b0489
$$ 110696 112371 -49009 283231 -71336 33392 -13210 239319 -4228 164496 141270 -20489
11471C22659J60776I2897a12602A79479B0592J18271e85B31702K0467A02315R8397
$$ 322659 483435 92897 -112602 179479 20592 138863 -585 231702 252169 102315 200712
11460B00712L1286Q2106A12994i0982B12836n4079i1084m3255I6443J0014g8001
$$ 200712 231998 314104 112994 -90982 212836 158757 -91084 -134339 96443 106457 -78001
11448I2786a07554A94478R7732j11328a5054A2176b15954q7970a12075a333j11587
$$ 92786 -107554 194478 292210 180882 -15054 12176 -215954 -303924 -112075 -1333 -112920
11437a12920C44830N4439b11221A75776c7325B28662b97967A08795A9725J18647
$$ -112920 344830 399269 -211221 175776 -37325 228662 -297967 108795 19725 138372
11427A38372d56848F9579K3779J02520b3828E972J80131a4331G773c50048r5224
$$ 138372 -456848 69579 93358 195878 -23828 5972 186103 -14331 7773 -350048 -445272
11416d45272A83822m646E1403a86208C32982A12819h2791a7383A34310b63865
$$ -445272 183822 179176 51403 -186208 332982 112819 -82791 -17383 134310 -263865
11405e8486o9635E2319b55366A94855b34635d4510m3663H371b46321e9322k23562
$$ -58486 -128121 52319 -255366 194855 -234635 -44510 -88173 8371 -246321 -59322 -282884
11394b82884a32053J4990b3967I2590a46484A49627f7928r0548O9615C19590b37178
$$ -282884 -132053 -117063 -23967 92590 -146484 149627 -67928 -158476 -88861 319590 -237178
11382a4820A7790J09884b02897A40878b48772A31670c47711h4521j2844j58060
$$ -14820 17790 127674 -202897 140878 -248772 131670 -347711 -84521 -97365 -255425
11372b55425d05A72746b49498B45137M1183F9649r517c59379A96454q1024A9344
$$ -255425 -405 172746 -249498 245137 286320 69649 60132 -359379 196454 115430 19344
11360D5887g561m684A15753n7221b43644M6724h9122H7822K58796A61179D8217
$$ 45887 -7561 -12245 115753 58532 -243644 -196920 -89122 87822 346618 161179 48217
11348A72375a97688I9598J84895a05752A69022c9591A18711J2988K8186m4858
$$ 172375 -197688 99598 284493 -105752 169022 -39591 118711 131699 159885 115027
11338A15027K71070A73576a56604j31318C0984g5314K3339l0781C8913b79696
$$ 115027 386097 173576 -156604 -287922 30984 -75314 -51975 -82756 38913 -279696
11327B85552B1730a53397D00934d0504j19380j01986A20291b70961a10035m5177
$$ 285552 21730 -153397 400934 -40504 -159884 -261870 120291 -270961 -110035 -155212
11317a55212A68324A8038J09956b58791K1051d1857B5339J40962b3652B23924
$$ -155212 168324 18038 127994 -258791 -237740 -41857 25339 166301 -23652 223924
11306A55443b35970B5290g9616A52605o9193J20104b09400H8023b08011B28448
$$ 155443 -235970 25290 -79616 152605 83412 203516 -209400 88023 -208011 228448
11295c62978d0041d49k41671f1767j005j95518A31896R5958J30585a43147d368
$$ -362978 -40041 -449 -242120 -61767 -62772 -258290 131896 227854 358439 -143147 -4368
11283b90105r44a1795m2269A28426c25634r7209F3821c6759j27832j64122F2486
$$ -290105 -291049 -11795 -54064 128426 -325634 -422843 63821 -36759 -164591 -328713 62486
11271d4786m03687J62217j42200E7863a72764d8537k05684A45885e03209A23114
$$ -44786 -448473 -286256 -428456 57863 -172764 -48537 -254221 145885 -503209 123114
11260i4069A2662O1591B4370I849J15357E4789d07441a7418m0444p0073G4826
$$ -94069 12662 74253 24370 9849 125206 54789 -407441 -17418 -57862 -127935 74826
11248c57089a0715A61592d8567j39260O4834p3402a3942D1479i1038B53701b74141
$$ -357089 -10715 161592 -48567 -187827 -122993 -196395 -13942 41479 -91038 253701 -274141
11236E1979I438J0971a1484j83929g0771j71023A7629L3764b59735A0513a29267
$$ 51979 9438 20409 -11484 -195413 -70771 -241794 17629 51393 -259735 10513 -129267
11224a80433E0533J08051b14323K9976l35536I7066f7752m35971b04089c2109
$$ -180433 50533 158584 -214323 -184347 -519883 97066 -67752 -503723 -204089 -32109
11213a35249A35989a73038p992M2749A61205a99426A39537h1402D0628h1418j10155
$$ -135249 135989 -173038 -181030 -138281 161205 -199426 139537 -81402 40628 -81418 -191573
11202a91573F5339c60213A69005b38544J18113C8730l305R0528c06356o8780e3244
$$ -191573 65339 -360213 169005 -238544 -120431 38730 35425 125953 -306356 -375136 -53244
11190b82891f0655G2808c05054B26453j11405a83479p4035J19046j84391A63652
$$ -282891 -60655 72808 -305054 226453 115048 -183479 -257514 -138468 -322859 163652
11179a28311f339j28465D502c454E5714b18559m4674D9339a76323a0592j08994
$$ -128311 -6339 -134804 4502 -3454 55714 -218559 -263233 49339 -176323 -10592 -119586
11168a19586H211J99905a44463H2806c4663A62488p6935J16093a23192q4251j71597
$$ -119586 8211 208116 -144463 82806 -34663 162488 85553 201646 -123192 -207443 -379040
11157c79040A74564d8053A76519f1377K6010k0538l6168d0835A12689c00887R1252
$$ -379040 174564 -48053 176519 -61377 -35367 -55905 -92073 -40835 112689 -300887 -209635
11146b09635A28079b29232A17111b19673H7577N1506K8946K91112b71345A20413
$$ -209635 128079 -229232 117111 -219673 87577 139083 168029 459141 -271345 120413
11135B55292O5381i7534r4578B39211P8231A31194J2320Q465m4101K42677l4372
$$ 255292 320673 -97534 -192112 239211 317442 131194 143514 151979 107878 350555 316183
11124C16183A26523o0898O9887K41548D9511a03195l5268C11610a94834q2973
$$ 316183 126523 65625 135512 377060 49511 -103195 -138463 311610 -194834 -277807
11114b77807A51619c4267E6878a33789d0904E8440a96898G8139R2136K06195J23599
$$ -277807 151619 -34267 56878 -133789 -40904 58440 -196898 78139 170275 376470 500069
11103E00069g0736A53895j0587P974h4146L4375I1789I767a46256I6955P9144
$$ 500069 -70736 153895 143308 151282 -84146 -49771 91789 9767 -146256 96955 176099
11092A76099B6510b16033G3889J50604I3964K43409j34559p7373K21117A24685
$$ 176099 26510 -216033 73889 224493 93964 337373 202814 125441 346558 124685
11081B75988a7741C86852i4069B24608g1338A80843c5349H6738j4912J20144K5139
$$ 275988 -17741 386852 -94069 224608 -71338 180843 -35349 86738 71826 191970 217109
11070B17109r2962n0703J82639F2612Q2178R9511J97508j25990L61354B14836
$$ 217109 124147 73444 256083 62612 144790 244301 441809 315819 677173 214836
11059B65954J42028L01041B67672j0210J60211A91043M46559j50042n7058J55730
$$ 265954 407982 709023 267672 257462 417673 191043 637602 487560 430502 586232
11049E86232j47047J20891J38496J709M947R3776l36645K64937P876j03983L36237
$$ 586232 439185 560076 698572 700281 705228 799004 462359 727296 735172 631189 967426
11038I67426k98609o2969p692n693L58157j41522k55333j02720j66648M01143
$$ 967426 668817 605848 598156 592463 950620 809098 553765 451045 284397 685540
11028F85540n4546P532k74004J73575j0677r5416k5230J15295R7848j14879M0051
$$ 685540 630994 638526 364522 538097 527420 432004 406774 522069 619917 505038 545089
11017E45089B41417N28180p9403B93874J68615n7945L83489k15322J06012r6924
$$ 545089 241417 769597 690194 293874 462489 404544 788033 572711 678723 581799
11007E81799O160k35137J94620n2729J08902k26282q0190J75285J34432j1142
$$ 581799 587959 352822 547442 494713 603615 377333 297143 472428 606860 595718
10997E95718r4933K92507k62492j00777M58833k05057o7532k25846L67466K12994
$$ 595718 500785 793292 530800 430023 888856 683799 616267 390421 757887 970881
10987I70881k8213k66710K80349k44560j802J84530J20736k10563O53920k82687
$$ 970881 942668 675958 956307 711747 709945 894475 1015211 804648 1458568 1175881
10977A175881m8280N05633J09635K49280K69499Q8425K93569k2584o08875K76041
$$ 1175881 1127601 1633234 1742869 1992149 2261648 2350073 2643642 2621058 2012183 2288224
10967B288224k41484j91083k09692j73280m13150K24698m44466L28923J6588J66207
$$ 2288224 2046740 1855657 1645965 1472685 1059535 1284233 839767 1168690 1185278 1351485
10957A351485m47161M52054o8631l81546K76530o9604l63644q5281j99886J12099
$$ 1351485 904324 1356378 1287747 906201 1182731 1113127 749483 664202 464316 576415
10947E76415j92527f1441A79204p4044R0380k5641a03600e1192G7290L8362K06213
$$ 576415 383888 -61441 179204 105160 195540 169899 -103600 -51192 77290 115652 321865
10936C21865N4955g275B58116p107K3452B2161f2356G6858K24656a41347F6821
$$ 321865 376820 -7275 258116 251009 274461 22161 -62356 76858 301514 -141347 66821
10924B61898a30695G955J25811a61003D6146J75243h9870E3052a26766A53537
$$ 261898 -130695 7955 133766 -161003 46146 221389 -89870 53052 -126766 153537
10913b16634m3143A28908g6850m2887c0539j50473G9463c37361a47740j52331
$$ -216634 -259777 128908 -76850 -119737 -30539 -181012 79463 -337361 -147740 -300071
10903c00071a37803H7039O288J07172E5692e39195A49473K44669G7649e9894q3276
$$ -300071 -137803 87039 93327 200499 55692 -539195 149473 394142 77649 -59894 -143170
10892a43170j07853e6785F6482I133L42750c17041a26694L2626B12869F7471l1301
$$ -143170 -251023 -56785 66482 9133 351883 -317041 -126694 -94068 212869 67471 36170
10881C6170J6908a24365C5535D650a37424L1745L8897f162C9733b41023p7261
$$ 36170 53078 -124365 35535 4650 -137424 -105679 -66782 -6162 39733 -241023 -318284
10870c18284J05936Q3046A46678b18180R5792E3754a03093D8947d49195B2419
$$ -318284 -212348 -129302 146678 -218180 -122388 53754 -103093 48947 -449195 22419
10859e8235b8764o6953j7877B79904g8786r5695B19375b67256E5423J70329D6891
$$ -58235 -28764 -95717 -113594 279904 -78786 -174481 219375 -267256 55423 225752 46891
10847a86721N0619l5303b4630j81828N7358m2997l6681I123b57525k78515n1752
$$ -186721 -136102 -171405 -24630 -206458 -149100 -192097 -228778 9123 -257525 -536040 -587792
10836e87792c9577A36077O5864a65607j6517g5350A94922a6383l00555C92145
$$ -587792 -39577 136077 201941 -165607 -182124 -75350 194922 -16383 -316938 392145
10825a7145j10695n3470A15945b24017M7074D8559a17762A57015i3127D787a16856
$$ -17145 -127840 -181310 115945 -224017 -176943 48559 -117762 157015 -93127 4787 -116856
10813a16273A41732c29609A2739L4001k871b5677o9617B14176G6802b17618j55167
$$ -116273 141732 -329609 12739 46740 43869 -25677 -95294 214176 76802 -217618 -372785
10802c72785C11027a59024C425J87740D4587R7534f4658C9484N1770J01742G7399
$$ -372785 311027 -159024 3425 191165 44587 142121 -64658 39484 91254 192996 77399
10790f0165p8762b3877l7954p5481k2998L9055G255a94446D01325c06454A33b45381
$$ -60165 -138927 -23877 -61831 -137312 -160310 -121255 7255 -194446 401325 -306454 133 -245381
10777A9402J71478h2663j75294h5659k2162b5064B89404a75236A57363f4278B18530
$$ 19402 190880 -82663 -257957 -85659 -107821 -25064 289404 -175236 157363 -64278 218530
10765B35265d7727j91116B09906j02157g1365l7017l075B31220d5250q3422M4770
$$ 235265 -47727 -238843 209906 107749 -71365 -108382 -111457 231220 -45250 -128672 -83902
10754h3902C9422P5791a74790c7908A89802J12486h122D861K7350L0401a64835
$$ -83902 39422 115213 -174790 -37908 189802 302288 -8122 4861 32211 62612 -164835
10742B24990i7605N787B1667d3829G2011a6564D83125A71923i6300K5014L177
$$ 224990 -97605 -91818 21667 -43829 72011 -16564 483125 171923 -96300 -71286 -68109
10731f8109A21825J21501r5358J56364f7347A07907b466I0155i8621b8518r5991
$$ -68109 121825 243326 147968 304332 -67347 107907 -2466 90155 -98621 -28518 -124509
10720a24509m7457h0436N468L6352a3477H3026a39721A0987b32606A17837g2784
$$ -124509 -171966 -80436 -74968 -38616 -13477 83026 -139721 10987 -232606 117837 -72784
10708a22210j02187i0930A0695g082k21298c9718B84379d78864F6813j4410i0818
$$ -122210 -224397 -90930 10695 -7082 -228380 -39718 284379 -478864 66813 52403 -90818
10696d7078j86093j43676A82853a34064C26463a91709g6013a3013j47102F322
$$ -47078 -233171 -376847 182853 -134064 326463 -191709 -76013 -13013 -160115 6322
10685c27739l9621R6827A7365a08212l54711a77092g6359a4339j96794j75146
$$ -327739 -367360 -270533 17365 -108212 -462923 -177092 -76359 -14339 -211133 -386279
10675c86279q1275h294A052N7528c36891A6068b13824I5179J15346g1326m3230
$$ -386279 -467554 -8294 1052 58580 -336891 16068 -213824 95179 210525 -71326 -114556
10664a14556j9884L0010F1010d64716i8926a0074C1575d78090D5656a19891K2994
$$ -114556 -134440 -104430 61010 -464716 -98926 -10074 31575 -478090 45656 -119891 -96897
10653i6897j80742j63084J55767A36933a98053C66059a3191A46425G2235h7445
$$ -96897 -277639 -440723 -284956 136933 -198053 366059 -13191 146425 72235 -87445
10642a65869b9284j30794A93329O1356a3292j84141A18569b65198a11487E0830
$$ -165869 -29284 -160078 193329 254685 -13292 -197433 118569 -265198 -111487 50830
10631A91324n9993a20604N8804k93673a18347A78677J04151c8716G1536R742c9127
$$ 191324 131331 -120604 -61800 -355473 -118347 178677 282828 -38716 71536 81278 -39127
10619a2370k53r2183A80003g6900m43163B40008f6158k14882l4203a28569E4826
$$ -12370 -12623 -104806 180003 -76900 -520063 240008 -66158 -281040 -315243 -128569 54826
10607a78437k03157I5716a17784a2236j07213j06917A18861C653a07729B5542
$$ -178437 -381594 95716 -117784 -12236 -119449 -226366 118861 3653 -107729 25542
10596A00994h3659f261k98903a01856K2718L7585E9381B2332c3400B31513b00858
$$ 100994 -83659 -6261 -305164 -101856 -79138 -41553 59381 22332 -33400 231513 -200858
10584b56552E7675R3b2200j15089K5844L9845j03186C90508g6560L808A88766
$$ -256552 57675 57768 -22200 -137289 -111445 -71600 -174786 390508 -76560 -72752 188766
10572f3318C26450b11761j71652A36319c37805J12214A6930h1855H3434k5310
$$ -63318 326450 -211761 -383413 136319 -337805 -225591 16930 -81855 83434 58124
10562E8124c96306F7103a23298c8202k32976g0354j14523A48014i5555a0519k14216
$$ 58124 -396306 67103 -123298 -38202 -271178 -70354 -184877 148014 -95555 -10519 -224735
10551b24735D7335J05335b82955A98793a78032h8147B98043G8932a13415C00305
$$ -224735 47335 152670 -282955 198793 -178032 -88147 298043 78932 -113415 300305
10540h0815j41296j12209A27234b42676a17286D5055b8858n4956A74343d823j0269
$$ -80815 -222111 -334320 127234 -242676 -117286 45055 -28858 -83814 174343 -4823 -15092
10529a5092I6842j7171a9627D4015c55778J69975I8534N1062a71783j5781m8974
$$ -15092 96842 79671 -19627 44015 -355778 -185803 98534 149596 -171783 -187564 -236538
10518b36538Q3591A11337Q3027a18506a6674j48524b498E8295B716J4037J40652
$$ -236538 -152947 111337 194364 -118506 -16674 -165198 -2498 58295 2716 16753 157405
10507A57405c04132i8324o4308E4950A909i0414j12261A28303a16469j40049A73810
$$ 157405 -304132 -98324 -162632 54950 1909 -90414 -202675 128303 -116469 -256518 173810
10495c36392R3199h9788F2723K03093b74347e5971f715B1740P971N9643a30725
$$ -336392 -243193 -89788 62723 265816 -274347 -55971 -6715 21740 29711 89354 -130725
10483a95117f1104b332j61631m9302D1083J40621j5262E8750K72324a24076I2926
$$ -195117 -61104 -2332 -163963 -213265 41083 181704 166442 58750 331074 -124076 92926
10471a15849D653K01298a22322A04377P374J9622D1929J38141b64393O9077I99
$$ -115849 4653 205951 -122322 104377 111751 131373 41929 180070 -264393 -195316 999
10459b15B55581a3275o271k3885p765I2515c03974B7898k063J27174a66796B15984
$$ -215 255581 -13275 -19546 -43431 -51196 92515 -303974 27898 25835 153009 -166796 215984
10446h2282K9823C4587b94647A22292D6712i537n8867L0271B10345a263A79186
$$ -82282 -52459 34587 -294647 122292 46712 -9537 -68404 -38133 210345 -1263 179186
10434b62756d5421B71901G2499a25472d760j61413A14483Q262h1769p8446L520
$$ -262756 -45421 271901 72499 -125472 -4760 -166173 114483 122745 -81769 -160215 -156695
10423a56695i978p6141n508A59282L5960d5738F556c35802F32990A70526D4965
$$ -156695 -9978 -86119 -91627 159282 195242 -45738 6556 -335802 632990 170526 44965
10411A06977a67215a7168j72511H2921b12556j03088A13779b0429A38492o2398
$$ 106977 -167215 -17168 -189679 82921 -212556 -315644 113779 -20429 138492 76094
10401G6094L6119c34123B9982J9177b7913k63895d9641J6472B3187M83181A9053
$$ 76094 112213 -334123 29982 49159 -27913 -291808 -49641 -33169 23187 506368 19053
10389C25806J16960B11887J49672a16667c6656A454b43878K1146n464a12179A89212
$$ 325806 442766 211887 361559 -116667 -36656 1454 -243878 -222732 -228196 -112179 189212
10377A28396K07483a1022C41642K11512a11713A65558p5589N2171a16027B16830
$$ 128396 335879 -11022 341642 553154 -111713 165558 89969 142140 -116027 216830
10366F19422k40320K33872K7169I9397m5883J73750E4682M2320J26967n2245R0909
$$ 619422 379102 612974 640143 99397 53514 227264 54682 97002 223969 171724 262633
10355B62633o2738a11292B76082K604L23153K1830N61A82945J52916M1884O9378
$$ 262633 199895 -111292 276082 278686 601839 623669 624230 182945 335861 377745 447123
10344D47123A99722a1433B61861n0137A04504K57795F7122d85262I2883J85916
$$ 447123 199722 -11433 261861 211724 104504 362299 67122 -485262 92883 278799
10334B78799r3514b2235B07355r9660F605a3435C04530H0825R5212C5271J75076
$$ 278799 185285 -22235 207355 107695 6605 -13435 304530 80825 176037 35271 210347
10323B10347J7434o4014a12999n6752A67165a19459A2170a51879A44458K76133
$$ 210347 227781 163767 -112999 -169751 167165 -119459 12170 -151879 144458 420591
10313D20591o298H3563k9919J00012J6614l0923i1771A09967e4424B82123D5594
$$ 420591 414293 83563 53644 153656 170270 139347 -91771 109967 -54424 282123 45594
10301a3606k28813A71956R6173a46755F7800j3899N3779l9702h3122g426A76088
$$ -13606 -242419 171956 268129 -146755 67800 53901 107680 67978 -83122 -7426 176088
10289f6077C72744A15179b35066i4159p5376e4985j59720b8961k12416F611L0867
$$ -66077 372744 115179 -235066 -94159 -169535 -54985 -214705 -28961 -241377 6611 37478
10278C7478L08252b73359A34897b0232k13354g473k33900A99721B5104J69745
$$ 37478 345730 -273359 134897 -20232 -233586 -7473 -241373 199721 25104 194849
10268A94849a4476G6714d2751j84940e2832l5912o2255g2318A65247e5143B99789
$$ 194849 -14476 76714 -42751 -227691 -52832 -88744 -150999 -72318 165247 -55143 299789
10256A65748p1689a02247o7528D29803j87979a24042F3649L7389j2564e4175j23584
$$ 165748 94059 -102247 -169775 429803 241824 -124042 63649 101038 88474 -54175 -177759
10245a77759f8865D2941J63726d7465k49342m2328a46359B79352a3980B2628J24599
$$ -177759 -68865 42941 206667 -47465 -296807 -339135 -146359 279352 -13980 22628 147227
10234A47227a41028k16002I1016a53372A41402j5511b0471B33728c14668i0963
$$ 147227 -141028 -357030 91016 -153372 141402 125891 -20471 233728 -314668 -90963
10223d288C9767a76365I1160K77717b53285b6307m202l36972a22355k1215f601
$$ -4288 39767 -176365 91160 368877 -253285 -26307 -30509 -367481 -122355 -143570 -6601
10211I6751a42580e5855E2858E615n86a17287C2715q556H96a02164A35709O52
$$ 96751 -142580 -55855 52858 5615 5029 -117287 32715 24159 896 -102164 135709 136361
10199A36361a0990A5382d9111l50741b7499k2880k2139A91575a3653l0226A199
$$ 136361 -10990 15382 -49111 -399852 -27499 -50379 -72518 191575 -13653 -43879 1199
10187a45315A22115C4988h4895C07784A13796a31521e8198k40305J02732Q0513
$$ -145315 122115 34988 -84895 307784 113796 -131521 -58198 -298503 -195771 -115258
10177a15258B05136e45766a70063l33454A60299p9314j0868b14479d9673A37171
$$ -115258 205136 -545766 -170063 -503517 160299 80985 70117 -214479 -49673 137171
10166i6530k16119e2758p4818r3532G4280d112B461e9902r8603B32035b11375
$$ -96530 -312649 -52758 -127576 -221108 74280 -4112 2461 -59902 -158505 232035 -211375
10154A70028d180A33233a1539C5687P2704o339i531j32264G151L683b8889l51893
$$ 170028 -4180 133233 -11539 35687 108391 102052 -9531 -141795 7151 10834 -28889 -380782
10142c80782H018b68276P877J19115F378a12358p8013C5481d6476k40361f5931
$$ -380782 8018 -268276 -260399 -141284 6378 -112358 -190371 35481 -46476 -286837 -65931
10130a01A17930a49846d4724B90876i1772k91309e2379j01968c4343B3424a12747
$$ -101 117930 -149846 -44724 290876 -91772 -383081 -52379 -154347 -34343 23424 -112747
10118a32101B98609a0171k40703r034B28824E8663a11640k5251N3852A01846D3756
$$ -132101 298609 -10171 -250874 -259908 228824 58663 -111640 -136891 -83039 101846 43756
10106a36673q0207O8452j18759f1061j33552F7307a19242J5303l94043b30362
$$ -136673 -216880 -148428 -267187 -61061 -194613 67307 -119242 -103939 -497982 -230362
10095A9350i6866j3958p463B7297e9100j43229O8314n7114B24502i8167k17102
$$ 19350 -96866 -110824 -118287 27297 -59100 -202329 -134015 -191129 224502 -98167 -315269
10084c15269D0614i3799B4106c42508a26093I133b33470B02193O417a38815k10529
$$ -315269 40614 -93799 24106 -342508 -126093 9133 -233470 202193 208610 -138815 -349344
10073c49344j1300G9218b93686D1281Q8490r829n7843a15110A92080a90705h6508
$$ -349344 -360644 79218 -293686 41281 129771 119942 62099 -115110 192080 -190705 -86508
10061a47953A10403f837k94894a50644k51627a95678O1514f5890j12592H2762
$$ -147953 110403 -6837 -301731 -150644 -402271 -195678 -134164 -65890 -178482 82762
10050A85293n1655a32792j37893A12430m6579g6656a7443j33686c3890k36563
$$ 185293 133638 -132792 -270685 112430 65851 -76656 -17443 -151129 -33890 -270453
10040b70453A7938L39682a25173J5916q3915P0648k55515R2564i9128H4670Q3131
$$ -270453 17938 357620 -125173 -109257 -193172 -122524 -378039 -285475 -99128 84670 167801
10029A67801g2473B98526e4220j16848D6800f4291b9944R33j24974L6576C2450
$$ 167801 -72473 298526 -54220 -171068 46800 -64291 -29944 -29011 -153985 -117409 32450
10017c02986L4045D4462i9613r0787j52772a59719g4629m666q1437B0812E904
$$ -302986 -268941 44462 -99613 -190400 -343172 -159719 -74629 -79295 -160732 20812 5904
10005H1782i8886F5945N7812k4770b49666a19470B12256h0687B3964a48120e7383
$$ 81782 -98886 65945 123757 98987 -249666 -119470 212256 -80687 23964 -148120 -57383
9993g7384b3921p857j2081k4370k8839r9924B8283J6328b97984A8900a1904j57502
$$ -77384 -23921 -31778 -43859 -68229 -97068 -196992 28283 44611 -297984 18900 -11904 -169406
9981a69406R9A08454f2299I0926K1378d27334C00313a67287A01220a17979b7772
$$ -169406 -169307 108454 -62299 90926 112304 -427334 300313 -167287 101220 -117979 -27772
9969b32724m7059a01532J5549F6958J50597q3892M335f0953B48191h8877j37286
$$ -232724 -279783 -101532 -85983 66958 217555 133663 137998 -60953 248191 -88877 -226163
9958b26163B41694b7202j4301k61193j16904B36050a17129A8535a50708D96701
$$ -226163 241694 -27202 -41503 -302696 -419600 236050 -117129 18535 -150708 496701
9947I7915d759j9078H2116h1807A98007P6201C3575b75886O4925Q3219A01346
$$ 97915 -4759 -23837 82116 -81807 198007 274208 33575 -275886 -210961 -127742 101346
9935c79922a17320q6162B8748k725J55611E6894J16410C7853b15204l7437B15154
$$ -379922 -117320 -203482 28748 26023 181634 56894 173304 37853 -215204 -252641 215154
9923D1720b01473m99894e349E3641J38845b7440D9170b82822A88528h9286j52602
$$ 41720 -201473 -701367 -5349 53641 192486 -27440 49170 -282822 188528 -89286 -241888
9912b41888A5821e6038k99008I2003a44778k75J8846A68905a61613j0993D11088
$$ -241888 15821 -56038 -355046 92003 -144778 -145053 -126207 168905 -161613 -172606 411088
9900b4986B56392b44320A04924a5032D52313i6284B11001d24262f5500j91481
$$ -24986 256392 -244320 104924 -15032 452313 -96284 211001 -424262 -65500 -256981
9890b56981R2515j25077C87201e1476m28602a88425i0878D4953J17741J14250
$$ -256981 -164466 -289543 387201 -51476 -480078 -188425 -90878 44953 162694 276944
9880B76944A13009m3935N1884a87155K973B305b48578R4549d1072j14358a9776
$$ 276944 113009 69074 120958 -187155 -184182 2305 -248578 -154029 -41072 -155430 -19776
9868d0257C4594b13741L4664j08923O8862a01042o556H7938c60167A30631b72087
$$ -40257 34594 -213741 -179077 -288000 -219138 -101042 -107598 87938 -360167 130631 -272087
9856a59269a7381k50876A41188f5390k78044F1432k4671J92352a90132h9742j04906
$$ -159269 -17381 -268257 141188 -65390 -343434 61432 36761 229113 -190132 -89742 -194648
9845a94648B08143i3534K2855j33191A24825O6350a66888B8781b8241j12513H2732
$$ -194648 208143 -93534 -70679 -203870 124825 191175 -166888 28781 -28241 -140754 82732
9833E745A610g5127a4285J125B04133c79338f1941q1830A02583c58460J10196
$$ 5745 1610 -75127 -14285 -13160 204133 -379338 -61941 -143771 102583 -358460 -248264
9822b48264A15932e3171o5895p8581i690o1597j14921d1028A34272a54511L6419
$$ -248264 115932 -53171 -119066 -197647 -9690 -71287 -186208 -41028 134272 -154511 -118092
9811a18092l6356B13177p4423k8895b59145A20660k6099D4797r93J3071A3874
$$ -118092 -154448 213177 138754 109859 -259145 120660 94561 44797 43804 56875 13874
9799A634J32431A3648a64176F083h4889M0017k7603j7685c7428k6k08399A83936
$$ 1634 134065 13648 -164176 6083 -84889 -44872 -72475 -90160 -37428 -37454 -245853 183936
9786b50408D715J37656a44553N0307j69277A18410N8978D3456A3849J19937a57278
$$ -250408 4715 142371 -144553 -94246 -263523 118410 177388 43456 13849 133786 -157278
9774e0642m2304k44376B17271N6637b1819k21555H9069B5619h7647B08477h5204
$$ -50642 -92946 -337322 217271 273908 -21819 -243374 89069 25619 -87647 208477 -85204
9762a33122j7677f5584B67143b07985D555J04800n2363j2966a78903m4384e5044
$$ -133122 -150799 -65584 267143 -207985 4555 109355 56992 44026 -178903 -223287 -55044
9750c84825e6464A27047e78871K69228H6613a9327i597o0028n6074k51111i3373
$$ -384825 -56464 127047 -578871 -309643 86613 -19327 -9597 -69625 -125699 -376810 -93373
9738i1961a7702k01928e1511D9905a58606L111p1165b2456o9099A85210c52719
$$ -91961 -17702 -219630 -51511 49905 -158606 -155495 -226660 -22456 -91555 185210 -352719
9726a61021L6783A51055b87201D3872a45013j10944M7937n567P4661a24A41294
$$ -161021 -124238 151055 -287201 43872 -145013 -255957 -208020 -213587 -138926 -124 141294
9714H5752J19252h4794A40847a72088j64394a18161B40332a48536j35580g9243
$$ 85752 205004 -84794 140847 -172088 -336482 -118161 240332 -148536 -284116 -79243
9703C31391b43473P1195f8743j44144P5666f3820j82565D9499R5220k5922K22706
$$ 331391 -243473 -172278 -68743 -212887 -137221 -63820 -246385 49499 144719 118797 341503
9692C41503A5634J97106c27043e3054k03101A63664J82986B2906N5844a0217F2520
$$ 341503 15634 212740 -327043 -53054 -256155 163664 346650 22906 78750 -10217 62520
9680B60314b52217a07639l1486j55178L7434O4102k10673F2601k8460c0627B62793
$$ 260314 -252217 -107639 -139125 -294303 -256869 -192767 -403440 62601 34141 -30627 262793
9668A53981a12720c0630a0239A9924c65559K0553B10734a70548n63669a17861
$$ 153981 -112720 -30630 -10239 19924 -365559 -345006 210734 -170548 -734217 -117861
9657A4707b59718f5122o3958C72284b64388j22490A31433n1451a89742C09843
$$ 14707 -259718 -65122 -129080 372284 -264388 -386878 131433 79982 -189742 309843
9646d30706a60452M8007L4984o8047j44955i8994r1048d8676A42490h1933C7164
$$ -430706 -160452 -112445 -77461 -145508 -290463 -98994 -190042 -48676 142490 -81933 37164
9634E8360a08699B87956F0682B8098L75984c85804e2785k79173B29305b28171
$$ 58360 -108699 287956 60682 28098 404082 -385804 -52785 -331958 229305 -228171
9623g7201A280R5457K01043j07536B5302a98430C28910a8669o4092j5657E6738
$$ -77201 1280 96737 297780 190244 25302 -198430 328910 -18669 -82761 -98418 56738
9611b16723n6684e882j48381j85372a32407K9405M2201I076N8263J46473p7053
$$ -216723 -273407 -5882 -154263 -339635 -132407 -103002 -60801 9076 67339 213812 136759
9600A36759c8038l21027n044A6058L0273R9189a7360n861j82790Q3671A05195
$$ 136759 -38038 -359065 -364109 16058 46331 145520 -17360 -23221 -206011 -122340 105195
9588c01476C08643b90259J41009c2969I0742a36705p0460d1987j28220A14532
$$ -301476 308643 -290259 -149250 -32969 90742 -136705 -207165 -41987 -170207 114532
9577a22671B05978K00081a8915k49553a6130k99842k8117A11817a63886C42a53887
$$ -122671 205978 406059 -18915 -268468 -16130 -315972 -344089 111817 -163886 342 -153887
9565B03399b7835B11b87405a18154n238B1074a28513L1961C84230e9734a3925
$$ 203399 -27835 211 -287405 -118154 -123392 21074 -128513 -96552 384230 -59734 -13925
9553A85831A8304c54739B7591J20320m5560b29865M7930B65089I8698a4944k45310
$$ 185831 18304 -354739 27591 147911 102351 -229865 -181935 265089 98698 -14944 -260254
9542b60254R622O2716h363G1506b21842P7037j9394g4375J5675j69913A98757
$$ -260254 -250632 -187916 -8363 71506 -221842 -144805 -164199 -74375 -58700 -228613 198757
9530a16031C02610o5785d48292E193O1796R2921b42379a02016B2657c81524A03381
$$ -116031 302610 236825 -448292 5193 66989 159910 -242379 -102016 22657 -381524 103381
9518I6850l1415B0379O5521b37298h1967j32666A84149a09320j81108C9218J24860
$$ 96850 65435 20379 85900 -237298 -81967 -214633 184149 -109320 -290428 39218 164078
9507A64078r987c33544e7205m7508k14836a47283k2594N0045k94450A46032h9664
$$ 164078 154091 -333544 -57205 -104713 -319549 -147283 -169877 -119832 -414282 146032 -89664
9495a50994b6103m0527k43395f621C1995c73684J74686K8722j53173a52146A71798
$$ -150994 -26103 -66630 -310025 -6621 31995 -373684 -198998 -170276 -323449 -152146 171798
9483e3986j97907J5004J08311a7215k39924A29781b39184E9313K80561a9105l77280
$$ -53986 -251893 -236889 -128578 -17215 -257139 129781 -239184 59313 339874 -19105 -396385
9472c96385R076b6726C2283a6965j36465e4669I6837a91223j59594D35887b60314
$$ -396385 -387309 -26726 32283 -16965 -153430 -54669 96837 -191223 -350817 435887 -260314
9460A05357R8131q6627i6762L7359A99138b23516I8275b32941F8026P3368f3961
$$ 105357 203488 116861 -96762 -59403 199138 -223516 98275 -232941 68026 141394 -63961
9448B9710J796a85757g8029o4185J2531J3394j48534B03759J77951a9910H707
$$ 29710 31506 -185757 -78029 -142214 -129683 -116289 -264823 203759 381710 -19910 8707
9436a53665I5742f6304r277J4606H4408e3104j17118j5163f9631R283j0986j78891
$$ -153665 95742 -66304 -75581 -60975 84408 -53104 -170222 -185385 -69631 -60348 -71334 -250225
9424b50225B35039c2318p3127B63952b76589l04560A83488a27080D09450j38218
$$ -250225 235039 -32318 -105445 263952 -276589 -581149 183488 -127080 409450 271232
9414B71232a9188j25991j33568A14200a4480B1795a515A1240L2821J07495N4392
$$ 271232 -19188 -145179 -278747 114200 -14480 21795 -1515 11240 44061 151556 205948
9403B05948b02995O5695j52010n7898a50247G9324a69339k6371b1495m10117K07321
$$ 205948 -202995 -137300 -289310 -347208 -150247 79324 -169339 -195710 -21495 -431612 -224291
9392b24291R612b5275l22264g7773e056j66509A36638A1048L183J53847f9933
$$ -224291 -214679 -25275 -347539 -77773 -5056 -171565 136638 11048 14231 168078 -69933
9380A2689a18901k39252d0046A03751J0240c9731j51784F6511b69594R0018D3265
$$ 12689 -118901 -358153 -40046 103751 113991 -39731 -191515 66511 -269594 -179576 43265
9368b44271J9691j28128J15780d7604A83801m6309N8634b3015j68514l2804i004
$$ -244271 -224580 -352708 -236928 -47604 183801 137492 196126 -23015 -191529 -224333 -9004
9356A90503a94263j40582J18496c9450I5914b32361j43270H3124a6382A52191
$$ 190503 -194263 -334845 -216349 -39450 95914 -232361 -375631 83124 -16382 152191
9345a79891A95176R734a77273Q1640B86170a89501n3526R8772A13716g2929A68334
$$ -179891 195176 204910 -177273 -95633 286170 -189501 -243027 -144255 113716 -72929 168334
9333f9681q9118f4862C10858j39643i0831D3977c8923j67637l39874B82545b13436
$$ -69681 -158799 -64862 310858 171215 -90831 43977 -38923 -206560 -546434 282545 -213436
9321g8590B73658d5678l55082A91258l8706G573J61561E1177K75653a21699k09406
$$ -78590 273658 -45678 -400760 191258 152552 7573 169134 51177 326830 -121699 -331105
9310c31105A20575B9300J8310J16665E7801J5341a78105B19928q0214B4503J34229
$$ -331105 120575 29300 47610 164275 57801 73142 -178105 219928 139714 24503 158732
9299A58732F152c01799K4119J28622l6942b0296j95997a6445k09354O2097K2018
$$ 158732 6152 -301799 -277680 -149058 -186000 -20296 -216293 -16445 -225799 -163702 -141684
9288a41684k65391d3794A52474M774a09867k73095C07601H5443d761j93500H030
$$ -141684 -407075 -43794 152474 157248 -109867 -382962 307601 85443 -4761 -198261 8030
9276a91548B6433J37603l9546b23868A99273A4683a5238n5734n6572j37578q8847
$$ -191548 26433 164036 124490 -223868 199273 14683 -15238 -70972 -127544 -265122 -353969
9265c53969C2948e7123j16968j69304H7531e9026b2170F6396J1345Q0166b3833
$$ -353969 32948 -57123 -174091 -343395 87531 -59026 -22170 66396 77741 157907 -23833
9253a17363j97404a13139L1359l3550B14617a79981A60359c24394B49606f1589
$$ -117363 -314767 -113139 -81780 -115330 214617 -179981 160359 -324394 249606 -61589
9242A4600Q291g5279c7216j20373f9210A79105a49592D8995d17598I5685M5541
$$ 14600 22891 -75279 -37216 -157589 -69210 179105 -149592 48995 -417598 95685 141226
9231A41226a01282B49504b01597j0594C98094A34938a82474h2178J6745A03927
$$ 141226 -101282 249504 -201597 -212191 398094 134938 -182474 -82178 -65433 103927
9220B5840R249b86698B05681b17413A726c158A53438E4836p166c3558F2245b33186
$$ 25840 35089 -286698 205681 -217413 1726 -3158 153438 54836 47670 -33558 62245 -233186
9207a66829E4659f9952j15176K6426l7200B57156b30820A21524b736k4407C01641
$$ -166829 54659 -69952 -185128 -158702 -195902 257156 -230820 121524 -2736 -27143 301641
9195B32526b95251B75660d73674C13775j20205a15832o9610A26521c69675a5896
$$ 232526 -295251 275660 -473674 313775 193570 -115832 -185442 126521 -369675 -15896
9184c5384A01616a43290c3021j78071A56146i8422M3935j2868j10637a7828j46152
$$ -35384 101616 -143290 -33021 -211092 156146 -98422 -54487 -67355 -177992 -17828 -163980
9173a63980d2939j48895G2257h7318b9944r6092n6145o7472d4689J6197p4362
$$ -163980 -42939 -191834 72257 -87318 -29944 -126036 -182181 -249653 -44689 -28492 -102854
9162a02854b9163j38132o389D8603a14543l26989d9404k73853l985D2127a6664
$$ -102854 -29163 -167295 -173684 48603 -114543 -441532 -49404 -323257 -327242 42127 -16664
9150A04543J24914e8924n372n8790C3310c28094a39964j80961A0902a0651o591
$$ 104543 229457 -58924 -64296 -123086 33310 -328094 -139964 -320925 10902 -10651 -17242
9139a7242j00268n5385F4621h4582n5420A31443b29773M3806A60369b32735r2850
$$ -17242 -117510 -172895 64621 -84582 -140002 131443 -229773 -185967 160369 -232735 -325585
9128c25585b4251r2488A26638c37748A45365b501j92376n2532i9840E976Q5728
$$ -325585 -24251 -116739 126638 -337748 145365 -2501 -194877 -247409 -99840 5976 91704
9117I1704b03472a3250A20260J49083a82883b7097D9426A3673c8903B35029p5481
$$ 91704 -203472 -13250 120260 269343 -182883 -27097 49426 13673 -38903 235029 159548
9106A59548F2464b19637J09638A17122k653f6366I3957C4438K02870b80197J00042
$$ 159548 62464 -219637 -109999 117122 114469 -66366 93957 34438 237308 -280197 -180155
9095a80155O8313A5556c1564o6997E7868d3744A2848a59650C4228a22525K7491
$$ -180155 -111842 15556 -31564 -98561 57868 -43744 12848 -159650 34228 -122525 -95034
9084i5034D9091R8385h2325j36510L4288A37965a27060j86075B74200H4505i4200
$$ -95034 49091 147476 -82325 -218835 -184547 137965 -127060 -313135 274200 84505 -94200
9072A98066g2672B6139a28232c8425m46324C44545G699c936l8432D6882a61409
$$ 198066 -72672 26139 -128232 -38425 -484749 344545 7699 -3936 -42368 46882 -161409
9060a37704O2475o3087A87465D0111a60051B0879a20388r1915A59942D4886A1945
$$ -137704 -75229 -138316 187465 40111 -160051 20879 -120388 -212303 159942 44886 11945
9048a93632c4976I4726f8318A32577b88048A62278n3797b58279Q5784O3635D2695
$$ -193632 -34976 94726 -68318 132577 -288048 162278 108481 -258279 -172495 -108860 42695
9036g2721j29502K8322m07645b81615d791A00451D8179c1873C2302f0556r4216
$$ -72721 -202223 -173901 -581546 -281615 -4791 100451 48179 -31873 32302 -60556 -154772
9025a54772j4187O9329p2092h5470C2427b00097F3382i8668B06398c03699C7627
$$ -154772 -168959 -99630 -171722 -85470 32427 -200097 63382 -98668 206398 -303699 37627
9013a32578K8180j51896J12849D37477a07303a2678E8837b98546a20503B4998
$$ -132578 -104398 -256294 -143445 437477 -107303 -12678 58837 -298546 -120503 24998
9002C4306c38353a20889C7207p079g7698k64791a20467p0314I768e05304b7263
$$ 34306 -338353 -120889 37207 30128 -77698 -342489 -120467 -190781 9768 -505304 -27263
8990f9742B47944c28058c8379j34655j93657K5251f4334c726j64724A72510e9818
$$ -69742 247944 -328058 -38379 -173034 -366691 -341440 -64334 -3726 -168450 172510 -59818
8978a22654G3416l2013J20705G8536c44106a00126n661G6415b58609F0572a58282
$$ -122654 73416 41403 162108 78536 -344106 -100126 -105787 76415 -258609 60572 -158282
8966a08530j40927n6388j03602a21245A26989a5409G6779C0522b4864a1287D4236
$$ -108530 -249457 -305845 -409447 -121245 126989 -15409 76779 30522 -24864 -11287 44236
8954A00017a73737P1829j6350o4599c7735a900m19561a241l58129P1213h5138
$$ 100017 -173737 -101908 -118258 -182857 -37735 -1900 -421461 -1241 -359370 -288157 -85138
8942C9361b7578k11819m4022b9430C6157d39619A18045D3096N74231a50986j16695
$$ 39361 -27578 -239397 -283419 -29430 36157 -439619 118045 43096 617327 -150986 -267681
8931b67681A45841C8292K3598J04826m528p3432K26748K60917J900777O662237
$$ -267681 145841 38292 61890 166716 162188 88756 315504 576421 2477198 9139435
8921I139435J1957669F637969B016739p92109n16711B73525G1328J823J23587
$$ 9139435 21097104 6637969 2016739 1224630 707919 273525 71328 73151 196738
8912A96738n710o475i5152C02777L42181B56798K04784B01977b7360k17781i6786
$$ 196738 191028 184553 -95152 302777 644958 256798 461582 201977 -27360 -245141 -96786
8900f36B39410j8758e4223j32574j0372J3213C35681g411j3554q0092k1548D75431
$$ -636 239410 220652 -54223 -186797 -197169 -183956 335681 -7411 -20965 -101057 -122605 475431
8887B24004D1177i4211E0021c16292c045j56980A73394g1085j47689a1553B09039
$$ 224004 41177 -94211 50021 -316292 -3045 -160025 173394 -71085 -218774 -11553 209039
8875b5485m54592E230J25035b76222A57417l3438e7123j09108j44888i8158J0516
$$ -25485 -480077 5230 130265 -276222 157417 123979 -57123 -166231 -311119 -98158 -87642
8864h7642l85313B37570E1318a15414I4298J36170b37995J13515D3510J27815
$$ -87642 -472955 237570 51318 -115414 94298 230468 -237995 -124480 43510 171325
$$ [...]
##END NTUPLES=NMR SPECTRUM
##END=
