
##TITLE=UV1219_M5_1296-1170_70_7229600_jnX9vRKcGx
##JCAMPDX= 6.0         $$ Bruker NMR JCAMP-DX V2.0
##DATA TYPE= NMR SPECTRUM
##DATA CLASS= NTUPLES
##ORIGIN= BRUKER
##OWNER= Administrator
$$ 1.72 TOPSPIN		Version 2.1
$$ 2013-01-23 20:29:18.125 -0500  Administrator@X
$$ Compression mode = diff/dup
##.OBSERVE FREQUENCY= 400.02188249412
##.OBSERVE NUCLEUS= ^1H
##.ACQUISITION MODE= SIMULTANEOUS (DQD)
##.ACQUISITION SCHEME= undefined
##.AVERAGES= 64
##.DIGITISER RES= 22
##SPECTROMETER/DATA SYSTEM= spect
##.PULSE SEQUENCE= noesygpps1d.comp
##.SOLVENT NAME= COFFEE_meoh
##.SHIFT REFERENCE= INTERNAL, COFFEE_meoh, 1, 14.96107
##AUDIT TRAIL= $$ (NUMBER, WHEN, WHO, WHERE, PROCESS, VERSION, WHAT)
$$ ##TITLE= Audit trail, TOPSPIN		Version 2.1
$$ ##JCAMPDX= 5.01
$$ ##ORIGIN= Bruker BioSpin GmbH
$$ ##OWNER= Administrator
$$ $$ E:\/data/COFFEE/nmr/UV1219_M5_1296-1170_70_7229600_jnX9vRKcGx/42/pdata/1/auditp.txt
$$ ##AUDIT TRAIL=  $$ (NUMBER, WHEN, WHO, WHERE, PROCESS, VERSION, WHAT)
(   1,<2013-01-23 20:29:12.344 -0500>,<Administrator>,<X>,<go>,<TOPSPIN 2.1>,
      <created by zg
	started at 2013-01-23 20:17:42.688 -0500,
	POWCHK enabled, PULCHK disabled,
       configuration hash MD5:
       86 BA 57 50 F2 9D 5C 9B 26 00 A9 28 5F 66 2E 89
       data hash MD5: 64K
       D4 5A 73 1B 86 14 C3 0B 30 64 14 C7 59 9D 43 6A>)
(   2,<2013-01-23 20:29:15.422 -0500>,<Administrator>,<X>,<proc1d>,<TOPSPIN 2.1>,
      <Start of raw data processing
       efp LB = 0.3 FT_mod = 6 PKNL = 1 PHC0 = 0 PHC1 = 0 SI = 128K 
       data hash MD5: 128K
       AA 54 07 7B 93 FA 4A 68 79 3B EA 2C 78 F9 DC D9>)
(   3,<2013-01-23 20:29:16.469 -0500>,<Administrator>,<X>,<proc1d>,<TOPSPIN 2.1>,
      <pk PHC0 = -77.0636 PHC1 = 0 
       data hash MD5: 128K
       68 3D 7E 1F 4D 69 EE C7 83 30 4E 24 C4 7D BA 67>)
(   4,<2013-01-23 20:29:17.125 -0500>,<Administrator>,<X>,<proc1d>,<TOPSPIN 2.1>,
      <abs ABSG = 1 
       data hash MD5: 128K
       15 A3 87 6E EB C5 45 49 6C 5D 46 05 7A F1 CA 06>)
(   5,<2013-01-23 20:29:17.297 -0500>,<Administrator>,<X>,<proc1d>,<TOPSPIN 2.1>,
      <abs ABSG = 2 
       data hash MD5: 128K
       93 20 D3 F1 EF 1F 2D A9 1E 56 FC E2 DA 6F D1 6C>)
(   6,<2013-01-23 20:29:17.453 -0500>,<Administrator>,<X>,<proc1d>,<TOPSPIN 2.1>,
      <abs ABSG = 3 
       data hash MD5: 128K
       A4 C8 34 66 62 F1 2A 99 F9 06 2A BF 25 F8 26 A8>)
(   7,<2013-01-23 20:29:17.625 -0500>,<Administrator>,<X>,<proc1d>,<TOPSPIN 2.1>,
      <abs ABSG = 4 
       data hash MD5: 128K
       75 DD E3 07 A5 75 7B F0 E1 BB 89 77 3A F9 45 6C>)
(   8,<2013-01-23 20:29:17.797 -0500>,<Administrator>,<X>,<proc1d>,<TOPSPIN 2.1>,
      <abs ABSG = 5 
       data hash MD5: 128K
       56 57 C5 66 C9 2C 9F 93 07 B6 CF 15 DA 13 B9 BF>)
$$ ##END=
$$ 
$$ $$ hash MD5
$$ $$ 8B B8 08 C3 AD 6B 38 73 8F 6A 6A 62 84 CB 4D B1
##$RELAX= 
##$RELAX= 
##$RELAX= 
##$RELAX= 
##$RELAX= 
##$RELAX= 
##$RELAX= 
##$RELAX= 
$$ Bruker specific parameters
$$ --------------------------
##$DU= <E:\>
##$EXPNO= 42
$$ [...]
150 150 150 150 150 150 150 150
##$TP07= 0
##$TPNAME0= <>
##$TPNAME1= <>
##$TPNAME2= <>
##$TPNAME3= <>
##$TPNAME4= <>
##$TPNAME5= <>
##$TPNAME6= <>
##$TPNAME7= <>
##$TPOAL= (0..7)
0.5 0.5 0.5 0.5 0.5 0.5 0.5 0.5
##$TPOFFS= (0..7)
0 0 0 0 0 0 0 0
##$TUNHIN= 0
##$TUNHOUT= 0
##$TUNXOUT= 0
##$USERA1= <user>
##$USERA2= <user>
##$USERA3= <user>
##$USERA4= <user>
##$USERA5= <user>
##$V9= 5
##$VALIST= <valist>
##$VCLIST= <CCCCCCCCCCCCCCC>
##$VD= 0
##$VDLIST= <DDDDDDDDDDDDDDD>
##$VPLIST= <PPPPPPPPPPPPPPP>
##$VTLIST= <TTTTTTTTTTTTTTT>
##$WBST= 1024
##$WBSW= 4
##$XGAIN= (0..3)
0 0 0 0
##$XL= 0
##$YL= 0
##$YMAX_a= 6328060
##$YMIN_a= -12535202
##$ZGOPTNS= <>
##$ZL1= 120
##$ZL2= 120
##$ZL3= 120
##$ZL4= 120
##$ABSF1= 14.96107
##$ABSF2= -5.597112
##$ABSG= 5
##$ABSL= 3
##$ALPHA= 0
##$AQORDER= 0
##$ASSFAC= 0
##$ASSFACI= 0
##$ASSFACX= 0
##$ASSWID= 0
##$AUNMP= <proc_prof1d_extract.lims>
##$AXLEFT= 0
##$AXNAME= <>
##$AXNUC= <1H>
##$AXRIGHT= 0
##$AXTYPE= 0
##$AXUNIT= <>
##$AZFE= 0.1
##$AZFW= 0.1
##$BCFW= 0
##$BC_mod= 0
##$BYTORDP= 0
##$COROFFS= 0
##$CY= 15
##$DATMOD= 1
##$DC= 0
##$DFILT= <>
##$DTYPP= 0
##$F1P= 0
##$F2P= 0
##$FCOR= 0.5
##$FTSIZE= 131072
##$FT_mod= 6
##$GAMMA= 0
##$GB= 0
##$INTBC= 1
##$INTSCL= 1
##$ISEN= 128
##$LB= 0.3
##$LEV0= 0
##$LPBIN= 0
##$MAXI= 10000
##$MC2= 0
##$MEAN= 0
##$ME_mod= 0
##$MI= 0
##$NCOEF= 0
##$NC_proc= -2
##$NLEV= 6
##$NOISF1= 0
##$NOISF2= 0
##$NSP= 0
##$NTH_PI= 0
##$NZP= 0
##$OFFSET= 14.96107
##$PC= 1
##$PHC0= -77.0636
##$PHC1= 0
##$PH_mod= 1
##$PKNL= yes
##$PPARMOD= 0
##$PPDIAG= 0
##$PPIPTYP= 0
##$PPMPNUM= 2147483647
##$PPRESOL= 1
##$PSCAL= 4
##$PSIGN= 0
##$PYNMP= <proc.py>
##$REVERSE= no
##$SF= 400.020009606834
##$SI= 131072
##$SIGF1= 0
##$SIGF2= 0
##$SINO= 400
##$SIOLD= 131072
##$SPECTYP= <>
##$SREGLST= <1H.CDCl3>
##$SSB= 0
##$STSI= 131072
##$STSR= 0
##$SW_p= 8223.68421052631
##$SYMM= 0
##$S_DEV= 0
##$TDeff= 65536
##$TDoff= 0
##$TI= <>
##$TILT= no
##$TM1= 0
##$TM2= 0
##$TOPLEV= 0
##$USERP1= <user>
##$USERP2= <user>
##$USERP3= <user>
##$USERP4= <user>
##$USERP5= <user>
##$WDW= 1
##$XDIM= 131072
##$YMAX_p= 438278647
##$YMIN_p= -25955
##$CURPLOT= <Network HP LaserJet P1505>
##$CURPRIN= <$Network HP LaserJet P1505>
##$DFORMAT= <normdp>
##$LAYOUT= <+/1D_H.xwp>
##$LFORMAT= <normlp>
##$PFORMAT= <normpl>
##$SURQMSG= 1
$$ End of Bruker specific parameters
$$ ---------------------------------
##NTUPLES= NMR SPECTRUM
##VAR_NAME=  FREQUENCY,     SPECTRUM/REAL,   SPECTRUM/IMAG
##SYMBOL=    X,             R,               I
##VAR_TYPE=  INDEPENDENT,   DEPENDENT,       DEPENDENT
##VAR_FORM=  AFFN,          ASDF,            ASDF
##VAR_DIM=   131072,        131072,          131072
##UNITS=     HZ,            ARBITRARY UNITS, ARBITRARY UNITS
##FACTOR=    0.0627417313425164, 1,          1
##FIRST=     8223.62146879497, 1316,         -57346
##LAST=      0,             2561,            -57441
##MIN=       0,             -25955,          0
##MAX=       8223.62146879497, 438278647,    0
$$ Real data points
##PAGE= N=1
##DATA TABLE= (X++(R..R)), XYDATA
$$ [...]
61605D73862m216m715n002n306n793o295o362n715m689l935l621l262k505j719
61591D10727j525k025k811l503l923l950l553k940k387k015j848j973k415l007
61577C72852l561m000m173l726k515j010n6j67j142k258k824k749k585k805l081
61562C36200k710j689q69p26o41J94J522K308K044J221N20P0l98r40j107l44J238
61545C35893K521K306P30o52o25L03O87O6o22m21N03J383J916K411L025L363K996
61528C55783K202J771J957J972R61p11j769j721j529k199l314l648k847j819j493
61513C43596j849k279k336j955j287o35l29m14n54l72R3M31M02K54L70O02L31
61496C34069o62j668j808j069j86L20M71L33m6k54K19J065J285N15m72q83q12
$$ plain form
61605 473862 469646 464931 459929 454623 448830 442535 436173 430458 425769 421834 418213 414951 412446 410727
61591 410727 409202 407177 404366 400863 396940 392990 389437 386497 384110 382095 380247 378274 375859 372852
61577 372852 369291 365291 361118 357392 354877 353867 353811 353644 352502 350244 347420 344671 342086 339281 336200
61562 336200 333490 331801 330932 330206 329565 329759 331281 333589 335633 336854 337374 337444 337046 336106 334999 334655 335893
61545 335893 338414 340720 341450 340798 340173 340476 341163 341229 340607 340186 340689 342072 343988 346399 349424 352787 355783
61528 355783 357985 359756 361713 363685 364646 363935 362166 360445 358916 356717 353403 349755 346908 345089 343596
61513 343596 341747 339468 337132 335177 333890 333255 332926 332512 331958 331586 331679 332110 332512 332766 333136 333738 334069
61496 334069 333407 331739 329931 328862 328676 328996 329467 329800 329754 329500 329719 330784 332069 332584 332112 331229 330417
61479C30417n89l1R48J645J384N95K46N26Q41R02R34R58O98K36m1j74o21j334
61461C37540j603j023j61J37k60p10n16L85J334J558J008M31M45Q16R74Q29O61
61444C41845N08K99L11Q32J460J556J329J659K770L796L958L485L032K829K793
61429C72462L015L572M072L882K832J439M91L66P97J256J591K073K720K947K348
61414D05863J487J388K255L288L615K943J371p31k607l462l206k466j857j626
61400D06255j893k589l133k928k228j894k131k266j954j727j882j779r08K3k9
61385C78937r37j595j370o01K39J096J970K556K485J707O26j5L96J636K633K616
61369C92379K097K227L248M168M142L507L125L083K722J789J036J310K452L493
$$ plain form
61479 330417 329828 329797 330745 332390 333774 334369 334615 335141 335982 336884 337818 338776 339474 339710 339669 339495 338874 337540
61461 337540 335937 334914 334753 334890 334630 333920 333404 333789 335123 336681 337689 338120 338565 339381 340355 341184 341845
61444 341845 342353 342652 342963 343795 345255 346811 348140 349799 352569 356365 360323 363808 366840 369669 372462
61429 372462 375477 379049 383121 387003 389835 391274 391765 392131 392928 394184 395775 397848 400568 403515 405863
61414 405863 407350 408738 410993 414281 417896 420839 422210 421479 418872 415410 412204 409738 407881 406255
61400 406255 404362 401773 398640 395712 393484 391590 389459 387193 385239 383512 381630 379851 378943 378966 378937
61385 378937 378000 376405 375035 374434 374673 375769 377739 380295 382780 384487 385113 385098 385494 387130 389763 392379
61369 392379 394476 396703 399951 404119 408261 411768 414893 417976 420698 422487 423523 424833 427285 430778
61355D30778L833L797L918M205M416M735N611P027Q461R581J0565J1610J2555
61342E21092J3179J3509J3525J2858J1075Q259N113K527J005L68q2r36k157l247
61328E96088l862m123m368m805n385n840n928n791n785n832n252l730k095j467
61314E31825j765j866j216l93N8N13J475K642L424L893M619N824P242Q654J0079
61299E75008J1495J2720J3512J3603J2759J0943Q283M895R80k828n729p559q856
61286F39226r982j0628j0463r721q712p295n361l438k219j635r82J37J402K242
61272E72571K434K348K739M105O053P585Q282Q737R574J0470J0684J0150R525
61259F65257R305R512J0037J0837J1863J3167J4923J6972J8474J8492J6789J3766
$$ plain form
61355 430778 434611 438408 442326 446531 450947 455682 461293 468320 476781 486362 496927 508537 521092
61342 521092 534271 547780 561305 574163 585238 593497 598610 601137 602142 602510 602428 601492 599335 596088
61328 596088 592226 588103 583735 578930 573545 567705 561777 555986 550201 544369 539117 535387 533292 531825
61314 531825 530060 528194 526978 526585 526643 527156 528631 531273 534697 538590 543209 549033 556275 564929 575008
61299 575008 586503 599223 612735 626338 639097 650040 658323 663218 664198 661370 655641 648082 639226
61286 639226 629244 618616 608153 598432 589720 582425 577064 573626 571407 569772 568790 568927 570329 572571
61272 572571 575005 577353 580092 584197 590250 597835 606117 614854 624428 634898 645582 655732 665257
61259 665257 674562 684074 694111 704948 716811 729978 744901 761873 780347 798839 815628 829394
61247H29394R886N547J224k772o483r854j2322j3366j3296j2958j2810j2745j2513
61234G36932j1835j0298p916n642m590m693m783m130l214k767k623j948k99J816
61220F74010L404L946L937M287N079N314M199K293P91J17r1L0O15J275J317Q97
61204G11420R26J582J849J038j41o24l95j9O72K502N653R237J2272J4584J6565
61189G77121J8489K0320K1978K3432K4414K4339K2776K0028J6857J3627J0149
61178I93530O617M073L308L654L599K419N55j425l385n151o463p609r274j1459
61164I72989j3264j4065j4231j4381j4639j5083j6069j7442j8089j7097j4985
61153H03644j3038j1710j0414q720o988n751n048m508l747k572j021O58K194L315
$$ plain form
61247 829394 839280 844827 846051 843279 836796 826942 814620 801254 787958 775000 762190 749445 736932
61234 736932 725097 714799 706883 701241 696651 691958 687175 683045 679831 677064 674441 672493 672194 674010
61220 674010 677414 681360 685297 689584 694663 699977 704176 706469 707260 707377 707286 707316 707931 709206 710523 711420
61204 711420 712346 713928 715777 716815 716674 716050 715655 715636 716308 718810 724463 733700 745972 760556 777121
61189 777121 795610 815930 837908 861340 885754 910093 932869 952897 969754 983381 993530
61178 993530 1000147 1004220 1007528 1011182 1014781 1017200 1017755 1016330 1012945 1007794 1001331 993722 984448 972989
61164 972989 959725 945660 931429 917048 902409 887326 871257 853815 835726 818629 803644
61153 803644 790606 778896 768482 759762 752774 747023 741975 737467 733720 731148 730127 730785 732979 736294
61139G36294L617K634L00k856o061q726j0411j0757r756p924n987m459l478k761
61125F69669j660K90K784N102P041R037J1236J3217J4845J6646J8854K0794K1833
61112H09688K2327K3011K3902K4584K5054K5474K5439K4396K2610K0899J9540
61101A066924J8175J6743J5598J4692J3368J1187Q290M793M70m709j0198j5259
61089A140074j9364k2168k3636k4320k5042k6010k6579k6043k4374k2180k0295
61078H80063j9382j9439j9536j8523j6252j3698j1828j0720r930r159q246p005
61066G16345n527m347l752l177j882j73P23K71m45R0J986L982N190O035P236Q626
61050G31181R629J0298J1048J1796J2352J3371J5693J8754K0967K1918K2908K4821
$$ plain form
61139 736294 739911 742545 742845 739989 733928 725202 714791 704034 694278 686354 680367 675908 672430 669669
61125 669669 668009 668299 671083 676185 683226 692263 703499 716716 731561 748207 767061 787855 809688
61112 809688 832015 855026 878928 903512 928566 954040 979479 1003875 1026485 1047384 1066924
61101 1066924 1085099 1101842 1117440 1132132 1145500 1156687 1164977 1169770 1170240 1165531 1155333 1140074
61089 1140074 1120710 1098542 1074906 1050586 1025544 999534 972955 946912 922538 900358 880063
61078 880063 860681 841242 821706 803183 786931 773233 761405 750685 740755 731596 723350 716345
61066 716345 710818 706471 702719 699542 697660 697487 698210 698481 698036 698126 700112 704094 709284 715319 722555 731181
61050 731181 740810 751108 762156 773952 786304 799675 815368 834122 855089 877007 899915 924736
61038I24736K6818K7915K8520K9400L0205L0338L0300L0836L1487L1436L1184
61027A253175L1878L3425L4781L5784L7221L9328M1724M4630M8615N3172N7001
61016A710734N9664O1571O2617O2589O2916O6077P3010Q2785R4902J09857J27089
61005B573811J44478J60688J76519J93793K14933K43874K85011L40924M13387
60996D747418N06521O25806P74632R56602J180983J458901J793883K186438K646903
60987A6878087L173349L681859L966844L788272L056576J945607Q04878n2930
60979C7242542m88614n08234j80577L62932Q76112J039664O36887k85610j438849
60970C7256253k478709l187266l518104l531633l321947k983704k598944k223572
$$ plain form
61038 924736 951554 979469 1007989 1037389 1067594 1097932 1128232 1159068 1190555 1221991 1253175
61027 1253175 1285053 1318478 1353259 1389043 1426264 1465592 1507316 1551946 1600561 1653733 1710734
61016 1710734 1770398 1831969 1894586 1957175 2020091 2086168 2159178 2241963 2336865 2446722 2573811
61005 2573811 2718289 2878977 3055496 3249289 3464222 3708096 3993107 4334031 4747418
60996 4747418 5253939 5879745 6654377 7610979 8791962 10250863 12044746 14231184 16878087
60987 16878087 20051436 23733295 27700139 31488411 34544987 36490594 37295472 37242542
60979 37242542 36753928 36245694 36065117 36428049 37304161 38343825 38980712 38695102 37256253
60970 37256253 34777544 31590278 28072174 24540541 21218594 18234890 15635946 13412374
60962A3412374j882717j582232j322405j101400r14144p55242o22388n14672m29463
60953D287711l62890l11615k72210k40519k13412j90004j69932j51878j34874
60944B240377j19284j05298r2096p9878p0866o6633o5901o6437o7596o9163o9413
60933A367812o6701o2048n7880n4697n0991m6111m1130l7015l3582l0447k7590
60922H59620k4856k2061j9558j7714j6078j4030j1972j0729j0102r123p532n862
60910F90003m328k823j732j524j603q73N60J392R40j64j208k243l460m651n568
60895F62718o178o454o498o782p580q391q653q759r398j0194j0059q838p526o850
60881E50558o646o695p053p454p369o864o484o197n369l949k680j964j392n64
$$ plain form
60962 13412374 11529657 9947425 8625020 7523620 6609476 5854234 5231846 4717174 4287711
60953 4287711 3924821 3613206 3340996 3100477 2887065 2697061 2527129 2375251 2240377
60944 2240377 2121093 2015795 1923699 1843821 1772955 1706322 1640421 1573984 1506388 1437225 1367812
60933 1367812 1301111 1239063 1181183 1126486 1075495 1029384 988254 951239 917657 887210 859620
60922 859620 834764 812703 793145 775431 759353 745323 733351 722622 712520 703397 695865 690003
60910 690003 685675 682852 681120 679596 677993 677120 677680 679072 680012 679848 678640 676397 672937 668286 662718
60895 662718 656540 650086 643588 636806 629226 620835 612182 603423 594025 583831 573772 564934 557408 550558
60881 550558 543912 537217 530164 522710 515341 508477 501993 495796 490427 486478 483798 481834 480442 479878
60867D79878M92J796L398M759N175N000N377O516P327P073O332N882N675N454
60853E50134N419N722O037O142O169N969N104L811L044L104L227K949K757K770
60839F12358K033Lk414m268o038q448j0708j1378j0455r259q596q207p901p860
60825E18862p832p178n963n056m898m960m673m156l760l385k745j833r43l97l49
60810D60734o21p38l39M74J356K181K992L744M456N351O487P377P534P240P257
60795E15485P789Q302Q485Q873J0192J2373J4555J6023J6903J7829J9003J9869
60783F75681J9948J9768K0346K1723K2693K2412K1649K1787K2920K3802K3545
60772I16274K2611K1899K1521K0899J9628J7740J5300J2163Q270L971k21m077
$$ plain form
60867 479878 480370 482166 485564 490323 495498 500498 505875 512391 519718 526791 533123 539005 544680 550134
60853 550134 555553 561275 567312 573454 579623 585592 590696 594507 597551 600655 603882 606831 609588 612358
60839 612358 614391 614394 611980 607712 601674 593226 582518 571140 560685 551426 542830 534623 526722 518862
60825 518862 511030 503852 497889 492833 487935 482975 478302 474146 470386 467001 464256 462423 461480 461083 460734
60810 460734 460113 459375 459036 459510 460866 463047 466039 469783 474239 479590 486077 493454 500988 508228 515485
60795 515485 523274 531576 540061 548934 559126 571499 586054 602077 618980 636809 655812 675681
60783 675681 695629 715397 735743 757466 780159 802571 824220 846007 868927 892729 916274
60772 916274 938885 960784 982305 1003204 1022832 1040572 1055872 1068035 1076305 1080276 1080055 1075978
60760A075978p812j1683j5551j8948k1565k3523k5076k6224k6744k6632k6292
60749H45928k6159k6083k5338k3476k1073j9159j7976j6857j5485j4522j4530
60738F25270j4921j4766j4087j3453j2715j1282r484q408q246p938o738n142l864
60725D94226k923k194j913k012j735o25P61J650J882J532N38p27j342j088r52
60710D85078j664k525k680k693l620n165o073o067o078o624p147p061o519n943
60696D15219n562n482n603n421m615l628l067k688j829o08K01L64L35K36k74r60
60680C76618r49j6J004J473J788K468L200L449L382L512L777L658L076K609K756
60665D11805L308L543L017J979R77J57o85j354j170J0J255J657J542J856K745
$$ plain form
60760 1075978 1068166 1056483 1040932 1021984 1000419 976896 951820 925596 898852 872220 845928
60749 845928 819769 793686 768348 744872 723799 704640 686664 669807 654322 639800 625270
60738 625270 610349 595583 581496 568043 555328 544046 534562 526154 517908 509970 503232 498090 494226
60725 494226 491303 489109 487196 485184 483449 482824 483585 485235 487117 488649 489187 488460 487118 486030 485078
60710 485078 483414 480889 478209 475516 471896 466731 460658 454591 448513 441889 434742 427681 421162 415219
60696 415219 409657 404175 398572 393151 388536 384908 381841 379153 377324 376716 376917 377281 377616 377852 377578 376618
60680 376618 375669 375653 376657 378130 379918 382386 385586 389035 392417 395929 399706 403364 406440 409049 411805
60665 411805 415113 418656 421673 423652 424629 424786 424101 422747 421577 421587 422842 424499 426041 427897 430642
60650D30642L606M328N416O896Q001Q195P706O914N943N026M405L698K167q9j987
60635E00867k848l148l542l974m205m438m737m593l749k942k994l563l620k866
60621D49648k005j678j808k006k085k068k034k029j976j744j420j336j584j787
60607D24088j538r02k05L64P19P58O26P73J375J899J711R58L87L50N03M89M85
60590D32840Q27J433J816J592Q69J54J8O60J672K273J932R31K03M73J546K585
60574D51824L124L456M035M884N890P296R321J1559J3311J4521J5844J7786K0306
60561E83157K3225K6416K9314L0866L0288K7579K3119J7156J0005K334n132j1812
60549G86515j7005j9823j9950j8165j5588j2498q459l485J478N483Q574J1652
$$ plain form
60650 430642 434248 438576 443992 450888 458889 467084 474790 481704 487647 492673 497078 500776 502943 502854 500867
60635 500867 498019 494871 491329 487355 483150 478712 473975 469382 465633 462691 459697 456134 452514 449648
60621 449648 447643 445965 444157 442151 440066 437998 435964 433935 431959 430215 428795 427459 425875 424088
60607 424088 422550 421648 421443 421807 422526 423284 423910 424683 426058 427957 429668 430626 431013 431363 431866 432355 432840
60590 432840 433667 435100 436916 438508 439377 439531 439549 440209 441881 444154 446086 447017 447220 447693 449239 451824
60574 451824 454948 458404 462439 467323 473213 480509 489830 501389 514700 529221 545065 562851 583157
60561 583157 606382 632798 662112 692978 723266 750845 773964 791120 801125 803459 798327 786515
60549 786515 769510 749687 729737 711572 695984 683486 675027 671542 673020 678503 687077 698729
60537F98729J5553K0524K6381L2728L8877M3839M6729M7116M4867L9724L1483
60526A086550K0742R145j417r771j5616j9110k0658k0898k0411j9352j7672j5683
60514I55849j4114j3524j3681j3645j2522j0278p754n593l337j83L492O279P712
60501H78701R155J2114J6532K1646K7683L5442M4635N4099O3517P3621Q4554R5165
60489A416864J04153J10755J14141J13293J08012R9152Q7427P2895N5963L7776
60479B320431J8929j266k3332m6097o7355q5555j00194j11011j17613j19714j17342
60468A549881j11048j02208r2611q3342p4396o5610n7334m9857m2902l6377l0985
60457H03211k7401k5171k3095k0420j7243j4096j1614j0221r703r404r172r515
$$ plain form
60537 698729 714282 734806 761187 793915 832792 876631 923360 970476 1015343 1055067 1086550
60526 1086550 1107292 1116437 1115020 1105249 1089633 1070523 1049865 1028967 1008556 989204 971532 955849
60514 955849 941735 928211 914530 900885 888363 878085 870331 864738 861401 861218 864710 870989 878701
60501 878701 887856 899970 916502 938148 965831 1001273 1045908 1100007 1163524 1237145 1321699 1416864
60489 1416864 1521017 1631772 1745913 1859206 1967218 2066370 2153797 2226692 2282655 2320431
60479 2320431 2339360 2338094 2314762 2268665 2201310 2115755 2015561 1904550 1786937 1667223 1549881
60468 1549881 1438833 1336625 1244014 1160672 1086276 1020666 963332 913475 870573 834196 803211
60457 803211 775810 750639 727544 707124 689881 675785 664171 653950 644247 634843 625671 616156
60445F16156j0448j0879r842p833o163n400n108m737m077l109k040j229o14L17
60431E44994J532K018J183j3k92J7n43k293l913m269l700l090k613j928j028l10
60415E25752l3n4n5J28K92R7l98o83n10l38o86j292j417q05J03Q34J264J525J805
60396E25529K236K617K492J785J120J117J646K119K241K137K058K300L007L655
60382E56059L288J722K5p19n35J29J325L003M175L969L015K628K944L068K820
60367E86916K925L606M266M724N403O128O046M992L824L052K306J502J189J314
60353F38193J033M28J020L603O758Q752R947J2046J5605J9698K3554K7139L0162
60340G97938L1787L1543K9519K5586J9275J0844J667o801j4030k0066k4691k7387
$$ plain form
60445 616156 605708 594829 584987 577154 570991 565591 560483 555746 551669 548560 546520 545291 544677 544994
60431 544994 546526 548544 549727 549714 549422 549439 548896 546603 542690 538421 534721 531631 529018 527090 526062 525752
60415 525752 525719 525665 525610 525738 526030 526127 525729 525046 524536 524198 523512 522220 520803 519998 520101 520935 522199 523724 525529
60396 525529 527765 530382 532874 534659 535779 536896 538542 540661 542902 545039 547097 549397 552404 556059
60382 556059 559347 561069 561094 560375 559840 559969 561294 564297 568472 572441 575456 578084 581028 584096 586916
60367 586916 589841 593447 597713 602437 607840 613968 620014 625006 628830 631882 634188 635690 636879 638193
60353 638193 639226 639654 640674 644277 651035 659787 669734 681780 697385 717083 740637 767776 797938
60340 797938 829725 861268 890787 916373 935648 946492 948159 941358 927328 907262 882571 855184
60328H55184k7944k6779k4641k2051j9115j5835j2633j0214q809p719n995l506
60316F69943j093L98R11R92J024R63Q17J064K216L961N313N942O890R370J3139
60301G21850J6945K0665K5836L3358M1335M6200M6011M1967L6621L1106K4511
60290A086405J5657N052n262j3571j9852k5032k9404l2473l4193l5404l6599l7015
60278H38309l5649l2761k9575k6704k3676k0174j6897j4766j3699j2728j1177
60267F00503r293p689o569n696m890m265l942l761l358k513j419o00m82r74j535
60252E43517j749j709j584j143j84P15O70j20l05Q06K088K068R51K19N12J028
60236E45780R73N31J48j64l67j1J090K392L349M112M989N664N638N097M674M438
$$ plain form
60328 855184 827240 800461 775820 753769 734654 718819 706186 695972 687163 679444 673449 669943
60316 669943 668850 669248 670159 671151 672175 673138 673955 675019 677235 681196 686509 692451 699341 708711 721850
60301 721850 738795 759460 785296 818654 859989 906189 952200 994167 1030788 1061894 1086405
60290 1086405 1102062 1107114 1101852 1088281 1068429 1043397 1013993 981520 947327 911923 875324 838309
60278 838309 802660 769899 740324 713620 689944 669770 652873 638107 624408 611680 600503
60267 600503 591210 583521 576952 571256 566366 562101 558159 554398 551040 548527 547108 546508 546026 545052 543517
60252 543517 541768 540059 538475 537332 537148 537863 538533 538413 538108 538914 541002 543070 544021 544240 544752 545780
60236 545780 546753 547284 547432 547268 546901 546890 547980 550372 553721 557833 562822 568486 574124 579221 583895 588333
60220E88333L797K469J012K06J82L94L26K8OO33J718K658K994K780K480K556L071
60203F15643L601L670L400L420M006M529M210L150K120J462Q59K00j18m3l06j433
60187F48370k727k935j763k54M04O1n84r72j245j773k399k456j565j96Q12J102
60171F31880R33P02O61R32J443J891K152K593L553M646N056M471L264J850M55
60156F66482n90j096j559k715m328n206m707l486k366j256K87K028L396M364N323
60141F54571O316P055P482P773P914P769P420P030O519N760M985M514M208L615
60127G42931K547J149m56k161l623m485m890n281n665n502m470l024j884j173
60113G04013m05O85J580J559P56K53Q97K353L673M489N119N649N721N254M665
$$ plain form
60220 588333 592130 594599 595611 595817 595999 596393 596719 596747 596753 597386 599104 601762 604756 607536 610016 612572 615643
60203 615643 619244 622914 626314 629734 633740 638269 642479 645629 647749 649211 650070 650270 650152 650109 649803 648370
60187 648370 645643 642708 640945 640691 641095 641156 640572 639600 638355 636582 634183 631727 630162 629966 630778 631880
60171 631880 632813 633515 634176 635108 636551 638442 640594 643187 646740 651386 656442 660913 664177 666027 666482
60156 666482 665892 664796 663237 660522 656194 650988 646281 642795 640429 639173 639460 641488 644884 649248 654571
60141 654571 660887 667942 675424 683197 691111 698880 706300 713330 719849 725609 730594 735108 739316 742931
60127 742931 745478 746627 746171 744010 740387 735902 731012 725731 720066 714564 710094 707070 705186 704013
60113 704013 703608 704293 705873 707432 708188 708441 709338 711691 715364 719853 724972 730621 736342 741596 746261
60098G46261M107L195J868P92L60l7j086k423l216l488l917m551m663l928k914
60083G26360k141j427m66M70J000J336K025L022L459K459O6k699m792o088p295
60068G15289q812r972r789q360p049p005p838q126p118n559m770n249o330p109
60054F12203p267p011o555n975n381m928m631m402m191l891l210j931k85J202
60040E53747K225K804K959K684K294K323K915L552L560K630R42q76j912j674q73
60025E77300r77k616m800o018n801m919m327m369m790n092m960m530m223m174
60011E15704m041l510k734k041j457p60J55J255K498L745M724N342N937O979Q485
59996E40281R933J0651J0299R046P374N660L947K204N94p00j712k427k513j777
$$ plain form
60098 746261 750368 753563 755431 756223 756583 756546 755460 753037 749821 746333 742416 737865 733202 729274 726360
60083 726360 724219 722792 722326 722796 723796 725132 727157 730179 733638 736097 736163 733464 728672 722584 715289
60068 715289 706477 696505 686716 678356 671307 664302 656464 648338 641220 635661 630891 625642 619312 612203
60054 612203 604936 597925 591370 585395 580014 575086 570455 566053 561862 557971 554761 552830 552545 553747
60040 553747 555972 558776 561735 564419 566713 569036 571951 575503 579063 581693 582635 581759 579847 578173 577300
60025 577300 576323 573707 568907 562889 557088 552169 547842 543473 538683 533591 528631 524101 519878 515704
60011 515704 511663 508153 505419 503378 501921 501161 501316 502571 505069 508814 513538 518880 524817 531796 540281
59996 540281 550214 560865 571164 580210 587584 593244 597191 599395 599989 599289 597577 595150 592637 590860
59982E90860o41K99J026J755K092J467L54n8L88M38p04k176k764k549k412k580
59966E84795k583k219j691j085l65K97P38J080J334J240R40J213K304L158K711
59951E91867J468Q78J397K192K496K270J621N90l80p16o08q90j800k615k717k389
59935E92664k268k585l172l761l980l488k366j088k5P78J306J473J366J232J164
59920E77250J012O52P5o66j304j315m47Q17J686J897J764J589J439J368J422J451
59904E88690J297J050Q59P35Q42J545K690L394L157K662K623K431J126o69j261
59889F11171l71M69L49L66J760L892N164N197M912M941N083N115N169N246N109
59874F63572M838M819N015M766L578J760k2j542l012m468n537n960n963n908n815
$$ plain form
59982 590860 590219 590518 591544 593299 595391 596858 597212 597154 597542 597980 597276 595100 592336 589787 587375 584795
59966 584795 582212 579993 578302 577217 576852 577149 577887 578967 580301 581541 582481 583694 585998 589156 591867
59951 591867 593335 594213 595610 597802 600298 602568 604189 604779 604399 603683 603075 602185 600385 597770 595053 592664
59935 592664 590396 587811 584639 580878 576898 573410 571044 569956 569931 570709 572015 573488 574854 576086 577250
59920 577250 578262 578914 578989 578323 577019 575704 575257 576074 577760 579657 581421 583010 584449 585817 587239 588690
59904 588690 589987 591037 591896 592631 593473 595018 597708 601102 604259 606921 609544 611975 613101 612432 611171
59889 611171 610800 611269 611618 611984 613744 617636 622800 627997 632909 637850 642933 648048 653217 658463 663572
59874 663572 668410 673229 678244 683010 686588 688348 688326 686784 683772 679304 673767 667807 661844 655936 650121
59859F50121n550n341n519n788n338l976k567j984k084k219k242k298k040q58
59845F02317J141L194M872O388P893R258J0715J2952J6146J9291K0884K0087J7127
59832G52265J2962Q829N775M227L917M273M748M824L897J314l318r560j5832k0196
59818G58125k1873k1701k0851j9570j7641j5421j3553j1971j0138q182o853o336
59806E84035n984n359m722m313l926l499l363l544l514l024k559k554k739k746
59792E32189k831l349l931l868l183k701k976l614l860l573l261l173k770j503
59778D87596J04P99J95o62p08j91M0o8L1L14K35j53j80L18P55Q66J157K038L172
59759D95658L943L964L074J521K73L34J534K604K735K434K609L521M794N820N934
$$ plain form
59859 650121 644571 639230 633711 627923 622585 618609 616042 614058 611974 609755 607513 605215 603175 602317
59845 602317 603458 606652 611524 617912 625805 635063 645778 658730 674876 694167 715051 735138 752265
59832 752265 765227 774056 779831 784058 787975 792248 796996 801820 805717 807031 803713 794153 778321 758125
59818 758125 736252 714551 693700 674130 656489 641068 627515 615544 605406 597224 590371 584035
59806 584035 578051 572692 567970 563657 559731 556232 552869 549325 545811 542787 540228 537674 534935 532189
59792 532189 529358 526009 522078 518210 515027 512326 509350 505736 501876 498303 495042 491869 489099 487596
59778 487596 487700 488499 488694 488032 487324 487133 487173 487105 487136 487450 487685 487532 487352 487670 488425 489291 490448 492486 495658
59759 495658 499601 503565 506639 508160 508433 508767 510301 512905 515640 518074 520683 524204 528998 534818 540752
59744E40752M901L429K534K270J861J141Q61J274J518J006M20N39R14O50j25n58
59728E63387m88n80j144j650j526r19m52n18r05j077q50o25p89j054r32o44q47
59711E48387j431j436l88J003J856K120K193K186K047J880J777J750K008K738
59697E66690L449L323K515K241L037L849L536K524K129K694L268K853J358n01
59683F02965j741j857j338j099j243j025k47J48m92j424j643j401j616k356k954
59668E82677l278l795m462m561l780k717k060j796j417n90M77J214J300J078J121
59653E59411J359J220P53Q76K118L712M535M353L630K611J284k01j608k889l930
59638E77234m465m637n023n672n739m646l039j876j201n73o9l8k51k94l91r74
$$ plain form
59744 540752 545653 549082 551616 553886 555747 556888 557749 559023 560541 561547 561967 562506 563420 564070 563945 563387
59728 563387 562899 562319 561175 559525 557999 557080 556628 556110 555205 554128 553278 552653 551864 550810 549878 549234 548387
59711 548387 546956 545520 545132 546135 547991 550111 552304 554490 556537 558417 560194 561944 563952 566690
59697 566690 570139 573462 575977 578218 581255 585104 588640 591164 593293 595987 599255 602108 603466 602965
59683 602965 601224 599367 598029 596930 595687 594662 594415 594563 594071 592647 591004 589603 587987 585631 582677
59668 582677 579399 575604 571142 566581 562801 560084 558024 556228 554811 554221 554698 555912 557212 558290 559411
59653 559411 560770 561990 562743 563619 565737 569449 573984 578337 581967 584578 585862 585661 584053 581164 577234
59638 577234 572769 568132 563109 557437 551698 547052 544013 542137 540936 540363 540294 540256 540005 539711 539320 538346
59622E38346j667j655q96j64O3L7J08K31J12n55j799l082l647l482l350l554l445
59605E11601k596j564p86K32J673K442J666L12k03k24j037k357k555j327k77n28
59589E04472j341j578j165n64M3M18J77n05q76o58l01n6K90M80k48j871l221l472
59571D90024l116k944k911k644k289k135j942j338n46j85m96j071j188l31J249
59556D68137K518K631J899J256J051R83J061J596K285K418K161K536L717M553
59542D98802M307L858M416N912P450Q772J0528J3495J7873K2619K5122K2571J4733
59529F60458M752l588q908j1894j2948j1618q076l724O0K855M715N562N432M717
59515F27795L760K510Q61j006k792m364n741o998q246r465j0293j0280r541q821
$$ plain form
59622 538346 536679 535024 534128 533964 534027 534064 534172 534403 534515 533960 532161 529079 525432 521950 518600 515046 511601
59605 511601 509005 507441 506655 506887 508560 511002 512668 512980 512777 512553 511516 509159 506604 505277 505000 504472
59589 504472 503131 501553 500388 499824 499867 500285 500462 499957 499081 498423 498122 498066 498356 498836 498588 496717 493496 490024
59571 490024 486908 483964 481053 478409 476120 473985 472043 470705 470159 469974 469478 468407 467219 466888 468137
59556 468137 470655 473286 475185 476441 477492 478475 479536 481132 483417 485835 487996 490532 494249 498802
59542 498802 503109 506967 511383 517295 524745 533517 544045 557540 575413 598032 623154 645725 660458
59529 660458 665210 661622 652714 640820 627872 616254 608178 604454 604514 607369 612084 617646 623078 627795
59515 627795 631555 634065 634926 633920 631128 626764 621023 614025 605779 596314 586021 575741 566200 557379
59501E57379q641q584p836o327m950m436m440m069l116k211j854j819j682j434
59487D95980j263j156j000p32j46J054K557L332K763J637J285J976K822L178L287
59472E15574L489L535L061K330K005K337K749K351J002k16j0J498K735K584J744
59457E46768J630K519L698M909O552Q594J0335J1379J1961J2183J1832J1032J0313
59444F53705R792Q928P297M970K090j209m373o726q289r683j1026j1674j1183
59431F22619r834q101o340n052m558m253l117j155N85J700L069N426Q328J1076
59417F10393J3712J6429J8858K0661K2060K3294K4372K5876K8634L1519L0645
59406H66453K2616Q456o804j8368k4571k6147k4326k0064j4004o456J944R090
$$ plain form
59501 557379 548738 540154 532318 525991 521041 516605 512165 508096 504980 502769 500915 499096 497414 495980
59487 495980 494717 493561 492561 491829 491683 492737 495294 498626 501389 503026 504311 506287 509109 512287 515574
59472 515574 519063 522598 525659 527989 529994 532331 535080 537431 538433 538217 538207 539705 542440 545024 546768
59457 546768 548398 550917 554615 559524 566076 574670 585005 596384 608345 620528 632360 643392 653705
59444 653705 663497 672425 679722 684692 686782 685573 681200 674474 666185 656502 645476 633802 622619
59431 622619 612785 604684 598344 593292 588734 584481 581364 580209 580794 582494 585563 590989 599317 610393
59417 610393 624105 640534 659392 680053 702113 725407 749779 775655 804289 835808 866453
59406 866453 889069 897525 890721 872353 847782 821635 797309 777245 763241 756785 758729 767819
59394G67819J1618P294k757j4512k3862k8991l0407k9339k6588k2715j8585j5105
59382E73870j2475j0193p790n344l246j864j373j552j717j228j01J173K325L384
59368E33869M224M588M619M744M983N030M992N360O022O158N415M609M756N938
59354F05307P432Q531Q956Q936R137J0122J1763J3577J5554J7861J9883K0569
59342G57628K0071J9846K0694K1698K1727K0899J9755J7957J4917J0963O875K791
59330I55821j410n197p957j0025j2109j3994j4989j5325j5855j6439j5971j4315
59318H12235j2884j2810j3441j3389j2332j0949r650q273o878o010n828n622m654
59305F89515l200k209k012j888j150j2R90J953L241M569N426O259Q168J1206J4023
$$ plain form
59394 767819 779437 786731 783974 769462 745600 716609 686202 656863 630275 607560 588975 573870
59382 573870 561395 551202 543412 538068 534822 532958 531585 530033 528316 527088 526987 528160 530485 533869
59368 533869 538093 542681 547300 552044 557027 562057 567049 572409 578431 584589 590004 594613 599369 605307
59354 605307 612739 621270 630226 639162 648299 658421 670184 683761 699315 717176 737059 757628
59342 757628 777699 797545 818239 839937 861664 882563 902318 920275 935192 946155 953030 955821
59330 955821 954411 949214 941257 931232 919123 905129 890140 874815 858960 842521 826550 812235
59318 812235 799351 786541 773100 759711 747379 736430 726780 718507 711629 705619 699791 694169 689515
59305 689515 686315 684106 682094 680206 679056 679044 680034 681987 685228 689797 695223 701482 709650 720856 734879
59290G34879J5709J7135J9849K4186K8939L2198L1939K6648J6495L793q278j7415
59278I26077k2630k3852k1899j8405j4772j1233p415l512k13K324M538O534P780
59265H23322P968P595P366P282O571M481J107k605n813q620j1630j4730j6885
59252H05409j7326j6418j5076j3817j2731j1849j1106j0257r245q333p605o755
59240F64891n588m285k926j379R8R58J392K465M523O342O662N820M954M261L180
59225F91368J777O75k98k034m629o958q053q131p978q000q133q117p635o597n459
59210F11798m866m848m724l939k686j598j068r11o20J06J067J891K626L589M588
59195F00405M926M447L978M297N153N808O093O288O416O267N879N472N093M844
$$ plain form
59290 734879 750588 767723 787572 811758 840697 872895 904834 931482 947977 951770 943492 926077
59278 926077 903447 879595 857696 839291 824519 813286 805871 802359 802146 804470 809008 815542 823322
59265 823322 831290 838885 846251 853533 860104 864585 865692 863087 857274 848654 837024 822294 805409
59252 805409 788083 771665 756589 742772 730041 718192 707086 696829 687584 679251 671646 664891
59240 664891 659303 655018 652092 650713 650811 651769 653161 655626 660149 666491 673153 678973 683927 688188 691368
59225 691368 693145 693820 693522 691488 686859 679901 671848 663717 655739 647739 639606 631489 623854 617257 611798
59210 611798 606932 602084 597360 593421 590735 589137 588069 587158 586538 586644 587711 589602 592228 595817 600405
59195 600405 605331 609778 613756 618053 623206 629014 635107 641395 647811 654078 659957 665429 670522 675366
59181F75366N062N786O346O112N337M790M769N010N210N107M438L406K870L414
59167G43023M565N457N906O209O300N914N294M945M852M616M186L812L417K592
59153H11088J102j113m028p085r124r526r087r030r493r736r395q581p267n583
59139G13142m442m633n433n315m062k975k825k809j934m07R21J672K013K176K397
59124F87486L007M137N560O895P773P950P671P737Q650R777J0040R367Q818R187
59110G94055J0105J0627J0131Q582O416M377L056K401J885J042l22k161m058n328
59096H40808n704n679n836o205o599p056p363o835n271l589k728k496k348k628
59082G70471l853n326n878n706o119p502q915r701j0200j0631j0543r779q901
$$ plain form
59181 675366 680428 686214 692560 698672 704009 708799 713568 718578 723788 728895 733333 736739 739609 743023
59167 743023 747588 753045 758951 765160 771460 777374 782668 787613 792465 797081 801267 805079 808496 811088
59153 811088 812190 811077 807049 799964 790840 781314 772227 763197 753704 743968 734573 725992 718725 713142
59139 713142 708700 704067 698634 693319 689257 686282 683457 680648 678714 678307 679228 680900 682913 685089 687486
59124 687486 690493 694630 700190 707085 714858 722808 730479 738216 746866 756643 766683 776050 784868 794055
59110 794055 804160 814787 824918 833500 839916 844293 847349 849750 851635 852677 852355 850194 846136 840808
59096 840808 835104 829425 823589 817384 810785 803729 796366 789531 784260 780671 777943 775447 773099 770471
59082 770471 766618 761292 755414 749708 743589 736087 727172 717471 707271 696640 686097 676318 667417
59069F67417q253p446o171m781l794l441l737m322m309l167j652r80j223j493
59055F12648j557j965k638k694j996j469j574j663j312j024j149j181p82l67j82
59040E91095J45N68K77q28j463o35Q88J719J711J717K122K603K987L436M075M898
59024F15315N911O918P595Q146R288J1144J2702J2963J2133J1085J0068Q597O308
59011G38173L371K74k375m079m823n044m948m183k472k81J518K486K916L419M346
58996G28298N436O002N685M872M121L421K474J420O76J84n08j571k818m158n473
58981G48061o356o694p150q181q874p922n541l183j468K83K408M254N460O567
58967G11664P925R127R945J0681J1260J1194J0802J1124J2077J2172J0647Q608
$$ plain form
59069 667417 659164 651718 645547 640766 636972 633531 629794 625472 621163 617996 616344 615364 614141 612648
59055 612648 611091 609126 606488 603794 601798 600329 598755 597092 595780 594756 593607 592426 591644 591277 591095
59040 591095 591240 591808 592085 591257 589794 589159 590047 591766 593477 595194 597316 599919 602906 606342 610417 615315
59024 615315 621226 628144 635739 643885 653173 664317 677019 689982 702115 713200 723268 731865 738173
59011 738173 741544 741818 739443 735364 730541 725497 720549 716366 713894 713613 715131 717617 720533 723952 728298
58996 728298 733734 739736 745421 750293 754414 757835 760309 761729 762405 762589 762081 760510 757692 753534 748061
58981 748061 741705 735011 727861 719680 710806 702884 697343 694160 692692 692975 695383 699637 705097 711664
58967 711664 719589 728716 738661 749342 760602 771796 782598 793722 805799 817971 828618 837226
58955H37226P161N702L083n95m394p828j0774j2871j4059j5013j6138j6737j5949
58942G38814j3947j1494r014o742n081m056l112k083j643k184l029l499l847m474
58928F64609n006n093n214n787o260o004n350m808m054k762j679j636k123k011
58914F06822j285q29q35o70p9N66J100J803K759L772M800N869O765P417Q280R732
58898F55987J1387J2604J3299J3722J3842J3633J3487J3765J4352J5197J6674
58887H07949J8815K0880K2418K3966K5798K6766K5526K2413J8874J5502J1882
58876A040789P994M380R40l100p773j2017j5033j7129j8812j9813j9508j7821
58864I23097j5376j2908j0853r422q915r672j1461j3096j3404j2658j2347j3226
$$ plain form
58955 837226 844387 850089 853172 852577 848183 840355 829581 816710 802651 787638 771500 754763 738814
58942 738814 724867 713373 704359 697617 692536 688480 685368 683285 681642 679458 676429 672930 669083 664609
58928 664609 659603 654510 649296 643509 637249 631245 625895 621087 617033 614271 612592 610956 608833 606822
58914 606822 605537 604708 603873 603203 603124 603690 604790 606593 609352 613124 617924 623793 630558 637975 646255 655987
58898 655987 667374 679978 693277 706999 720841 734474 747961 761726 776078 791275 807949
58887 807949 826764 847644 870062 894028 919826 946592 972118 994531 1013405 1028907 1040789
58876 1040789 1048783 1053163 1054103 1051003 1043230 1031213 1016180 999051 980239 960426 940918 923097
58864 923097 907721 894813 883960 874538 865623 855951 844490 831394 817990 805332 792985 779759
58852G79759j4401j4736j4363j4018j3657j2612j0762q770p387o965p351p804
58840F46933p497o522n866o069o510o553o475o641o567n765m780m440m561m371
58826E64316l710l003k361j636r80n44j9P88J398J476J680K704L898L958K808
58811E70773J823K104L349M404M443L580K778K927L812M289L744K778K034J208
58797F14046j72j762k956l835m714n319n251m805m563m505m181l358k003k15J403
58782E67810K111K276L323N727Q079Q917Q489P785O959N829M913M470L389N55
58768F40632l202n944o968p081o984o732o404o109n498m359l363l214l453l030
58754E68291j715oJ722L130L716L648M014N168N779M785L326L216M438N686O629
$$ plain form
58852 779759 765358 750622 736259 722241 708584 695972 685210 676440 669053 662088 654737 646933
58840 646933 639436 632914 627048 620979 614469 607916 601441 594800 588233 582468 577688 573248 568687 564316
58826 564316 560606 557603 555242 553606 552626 552082 552063 552851 554249 555725 557405 560109 564007 567965 570773
58811 570773 572596 574700 578049 582453 586896 590476 593254 596181 599993 604282 608026 610804 612838 614046
58797 614046 613874 612112 609156 605321 600607 595288 590037 585232 580669 576164 571983 568625 566622 566407 567810
58782 567810 569921 572197 575520 581247 589326 598243 606732 614517 621476 627305 632218 636688 640077 640632
58768 640632 637430 631486 624518 617437 610453 603721 597317 591208 585710 581351 577988 574774 571321 568291
58754 568291 566576 566570 568292 571422 575138 578786 582800 587968 593747 598532 601858 605074 609512 615198 621827
58739F21827P789Q905R203Q933Q921R053Q756Q461Q844R163Q269O861O692P843
58725G39520Q753Q768Q578Q235O923M983M016M608N666O391P198Q299R121R525
58711H40584J0011J0314R381P077M378J630j750n523q350r826j1183j3366j5904
58698H17473j8213k0453k2452k3314k2878k2183k1762k0760j8500j5776j3687
58687E97495j2261j0911r419p838o288n294n420o162o136m777l033k005j766j787
58673E14398j605q83L75J467J775J849K759M442N868O737P799R440J1237J2822
58659E78480J3863J3257J0116N655K398J088M5k033m344n728o434p147p601p247
58645E84368o315n373m542l870l609l595l096j767j41J128J890K226K289K427
$$ plain form
58739 621827 629616 638521 647724 656657 665578 674631 683387 691848 700692 709855 718124 724985 731677 739520
58725 739520 748273 757041 765619 773854 780777 785760 789776 794384 800050 806441 813639 821938 831059 840584
58711 840584 850595 860909 870290 877367 881745 883375 881625 876102 867752 857926 846743 833377 817473
58698 817473 799260 778807 756355 733041 710163 687980 666218 645458 626958 611182 597495
58687 597495 585234 574323 564904 557066 550778 545484 540064 533902 527766 522989 519956 517951 516185 514398
58673 514398 512793 511910 512285 513752 515527 517376 520135 524577 530445 537182 544981 554421 565658 578480
58659 578480 592343 605600 615716 621371 623769 624857 624902 622869 618525 612797 606363 599216 591615 584368
58645 584368 578053 572680 568138 564268 560659 557064 553968 552201 552060 553188 555078 557304 559593 562020
58631E62020K765K734J804L68r66k431m263n405m646k620j047j83J108L011M436
58616E56685N105N952P190P853P628P335P207O497N064L698K514Q53r91j839j706
58601F19045j901k666k760j899j523k432l632m175m293m112l166j821j172r08
58587E82585O31L604O087P147Q177J0147J1875J2312J2341J2847J2924J1603R690
58574G01970Q371P521O652O020N669M947M122M796P540J0774J3164J5409J8398
58561H15353K1435K3612K5203K6305K5867K3517K0681J8413J5704J1455O540K368
58549A036453j077m273o754q273r792j1787j2977j2290j0813j0262j0849j2019
58537I25287j3885j6425j8639j9880k0781k1564k1085j8832j6306j4811j3520
$$ plain form
58631 562020 564785 567519 569323 569691 568725 566294 562031 556626 551980 549360 548313 548130 549238 552249 556685
58616 556685 561790 567742 574932 582785 590413 597748 604955 611452 616516 620214 622728 623581 622590 620751 619045
58601 619045 617144 614478 611718 609819 608296 605864 602232 598057 593764 589652 586486 584665 583493 582585
58587 582585 583216 586820 592907 600054 608231 618378 630253 642565 654906 667753 680677 692280 701970
58574 701970 710341 717862 724514 730534 736203 741150 745272 750068 757608 768382 781546 796955 815353
58561 815353 836788 860400 885603 911908 937775 961292 981973 1000386 1016090 1027545 1034085 1036453
58549 1036453 1035376 1031103 1024349 1016076 1006284 994497 981520 969230 958417 948155 937306 925287
58537 925287 911402 894977 876338 856458 835677 814113 793028 774196 757890 743079 729559
58526G29559j1240q523o379m466k250m49K96P98J766K453K331K406L264L615K620
58511G15801J791K558L698L442K391K047J896N59j435k538k878l664m719m859
58497G14090m135l666l763l999m384m919m830l802k902k822k386m29K148L809
58483F78010M534M959M959M815O015Q936J1443J1907J1874J3317J5083J4750J2490
58470H03092J0143P735M013n31m062o275q155r482r203p836o936o541n372l251
58456G57339j193N08K341M180N560O747P945Q334P449O303N513L837M40l040m864
58441H07399n862p314q087o693m519l792l758k119P58K397K249J967K362K951
58427G77939L958N816P386P379O844P553Q926R342R265J0007J0531R019O582N759
$$ plain form
58526 729559 718319 709796 703417 698951 696701 696252 696548 697346 699112 701565 703896 706302 709566 713181 715801
58511 715801 717592 720150 723848 727290 729681 731728 733624 734183 732748 730210 727332 723668 718949 714090
58497 714090 709955 706289 702526 698527 694143 689224 684394 680592 677690 674868 672482 672053 674201 678010
58483 678010 682544 687503 692462 697277 703292 712228 723671 735578 747452 760769 775852 790602 803092
58470 803092 813235 820970 824983 824452 820390 814115 805960 796478 787275 779439 772503 765962 760590 757339
58456 757339 756146 756654 758995 763175 768735 775482 783427 791761 799210 805513 811026 814863 815303 812263 807399
58441 807399 801537 794223 786136 779443 774924 771132 767374 765255 766013 768410 770659 772626 774988 777939
58427 777939 781897 787713 795099 802478 809322 816875 825801 835143 844408 854415 864946 873965 880547 886306
58413H86306O081M894K029j89j257k930n339o555o305o543p801q378p706p256
58399H39051p494o917m837k414m31J476L081L572L404L718L984K842J019O27J715
58384H42396K303J805J514J868K024K020K557K884J753K22N05K382L751M349N601
58369H77934P204P435O677P129Q930J0066J0153J0771J1967J2073J1213J1359
58357I92911J2522J2507J0860R606R466Q877P400O701P286P458O317N023M429
58344A101363M137M179N077O196O662P508J0012J2589J2748J1413J1632J3575
58332A207091J4734J4590J4875J5497J4674J3032J3040J4249J3600J0717Q459
58321A354558P852P010N533N326O425O493N216M879N923O371O137P416J0077J1401
$$ plain form
58413 886306 892387 897281 899310 899121 897864 894934 889595 883040 876735 870192 862391 854013 846307 839051
58399 839051 831557 824640 819803 817389 816958 818434 821515 825087 828491 832209 836193 839035 840054 840681 842396
58384 842396 844699 846504 848018 849886 851910 853930 856487 859371 861124 861346 861851 864233 867984 872333 877934
58369 877934 885138 892573 899250 906379 915309 925375 935528 946299 958266 970339 981552 992911
58357 992911 1005433 1017940 1028800 1038406 1047872 1056749 1064149 1070850 1078136 1085594 1091911 1096934 1101363
58344 1101363 1105500 1109679 1114756 1120952 1127614 1135122 1145134 1157723 1170471 1181884 1193516 1207091
58332 1207091 1221825 1236415 1251290 1266787 1281461 1294493 1307533 1321782 1335382 1346099 1354558
58321 1354558 1362410 1369420 1374953 1380279 1386704 1393197 1398413 1403292 1409215 1415586 1421723 1429139 1439216 1450617
58307A450617J1111J2009J4751J6671J6741J7111J8679J9649J9409J9579K0354
58296A636681K0149J9364K0058K1634K1460J9972K0117K1772K1979K0872K1573
58285A865631K4034K4963K4224K5126K7823K8891K8170K9337L2773L4644L4164
58274B179780L4861L7406L8316L7262L8282M2044M4239M3647M4387M8108N1317
58263B639649N2671N5438O0419O3989O5400O8332P2969P4647P2852P3085P7137
58252C376588Q0011P9531Q0148Q3943Q6844Q7347Q9992R6328J01439J03438J07214
58241D372823J14807J21412J25240J31597J42729J53331J60885J70415J84209
58232E677448J97051K06742K18957K36344K53432K67650K84505L06446L27909
$$ plain form
58307 1450617 1461728 1473737 1488488 1505159 1521900 1539011 1557690 1577339 1596748 1616327 1636681
58296 1636681 1656830 1676194 1696252 1717886 1739346 1759318 1779435 1801207 1823186 1844058 1865631
58285 1865631 1889665 1914628 1938852 1963978 1991801 2020692 2048862 2078199 2110972 2145616 2179780
58274 2179780 2214641 2252047 2290363 2327625 2365907 2407951 2452190 2495837 2540224 2588332 2639649
58263 2639649 2692320 2747758 2808177 2872166 2937566 3005898 3078867 3153514 3226366 3299451 3376588
58252 3376588 3456599 3536130 3616278 3700221 3787065 3874412 3964404 4060732 4162171 4265609 4372823
58241 4372823 4487630 4609042 4734282 4865879 5008608 5161939 5322824 5493239 5677448
58232 5677448 5874499 6081241 6300198 6536542 6789974 7057624 7342129 7648575 7976484
58223G976484L46902L69780L99014M28601M57178M92580N37573N85126O33891
58214A2227129O93359P67008Q46357R28968J025555J141754J270914J413344J583620
58205B1898008J790162K028423K304093K641236L058063L559917M168154M930259
58197D6378315N890871P083597Q564870J0422399J2734516J5551592J8918301
58190A25544461K2860547K7339958L2259640L7416190M2153430M4896886M3326886
58183C75797998L5619787K1959861M901001j1868590k5303785l3980512l7957951
58176C29167809l8134137l5685041l1724342k7117779k2412967j7865627j3567856
58169A42660060r684659o646261n017808n040359o297082p921063r154787r693412
$$ plain form
58223 7976484 8323386 8693166 9092180 9520781 9977959 10470539 11008112 11593238 12227129
58214 12227129 12920488 13687496 14533853 15462821 16488376 17630130 18901044 20314388 21898008
58205 21898008 23688170 25716593 28020686 30661922 33719985 37279902 41448056 46378315
58197 46378315 52269186 59352783 67917653 78340052 91074568 106626160 125544461
58190 125544461 148405008 175744966 208004606 245420796 287574226 332471112 375797998
58183 375797998 411417785 433377646 438278647 426410057 401106272 367125760 329167809
58176 329167809 291033672 255348631 223624289 196506510 174093543 156227916 142660060
58169 142660060 132975401 126329140 121311332 116270973 109973891 102052828 92898041 83204629
58161H3204629r587979r001407q109025p095744o110607n217810m427577l750450
58153B9904030l192184k729440k332080j994455j719225j490378j288416j115141
58145A4042711r79189q71638p77372o96966o37088n91155n48004n08806m78463
58136G954030m50468m16165l79653l48934l21149k90022k59105k34677k13922
58127E039935j92517j75779j70071j70487j68476j64687j63419j61461j53387
58118C519651j41808j32236j23467j12274j01734r5781r1275q4056p7195p4821
58108B485004p3667o9137o4058o3049o3558o0889n6956n5881n5819n3127m9985
58097A818878m9958n0412m7162m2439m0733m0638l8226l4734l3563l3168l0020
$$ plain form
58161 83204629 73616650 64615243 56506218 49410474 43299867 38082057 33654480 29904030
58153 29904030 26711846 23982406 21650326 19655871 17936646 16446268 15157852 14042711
58145 14042711 13063522 12191884 11414512 10717546 10080458 9489303 8941299 8432493 7954030
58136 7954030 7503562 7087397 6707744 6358810 6037661 5747639 5488534 5253857 5039935
58127 5039935 4847418 4671639 4501568 4331081 4162605 3997918 3834499 3673038 3519651
58118 3519651 3377843 3245607 3122140 3009866 2908132 2812351 2721076 2637020 2559825 2485004
58108 2485004 2411337 2342200 2278142 2215093 2151535 2090646 2033690 1977809 1921990 1868863 1818878
58097 1818878 1768920 1718508 1671346 1628907 1588174 1547536 1509310 1474576 1441013 1407845 1377825
58086A377825k5465k3031k1990j9924j8410j9986k2532k2720k1907k2954k4432
58075A134474k3722k2517k3438k4558k2966k0539k0370k0765j8674j5894j5839
58064I05192j7134j6333j4235j3591j3238j0521p149o771q732r763r786j0700
58052G67239j1619j0649r358j0254j1787j0956q761q053q151o803n290o227q238
58039F51093q111o452o057o463n443m152n376q073q856p743p468q301q475q394
58025E51729r539j0516r059o719o645p969p462n469n067o234o222m954m866n841
58011D55167n401l725l467m614m377k325r65j101q81J92O31M56J333K886K895
57996D36704J406Q97K041K970K844K682K522J313k76m79K51j32j447j653q45j136
$$ plain form
58086 1377825 1352360 1329329 1307339 1287415 1269005 1249019 1226487 1203767 1181860 1158906 1134474
58075 1134474 1110752 1088235 1064797 1040239 1017273 996734 976364 955599 936925 921031 905192
58064 905192 888058 871725 857490 843899 830661 820140 812991 806220 797488 787725 777939 767239
58052 767239 755620 744971 735613 725359 713572 702616 693855 685802 677651 670848 665558 659331 651093
58039 651093 642982 636530 630473 624010 618567 614415 609039 600966 592110 584367 576899 568598 560123 551729
58025 551729 542190 531674 522615 515896 509251 501282 493820 488351 483284 477050 470828 465874 461008 455167
58011 455167 449766 446041 442574 437960 433583 431258 430293 429192 428311 428503 429134 429590 430923 433809 436704
57996 436704 438110 439007 441048 444018 446862 449544 452066 453379 453103 452624 452875 452743 451296 449643 448798 447662
57980D47662k597l113k412k476l674m137l440l323m150m109k663j532j508j308
57966D07220k91M75N06O43J054R92P79J473K597K723K222K603L334K363j47j747
57950D26799j538j147j605k230k811l992n099m520k628j583j860j699k93J197
57936C96991K100L019L979M408N055P042R089Q716O327M906N373N578M418L529
57922D70530M005M559M099L254K321M37k184l824m076m557n978p004o909o751
57908D47922o985o509n099m199m308m088l190l370n444p560p963p353p082p005
57894C67767o547o096n997n716n072m768m890m517l545l119l436l083j373M30
57880C10038J179J333J534J466J013Q58J060O10p76j975k308k444k829k909k553
$$ plain form
57980 447662 445065 441952 439540 437064 433390 429253 425813 422490 418340 414231 411568 410036 408528 407220
57966 407220 406929 407404 407910 408553 409607 410599 411378 412851 415448 418171 420393 422996 426330 428693 428546 426799
57950 426799 425261 424114 422509 420279 417468 413476 408377 403857 401229 399646 397786 396087 395794 396991
57936 396991 399091 402110 406089 410497 415552 422594 431683 440399 446726 451632 457005 462583 467001 470530
57922 470530 474535 479094 483193 486447 488768 489205 487021 483197 479121 474564 468586 461582 454673 447922
57908 447922 440937 434428 429329 425130 420822 416734 413544 410174 404730 397170 389207 381854 374772 367767
57894 367767 361220 355124 349127 343411 338339 333571 328681 324164 320619 317500 314064 310981 309608 310038
57880 310038 311217 312550 314084 315550 316563 317421 318481 319091 318315 316340 314032 311588 308759 305850 303297
57865C03297k589l290l862m031m391m793m241k878k151k437k388j281oQ98K209
57850B68066M213N898O783P724R117J0092J0211J0145J0030R060P384O417O500
57837C71640O231M853L265J961J80k080l367l190k938l393l495k725k421l348
57823C61173m121l518k431j967j578o17N5l78j098j184j131j423j256j74O36K10
57807C41198n30n32m71j256k225k581l191n100p414q453q092p359o602n627m766
57792B76999m356l896k900j849j245p14JK76q0l0J068K256K559K511K838L001
57776B76439K467K140K971M208M620M488M825N529N831N798N910N858N101L931
57762C40116K789J296q46k878m181n580q108j1110j2940j2958j1742r926q041
$$ plain form
57865 303297 300708 297418 293556 289525 285134 280341 276100 273222 271071 268634 266246 264965 264959 265857 268066
57850 268066 272279 278177 284960 292684 301801 311893 322104 332249 342279 351339 358723 365140 371640
57837 371640 377871 382724 385989 387950 388130 386050 382683 379493 376555 373162 369667 366942 364521 361173
57823 361173 357052 353534 351103 349136 347558 346941 346996 346618 345520 344336 343205 341782 340526 340352 340988 341198
57807 341198 340668 340136 339665 338409 336184 333603 330412 325312 317898 309445 301353 293994 287392 281765 276999
57792 276999 272643 268747 265847 263998 262753 262039 262040 262316 262236 262206 263274 265530 268089 270600 273438 276439
57776 276439 278906 281046 284017 288225 292845 297333 302158 307687 313518 319316 325226 331084 336185 340116
57762 340116 342905 344201 343355 340477 336296 330716 322608 311498 298558 285600 273858 263932 255891
57749B55891o790o406o168n474m700m266l785l075k961l979n184n393m795m270
57735A88645l926l305k323j019P69K671L643L425L044L063K689J492O35J066J896
57720B02465J969J739K049K336J689O68L36M37J44l15l80n71j507k411k274j696
57704B04678j792k118j558n52m47j178j503j181j014j077p14m5K56M95J435K438
57688A96123K019L15p87k65R28J623J854K065K287K618L553N298P475R770J2331
57673B47207J5540J9916K6041L3933M2791N2044O2356P4653Q8110R9230J02496
57662H64317R2274O6142K8033j2652m6700o9955q2780q6769q3760p6567o7999
57651E23584n9048m9616m0608l3547k8401k3696j8829j4647j1700r481p560o053
$$ plain form
57749 255891 249101 242695 236527 231053 226353 222087 218302 215227 212266 208287 203103 197710 192915 188645
57735 188645 184719 181414 179091 178072 178841 181512 185155 188580 191624 194687 197376 198868 199503 200569 202465
57720 202465 204434 206173 208222 210558 212247 212915 213251 213688 213832 213517 213137 212566 211059 208648 206374 204678
57704 204678 202886 200768 199210 198658 198211 197033 195530 194349 193335 192258 191544 191499 191755 192250 193685 196123
57688 196123 198142 198457 197670 197405 198333 199956 201810 203875 206162 208780 212333 217631 225106 234876 247207
57673 247207 262747 282663 308704 342637 385428 437472 499828 574481 662591 761821 864317
57662 864317 956591 1022733 1050766 1038114 991414 921459 838679 751910 668150 591583 523584
57651 523584 464536 414920 374312 340765 312364 288668 269839 255192 243492 234011 226451 220398
57639B20398m780l343k188k177k951l040j914o64k86m30l22P6L00R9m49j030j253
57622A96046j086j017j351j664j560j430j765k231k288k146k191k031j204k82
57608A73800r6l61k39K28N25R21J939K918K679J391L30p0m82j118j383j162j143
57591A78677j645k257k664k859k666k099j900k579l284k914j915j579j923j958
57577A46435j662j940k686k832k408k584l444l599k629j969k619l606l642k890
57563A07925k167j610j110r87j334j502j054m93m29o83p63n66j66M17R05R13O22
57546I7918O50J060J312J281J419J757J716J170P19P18R40J274J814K099J430
57531A17277J51n14k21M7l27p27n86l98o89r94o11K81R24Q99L13m18p46m43j2
$$ plain form
57639 220398 215618 212275 210087 207910 204959 201919 200005 199341 199055 198625 198303 198379 198679 198778 198329 197299 196046
57622 196046 194960 193943 192592 190928 189368 187938 186173 183942 181654 179508 177317 175286 174082 173800
57608 173800 173704 173343 173104 173332 173857 174778 176717 179635 182314 183705 184035 183965 183483 182365 180982 179820 178677
57591 178677 177032 174775 172111 169252 166586 164487 162587 160008 156724 153810 151895 150316 148393 146435
57577 146435 144773 142833 140147 137315 134907 132323 128879 125280 122651 120682 118063 114457 110815 107925
57563 107925 105758 104148 103038 102051 100717 99215 98161 97668 97239 96556 95793 95227 95061 95478 96383 97296 97918
57546 97918 98568 99628 100940 102221 103640 105397 107113 108283 109002 109720 110660 111934 113748 115847 117277
57531 117277 117428 116914 116693 116740 116413 115686 115100 114702 114013 113019 112408 112689 113613 114512 114825 114407 113661 113218 113206
57512A13206M9J91J194K706L509L243K687K180J212k15j182j363j587k274k625
57497A20931k098j511j761k482k885l066l427l611l029k002j416j514j750j652
57483H8727j310j108j297j701j786j313p55n70m02K54R04O72j00j75N41P27k15
57466H1093j178j067l18J28K44N26J035J511J738J289k22k078k670j416L93J303
57450H0311J291J054P21J05o16j291k074k667k254q78J39M7j56M88J078L10j149
57433G4459j468m63K22k89r98q64l07j64k42J34P65P50r6q60p07R3O76P86Q49
57414G2276R72O33l73j368j689j579j503j168j31J064J437J041P07M95l46j704
57398F8764k314j529k88K82K56K70M15M13K89K39K55L17N25Q50J158J552K144
$$ plain form
57512 113206 113255 113446 114640 117346 120855 124098 126785 128965 130177 129962 128780 127417 125830 123556 120931
57497 120931 118833 117322 115561 113079 110194 107128 103701 100090 97061 95059 93643 92129 90379 88727
57483 88727 87417 86309 85012 83311 81525 80212 79457 78887 78485 78739 79643 80315 80215 80040 80581 81308 81093
57466 81093 79915 78848 78530 78658 78902 79428 80463 81974 83712 85001 84779 82701 80031 78615 79008 80311
57450 80311 81602 82656 83377 83482 82866 81575 79501 76834 74580 73702 73841 73888 73732 74220 75298 75608 74459
57433 74459 72991 72528 72750 72461 71463 70599 70292 70128 69886 70020 70785 71535 71439 70579 69872 69965 70641 71427 72276
57414 72276 73248 73881 73508 72140 70451 68872 67369 66201 66070 67134 68571 69612 70319 70814 70468 68764
57398 68764 66450 64921 64633 64915 65171 65441 65856 66269 66558 66797 67052 67369 67894 68744 69902 71454 73598
57381G3598K524K167J284M73k45j087j489p15O37J131O06K14K40l52j741k459
57365G4786j660n46m27q09n90R1M29L73K77l0o94j149r32m14NO13J428J632Q99
57346G3282K19M16Q02N06lN9J91m51j357j382o31j29r4O5L92L80J59L97J092J491
57326G5404J152K51r57k079k361j449j74K54l49j195j654j613j126m56o2P3N71
57309F4230J530K007J350L62J46N70Q35Q63J018J105Q05N47Q36J209R63M07K63
57292G9046L87L40O27J979L762M549M064L339L060L073L301L872M416M436M334
57277A24585M906N876O124N351M413L939L674L247K627J775O40m40j181j927l034
57262A60575l959l915l137k555k434k414k468k790l003k636k136k262k733k646
$$ plain form
57381 73598 76122 78289 79573 80046 79801 78714 77225 76510 77147 78278 78884 79098 79338 78986 77245 74786
57365 74786 73126 72580 72153 71344 70754 70845 71274 71647 71924 71894 71200 70051 69119 68705 68710 69323 70751 72383 73282
57346 73282 73501 73917 74719 75225 75222 75281 75472 75021 73664 72282 71651 71522 71428 71493 71885 72265 72424 72821 73913 75404
57326 75404 76556 76807 75850 73771 71410 69961 69787 70041 69692 68497 66843 65230 64104 63648 63586 63659 64230
57309 64230 65760 67767 69117 69479 69625 70195 71030 71893 72911 74016 74821 75368 76204 77413 78376 78783 79046
57292 79046 79433 79773 80400 82379 86141 90690 94754 98093 101153 104226 107527 111399 115815 120251 124585
57277 124585 129491 135367 141491 146842 151255 155194 158868 162115 164742 166517 167157 166717 165536 163609 160575
57262 160575 156616 152701 149564 147009 144575 142161 139693 136903 133900 131264 129128 126866 124133 121487
57248A21487j967j316o33N07J546J446N16J22N29O32j3m73j23N09R73J542K137
57231A27421K032J211P29J079J462J334J409K288L266L439L094L061L382L513
57217A58720L285K970K811K971L508L998L812L120K874L412L922L815L815M902
57203B07935O783Q186Q453Q080P874Q083Q414Q538Q465Q417Q376Q054P556P586
57189C20800Q561R853J0680J1274J2325J3548J3942J3401J3002J3539J4720J5920
57177D71565J6805J7105J6797J6590J7317J8670J9553J9725J9938K0361K0243
57166F74669J9467J8981J9113J8836J7540J6336J6567J7995J9549K0977K2682
57155H82712K4510K5908K6917K8021K9178K9745K9300K7943K6001K3896K2072
$$ plain form
57248 121487 119520 118204 117571 118078 119624 121070 121586 121708 122237 122869 122856 122383 122260 122769 123742 125284 127421
57231 127421 129453 130664 131393 132472 133934 135268 136677 138965 142231 145670 148764 151825 155207 158720
57217 158720 162005 164975 167786 170757 174265 178263 182075 185195 188069 191481 195403 199218 203033 207935
57203 207935 214718 222904 231357 239437 247311 255394 263808 272346 280811 289228 297604 305658 313214 320800
57189 320800 329361 339214 349894 361168 373493 387041 400983 414384 427386 440925 455645 471565
57177 471565 488370 505475 522272 538862 556179 574849 594402 614127 634065 654426 674669
57166 674669 694136 713117 732230 751066 768606 784942 801509 819504 839053 860030 882712
57155 882712 907222 933130 960047 988068 1017246 1046991 1076291 1104234 1130235 1154131 1176203
57144A176203K0601J9125J7451J5831J4400J2882J1249J0124J0022J0663J1495
57133A330046J2428J3503J4391J4874J5458J6872J9165K1839K4630K7669L0983
57122A541858L4353L7569M0564M3359M6100M8982N2021N5174N8724O3152O8523
57111B090379P4489Q1174Q9443R9948J12468J26713J43329J63576J88450K18852
57101C388821K56402L03422L62115M34416N22664O29833P58644R10613J085880
57092H652810J283242J499524J728685J961806K187867K394331K567736K695607
57084B4971608K769027K782731K732088K611850K420400K163697J849922J477849
57076D3779172J034947N13351p0100o70986j234670j717055k093920k359420k521310
$$ plain form
57144 1176203 1196804 1215929 1233380 1249211 1263611 1276493 1287742 1297866 1307888 1318551 1330046
57133 1330046 1342474 1355977 1370368 1385242 1400700 1417572 1436737 1458576 1483206 1510875 1541858
57122 1541858 1576211 1613780 1654344 1697703 1743803 1792785 1844806 1899980 1958704 2021856 2090379
57111 2090379 2164868 2246042 2335485 2435433 2547901 2674614 2817943 2981519 3169969 3388821
57101 3388821 3645223 3948645 4310760 4745176 5267840 5897673 6656317 7566930 8652810
57092 8652810 9936052 11435576 13164261 15126067 17313934 19708265 22276001 24971608
57084 24971608 27740635 30523366 33255454 35867304 38287704 40451401 42301323 43779172
57076 43779172 44814119 45327470 45257370 44586384 43351714 41634659 39540739 37181319 34660009
57067C4660009k595763k601321k553898k465302k344352k198217k033611j857955
57059A6009590j679338j504849j339296j185634j045775r20445q09096p10737
57051F814420o24581n49649m84473m27729l78611l36257k99361k66817k38281
57042C208661k13713j92689j74360j57786j42297j27919j15266j04590r5180q6346
57032A798515p8397p1752o5623n8936n2091m6273m1287l5771k9418k3046j6353
57021A279568p642L840J7298L2603N1066P3671J00679J32601J67018J92337J89534
57010B232573J46269O9797j6776r0953j42261j70639j79828j74466j60039j41745
57000A371932j22967j05340q9673p6241o4916n5518m7758m0902l4260k7982k2676
$$ plain form
57067 34660009 32064246 29462925 26909027 24443725 22099373 19901156 17867545 16009590
57059 16009590 14330252 12825403 11486107 10300473 9254698 8334253 7525157 6814420
57051 6814420 6189839 5640190 5155717 4727988 4349377 4013120 3713759 3446942 3208661
57042 3208661 2994948 2802259 2627899 2470113 2327816 2199897 2084631 1980041 1884861 1798515
57032 1798515 1720118 1648366 1582743 1523807 1471716 1425443 1384156 1348385 1318967 1295921 1279568
57021 1279568 1271926 1275766 1293064 1325667 1376733 1450404 1551083 1683684 1850702 2043039 2232573
57010 2232573 2378842 2448639 2431863 2340910 2198649 2028010 1848182 1673716 1513677 1371932
57000 1371932 1248965 1143625 1053952 977711 912795 857277 809519 768617 734357 706375 683699
56989F83699j8356j4532j1146q480o208l521l30K480M061M082K246j687p132j2572
56975F12604j6542j8397j8282j6918j5353j4179j3005j1233r143p536o422m878
56963D60716k271J089M580P906J1018J3914J6712J9363K1050K0312J6015Q227
56951E98631j658j1428j9003k3421k5067k4822k3305k0951j8297j5614j2626r073
56939C93366n272j681J729N222Q730J2119J5686J9885K4631K9122L1982L1342
56927E66861K5649J5112K087j0540k1065k8782l3032l3488l1073k7539k4132k1150
56915C78908j8582j6444j4557j2654j0764r144p921p084o519n885m872l793l337
56902B57352l397k881j234O22J514J500J374J470J824K889N000P555R731J1674
$$ plain form
56989 683699 665343 650811 639665 631185 624977 621456 621126 623606 627667 631749 633995 632308 625176 612604
56975 612604 596062 577665 559383 542465 527112 512933 499928 488695 479552 472016 465594 460716
56963 460716 458445 459534 464114 472020 483038 496952 513664 533027 554077 574389 590404 598631
56951 598631 596973 585545 566542 543121 518054 493232 469927 448976 430679 415065 402439 393366
56939 393366 388094 386413 388142 393364 402094 414213 429899 449784 474415 503537 535519 566861
56927 566861 592510 607622 609709 599169 578104 549322 516290 482802 451729 424190 400058 378908
56915 378908 360326 343882 329325 316671 305907 296763 288842 281758 275239 269354 264482 260689 257352
56902 257352 253955 251074 249840 250462 251976 253476 254850 256320 258144 261033 266033 273588 283319 294993
56888B94993J4133J7220K0413K3344K5554K5784K2712J6430Q416J94p212j2840
56876D49141j5879j6391j5211j3027j0145o915l785p98K440O326J1068J6571K2344
56863D25739K7909L3658M0594M8811N6732O2135O2968N7056M2836K1787r89k0165
56851H59071l3670m1960m5344m3883l9093l3332k7506k0965j3557o081J262R242
56839E64184J8198K7691L7751M9115O2025P5831Q9512J00931J05479R7510P4589
56828A302816M0001R52l5132o3062q0731q8822q9342q4094p4677o3290n2231m2382
56816F70006l3071k3531j3735l922N826J5552K5664L6885M9128O0786O9747P4279
56804I33614P1970N9377L5261M037k6210m9549o4690p2521p3783o9796o2953n5102
$$ plain form
56888 294993 309126 326346 346759 370103 395657 421441 444153 460583 468999 469193 461981 449141
56876 449141 433262 416871 401660 388633 378488 371573 367788 366990 369430 375756 386824 403395 425739
56863 425739 453648 487306 527900 576711 633443 695578 758546 815602 858438 880225 879236 859071
56851 859071 825401 783441 738097 694214 655121 621789 594283 573318 559761 553680 554942 564184
56839 564184 582382 610073 647824 696939 758964 834795 924307 1025238 1130717 1228227 1302816
56828 1302816 1342817 1343769 1308637 1245575 1164844 1076022 986680 902586 827909 764619 712388 670006
56816 670006 636935 613404 599669 595747 601573 617125 642789 679674 728802 789588 859335 933614
56804 933614 1005584 1064961 1100222 1104259 1078049 1028500 963810 891289 817506 747710 684757 629655
56792F29655m6651l7908k9867k2992j6602j0184m059J815Q259J5446K2379K8405
56780E37696L3763L7769L7871L1700J9396L375j3202k7311l6870m1715m3168m2250
56768D97054l9244l5011l1078k7886k4464k0540j7339j5445j3620j0909q433p628
56756B45457p908p658o559n513m888m271l470k645j819j196j380k472l452l318
56742A88908k315j335p82o74j086j712j703p89R0K2o72j166j294j246r45n01n33
56725A72267j206j686j351p46n73n43j10N00Q49J126J540J707J492J618K405K810
56709A80099J810N1j054j187r89p30k86R7J37K16P28J210J051N48K82P3m53q53
56691A80750n91k33o87j657k083j733j284j024o24OO07J145J633J639Q70p6m09
$$ plain form
56792 629655 583004 545096 515229 492237 475635 465451 461392 463207 471466 486912 509291 537696
56780 537696 571459 609228 647099 678799 698195 701570 688368 661057 624187 582472 539304 497054
56768 497054 457810 422799 391721 363835 339371 318831 301492 286047 272427 261518 253085 245457
56756 245457 237549 229891 223332 217819 212931 208660 205190 202545 200726 199530 198150 195678 192226 188908
56742 188908 186593 185258 184476 183802 182716 181004 179301 178512 178602 178624 177952 176786 175492 174246 173301 172800 172267
56725 172267 171061 169375 168024 167278 166705 166162 166052 166552 167401 168527 170067 171774 173266 174884 177289 180099
56709 180099 181909 181960 180906 179719 178730 178000 177714 177811 177948 178164 178892 180102 181153 181701 181983 182056 181603 180750
56691 180750 180159 179926 179239 177582 175499 173766 172482 171458 170834 170840 171447 172592 174225 175864 176734 176658 176249
56674A76249k47k21l53l21l49p98j214q38J28Q07R67J072J261J308J378J814K241
56657A82884J869P13l38o83m76qO31J245J543J394P17n98k202l140k777j553k19
56640A79002J027K168K743K494K095K319K940L267L258L275L236K849K232J604
56626B14509Q98L26N43J418J631M76q59j099q47j315k095j998j331j368k003j952
56610B04934j138q40j464k060k179k363k534j802l23M25j75r55q81m53m98q92
56594A86802j208j511j800j647r99m33j34L61J077J277P98N02R02J387J408J333
56578A88115J489J416R23Q23J672K655K667J928J521J862K460K890L097K971K371
56563B18860J590J326K082L727N551O745P151P453Q258R025Q521O452L948K327
$$ plain form
56674 176249 176002 175781 175428 175107 174758 173960 172746 171908 172036 172843 173810 174882 176143 177451 178829 180643 182884
56657 182884 184753 185466 185128 184445 183969 183961 184592 185837 187380 188774 189491 188893 186691 183551 180774 179221 179002
56640 179002 180029 182197 184940 187434 189529 191848 194788 198055 201313 204588 207824 210673 212905 214509
56626 214509 215407 215733 216276 217694 219325 219801 218942 217843 216996 215681 213586 211588 210257 208889 206886 204934
56610 204934 203796 202956 201492 199432 197253 194890 192356 190554 190231 190656 190481 189526 188645 188192 187694 186802
56594 186802 185594 184083 182283 180636 179637 179204 179070 179431 180508 181785 182583 183085 183987 185374 186782 188115
56578 188115 189604 191020 191943 192766 194438 197093 199760 201688 203209 205071 207531 210421 213518 216489 218860
56563 218860 220450 221776 223858 227585 233136 239881 247032 254485 262743 271768 280289 286741 290689 293016
56549B93016J933K317K830K797J858N32j09L40J179J597J495J065K45r49k016
56534C08130k462k458k616l278m185m762m678m253m114m271l860k352o03kp84
56519B63452j942k615k726k425j860j535j866k303j874p81m00j340k523k639j675
56504B34948m42N19R84P15j25p77p79o56j140k038k447j927r44k19j2j5J44L51
56486B26140J31o06j230j243j055j279j538r42L31R85L73o54j046r39j034j287
56470B15107r31L81K042L075L000K206J543J464J609J383P60K67K81Q08J683K562
56454B37240K872K372J628J363J459J191L68l69m08J85R56J496J669J712J994
56439B55728K380K279J641J283J609J795J094K40L37J047J161N92K57K98k8o70
$$ plain form
56549 293016 294949 297266 300096 302893 304751 305283 305174 305514 306693 308290 309785 310850 311095 310146 308130
56534 308130 305668 303210 300594 297316 293131 288369 283691 279438 275324 271053 267193 264841 264238 264236 263452
56519 263452 261510 258895 256169 253744 251884 250349 248483 246180 244306 243525 243125 241785 239262 236623 234948
56504 234948 234506 235025 236009 236724 236599 235822 235043 234387 233247 231209 228762 226835 225891 225672 225660 225645 225789 226140
56486 226140 226271 225665 224435 223192 222137 220858 219320 218378 218709 219694 220067 219413 218367 217428 216394 215107
56470 215107 214176 214557 216599 219674 222674 224880 226423 227887 229496 230879 231639 231906 232187 232995 234678 237240
56454 237240 240112 242484 244112 245475 246934 248125 248493 248124 247716 247901 248857 250353 252022 253734 255728
56439 255728 258108 260387 262028 263311 264920 266715 267809 268049 268386 269433 270594 271186 271443 271741 271713 271043
56423B71043o90nK77l54j019r63n59k99K9O05J015R32N23j51j244k371k758k352
56405B61659j833j364m87N92R92P32R42K002K845K755K493K831L260L031K422
56390B82872J990J551Q04J57Qm1m74j009j125q12j90Q65K122K774K414J512N44
56373B93962n29j528j856j563j491j813j607o30j65j081k268k236j267o42n51
56358B74735k26M27P69P08P94J140J271J010O61M31L57N82J115J513J360R00O98
56341B88245J017J777K661K958J978K00p86j02J246J771J363J009J219J653J980
56326C08189K164K173K053K117K533K945K986K849K889L023K920K537K034J508
56312C42920J042O48P9q23j493j102K36J464K003K266K515K323J655J377J963
$$ plain form
56423 271043 270353 270348 270625 270271 269252 268289 267730 267431 267460 268065 269080 270012 270535 270384 269140 266769 264011 261659
56405 261659 259826 258462 257975 258567 259559 260291 261233 263235 266080 268835 271328 274159 277419 280450 282872
56390 282872 284862 286413 287217 287374 287382 287341 286867 285858 284733 283921 283731 284596 286718 289492 291906 293418 293962
56373 293962 293433 291905 290049 288486 286995 285182 283575 282945 282780 281699 279431 277195 275928 275286 274735
56358 274735 274509 274936 275705 276413 277207 278347 279618 280628 281289 281720 282077 282659 283774 285287 286647 287547 288245
56341 288245 289262 291039 293700 296658 298636 298836 298050 297948 299194 300965 302328 303337 304556 306209 308189
56326 308189 310353 312526 314579 316696 319229 322174 325160 328009 330898 333921 336841 339378 341412 342920
56312 342920 343962 344610 344689 343866 342373 341271 341507 342971 344974 347240 349755 352078 353733 355110 357073
56297C57073K644K611K223K197K367K149J626J289J138Q43M51L16O32J364K321
56282C81244L058L206L080L321L872M074L840L753L900L762L485L989N364O480
56268D36428O663O509O534O410O110O420P469Q195Q177Q560J0194J2198J3511
56255E43378J4549J6122J7960J9661K1931K5505K9727L3576L7251M1453M5954
56244H47067N0070N3881N7802O1568O4703O7166O8733O8590O6468O3150N8955
56233A528153N2847M4146L3948K3635J3199K272q362j7783k6328l4609m1995m7522
56221A521601n1334n3954n5113n4711n3709n2749n0983m7795m4437m2242m0366
56210I74208l7309l3514l0547k8484k6240k3801k2048k0864j9374j7677j6501
$$ plain form
56297 357073 359717 362328 364551 366748 369115 371264 372890 374179 375317 376160 376611 376927 377559 378923 381244
56282 381244 384302 387508 390588 393909 397781 401855 405695 409448 413348 417110 420595 424584 429948 436428
56268 436428 443091 449600 456134 462544 468654 475074 482543 490738 498915 507475 517669 529867 543378
56255 543378 557927 574049 592009 611670 633601 659106 688833 722409 759660 801113 847067
56244 847067 897137 951018 1008820 1070388 1135091 1202257 1270990 1339580 1406048 1469198 1528153
56233 1528153 1581000 1625146 1659094 1682729 1695928 1698200 1689838 1672055 1645727 1611118 1569123 1521601
56221 1521601 1470267 1416313 1361200 1306489 1252780 1200031 1149048 1101253 1056816 1014574 974208
56210 974208 936899 903385 872838 844354 818114 794313 772265 751401 732027 714350 697849
56199F97849j5535j3809j1371r079p137n348m168l899l596k373j089r73j411j004
56185F17057o3J7p05r02l11J91L89P00P28j15r14l09J100J482O69J71M71N59J85
56166F20400L87J470K444K880L525M674N555N696N576N666O009O726P763Q354
56152F87125Q036P823Q990J1074J2525J3006J3449J4304J5340J6813J9154K1871
56140H49510K4229K6678L0051L4010L7997M3123N1243O2575P5945R0700J06585
56129A432646J22182J35337J44443J47741J42655J28362J08507Q9008P3534O2803
56119B587218N6832N4731N2913M6867L5199J9995L773j1492k3112k8812k9713
56108B764399k9979l3411m2065n7026p7419r8852j15898j26374j31134j30354
$$ plain form
56199 697849 682314 668505 657134 648055 640918 635570 631402 627503 623907 621534 620445 619472 618061 617057
56185 617057 616994 617011 616306 615404 615093 615284 615673 616373 617101 616986 616072 615763 616863 618345 619014 619185 619656 620215 620400
56166 620400 620787 622257 624701 627581 631106 635780 641335 647031 652607 658273 664282 671008 678771 687125
56152 687125 695161 702984 711974 723048 735573 748579 762028 776332 791672 808485 827639 849510
56140 849510 873739 900417 930468 964478 1002475 1045598 1096841 1159416 1235361 1326061 1432646
56129 1432646 1554828 1690165 1834608 1982349 2125004 2253366 2361873 2450881 2524415 2587218
56119 2587218 2644050 2698781 2751694 2798561 2833760 2853755 2857528 2846036 2822924 2794112 2764399
56108 2764399 2734420 2701009 2658944 2601918 2524499 2425647 2309749 2183375 2052241 1921887
56098A921887j23211j10899r6687q2664o9033n6528m6550l8758l1431k4447j9274
56087A222405j6007j3127j0121p702n579k900m76L46O02K269M452M592L094K912
56073A184760M638O013O413P665J0057J1655J2200J3698J6385J8062J8241J9035
56061A328822K1042K2183K1602K0952K0958K0435J9460J9668K0702K0268J8409
56050A554501J7590J7899J6728J4017J3070J4933J6779J7235J8541K1607K3829
56039A746729K3887K4175K6280K8357K9154L0307L2561L3952L3819L4414L6554
56028B080189L7939L7749L8408M0908M2885M3411M4961M8471N1323N2432N4486
56017B573162N8758O2633O4678O7249P1573P5397P7921Q1767Q7565R1997R3832
$$ plain form
56098 1921887 1798676 1687777 1591090 1508426 1439393 1382865 1336315 1297557 1266126 1241679 1222405
56087 1222405 1206398 1193271 1183150 1175448 1169869 1166969 1166493 1166839 1167441 1169710 1174162 1178754 1181848 1184760
56073 1184760 1189398 1195411 1201824 1209489 1219546 1231201 1243401 1257099 1273484 1291546 1309787 1328822
56061 1328822 1349864 1372047 1393649 1414601 1435559 1455994 1475454 1495122 1515824 1536092 1554501
56050 1554501 1572091 1589990 1606718 1620735 1633805 1648738 1665517 1682752 1701293 1722900 1746729
56039 1746729 1770616 1794791 1821071 1849428 1878582 1908889 1941450 1975402 2009221 2043635 2080189
56028 2080189 2118128 2155877 2194285 2235193 2278078 2321489 2366450 2414921 2466244 2518676 2573162
56017 2573162 2631920 2694553 2759231 2826480 2898053 2973450 3051371 3133138 3220703 3312700 3406532
56006C406532R6328J00935J04500J05621J07800J13118J18857J23621J30473J40581
55996D548366J50110J57072J64921J75822J86989J97172K09677K25320K39835
55987F255284K52207K67724K88591L09777L28628L49917L76624M04736M32486
55978I265974M65246N05906N50165N97015O53228P21439P95246Q72864R63444
55969A5390527J072581J194900J329362J487941J680046J903523K161701K474064
55961B8694645K859383L325922L891362M595353N480984O585385P962890R694142
55953G3090066J1856609J4508062J7702237K1475679K5804412L0612284L5755795
55946B30805144M0732753M4183538M3866281L7689945K5284345Q711974q451228
$$ plain form
56006 3406532 3502860 3603795 3708295 3813916 3921716 4034834 4153691 4277312 4407785 4548366
55996 4548366 4698476 4855548 5020469 5196291 5383280 5580452 5790129 6015449 6255284
55987 6255284 6507491 6775215 7063806 7373583 7702211 8052128 8428752 8833488 9265974
55978 9265974 9731220 10237126 10787291 11384306 12037534 12758973 13554219 14427083 15390527
55969 15390527 16463108 17658008 18987370 20475311 22155357 24058880 26220581 28694645
55961 28694645 31554028 34879950 38771312 43366665 48847649 55433034 63395924 73090066
55953 73090066 84946675 99454737 117156974 138632653 164437065 195049349 230805144
55946 230805144 271537897 315721435 359587716 397277661 422562006 431273980 422822752
55939D22822752k2904746l2855447l8085072l9349283l7793211l4581317l0655572
55932A86598104k6623504k2809583j9373012j6373521j3796914j1598989r745912
55925F6276669q207916o938231n884674n011693m293565l698349l196009k772239
55917B6273993k418961k120073j859561j634083j444539j283160j140354j016033
55909A3357229r12766q24841p44634o73092o13920n63556n16166m72765m36453
55900G599036m04225l71885l41862l17993k97471k75739k54581k37802k23335
55891D874143k07093j90635j77782j67246j55383j42863j32142j21544j08119
55882C471336r3351q0123o6851n0264l1341j3180M161K1428L5434M1905M0732
$$ plain form
55939 422822752 399918006 367062559 328977487 289628204 251834993 217253676 186598104
55932 186598104 159974600 137165017 117792005 101418484 87621570 76022581 66276669
55925 66276669 58068753 51130522 45245848 40234155 35940590 32242241 29046232 26273993
55917 26273993 23855032 21734959 19875398 18241315 16796776 15513616 14373262 13357229
55909 13357229 12444463 11619622 10874988 10201896 9587976 9024420 8508254 8035489 7599036
55900 7599036 7194811 6822926 6481064 6163071 5865600 5589861 5335280 5097478 4874143
55891 4874143 4667050 4476415 4298633 4131387 3976004 3833141 3700999 3579455 3471336
55882 3471336 3377985 3297862 3231011 3180747 3149406 3136226 3140387 3161815 3197249 3239154 3279886
55871C279886L3705J9567l647l3515o5003r5209j22226j41989j51160j51441j46880
55860B422088j38811j27244j14656j03874r4140q3501p3251o5878o0515n4652
55850A505566m8703m4799m2613m0288l8129l7475l7315l5692l3235l1713l0500
55839A085104k8071k5535k4932k5219k3742k0702j8575j7884j7052j5739j4989
55828H52664j4596j3472j2076j1614j1471j0293q869r090j0704j1863j2214j2784
55816G13618j3423j3075j2021j1374j0926r796q471p900p431n982m304l637l137
55803F02141j280J173K411K902M632P555R583R812R100P771N300K121n98k909
55789F59714n675q538j0301j0986j1443j1408j0016p839o378o026o526q559j2585
$$ plain form
55871 3279886 3313591 3333158 3329511 3295996 3230993 3135784 3013558 2871569 2720409 2568968 2422088
55860 2422088 2283277 2156033 2041377 1937503 1843363 1759862 1686611 1620733 1560218 1505566
55850 1505566 1456863 1412064 1369451 1329163 1291034 1253559 1216244 1180552 1147317 1115604 1085104
55839 1085104 1057033 1031498 1006566 981347 957605 936903 918328 900444 883392 867653 852664
55828 852664 838068 824596 812520 800906 789435 779142 770273 761183 750479 738616 726402 713618
55816 713618 700195 687120 675099 663725 652799 643003 634532 626632 619201 613219 608915 605278 602141
55803 602141 600861 602034 604445 607347 611979 619534 629117 638929 648029 655800 661100 663221 662623 659714
55789 659714 654039 645501 635200 624214 612771 601363 591347 583508 577130 571104 564578 556019 543434
55776E43434j6726j8379j7551j6242j5047j2878r722o925m650j702J751L686L015
55763D32064R33j019k434l294l445l253l393l671l382k748k710l431m319n281
55749C90617o570p668p866p621p845q239p912p198p106p351o769n402m345l748
55735B94977k809j616j121j354j415j191j311j542j109n17j161k990m485n053
55721B67303n592o395o488n482m303l547k662j333k04L20O37R39R12Q49J687L414
55705B40055M716M727M031L466K939J914K43j824l804m973n002m568m601n068
55691B32251n280n142n022m731l753k371j351o95J40R44R93M54L52J100K148L009
55675B13046L487L137J723J7r78j431k105k824k843k387k268k286j651p57p87
$$ plain form
55776 543434 526708 508329 490778 474536 459489 446611 436889 429964 425314 423612 425363 429049 432064
55763 432064 432997 431978 429544 426250 422805 419552 416159 412488 409106 406358 403648 400217 395898 390617
55749 390617 384047 376379 368513 360892 353047 344808 336896 329698 322592 315241 308472 303070 298725 294977
55735 294977 292168 290552 289431 288077 286662 285471 284160 282618 281509 280992 279831 276841 272356 267303
55721 267303 261711 255316 248828 243346 239043 235496 232834 231501 231297 231617 232254 233193 234105 234954 236641 240055
55705 240055 244771 249498 253529 256995 259934 261848 262091 260267 256463 251490 246488 241920 237319 232251
55691 232251 226971 221829 216807 212076 208323 205952 204601 203906 204046 204990 205983 206437 206789 207889 210037 213046
55675 213046 216533 219670 221393 221410 220432 219001 216896 214072 211229 208842 206574 204288 202637 201880 201093
55660B01093j547j522k18J233K036K616L261L529L438L714M432M737M341L879
55646B35022L470K404O61o64j030j245k127l509m931o165o772o377n621n584o083
55631A91449n936n038m557m791m605l517k602k519k336j309l16l60q73p95l17
55616A51578l74j084j786k071k001j744j585j722j766j097jM30j15o80n63k74
55600A35145l83m67P6R41J307P76m90j866k346j401L8M45k33o02j05J55n23j154
55582A29313p84j66m29j164j168m19J2l83j031j244q28O3J003J425J167P28O37
55565A26732Q65J113J302J449J476J341J051M95k89q40q81r81j756k652k602j755
55549A24068j300j529j525r24m96o05n59m9K39Q0K59Q97Q19m31j405q04N72J248
$$ plain form
55660 201093 199546 198024 197806 199039 201075 203691 206952 210481 213919 217633 222065 226802 231143 235022
55646 235022 238492 240896 241557 240893 239863 238618 236491 232982 228051 221886 215114 208737 203116 197532 191449
55631 191449 185513 180475 175918 171127 166522 163005 160403 157884 155548 154239 153923 153563 152690 151895 151578
55616 151578 151204 150120 148334 146263 144262 142518 140933 139211 137445 136348 136347 136777 136662 135982 135419 135145
55600 135145 134762 134295 134371 135312 136619 137395 136905 135039 132693 131292 131330 131775 131542 130940 130835 130990 130467 129313
55582 129313 128529 128363 127934 126770 125602 125183 125195 124812 123781 122537 121709 121772 122775 124200 125367 126095 126732
55565 126732 127597 128710 130012 131461 132937 134278 135329 135824 135535 134695 133814 132833 131077 128425 125823 124068
55549 124068 122768 121239 119714 118790 118294 117689 117130 117081 117320 117400 117659 118556 119375 118944 117539 116735 117307 118555
55531A18555J239J388J508P58o98j856k317k368k103j517j115j375j990k466k977
55516A02666l708m024l284j971r56j77Q78J825J804R20J68qk6k15m42o80j075
55499I1695j599k174k943l758l859k842j475p13k79P33K177K967K735K287K285
55484H5237K427K179J565R86P46Q96J130R81M37J38M83Q65N07l05o00j95J26j45
55466I7458o19p39m70l4M50Q55J008R04O62K42m32j119j378j074n19j27p9j60
55448I4829J55J186K415K770J874O16Q1K36K15m32j247j526j047k34J70k19r24
55431I8918j036l38M19N70K93J5k39m71l30K62O65L83q3MM34M48J4j45K96Q43
55411A00922R90Q14O89P33O87K07o58j276j085m62l76j009j430j019l97m09q74
$$ plain form
55531 118555 119794 121182 122690 123448 122750 120894 118577 116209 114106 112589 111474 110099 108109 105643 102666
55516 102666 98958 94934 91650 89679 88723 88546 89424 91249 93053 93973 94141 94133 94107 93892 93450 92770 91695
55499 91695 90096 87922 84979 81221 77362 74520 73045 72332 72053 72786 74963 77930 80665 82952 85237
55484 85237 87664 89843 91408 92394 93140 94036 95166 96147 96584 96722 97205 98070 98577 98272 97672 97477 97603 97458
55466 97458 96839 96100 95630 95596 96046 96901 97909 98813 99475 99717 99285 98166 96788 95714 95195 95068 94989 94829
55448 94829 94984 96170 98585 101355 103229 103845 103926 104162 104377 103945 102698 101172 100125 99891 100061 99842 98918
55431 98918 97882 97544 97963 98533 98826 98841 98602 98131 97801 98063 98728 99111 99028 99032 99466 99914 99928 99783 100079 100922
55411 100922 101912 102726 103415 104148 104835 105042 104384 103108 102023 101561 101185 100176 98746 97727 97330 96921 96047
55394I6047j054p66l14J74O48Q28O88P12J009Q06l38j534j707j204j128j507j359
55377I0001m03N75J045J304J599J651J263O67J11k07J22J179K047J586L4j079
55361A01495q53l3K26j70n12m26j65n7r4j1L52Q21J012P92M37K13N1j09n7L23
55341A03235O93O28J67l56o77o10j33L19J80l16k68M03N16o82k177k482j565n20
55323I6355J2O8m05j302j762j047K01P23L29j98n15p79o43L41J456J405K66n94
55305I3911n81m65o56m30O30J719J984J545P85k82j402j771j041J21R81J510J849
55288I8407J798J320P75K64m85j249j186j8J392K123K045J386K74q47j312j223
55272A03464j409j944j733k17J501K055J473O12j93r56j184l94Q71J568J479J218
$$ plain form
55394 96047 94993 94227 93913 94087 94735 95563 96251 96963 97972 98778 98440 96906 95199 93995 92867 91360 90001
55377 90001 89598 90173 91218 92522 94121 95772 97035 97702 97813 97606 97728 98907 100954 102540 102574 101495
55361 101495 100642 100609 100835 100665 100153 99727 99562 99505 99411 99400 99752 100573 101585 102377 102814 103027 103078 102969 102912 103235
55341 103235 103928 104556 104723 104367 103690 103080 102947 103266 103446 103130 102862 103265 103781 103099 100922 98440 96875 96355
55323 96355 96367 96435 96030 94728 92966 91919 92120 92843 93172 92974 92459 91680 91037 91378 92834 94239 94505 93911
55305 93911 93330 92865 92209 91779 92409 94128 96112 97657 98442 98160 96758 94987 93946 94067 95048 96558 98407
55288 98407 100205 101525 102300 102564 102079 100830 99644 99626 101018 103141 105186 106572 106846 105999 104687 103464
55272 103464 102055 100111 98378 98161 99662 101717 103190 103802 103609 102653 101469 101075 101946 103514 104993 106211
55256A06211J158J075P85M16R3j74l61n28q38j170j052l79K26J87l00p18r61j067
55238A02603p43J29Q50N67n15j245q70K28J106J130L01p96j332r04L2O05M41m7
55220A01540k52p1P3j83n81n36j5K50j98p00l18P01J191P49K28L32O62N98L06
55201A03776K54M03M52L96K38k78j090j460q42L19J173J478J478J179M76l23p11
55184A06918n79j31N17J164J223L20r92j675j340n24J02L57M26N46P86R76Q52
55167A08946L75k21o90q55m45N98J634J787J129P14J087J452Q77l79j338j567
55151A13104j341r69o56o23q06q03n70o44j108j075NJ206J312O04K93N98O32J09
55133A09268k20K4K67J53J57N41O65O7n81l55N05Q86K49p79j216o76M68J491J762
$$ plain form
55256 106211 107369 108444 109229 109645 109738 109564 109203 108675 107837 106667 105615 105236 105462 105649 105349 104631 103670 102603
55238 102603 101860 101989 102839 103406 102891 101646 100776 101004 102110 103240 103541 102745 101413 100509 100541 101146 101587 101540
55220 101540 101288 101217 101290 101107 100526 99990 99975 100225 100027 99327 99009 99710 100901 101650 101878 102210 102872 103470 103776
55201 103776 104030 104433 104885 105281 105519 105241 104151 102691 101849 102168 103341 104819 106297 107476 107952 107629 106918
55184 106918 106339 106208 106725 107889 109112 109432 108440 106765 105425 104901 105003 105360 105786 106332 107118 108094 108946
55167 108946 109321 109100 108410 107555 107110 107708 109342 111129 112258 112972 114059 115511 116388 116009 114671 113104
55151 113104 111763 110794 110138 109515 108709 107906 107336 106692 105584 104509 104514 105720 107032 107636 107929 108527 109159 109268
55133 109268 109048 109072 109339 109492 109649 110190 110855 110922 110341 109986 110491 111377 111626 110847 109631 108955 109423 110914 112676
55114A12676J116l3r17r34j46P52J129J050J004J098R25L65n6O9M19M93L74L90
55096A19774L73r5r02j438j326p00R6O67O40L8n55o39l47j3L56O71M14n21j144
55077A15349n10P90J333Q79N10P50Q37J33q71j443j542j381r18l08m7j82p6M74
55059A13777P41K24l73j43O81J188J066O40L5p89j464j506j026m74Q6O71P39j36
55041A13937j102p47Q27J835J155k15p14k81J39L84J036J890J851O27o18q43m49
55024A18712l44m55n3Q27J321J009L78m8k86m76n70o88j105j594j434m79M02M57
55006A15574R4K21R57J634J774J383N68m86j246j246p24l69l93m02j07L74Q53
54989A18459J208J210P22J20j9L22O36O90P27Q37P53M05J20J3k29p46j084p89
$$ plain form
55114 112676 113792 113759 112842 111908 111762 112514 113643 114693 115697 116795 117720 118085 118029 118098 118517 119010 119384 119774
55096 119774 120147 120052 119150 117712 116386 115686 115782 116449 117089 117127 116572 115933 115586 115573 115929 116600 117014 116493 115349
55077 115349 114839 115629 116962 117841 118351 119101 119938 120071 119200 117757 116215 114834 113916 113608 113561 113379 113303 113777
55059 113777 114518 114742 114369 114226 114907 116095 117161 117801 117836 117047 115583 114077 113051 112577 112663 113334 114073 113937
55041 113937 112835 112088 112915 114750 115905 115690 114976 114695 114834 115218 116254 118144 119995 120622 120004 119161 118712
55024 118712 118368 117913 117860 118687 120008 121017 121395 121347 121061 120585 120015 119327 118222 116628 115194 114715 115117 115574
55006 115574 115668 115889 116846 118480 120254 121637 122205 121719 120473 119227 118503 118134 117741 117339 117232 117606 118459
54989 118459 119667 120877 121599 121719 121700 122022 122658 123348 124075 124912 125665 126070 126190 126203 125974 125228 124144 123355
54971A23355k0O79R71R08P66Q42J158J242O18m64j173j097o86m85m16r6N47J279
54953A27928J865K087J737R19O1n25q91j087r75n75j88J24P17J646K215J804P79
54936A37641O3o1q7l27m27l9N57Q09O87O74J101J735K216K641L439M671N868O736
54918A67897P635Q878R968J0076R094P621N974L974J753j65j779l759o208q076
54904B12883q437p779p281p299p279o827n996m825l360k038j351j164r86q01r58
54889A46502j309j237n92J61P97J596K537L007K634J891J488J720K667M362O411
54874A72635P939Q536Q719R023R085Q236O477M204J407j923m894o381o608p019
54860B09436q262r276q875p373n900m828l770k747k297k525k871k951k905k835
$$ plain form
54971 123355 123335 124014 124985 125893 126659 127501 128659 129901 130519 130055 128882 127785 127099 126614 126198 126102 126649 127928
54953 127928 129793 131880 133617 134536 134597 134072 133181 132094 131119 130544 130356 130480 131197 132843 135058 136862 137641
54936 137641 137704 137643 137556 137229 136802 136763 137320 138129 138816 139490 140591 142326 144542 147183 150622 155293 161161 167897
54918 167897 175532 184410 194378 204454 213548 221169 227143 231117 232870 232705 230926 227167 220959 212883
54904 212883 204446 196667 189386 182087 174808 167981 161985 157160 153800 151762 150411 149247 148261 147460 146502
54889 146502 145193 143956 143364 143525 144322 145918 148455 151462 154096 155987 157475 159195 161862 166224 172635
54874 172635 180574 189110 197829 206852 215937 224173 230650 234854 236261 234338 229444 223063 216455 209436
54860 209436 201174 191898 183023 175650 169750 164922 161152 158405 156108 153583 150712 147761 144856 142021
54846A42021k520j912j351j045q45p43j048j750k228k044j563j302j098m82L83
54831A22473Q28O79M94P31J196J466J456J361J251R20J43r45j756j756j129o22
54815A26790n89o28m44m73j099j678j251K7J025J218J142J230J080L88l04l96
54799A26038k17m92j162j382o02Q61K229K867K544J503L53l49m59k15O4K03K24
54782A32008K56L40L48K47K34M37O28O28P90J503K425K903L115L960N565O844
54766A62231O962O492O606P655R105J0232J0381R142O915M841L425J776j061m443
54752B40259o784p588p810q290q737q488p455o090m905m225l947l487k408j063
54738A58982j52K57O98J312J520Q96k02j007r68M4J688L158L768L640L547L969
$$ plain form
54846 142021 139501 137589 136238 135193 134348 133605 132557 130807 128579 126535 124972 123670 122572 122090 122473
54831 122473 123301 123980 124474 125205 126401 127867 129323 130684 131935 132855 132998 132053 130297 128541 127412 126790
54815 126790 126201 125573 125129 124656 123557 121879 120628 120655 121680 122898 124040 125270 126350 126738 126434 126038
54799 126038 125821 125329 124167 122785 122183 123044 125273 128140 130684 132187 132540 132191 131732 131517 131581 131784 132008
54782 132008 132264 132604 132952 133199 133433 133870 134498 135126 135916 137419 139844 142747 145862 149822 155387 162231
54766 162231 169193 175685 182291 189946 199051 209283 219664 228806 235721 240562 243987 245763 244702 240259
54752 240259 233475 225887 218077 209787 201050 192562 185107 179017 174112 169887 165940 162453 160045 158982
54738 158982 158830 159087 159785 161097 162617 163513 163311 162304 161336 161380 163068 166226 169994 173634 177181 181150
54722A81150M754N616O471P182P551P676P775P556O287L770P53j853l796n309
54708B35583o555p534q191q440q255p832p371o775n954n271n011m650l416j657
54694A48671n96n52m62L51J039O34l80q83q26r26j263j285j004r89j210j007l28
54677A38984M3k59o04m63k36m64q20n69L15J067J011K25o83j141j079q65p51n20
54659A33191R0P23O98l9p44q41n97n45o84o35l41j23j27j02K68R55J572J709J350
54640A35778Q84O25L89j42p63q66l61J14J08J7L41P68O25J8j90L78J063J067M42
54621A40295j59l67l47l16k19M4K72Q6n43r93m97R12K139K059P63n00p00lP06
54602A42632R46R51J035J070P29J4o28p62m40j11j19l43m91n48p37j037j147r82
$$ plain form
54722 181150 185904 191520 197991 205173 212724 220400 228175 235731 242018 245788 246541 244688 240892 235583
54708 235583 229028 221494 213303 204863 196608 188776 181405 174630 168676 163405 158394 153744 150328 148671
54694 148671 148075 147523 147061 147412 148451 149085 148705 147822 146996 146070 144807 143522 142518 141529 140319 139312 138984
54677 138984 139027 138768 138164 137701 137465 137001 136181 135612 135927 136994 138005 138230 137547 136406 135327 134462 133711 133191
54659 133191 133281 134004 134702 134663 133919 133078 132481 131936 131252 130617 130276 130153 130026 129924 130192 131147 132719 134428 135778
54640 135778 136662 137287 137676 137534 136771 135905 135544 135658 135766 135783 136124 136892 137517 137535 137345 137723 138786 139853 140295
54621 140295 140136 139769 139422 139106 138887 138931 139203 139289 138746 137753 137256 138168 140307 142366 143129 142629 141929 141926 142632
54602 142632 143578 144529 145564 146634 147363 147377 146749 145987 145547 145436 145317 144974 144483 143935 143198 142161 141014 140032
54584A40032q51r24q95m80j9j10p30j185r70k38O25J472K163K310J641M51n96
54567A41696j050r16m94j83k72o90r84q13l09J54M58O76P31M86J18M2L78Q12J044
54548A40884J060R05N91L45N12J013J244Q56L66N89J625K738L186K809J928R98
54532A61649M16L54O13P90O53K78j33l87l73j69o6k52n81p88q59r23r00o32k88
54513A58402k22m24n50n42p44j165j227o12J06J78k64m53r3M04O90R12J223J384
54495A57003J162Q22Q31J191J283M79j056k220j924l62R40P50m57j199r14m42
54479A55887m83n84p3O49O47j16o23j82P55J239Q86J53j82K95J301K029J882J021
54461A64501J20l52m02k20R6M75P85Q63O09J05l07k90J9J04j85l03J19N74L62
$$ plain form
54584 140032 139181 138257 137362 136882 136863 136753 136023 134838 133868 133630 134255 135727 137890 140200 141841 142292 141696
54567 141696 140646 139730 139236 139053 138781 138091 137107 136294 135985 136139 136597 137273 138004 138490 138608 138650 139028 139840 140884
54548 140884 141944 142849 143440 143785 144297 145310 146554 147410 147776 148365 149990 152728 155914 158723 160651 161649
54532 161649 162065 162419 163032 163822 164475 164753 164620 164233 163860 163691 163625 163373 162792 162004 161145 160222 159322 158690 158402
54513 158402 158180 157756 157206 156664 155920 154755 153528 152916 153022 153200 152936 152483 152390 152794 153484 154396 155619 157003
54495 157003 158165 158987 159818 161009 162292 162771 161715 159495 157571 157209 158149 158899 158442 157243 156329 155887
54479 155887 155404 154820 154747 155396 156043 155927 155304 155122 155877 157116 158002 158155 157973 158268 159569 161598 163480 164501
54461 164501 164621 164269 163867 163647 163743 164218 165003 165866 166475 166580 166273 165983 166002 166106 165921 165618 165737 166311 166673
54442A66673k97o21n53p42j251j281n71r3p12j862k331j811r35j55N89J251J528
54425A56826J366J004N30r5o14o07p0O09J209J684J700Q49n49j466j272l74M23
54408A61153P95Q87R30J099J390J418P54l48j013q64n30o31p94k51R36J950K278
54391A69159K035J420N94Q9N19J598K121J359k4q57q89p93r91j118o95J73R06
54374A74606J045N34l54j202j616j441q44j97J72J81K8rJ29K36J27p4n8K91P55
54355A72309R95P62N9p21r06k08O84O57m46j497j491q00m48n16j57Q24J446R24
54337A71470k16r47j046r59q14l77K14M91L20K2j55j31L12J278K152K056J011
54320A74681N3q7K66M82M58K86j94r42j393j234j080j639k532k755k159j624j721
$$ plain form
54442 166673 166376 165755 165202 164460 163209 161928 161357 161264 160552 158690 156359 154548 153613 153458 154047 155298 156826
54425 156826 158192 159196 159726 159631 159017 158410 158340 158949 160158 161842 163542 164391 163842 162376 161104 160730 161153
54408 161153 161948 162835 163765 164864 166254 167672 168426 168078 167065 166201 165671 165040 164246 163995 164931 166881 169159
54391 169159 171194 172614 173208 173297 173816 175414 177535 178894 178870 178013 177124 176331 175340 174222 173527 173700 174606
54374 174606 175651 176185 175831 174629 173013 171572 170728 170531 170703 170884 170912 170903 171032 171268 171395 171321 171263 171554 172309
54355 172309 173304 174066 174125 173404 172498 172290 172974 173631 173185 171688 170197 169397 168949 168433 168276 169100 170546 171470
54337 171470 171254 170307 169261 168302 167488 167111 167325 167816 168136 168158 168003 167872 168184 169462 171614 173670 174681
54320 174681 174734 174647 174913 175395 175853 176139 175945 175003 173610 172376 171296 169657 167125 164370 162211 160587 158866
54303A58866j985j784j258r35q22l75P02J960K606K286J414O13l7r05j921k317
54287A56108j606m03L49N83R01J348J335P38K01J13Q8j42j58L22P36M79j53m63
54269A60376m22m48n17k49K28L29j06o14q16p25l07O52K004L043L082J987J86
54252A67683j528k236j564k04O77O59L21K41L00J76p4k15k12j23K9Q2j14k79M7
54233A63666O05M68n77j432j043J02O18jr67j350q76K04J329J751J152K04j18
54216A63735K44M49J1o39r41q57o06l44l48q70j579j707j053k95pM9K39L43M1
54197A55865l54l56r7j10m18m79N3R76J813K127J669O17m35j044j313j447j307
54180A55760p55k02j19k32J36J006J680J732J463J189Q05K50j70l01m90r97j439
$$ plain form
54303 158866 156881 155097 153839 152904 152082 151707 152409 154369 156975 159261 160675 161288 161251 160346 158425 156108
54287 156108 154502 154099 154448 155031 155932 157280 158615 159353 159554 159667 159755 159613 159455 159777 160513 160992 160839 160376
54269 160376 159954 159506 158989 158740 158968 159297 159191 158577 157761 157036 156729 157381 159385 162428 165510 167497 167683
54252 167683 166155 163919 162355 162151 162828 163487 163808 164049 164349 164525 164451 164236 164024 163901 163930 164012 163898 163619 163666
54233 163666 164271 164739 164162 162730 161687 161789 162407 162406 161439 160089 159213 159417 160746 162497 163649 163853 163735
54216 163735 163979 164428 164439 163800 162859 162002 161396 161052 160704 159834 158255 156548 155495 155200 155193 155242 155481 155824 155865
54197 155865 155511 155155 155058 154948 154530 154051 154104 155080 156893 159020 160689 161306 160871 159827 158514 157067 155760
54180 155760 155005 154803 154684 154452 154588 155594 157274 159006 160469 161658 162463 162713 162543 162242 161752 160755 159316
54163A59316j278n97J5K11J37M0m7j94l91n48n57l78j11M6l2l17p32j151j284
54144A52148q10K00J157J444J026L76m8j48p9l7j26k48o4P19J902K738K533J390
54126A64073J43n08p08j053j647j903j366l27N93J154J447J451J052M78K19M63
54110A63561R55J360J501J267O88J15n4Q1J0n01j153j522j483j086n06j23k13
54093A62897m89l92N6K07k27p09p15m33k58j38J32M00N39Q58J561K184K182J720
54075A69375J273Q29K83J75J038K200K370J483Q04R59J029J96q39r29k27J77j27
54058A80069n58o34m62j91K46P33R64R42J022J320J535J472J279J093Q47N74M37
54041A90688M00K66K29Q30K176L627M554N007N270N232M766M363M754N970P310
$$ plain form
54163 159316 158038 157441 157456 157667 157804 157844 157797 157603 157212 156664 156107 155729 155618 155664 155632 155315 154583 153432 152148
54144 152148 151338 151538 152695 154139 155165 155541 155493 155345 155266 155229 155103 154855 154791 155510 157412 160150 162683 164073
54126 164073 164216 163708 163000 161947 160300 158397 157031 156704 157297 158451 159898 161349 162401 162879 163098 163561
54110 163561 164516 165876 167377 168644 169332 169447 169393 169474 169484 168983 167830 166308 164825 163739 163233 163110 162897
54093 162897 162408 162016 162072 162279 162052 161343 160628 160195 159937 159799 159931 160331 160870 161728 163289 165473 167655 169375
54075 169375 170648 171477 171760 171935 172973 175173 177543 179026 179830 180789 181818 182014 181175 180246 180019 180196 180069
54058 180069 179511 178877 178415 178224 178470 179203 180167 181109 182131 183451 184986 186458 187737 188830 189677 190251 190688
54041 190688 191088 191354 191583 192413 194589 198216 202770 207777 213047 218279 223045 227408 232162 238132 245442
54026B45442Q189Q476Q075O866N173L759L037K731K580K810L577M391M696M706
54012C14508N147O295P770R088R880R644P951M974J365k490o548j0347j2809j3235
53998C31193j2156j0772r823r288q836q158p069n739m745m512m738m699m086l202
53984B33370k471k032j840j783j675j385j123j249j787k296k342j934j378q85
53970B09190m17J24N71M65n23k000k968k745j644m53M99J375K127K383K067J581
53954B09632J198P34R9l39k21K70P83J317J973K502K576K412K558L122L664L916
53938B36196M133M583N053N161M888M622M728N301O141O806O791N848M226K493
53924C06970J097J41m90q38q02k76O62J785K841L601L818L397K689K465L361N256
$$ plain form
54026 245442 253631 262107 270182 277048 282221 285980 289017 291748 294328 297138 300715 305106 309802 314508
54012 314508 319655 325950 333720 342808 352688 362332 370283 375257 376622 374132 367584 357237 344428 331193
53998 331193 319037 308265 298442 289154 280318 272160 265091 259352 254607 250095 245357 240658 236572 233370
53984 233370 230899 228867 227027 225244 223569 222184 221061 219812 218025 215729 213387 211453 210075 209190
53970 209190 208773 208897 209468 209933 209410 207410 204442 201697 200053 199600 200099 201474 203601 205984 208051 209632
53954 209632 210830 211564 211663 211324 211103 211373 212156 213473 215446 217948 220524 222936 225494 228616 232280 236196
53938 236196 240329 244912 249965 255126 260014 264636 269364 274665 280806 287612 294403 300251 304477 306970
53924 306970 308067 308208 307718 306880 306078 305802 306464 308249 311090 314691 318509 321906 324595 327060 330421 335677
53908C35677P334Q710R003Q463P630O895O203N238L902K503J351L96n01j183j451
53893D00170j564j989k638k920k726k785l689m991n772n823n669n633n542n336
53879C43093n386n837o243o107n513m844m147l186k032j214j215k004l014l579
53865B88772l385k749k299k311k439k273j988k045k382k332j457j14J100K171
53851B66269L528N249O809P867Q893J0722J3484J6217J7498J6299J2313N957j583
53838C89522q578j3551j6094j6742j6157j4730j2924j1384j0301r085p203n154
53826B47619m049m212m681m357l172j958j379j381j521j481j183o02K46J147J622
53811B20658J294L78l65l97L2L10L38O59J664K997L915L980L348K585K378L136
$$ plain form
53908 335677 343011 351721 360724 369187 376817 383712 389915 395153 399055 401558 402909 403305 402804 401621 400170
53893 400170 398606 396617 393979 391059 388333 385548 381859 376868 371096 365273 359604 353971 348429 343093
53879 343093 337707 331870 325627 319520 314007 309163 305016 301830 299798 298584 297369 295365 292351 288772
53865 288772 285387 282638 280339 278028 275589 273316 271328 269283 266901 264569 263112 262998 264098 266269
53851 266269 269797 275046 281855 289722 298615 309337 322821 339038 356536 372835 385148 391105 389522
53838 389522 380944 367393 351299 334557 318400 303670 290746 279362 269061 259976 252773 247619
53826 247619 243570 239358 234677 230320 227148 225190 223811 222430 220909 219428 218245 217643 217889 219036 220658
53811 220658 221952 222330 221965 221568 221600 221910 222248 222907 224571 227568 231483 235463 238811 241396 243774 246910
53795B46910M623N995O436N825M790M105M014M059L691K986K612K890L250K945
53781C05131K022J061J73r70k172k673k371k231k926l830l979l503l213l269l164
53766B74086k842k840l302l678l645l497l449l268k894k771l043l036k176r57
53752B32688m15p38j104q78m23m43r36j221r13m74n65j080j250p53j96k16n10
53735B20573l65J62K88k90r37j057p47k63N16J526K017J379J56m81k02K40K09
53718B22724m4j9K16K35p7m05m08M0Q32J614J942J721J444J660K212K379J865
53701B37931J292J377J876J941J442J291K160L410L904L510L098L117K993K217
53687B71559J213O38L14m23j578k395k382j846j276p05QO75Q76M89k02q35j225
$$ plain form
53795 246910 251533 257528 263964 269789 274579 278684 282698 286757 290448 293434 296046 298936 302186 305131
53781 305131 307153 308214 308387 307417 305245 302572 300201 297970 295044 291214 287235 283732 280519 277250 274086
53766 274086 271244 268404 265102 261424 257779 254282 250833 247565 244671 241900 238857 235821 233645 232688
53752 232688 232273 231535 230431 229553 229130 228687 227751 226530 225617 225143 224578 223498 222248 221495 221299 221083 220573
53735 220573 220208 220370 220658 220368 219431 218374 217627 217364 217880 219406 221423 222802 222958 222477 222275 222515 222724
53718 222724 222680 222661 222877 223112 223035 222630 222222 222262 223094 224708 226650 228371 229815 231475 233687 236066 237931
53701 237931 239223 240600 242476 244417 245859 247150 249310 252720 256624 260134 263232 266349 269342 271559
53687 271559 272772 273410 273724 273301 271723 269328 266946 265100 263824 263119 263127 263802 264678 265167 264965 264130 262905
53670B62905j304j068o21k16q4k70n81p43n82j21M14P41O80K45m33j178j757j852
53652B54175j279l31L02J82l74o32k23N42J118J229R12L91OP4O06J291J840K191
53634B62020K365K291J949J496J105Q11O34P22J192J925K617K971K787K132J424
53619B88441J197J478J769J748J753K183K702K558J664Q13P48J447K443L401M067
53604C18412M097L392K434J863J753J645J294R63R03R17P21M17K91L22K39Pj71
53587C39499k94o03j067j270j042p93r24j245j416j592k083k580k440j683j075
53572C19392j078j352j472j508j571j413q97l76j29J13N32O25Lo10r1J426K552
53555C14146K519K124K406L132L326K875K734L564M832N489N190M457L870L447
$$ plain form
53670 262905 261601 260533 259912 259696 259612 259342 258761 258018 257436 257315 257729 258470 259150 259395 258962 257784 256027 254175
53652 254175 252896 252565 252867 253049 252675 252043 251820 252362 253480 254709 255621 256012 256018 256092 256698 257989 259829 262020
53634 262020 264385 266676 268625 270121 271226 272037 272671 273393 274585 276510 279127 282098 284885 287017 288441
53619 288441 289638 291116 292885 294633 296386 298569 301271 303829 305493 306306 307054 308501 310944 314345 318412
53604 318412 322509 325901 328335 330198 331951 333596 334890 335853 336756 337673 338394 338811 339102 339424 339663 339670 339499
53587 339499 339205 338602 337535 336265 335223 334430 333506 332261 330845 329253 327170 324590 322150 320467 319392
53572 319392 318314 316962 315490 313982 312411 310998 310101 309725 309596 309709 310241 310866 310869 310259 310168 311594 314146
53555 314146 316665 318789 321195 324327 327653 330528 333262 336826 341658 347147 352337 356794 360664 364111
53541C64111K892K154J485J024O33K11m6J28P40J598K627L855N169O327P230Q012
53525D08150Q759R336R597R655R865J0512J1547J2608J3347J3699J3880J4113
53513E45068J4536J5299J6596J8407K0365K1958K2868K3070K2836K2634K2798
53502G66435K3117K3006K2227K1227K0537K0141J9714J9239J8959J8848J8624
53491I92074J8232J7970J8040J8287J8438J8335J7913J7230J6565J6242J6233
53480A185559J6141J5645J4842J4084J3607J3247J2454J0745Q278N811L909K359
53468A316681O73j196l058n119p753j0650j2826j3720j3837j4160j5221j6822
53456A202992j8336j9211j9465j9756k0588k1547k1785k1232k0626k0332j9810
$$ plain form
53541 364111 367003 369157 370642 371666 372299 372510 372464 372592 373332 374930 377557 381412 386581 392908 400138 408150
53525 408150 416909 426245 435842 445497 455362 465874 477421 490029 503376 517075 530955 545068
53513 545068 559604 574903 591499 609906 630271 652229 675097 698167 721003 743637 766435
53502 766435 789552 812558 834785 856012 876549 896690 916404 935643 954602 973450 992074
53491 992074 1010306 1028276 1046316 1064603 1083041 1101376 1119289 1136519 1153084 1169326 1185559
53480 1185559 1201700 1217345 1232187 1246271 1259878 1273125 1285579 1296324 1304602 1310413 1314322 1316681
53468 1316681 1317354 1316158 1313100 1307981 1300228 1289578 1276752 1263032 1249195 1235035 1219814 1202992
53456 1202992 1184656 1165445 1145980 1126224 1105636 1084089 1062304 1041072 1020446 1000114 980304
53445I80304j8679j7483j6938j6899j6704j6122j5331j4254j2595j0475q411o668
53433H09745n072l485k073r72o4Q80J997L347M867O316P442Q294R173J0333J1818
53418H62546J3502J5204J6725J7933J8817J9471K0118K1076K2508K4163K5630
53407A077693K6924K8478L0445L2391L3901L5167L6673L8538M0559M2639M4778
53396A468186M6783M8380M9564N0551N1368N1803N1694N1138N0430N0001N0097
53385B019995N0340M9806M7921M5119M2296L9840L7464L4832L1868K8591K5085
53374B453157K1563J8071J4218R700N021J149j776m865r409j5607k2601k9454
53362B439167l5840m1824m7215n1313n3488n3985n3864n3945n4113n3911n3396
$$ plain form
53445 980304 961625 944142 927204 910305 893601 877479 862148 847894 835299 824824 816413 809745
53433 809745 804673 801188 799115 798143 798079 798959 800956 804303 809170 815486 822928 831222 840395 850728 862546
53418 862546 876048 891252 907977 925910 944727 964198 984316 1005392 1027900 1052063 1077693
53407 1077693 1104617 1133095 1163540 1195931 1229832 1264999 1301672 1340210 1380769 1423408 1468186
53396 1468186 1514969 1563349 1612913 1663464 1714832 1766635 1818329 1869467 1919897 1969898 2019995
53385 2019995 2070335 2120141 2168062 2213181 2255477 2295317 2332781 2367613 2399481 2428072 2453157
53374 2453157 2474720 2492791 2507009 2516709 2521730 2522879 2521103 2516238 2506829 2491222 2468621 2439167
53362 2439167 2403327 2361503 2314288 2262975 2209487 2155502 2101638 2047693 1993580 1939669 1886273
53351A886273n2807n1779m9643m6575m3693m1867m1044m0856m1155m1645m1609
53340A393600m0620l9144l7890l6830l5341l3168l0743k8583k6746k4956k3010
53329A036569k0990j9135j7502j5812j3821j1765j0175r209q521p941p711p826
53317H86161p597o408m647l266k556j862n51J205K793L894M675N491O616Q171
53303H92119J0048J1941J3546J4808J5918J7060J8215J9258K0225K1307K2524
53292A076969K3615K4490K5493K6890K8139K8243K6984K5330K4314K3831K2907
53281A357205K0882J7992J4949J2374J0468Q861O797L829L54k741m968o593q188
53268A431221j0133j2457j4891j7055j8775k0269k1841k3497k4983k6059k6632
$$ plain form
53351 1886273 1833466 1781687 1732044 1685469 1641776 1599909 1558865 1518009 1476854 1435209 1393600
53340 1393600 1352980 1313836 1275946 1239116 1203775 1170607 1139864 1111281 1084535 1059579 1036569
53329 1036569 1015579 996444 978942 963130 949309 937544 927369 918160 909639 901698 893987 886161
53317 886161 878564 872156 867509 864243 861687 859825 859274 860479 863272 867166 871841 877332 883948 892119
53303 892119 902167 914108 927654 942462 958380 975440 993655 1012913 1033138 1054445 1076969
53292 1076969 1100584 1125074 1150567 1177457 1205596 1233839 1260823 1286153 1310467 1334298 1357205
53281 1357205 1378087 1396079 1411028 1423402 1433870 1442731 1449528 1453357 1453711 1450970 1446002 1439409 1431221
53268 1431221 1421088 1408631 1393740 1376685 1357910 1337641 1315800 1292303 1267320 1241261 1214629
53257A214629k6774k6858k7457k8735l0080l0728l0611l0165k9482k8215k6389
53246H99135k4656k3557k2986k2631k2506k2697k2991k3062k2847k2404k1685
53235F47113k0668j9498j8209j6589j4620j2776j1526j0748r988r042p997o919
53223D88533n964n599o127p111p731p749p610p639p667p578p606p871q131q217
53209C85933q276q219p469n787l949l045l268l889m197m076l732l426l465l945
53195C19190m486m555m095l477k919k416k146k343k636k280j262n94j065k188
53181B82728k908k901k640k455k233j887j552j325j238j434j869k041j543q48
53167B55854q42j513j815j099n2K46l22j012j264j077n65K57J158J651J375L75
$$ plain form
53257 1214629 1187855 1160997 1133540 1104805 1074725 1043997 1013386 983221 953739 925524 899135
53246 899135 874479 850922 827936 805305 782799 760102 737111 714049 691202 668798 647113
53235 647113 626445 606947 588738 572149 557529 544753 533227 522479 512491 503449 495452 488533
53223 488533 482569 476970 470843 463732 456001 448252 440642 433003 425336 417758 410152 402281 394150 385933
53209 385933 377657 369438 361969 356182 352233 349188 345920 342031 337834 333758 330026 326600 323135 319190
53195 319190 314704 310149 306054 302577 299658 297242 295096 292753 290117 287837 286575 285981 284916 282728
53181 282728 279820 276919 274279 271824 269591 267704 266152 264827 263589 262155 260286 258245 256702 255854
53167 255854 255012 253499 251684 250585 250533 250779 250457 249445 248181 247104 246539 246796 247954 249605 250980 251355
53151B51355r48k019k325j846j152q75j043j199j040o49j58L54O29L32m55j152
53135B37809j368j345j442j479j006j35M50L37j05k80j27o5l31p15q56o33j50
53118B28559L86P28P49O48Q49J494K135K150J419M30k72n83p82j143j659k101
53102B33007k232k060j806j627j439j074n42qM21P54R29Q04L09m64j309j924j980
53085B19759j456q17n99p64p77m24j40l14o11l72M26J070J045O64N91R04R81L76
53067B19542m83p57k15N16P75N48J68k59o75p16j19O17O25k21j122j407j220r97
53049B14600q24n86k63J61O79R17M28m14m97N97J777J740M96r46j876k168j800
53032B12021j073q98j818k941k864j597m98k66j69M88J245J360Q84K81l26q69
$$ plain form
53151 251355 250407 248388 246063 244217 243065 242190 241147 239948 238908 238259 238101 238455 239084 239416 238961 237809
53135 237809 236441 235096 233654 232175 231169 231034 231484 231821 231716 231436 231309 231244 230913 230198 229342 228709 228559
53118 228559 228945 229673 230422 231070 231919 233413 235548 237698 239117 239547 239275 238692 237910 236767 235108 233007
53102 233007 230775 228715 226909 225282 223843 222769 222227 222219 222640 223394 224323 225127 225436 224972 223663 221739 219759
53085 219759 218303 217486 216887 216123 215346 214922 214782 214468 213857 213485 213911 214981 216026 216690 217281 218185 219166 219542
53067 219542 219059 218302 218087 218603 219378 219926 220094 219835 219160 218444 218325 218942 219567 219346 218224 216817 215597 214600
53049 214600 213776 213190 212927 213088 213767 214684 215112 214698 214201 214798 216575 218315 218811 217865 215989 213821 212021
53032 212021 210948 210050 208232 205291 202427 200830 200332 200066 199897 200385 201630 202990 203874 204155 203829 202960
53016B02960r30k74O27J110R82M24l08p45l54O46J253R49M16M02N30M0q61j346
52998B05521j262j076p84L5J071J323N51k60l13m1k03n81l75M77J139R85L62J
52980B06570Q5K14R6n0N1K00L4k40O9J152K288K670K232J382M06m02n36J59J023
52961B17403J356J366J633J917J422J47r34j248j243j440j631j407q35k39J23
52946B16390r7j098k266k487j543m67q9M2N95J121P11n11j494j606j071k82M81
52929B06329P69L22l61m97j03R6j57l70k61k47o10r16o80j24J32j43o07p31j98
52910B01643P55J388J163M77K04M83N33j52j056j402j111o38k79j43l34o79o05
52893B00247J34R07Q81J42m26k40N31J443K117K134J243j17j053j214j158j464
$$ plain form
53016 202960 202030 201756 202383 203493 204475 204899 204591 203846 203492 204138 205391 206340 206756 207158 207688 207728 206867 205521
52998 205521 204259 203183 202399 202434 203505 204828 205379 205119 204806 204765 204562 203981 203606 204083 205222 206207 206569 206570
52980 206570 206655 206869 206965 206915 206966 207166 207200 206960 207029 208181 210469 213139 215371 216753 217159 216757 216221 216380 217403
52961 217403 218759 220125 221758 223675 225097 225244 224310 223062 221819 220379 218748 217341 216506 216267 216390
52946 216390 216293 215195 212929 210442 208899 208432 208343 208385 208980 210101 210812 210301 208807 207201 206130 205848 206329
52929 206329 207098 207420 207059 206562 206459 206555 206398 206028 205767 205520 204910 203994 203314 203190 203322 203179 202572 201841 201643
52910 201643 202398 203786 204949 205426 205630 206113 206646 206494 205438 204036 202925 202287 202008 201865 201531 200852 200247
52893 200247 200381 201288 202169 202311 201885 201645 202176 203619 205736 207870 209113 208996 207943 206729 205571 204107
52877B04107j823j471l08P85R70M26P5M12R01P87J76q3M21J192J671J968K347
52860B12553K550K270J947K275L042L284K613J651R48K84n74j193j121p23p38
52845B29068j332k139k968l806m353m173l332k383j723j309j024q42o50l34m8
52830A98652r3m17n88k87M28J290J891J721O58n69j010o80n26j049j599j414o85
52813A95723n8L95J046J878K499K879L413M238N003N326M975L699J467j062k871
52798B28550l590l742l859l887l644l276k891k236j232m10k92o02o97n53o88j184
52782A95767j466j189p29m98l25J27O96J013J163J490J829J576O64n7J68R66J314
52765B02509Q66L24M19J001J415J346R18K62n80j323j599j440j214j012n34K08
$$ plain form
52877 204107 202284 200813 200505 201290 202260 202686 202761 203173 204074 204861 205037 204954 205375 206567 208238 210206 212553
52860 212553 215103 217373 219320 221595 224637 227921 230534 232185 233133 233417 232843 231650 230529 229806 229068
52845 229068 227736 225597 222629 218823 214470 210297 206965 204582 202859 201550 200526 199684 199034 198700 198652
52830 198652 198559 198142 197554 197267 197695 198985 200876 202597 203255 202686 201676 200996 200470 199421 197822 196408 195723
52813 195723 195665 196060 197106 198984 201483 204362 207775 212013 217016 222342 227317 231016 232483 231421 228550
52798 228550 224960 221218 217359 213472 209828 206552 203661 201425 200193 199783 199491 198889 198192 197639 196951 195767
52782 195767 194301 193112 192383 191885 191560 191687 192383 193396 194559 196049 197878 199454 200118 200061 200229 201195 202509
52765 202509 203375 203699 204118 205119 206534 207880 208798 209060 208480 207157 205558 204118 202904 201892 201358 201566
52749B01566O24L10k90n12m26n30p46m83L00Q46O89L01K43L40K63L92J235K303
52731B06425K490J599O77N55Q65Q75O00M68M60K65K9R9J98l30j381j980j572p42
52713B09600k69r2K75P29P14J20n60r32j039j003q29o34n98o05l65K9J55m2q5
52694B04569K13L69J9l58j27M36M08m51j342j490j049o27m06j08L69P64Q78Q23
52676B02890P33N54K72K30Q43J903K478J849M69l87q8O39P17J09k76J8L47m9r26
52657B12325j355r31j44M46R18J637K528L118L214L180L353L482K915J340q11
52642B35215k650l415k949j806q69o37q14p90m84m24r27j526j519q59j86Ok5M30
52624B15771J750L485M604M266K523K25j690k780l051k709k092j545j139o68j38
$$ plain form
52749 201566 202190 202500 202210 201698 201272 200742 199996 199513 199813 200659 201348 201649 201892 202232 202495 202887 204122 206425
52731 206425 208915 210514 211191 211746 212611 213486 214086 214554 215014 215279 215308 215407 215605 215275 213894 211914 210342 209600
52713 209600 209331 209239 209514 210243 210957 211077 210517 209585 208546 207543 206714 206080 205482 204877 204512 204541 204696 204654 204569
52694 204569 204782 205151 205170 204812 204685 205121 205529 205078 203736 202246 201197 200570 200164 200056 200425 201189 202067 202890
52676 202890 203623 204177 204449 204679 205522 207425 209903 211752 212221 211834 211746 212385 213102 213211 212935 212953 213300 213251 212325
52657 212325 210970 210039 209895 210341 211259 212896 215424 218542 221756 224936 228289 231771 234686 236026 235215
52642 235215 232565 229150 226201 224395 223526 222889 222075 221285 220801 220377 219450 217924 216405 215546 215360 215366 215341 215771
52624 215771 217521 221006 225610 229876 232399 232624 230934 228154 225103 222394 220302 218757 217618 216950 216812
52609B16812R2r0j21N04J331J363L70p57j133q09l98k37k51l22l48j16N85J608
52591B18083K366K229J142j49o72k53K86K39k7K99J096J424R76N57Q20J328J346
52574B31090R30N89L84J3n15q82r60q08m23P4L29K65L24O53N15o68k109k423j493
52555B24885m79LM97J308J644Q91k11n49k03j23o17j066r82n96k57M7M16O70N62
52536B25840Q5m81p74n71m7L52L40R0j38l69p33j011q55l01K32N00O35P10N51
52517B24055J33j44J48R26J644J845J599J404J720K528L251L294K593J635R15
52502B47546N33L13J11j50n53j142j805k305k403j985j175m00j47n14j087j343
52486B33494j098n36J11O66R87J091J208J455J542J098L57P7O02J381J657J324
$$ plain form
52609 216812 216904 216814 216693 217197 218528 219891 220261 219504 218371 217562 217164 216927 216676 216354 216006 215890 216475 218083
52591 218083 220449 222678 223820 223671 222999 222746 223032 223271 223244 223543 224639 226063 227039 227596 228416 229744 231090
52574 231090 232020 232609 232993 233006 232491 231609 230649 229841 229418 229492 229821 230086 230410 231063 231578 230910 228801 226378 224885
52555 224885 224406 224409 224906 226214 227858 228749 228538 227989 227786 227663 227046 225980 224998 224402 224145 224192 224608 225278 225840
52536 225840 225925 225444 224670 224099 224052 224404 224744 224834 224696 224327 223594 222583 221728 221427 221659 222159 222794 223504 224055
52517 224055 224188 224044 224192 225118 226762 228607 230206 231610 233330 235858 239109 242403 244996 246631 247546
52502 247546 248079 248392 248503 248353 247800 246658 244853 242548 240145 238160 236985 236585 236438 235924 234837 233494
52486 233494 232396 231860 231971 232637 233624 234715 235923 237378 238920 240018 240375 240452 241054 242435 244092 245416
52470B45416Q04L80R5J34O81J466J901J802J516J328J201J148J306J517J405J066
52454B63166J009J094L50j527l250l452k537j987k144j970j072n39j215k278k350
52439B41298j379m79l25n23m46j3M69P31P26N66L48p5q74j783k191j867j281q80
52421B32022n15K5L87J92j78o3M03N07K17L52J229J963J724J063J216K364L410
52404B46318L587L549M523O738R241J0974J1510J0693Q324M592M77k893n133o476
52390C06024p018o701n894n223m638l475j748n81p74j574j643q40j98m27j209
52375B64081j884k064j544l71Q91J612J928K542L594M339M187L409K541J697Q22
52360B85780J26k09l67n30n20k26n5m44j112j305p50M8M17J66l74o45k36P79J833
$$ plain form
52470 245416 246220 246600 246695 246829 247510 248976 250877 252679 254195 255523 256724 257872 259178 260695 262100 263166
52454 263166 264175 265269 265619 264092 260842 257390 254853 252866 250722 248752 247680 247141 245926 243648 241298
52439 241298 239919 239440 239115 238592 238146 238133 238602 239333 240059 240625 240973 240898 240024 238241 236050 234183 232902 232022
52421 232022 231507 231532 231919 232111 231933 231870 232273 232780 232997 233349 234578 236541 238265 239328 240544 242908 246318
52404 246318 249905 253454 257977 264715 273956 284930 296440 307133 315457 320049 320526 317633 312500 306024
52390 306024 299006 292305 286411 281188 276550 273075 271327 270746 269972 268398 266755 265915 265717 265290 264081
52375 264081 262197 260133 258589 258218 259109 260721 262649 265191 268785 273124 277311 280720 283261 284958 285780
52360 285780 285906 285697 285330 284800 284280 284054 283999 283555 282443 281138 280388 280436 280853 281019 280645 280000 279764 280543 282376
52341B82376K401K525K578K631K332J572R21J123K165L195L457L168L195L943
52327C17582M917N506N803O292P018P590P852Q044Q192P902O994N924N306N252
52313D10174N419N539N624N803O162O653P061P229P278P431P585P489P278P483
52299E04208Q257R084R520R785J0297J0914J1113J0642R590P978N744L132Q15
52286F11079n32o75k0N69L78n10j315j427q82J1J098K092K439J946J204R68J329
52269F17752J892K392K668K419J614R39J142K081L039L720M246M418L904L111
52255F55337K981L751M798N859P359R216J0367J0171R403R073Q950Q151O714N507
52241G57637M885M438L972L852M186M476M294L731L004K177J500J374J672J636
$$ plain form
52341 282376 284777 287302 289880 292511 294843 296415 297336 298459 300624 303819 307276 310444 313639 317582
52327 317582 322499 328005 333808 340100 347118 354708 362560 370604 378796 386698 393692 399616 404922 410174
52313 410174 415593 421132 426756 432559 438721 445374 452435 459664 466942 474373 481958 489447 496725 504208
52299 504208 512465 521549 531069 540854 551151 562065 573178 583820 593410 601388 607132 610264 611079
52286 611079 610547 609872 609852 610421 610799 610289 608974 607547 606665 606676 607774 609866 612305 614251 615455 616423 617752
52269 617752 619644 622036 624704 627123 628737 629676 630818 632899 635938 639658 643904 648322 652226 655337
52255 655337 658318 662069 666867 672726 680085 689301 699668 709839 719242 728315 737265 745416 752130 757637
52241 757637 762522 766960 770932 774784 778970 783446 787740 791471 794475 796652 798152 799526 801198 802834
52227H02834Q34j48m17J34Q26J083Q59L90j01m15m40k81j34j21l22p78j168p66
52209H01869P56K635L643L527L262L727M628N124M954M479L966L447L106L139
52195H52262L306L146K746K747L498M633N609O193O259N697M776M111L865L391
52181I12239K070J96j467k689l834n071o138o771o976o817o389n984n919o112
52167H50338o081n447m263k908j856j319q97K15K234M246N106M762M120L704L100
52152H55054J857K72j012j715j884j507m82J109K915M400N052M778M039L321K586
52137H78783J554L75n86j512k935m670n689n373m218k947j553K55K313M251O038
52122H64086P724Q995R650J0155J1084J2293J3158J3371J2996J2031J0590R256
$$ plain form
52227 802834 803668 803520 803103 803237 804063 805146 806005 806395 806294 805879 805439 805158 805024 804903 804581 803803 802635 801869
52209 801869 802625 805260 808903 812430 815692 819419 824047 829171 834125 838604 842570 846017 849123 852262
52195 852262 855568 858714 861460 864207 867705 872338 877947 884140 890399 896096 900872 904983 908848 912239
52181 912239 914309 914505 913038 910349 906515 901444 895306 888535 881559 874742 868353 862369 856450 850338
52167 850338 844257 838810 834547 831639 829783 828464 827567 827782 830016 834262 839368 844130 848250 851954 855054
52152 855054 856911 857183 856171 854456 852572 851065 850583 851692 854607 859007 864059 868837 872876 876197 878783
52137 878783 880337 880712 880126 878614 875679 871009 865320 859947 855729 852782 851229 851484 853797 858048 864086
52122 864086 871810 880805 890455 900610 911694 923987 937145 950516 963512 975543 986133 995389
52110I95389Q506P943O818N172L770K950K407K111K570L894N400O524P499Q690
52096A069643R851J0526J0732J0746J0475R580P959N763L126K03k663n162p223
52083A133556q754r412r018q014p041o224n300m345l840l900l983l571k782j996
52069A055376j258m24L23O25N69P08J280J836J867J513J269J299J423J683K283
52054A070372L005L278L079L216M173N159M856L047Q35o71j404j934k637l499
52040A090875m436n370o111o386o030n123l995l138k889l125l375l282k879k405
52026A032331k066j984k252k859l608m172m249l802l203k981l274l685l867l974
52012I86355m244m336l665k398j546j827k945m202n466p120r329j1755j3918j5523
$$ plain form
52110 995389 1003895 1011838 1018656 1023828 1027598 1030548 1032955 1035066 1037636 1041530 1046930 1053454 1060953 1069643
52096 1069643 1079494 1090020 1100752 1111498 1121973 1131553 1139512 1145275 1148401 1148604 1145941 1140779 1133556
52083 1133556 1124802 1115390 1106372 1098358 1091317 1085093 1079793 1075448 1071608 1067708 1063725 1060154 1057372 1055376
52069 1055376 1054118 1053694 1054017 1054642 1055211 1055919 1057199 1059035 1060902 1062415 1063684 1064983 1066406 1068089 1070372
52054 1070372 1073377 1076655 1079734 1082950 1087123 1092282 1097138 1100185 1101020 1100349 1098945 1097011 1094374 1090875
52040 1090875 1086439 1081069 1074958 1068572 1062542 1057419 1053424 1050286 1047397 1044272 1040897 1037615 1034736 1032331
52026 1032331 1030265 1028281 1026029 1023170 1019562 1015390 1011141 1007339 1004136 1001155 997881 994196 990329 986355
52012 986355 982111 977775 974110 971712 970166 968339 965394 961192 955726 948606 939277 927522 913604 898081
51998H98081j6508j6998j7225j7353j7381j7244j6869j6107j4833j3247j1881
51987G22435j1150j1021j1177j1360j1418j1262j0943j0635j0435j0325j0352
51976F02357j0560j0751j0688j0579j0898j1455j1249r645p194m793k502P5K660
51963E04778M494N593O807Q431R654R764R166Q633Q052O611L995P72k225m525
51949E80000o017o813p102o912o048m469k560p83Q78K791N115P566R761J1486
51935E76893J2688J3438J3897J3996J3270J1346Q611N948L645J068k366o257r676
51922F56501j2274j4428j6382j7811j8343j8144j7625j6881j5701j4051j2269
51911D82592j0712r459q359p252n971m325k224J57K453M344N681O471O918P395
$$ plain form
51998 898081 881573 864575 847350 829997 812616 795372 778503 762396 747563 734316 722435
51987 722435 711285 700264 689087 677727 666309 655047 644104 633469 623034 612709 602357
51976 602357 591797 581046 570358 559779 548881 537426 526177 516532 509338 504545 502043 502118 504778
51963 504778 509272 514865 521672 530103 539757 549521 558687 567320 575372 581983 585978 586750 584525 580000
51949 580000 573983 567170 560068 553156 547108 542639 540079 539296 540174 542965 548080 555646 565407 576893
51935 576893 589581 603019 616916 630912 644182 655528 664139 670087 673732 674800 672434 666177 656501
51922 656501 644227 629799 613417 595606 577263 559119 541494 524613 508912 494861 482592
51911 482592 471880 462421 454062 446810 440839 436514 434290 434447 436900 441244 446925 453396 460314 467709
51897D67709Q088Q507P726N397K317m06k604m888p358r167r641r118q235o921
51883D41406m779k024P13L348O253R349J2172J4908J8388K2814K7292L0938L3495
51870F14273L4303L1723K4637J4104K597p944j6581k2489k5084k5044k4047k3100
51858E77348k1911k0046j7703j5085j1932q348n238l318k252j469j216k001l414
51845D63415m379m477m266m373m868n533o086o158n603m912m778n107m957l682
51831C94236j694J27J416K386L211L737L699K968J610r5j689k707k907k363j390
51816D00545m31J71L84M71P31J286K101L044L855M193L855K969J772K97j503l220
51800D20520l995l436k386k190l064l739l056j408q4L66L48J19n72j565k059j736
$$ plain form
51897 467709 475797 484304 492030 497427 499744 499338 496734 491846 484488 475321 465680 456562 448327 441406
51883 441406 436627 434603 435316 438664 444917 454266 466438 481346 499734 522548 549840 580778 614273
51870 614273 648576 680299 704936 719040 721637 713693 697112 674623 649539 624495 600448 577348
51858 577348 555437 535391 517688 502603 490671 482323 477085 473767 471515 470046 468830 466829 463415
51845 463415 459036 454559 450293 445920 441052 435519 429433 423275 417672 412760 407982 402875 397918 394236
51831 394236 392542 392669 394085 396471 399682 403419 407118 410086 411696 411601 409912 407205 404298 401935 400545
51816 400545 400114 400285 400669 401140 401871 403157 405258 408302 412157 416350 420205 423174 424946 425243 423740 420520
51800 420520 416525 413089 410703 408513 405449 401710 398654 397246 397162 397528 397876 397995 397423 395858 393799 392063
51784C92063j286j295j283o13K21J54r19k088k848l585m574n191m598k666nK590
51768C64077M476N478O074P008Q404R611J0034R734Q961P574N403K850N84j320
51754D48948l321n463p016p413p112p009p164o739n341l789l040k883k388j422
51740C78848q03q38o56N07K199L545M488N457O385O985P540Q306Q427O746L786
51725D40922J563J041J078N41K39J567L993N310M214J600q08k146k582k558k344
51710D51630k003j542j122j094j592k229k491k269j676n42J319L337M280L366
51696D47372J074j330k832l236k990k574j907m07K088M509N119L090p35m665p466
51681D35110q813r003q581p980p149n627l191k98K259M003M855M790L789K165
$$ plain form
51784 392063 390777 389482 388199 387586 387807 387961 387042 384954 382106 378521 373947 368756 364158 361492 361487 364077
51768 364077 368553 374031 380105 387113 395517 405128 415162 424896 433857 441431 446834 449684 450268 448948
51754 448948 445627 440164 433148 425735 418623 411614 404450 397711 392370 388581 385541 382658 380270 378848
51740 378848 378045 377207 376551 377058 379257 382802 387290 392747 399132 406117 413657 421963 430390 437136 440922
51725 440922 442485 443526 444604 445145 445384 446951 450944 456254 460468 462068 461260 459114 456532 453974 451630
51710 451630 449627 448085 446963 445869 444277 442048 439557 437288 435612 435070 436389 439726 444006 447372
51696 447372 448446 447116 444284 441048 438058 435484 433577 433170 435258 439767 444886 447976 447241 442576 435110
51681 435110 426297 417294 408713 400733 393584 387957 384766 384468 386727 390730 395585 400375 404164 406329
51667D06329O23r7L85J977M149O137P385P895Q054P944P034M662Q77l270o360
51652D53724p622p430o737n983m644k016J630M987O781O722N315L085K92k760
51638D45344n607p936r763j1184j2056j2046j0946q924o559m550l252k463j791
51625C48267j195r05q84o68P9J155K117K715K853K449J646R04M94L8r30k088k549
51608C53498k035j314j144j251p88M11J543J805J302Q43J017J719K498L105L637
51593C64846M233M951N907P305R074J0624J1188J0345Q156M922J215k026l845
51580D36895l989l038j679m7K130M952Q187J1521J4683J7319J8998J9550J9377
51567E44859J9257J9737K0703K1537K1651K0799J9115J7221J6327J7772K2025
$$ plain form
51667 406329 406952 406855 407240 409217 413366 419503 426888 434783 442837 450781 457815 462477 463354 460084 453724
51652 453724 446102 438672 431935 425952 421308 419292 420922 425909 432690 439412 444727 447812 448104 445344
51638 445344 439737 431801 422038 410854 398798 386752 375806 366882 360323 355773 352521 350058 348267
51625 348267 347072 346167 345283 344615 344694 345849 347966 350681 353534 355983 357629 358533 359027 359065 358135 356047 353498
51608 353498 351463 350149 349005 347754 346966 347377 348920 350725 352027 352870 353887 355606 358104 361209 364846
51593 364846 369079 374030 379937 387242 396316 406940 418128 428473 436629 441551 442766 440740 436895
51580 436895 432906 429868 428189 428142 430272 435224 443411 454932 469615 486934 505932 525482 544859
51567 544859 564116 583853 604556 626093 647744 668543 687658 704879 721206 738978 761003
51556G61003K8200L4799M0744M5430M7993M7131M1874L2452K0358P607m248j4702
51544A088641k4006l2247l8954m3726m6823m8743m9447m8559m6167m2810l8809
51533F28350l4208k9342k4764k0569j6476j2749j0277r382r195q677p684o559
51521D38468n296l782k515k291l134m171m536m103l289k507j874j260n73m3j15
51506C98979r64k218l264l692l474k940k550k431k173j447p17p92j649k397k510
51491C65761k378k346k035j144j68L22N39R50J383J383J005M81m20j806k774k155
51475C56598j20J877K807K985L198L644M051M185L917L168J992N86q52k096k941
51460C82999l533m341n386n881n191l887l093l002k800k011j111o48n27l38K30
$$ plain form
51556 761003 789203 824002 864746 910176 958169 1005300 1047174 1079626 1099984 1107591 1103343 1088641
51544 1088641 1064635 1032388 993434 949708 902885 854142 804695 756136 709969 667159 628350
51533 628350 594142 564800 540036 519467 502991 490242 479965 470583 461388 452711 445027 438468
51521 438468 433172 429390 426875 424584 421450 417279 412743 408640 405351 402844 400970 399710 399137 399094 398979
51506 398979 398015 395797 392533 388841 385367 382427 379877 377446 375273 373826 373109 372317 370668 368271 365761
51491 365761 363383 361037 359002 357858 357690 358012 358551 359501 360884 362267 363272 363753 363333 361527 358753 356598
51475 356598 356478 358355 361162 364147 367345 370989 375040 379225 383142 386310 388302 388888 388036 385940 382999
51460 382999 379466 375125 369739 363858 358667 354780 351687 348685 345885 343874 342763 342115 341588 341250 341480
51445C41480J393L168N082O515P537Q913J1109J3615J5331J5297J3187R622O010
51432D58259L622K770L086M183N434N565L517l50m641q397j1348j2972j2627j0778
51418D25323q889p704o623n104l571k542j880j474j620k107j992r87q8n4k41J99
51402C80646Q27Q14M66O40J175J233Q60R63J851K940L900N014O298P218P541P751
51386D30137Q368R425J0777J2458J4584J7345K1045K5810L1243L6831M2561M8643
51374G09227N4778O0172O4118O6154O5689O2096N5188M5277L2947J9084M841r028
51362A230543k2544l5670m7341n6081o1416o4046o4655o3333o0141n5506m9915
51351F49895m3768l7605l1908k6693k1872j7913j5442j4130j2834j1040r388q521
$$ plain form
51445 341480 342873 346041 351123 357638 365175 374088 385197 398812 414143 429440 442627 452249 458259
51432 458259 461881 464651 467737 471920 477354 482919 486436 486086 481445 473048 461700 448728 436101 425323
51418 425323 416434 408730 402107 397003 393432 390890 389010 387536 385916 383809 381817 380830 380742 380688 380447 380646
51402 380646 381473 382287 382753 383393 384568 385801 386661 387624 389475 392415 396315 401329 407627 414845 422386 430137
51386 430137 438505 447930 458707 471165 485749 503094 524139 549949 581192 618023 660584 709227
51374 709227 764005 824177 888295 954449 1020138 1082234 1137422 1182699 1215646 1234730 1239571 1230543
51362 1230543 1207999 1172329 1124988 1068907 1007491 943445 878790 815457 755316 699810 649895
51351 649895 606127 568522 536614 509921 488049 470136 454694 440564 427730 416690 407302 398781
51339C98781q095p407o357n314m458l724l131k715k349j879j376j054j037j269
51325C48616j545j610j454j347j443j488j213p35j90O61J812K383J571J09l03
51310C43824P56J798J426P3q58p62q5N34O48Nj080j627r83K86R87N49p43k349
51292C42399l746m348l897k873k036j601j271q87n20n7O91J567K264K906L885
51277C32476N116O008O268O117N678M775L552K628K202J610L17j096j619j185
51263C72847o64n56n15k82k69q37j540j716j498j609k268k875k810k186j643j700
51247C49879k366l134l328k726j831j256r21l17N62J125J044O28K25j49l31N6
51231C37160Q45J158N62k12k81K21N36M32J34k28m66q8Q79J361N82m66j29J592
$$ plain form
51339 398781 390686 383279 376922 371608 367150 363426 360295 357580 355231 353352 351976 350922 349885 348616
51325 348616 347071 345461 344007 342660 341217 339729 338516 337781 337591 338252 340064 342447 344018 344127 343824
51310 343824 344580 346378 347804 347877 347019 346257 346172 346706 347354 347359 346279 344652 343669 343955 344942 345491 344748 342399
51292 342399 338653 334305 330408 327535 325499 323898 322627 321740 321220 321163 321854 323421 325685 328591 332476
51277 332476 337592 343600 349868 355985 361663 366438 369990 372618 374820 376430 376747 375651 374032 372847
51263 372847 372183 371627 371112 370830 370561 369724 368184 366468 364970 363361 361093 358218 355408 353222 351579 349879
51247 349879 347513 344379 341051 338325 336494 335238 334317 334000 334562 335687 336731 337359 337584 337435 337104 337160
51231 337160 338005 339163 339725 339513 339232 339453 339989 340421 340555 340327 339861 339773 340652 342013 342595 342129 342000 343592
51213C43592L065L336L034K853K553J912J380J166P51k5l42L98J660K661L376
51198C71370L903L747K673J516J135J113M80p28j639j887j832j632j104l61K09
51183C76963N55Q97J174J206J224J492J687J402J030J246J700J274k71j869k607
51168C87103k708k747k782k715k819l187l198k242p68J9m84j573k052j418j92
51153C58237P76J069Q19L29j12j63L50J052J251P85K55J52K50K11K46O18Q80M08
51135C67413n79j262j380j378j547j701j730j720j456n68O68J409J381J305J884
51120C60739K895L660L918L922M028M451N075N359M749L375J951R83N09N72J145
51105D07331J548Q30q42j987j605l91M39Q09J358J936J711O65j31PM44J59r70
$$ plain form
51213 343592 346657 349993 353027 355880 358433 360345 361725 362891 363642 363617 363275 363673 365333 367994 371370
51198 371370 375273 379020 381693 383209 384344 385457 385937 385209 383570 381683 379851 378219 377115 376754 376963
51183 376963 377518 378415 379589 380795 382019 383511 385198 386600 387630 388876 390576 391850 391579 389710 387103
51168 387103 384395 381648 378866 376151 373332 370145 366947 364705 363937 363956 363472 361899 359847 358429 358237
51153 358237 359013 360082 360901 361230 361118 360955 361305 362357 363608 364393 364648 364800 365050 365261 365507 366125 367005 367413
51135 367413 366834 365572 364192 362814 361267 359566 357836 356116 354660 354092 354760 356169 357550 358855 360739
51120 360739 363634 367294 371212 375134 379162 383613 388688 394047 398796 402171 404122 405105 405614 406186 407331
51105 407331 408879 409709 408867 406880 405275 404884 405323 406132 407490 409426 411137 411802 411671 411678 412122 412281 411311
51088D11311k136k504j876p72m9j71o95o86K19J376J920J695J223R39Q12O60N40
51071D11806N93P02N31L2l91l31O9L10K51L62J145K533M059N451O870Q536J0206
51054D52734J1012J0010P147L689J333P72J449K659M412O829R228J0563J0643
51041E32480J0386J0705J1539J2055J1478R592O784L904J921J318J681J823M20
51028F16086l206q525j3863j7389j8324j7288j5368j3074j0304p192m471k774
51016D84308j898j093lJ062J818K560L665M901N638N705N584N675N750N429M867
51001E33968M650N029N541N507M804M063M045M774N444N310M703M801O323Q631
50987F07593J0342J0706J0185R803J0121J0934J1745J2362J2873J3239J3141J2411
$$ plain form
51088 411311 409175 406671 404795 404023 403974 403803 403108 402422 402641 404017 405937 407632 408855 409794 410606 411266 411806
51071 411806 412399 413101 413632 413664 413273 412942 413011 413321 413572 413934 415079 417612 421671 427122 433992 442528 452734
51054 452734 463746 473756 480903 484592 485925 486697 488146 490805 495217 502046 511274 521837 532480
51041 532480 542866 553571 565110 577165 588643 598235 605019 608923 610844 612162 613843 615666 616086
51028 616086 612880 604355 590492 573103 554779 537491 522123 509049 498745 491553 487082 484308
51016 484308 482410 481317 481314 482376 484194 486754 490419 495320 500958 506663 512247 517922 523672 529101 533968
51001 533968 538618 543647 549188 554695 559499 563562 567607 572381 577825 583135 587838 592639 598962 607593
50987 607593 617935 628641 638826 648629 658750 669684 681429 693791 706664 719903 733044 745455
50975G45455J1336J0179Q492N490J268k734m937n070m037k583n45K463O206R976
50961G80959J3282J6060J8344K0169K1830K3777K5980K7698K8232K7746K6905
50950A030982K5840K4123K1823J9898J9088J9032J8966J8911J9433K0647K2353
50939A261096K4904K8738L2772L4433L1975K6240J9513J3290P751K788j490n159
50927A476851q537j1712j4591j7417k0751k4777k9125l3356l7207m0269m1984
50916A197125m2235m1494m0195l8271l5663l2908l0735k9155k7407k4968k2294
50905H31800k0197j8710j7043j4813j2783j1891j1841j1386r998q504p725p257
50893F79652o243m884m215m618n288n318m661l779k903j975r50P3R10J317J196
$$ plain form
50975 745455 756791 766970 775462 780952 782220 779486 774549 769479 765442 762859 762314 764777 770983 780959
50961 780959 794241 810301 828645 848814 870644 894421 920401 948099 976331 1004077 1030982
50950 1030982 1056822 1080945 1102768 1122666 1141754 1160786 1179752 1198663 1218096 1238743 1261096
50939 1261096 1286000 1314738 1347510 1381943 1413918 1440158 1459671 1472961 1480712 1483500 1482010 1476851
50927 1476851 1468314 1456602 1442011 1424594 1403843 1379066 1349941 1316585 1279378 1239109 1197125
50916 1197125 1154890 1113396 1073201 1034930 999267 966359 935624 906469 879062 854094 831800
50905 831800 811603 792893 775850 761037 748254 736363 724522 713136 703138 694634 686909 679652
50893 679652 673409 668525 664310 659692 654404 649086 644425 640646 637743 635768 634818 634891 635801 637118 638314
50878F38314Q15N80O56R69J601K696M013M975N360N568O057O801P436P675P530
50863G01046P375P872R395J1491J3306J4684J6244J8204J9859K0718K1536K3474
50851H85204K6589K9947L3099L6586M0857M5399M9293N2268N4817N7505O0402
50840A371966O3120O5146O6182O6204O5224O3114N9724N5091M9425M3044L6500
50829B004740L0561K5813K2291J9702J7937J7116J7420J9144K2720K8095L4194
50818B259733L9462M3074M5087M5389M3111L7433K8569J7604N564p014j9938l3133
50806B504941m6403n9158p0448p9462q5872q9583r0526q8909q5367q0501p4523
50795A654189o7671o0644n4094m7895m1404l4447k7511k1033j5003r407m549o92
$$ plain form
50878 638314 639129 639709 640365 641334 642935 645631 649644 654619 659979 665547 671604 678405 685841 693516 701046
50863 701046 708421 716293 725688 737179 750485 765169 781413 799617 819476 840194 861730 885204
50851 885204 911793 941740 974839 1011425 1052282 1097681 1146974 1199242 1254059 1311564 1371966
50840 1371966 1435086 1500232 1566414 1632618 1697842 1760956 1820680 1875771 1925196 1968240 2004740
50829 2004740 2035301 2061114 2083405 2103107 2121044 2138160 2155580 2174724 2197444 2225539 2259733
50818 2259733 2299195 2342269 2387356 2432745 2475856 2513289 2541858 2559462 2565026 2558012 2538074 2504941
50806 2504941 2458538 2399380 2328932 2249470 2163598 2074015 1983489 1894580 1809213 1728712 1654189
50795 1654189 1586518 1525874 1471780 1423885 1382481 1348034 1320523 1299490 1284487 1275080 1270531 1269839
50783A269839K235M369N578N658M704L169J627M49m47j532l071m746o128p509
50769A274195r683j2856j6281j9143k1387k3427k5463k7371k8919k9743k9527
50758A030395k8498k7396k6582k5525k3589k0988j8427j6127j3776j1214q581
50747H09692n895l166p86Q61K175M013O491Q786J0354J1659J3396J5619J8074
50734H91273K0835K4021K7234K9959L2343L4989L7967M0502M1770M1709M0961
50723A263563M0234L9791L9346L8372L6562L4001L0836K6958K2085J6154R493
50712A597395K718l361p870j0176j0276q745o229k928J395O913J3226J9340K4217
50699A615619K7291K8655K8743K7888K5869K1896J5357O777k272j0472j7670k4153
$$ plain form
50783 1269839 1272074 1276443 1282021 1287679 1292383 1295552 1297179 1297628 1297181 1295649 1292578 1287832 1281704 1274195
50769 1274195 1264512 1251656 1235375 1216232 1194845 1171418 1145955 1118584 1089665 1059922 1030395
50758 1030395 1001897 974501 947919 922394 898805 877817 859390 843263 829487 818273 809692
50747 809692 803797 800631 799845 800706 802881 806894 813385 822171 832525 844184 857580 873199 891273
50734 891273 912108 936129 963363 993322 1025665 1060654 1098621 1139123 1180893 1222602 1263563
50723 1263563 1303797 1343588 1382934 1421306 1457868 1491869 1522705 1549663 1571748 1587902 1597395
50712 1597395 1600113 1596752 1588882 1578706 1568430 1559685 1553456 1550528 1551923 1558836 1572062 1591402 1615619
50699 1615619 1642910 1671565 1700308 1728196 1754065 1775961 1791318 1798095 1795823 1785351 1767681 1743528
50687A743528k9448l2550l3158l1949k9603k6426k3023k0388j8776j7217j4713
50676A466277j1419q039m595m87M523J0133J6075K2184K7970L2706L5976L7722
50664A629026L7965L6934L5217L3231L0746K7543K4303K2051K0793J9584J7953
50653A935346J6365J5084J3497J1041Q071N296L026J539J506L311O337R736J3606
50640B043761J8663K4877L1215L6742M1280M4810M6937M7362M6395M4522M1690
50629B468254L7517L2147K6474K1406J7244J3987J1931J1182J0309N999m933k2523
50617B628994m2690n9509o8725o9558o3961n4640m3579l1699j9510p876J930Q911
50605B178088J2819J3786J1689O266k218j2739k4055l5281m5869n5234o2671o7674
$$ plain form
50687 1743528 1714080 1681530 1648372 1616423 1586820 1560394 1537371 1516983 1498207 1480990 1466277
50676 1466277 1454858 1446819 1442224 1441737 1446260 1456393 1472468 1494652 1522622 1555328 1591304 1629026
50664 1629026 1666991 1703925 1739142 1772373 1803119 1830662 1854965 1877016 1897809 1917393 1935346
50653 1935346 1951711 1966795 1980292 1991333 1999404 2004700 2007726 2009265 2010771 2014082 2020419 2030155 2043761
50640 2043761 2062424 2087301 2118516 2155258 2196538 2241348 2288285 2335647 2382042 2426564 2468254
50629 2468254 2505771 2537918 2564392 2585798 2603042 2617029 2628960 2640142 2650451 2656450 2651517 2628994
50617 2628994 2586304 2526795 2458070 2388512 2324551 2269911 2226332 2194633 2175123 2167247 2169177 2178088
50605 2178088 2190907 2204693 2216382 2222648 2220430 2207691 2183636 2148355 2102486 2047252 1984581 1916907
50593A916907p0318p1225p1025o9813o7265o3375n8809n4285m9761m4688l8999
50582A257344l3399k8548k4356k0370j6471j2764r020m862n47K976N089O278P519
50569A128869R156J0629J1255J0847R658Q096O628N631N159N099N608P135R803
50556A233573J3075J6404J9946K4227K9269L4421L9086M3103M6356M8446M9029
50545A596935M8177M6160M3149L9457L5875L3417L2691L3659L5950L9133M2865
50534B027468M6994N1626N6851O2425O7950P3473P9581Q6803R4991J03513J11886
50523B863561J19995J27718J34598J39973J43263J44048J41947J36642J27916
50514D079661J15499R8959P8073N3503K6871q3k6418n1885p6115r8179j16906
$$ plain form
50593 1916907 1846589 1775364 1704339 1634526 1567261 1503886 1445077 1390792 1341031 1296343 1257344
50582 1257344 1223945 1195397 1171041 1150671 1134200 1121436 1112416 1107554 1107007 1109983 1115072 1121350 1128869
50569 1128869 1138025 1148654 1159909 1170756 1180414 1188510 1195138 1200769 1205928 1211027 1216635 1223770 1233573
50556 1233573 1246648 1263052 1282998 1307225 1336494 1370915 1410001 1453104 1499460 1547906 1596935
50545 1596935 1645112 1691272 1734421 1773878 1809753 1843170 1875861 1909520 1945470 1984603 2027468
50534 2027468 2074462 2126088 2182939 2245364 2313314 2386787 2466368 2553171 2648162 2751675 2863561
50523 2863561 2983556 3111274 3245872 3385845 3529108 3673156 3815103 3951745 4079661
50514 4079661 4195160 4294119 4372192 4425695 4452566 4452483 4426065 4374180 4298065 4199886 4082980
50503D082980j31256j40377j43711j41407j34301j23208j08314q9649o7996m4884
50493B957877k1615J194K2821M1591N5269O2236O1994N4631M0405K0040m835l1814
50481C259794n8212q1551j00116j13501j22401j27513j28849j26526j21882j16974
50471B162269j12754j08368j02613r5489q7890q0341p2792o5382n8571n2471m6705
50460A278893m1138l6136l1886k8016k4210k0778j8065j5720j3077j0156p633
50449A032078n805m170k289n73K59K94M49J410K982M650O333Q173R832J0618J0400
50434A074641R939R960J0254J0114R521R364J0407J2443J4672J6668J8595K0631
50422A227209K2478K3686K4231K4558K5120K6140K7870L0726L4875L9827M4957
$$ plain form
50503 4082980 3951724 3811347 3667636 3526229 3391928 3268720 3160406 3070757 3002761 2957877
50493 2957877 2936262 2937456 2960277 3001868 3057137 3119373 3181367 3235998 3276403 3296443 3291608 3259794
50481 3259794 3201582 3120031 3019915 2906414 2784013 2656500 2527651 2401125 2279243 2162269
50471 2162269 2049515 1941147 1838534 1743045 1655155 1574814 1502022 1436640 1378069 1325598 1278893
50460 1278893 1237755 1201619 1169733 1141717 1117507 1096729 1078664 1062944 1049867 1039711 1032078
50449 1032078 1026273 1022103 1019814 1019241 1019500 1019794 1020243 1021653 1024635 1029285 1035618 1043791 1053623 1064241 1074641
50434 1074641 1084580 1094540 1104794 1114908 1124429 1133793 1144200 1156643 1171315 1187983 1206578 1227209
50422 1227209 1249687 1273373 1297604 1322162 1347282 1373422 1401292 1432018 1466893 1506720 1551677
50411A551677N0278N6273O2820O8882P3601P7172Q0182Q2472Q3310Q2491Q0521
50400B349679P7633P3294O6909N8528M8485L6616K2291N288j3491l2245m9332
50389B643655o4133p6766q6904r3341r5083r2521q6987p9429p0141n9555m8383
50378A790412l6824k4547j1794J60J0047J7470K2366K4304K2961J8767J2327L601
50366A849250p601k0431l3044m3828n2153n8022o1569o2967o2433o0229n6928
50355A330045n3445n0425m7623m4365m0554l6799l3649l1099k8952k7031k5028
50344I11075k2548j9668j7049j5211j3902j2426j0489q548p276o831o673o146
50332G64308n166m218l647l222k593j888j561j801k300k528k040p91O66J612K076
$$ plain form
50411 1551677 1601955 1658228 1721048 1789930 1863531 1940703 2020885 2103357 2186667 2269158 2349679
50400 2349679 2427312 2500606 2567515 2626043 2674528 2711144 2733435 2738723 2725232 2692987 2643655
50389 2643655 2579522 2502756 2415852 2322511 2227428 2134907 2047920 1968491 1898350 1838795 1790412
50378 1790412 1753588 1729041 1717247 1717407 1727454 1744924 1767290 1791594 1814555 1833322 1845649 1849250
50366 1849250 1841649 1821218 1788174 1744346 1692193 1634171 1572602 1509635 1447202 1386973 1330045
50355 1330045 1276600 1226175 1178552 1134187 1093633 1056834 1023185 992086 963134 936103 911075
50344 911075 888527 868859 851810 836599 822697 810271 799782 791234 783958 777127 770454 764308
50332 764308 759142 754924 751277 748055 745462 743574 742013 740212 737912 735384 733344 732553 733219 734831 736907
50317G36907K947M696O484P190P012P169Q148R311J0249J1477J3409J5631J7685
50304H58315J9776K1993K3516K3439K1824J9174J5335R930L650j834n380p113
50292A002625p621p238o325n486n116n055m997m823m324k943n5M647J0907J7392
50278I81588K1395K0053J2755K099q021j5130j8804j9423j7469j3929j0160o867
50266I28087l799q37J318K027J728J314R20O0j126j653r11N16J608J980J896J575
50250I34703J028M07L3m4k43j050k473l979m950n218n139n129n213n116m686l982
50234H88949l028j812n60L69R94J788K948L934M086L556L261L908N391P109Q619
50219I29512R937J1406J3284J5354J7131J8521K0056K2071K3899K4320K2866K0244
$$ plain form
50317 736907 739854 744550 751034 758224 765236 772405 780553 789864 800113 811590 824999 840630 858315
50304 858315 878091 900084 923600 947039 968863 988037 1003372 1013302 1016952 1015118 1009738 1002625
50292 1002625 995004 987766 981441 975955 970839 965784 960787 955964 951640 948697 948642 953289 964196 981588
50278 981588 1002983 1023036 1035791 1037890 1029869 1014739 995935 976512 959043 945114 934954 928087
50266 928087 924288 923451 924769 926796 928524 929838 930758 930818 929692 928039 927128 927644 929252 931232 933128 934703
50250 934703 935731 936138 936171 936127 935884 934834 932361 928382 923432 918214 913075 907946 902733 897617 892931 888949
50234 888949 885921 884109 883549 883918 884912 886700 889648 893582 897668 901224 904485 908393 913784 920893 929512
50219 929512 939449 950855 964139 979493 996624 1015145 1035201 1057272 1081171 1105491 1128357 1148601
50207A148601J7396J4678J2147J0177R257R331R688R560Q537O455L139j566p590
50194A249810j4521k1619k7918l2505l4959l5596l5040l3475l0520k6036k0777
50183I36844j5846j1555p438l524j048j444m844r923j4908j8447j9915j9494j8016
50170G90442j6314j4637j2888j1082r284p331n244l611k934k698j913n73J99k55
50156G01877j141j220k60J008J950K560L233M382O042P558P957O853M726K176
50142G47701n67l198n031n722n775n738n336m055k273r07j19P84K132L399M059
50127G19354M215M069L531K715K210K362K689K562K130K049K494L006L256L544
50113G60186M385N892P678R175J0157J1034J2578J5005J7580J9465K0899K3007
$$ plain form
50207 1148601 1165997 1180675 1192822 1202999 1212256 1221587 1231275 1240835 1249372 1255827 1258966 1257400 1249810
50194 1249810 1235289 1213670 1185752 1153247 1118288 1082692 1047652 1014177 983657 957621 936844
50183 936844 920998 909443 902005 898481 897433 895989 891145 881222 866314 847867 827952 808458 790442
50170 790442 774128 759491 746603 735521 726237 718906 713662 710051 707117 704419 702506 701933 702132 701877
50156 701877 700736 699516 699256 700264 702214 704774 708007 712389 718431 725989 733946 740799 745525 747701
50142 747701 747134 743936 738905 733183 727408 721670 716334 712279 710006 709099 708980 709764 711896 715295 719354
50127 719354 723569 727638 731169 733884 736094 738456 741145 743707 745837 747886 750380 753386 756642 760186
50113 760186 764571 770463 778141 787316 797473 808507 821085 836090 853670 873135 894034 917041
50101I17041K6403L0454L4240L7705M1394M5395M9065N1650N2616N1596M8687
50090A386246M4953M1899M0158L9175L8381L7953L7928L7191L4158K8235J9897
50079A786174R684k038j4397k5998l5840m3663m9300n2444n3352n3000n2138n0638
50067A363050m8122m4624m0356l5389l0099k5378k1809j9042j6523j4397j3094
50056A054217j2504j2254j2507j3586j4975j5551j4851j3428j1883j0330q867
50045I13481p853p350o863o006n001m250l737l183k462j626o75M00J500K511L409
50030H72295M297N448P096Q945J0051R740Q533P548P016O100M336K471J400R20
50016I56196J64j134k552l904n540p693r980j1745j2636j2787j2565j2170j1478
$$ plain form
50101 917041 943444 973898 1008138 1045843 1087237 1132632 1181697 1233347 1285963 1337559 1386246
50090 1386246 1431199 1473098 1513256 1552431 1590812 1628765 1666693 1703884 1738042 1766277 1786174
50079 1786174 1795858 1793820 1779423 1753425 1717585 1673922 1624622 1572178 1518826 1465826 1413688 1363050
50067 1363050 1314928 1270304 1229948 1194559 1164460 1139082 1117273 1098231 1081708 1067311 1054217
50056 1054217 1041713 1029459 1016952 1003366 988391 972840 957989 944561 932678 922348 913481
50045 913481 905628 898278 891415 885409 880408 876158 872421 869238 866776 865150 864475 864875 866375 868886 872295
50030 872295 876592 882040 889136 898081 908132 917872 926405 933953 940969 947069 951405 953876 955276 956196
50016 956196 956360 955226 952674 948770 943230 935537 925557 913812 901176 888389 875824 863654 852176
50003H52176j0394r352q952q954q088n378j347K593N724Q366J0757J2351J2519
49990H52021J1427R860Q496P619P305P535Q062Q447Q248P385O420O406Q103J1202
49976I68536J4564J7329J9508K1324K2354K1852J9804J7235J5260J4192J3770
49965A165728J3864J4528J5442J5738J4532J1420O382m80q766j7545k5554l1689
49953A173600l5335l6362l5083l2054k7720k2336j6478j1431q548q127r111j0030
49941I20985j0107r503q895q893r623j0694j1725j2882j4567j6592j8144j8759
49929G70601j8867j9108j9421j9173j7947j5904j3541j1396r725q233o350m034
49917F06902k011r06m75o2M80Q55J039J350J883K409K873L493M392N524O915Q639
$$ plain form
50003 852176 841782 832430 823478 814524 806436 801058 799711 802304 808028 816394 827151 839502 852021
49990 852021 863448 873308 881804 889423 896728 904263 912325 920772 929020 936405 942825 949231 957334 968536
49976 968536 983100 1000429 1019937 1041261 1063615 1085467 1105271 1122506 1137766 1151958 1165728
49965 1165728 1179592 1194120 1209562 1225300 1239832 1251252 1257634 1257154 1248388 1230843 1205289 1173600
49953 1173600 1138265 1101903 1066820 1034766 1007046 984710 968232 956801 948253 940126 931015 920985
49941 920985 910878 901375 892480 883587 873964 863270 851545 838663 824096 807504 789360 770601
49929 770601 751734 732626 713205 694032 676085 660181 646640 635244 625519 617286 610936 606902
49917 606902 604891 603985 603510 603448 603928 604783 605822 607172 609055 611464 614337 617830 622222 627746 634661 643300
49901F43300J0510J2205J3591J4635J5143J5023J4565J3895J2421R610O207L757
49889G84862K730J920kl130o755j0273j3184j4937j5385j4979j4166j3130j2407
49876F71164j2745j3785j3847j1980r422p996p714p222o020m763l608j939L8J055
49862E71216O39J6M38J682L015M525O554Q542R674J0351J1838J4492J7167J8478
49848F78627J7977J6019J3119R790O624M168K634J754Q92n20k575n060p912j1083
49834G24454j3866j5025j4100j2165j0717j0144r696q704p106n033k638l84J146
49821F16022J914K461L246M317N681P405R280J0886J2120J3183J3909J3682J2336
49808G26442J0598R242Q106O522M430K530J330M09j149l735o706q905r720r574
$$ plain form
49901 643300 653810 666015 679606 694241 709384 724407 738972 752867 765288 774898 781105 784862
49889 784862 787592 789512 789510 786380 779625 769352 756168 741231 725846 710867 696701 683571 671164
49876 671164 658419 644634 630787 618807 609385 601389 593675 586453 580433 575670 572062 570123 570161 571216
49862 571216 571855 571871 572309 573991 577006 581531 588085 596627 606301 616652 628490 642982 660149 678627
49848 678627 696604 712623 725742 735532 742156 746324 748958 750712 751604 751084 748509 743449 735537 724454
49834 724454 710588 695563 681463 669298 658581 648437 638741 630037 622931 617898 615260 614876 616022
49821 616022 617936 620397 623643 627960 633641 641046 650326 661212 673332 686515 700424 714106 726442
49808 726442 737040 746282 754388 760910 765340 767870 769200 769609 768460 764725 758019 749114 739394 729820
49794G29820r354r445r583r521r454r637r933r905r239p965o434n135m339l835
49780F16041l266k604k101j768j363r22p42o79p5J349L058M512N880P413Q706
$$ plain form
49794 729820 720466 711021 701438 691917 682463 672826 662893 652988 643749 635784 629350 624215 619876 616041
49780 616041 612775 610171 608070 606302 604939 604017 603275 602596 602521 603870 606928 611440 617320 624733 633439
$$ [...]
##END NTUPLES=NMR SPECTRUM
##END=
