
##TITLE=UV1220_M5_1296-1170_90_7229556_2qQ6gD5V1T
##JCAMPDX= 6.0         $$ Bruker NMR JCAMP-DX V2.0
##DATA TYPE= NMR SPECTRUM
##DATA CLASS= NTUPLES
##ORIGIN= BRUKER
##OWNER= Administrator
$$ 1.72 TOPSPIN		Version 2.1
$$ 2013-01-18 01:16:40.131 -0500  Administrator@X
$$ Compression mode = diff/dup
##.OBSERVE FREQUENCY= 400.02188249412
##.OBSERVE NUCLEUS= ^1H
##.ACQUISITION MODE= SIMULTANEOUS (DQD)
##.ACQUISITION SCHEME= undefined
##.AVERAGES= 8
##.DIGITISER RES= 22
##SPECTROMETER/DATA SYSTEM= spect
##.PULSE SEQUENCE= zg30
##.SOLVENT NAME= COFFEE_meoh
##.SHIFT REFERENCE= INTERNAL, COFFEE_meoh, 1, 14.98509
##AUDIT TRAIL= $$ (NUMBER, WHEN, WHO, WHERE, PROCESS, VERSION, WHAT)
$$ ##TITLE= Audit trail, TOPSPIN		Version 2.1
$$ ##JCAMPDX= 5.01
$$ ##ORIGIN= Bruker BioSpin GmbH
$$ ##OWNER= Administrator
$$ $$ E:\/data/COFFEE/nmr/UV1220_M5_1296-1170_90_7229556_2qQ6gD5V1T/20/pdata/1/auditp.txt
$$ ##AUDIT TRAIL=  $$ (NUMBER, WHEN, WHO, WHERE, PROCESS, VERSION, WHAT)
(   1,<2013-01-18 01:16:32.116 -0500>,<Administrator>,<X>,<go>,<TOPSPIN 2.1>,
      <created by zg
	started at 2013-01-18 01:15:26.022 -0500,
	POWCHK enabled, PULCHK disabled,
       configuration hash MD5:
       86 BA 57 50 F2 9D 5C 9B 26 00 A9 28 5F 66 2E 89
       data hash MD5: 64K
       A0 34 6F F2 7C 27 60 DA AB 6A EA 89 15 1B 54 C0>)
(   2,<2013-01-18 01:16:35.178 -0500>,<Administrator>,<X>,<proc1d>,<TOPSPIN 2.1>,
      <Start of raw data processing
       efp LB = 0 FT_mod = 6 PKNL = 1 PHC0 = 0 PHC1 = 0 SI = 32K 
       data hash MD5: 32K
       44 9C 16 73 26 4B B2 AE 99 AF C8 EE BA AD 8C 68>)
(   3,<2013-01-18 01:16:35.616 -0500>,<Administrator>,<X>,<proc1d>,<TOPSPIN 2.1>,
      <pk PHC0 = 97.91016 PHC1 = 0 
       data hash MD5: 32K
       25 80 DB 5D 51 B1 3F E8 EF E9 2D 51 F4 2E 3B CA>)
(   4,<2013-01-18 01:16:35.834 -0500>,<Administrator>,<X>,<proc1d>,<TOPSPIN 2.1>,
      <abs ABSG = 1 
       data hash MD5: 32K
       2E 94 64 88 AA 3E F5 9B A5 6F 29 3F E5 8D A8 E1>)
(   5,<2013-01-18 01:16:35.991 -0500>,<Administrator>,<X>,<proc1d>,<TOPSPIN 2.1>,
      <abs ABSG = 2 
       data hash MD5: 32K
       A4 4C 3F 1B A8 BA D4 C0 FB C4 88 00 CC C9 B7 49>)
(   6,<2013-01-18 01:16:36.131 -0500>,<Administrator>,<X>,<proc1d>,<TOPSPIN 2.1>,
      <abs ABSG = 3 
       data hash MD5: 32K
       23 F9 CB FF 53 2A 4D E2 F3 C8 59 24 59 A0 37 4F>)
(   7,<2013-01-18 01:16:36.272 -0500>,<Administrator>,<X>,<proc1d>,<TOPSPIN 2.1>,
      <abs ABSG = 4 
       data hash MD5: 32K
       9A E7 1F 48 A0 01 F8 A6 C0 DE D7 C9 B6 61 38 70>)
(   8,<2013-01-18 01:16:36.428 -0500>,<Administrator>,<X>,<proc1d>,<TOPSPIN 2.1>,
      <abs ABSG = 5 
       data hash MD5: 32K
       1C F0 07 BE E9 BF F3 EC 44 B9 9A B7 B4 53 5F 78>)
$$ ##END=
$$ 
$$ $$ hash MD5
$$ $$ 98 87 FD C5 01 39 69 85 C0 6B 43 C3 19 11 2A 8A
##$RELAX= 
##$RELAX= 
##$RELAX= 
##$RELAX= 
##$RELAX= 
##$RELAX= 
##$RELAX= 
$$ Bruker specific parameters
$$ --------------------------
##$DU= <E:\>
##$EXPNO= 20
$$ [...]
##$TP= (0..7)
150 150 150 150 150 150 150 150
##$TP07= 0
##$TPNAME0= <>
##$TPNAME1= <>
##$TPNAME2= <>
##$TPNAME3= <>
##$TPNAME4= <>
##$TPNAME5= <>
##$TPNAME6= <>
##$TPNAME7= <>
##$TPOAL= (0..7)
0.5 0.5 0.5 0.5 0.5 0.5 0.5 0.5
##$TPOFFS= (0..7)
0 0 0 0 0 0 0 0
##$TUNHIN= 0
##$TUNHOUT= 0
##$TUNXOUT= 0
##$USERA1= <user>
##$USERA2= <user>
##$USERA3= <user>
##$USERA4= <user>
##$USERA5= <user>
##$V9= 5
##$VALIST= <valist>
##$VCLIST= <CCCCCCCCCCCCCCC>
##$VD= 0
##$VDLIST= <DDDDDDDDDDDDDDD>
##$VPLIST= <PPPPPPPPPPPPPPP>
##$VTLIST= <TTTTTTTTTTTTTTT>
##$WBST= 1024
##$WBSW= 4
##$XGAIN= (0..3)
0 0 0 0
##$XL= 0
##$YL= 0
##$YMAX_a= 708888
##$YMIN_a= -603055
##$ZGOPTNS= <>
##$ZL1= 120
##$ZL2= 120
##$ZL3= 120
##$ZL4= 120
##$ABSF1= 14.98509
##$ABSF2= -5.573092
##$ABSG= 5
##$ABSL= 3
##$ALPHA= 0
##$AQORDER= 0
##$ASSFAC= 0
##$ASSFACI= 0
##$ASSFACX= 0
##$ASSWID= 0
##$AUNMP= <proc_prof1d_extract_pilot.lims>
##$AXLEFT= 0
##$AXNAME= <>
##$AXNUC= <1H>
##$AXRIGHT= 0
##$AXTYPE= 0
##$AXUNIT= <>
##$AZFE= 0.1
##$AZFW= 0.1
##$BCFW= 0
##$BC_mod= 0
##$BYTORDP= 0
##$COROFFS= 0
##$CY= 15
##$DATMOD= 1
##$DC= 0
##$DFILT= <>
##$DTYPP= 0
##$F1P= 0
##$F2P= 0
##$FCOR= 0.5
##$FTSIZE= 32768
##$FT_mod= 6
##$GAMMA= 0
##$GB= 0
##$INTBC= 1
##$INTSCL= 1
##$ISEN= 128
##$LB= 0
##$LEV0= 0
##$LPBIN= 0
##$MAXI= 10000
##$MC2= 0
##$MEAN= 0
##$ME_mod= 0
##$MI= 0
##$NCOEF= 0
##$NC_proc= -8
##$NLEV= 6
##$NOISF1= 0
##$NOISF2= 0
##$NSP= 0
##$NTH_PI= 0
##$NZP= 0
##$OFFSET= 14.98509
##$PC= 1
##$PHC0= 97.91016
##$PHC1= 0
##$PH_mod= 1
##$PKNL= yes
##$PPARMOD= 0
##$PPDIAG= 0
##$PPIPTYP= 0
##$PPMPNUM= 2147483647
##$PPRESOL= 1
##$PSCAL= 4
##$PSIGN= 0
##$PYNMP= <proc.py>
##$REVERSE= no
##$SF= 400.02
##$SI= 32768
##$SIGF1= 0
##$SIGF2= 0
##$SINO= 400
##$SIOLD= 32768
##$SPECTYP= <>
##$SREGLST= <1H.CDCl3>
##$SSB= 0
##$STSI= 32768
##$STSR= 0
##$SW_p= 8223.68421052631
##$SYMM= 0
##$S_DEV= 0
##$TDeff= 65536
##$TDoff= 0
##$TI= <>
##$TILT= no
##$TM1= 0
##$TM2= 0
##$TOPLEV= 0
##$USERP1= <user>
##$USERP2= <user>
##$USERP3= <user>
##$USERP4= <user>
##$USERP5= <user>
##$WDW= 1
##$XDIM= 32768
##$YMAX_p= 475322870
##$YMIN_p= -873890
##$CURPLOT= <Network HP LaserJet P1505>
##$CURPRIN= <$Network HP LaserJet P1505>
##$DFORMAT= <normdp>
##$LAYOUT= <+/1D_H.xwp>
##$LFORMAT= <normlp>
##$PFORMAT= <normpl>
##$SURQMSG= 1
$$ End of Bruker specific parameters
$$ ---------------------------------
##NTUPLES= NMR SPECTRUM
##VAR_NAME=  FREQUENCY,     SPECTRUM/REAL,   SPECTRUM/IMAG
##SYMBOL=    X,             R,               I
##VAR_TYPE=  INDEPENDENT,   DEPENDENT,       DEPENDENT
##VAR_FORM=  AFFN,          ASDF,            ASDF
##VAR_DIM=   32768,         32768,           32768
##UNITS=     HZ,            ARBITRARY UNITS, ARBITRARY UNITS
##FACTOR=    0.250966925370066, 1,           1
##FIRST=     8223.43324360094, -128765,      -86343
##LAST=      0,             -184419,         -17572
##MIN=       0,             -873890,         0
##MAX=       8223.43324360094, 475322870,    0
$$ Real data points
##PAGE= N=1
##DATA TABLE= (X++(R..R)), XYDATA
$$ [...]
19543a0765A2252a58193J3645H653a05155o4739d4821j80310A07352a44266B02347
19531F2282J03579a67248M8931f118H7199g4585D6592J98635a32478C9010O081
19520D5091m265a75948d4160K978q0080a3859k42641J8801A71356a94520D7047
19508i0613k27444h4067C04916g5792A1994c1749k3704j68195I1374b8471l38022
19497c66493E0659a24518G9738a0228o8569I8272d3301A36627A2878b02768O7905
19486a34863F70e6719m8936C834b21168N088j46090B19970q0926C2823g006m7155
19474e4161K4323E1182f9302A24207Q8690G3451a66187a5548k28958O4726B35518
19462b40365J10718j4447B01931a4642H5510a75928m9245R5411G2190B1201b02926
$$ y = [-10765, 12252, -158193, -144548, 8653, -105155, -169894, -44821, -225131, 107352, -144266, 202347, 62282, 165861, -167248, -118317, -6118, 87199, -74585, 46592, 245227, -132478, 39010, 45091, 40826, -175948, -44160, -41182, -121262, -13859, -256500, -237699, 171356, -194520, 47047, -90613, -318057, -84067, 304916, -75792, 11994, -31749, -55453, -223648, 91374, -28471, -366493, 50659, -124518, 79738, -10228, -78797, 98272, -43301, 136627, 12878, -202768, -134863, 670, -56719, -105655, 3834, -221168, -216080, -362170, 219970, 139044, 32823, -7006, -54161, -29838, 51182, -69302, 124207, 212897, 73451, -166187, -15548, -244506, -179780, 235518, -240365, -129647, -144094, 201931, -14642, 85510, -175928, -225173, -129762, 72190, 21201, -202926]
19450A48522a80514d893A29878k9845a79530K341N8424L5739C3118N3275A973
19438c07220L9625a25523A22452c05886C0433N6715L4824c51525J55335i890l26388
19427c36278a48360l0653M7083D8585i1965J5645D396b15590B55731B5114e35358
19415e09667I365a90847C58324j58849R8864g2408A09258J98132j09547h3288
19404H3686B1990K6130N4815k6597f1231o6239m7864c3910B52561H2614a24122
19392b62562r3019D578c20841J33193M4498G850a84148n5145P6806P8744q2697
19381a66440o215d1182j91513M6693n6722a14011g884k47866j36504e129A8997
19369E8458K9069a46977A1824a60939K2652c4922q6461M2725B94458H2766b1066
$$ y = [148522, -180514, -4893, 129878, 100033, -179530, -177189, -118765, -83026, 33118, 86393, 1973, -307220, -267595, -125523, 122452, -305886, 30433, 87148, 121972, -351525, -196190, -9890, -336278, -148360, -179013, -131930, 48585, -91965, -76320, 4396, -215590, 255731, 25114, -535358, -509667, 9365, -190847, 358324, 199475, 298339, -72408, 109258, 307390, 197843, -83288, 83686, 21990, 48120, 102935, 76338, -61231, -127470, -175334, -33910, 252561, 82614, -124122, -262562, -355581, 4578, -320841, -187648, -143150, 7850, -184148, -239293, -162487, -83743, -166440, -172655, -41182, -232695, -186002, -242724, -114011, -7884, -255750, -392254, -5129, 18997, 58458, 87527, -146977, 11824, -160939, -138287, -34922, -121383, -78658, 294458, 82766, -21066]
19357C28664p8245D4835a51015e6208a8893k1342A07818b90626J34083I3815N6819
19346A50634a76254B03230F4951c55323J8514N2430B6589a44229N979N8322I1651
19334A19610a22801K6517B79720j03034D2628L18014G964a68036b0332F0553f694
19322A53533R079a63232f5346B37114m7599B7365d33323A26323m7268K9968m0175
19311F8848b41583A64663b39589D6128e0102H1216b52995p9463a22005p2429m035
19300a98469g3557A35527a44577d5452P295D6372c7641l00865J13388n4664m2770
19289c22552A2305R3077a29574k98073a16047C3068M2736b65073c318j20869A5600
19277A47519a56055b7666o0187l41849J69726o207a12343B54129a55751L8975
$$ y = [328664, 250419, 44835, -151015, -56208, -18893, -40235, 107818, -290626, -156543, 93815, 150634, -176254, 203230, 64951, -355323, -336809, -284379, 26589, -144229, -138250, -79928, 91651, 119610, -122801, -96284, 279720, 176686, 42628, 360642, 7964, -168036, -20332, 60553, -6694, 153533, 162612, -163232, -65346, 237114, 189515, 27365, -433323, 126323, 79055, 109023, 68848, -241583, 164663, -239589, 46128, -50102, 81216, -252995, -332458, -122005, -194434, -198469, -73557, 135527, -144577, -45452, -38157, 46372, -37641, -338506, -225118, -279782, -322552, 12305, 105382, -129574, -427647, -116047, 33068, 75804, -265073, -3318, -124187, 15600, 147519, -156055, -27666, -87853, -429702, -259976, -266183, -112343, 254129, -155751, -116776]
19267a16776m19599K39897B12099f6237j71878l13676g2057a2696I0701C7951
19256b31006i1544C0069g8475j80861Q2832f2495M889j1093B3299N1548i1027
19244B69589a23069K2585b2861A50517J18438B1347a85568A5846a71462A2120
19233b00660l1872n2648g7547k34937N65b5045G8485d3220m1163j42733A15699
19221e5700G7264e7427p7119A83692E7698L9518c40501D60281a5808B18325J09541
19210C27866b31012A76724a31913k26527C2578b0002l25182J14586B51842A15435
19199a69607j34353b7217j42024b0220j26564j09059O7129j43693E66938b2325
19188A04083D7578M9170a72748r6457K1703B6136e1955n507B45788A02078l7300
$$ y = [-116776, -536375, -296478, 212099, -66237, -238115, -551791, -72057, -12696, 90701, 37951, -231006, -91544, 30069, -78475, -259336, -176504, -62495, -57606, -68699, 23299, 74847, -91027, 269589, -123069, -100484, -22861, 150517, 268955, 21347, -185568, 15846, -171462, 12120, -200660, -232532, -285180, -77547, -312484, -311919, -25045, 78485, -43220, -84383, -227116, 115699, -55700, 77264, -57427, -134546, 183692, 57698, 97216, -340501, 460281, -15808, 218325, 327866, -231012, 176724, -131913, -358440, 32578, -20002, -345184, -230598, 251842, 115435, -169607, -303960, -27217, -169241, -20220, -146784, -255843, -188714, -332407, 566938, -22325, 104083, 47578, 96748, -172748, -269205, -247502, 26136, -51955, -57462, 245788, 102078, 64778]
19177F4778A4000a48817A879a20822L9318F1105a02991H1671N615d91197b9839
19165b69556a26274E2748J24138a75131c6578p2395o5047B77946h7196G2979F826
19153B9848b51034A37143J66742b47368i6243A16254d90071h8923j6023m02a1054
19141b61054B8270O4569d76116A09590a45419A63779M0804c858j20854d8399A39269
19129d14400a35405J8225L6286B46310a52021A27649O9451b13450n2188L2901
19119b32737A14417k8729a8879q3342A0220J63732d4468j7331H001J7657a32620
19107G6879J92196i5520M7673p925m48266a82092A8540b1689o0420I9238C9546
19095b80957C23105a49239j14318I2842J15997m1693b55788g5501L4289A27445
$$ y = [64778, 14000, -148817, 1879, -120822, -81504, 61105, -102991, 81671, 87286, -491197, -29839, -269556, -126274, 52748, 176886, -175131, -36578, -108973, -174020, 277946, -87196, 72979, 6826, 29848, -251034, 137143, 303885, -247368, -96243, 116254, -490071, -88923, -104946, -105348, -11054, -261054, 28270, 92839, -476116, 109590, -145419, 163779, 204583, -3858, -124712, -48399, 139269, -414400, -135405, -117180, -80894, 246310, -152021, 127649, 197100, -213450, -265638, -232737, 114417, 85688, -18879, -102221, 10220, 173952, -44468, -61799, 8001, 25658, -132620, 76879, 269075, -95520, -47847, -55772, -504038, -182092, 18540, -21689, -82109, 99238, 39546, -280957, 323105, -149239, -263557, 92842, 208839, 167146, -255788, -75501, -41212, 127445]
19084A071i5397o7453a9616k7110n0758F7594L4853M0077c70797d1955L206j13184
19072a51933D6823a64263k22136A00745a04159J2819j80868c5041j83303A61113
19061a50454A13486i8575k07308R8780Q6031d8068B53048a98601B68246b27620
19050i5501J4820A04060g5368I6234f7174j29205C60278g9510A44478a22543d9880
19038A54213D6527R8335c20235R2396Q7075c4159m1115j14867L4562j49090d5307
19026F745J45958O7434b145k2712k26373j38918C2594j56O9230c31641a38739
19014b16424M6355B3947h1700k21327a29514J2431E5858c9078A80545J69047r8000
19003B51592a18848l20305a40013j30837C1814c29205c5365B18791B3267J82470
$$ y = [1071, -95397, -162850, -19616, -46726, -97484, 67594, 102447, 142524, -370797, -41955, -38749, -151933, 46823, -164263, -386399, 100745, -104159, -91340, -272208, -35041, -218344, 161113, -150454, 113486, -98575, -305883, -207103, -121072, -48068, 253048, -198601, 268246, -227620, -95501, -80681, 104060, -75368, 96234, -67174, -196379, 360278, -79510, 144478, -122543, -49880, 154213, 46527, 144862, -320235, -227839, -140764, -34159, -75274, -190141, -155579, -304669, -45307, 6745, 152703, 220137, -2145, -24857, -251230, -390148, 32594, 32438, 101668, -331641, -138739, -216424, -170069, 23947, -81700, -303027, -129514, -117083, 55858, -39078, 180545, 349592, 251592, -118848, -439153, -140013, -270850, 31814, -329205, -35365, 218791, 23267, 205737]
18993B05737b26639A49581b4708B7892a14977I7391a24554K6322B91660b58909
18982B74788b9423l2705C930d6924A02704b33164G414a25175j0319N1938C6205
18970A12897m7989a09857B45571D5855J38976a11877l0836d4850r6959O2555A26136
18958B50335b29070L5610b4172j19079K0228K0397F0234c19409j27734J91947
18948b55196O8934B69416A33291J824c10969N4399j83089D03121A5619Q5668L8434
18937A39721c02644h3888A3240C322c384j14342r2185A08847b48201g1221r3337
18926a64558H141c47362a33024N8140m2258B73901A30454B3683a96654A86156
18915b1980j56607A6152b56643r5557A42191c4818B20992m9292e916G852K90764
$$ y = [205737, -226639, 149581, -24708, 27892, -114977, 97391, -124554, -98232, 291660, -258909, 274788, -29423, -62128, 3930, -46924, 102704, -233164, 7414, -125175, -135494, -83556, 36205, 112897, 64908, -109857, 245571, 45855, 184831, -111877, -142713, -44850, -141809, -79254, 126136, 250335, -229070, -193460, -24172, -143251, -123023, -102626, 60234, -319409, -447143, -255196, -186262, 269416, 133291, 135115, -310969, -256570, -439659, 403121, 15619, 101287, 139721, -302644, -83888, 13240, 3322, -3384, -117726, -209911, 108847, -248201, -71221, -164558, 8141, -347362, -133024, -74884, -117142, 273901, 130454, 23683, -196654, 186156, -21980, -178587, 16152, -256643, -352200, 142191, -34818, 220992, 171700, -5916, 7852, 298616]
18904B98616F2815b16405A52160E6175J19089J23103d7181D62628a34478M4745
18894h9733E451a17554j79606I6097a31393B68504b84043C1781b32630d0737r7774
18883a38511H7795a23282m4989d9938D12298c31148q8307g672k70609C22088a76157
18871I5728b45748J03093G2376B6988L14779d0906j4338j8190G3563a41316c6375
18859A3638J43957C1472Q9227a33645A25812n5602b21571A63580K22123E0555
18848A33372c22538E4011b32745P043p3243R951p2575D2126b71000G351e4822
18836D8044a2810l41508c7559l49470J21639j06009A26815l6191a96028R635j19224
18825c05617A8349a37203C19130b1475j68461N2001b4784A93847H144d0274o4086
$$ y = [298616, 62815, -216405, 152160, 56175, 175264, 298367, -47181, 462628, -134478, -89733, 5451, -117554, -297160, 96097, -131393, 268504, -284043, 31781, -232630, -40737, -138511, 87795, -123282, -168271, -49938, 412298, -331148, -419455, -7672, -278281, 322088, -176157, 95728, -245748, -142655, 72376, 26988, 341767, -40906, -55244, -73434, 73563, -141316, -36375, 13638, 157595, 31472, 120699, -133645, 125812, 70210, -221571, 163580, 385703, 50555, 133372, -322538, 54011, -232745, -225702, -298945, -288994, -361569, 42126, -271000, 7351, -54822, 48044, -12810, -354318, -37559, -387029, -265390, -371399, 126815, 90624, -196028, -186393, -305617, 18349, -137203, 319130, -21475, -189936, -137935, -24784, 193847, 8144, -40274, -104360]
18814a04360A58018f0077D5709J57751a17445B1400a20533b0294G6141O1930b24494
18802F0228a25946A75745o7849L2266a97409i1268J184h221A71677k6867j8621
18791A26189a89492C6061b42804R7126k19513J52902j62565b0301r1684Q691M5465
18780e7829q9519e7739o4178E6127k7779e0723P865F7645R118a93962l6628Q069
18768b22521l08415a4189l06566J7099J12151f9763b9950A30865D3998b2000A81774
18756a50740K0873M6564b9405k0086A55885f332r5554G9418a211l29101B35149
18744d90482A90864A8437K2620b45168A13481K01552a91655m415F7040b47651
18733d26822J02987G0525c5707C67856a34215k52801J48755j76755A88598b20082
$$ y = [-104360, 158018, -60077, 45709, 203460, -117445, 21400, -120533, -20294, 76141, 138071, -224494, 60228, -125946, 175745, 107896, 140162, -197409, -91268, -90084, -8221, 171677, 144810, 126189, -189492, 36061, -242804, -145678, -365191, -212289, -374854, -20301, -111985, -103294, -57829, -147348, -57739, -121917, 56127, 28348, -50723, -42858, 67645, 76763, -193962, -230590, -222521, -530936, -14189, -320755, -303656, -191505, -69763, -29950, 130865, 43998, -22000, 181774, -150740, -129867, -83303, -29405, -49491, 155885, -6332, -101886, 79418, -1211, -330312, 235149, -490482, 190864, 18437, 41057, -245168, 113481, 315033, -191655, -196070, 67040, -247651, -426822, -323835, 70525, -35707, 367856, -134215, -387016, -238261, -415016, 188598, -220082]
18722b04956o2813A06616Q1054b66393K7144J16309B55242b17388m0721c5439
18711C7711j277A0667M50285j90280A02690e5451A92475b26475E2757b50706b0034
18699H839N7914c27088e9871A69733g4037F2933c41185j01726J86379A99902a79062
18687B10343N7690b1344g620A92736a09080H2436i1984m27112b15190B20555H5036
18675B5014q848a19905m10894a03391p659E7103B8305a31518c411B92082a97013
18663B71139E9088l027A8678J23207K49852f178k27645e6660A46075F0326b51062
18651e1442B16389i3456j52104A68249H0893i0708n5678N0230M4873k47899B33894
18639c051k37288R8610o6344i5713K4989k84130B2177i858l94079C25849a11856
$$ y = [-204956, -267769, 106616, 187670, -266393, -239249, -122940, 255242, -217388, -258109, -35439, 37711, 36434, 10667, 460952, 270672, 102690, -55451, 192475, -226475, 52757, -250706, -20034, 8839, 66753, -327088, -59871, 169733, -74037, 62933, -341185, -442911, -256532, 199902, -179062, 210343, 268033, -21344, -7620, 192736, -109080, 82436, -91984, -519096, -215190, 220555, 85036, 25014, 16166, -119905, -530799, -103391, -111050, 57103, 28305, -131518, -3411, 292082, -197013, 271139, 59088, 56061, 18678, 141885, 391737, -6178, -233823, -56660, 146075, 60326, -251062, -51442, 216389, -93456, -245560, 168249, 80893, -90708, -146386, -96156, -51283, -299182, 233894, -3051, -240339, -141729, -208073, -95713, -70724, -354854, 22177, -9858, -403937, 325849, -111856]
18627A58056B1889f2318l60263J97711E8142d42985d5932j53677h698B47213b48651
18615A89982b16107M931q3995J37299G7789a209k45052A86587n5456a23339c896
18603A21433a59883q0866N8693G781J58389a51936B40019a29170I3842c96959
18592E8603J27939E3482a88269N325j15891M6030d8371j25899k7064K9615C9155
18580I651J84225c10415C363K25549f6081k10328a15418E9562M0141J5329O6205
18569A81237a07025G0734a01162L7276c830B00169a62740j3623Q0588q191M65
18558a03501A72838a79593n7691J12531e7509I2218A888f540q5772H2597G617
18546d4835E8382a32492F7953c89318B1411a06036C51405h2245G7867I879L33134
$$ y = [158056, 21889, -62318, -422581, -224870, 58142, -442985, -45932, -199609, -8698, 247213, -248651, 189982, -216107, -211176, -295171, -157872, 77789, -1209, -246261, 186587, 131131, -123339, -3896, 121433, -159883, -240749, -182056, 7781, 166170, -151936, 240019, -129170, 93842, -396959, 58603, 186542, 53482, -188269, -182944, -298835, -252805, -48371, -174270, -201334, -171719, 39155, 9651, 193876, -310415, 3363, 228912, -66081, -276409, -115418, 59562, 99703, 115032, 181237, -107025, 70734, -101162, -63886, -3830, 200169, -162740, -176363, -95775, -103966, -103501, 172838, -179593, -237284, -124753, -57509, 92218, 1888, -6540, -92312, 82597, 7617, -44835, 58382, -132492, 67953, -389318, 21411, -106036, 351405, -82245, 77867, 9879, 343013]
18535C43013a13695A35886M1706b00194i5730E0694a38375j09612A5945J48722
18525A64667D4511O964b8598A88048J29171G4033g6177D6046h1359k16888c2828
18513e704j312m8165A52625a32646r2976J09890l8164A76302a46313O6170k04452
18502b84595a23582k40507g4035q7299e2547k0593H5093L7548g3652b5023B63391
18490a79011G5722i2930A38884P8141b83223A9933e0813K3407B86183a63181A6968
18478D3705b40983b7851m34202B67213A03129c3784k9099a1572k75589A58478
18467d55003J26019J27994e3856a2187C0300K01893q6713J09268a75195f8225
18456b65949C69059h7987B7995q824a33957C19199A36429b20628L4318B07993
$$ y = [343013, -113695, 135886, 177592, -200194, -95730, 50694, -138375, -247987, 15945, 164667, 44511, 51475, -28598, 188048, 317219, 74033, -76177, 46046, -81359, -298247, -32828, -5704, -7016, -55181, 152625, -132646, -225622, -115732, -153896, 176302, -146313, -80143, -284595, -123582, -364089, -74035, -161334, -52547, -73140, 85093, 122641, -73652, -25023, 263391, -179011, 75722, -92930, 138884, 217025, -283223, 19933, -50813, -27406, 286183, -163181, 16968, 43705, -240983, -27851, -462053, 267213, 103129, -33784, -62883, -11572, -287161, 158478, -455003, -328984, -200990, -53856, -12187, 30300, 232193, 145480, 254748, -175195, -68225, -265949, 369059, -87987, 27995, 19171, -133957, 319199, 136429, -220628, -186310, 207993]
18445a06036A87316b77435H5457B8530h9652B66837b56734F194a54565B09935
18434G9452a76492B8403a73029o5075H8086a98332i3986F6428a48486p25404a80246
18422c07143B975a2627H050a2086C45913a07694r1577d5260B75785a21642B5685
18410A7222A676a73072B41620a11395H2322N07963A80183c3425B7070J71034R1781
18399B89885j41896R7796c4540a3826k48940A11053i2045l0971j27607m1508F294
18387c01219a06224A02894m6464d23666a46246H7280c67513A05631J9269a54706
18376a66350A8852a03436F8502a66104b2724l437k84985J39576B2507j412a42466
18364b93471h5931B96408f521k82428J07581b4245B64517b15183d464j73352f8525
$$ y = [-106036, 187316, -277435, 85457, 28530, -89652, 266837, -256734, 6194, -154565, 209935, 79452, -176492, 28403, -173029, -238104, 88086, -198332, -93986, 66428, -148486, -873890, -180246, -307143, 2975, -12627, 8050, -12086, 345913, -107694, -199271, -45260, 275785, -121642, 25685, 17222, 1676, -173072, 241620, -111395, 82322, 590285, 180183, -33425, 27070, 198104, 289885, 147989, 245785, -34540, -13826, -262766, 111053, -92045, -123016, -250623, -292131, 6294, -301219, -106224, 102894, 56430, -423666, -146246, 87280, -367513, 105631, 124900, -154706, -166350, 18852, -103436, 68502, -166104, -22724, -26161, -311146, -171570, 22507, 21095, -142466, -293471, -85931, 296408, -6521, -288949, -181368, -24245, 264517, -215183, -4464, -177816, -68525]
18352a31746N9387j92541A87493L7023q6389J50944I2192a41012G9226e4473F3247
18340c48877g8756b9824J0828B1268b49229b8651j20144K0294j33359C91193A56664
18328A9829N5757f9953A4513J07366a37807G6719h7529j22300k74305I012J24580
18317A33592G484d3341H9341e02632A41110R1856b5717p2966b7901k3174B73976
18305b15206l4366B01012a1771m5628A94297a02761B8169A3611f496k2467m3714
18294g2677j55125l8070J00721A06500P9664f2784K5878k51205D1566h0807j63341
18283b44148g79k19378B7350a0303E001R0314b0970A8600R445a19365K9587j60131
18271b49909q1550a01962c5651E2569P0747f1745A15573g7761A7868a48266B7113
$$ y = [-131746, -72359, -264900, 187493, 224516, 138127, 289071, 92192, -141012, 79226, -54473, 63247, -348877, -78756, -29824, -18996, 21268, -249229, -28651, -148795, -128501, -261860, 391193, 156664, 19829, 75586, -69953, 14513, 121879, -137807, 76719, -87529, -209829, -484134, 9012, 133592, 7484, -43341, 89341, -502632, 141110, 232966, -25717, -98683, -27901, -51075, 273976, -215206, -249572, 201012, -11771, -57399, 194297, -102761, 28169, 13611, -6496, -28963, -72677, -227802, -265872, -165151, 106500, 186164, -62784, -36906, -288111, 41566, -80807, -244148, -779, -220157, 27350, -10303, 5001, 95315, -20970, 18600, 28045, -119365, -89778, -249909, -331459, -101962, -35651, 52569, 123316, -61745, 115573, -77761, 17868, -148266, 27113]
18259B0478f880k9055B21668a65534j57918B50311M218A0771J3021a17231A66587
18247A87919a03266b592r1720E4786B1292e623k27284A34880a33938M8136A3689
18235a01789A27428E4324H279h0276k2007A45703f0617D9031K29828h8694C29592
18223B07022d3885q3440r3753A23097f8510j432J5619o4574a2239o4093J2895
18212f3437A0582f5171C78978A59760b237k05866A98712E0662J26434O4877i4615
18200a42054k1547A26688j5386R1651E1330M8290g7988j17361j99146J65886K6973
18189b01636I131J23370a01691j538E1168A7932a11125j87159D9389Q6009a08590
18177B61810j9988q3217a975A24233D6227c1014j42708E8733c38392p7921B35376
$$ y = [20478, -6880, -35935, 221668, -165534, -323452, 250311, 254529, 10771, 23792, -117231, 166587, 187919, -103266, -2592, -94312, 54786, 21292, -5623, -232907, 134880, -133938, -85802, 13689, -101789, 127428, 54324, 8279, -80276, -102283, 145703, -60617, 49031, 278859, -88694, 329592, 207022, -43885, -127325, -221078, 123097, -68510, -69942, -54323, -118897, -12239, -76332, -63437, 10582, -65171, 378978, 159760, -2237, -208103, 198712, 50662, 177096, 241973, -94615, -142054, -163601, 126688, 111302, 202953, 51330, 99620, -77988, -195349, -394495, -228609, -201636, 9131, 132501, -101691, -103229, 51168, 17932, -111125, -298284, 49389, 135398, -108590, 261810, 241822, 158605, -1975, 124233, 46227, -31014, -173722, 58733, -338392, -416313, 235376]
18165c12951B83777b5335o5808B63599D5975P6145a69018A74700a76640A08027
18154I6519a90732H323a39477A6627b534n1697m2044A81067R6428G8887j822b73397
18141A21960a24824E6150a13040j14629J05645k7865b9721E0654O0367h0693A71274
18129f0278r0141J7090o1495K7917j5506A80740i3852o5743a8335F0648P176J31240
18117A99064b31537A79167a98202Q0241l87833a80979R0400B07818a75931n9444
18107b35375k6767C2148O6211K25892G8758b42437d4407m9236k71925F0970i2608
18095D11676a17182K611j71142b259A56244M332J54892A47805o9822Q2422c3025
18083F0813c66372B91943b0348B52105H9586A2055a78125F7b15077k6457B927
$$ y = [-312951, 283777, -25335, -91143, 263599, 45975, 122120, -169018, 174700, -176640, 108027, 96519, -190732, 8323, -139477, 16627, -2534, -54231, -96275, 181067, 277495, 78887, 77065, -273397, 121960, -124824, 56150, -113040, -227669, -122024, -149889, -29721, 50654, 111021, -80693, 171274, -60278, -150419, -133329, -194824, -166907, -182413, 180740, -93852, -159595, -18335, 60648, 67824, 199064, -231537, 179167, -198202, -117961, -505794, -180979, -90579, 207818, -175931, -235375, -262142, 32148, 98359, 324251, 78758, -242437, -44407, -93643, -365568, 60970, -92608, 411676, -117182, -114571, -285713, -2259, 156244, 160576, 315468, 147805, 77983, 160405, -33025, 60813, -366372, 291943, -20348, 252105, 89586, 12055, -178125, 67, -215077, -241534, 2927]
18071a92949N9494M6821G2731r008R8621f5104j3713k12331J10008P1342j96635
18060c06433B06822b7548A04634k2483J19525h1248J5505K5153J8563D03897D8929
18048A39293A9722R2169M1560a44573B07836r5503e9506D0244c6224B04290F8448
18036C37211G8598N1270K3674b56659N1968A4180N2014b53215a11468B53310A15776
18024A15744h1865H7639M6336J29096f9619K6248q7813c8753q474A81530O1015
18013B42545a21819d5580C57232C5863b958I5772b00420A03223d3338k53534d4024
18001A7473e1428k16140I2089a11562G1500N4796b28490a7205k7230j34041B94460
17989B45960C3200d48075C8563R0567d16933H9003a82844P0194E70722A14642
$$ y = [-192949, -133455, -86634, 72731, 63723, 162344, -65104, -78817, -291148, -181140, -109798, -306433, 206822, -27548, 104634, 82151, 201676, -81248, -65743, -40590, -22027, 403897, 48929, 139293, 19722, 111891, 153451, -144573, 207836, 112333, -59506, 40244, -36224, 204290, 68448, 337211, 78598, 129868, 153542, -256659, -204691, 14180, 66194, -253215, -111468, 253310, 115776, 115744, -81865, 87639, 133975, 263071, -69619, -43371, -131184, -38753, -47227, 181530, 242545, -121819, -45580, 357232, 35863, -2958, 95772, -200420, 103223, -43338, -296872, -44024, 17473, -51428, -267568, 92089, -111562, 71500, 126296, -228490, -17205, -44435, -178476, 294460, 245960, 33200, -448075, 38563, 129130, -416933, 89003, -182844, -112650, 570722, 114642]
17978a62221n9051A82922c08133A95656c1927K1o759B38442G0266J40482c2756
17966B14543b74709J09112e941q9560A18367b03481g8426j62990b6257A17444
17955I2021J0764i0128E2803d8617j90415E189a29093A94106b89297O8221A78742
17943C6865a27889e954j30545A726L68399j16510n9046b19571r0873E6174b34940
17931A21972K043b88459J05014d5871R950m1869A2017J6955J19025c17409H5669
17919b16244A32222c25417A59230g6418K3413B75382H9899K1210m6482N850b86906
17907C28075A00521k9338J70516a8134j2765j74275A59033K0598F4135J15883
17897A80018a19510A17451a0895B69874b02560B18243a49198C14176e9757k00498
$$ y = [-162221, -221272, 182922, -308133, 195656, -31927, -31906, -38665, 238442, 70266, 210748, -32756, 214543, -274709, -165597, -5941, -95501, 118367, -203481, -78426, -241416, -26257, 117444, 92021, 102785, -90128, 52803, -48617, -239032, 5189, -129093, 194106, -289297, -221076, 178742, 36865, -127889, -5954, -136499, 1726, 370125, 253615, 194569, -219571, -310444, 56174, -234940, 121972, 124015, -288459, -183445, -45871, -35921, -77790, 12017, 28972, 147997, -317409, 85669, -216244, 132222, -325417, 159230, -76418, -53005, 275382, 89899, 111109, 64627, 70477, -286906, 328075, 100521, 71183, 241699, -18134, -30899, -205174, 159033, 179631, 64135, 180018, -119510, 117451, -10895, 269874, -202560, 218243, -149198, 314176, -59757, -260255]
17887b60255B48292a02272n1792b2138o4011M0121D5057r394A6574d1895E15804
17875A00684G189g0872C32671d9963a9362A70488A40c7972m84660A22714J6365
17864A39079c51512A08205c1791l25326A78882b4941C1584K04612c43278B88662
17853a95279A09204Q537b80079f2209n0763P570j3619B26548A7735L71382a90494
17841B15689F8902f1515A66374a15847j48927i9595J4111I3034J54530h4028D2498
17829B0675M3406a0236B49534a66403A81943a15378g470k55313m3851F4912b8200
17817g8924b9823A66610c14755J48994B28981j6345A05997Q797K02490E4181a02999
17805D22436e3280D0449K12260n2451l1243G5360a32884O2019k00881B17362c46998
$$ y = [-260255, 248292, -102272, -154064, -22138, -86149, -46028, 45057, 35663, 16574, -41895, 515804, 100684, 7189, -70872, 332671, -49963, -19362, 170488, 140, -37972, -522632, 122714, 139079, -351512, 108205, -31791, -357117, 178882, -24941, 31584, 236196, -343278, 288662, -195279, 109204, 117741, -280079, -62209, -112972, -105402, -119021, 226548, 17735, 389117, -190494, 215689, 68902, -61515, 166374, -115847, -264774, -99595, -85484, 93034, 247564, -84028, 42498, 20675, 64081, -10236, 249534, -166403, 181943, -115378, -7470, -262783, -306634, 64912, -28200, -78924, -29823, 166610, -314755, -165761, 228981, 212636, 105997, 114794, 317284, 54181, -102999, 422436, -53280, 40449, 252709, 200258, 169015, 75360, -132884, -70865, -271746, 217362, -346998]
17793g7707n2436E2513a53747A18742a22579c104B60558a55406d4681A15822E3120
17781b78501A81541B6226a27103p3036I4518J28766I2802c32895A83022o8240
17771A14782j4894J43913K47535A48464N1193c8254k06209Q766A27519f662B26732
17759C1190h503k1770d81p4504F2281i0248H4134J57819H5446l7396J28264D8869
17746i8492G0845c26269L9054r3643i0249L126A25881K12057b80634A94619q7936
17735A06683R702J46821a5063k32108f8455D51517B23126i4688E94442B46654
17724b38956A6349c3940G3011P5096a06128L7886C56314j49536b46795C8985L7377
17713G6362b12500i9880A28774j9079k3673L1107N8120J4950J14563A11674b39961
$$ y = [-77707, -130143, 52513, -153747, 118742, -122579, -3104, 260558, -155406, -44681, 115822, 53120, -278501, 181541, 26226, -127103, -200139, 94518, 223284, 92802, -332895, 183022, 114782, 99888, 243801, 491336, 148464, 199657, -38254, -244463, -235697, 127519, -6662, 226732, 31190, -8503, -30273, -481, -74985, 62281, -90248, 84134, 241953, 85446, 48050, 176314, 48869, -98492, 70845, -326269, -287215, -380858, -90249, -87123, 125881, 337938, -280634, 194619, 106683, 116385, 263206, -15063, -247171, -68455, 451517, 223126, -94688, 594442, 246654, -238956, 16349, -33940, 73011, 148107, -106128, -68242, 356314, 206778, -246795, 38985, 76362, -212500, -99880, 128774, 109695, 86022, 117129, 175249, 190199, 304762, 111674, -239961]
17701a56929C81743d9532J583j65649g3140D8817O5932a54207A70513c3734C8927
17689d494j83725g4788H7359a91489A53920K4651D9800J63275g353l2464R40I7556
17676A15991R0777a02424B14166J39358h3144B39421n7621O9685a68871b3278
17665a78412f262A08692k9451b16669e4239m7590B54962b7378k6534A91696J8645
17654B10341H2380a59891D37355a0140A51482m9344l4359a49230C8470K58472
17644B96942a82520a9485A76940c2986a5264A59605a01070p205A87153B8441a05105
17632A101J39574J89998i9058q899A60231K47293M2958E9770A9569K00275a45265
17620B23252J55940A31623L829D8750a27349G4975O1230C274a41579G5619b00496
$$ y = [-156929, 381743, -49532, -47949, -213598, -73140, 48817, 114749, -154207, 170513, -33734, 38927, -4494, -188219, -74788, 87359, -191489, 153920, 178571, 49800, 213075, -7353, -39817, -38877, 97556, 115991, 206768, -102424, 214166, 353524, -83144, 239421, 181800, 251485, -168871, -23278, -178412, -6262, 108692, 79241, -216669, -54239, -101829, 254962, -27378, -53912, 191696, 210341, 82380, -159891, 437355, -10140, 151482, 102138, 67779, -149230, 38470, 296942, -182520, -19485, 176940, -32986, -15264, 159605, -101070, -108275, 187153, 28441, -105105, 1101, 140675, 330673, -99058, -107957, 160231, 407524, 450482, 59770, 19569, 219844, -145265, 223252, 379192, 131623, 135452, 48750, -127349, 74975, 136205, 3274, -141579, 75619, -200496]
17608A37297c01504e0965m8485A30538l8574K0369L3982K78089e3946F7054J7362
17597H4416a29731k10152i0682p3662l61977b2872A48513O6448J68933a79900
17586E39844b45944E0475K93484A44948a05390A04754a95223Q1947C36745C9419
17575G2392k0684e4545F4936K10937a54006c3271F1592a55157B44268B3875b72245
17563A69256a47619K2896I0101e9443E22995F9707L21287a36118E5881b71066
17552a41858l3880A54220C267J12936a19532I7307J56690b1095l33668B17650
17541a63061A60317h525j36390B05342m2815J37332A4726L68369b36722A3469
17530a37297B09655i628A97335l0030A1372M03402c8642j11400C37619b16351
$$ y = [137297, -301504, -50965, -99450, 130538, 91964, 112333, 146315, 424404, -53946, 67054, 84416, -129731, -339883, -90682, -164344, -526321, -22872, 148513, 214961, 383894, -179900, 539844, -245944, 50475, 343959, 144948, -105390, 104754, -195223, -113276, 336745, 39419, 72392, 51708, -54545, 64936, 275873, -154006, -33271, 61592, -155157, 244268, 23875, -272245, 169256, -147619, -124723, 90101, -59443, 522995, 69707, 390994, -136118, 55881, -271066, -141858, -175738, 154220, 3267, 116203, -119532, 97307, 253997, -21095, -354763, 217650, -163061, 160317, -8525, -144915, 205342, 162527, 299859, 14726, 383095, -236722, 13469, -137297, 209655, -9628, 197335, 167305, 11372, 414774, -38642, -150042, 337619, -216351]
17519A41411o9465g1711A37141o4801e2878B89167j37077e2111q8698k7974A11075
17507B31206a97933H2045h7518A16483K06359H4646a24921m1204A88860a17359
17496F7119L8652B1704H119K55668a46753B49181b01414B79893j21106J73615
17486C32402R3218B1333K03554j2659J45088l1221a49419A94752G480L10576j52906
17475A65150G2031L67136j62867N4336H1769J93607K5135j48797M2782G5022J74437
17464B49459d03371B64941I3690P9931q0016J19029O8421D3957b25390B56879
17453B97332L25256k13986i0648A44610b56028B1639M72062j78339L4994k9403
17443C20953j28205J9126L62750B03777K11907p9521m439A5185K47665h4955C21787
$$ y = [141411, 71946, -71711, 137141, 72340, -52878, 289167, 152090, -52111, -140809, -168783, 111075, 231206, -197933, 82045, -87518, 116483, 322842, 84646, -124921, -166125, 188860, -117359, 67119, 105771, 21704, 8119, 263787, -146753, 249181, -201414, 279893, 158787, 332402, 425620, 21333, 224887, 212228, 357316, 326095, -149419, 194752, 7480, 318056, 165150, 72031, 439167, 276300, 330636, 81769, 275376, 300511, 151714, 194496, 75022, 249459, -403371, 264941, 93690, 173621, 93605, 212634, 281055, 43957, -225390, 256879, 297332, 622588, 408602, -90648, 144610, -256028, 21639, 493701, 315362, 350356, 320953, 192748, 211874, 574624, 203777, 415684, 336163, 331724, 15185, 262850, -84955, 321787]
17431E76863j95239A6412Q3157L25954B7514N32174B77625a41465A24383K35455
17421C59838A53022J36324P0924A33272n0419K78631n7146r8819E5569O99868
17411G55437C54625j02553j05695a81135F5644J81888c02230B01698L9335j15471
17401A25562J02817J99121r6320c7368B55342J4111K7445B4514M2348g8060C05842
17389A31807o0582L57497A44263K0243n5253E4204c4000C38612J53342j76910
17379C15044d6730A00331L00973F5770a73407c4480F1243c4447C12511k015Q8035
17368C98531A26086a24696C10001I8167a39913C90355N3953b69179A37637F0426
17357B845A237J26549J31748K2546A03249J70712k3177B5848J10688J85355n9156
$$ y = [576863, 381624, 16412, 99569, 425523, 27514, 559688, 277625, -141465, 124383, 359838, 153022, 289346, 360270, 133272, 82853, 361484, 304338, 205519, 55569, 755437, 354625, 252072, 146377, -181135, 65644, 247532, -302230, 201698, 241033, 125562, 228379, 427500, 331180, -37368, 255342, 269453, 296898, 24514, 66862, -78060, 305842, 131807, 71225, 428722, 144263, 164506, 109253, 54204, -34000, 338612, 491954, 315044, -46730, 100331, 401304, 65770, -173407, -34480, 61243, -34447, 312511, 310496, 398531, 126086, -124696, 310001, 98167, -139913, 390355, 444308, -269179, 137637, 60426, 2845, 1237, 127786, 259534, 282080, 103249, 273961, 250784, 25848, 136536, 321891, 262735]
17346B62735J8331Q1l1351J33544a30996A33609A0544J23441J76408i2890D6781
17334D6873L89570g9729A31446j2741a6488B43490H2447J76134R9295J14089k10566
17323B61399E3094J60893N0246m6625P98C877b3163B54183B5007P1169d0108A50737
17310A38929K11500D9315J33098p6606J61378J03717a35416C76217j68485K23990
17300D31722q1900n2805J45140B00617R428L9221b1368B83842K6106A29719K33720
17289C63439m627j61193g2738b9056H0730B4807Q5777d0706C31752a54526B80476
17277C16733k2912n5952b31858B06928J97856j24178a83325B96664J277N7139
17267C55080O877F5229f2521B73659G9877h2992A65598a23679C69771J4226A03744
$$ y = [262735, 281066, 281147, 249796, 383340, -130996, 133609, 10544, 133985, 310393, -92890, 46781, 46873, 436443, -79729, 131446, 118705, -16488, 243490, 82447, 258581, 357876, 471965, 261399, 53094, 213987, 264233, 217608, 218406, 3877, -23163, 254183, 25007, 96176, -40108, 150737, 138929, 350429, 49315, 182413, 105807, 267185, 370902, -135416, 376217, 207732, 431722, 349822, 297017, 442157, 200617, 210045, 249266, -21368, 283842, 309948, 129719, 363439, 358812, 197619, -72738, -29056, 80730, 24807, 110584, -40706, 331752, -154526, 280476, 316733, 293821, 237869, -231858, 206928, 404784, 280606, -183325, 296664, 297941, 355080, 361957, 65229, -62521, 273659, 79877, -82992, 165598, -123679, 369771, 383997, 103744]
17255A95045D2596I77L62296A75957a54609j565D87891I0638J42965C1283K40157
17244B71440E6089j8978K99973R066K4470l3282j61926l295n390p5415K66530
17233C57842m5771j12874m9733J53076J50613k26252b1561B12510J08886j06692
17223B14704f180A95456l6350J76993A62562K68764J29299B75688a19649C03466
17212D66527A52856K55897A69560k467q1261K38442J58799j79019K57615A25917
17201F4216M8248J93535O8596A60194L5214M677n0687j6451l4642L15339D5088
17189E48611E1803M71661C0445L38876H6182Q3365J41891K1439b8769D12698R7321
17178E10019A93432P406K31535p1021r6855J82000l1732j68538J27084J00798
$$ y = [195045, 42596, 977, 363273, 175957, -154609, -156174, 487891, 90638, 233603, 31283, 271440, 56089, 37111, 337084, 346150, 370620, 337338, 175412, 172117, 166727, 91312, 357842, 312071, 199197, 149464, 302540, 453153, 226901, -21561, 212510, 321396, 214704, -6180, 195456, 159106, 336099, 162562, 431326, 560625, 275688, -119649, 303466, 466527, 152856, 408753, 169560, 167093, 85832, 324274, 483073, 304054, 561669, 125917, 64216, 112464, 305999, 374595, 160194, 195408, 200085, 149398, 132947, 98305, 413644, 45088, 548611, 51803, 523464, 30445, 369321, 86182, 169547, 311438, 332877, -28769, 412698, 510019, 193432, 200838, 432373, 361352, 264497, 446497, 414765, 246227, 373311, 474109]
17168D74109k36469M21006A73638k4332J71326M18072k23611j30975J88646j29310
17158D43454K2211l9308j6898A73662Q8805J9960J6301N9770O3793H2587K15730
17147B98317M8851n5382j7497R3786Q9889l7607j93673K46902K3987q7643j29449
17136B80481L4805A05242N74593l30831K10783j08467J34529o6077K81175B53958
17125D68045n0515r1206K89834j71327K04322k68720r1567J13971J33202B46313
17114E97804Q6755A84753N0257L75799k80690K36756j80299P5548R7762K4922
17104E84808J56166k73897n0985K20860k64686L00227k55952j2687j22812L70732
17094F51774j21758p9131J216P2436j37936H554J51911M55820k02002J42006l4516
$$ y = [474109, 237640, 658646, 173638, 149306, 320632, 738704, 515093, 384118, 572764, 443454, 465665, 426357, 409459, 173662, 262467, 282427, 298728, 358498, 422291, 82587, 298317, 347168, 291786, 274289, 368075, 457964, 420357, 226684, 473586, 497573, 409930, 280481, 315286, 105242, 679835, 349004, 559787, 451320, 585849, 519772, 800947, 253958, 468045, 417530, 326324, 616158, 444831, 649153, 380433, 288866, 402837, 536039, 246313, 597804, 684559, 184753, 235010, 610809, 330119, 566875, 386576, 462124, 559886, 584808, 740974, 467077, 416092, 636952, 372266, 672493, 416541, 403854, 281042, 651774, 530016, 450885, 452101, 524537, 386601, 8554, 160465, 616285, 414283, 556289, 521773]
17083E21773J74972L5267l34290j17107N68838B18938Q3883Q9718J3493j51234
17073B54798L25996q615B68424L17819q0202j2919j0794J82156l1005j6837K51445
17062H68087l61547J2483J68397B67711M84030k73161B15928M78172J05065A94084
17051D55551n3995N00599l04124q871j49766L00625k89514o433R5067L03336k14365
17040F28110n2944J35034k8379j30971J16664n6001k3330M98373j75353k37635
17030F73568Q0499k00196K31428J6479J92389k96750l368J80352j50317J84601
17020I08685j79277l750J52264k7171j54155j84018K51069Q2880K1164m04829
17010D62862K26088j56440L86988p2054J8473k86100K39901k02658n2780K03653
$$ y = [521773, 696745, 732012, 397722, 280615, 849453, 218938, 302821, 392539, 406032, 254798, 580794, 572179, 268424, 586243, 506041, 493122, 482328, 664484, 633479, 616642, 868087, 506540, 519023, 687420, 267711, 751741, 478580, 215928, 694100, 799165, 194084, 455551, 401556, 902155, 598031, 589160, 439394, 740019, 450505, 444072, 539139, 842475, 628110, 575166, 710200, 681821, 550850, 667514, 611513, 588183, 1086556, 911203, 673568, 754067, 553871, 785299, 801778, 994167, 697417, 694049, 874401, 724084, 908685, 729408, 725658, 877922, 850751, 696596, 512578, 763647, 846527, 867691, 462862, 688950, 532510, 919498, 847444, 865917, 579817, 819718, 617060, 564280, 767933]
17000G67933L87289n20286L19441K1667j96509O3704L02809k44479k28698M70939
16990A143810q4356k7691O0534m34897L05198J71793l30624r6540J45078j86594
16980F65711M12677o9347K56633m55285J55669L65150r4625l6893P6551k80722
16970I95519P7371J22220k22895J74362R8074l21028K32946r4216J92843n6958
16960A198238J93203k69679K2616J65782j80497N7133L1503n3860J98018j75582
16950A186875P3880J91483m02551K96802n2875o0479J08977L00430j28232j40113
16940A374197J41283q0279l49617L62920m6046L34447O0104m64205O948L51852
16930A691604m97301L90299j2154R4430k54495K59853m6515k63694L17893m1929
$$ y = [767933, 1155222, 634936, 954377, 976044, 779535, 843239, 1146048, 901569, 672871, 1143810, 1059454, 1031763, 1092297, 657400, 962598, 1134391, 803767, 707227, 852305, 665711, 1078388, 1009041, 1265674, 810389, 966058, 1331208, 1236583, 1199690, 1276241, 995519, 1072890, 1195110, 972215, 1146577, 1244651, 923623, 1156569, 1062353, 1255196, 1198238, 1391441, 1121762, 1144378, 1310160, 1129663, 1186796, 1218299, 1164439, 1362457, 1186875, 1260755, 1452238, 1049687, 1346489, 1293614, 1233135, 1342112, 1642542, 1514310, 1374197, 1515480, 1435201, 1085584, 1448504, 1402458, 1736905, 1797009, 1332804, 1339752, 1691604, 1194303, 1584602, 1572448, 1666878, 1412383, 1672236, 1625721, 1362027, 1679920, 1637991]
16920A637991M4896j35130J85336j4368Q8230j13878J75819J79166j31593j0364
16910A906105K0956l08132K37886N7002j42965L79798j03778j8234j48873j51096
16900A728669M02807j18814o118M4146M42436l55828M1095j69925r751N73105
16890B571822k95291j5858m3215J15987n9702M60537k60667L28549l68823L1505
16880B464844J17852k3574N9962L32218l81267L61581q2026j39324K52792j14597
16870B848461J34013j49967K87985l41534L36648J35868l4342N6511J75841j00611
16860C348873K9868k3861J46764j29059M55804j40849J22468k07665j18065M87220
16850C971498N5545j24090J22980J17224j29337K90934N9065Q1480Q5182J74561
$$ y = [1637991, 1682887, 1547757, 1733093, 1718725, 1806955, 1693077, 1868896, 2048062, 1916469, 1906105, 1927061, 1618929, 1856815, 1913817, 1770852, 2150650, 2046872, 2028638, 1879765, 1728669, 2131476, 2012662, 2006544, 2050690, 2493126, 2137298, 2178393, 2008468, 1998717, 2571822, 2276531, 2260673, 2217458, 2333445, 2273743, 2734280, 2473613, 2802162, 2433339, 2464844, 2582696, 2559122, 2619084, 2951302, 2570035, 2931616, 2849590, 2710266, 2963058, 2848461, 2982474, 2832507, 3120492, 2778958, 3115606, 3251474, 3217132, 3273643, 3449484, 3348873, 3378741, 3354880, 3501644, 3372585, 3828389, 3687540, 3810008, 3602343, 3484278, 3971498, 4027043, 3902953, 4025933, 4143157, 4013820, 4304754, 4363819, 4445299, 4530481, 4705042]
16840D705042n993m0078m276L42918k13037k22853P1759O62555m6690J35459Q574
16829E393380k71166K61064M07507K29304l4043k21065K19174M45277j91412N61381
16819F799401j67675j645L97372J68151k47522J21289Q78256j68016J59565K70866
16809H210042L1763J64477J48951L36076J08697K32275O8978J92422L03470L18642
16799A0115793L13536J12752L28731P58169j60813L70350L35964P9873O53295
16790A2907650L06147L51950Q8093P54964L15705N61012K48708L88392P94021
16781A6716642L44175N06937N24662N86218O60565Q56665O09341O54339P19401
16772B2178945J187328M12188R44457Q54470J156187P67416J225793J270918J011234
$$ y = [4705042, 4699049, 4658971, 4654695, 4997613, 4784576, 4561723, 4633482, 5296037, 5249347, 5384806, 5393380, 5122214, 5383278, 5790785, 6020089, 5986046, 5764981, 5984155, 6429432, 6238020, 6799401, 6631726, 6630081, 7027453, 7195604, 6948082, 7069371, 7947627, 7779611, 7939176, 8210042, 8241805, 8406282, 8555233, 8891309, 9000006, 9232281, 9301259, 9493681, 9797151, 10115793, 10429329, 10542081, 10870812, 11628981, 11468168, 11838518, 12174482, 12254355, 12907650, 13213797, 13565747, 13653840, 14408804, 14724509, 15285521, 15534229, 15922621, 16716642, 17060817, 17567754, 18092416, 18678634, 19339199, 20195864, 20805205, 21459544, 22178945, 23366273, 23778461, 24722918, 25577388, 26733575, 27500991, 28726784, 29997702, 31008936]
16763C1008936J249788J467257J637524J487838J342984J709594K007788J664765
16755D3576474K057021K083600K473329K393713K659903K879054L081048K970996
16747F4175138L853455L325358L868111M278545M620030M675234M861995N263520
16739I8921386N580061O137390N968532O381338O240070O439835O892036O169868
16731A48730516O158987O010457N324465M342191M105715K927201K379267J409897
16723A81388696J074920k29038m12154r42057j225593j838217k531970k964696
16715A72319891l460387l902209m154392m462870m643391n841336n547871n850197
16707A34457238n773787o014786n865645n914452n963719n609487n768097m889001
$$ y = [31008936, 32258724, 33725981, 35363505, 36851343, 38194327, 39903921, 41911709, 43576474, 45633495, 47717095, 50190424, 52584137, 55244040, 58123094, 61204142, 64175138, 68028593, 71353951, 75222062, 79500607, 84120637, 88795871, 93657866, 98921386, 104501447, 110638837, 116607369, 122988707, 129228777, 135668612, 142560648, 148730516, 154889503, 160899960, 166224425, 170566616, 174672331, 177599532, 179978799, 181388696, 182463616, 182234578, 181822424, 180880367, 179654774, 177816557, 175284587, 172319891, 168859504, 164957295, 160802903, 156340033, 151696642, 145855306, 140307435, 134457238, 128683451, 122668665, 116803020, 110888568, 104924849, 99315362, 93547265, 88658264]
16699H8658264m803641m652281m225344m469599l762629l594870l564941k525605
16691E7059354l499922k152481k679975k948913k033960j978739j909911j733539
16683C8121914j932919j202350j617277j696909j555732q92131j306579j165507
16675B6752510j020998j203499q90557n26244j082164j101848n45907o67592o93615
16666A9020086p27522n61237m18170n14760p02537m75199l77557p69779m0740
16657A4432585o70225m04354j20903n68711j63104o45689k62971p0375o01299
16648A0924954k2420n59408k08842l90660q4624l71439o7059k02457p55469q949
16638H253627j97963M6894o7629j54519j30276m75476J68518m76274k90211J80501
$$ y = [88658264, 83854623, 79202342, 74976998, 70507399, 66744770, 63149900, 59584959, 57059354, 53559432, 51406951, 48726976, 45778063, 43744103, 41765364, 39855453, 38121914, 36188995, 34986645, 33369368, 31672459, 30116727, 29224596, 27918017, 26752510, 25731512, 24528013, 23637456, 23111212, 22029048, 20927200, 20381293, 19713701, 19020086, 18292564, 17731327, 17313157, 16798397, 16095860, 15620661, 15243104, 14473325, 14432585, 13762360, 13358006, 13237103, 12668392, 12505288, 11859599, 11596628, 11526253, 10924954, 10902534, 10343126, 10134284, 9743624, 9659000, 9287561, 9220502, 9018045, 8262576, 8253627, 8055664, 8102558, 8034929, 7880410, 7750134, 7274658, 7443176, 6966902, 6676691, 6857192]
16628F857192j64211o069k60438k892l87463j35995j07192k95016q5470M33452
16618E845898o46617K41442j56694J06984n99898M7819k16877R8170j6347M0170
16608D744050k57326j49246m98141M09662k01166J29980o95624L18497j47134
16599C653552J23923q6838P2006l04275k759o3210K61345l38550J06842k62655
16589C159381q4019K17317k97348K11202k62111L45884l96845L40343m55215O2953
16579B841542l46879K15853n420R3778N7377j65969j13822l09266K24818k78121
16569B213891k21615K21789M74532l87913J32322m42921K22754n8671k16550j20175
16559A817443K42367k6281J16767L8425m34709J81373J05424P569K5204q7977
$$ y = [6857192, 6692981, 6686912, 6426474, 6423582, 6036119, 5900124, 5792932, 5497916, 5412446, 5845898, 5199281, 5440723, 5284029, 5391013, 4791115, 4838934, 4622057, 4720227, 4703880, 4744050, 4486724, 4337478, 3839337, 4248999, 4047833, 4177813, 3482189, 3800686, 3653552, 3777475, 3690637, 3762643, 3458368, 3455609, 3392399, 3653744, 3315194, 3422036, 3159381, 3075362, 3292679, 2995331, 3206533, 2944422, 3290306, 2893461, 3233804, 2778589, 2841542, 2494663, 2710516, 2705096, 2798874, 2856251, 2690282, 2576460, 2267194, 2492012, 2213891, 1992276, 2214065, 2688597, 2300684, 2433006, 1990085, 2212839, 2154168, 1937618, 1817443, 2059810, 2033529, 2150296, 2188721, 1754012, 1935385, 2040809, 2048378, 2073582, 1985605]
16549A985605j79698j19132K25377m18196m571K37789K18614l36655L70332j50500
16539A828965R7611k58176j79926L29866j01110k2225m74276R3418l7777J49651
16529A426021j89266K07286J8473Q631j34374N6577r8149l08515L10937J30216
16519A427837L836k67645O7821l42J99221j22334k93373K37423j61008K73733
16509A365169k54174m2386N70532l82355k82735K15676M9238k19454J995N5840
16499A077346m7844K65715l8461k24457Q5777o7910l02532K7790K69161N881l78254
16488F72212L01629r4543P5074R9106j21222j74386P5141M7258M2880k09885K52467
16477I65731J31088l08672R7583J73006k49944j00424Q3551M3897J51366q1971
$$ y = [1985605, 1805907, 1686775, 1912152, 1493956, 1489385, 1727174, 1945788, 1609133, 1979465, 1828965, 1926576, 1668400, 1488474, 1818340, 1717230, 1695005, 1220729, 1314147, 1276370, 1426021, 1236755, 1444041, 1462514, 1471145, 1336771, 1393348, 1295199, 986684, 1297621, 1427837, 1431673, 1164028, 1231849, 1231507, 1430728, 1308394, 1015021, 1252444, 1091436, 1365169, 1110995, 1068609, 1639141, 1256786, 974051, 1189727, 1238965, 1019511, 1021506, 1077346, 1029502, 1295217, 1256756, 1032299, 1118076, 1050166, 747634, 775424, 1044585, 1050466, 672212, 973841, 879298, 954372, 1053478, 932256, 757870, 833011, 880269, 923149, 713264, 965731, 1096819, 788147, 885730, 1058736, 808792, 708368, 791919, 835816, 987182, 905211]
16467I05211j77200j56395N31545m47769p2081P5394j11337J0340j27911M95616
16457I25413k59295J79857C77722N70475j87143K83195m01293k78680M75512j02708
16447G37080J88330l59803Q526K57622B30457N39701B79237L956K77089L7111
16437E97393K248O2986J41732j20714K4211j55220M45410D22213J26697o0056
16427D88854J81922J77676k069D17698Q1382J81901J05465j28536B18340M73537
16417F91877k54149J53836k48118K42624B02465K45525J54678L6421Q969k12675
16407D35383K13253F82P15049l06888k2391o7039r6399K06017J22078n8325j0019
16396D82765L12815l11788A26244P59180A40709L18332B20950J07424K70877k91127
$$ y = [905211, 728011, 571616, 1103161, 655392, 583311, 658705, 547368, 557708, 429797, 925413, 666118, 845975, 377722, 948197, 761054, 1044249, 642956, 364276, 839788, 737080, 925410, 565607, 574133, 831755, 230457, 770158, 279237, 283193, 560282, 597393, 599641, 662627, 804359, 683645, 707856, 552636, 998046, 422213, 548910, 488854, 670776, 848452, 846383, 417698, 499080, 680981, 786446, 657910, 218340, 691877, 437728, 591564, 343446, 586070, 202465, 447990, 602668, 639089, 648058, 435383, 648636, 682, 715731, 408843, 386452, 319413, 223014, 429031, 551109, 492784, 482765, 795580, 483792, 126244, 885424, 140709, 459041, 220950, 328374, 599251, 308124]
16386C08124J79727m5356A52516K01427l7307A35960J27554j26221J63283q4411
16376B16165K35093o7352r7905N2798l9346M48376B39086L47921B60411K71868
16366E32279O9237B92451j20708K16123n6442A63985K20662j3953K35580B54405
16355E37948P486k67897D0849L46732j74114Q1752j16270J3089M08983C8154K62672
16344C00826j04748K53295q1805A63047O01852C44048l8025i4608D51294j10398
16334C40896P6692A17223d367D12254A98256N9601A17911M0262L02767e7311D35486
16322C49725j42212J11792J42695A3449M54824o2754e6995B54535O7294e5988
16311b48842D6864K17942N1581i7800A61989l6619M22117A06730M70224B47328
$$ y = [308124, 487851, 442495, 152516, 353943, 316636, 135960, 263514, 137293, 300576, 216165, 451258, 383906, 286001, 338799, 299453, 747829, 239086, 587007, 260411, 532279, 601516, 292451, 171743, 387866, 331424, 163985, 384647, 370694, 606274, 254405, 537948, 545434, 277537, 40849, 387581, 213467, 295219, 178949, 192038, 601021, 38154, 300826, 196078, 449373, 367568, 163047, 764899, 344048, 306023, -94608, 451294, 340896, 417588, 117223, -4367, 412254, 198256, 257857, 117911, 158173, 460940, -57311, 435486, 349725, 207513, 319305, 462000, 13449, 468273, 405519, -56995, 254535, 321829, -55988, -248842, 46864, 264806, 316387, -97800, 161989, 125370, 547487, 106730, 576954, 247328]
16300B3597J21178d1754D6495K76272C5696L79615b1579l380C47855m3099J63183
16289D67939A16060R6160J9402K50698G2795a25034A955J38676K08260j53906
16279A94985K9172M14900G5212J06966e2753D44417G2756k140l458K0465j3237
16268G4386L43196E6265a51697A73970J80163i0q235B51489J55777m9095a29028
16256A69767K38373b82598H3988a61322j07895C71970e2513H8609R9701n3909
16246A34401f383B94680L52904B593N35680B60790A09458J31018k9632q1639R8940
16235B28145D5957K79032M5752m9143a29752b9954A38996J51438G4860Q2232c7756
16223D34953d42984A81296h4806E20220k01739A52801A0037h0146A079J06520
$$ y = [23597, 144775, -41754, 46495, 322767, 35696, 415311, -21579, -24959, 347855, 304756, 467939, 116060, 212220, 231622, 482320, 72795, -125034, 1955, 140631, 348891, 194985, 224157, 639057, 75212, 182178, -52753, 444417, 72756, 70616, 67158, 87623, 74386, 417582, 56265, -151697, 173970, 354133, -90, -8325, 251489, 407266, 358171, -129028, 169767, 408140, -282598, 83988, -161322, -269217, 371970, -52513, 88609, 188310, 134401, -6383, 294680, 647584, 2593, 538273, 260790, 109458, 240476, 210844, 129205, 228145, 45957, 324989, 370741, 321598, -129752, -29954, 138996, 290434, 74860, 157092, -37756, 434953, -442984, 181296, -84806, 520220, 318481, 152801, 10037, -80146, 1079, 107599]
16213A07599O0408a21449B98007A38438K42950A37601J21898A04064K6630E9330
16202B28739R4127b56823B32423q874o3977a31137j94593G9132k3586A8594M294
16191B2888K20252J18241A37066k4461a53798C61791j75023K4054j01983D7012
16180B29678G6009O2206a54890c6188C6693J65971K6226B7641N2622M5635b7855
16168C26785E7738b14447J01576G2051J21603d5342m5786m0818m8995D74836A81084
16156D28983g993B22805k4948k7069e6115r8602n6414g1790B1999J13808n8187
16145G7620j9962K79832e4151B22268E2880O5057B9193L7695L8522L9319b2490
16133C16833j49689i1907q4405C6838f0045A00087a7702j41836g5848E92h270
$$ y = [107599, 168007, -121449, 298007, 138438, 381388, 137601, 259499, 104064, 130694, 59330, 228739, 322866, -256823, 232423, 223549, 159572, -131137, -325730, 79132, 55546, 18594, 22888, 243140, 361381, 137066, 112605, -153798, 361791, 186768, 210822, 108839, 47012, 229678, 76009, 138215, -154890, -36188, 36693, 202664, 228890, 27641, 80263, 125898, -27855, 326785, 57738, -214447, -112871, 72051, 193654, -45342, -91128, -131946, -180941, 474836, 181084, 428983, -7993, 222805, 197857, 170788, -56115, -154717, -211131, -71790, 21999, 135807, 77620, 57658, 337490, -54151, 222268, 52880, 117937, 29193, 66888, 105410, 144729, -22490, 316833, 167144, -91907, -176312, 36838, -60045, 100087, -17702, -159538, -75848, 592, -8270]
16121A40560M5604q5936G279O6930c30540M5430B2044M2720J96309J59128B08112
16109C15871K14765b70980D034R873h9782A55266G3995c13926B38372J4518f877
16097A28172O7539a77393C15947a11331k7773J3366b5985n8383j2032B3090A1312
16085B4560K57175H8073e4838r6418c7013l5259B16984a92644H8824a59605q4369
16074b43974A81808B1551b8174B58985a39129A25926D2514L5479J09813R9427
16064B87233j12073C7763L56987A85535c71p1428B31605r338a67956A05405g6046
16052H0824k6552c9161A54573a96322c2457F9622J57798E0054e5266b3993j69955
16041a93948K3771A08520e8877G5652A6247b01848j07467A39263J38989b35799
$$ y = [140560, 186164, 100228, 7279, 74209, -330540, -285110, 22044, 64764, 261073, 420201, 208112, 315871, 530636, -270980, 4034, 13907, -89782, 155266, 73995, -313926, 238372, 252890, -6877, 128172, 195711, -177393, 315947, -111331, -139104, -125738, -25985, -84368, -96400, 23090, 11312, 24560, 281735, 88073, -54838, -151256, -37013, -72272, 216984, -192644, 88824, -159605, -243974, 181808, 21551, -28174, 258985, -139129, 125926, 42514, 77993, 187806, 287233, 175160, 37763, 394750, 185535, -371, -71799, 231605, 222267, -167956, 105405, -76046, 80824, 54272, -39161, 154573, -196322, -32457, 69622, 227420, 50054, -55266, -23993, -193948, -170177, 108520, -58877, 75652, 16247, -201848, -309315, 139263, 278252, -235799]
16030A35024a46476A86292e3162k19523F92K07791a03573p8050j86021g7615G6719
16018a20210p5737I4235J48148j18453a6709B47970b48161F512J79633a61427
16007b70575b2130H7353a78602k29943I0626a67179I8775J05916e3517A35097
15996A11876i8321k68548i993H0370a1546j84748a171j81683N4739N195B71281
15984A4220R4178K38136a34887M116a2743B42647J59830g3189j49230D93218a61857
15972i3784n8514N4960D724d04407a92243f6240k6965A68843J46034a05275h27
15960E3138J04865a87263A99336q3685a05966A80082e1274C4276a13746n8548
15950a72294C40539d49813b2658j20083B8948a99264M9341j3002D2634a61132
$$ y = [135024, -146476, 186292, -53162, -272685, 692, 208483, -103573, -181623, -367644, -77615, 76719, -120210, -195947, 94235, 242383, 123930, -16709, 247970, -248161, 6512, 186145, -161427, -270575, -22130, 87353, -178602, -408545, 90626, -167179, 98775, 204691, -53517, 135097, 111876, -98321, -366869, -9993, 80370, -11546, -196294, -1171, -182854, -128115, -122920, 271281, 14220, 108398, 346534, -134887, -130771, -12743, 242647, 402477, -73189, -222419, 493218, -161857, -93784, -152298, -97338, 4724, -404407, -192243, -66240, -93205, 168843, 314877, -105275, -827, 53138, 158003, -187263, 199336, 115651, -105966, 180082, -51274, 34276, -113746, -172294, 340539, -449813, -22658, -142741, 28948, -199264, -149923, -162925, 42634, -161132]
15939C0713J39335A185f8217j9124A33692d1479F6577e7663p0715E5941f5039
15927a28915A50477a41376k05580M4356N740B6671a54487e0657m4886j18270A34880
15915c13135b6720A21013a65963N4484j50234J02074E1818b63328a25526A68337
15904B86796j10314c3872j71718O7735N7692n7459A10986l1511p017a59892o9561
15893b29453E5228a11705l46010B50304a06774p2502a4807k10850o8196B29657
15882h0563F7560K06890C3109i7329j33086E1867b49588G9976c23560f5668R103
15871e6565j50445H2822a20882M7651j12780A23750g6932A6451L6365f68C5099
15859a48858K3869G1936e4519p47k23560H320J03820C659L3651j6180f246l11117
$$ y = [30713, 170048, 1185, -68217, -87341, 133692, -41479, 66577, -57663, -128378, 55941, -65039, -128915, 150477, -141376, -346956, -302600, -296860, 26671, -154487, -50657, -95543, -213813, 134880, -313135, -26720, 121013, -165963, -111479, -261713, -159639, 51818, -263328, -125526, 168337, 286796, 176482, -33872, -205590, -137855, -80163, -137622, 110986, 79475, 72458, -159892, -229453, 55228, -111705, -457715, 250304, -106774, -179276, -14807, -225657, -293853, 229657, -80563, 67560, 274450, 33109, -97329, -230415, 51867, -249588, 79976, -323560, -65668, -56565, -207010, 82822, -120882, -73231, -186011, 123750, -76932, 16451, 52816, -668, 35099, -148858, -124989, 71936, -54519, -55266, -278826, 8320, 112140, 3659, 37310, 21130, -6246, -317363]
15847c17363B81250N3868a43976j0369e9423r7601C17903f8094n0180o0750P3058
15836a05966a6312o8882A65313n15J42628C8070b56523i2076k25156j00426A85086
15824a88589a6706j58228c2547l99555C1268Q2346a6151k24366A5650R0432b07315
15812A67519E9797M3461m1764h045B7766b78490e2276k15142B93136i633k91671
15801c01304i0576n9987P0697D6559e885H3593E080c146l97222A1665g4099B60927
15788c20172J32927m4910D4147c78197A70180b02417F8585a42592B54144p4178
15778A79966b44018K7088a4075I3390D6403O3253J26079f9822A07958c07611i3487
15766b15339R2290A3118e4718k24287j4277C84118d1008B1055c04537P2494a01573
$$ y = [-317363, 281250, 335118, -143976, -154345, -59423, -157024, 317903, -68094, -118274, -179024, -105966, -16312, -85194, 165313, 164798, 307426, 38070, -256523, -92076, -317232, -417658, 185086, -188589, -16706, -174934, -32547, -432102, 31268, 113614, -16151, -240517, 15650, 106082, -207315, 167519, 59797, 103258, 61494, -8045, 27766, -278490, -52276, -267418, 293136, -9633, -301304, -90576, -150563, -79866, 46559, -5885, 83593, 5080, -3146, -400368, 11665, -74099, 260927, -320172, -187245, -232155, 44147, -378197, 170180, -202417, 68585, -142592, 254144, 179966, -244018, -216930, -14075, 93390, 46403, 109656, 235735, -69822, 107958, -307611, -93487, -215339, -123049, 13118, -54718, -279005, -293282, 384118, -41008, 21055, -304537, -232043, -101573]
15754F6587J49914f0751p3902d3261k6099A92827g5334r0261k32719AL8884J86744
15742B25629h100c054a326B51294C8017i8373A0844a17860A48096J22641g3821
15730g8391k46228a47929I2428b95367H3918d7274E7350L3979n036m1037N0524
15719I5780l2926D666b0751D9873f0794l3377C0869a86648B19896o7987b36986
15707a00889B61824r0766B280a90833O602C7270a39716M3367j15842D8456a63918
15695f0350E0431c3523I0589a25483d3950A93827C8342d49794D9508N4670a6253
15683c54345H7071R7027E0238K6440c88102j44304e2260G52a70939B9352N2595
15672H1947c9591A41512J11665j1798G5092L0693i8936d2279D5900c0121p9877
$$ y = [66587, 216501, -60751, -134653, -43261, -69360, 192827, -75334, -165595, -398314, 1, 38885, 225629, -8100, -3054, -1326, 251294, 38017, -98373, 10844, -117860, 148096, 270737, -73821, -78391, -324619, -147929, 92428, -295367, 83918, -47274, 57350, 91329, 86293, 45256, 95780, 62854, 4666, -20751, 49873, -60794, -94171, 30869, -186648, 219896, 151909, -236986, -100889, 261824, 171058, 2280, -190833, -184231, 37270, -139716, -96349, -212191, 48456, -163918, -60350, 50431, -33523, 90589, -125483, -43950, 193827, 38342, -449794, 49508, 104178, -16253, -354345, 87071, 184098, 50238, 76678, -388102, -532406, -52260, 752, -170939, 29352, 81947, -39591, 141512, 253177, 241379, 75092, 105785, -98936, -42279, 45900, -30121, -109998]
15661a09998d2180k0927J4543A70726D6695n955P2699a57177A20195F13b03121
15649B61502c9266j70019N1870H843a507p96j6888j66826D1797a95320L4085p1078
15637b32313f7593J5204r4777J4859F210J20861a47035f0307j71762J03949k7179
15626a55299a8445G6910Q7633a1946B64466a67291K2811p4035A56031J51401h6846
15614A83969a55818B18545n6956c48886J3305i0173A04471a00494D31727A25630
15603a26772B86348G5772a00815q1781k43312A48584b74695E2620K29341i9195
15592d2589j57759C0412f7543c0503B56583b26A07210J49716G843J62248j5865
15581A54226k8918K82850b88780B9458b64095C04470d2799J6106A17570c75672
$$ y = [-109998, -42180, -63107, -48564, 170726, 46695, 40740, 113439, -157177, 120195, 613, -203121, 261502, -39266, -209285, -157415, 8843, -1507, -2303, -19191, -186017, 41797, -195320, -161235, -232313, -67593, -52389, -147166, -132307, 6210, 127071, -147035, -60307, -232069, -128120, -155299, -18445, 76910, 164543, -11946, 264466, -167291, -144480, -218515, 156031, 307432, -86846, 183969, -155818, 218545, 161589, -348886, -335581, -90173, 104471, -100494, 431727, 125630, -126772, 286348, 75772, -100815, -182596, -425908, 148584, -274695, 52620, 281961, -99195, -42589, -200348, 30412, -67543, -30503, 256583, -226, 107210, 256926, 7843, 170091, 154226, 125308, 408158, -288780, 29458, -264095, 304470, -42799, -26693, 117570, -375672]
15570b1278E4194J45162i0572I4524a85540C864d13904A09913J6418c5270A75931
15558A28235c1688H8658c6291B31145a01858C8891a02208k60800a30540C6089
15547A75936n4835r636a17518F4332K6807b28517F8564A6561e7852j3817A46051
15535G6919a68756j83907a20499b2331n6534D0226a1397J270k01225B4276d902
15523A70544C7654L20331I8946J00490A151e7080A932Q6890b1009A32304m8907
15512H3397a75196C01051a56150j5834B12284K34694E0804J75104e0229E7678
15501c5071B3972J5014K1104K21959o323F9750i1210A77243R4260d1990k22842
15490b64832D3938K73193a04245N490A43311R016G4126j4577a8147C10962e5802
$$ y = [-21278, 54194, 199356, -90572, 94524, -185540, 3864, -413904, 109913, 126331, -35270, 175931, 128235, -31688, 88658, -36291, 231145, -101858, 38891, -102208, -363008, -130540, 36089, 175936, 121101, 111465, -117518, 64332, 91139, -228517, 68564, 16561, -57852, -71669, 146051, 76919, -168756, -352663, -120499, -22331, -78865, 40226, -11397, -10127, -211352, 24276, -4902, 170544, 37654, 357985, 98946, 199436, 1151, -57080, 1932, 88822, -21009, 132304, 83397, -175196, 301051, -156150, -171984, 212284, 446978, 50804, 225908, -50229, 57678, -35071, 23972, 38986, 60090, 282049, 275726, 69750, -91210, 177243, 271503, -41990, -264832, 43938, 317131, -104245, -98755, 143311, 152327, 74126, 59549, -18147, 310962, -55802]
15478B09329a72728J0540b6220F568K30057A9466b84225A96487a66587q1366Q2046
15467a65907B6370e8229j13771f5139k7965b108r4452B71973b36043J01652b2717
15455c76347g0887A14649i9529B90925E2699L5373a09256C5305i380B00918d64420
15443i0605k41294a12014L7895k38886G1012K07152k7417L5965a09091I326K90347
15432B99673A39205b02477B31475c8846j19221I1168L19417q3645G0474J808I422
15420A47037A9256b5200j8881n1397M0773r6267d2269C17601A27903b24059B81667
15408b29156o2899b0741p1426A9997J02561E730a76604O9716A53893J02886A02261
15396i4996j00189N6306j19454c6578A07308F294N6250c47405C6902O7343m396
$$ y = [209329, -172728, -162188, -26220, 6568, 236625, 19466, -284225, 196487, -166587, -247953, -165907, 26370, -58229, -172000, -65139, -93104, -2108, -96560, 271973, -236043, -134391, -22717, -376347, -70887, 114649, -99529, 290925, 52699, 88072, -109256, 35305, -9380, 200918, -464420, -90605, -331899, -112014, -74119, -313005, 71012, 278164, 250747, 286712, -109091, 9326, 299673, 139205, -202477, 231475, -38846, -158067, 91168, 410585, 326940, 70474, 72282, 9422, 147037, 19256, -25200, -44081, -95478, -54705, -150972, -42269, 317601, 127903, -224059, 281667, -229156, -292055, -20741, -92167, 19997, 122558, 5730, -176604, -106888, 153893, 256779, 102261, -94996, -195185, -138879, -258333, -36578, 107308, 6294, 62544, -347405, 36902, 104245, 99849]
15385I9849c60697D0823N053K927f4604B71421k5126J1379B5837D092K80807a31635
15372A24561a88228p5329A25006j579a59384A84993a61925B42513A00092j6281
15362H3811a69394B26656F3964M5366a76450H6973i4383D4177J77156K16416a22583
15350B74007m9153d9817i21G2551K41973B0906K55897A25760O5483N939a39007
15338H6678D2925M29898j31178a24691A93809C8728f1637k02238B64255n3571
15328B10684C0702N66302C9143c5350C19978b5180D35349j32556b86105a7953
15317a74282C4852K41395b730k45552e3365n5928A42543E7953j9459J23128m7647
15306A13975A3928b07326C7338K44012K44192a03496A3008a42352C4090a57085
$$ y = [99849, -360697, 40823, 45876, 48803, -64604, 271421, 246295, 257674, 25837, 4092, 284899, -131635, 124561, -188228, -263557, 125006, 123427, -159384, 184993, -161925, 242513, 100092, 83811, -169394, 226656, 63964, 109330, -176450, 86973, -94383, 44177, 221333, 437749, -122583, 274007, 224854, -49817, -921, 72551, 314524, 20906, 276803, 125760, 191243, 197182, -139007, 86678, 42925, 472823, 341645, -124691, 193809, 38728, -61637, -263875, 264255, 210684, 30702, 597004, 39143, -35350, 319978, -25180, 435349, 302793, -286105, -17953, -174282, 34852, 276247, -2730, -248282, -53365, -109293, 142543, 57953, 38494, 161622, 113975, 13928, -207326, 37338, 281350, 525542, -103496, 13008, -142352, 34090, -157085]
15295D4476l135J35389h1800j25212i7739B61208c05277G9167A2912P2773a66869
15283a94144d6651A55403b64849a26037C6783b9093A67457F4098J73864F9129
15272B92634m6602k405J40929A71163g9980C06572J6514O6970A04213C3946J29317
15261A63263h3228p8405h456k5181C63384j18325a8424g786A23260i848j74548
15250a84396B03169L48118k68604J03853j8945O50914N45891J52446N62129J2790
15240B291761j83980P5719H02427J5962G8949K19551J5713A21156K72139A23242
15229D73794j90754a6004p6122K3491A37252a46996F2577K63295l7629J70645
15219D58888A17011b06602H8548d9671B67537p3272a93885A68232Q5651N4865
$$ y = [44476, 41341, 176730, -81800, -207012, -97739, 261208, -305277, 79167, 12912, 85685, -166869, -194144, -46651, 155403, -264849, -126037, 36783, -29093, 167457, 64098, 237962, 69129, 292634, 246032, 243627, 384556, 171163, -79980, 306572, 323086, 390056, 104213, 33946, 163263, -83228, -161633, -8456, -33637, 363384, 245059, -18424, -7786, 123260, -9848, -184396, 203169, 551287, 282683, 386536, 367591, 1018505, 1564396, 1716842, 2278971, 2291761, 2107781, 2183500, 802427, 818389, 78949, 298500, 314213, 121156, 393295, 123242, 473794, 283040, -16004, -92126, -68635, 137252, -146996, 62577, 325872, 288243, 458888, 117011, -206602, 88548, -49671, 267537, 194265, -193885, 168232, 253883, 308748]
15209C08748e5038G0175b8204E4559M30937j92247I6726J75834D775a4970B03778
15197A0877d29273f5108I8092P0032a90177B29943f194C0242L05356J5832A01908
15185A10215a55684a8149j8887B32673A06537a05327A95261J06527H2155a834
15174A26565A6371N47491B34134j5780p7682a4479A03241g3676A62244c42476
15163D39930A22053d1218B12845b35474F5601J09167a19139D66596k29928K35878
15153D72546e4433P029A51374K55717j28832o4649l9002H4001J89787a12683M9386
15142f3297A36120a24526E84864j16415A00972l327N18391k31903A4206K09742
15132B23948j11430r996J17966K64342k14451K38250B15650a00556B59880j4369
$$ y = [308748, -55038, 70175, -28204, 54559, 485496, 293249, 96726, 272560, 4775, -14970, 203778, 10877, -429273, -65108, 98092, 168124, -190177, 229943, -6194, 30242, 335598, 351430, 101908, 110215, -155684, -18149, -37036, 232673, 106537, -105327, 195261, 301788, 82155, -1834, 126565, 16371, 563862, 234134, 218354, 140672, -14479, 103241, -73676, 162244, -342476, 439930, 122053, -41218, 212845, -235474, 65601, 174768, -119139, 466596, 236668, 472546, -54433, -47404, 151374, 407091, 278259, 213610, 174608, 84001, 273788, -112683, -63297, 136120, -124526, 584864, 468449, 100972, 97645, 616036, 384133, 14206, 223948, 112518, 102522, 220488, 484830, 270379, 508629, 215650, -100556, 259880, 245511]
15122B45511A02587n0821a8620B68653J9425d3449B61060N338J11451p207j1833
15111C58809j43401n3468r095a47898O2650d0860D70094i4505B68795f1605F4022
15099A63941J88563j19929J33011A14888Q0804j5076J1816J13545j31082K01137
15089C76032q5905e3019A53717l6916e8585A76687J3506R518N1859H6028J90451
15078B76479k6973F2482K08816R146a02219C71585d3814D6296K61416B8312M29426
15067D57738A4899K48006n4567j3545L11102j84516J78530n4255M4507k25986
15057B64175F9128K88922o3661M9619l0619A45093L8959o6533L20070j13202O5014
15046C89401A16952D6172K98408A64799P4062H9806K939J56948i069B54591E0906
$$ y = [245511, 102587, 51766, -18620, 268653, 288078, -43449, 261060, 266398, 377849, 370642, 358809, 215408, 161940, 152845, -147898, -85248, -40860, 470094, -94505, 268795, -61605, 64022, 163941, 352504, 232575, 365586, 114888, 195692, 180616, 192432, 305977, 174895, 376032, 290127, -53019, 153717, 116801, -58585, 176687, 190193, 199711, 251570, 86028, 276479, 249506, 62482, 271298, 280444, -102219, 371585, -43814, 46296, 307712, 28312, 457738, 14899, 262905, 208338, 194793, 505895, 321379, 499909, 445654, 490161, 264175, 69128, 358050, 294389, 344008, 313389, 145093, 184052, 117519, 437589, 324387, 389401, 116952, 46172, 344580, 164799, 238861, 89806, 92745, 249693, -9069, 254591, 50906]
15034D67983A94067J76031j83128J46187L2299G258L81815k1697j46024J05472
15024C26824e1074B05796L02190k27710l4372j00518B7680R162K14265O0265K2233
15013C33605E0398N129O1350K44203A22600L43695j30775Q4651K4298J00864q314
15002E37019B08938C1827M63042e1927C15665l586j13688J35166K12085B20509
14991C30562j29816j5451E3818N47963k65339N6927J37436B64391F465K19422
14981B25887L4735a58466H1630L77099I6761b7567D03751a83779D29895j16505
14971C13390k9667J92863j71539A09116R3311K75698A34777M05969A98990K77798
14961D76788A77646b7796E2125M86539A41898K64353j71972j02906J51470o1927
$$ y = [467983, 194067, 370098, 186970, 333157, 365456, 7258, 389073, 367376, 221352, 326824, -51074, 205796, 507986, 280276, 245904, 145386, 27680, 36842, 251107, 311372, 333605, 50398, 55527, 116877, 361080, 122600, 466295, 335520, 420171, 444469, 545333, 537019, 208938, 31827, 494869, -51927, 315665, 312079, 198391, 333557, 545642, 220509, 330562, 200746, 185295, 53818, 601781, 336442, 393369, 530805, 264391, 6465, 225887, 260622, -158466, 81630, 458729, 96761, -27567, 403751, -183779, 429895, 313390, 283723, 476586, 305047, 109116, 202427, 478125, 134777, 540746, 198990, 476788, 177646, -27796, 52125, 538664, 141898, 406251, 234279, 131373, 282843, 220916]
14951B20916j08504J46407j00044L88775n7909J08475A55234F2834M17421j79703
14941C00552Q6849R2235D5983N69140B37288D7589K00367K28560A61979j1563
14931A50416K81628J30098J56200d608A95740L56235B68205L11525j8341k23125
14921C38264j67188K76914j8309I0711M06204j99262K33034k30848m3385L37048
14911E93502K9415a7719E00080j91724J33422f1398C97441M7549J8093B13978
14900H00372k48348m7381l7036B20019K22490J04026n6284J02970q1443J1583
14890E23361j75241R0334k3854P1136Q5063k79970Q2827A79178O67257l87616
14880D58819o5799J60230o420A97842K94003r0074j84394L76047B28483J59504
$$ y = [220916, 112412, 258819, 158775, 547550, 489641, 598116, 155234, 62834, 480255, 300552, 387401, 479636, 45983, 615123, 237288, 47589, 247956, 476516, 161979, 150416, 432044, 562142, 718342, -4608, 195740, 551975, 268205, 579730, 561389, 338264, 171076, 447990, 429681, 90711, 496915, 297653, 530687, 299839, 256454, 593502, 622917, -17719, 500080, 308356, 441778, -61398, 397441, 444990, 463083, 213978, 800372, 552024, 504643, 467607, 220019, 442509, 546535, 490251, 593221, 511778, 523361, 348120, 438454, 414600, 485736, 570799, 290829, 373656, 179178, 846435, 458819, 393020, 553250, 546830, 197842, 491845, 401771, 217377, 593424, 228483, 387987]
14870C87987K34450J60893l70946L2344J66361K86190l53117R4140j14342p4917
14860D49043K17235k14209P7373k58896Q8182M36952B48802K08454k02045J37076
14850C92287J98149k630r6015R2290k70864K16480r1636j04166J95907n1277j2633
14839D65892r1649N0197J71131o5405L0708q999J49569k19109K6804m1307M02552
14828H70384m15859J31003j73873J59795q4623K06945k04900K34288k41614k39857
14818B41689J00004M17294k31861n0450k616L3506j08203N2280L79563l38110
14808D93096K57757k99226R155M14456l51308K53460k42828Q3693L2137A83917
14797F86849J65671J46579o6515m51824N18273l8399m05814M11432l25002l2314
$$ y = [387987, 622437, 783330, 412384, 444728, 611089, 897279, 544162, 638302, 523960, 449043, 666278, 452069, 529442, 270546, 358728, 795680, 248802, 457256, 255211, 392287, 590436, 587806, 491791, 584081, 313217, 529697, 438061, 333895, 529802, 478525, 465892, 374243, 424440, 595571, 530166, 560874, 551875, 701444, 482335, 509139, 467832, 870384, 454525, 585528, 411655, 571450, 486827, 693772, 488872, 723160, 481546, 241689, 341693, 758987, 527126, 476676, 474060, 507566, 399363, 451643, 831206, 493096, 750853, 451627, 460782, 875238, 523930, 777390, 534562, 618255, 650392, 183917, 686849, 852520, 999099, 932584, 480760, 999033, 960634, 554820, 966252, 641250, 608936]
14787F08936p260K60206C27904M92745l0009L37404m75835J57392J28437j65378
14777G72660j5376j7781C33140O06591j41234r8357k63468L95859l90386K89795
14767G31940m5921K5504k12653Q4638J64297J60787r4238q9708K44019j85515
14757G83150C81187L33809M4610J59892j22744B19975L46478M18520k00844J0289
14747G94418p3359Q7484J68330k14533k4362J61123M68449D10357N05971k17501
14737F98827M30139E25318J69128N2227J25083J34705Q4528m35073n3148L86241
14727I89009J37404N4772j19585k84747K32480k09810j5676J08099L95000n34082
14717G52864P9476m2555K04761l44937M56946M2315j98601L05455R225J7172l12531
$$ y = [608936, 601676, 861882, 327904, 820649, 790640, 1128044, 652209, 809601, 938038, 772660, 757284, 739503, 333140, 939731, 798497, 700140, 436672, 832531, 442145, 731940, 686019, 711523, 498870, 583508, 747805, 908592, 814354, 724646, 968665, 783150, 381187, 714996, 759606, 919498, 796754, 219975, 566453, 984973, 784129, 794418, 721059, 808543, 976873, 762340, 737978, 899101, 1367550, 410357, 916328, 698827, 1128966, 525318, 694446, 746673, 871756, 1006461, 1090989, 655916, 602768, 989009, 1126413, 1181185, 1061600, 776853, 1009333, 799523, 783847, 891946, 1286946, 752864, 832340, 789785, 994546, 649609, 1106555, 1148870, 950269, 1255724, 1264949, 1282121, 969590]
14706I69590j64332O0397j09565q797M58242n3858j32953Q8559R1431n82128L82273
14695I98859J05266l65210L34501l43071J92989M83402o2760k15947K1606K00576
14685A350211m20717N03035m59386m1494L26060J925J3929k84502J38201K35219
14675A362481m6892M5899n09527O27837k69897O9758n715N7570j23801N3742j87754
14664A073701K45611r9175K13940p1872l5703R3086l39081R3692K01810J457L4633
14653A412099M0355k04490q275J66046K14884m1803j37088m51249M18119J3543
14643A422141o5656J88153j63794L47383M8634j05506K5922J51617l89048Q9141
14633A548987J3202n0854J28760r4096k974J06283k69635K96937p8043q4270Q8376
$$ y = [969590, 805258, 865655, 756090, 747293, 1205535, 1151677, 1018724, 1107283, 1198714, 616586, 998859, 1104125, 738915, 1073416, 730345, 923334, 1406736, 1343976, 1128029, 1149635, 1350211, 929494, 1432529, 973143, 931649, 1257709, 1259634, 1273563, 989061, 1127262, 1362481, 1315589, 1361488, 851961, 1479798, 1209901, 1279659, 1273944, 1331514, 1207713, 1261455, 1073701, 1319312, 1220137, 1434077, 1362205, 1326502, 1419588, 1080507, 1174199, 1376009, 1377466, 1412099, 1452454, 1247964, 1239689, 1405735, 1620619, 1578816, 1441728, 990479, 1408598, 1422141, 1356485, 1544638, 1380844, 1728227, 1776861, 1671355, 1697277, 1848894, 1459846, 1548987, 1562189, 1511335, 1640095, 1545999, 1543025, 1649308, 1379673, 1676610, 1598567, 1514297, 1602673]
14622A602673P8776j20761P0219J61750K3167K1979q6045j89658K63142K93887
14612B119129l41247L94878q4075j97504p8409L21825k80019j93881J74501j36834
14602A698364J50132L64970n01495L48378j43739J13170q4970J85680K3187m69305
14592A684372O08585k32730J40156j80212k50163O42438j90576L64980k83131
14583B303719k20726k26183M83845R0366k90509K42701m115L75329m13783J87276
14573B527920K21220l46571J82981N3591L7089K30110o2184l13158M09088k26679
14563B713407L49869j6886L6950K05815k69269K89727L97498l12169L62662N50051
14553D307655n6718Q94196N64208R89489K172031M096841J0535316K0592007J801294
$$ y = [1602673, 1681449, 1560688, 1630907, 1792657, 1815824, 1837803, 1751758, 1562100, 1825242, 2119129, 1777882, 2172760, 2088685, 1891181, 1812772, 2134597, 1854578, 1660697, 1835198, 1698364, 1848496, 2213466, 1711971, 2060349, 1916610, 2029780, 1944810, 2130490, 2153677, 1684372, 2292957, 2060227, 2200383, 2020171, 1770008, 2412446, 2221870, 2586850, 2303719, 2082993, 1856810, 2340655, 2431021, 2140512, 2383213, 2379098, 2754427, 2340644, 2527920, 2749140, 2402569, 2585550, 2639141, 2676230, 2906340, 2844156, 2530998, 2940086, 2713407, 3063276, 3046390, 3083340, 3289155, 3019886, 3309613, 3707111, 3394942, 3757604, 4307655, 4250937, 5145133, 5709341, 6698830, 8870861, 12967702, 23503018, 44095025, 45896319]
14544D5896319B0957860I539791l544352j279219l74733j78905J17999J254053
14536E534634j127822j402365k47575k48997L4533P0827j36369m0186K36516j81713
14526B491483L48347l75130M42713j34369j07040K81024l22739J51048L4029l06151
14516B503215O25035n4400k15732M72531j36927j37574L0258j07097K73498l5304
14506C217503j88146L30315k48614O00022m6158L1103j55078K43986k50596L09165
14496C843502j21089L4505K44830L84041l01200j78410K22192m7758J240K43037
14486D324890R4259k40175M52829j67651k1481j19748o6834K67354K95250q6293
14476D732400M5984k18083J99631J17398L3549J2033J08822K60683l03099K70710
$$ y = [45896319, 20957860, 9539791, 5995439, 4716220, 4341487, 4162582, 4280581, 5534634, 4406812, 3004447, 2756872, 2507875, 2542408, 2613235, 2476866, 2436680, 2673196, 2491483, 2839830, 2464700, 2907413, 2773044, 2666004, 2947028, 2624289, 2775337, 2809366, 2503215, 3128250, 3073850, 2858118, 3330649, 3193722, 3056148, 3086406, 2979309, 3252807, 3217503, 3029357, 3359672, 3111058, 3711080, 3664922, 3696025, 3540947, 3784933, 3534337, 3843502, 3722413, 3756918, 4001748, 4385789, 4084589, 3906179, 4128371, 4080613, 4081853, 4324890, 4419149, 4178974, 4631803, 4464152, 4442671, 4322923, 4256089, 4523443, 4818693, 4732400, 4778384, 4560301, 4759932, 4877330, 4910879, 4922912, 5031734, 5292417, 4989318, 5260028]
14466E260028M6024l53827L30766j65216J71286K10943K28577K84760j42556J56789
14456F027574j64210M0063K42936m1867q3677L39526m6703J16827P3133N0662
14446F554264J706K92951j81717J30186M29446r4862K89255j28156K0205K77077
14436G590355j03215L0204L90835n23021O69926j39518K01413R5803j98820K01317
14426H215279L45685J4346L27523l61312Q79426j10934Q5837M3508K6509K30289
14416I696156J07867M63009N1761j33100J48049J77758R5208O51501j81300j71149
14406A0905760L01234L48766J67088L00535J45433J01561m8349N43345L49302
14397A3114675r8676K42991p0456L38750N12415l7927L24778J81290M33415k81021
$$ y = [5260028, 5306052, 4952225, 5282991, 5117775, 5289061, 5500004, 5728581, 6013341, 5870785, 6027574, 5863364, 5903427, 6146363, 6104496, 6020819, 6360345, 6313642, 6430469, 6503602, 6554264, 6555970, 6848921, 6667204, 6797390, 7226836, 7131974, 7421229, 7293073, 7313278, 7590355, 7487140, 7517344, 7908179, 7385158, 8055084, 7915566, 8116979, 8212782, 8013962, 8215279, 8560964, 8575310, 8902833, 8541521, 9420947, 9310013, 9395850, 9439358, 9465867, 9696156, 9804023, 10267032, 10318793, 10185693, 10333742, 10511500, 10606708, 11258209, 11076909, 10905760, 11206994, 11555760, 11722848, 12023383, 12168816, 12270377, 12222028, 12765373, 13114675, 13015999, 13258990, 13188534, 13527284, 14039699, 14001772, 14326550, 14507840, 14941255, 14660234]
14387A4660234Q85559j06443L53866L24450K39753K02023M41823P12907j29304
14378A7584868J82921L46825O57169K74985L056Q23202J15740O81J128512L63705
14368B1481664P5141O59564N52686K16318O14332J89646P78788L17896P21901
14359B5607936J058864L87049L63171N96096N00219Q97016J012754R3379J048507
14350C1564991N61372J061825O74782J111616Q65932P57137J062220P63566J362581
14341C9786022P37467J225205R31787J408734J496415R61914J270688J624571
14333D9442803J005111J385983J992719J875327J364000K382285J399167K193519
14325F3040914J813960J858783K561451K102246K968487K221363L024900K885718
$$ y = [14660234, 15545793, 15439350, 15793216, 16117666, 16357419, 16559442, 17001265, 17714172, 17584868, 17767789, 18114614, 18771783, 19046768, 19049824, 19873026, 19988766, 19989447, 21117959, 21481664, 21556805, 22216369, 22769055, 22985373, 23599705, 23789351, 24568139, 24886035, 25607936, 26666800, 27053849, 27417020, 28013116, 28513335, 29410351, 30423105, 30516484, 31564991, 32126363, 33188188, 33862970, 34974586, 35840518, 36597655, 37659875, 38423441, 39786022, 40523489, 41748694, 42680481, 44089215, 45585630, 46547544, 47818232, 49442803, 50447914, 51833897, 53826616, 55701943, 57065943, 59448228, 60847395, 63040914, 64854874, 66713657, 69275108, 71377354, 74345841, 76567204, 79592104, 82477822]
14317H2477822K955821K881754L237176L480362L699835M021822L832350M270990
14309A10857932M596401M707255M916610N139535N505617O037995N865416O451298
14301A54078059O901745P186985P520697P914633Q948930Q391167R430844R804841
14293B20177901J0590173J0798729J1531970J1791427J2316180J2901359J3038243
14286C03145982J3643261J4047876J3856849J4613245J4320926J4480648J3808129
14279D01916916J3724491J2745427J2356391J1194618R085403P676458M116461
14272D72816165K141620L65085j062958j534116m115749l019450n563844q653849
14264D51372904r903286j1535602j2925982j3872385j4630264j5388896j5126658
$$ y = [82477822, 85433643, 88315397, 91552573, 95032935, 98732770, 102754592, 106586942, 110857932, 115454333, 120161588, 125078198, 130217733, 135723350, 141761345, 147626761, 154078059, 160979804, 168166789, 175687486, 183602119, 192551049, 200942216, 210373060, 220177901, 230768074, 241566803, 253098773, 264890200, 277206380, 290107739, 303145982, 316789243, 330837119, 344693968, 359307213, 373628139, 388108787, 401916916, 415641407, 428386834, 440743225, 451937843, 461023246, 468699704, 472816165, 474957785, 475322870, 474259912, 472725796, 468610047, 465590597, 460026753, 451372904, 441469618, 429934016, 417008034, 403135649, 388505385, 373116489, 357989831]
14257C57989831j5030222j5094616j4473771j4786695j3716361j3157921j2705831
14250B59024414j2256209j1290143j0764792r743476j0185444r334678q859457
14243A86590215q493293q023856p839262p094285p091441n679777n983751o045719
14235A30338831n433702n225119m671282m447709l747171m522727l794076l825019
14227I4672026l457178l318205l432825k832917l091369k364480k703715k261869
14219G1209468k411504k493888k077836j995637j963656j450121j643616j881905
14211E5291305j727569j860099j603222j030862r37539j230989j498787j674017
14203D3728221q54508j216006r25043p39461j437645o33798j328331p52406j304128
$$ y = [357989831, 342959609, 327864993, 313391222, 298604527, 284888166, 271730245, 259024414, 246768205, 235478062, 224713270, 214969794, 204784350, 195449672, 186590215, 178096922, 170073066, 162233804, 155139519, 148048078, 142368301, 136384550, 130338831, 124905129, 119680010, 115008728, 110561019, 106813848, 102291121, 98497045, 94672026, 91214848, 87896643, 84463818, 81630901, 78539532, 76175052, 73471337, 71209468, 68797964, 66304076, 64226240, 62230603, 60266947, 58816826, 57173210, 55291305, 53563736, 51703637, 50100415, 49069553, 48132014, 46901025, 45402238, 43728221, 42873713, 41657707, 40732664, 39993203, 38555558, 37921760, 36593429, 35841023, 34536895]
14194C4536895l12308q27128p82764q14593p47828r42715m86086q89563m28094
14185B8305816k90102j074154m12266m74778o70818n75428p03982m39113l45974
14176B3319201r09364k78609k26965l29720o18764j12017n50724k27330k98733
14167A9766975q62156J1854l93432l90374j82156o59448K00331o77346m44205
14158A6370043k60466j19950n3509n37204K2262l72599m23436j03358j98990l37793
14148A3985000n1311j87163m82246k70651r537n68432J53902l39889k57841o5376
14138A1906456r5871k90104k89959N7462k99624k54718K35185r0321m37804j16559
14128A0324143j48145m77778k3984K24214j66569n40091J57265k35272K23162
$$ y = [34536895, 34224587, 33397459, 32614695, 31800102, 31052274, 30109559, 29623473, 28733910, 28305816, 28015714, 26941560, 26529294, 26054516, 25383698, 24808270, 24104288, 23665175, 23319201, 22409837, 22131228, 21904263, 21574543, 20955779, 20843762, 20293038, 20065708, 19766975, 18904819, 18916673, 18523241, 18132867, 17950711, 17291263, 17491594, 16814248, 16370043, 16109577, 15989627, 15936118, 15398914, 15421176, 15048577, 14625141, 14521783, 14322793, 13985000, 13933689, 13746526, 13264280, 12993629, 12984092, 12415660, 12569562, 12229673, 11971832, 11906456, 11810585, 11520481, 11230522, 11287984, 10988360, 10733642, 10968827, 10878506, 10440702, 10324143, 10175998, 9698220, 9674236, 9898450, 9731881, 9191790, 9349055, 9113783, 9336945]
14119I336945j28941r5905l57105J40131k94761k07203k19052o4155J91478k61480
14109H039952p1852l5913k20931N2097l21121k51685J34644K88023m28832j00513
14099G083869J00410l74395m3504J57156Q8240k23416L4833j85900m53147r320
14089F174826R2467q2492L0411k17054O2968k66562L29668J0888k19985j0017
14079E905118m45332Q6718j03173j11805q4k08526K0549K0531M6780L619J53602
14068E367997k71084j36840J81518k40610l8011n64827M66145k27613L13599m71899
14058D378375J75927K21781j06994m44804L59059m08538J24195k2680K9557m32756
14048C873122L007j72088O87667l39618j75844J5018k44088J63090K33821k64489
$$ y = [9336945, 9208004, 9112099, 8754994, 8895125, 8600364, 8393161, 8174109, 8109954, 8301432, 8039952, 7968100, 7932187, 7711256, 7763353, 7442232, 7190547, 7325191, 7613214, 7184382, 7083869, 7184279, 6809884, 6766380, 6923536, 7011776, 6788360, 6823193, 6637293, 6184146, 6174826, 6267293, 6184801, 6215212, 5998158, 6061126, 5794564, 6124232, 6135120, 5915135, 5905118, 5459786, 5546504, 5443331, 5331526, 5331442, 5122916, 5143465, 5163996, 5210776, 5214395, 5367997, 5096913, 4960073, 5141591, 4900981, 4862970, 4298143, 4764288, 4536675, 4850274, 4378375, 4554302, 4776083, 4669089, 4224285, 4583344, 4174806, 4299001, 4276321, 4305878, 3873122, 3876129, 3704041, 4391708, 4052090, 3876246, 3891264, 3647176, 3810266, 4044087, 3779598]
14038C779598J50654m3502l58769K06174O9647k78632K48876m35057K7204r3923
14028C272270L98085Q441m48078J70560R1631k10192K13212p8028j0720l45515
14018C061666J21595m38157L18275J51089m25428L03117R0499l34071J06758k88429
14008B666914o0356L62077k08212l5894k3947l9052K05608l17204j00402k7358
13998B422174l85650O02294q4846j57776J90366k81815K33282L04173L29675J803077
13988D974954K184451P657106K1466487J3291802k1632536j2416960o405455k690827
13980F429022j177541n00550m73380n84972j65544p2123o509m42186L202j29596
13970B879823r8475L00762p5906m9014k13730k14924J80252k82996J4891M0397
$$ y = [3779598, 3930252, 3886750, 3527981, 3734155, 3803802, 3525170, 3774046, 3338989, 3366193, 3272270, 3670355, 3678796, 3230718, 3401278, 3492909, 3282717, 3495929, 3417901, 3407181, 3061666, 3183261, 2745104, 3063379, 3214468, 2789040, 3092157, 3182656, 2848585, 2955343, 2666914, 2606558, 2968635, 2760423, 2724529, 2700582, 2661530, 2867138, 2549934, 2449532, 2422174, 2036524, 2638818, 2553972, 2396196, 2586562, 2304747, 2538029, 2842202, 3171877, 4974954, 7159405, 14816511, 36282998, 49574800, 27942264, 15525304, 9119849, 6429022, 5251481, 4750931, 4277551, 3692579, 3527035, 3454912, 3448403, 3006217, 3009419, 2879823, 2781348, 3082110, 3006204, 2957190, 2743460, 2528536, 2708788, 2425792, 2440683, 2481080]
13960B481080N7362j94427J46692k2505k12160J85141k46689L16841p1977l38579
13950B100779k9441j3998L24263j77523N7818j32199k3680n7003j4425L44583
13940B379174n28582K65515k29637L8341J00933j54431k7031L45245J14079k62210
13930B041396p5616j30514L21345l81859O8855J33047J13560k84465j30041K22303
13920A898011K0053L16784j72862j63818m22386L5038M6603M43694j86232k83257
13910A531628K52062r885j64659K98394k97552p6349j84466M61258j63849k29760
13900A416822O05429o30644Q0601P7237M3848L52882l60179K37501l24875R2712
13890A591334n3970P7943o3995j73641N5816l73270O7930K82249J63944m16358
$$ y = [2481080, 2538442, 2344015, 2490707, 2468202, 2256042, 2441183, 2194494, 2511335, 2439358, 2100779, 2071338, 2057340, 2381603, 2204080, 2261898, 2129699, 2106019, 2049016, 2034591, 2379174, 1850592, 2116107, 1886470, 1924811, 2025744, 1871313, 1844282, 2189527, 2303606, 2041396, 1965780, 1835266, 2156611, 1774752, 1843607, 1976654, 2090214, 1805749, 1675708, 1898011, 1918064, 2234848, 2061986, 1898168, 1475782, 1510820, 1557423, 2001117, 1814885, 1531628, 1783690, 1773805, 1609146, 1907540, 1609988, 1533639, 1349173, 1810431, 1646582, 1416822, 2022251, 1391607, 1472208, 1549445, 1593293, 1946175, 1585996, 1823497, 1498622, 1591334, 1537364, 1615307, 1551312, 1377671, 1433487, 1060217, 1128147, 1410396, 1574340, 1157982]
13880A157982K44172l4481k3082J04261j38712m47962M70638j50110p7479N95374
13870A700601k59769j3940k20775J73047M8965k81422M8499j61967j19898L00686
13860A214027n4137o9325R4351K76264o4506Q693j36454j60467k6244K95744j23868
13849A254078k29931k35286M13013l7973L144K78171n65216L62336r8910O5942
13839A209368l80176L43314j34040k10678N09965l46920K43035Q9552k76156r6431
13829I50833K14210k35196J35317j32577N8365M4146r8158J77583p4144l45376
13819F95003K06187K6673j7833j27918J2608N7598K81462j40186j25299j94709
13809F73586M06465J00214j29277k9315j59211q2282N01562m33511K41937j64274
$$ y = [1157982, 1402154, 1367673, 1344591, 1448852, 1310140, 862178, 1332816, 1182706, 1105227, 1700601, 1440832, 1426892, 1206117, 1379164, 1428129, 1146707, 1195206, 1033239, 913341, 1214027, 1159890, 1090565, 1184916, 1461180, 1396674, 1405367, 1268913, 1108446, 1082202, 1377946, 1254078, 1024147, 788861, 1201874, 1163901, 1167045, 1445216, 880000, 1242336, 1143426, 1209368, 829192, 1172506, 1038466, 827788, 1337753, 990833, 1233868, 1323420, 1047264, 950833, 1165043, 929847, 1065164, 932587, 990952, 1035098, 936940, 1114523, 1040379, 695003, 901190, 927863, 910030, 782112, 794720, 852318, 1133780, 993594, 868295, 673586, 1080051, 1180265, 1050988, 1021673, 862462, 780180, 1281742, 848231, 1090168, 925894]
13799I25894J86341j00702l9391m9898L75133l82526j98109K87408J1598J22424
13789A138172n16241M89949j19500l5574N078j23901k3038j64148n9108K13766
13779H05455K95249l76245J4371O557Q179J1650L22170o4084j08102k74813K39409
13768H79796j29507K62664j48926N2541k77291J97156m0202K26967k22078M3414
13758H44534Q9853k39219j47423N83704l98133N1571j43649L61086m43911M95506
13748A053919m70274J24926M38489j95345l14509j20174P43781o06439j37662
13739E16712L29551j3951l15498L23166j79757P0266r9207o4295O7719J73784
13729H08490r3214L15520k71840p7591J26759r9348k08270L13478l01213J98881
$$ y = [925894, 1112235, 1011533, 972142, 922244, 1297377, 914851, 716742, 1004150, 1015748, 1138172, 621931, 1111880, 992380, 956806, 961884, 837983, 814945, 650797, 591689, 805455, 1100704, 724459, 738830, 745387, 753566, 765216, 1087386, 1023302, 915200, 640387, 879796, 750289, 1012953, 864027, 916568, 639277, 836433, 796231, 1023198, 801120, 844534, 934387, 695168, 547745, 1131449, 733316, 784887, 641238, 1002324, 558413, 1053919, 583645, 708571, 1147060, 951715, 637206, 517032, 1260813, 654374, 516712, 846263, 832312, 516814, 839980, 660223, 730489, 631282, 566987, 634706, 808490, 715276, 1030796, 758956, 681365, 808124, 708776, 500506, 813984, 512771, 711652]
13719G11652J98550D23041K65251m2630p4491A97991M91222L9798o7437k7140
13709F34434J29449j42341p3484j5214J72795l38274J92425J47720J24469l34605
13699D97374m3791L49729j05737B17024P15475l58635L68346m45130j16534M72312
13689H52858D16313J79051P6294B01089K6115M19097k1786J41637j49286M2525
13679F59391k71191n346J13695K89804B21884M32185A53638L73447q5092A99706
13668E87940N480j20740j69920K35068o3012J15753B75063L91770j77297J87128
13658F76664L1188k78791o1885K80446C08923M57622q6790k62499M58037j86153
13648F89140l27816L60536P8346k73056B29568J71121K11172p9105n1521J92435
$$ y = [711652, 910202, 423041, 688292, 645662, 571171, 197991, 689213, 729011, 661574, 634434, 763883, 621542, 548058, 532844, 705639, 367365, 559790, 707510, 831979, 497374, 453583, 803312, 697575, 217024, 932499, 573864, 942210, 497080, 380546, 852858, 416313, 595364, 671658, 201089, 227204, 646301, 624515, 766152, 616866, 659391, 388200, 382854, 496549, 786353, 221884, 654069, 153638, 527085, 441993, 199706, 587940, 593420, 472680, 302760, 537828, 474816, 590569, 275063, 666833, 489536, 676664, 707852, 429061, 367176, 647622, 308923, 766545, 679755, 417256, 875293, 689140, 361324, 721860, 800206, 527150, 229568, 400689, 611861, 532756, 481235, 673670]
13638F73670B41393L67913B12301M09679B87172K04915k15202Q4417L13484q5070
13628E89716k30424m0908P1192J39830j4450k22701j3605J45641A04748L05956
13618D10704Q7289B40428K84328p1591J35971L23423m27410L7474A07602K91529
13608C99131K95693j95463K8747r7579j52723J35476K4501j78404N73367E8023
13597D15670o0561J00065J5018B05386J86892K6121j25734J35035K00815j61200
13587D67315J41920j59270m512K84090k39969K51527l61832M9823P1106A89044
13576F06645j03357j80523J67242n0524m7497p5684R7061L45606j39362m5236
13566E74371k20008A29929J61097j0841M19919A94405M70987B60892p0047K52473
$$ y = [673670, 241393, 609306, 212301, 621980, 287172, 492087, 276885, 361302, 674786, 589716, 359292, 318384, 389576, 529406, 514956, 292255, 278650, 424291, 104748, 410704, 497993, 240428, 524756, 453165, 589136, 912559, 485149, 522623, 107602, 399131, 694824, 499361, 528108, 430529, 277806, 413282, 437783, 259379, 832746, 58023, 415670, 355109, 455174, 470192, 205386, 392278, 418399, 292665, 427700, 628515, 467315, 609235, 449965, 445453, 729543, 489574, 741101, 379269, 429092, 500198, 189044, 606645, 503288, 322765, 490007, 439483, 391986, 316302, 413363, 758969, 619607, 574371, 354363, 129929, 291026, 280185, 700104, 194405, 665392, 260892, 190845, 443318]
13556D43318B01771l4143R7293J50914K2229A39128J54305L67848k97663L43778
13546G07396m9457k65265A55954M05931j51968B6514K88782J03509R0852B11490
13535B49257A22297N62018l25280k3133J08699r764K68228C14112m8739o7659
13525A97714H1106M08368a761E71645q115B46432j01595l4012R0243F7115N00854
13514E67969A57312F8117L99373A55015J97060j07330J11216Q8692k20957o365
13504B17331L15138B09379M8150K02174j88486J56522L1456A60772K92948A59660
13493B54283L6379l6840B379M86209B04263L13076o7724o3736K492j4108r8333
13482B75930j3543J89156j84690I2556N68189l13017j54027l7341j0149C5867
$$ y = [443318, 201771, 167628, 264921, 415835, 438064, 139128, 293433, 661281, 363618, 707396, 657939, 392674, 155954, 561885, 409917, 26514, 315296, 418805, 509657, 211490, 249257, 122297, 684315, 359035, 335902, 444601, 434837, 703065, 314112, 265373, 197714, 81106, 489474, -1761, 571645, 563530, 246432, 144837, 110825, 201068, 67115, 567969, 157312, 68117, 467490, 155015, 352075, 244745, 355961, 444653, 223696, 217331, 532469, 209379, 257529, 459703, 271217, 427739, 459195, 160772, 453720, 159660, 254283, 290662, 253822, 2379, 488588, 204263, 517339, 449615, 385879, 388371, 374263, 275930, 262387, 451543, 266853, 92556, 660745, 347728, 193701, 156360, 146211, 35867]
13471B69396j07640j956M08494j14270A39163m3092J65641l2576K49458j06458
13461C72136A46940K81913g1409A55543Q3421O2208g262k567D39588l0832A67564
13449A74891K5104O7035K2583q4113J99874A76770q5220K23513I1067C673J39099
13438A42772L3237P1626K07162r155G3889K54077L241A64296D3153J03483E7514
13426B19160J66070H1284M72480A3730J78277L12161i1792q8094C7427f458B52090
13414D30517A51386A2588L89473j09614O4658a24995E61973k13893A58310L78932
13404E37242j34924O7203j59124J1643j52381o7050a8451I9282J14459J3031r8354
13393A28418E5684K44080J5550J231B3116N31605B54767G7289K90454A82404N0837
$$ y = [269396, 161756, 159800, 568294, 454024, 139163, 96071, 261712, 229136, 478594, 372136, 146940, 428853, -71409, 155543, 238964, 301172, -7262, -9829, 439588, 408756, 167564, 174891, 199995, 267030, 289613, 205500, 405374, 176770, 91550, 315063, 91067, 3673, 142772, 176009, 247635, 454797, 445642, 73889, 327966, 331207, 164296, 43153, 146636, 57514, 219160, 385230, 81284, 553764, 13730, 192007, 504168, -91792, -179886, 37427, -6458, 252090, 430517, 151386, 12588, 402061, 292447, 357105, -124995, 561973, 348080, 158310, 537242, 402318, 469521, 310397, 322040, 169659, 102609, -18451, 99282, 213741, 226772, 128418, 55684, 299764, 315314, 316545, 23116, 554721, 254767, 77289, 367743, 182404, 233241]
13382B33241R8376A61137K80022A33048a44896D3454a0908p6163D63904k20373
13372B43531M8220B0034M11314j83300p7399K1308K53525B13488R2801j19646
13362A86643M39459B62778A00263K08025c52557D12949k03704K53273k05256J49667
13352D06929a0386D13615p2353j63622O0561Q3814M3935J63944B58015K11232
13342D69247A73497C0981J65488J19751N3409K0931j73785i1971B10441j0612
13332A99829j6415P6366K47807n7392D3260N0118J49189l433J76432a56696C88144
13320C25963A06988K84801H0766L20618G3519K42147A51353J98831p884O8055
13310D10355j76615n1327J18734b33426B55897J75704A68148O3532P2380a22156
$$ y = [233241, 331617, 161137, 441159, 133048, -144896, 43454, -10908, -87071, 463904, 243531, 291751, 20034, 431348, 248048, 170649, 191957, 445482, 213488, 306289, 186643, 626102, 262778, 100263, 308288, -352557, 412949, 209245, 462518, 257262, 406929, -10386, 413615, 341262, 177640, 238201, 322015, 365950, 529894, 258015, 469247, 173497, 30981, 196469, 316220, 369629, 390560, 216775, -91971, 210441, 199829, 183414, 259780, 507587, 450195, 43260, 93378, 242567, 239134, 415566, -156696, 388144, 325963, 106988, 391789, 80766, 401384, 73519, 315666, 151353, 350184, 342300, 410355, 233740, 182413, 301147, -233426, 255897, 431601, 168148, 231680, 304060, -122156]
13299C27416A36635i2216A41790a56181d979B46685a23243C37710j19257D4177
13288D04730H4403K6499J53873r7550J57123e4798D66411A954O0423g9658A66004
13276G9447L69780j45989C5940J05044o5973M10077k41898N3944G1793k0073J65760
13265B17480O3889A29145K25908I3785M57068A25724J38483F5843N8531D1147
13254E37d3677j57221A03448F494J4860L06079j1048A42966h7630B83791c0450
13242D02670a75450A73926R6735C6885J54789C9448f5032G300O07549D9482N6812
13231A06294L75565d7845j1598B27686j0173R886J40976E0638G03K90543J16937
13220D08183I6295L2298m4795K28055b7654A70873J44406q0652J51638A68269
$$ y = [327416, 136635, -92216, 141790, -156181, -4979, 246685, -123243, 337710, 218453, 44177, 404730, 84403, 110902, 264775, 167225, 324348, -54798, 466411, 1954, 62377, -79658, 166004, 79447, 449227, 303238, 35940, 140984, 75011, 485088, 243190, 297134, 71793, 51720, 217480, 281369, 129145, 355053, 93785, 550853, 125724, 264207, 65843, 124374, 41147, 537, -43677, -200898, 103448, 6494, 21354, 327433, 316385, 142966, -87630, 283791, -30450, 402670, -175450, 173926, 270661, 36885, 191674, 39448, -65032, 7300, 614849, 49482, 106294, 481859, -47845, -59443, 227686, 217513, 227399, 368375, 50638, 703, 291246, 408183, 96295, 128593, 83798, 311853, -27654, 170873, 315279, 234627, 386265, 168269]
13209B70198c5069p2266A58434o1675K01817J62545p0737e3204D03627a52704
13198B78178H560M53948B11629k1852m5053d6325B01347q1870L23472B1909a79313
13186b96568A51501Q7251a04432b8296E5126L12781A51794B5796J27017F4317
13175b9753A39717P5314B7280P2489a02106A90588r4474L31672i2662C24078J49918
13164D73996g0369A48258K01225D2847J93336a35850A36268a25186D3391j7543
13154B5848P6420A3930i5440A51912Q4028b9855I7374D5993M2527b95396A61051
13142A95707d4477l274D1626K13765f8390K2314G973J0292K01441b04418C77773
13130C61408B4466J25018L1686a16085A85382h2012B55597a6612p1430p5831A49295
$$ y = [270198, -35069, -107335, 158434, 96759, 298576, 461121, 390384, -53204, 403627, -152704, 278178, 8560, 462508, 211629, 189777, 144724, -46325, 201347, 119477, 442949, 21909, -179313, -296568, 151501, 238752, -104432, -28296, 55126, 367907, 151794, 25796, 152813, 64317, -29753, 139717, 215031, 27280, 99769, -102106, 190588, 96114, 427786, -92662, 324078, 473996, -70369, 148258, 349483, 42847, 236183, -135850, 136268, -125186, 43391, 25848, 102268, 13930, -95440, 151912, 235940, -29855, 97374, 45993, 88520, -295396, 161051, 195707, -44477, -47751, 41626, 255391, -68390, -46076, 7973, 18265, 219706, -204418, 377773, 361408, 24466, 149484, 181170, -116085, 185382, -82012, 255597, -16612, -88042, -163873, 149295]
13118f233n4888A61815J71772M5722B2374b78025C02956a62662B57062b3828B71618
13106I7933b1638B22208i1519j6278A42204F8299e0925E2561J07255p2058J60176
13095B47934B7282L5584K6095A6081a535C11656a19650A06906D0287K52271r4536
13084A98022J06500a14979j81380A89752h5818p782K3010E8817R5595e6430k0067
13073g6497B48277K05824f0123A86523c42034e2625k72377C85522k1151A76551
13062A3263J85190b3275B68745a54302H6799b47414h4652C70066A07933a25475
13051A38212n6847K60630e0630C9873P8127i5035B02686D1118K04000Q9135G1522
13039a31200D0581J52874c2522I897a9355r8832C77999A35459J97850l2668i1122
$$ y = [-6233, -61121, 161815, 333587, 379309, 22374, -278025, 302956, -162662, 257062, -23828, 271618, 97933, -21638, 222208, -91519, -107797, 142204, 68299, -50925, 52561, 159816, 87758, 247934, 27282, 62866, 88961, 16081, -1535, 311656, -119650, 106906, 40287, 292558, 198022, 304522, -114979, -296359, 189752, -85818, -93600, -70590, 58817, 154412, -56430, -76497, 248277, 454101, -60123, 186523, -342034, -52625, -325002, 385522, 364371, 176551, 13263, 198453, -23275, 268745, -154302, 86799, -247414, -84652, 370066, 107933, -125475, 138212, 81365, 341995, -50630, 39873, 118000, -95035, 202686, 41118, 245118, 334253, 71522, -131200, 40581, 193455, -32522, 9897, -19355, -118187, 377999, 135459, 333309, 300641, -91122]
13027C16210B5J04493Q7219o3511J0904L68881a05973A47567J40353j00705r0698
13016I6517K76594A9401J65937L8207n0570J29242E1844c77593B04339f3059B4428
13004B86888j730F5371N7621m4550b98679B09574a4431A73168J80624B2627L20913
12993C43540b40245G5936L53630j37838a50212A02162D0637Q1192C202b0793j48285
12982a69078A6109f7603A49678F5986J57809L17484B27012I3718a05009B5471
12971A5356J1172b07775A84882J23341O5590c3009k756I5462d7297l3701F2830
12959B60055a70705q0116A05516M4864L57747A95461l8301o9085J97758a62841
12948H7079a75159B37639h9481A2392J24227o1259i5484j85352F35K43517a87335
$$ y = [316210, 25, 104518, 191737, 128226, 139130, 508011, -105973, 147567, 287920, 187215, 96517, 373111, 19401, 185338, 223545, 172975, 302217, 51844, -377593, 204339, -63059, 24428, 286888, 285158, 65371, 122992, 78442, -298679, 209574, -14431, 173168, 353792, 22627, 343540, -240245, 75936, 429566, 291728, -150212, 102162, 40637, 121829, 3202, -20793, -169078, 16109, -67603, 149678, 65986, 223795, 541279, 227012, 93718, -105009, 25471, 15356, 26528, -207775, 184882, 308223, 373813, -33009, -35765, 95462, -47297, -80998, 62830, 260055, -170705, -250821, 105516, 150380, 508127, 195461, 157160, 88075, 285833, -162841, 87079, -175159, 237639, -89481, 12392, 136619, 75360, -95484, -280836, 635, 244152, -187335]
12936a36334A13769J20002A03009c05424A08803l6475k3187j2174e7315J6890
12926d0425p1880A202J61667a05444M7340b2967b051H9361L02264a78658j845
12915a80503F1152L5617D3242O5500b22437A31975B2721h6047j2023B75487j30110
12904A45377b16183e9431m7574A49945J75911A6117b08493j60713A57327P8103
12894B35430c6101B00875q0278a03752A80278a52949d0903C8357K06439C7417
12883A78547J52273A27959a56234c0328j4188A76024e7461A67471c4760B483J34884
12872A37367P2115l7740g1348A25017h3427c3509q2255j08883h0581j13191c8854
12860a03461G4788k7473J37104a26411A69145o4923g02A77408J95642f0491A02612
$$ y = [-136334, 113769, 233771, 103009, -305424, 108803, 72328, 49141, 36967, -57315, -40425, -112305, 1202, 162869, -105444, -58104, -22967, -2051, 89361, 391625, -178658, -180503, 61152, 96769, 43242, 108742, -222437, 131975, 22721, -86047, -98070, 275487, 145377, -216183, -59431, -107005, 149945, 325856, 16117, -208493, -369206, 157327, 235430, -36101, 200875, 120597, -103752, 180278, -152949, -40903, 38357, 244796, 37417, 178547, 330820, 127959, -156234, -30328, -44516, 176024, -57461, 167471, -34760, 2483, 137367, 209482, 171742, -71348, 125017, -83427, -33509, -115764, -224647, -80581, -193772, -38854, -103461, 74788, 47315, 184419, -126411, 169145, 104222, -702, 177408, 373050, -60491, 102612]
12848B40837F509N09174e8923b5252B9347K95067j31746g9861I0584f3175M512
12837e8663B0096L91164A01719J1580e18869A0708P3351a1849D5057R7295C053
12825C10725F6837a42355A96013I892d6624o6111M4693A82627Q9805m8288A08626
12813A33063n8920e587j0400B31777g316j954A51618b38613A0624a37799B78040
12801c39301J02754f709l6244j53883F3774J98568H1486g7384k15763h8427C65208
12789B62437j23642a64309B74988H1976M21430a53830b7281j86760J2449K8130
12779a73462Q2464d1955A70196J52165M8248a28911h893B79003h8757j04508b3762
12767a53449g600l776A50966j4118d5930k33519I7722a0898l0821n8989B62778
$$ y = [240837, 6509, 515683, -58923, -25252, 29347, 324414, 192668, -79861, 90584, -63175, -58663, 20096, 411260, 101719, 113299, -518869, 10708, 84059, -11849, 45057, 142352, 3053, 310725, 66837, -142355, 196013, 9892, -46624, -112735, -68042, 182627, 272432, 224144, 108626, 133063, 74143, -5587, -15987, 231777, -7316, -9270, 151618, -238613, 10624, -137799, 278040, -339301, -236547, -6709, -42953, -196836, 63774, 262342, 81486, -77384, -293147, -88427, 365208, 262437, 138795, -164309, 274988, 81976, 503406, -153830, -27281, -214041, -201592, -173462, -90998, -41955, 170196, 322361, 370609, -128911, -8893, 279003, -88757, -193265, -23762, -153449, -7600, -11376, 150966, 136848, -45930, -279449, 97722, -10898, -41719, -100708, 262778]
12755c17936K1670g2011k3498n9863A78166K9738b47380B09639g1993j53339F0467
12743B74250B2213c5815p9538Q290B37277r3382M61035b08045A02701J05721P7087
12732B85509J83271j53257I3626i3926d0095j6502A56536F5658g2525j44407k90719
12721e07651A13111A4909b7209k4826C00840A15607J84757d990A09226l2718j1144
12710F5364M0645M6918G2246K7108K80654d1781A74928L07153A88657L27053b5297
12698b7077a2869B21803p0597j6610Q2069A0842c08911A08810P2968G579c02248
12686A13871e0862k17296I3980a02057B08093A8485n269K80078C3154N4834a77281
12674A2646L49680a29365j97909A07162K49147j30487J10201a66039I176P9655
$$ y = [-317936, -296266, -72011, -95509, -155372, 178166, 207904, -247380, 209639, -71993, -225332, 60467, 274250, 22213, -35815, -115353, -107063, 237277, 143895, 604930, -208045, 102701, 208422, 285509, 468780, 315523, 93626, -93926, -40095, -56597, 156536, 65658, -72525, -216932, -507651, 113111, 14909, -27209, -52035, 300840, 115607, 300364, -4990, 109226, 76508, 65364, 106009, 152927, 72246, 99354, 380008, -41781, 174928, 482081, 188657, 515710, -25297, -27077, -12869, 221803, 151206, 134596, 216665, 10842, -308911, 108810, 181778, 7579, -302248, 113871, -50862, -268158, 93980, -102057, 208093, 18485, 13216, 293294, 33154, 87988, -177281, 12646, 362326, -129365, -327274, 107162, 356309, 225822, 336023, -166039, 9176, 88831]
12664H8831d7516C6804L36794G7000R678J08703b5100m330B8120J81337a84606
12652D36306c190A03289A7256m47K03048b93520A33504a92202G8581J7857f4910
12640b74447B75973a4173A3260P0953a5396j2218C02967B7344J33502K32759c831
12628C54384o4212L1459j03232a29656D09323p6399r2779n6502J5633J65035j49970
12617B14341C3478J0328J7883K3464M6651J31544a14503L5949o7543j71634B41720
12605D396a88956B87793G7159e969A85627G9012L8111L5586L28070E373J85973
12594A91346O8199a04092A21819J1443J67497G7853J78802K55097a56101a1269
12583f2257A18370c2546j72263f2105j66675B79397i2505A75065m9299c0146j42700
$$ y = [88831, -47516, 36804, 373598, 77000, 86678, 195381, -25100, -29430, 28120, 209457, -184606, 436306, -3190, 103289, 17256, 16809, 219857, -293520, 133504, -192202, 78581, 96438, -64910, -274447, 275973, -14173, 13260, 84213, -15396, -27614, 302967, 27344, 160846, 393605, -3831, 354384, 290172, 321631, 218399, -129656, 409323, 332924, 240145, 183643, 199276, 364311, 214341, 33478, 43806, 61689, 85153, 131804, 263348, -114503, -78554, -146097, -317731, 241720, 4396, -188956, 287793, 77159, -5969, 185627, 79012, 117123, 152709, 480779, 5373, 191346, 259545, -104092, 121819, 133262, 300759, 77853, 256655, 511752, -156101, -11269, -62257, 118370, -32546, -204809, -62105, -228780, 279397, -92505, 175065, 125766, -30146, -172846]
12572a72846B6603N3954A9852K35714b99677K280A79704f2774k23351I0987h3577
12560B84342b06279B7694b23155C21616b62187c8599A50311P7096A10338m1302
12550F9036O2755m3065E953L80041a76812D3478J07450a45531p1131D4326R9088
12539A43414a41826C73270C7764L42673j55230g7818b273B1590L16193E7052M9511
12528A06563R5702G731R1730m5121d22375b07113e3348m8442E8016h5345l1859
12517a17204D31816H8866a2893A5074g1058r6142m3475j87408A17521b28200A87889
12505D310R5411e5498q3249g535H4782b57834B4748d5137l48598J96153A59261
12493b3490C5964a2120k09568O4948L5120k1487I4228B8382J65271e1461B48322
$$ y = [-172846, 26603, 80557, 19852, 255566, -299677, -297397, 179704, -62774, -286125, 90987, -83577, 284342, -206279, 27694, -223155, 321616, -262187, -38599, 150311, 227407, 110338, 69036, 131791, 88726, 5953, 385994, -176812, 43478, 150928, -145531, -216662, 44326, 143414, -141826, 373270, 37764, 380437, 225207, -77818, -2273, 21590, 337783, 57052, 106563, 202265, 7731, 99461, 54340, -422375, -207113, -53348, -101790, 58016, -85345, -117204, 431816, 88866, -12893, 15074, -71058, -167200, -210675, -398083, 117521, -228200, 187889, 4310, 99721, -55498, -138747, -7535, 84782, -257834, 24748, -45137, -393735, -197582, 159261, -23490, 35964, -12120, -221688, -156740, -121620, -143107, 94228, 28382, 193653, -51461, 248322]
12481B21429I1044c23607A05160P0714E6325f8882A31953c01831A04008b48607
12470e9290A40343M7038c92524B63865F8856a85550a7642A58907b109A07257M3918
12459A51175h526j09355B30832M714K0543K9594A34717b9000B03901b48925A1912
12447c1787A4909J01116J52570C5624K0060K34351a02252M3643j47023m4135d8068
12435I0620k018O4524G4847g3116B41968a26372K951n4821A5661a97538I8604
12423a37503G2564m582a85584A45157L8806E9298o377N11118j75291q5739a32500
12411b09108A01220R2810J86606c77316a46392B1117r940K47106h2910F7317N5642
12400A22959a95934R4377M3479C4997M19602a899A38877i8520C5191M9448b67977
$$ y = [221429, 91044, -323607, 105160, 175874, 56325, -68882, 131953, -301831, 104008, -248607, -59290, 140343, 187381, -392524, 263865, 68856, -185550, -17642, 158907, -2109, 107257, 151175, -8526, -117881, 230832, 235546, 256089, 285683, 134717, -29000, 203901, -248925, 11912, -31787, 14909, 116025, 268595, 35624, 55684, 290035, -102252, -58609, -205632, -249767, -48068, 90620, 88602, 153126, 74847, -73116, 241968, -126372, -123421, -178242, 15661, -197538, 98604, -137503, 72564, 67982, -185584, 145157, 183963, 59298, 52921, 564039, 388748, 303009, -132500, -209108, 101220, 194030, 380636, -377316, -146392, 21117, 11177, 258283, -82910, 67317, 122959, -195934, -101557, -58078, 34997, 454599, -1899, 138877, -98520, 35191, 84639, -267977]
12388A21624h9488D8215N9078K9639F5030j7509M0394b25131I3637l3983c6872
12376b31138A74366c54610a0507B2744b79624A01934K36264I7904J73203a92177
12365i5503e810n067A658c39617J37320N8445g469j07973A12180n3422K71698
12354C30456a75520C0912i1510A90191k8281c1781J1126F4255c831l994j09403
12343a17228B67156O3003b34506q7280A02123D5410P8803B4314a10468k6760D4087
12331a05337J3640A0491J29924l9016J19316f0866m7302A84831c53664E4298g3812
12319C02806c6962A2537e741j85561j6757D1959J15950n6123a96412A50258n5287
12308I4971B5817b22886j26500a7901j94927b285D2486c01152h52o3244A331h7437
$$ y = [121624, -89488, 48215, 107293, 136932, 65030, 47521, 87915, -225131, 93637, 59654, -36872, -231138, 174366, -354610, -10507, 22744, -279624, 101934, 338198, 97904, 271107, -192177, -95503, -5810, -10877, 1658, -339617, -202297, -143852, -7469, -115442, 112180, 58758, 330456, -175520, 30912, -91510, 190191, 161910, -31781, -20655, 64255, -3831, -7825, -117228, 267156, 330159, -234506, -321786, 102123, 45410, 124213, 24314, -110468, -137228, 44087, -105337, -91697, 10491, 140415, 101399, 220715, -60866, -108168, 184831, -353664, 54298, -73812, 302806, -36962, 12537, -5741, -191302, -208059, 41959, 157909, 101786, -196412, 150258, 94971, 25817, -222886, -349386, -17901, -212828, -2285, 42486, -301152, -852, -64096, 1331, -87437]
12295B06676g6373b926l01124E9029K55017a29351D46430f8128B48054A9556J7529
12284C7085J44876N122n3106a02503C7648Q7680C6016a7168c763j09871M994H7986
12271A48778P1612m4212J10806d53645b4313A4565a0228D42856D8943a33455A08746
12259A25361N1546B2644R907K80063a89181C29284b23955B85624e1463B59368
12248a94036A72808J03488G0894B3027J26192a29473I7025A9598e922k10122A0956
12236A57112F1316J96006F2338B9787b13744A6242E767P8249K20744a98357E8549
12224B30326I5708J8138K58290r2938n0764l7984b5634C39578F2624J83268C7267
12212C2760i509C86853A15256C6925L06456A33524J70834d9346A82133J8938J70367
$$ y = [206676, -76373, -2926, -304050, 59029, 314046, -129351, 446430, -68128, 248054, 19556, 37085, 181961, 187083, 133977, -102503, 37648, 125328, 36016, -17168, -3763, -113634, -108640, 87986, 148778, 220390, 176178, 286984, -453645, -24313, 14565, -10228, 442856, 48943, -133455, 108746, 125361, 176907, 22644, 32551, 312614, -189181, 329284, -223955, 285624, -51463, 259368, -194036, 172808, 276296, 70894, 23027, 149219, -129473, 97025, 19598, -5922, -216044, 10956, 157112, 61316, 257322, 62338, 29787, -213744, 16242, 5767, 84016, 304760, -198357, 58549, 230326, 95708, 113846, 372136, 279198, 228434, 190450, -25634, 339578, 62624, 245892, 37267, 32760, -9509, 386853, 115256, 36925, 343381, 133524, 304358, -49346, 182133, 201071, 371438]
12201C71438A20912M4915b7938B58651J43001A93692K38274k05850E1941O7349
12191A19290m8286O2130c5942k3384B01711H9542J65324K9321F1502e9210G1231
12179B3854g8629A62728a63021G6775f7360A35139j2294a76043H5108J44699n0339
12168A79468a66427E8088Q4805J29961D599J08473h458B53874r9172m2910A4071
12156B82531H7056R8772a21419j85406A13848D3043b55031B05237L7468J76664
12146D19369A6737J79553k3548c9344J5387l22982A31210K6653a77540A85415
12135A32374a31116c8409F00382g3006b3932A54931K37845c70383J84995A08526
12124a19185O009c2874a3921k67083G090J00756a14134A32693a13924j18224B84581
$$ y = [371438, 120912, 165827, -27938, 258651, 401652, 193692, 431966, 226116, 51941, 119290, 71004, 133134, -35942, -59326, 201711, 89542, 254866, 284187, 61502, -59210, 71231, 23854, -78629, 162728, -163021, 76775, -67360, 135139, 122845, -176043, 85108, 229807, 179468, -166427, 58088, 142893, 272854, 4599, 113072, -8458, 253874, 154702, 111792, 14071, 282531, 87056, 185828, -121419, -306825, 113848, 43043, -255031, 205237, 242705, 419369, 16737, 196290, 172742, -39344, -23957, -346939, 131210, 157863, -177540, 185415, 132374, -131116, -38409, 600382, -73006, -23932, 154931, 392776, -370383, -185388, 108526, -119185, -113176, -32874, -13921, -281004, 7090, 107846, -114134, 132693, -113924, -232148, 284581]
12112G2074M81268b43574C3806L36316i9037B20247a05952A10553a3208A61518
12101B90333n2807G3473J28680a16392A97771o1080a76575B44557d9577j48471
12091a98048a878B27508h0400A42252n704e258j57420A13482l0982j8938J08185
12080A71747B0101f1487r5664E8938a68948B57125c46811b3799A24565c07202
12069B61355F0716C922J60919i4340k38851A8092K23594p9814Q1572d04481A0222
12057E7913N31597J67470O73239D82640B18074K8531a51932C92070j81474G4695
12046e3517n663B13377E9977h3838G9304l7371c50090E552a07545j43810A52035
12034A31619C8948J77979g1839F2524d53841I1601b54570A05710d7250E8695L4262
$$ y = [72074, 553342, -243574, 33806, 370122, -99037, 220247, -105952, 110553, -13208, 161518, 290333, 237526, 73473, 202153, -116392, 197771, 136691, -176575, 244557, -49577, -198048, -1878, 227508, -80400, 142252, 136548, -5258, -162678, 113482, 82500, 63562, 171747, 20101, -61487, -157151, 58938, -168948, 257125, -346811, -23799, 124565, -307202, 261355, 60716, 3922, 164841, -94340, -333191, 18092, 241686, 161872, 243444, -404481, 10222, 57913, 589510, 756980, 1430219, 482640, 218074, 246605, -151932, 392070, 210596, 74695, -53517, -59180, 213377, 59977, -83838, 79304, 41933, -350090, 5552, -107545, -251355, 152035, 131619, 38948, 216927, -71839, 62524, -453841, 91601, -254570, 105710, -47250, 58695, 92957]
12023I2957J4363a7553n4608F3514J02214d01065H1435e7244a6969j71918h8174
12011A35663a88446E0230a68007M7979A07914c63706c2r8078c0090j2252j46275
12000a88617F0352c5402p2810A22275K5952J92000a40569j50607M2492B56075
11989a44173l4509g7744i655E0120a61350P2998j49036b5692q1138A07950J32003
11978B39953E0818a11173L0321Q069A6137J17814g0383A5644a6412j74251G557
11966B06078m5047f0614k66822e2314j89233K6444D8724d0868j294p4146r1354
11955b07662a8331A09787K73576a94570R3681o62A43909b07031A05586J09723
11945B15309a86690j12968d0052A66015d4972J7650k067J4426n2234C06577q6564
$$ y = [92957, 107320, -17553, -72161, 63514, 165728, -401065, 81435, -57244, -16969, -188887, -88174, 135663, -188446, 50230, -168007, -120028, 107914, -363706, -32, -98110, -30090, -42342, -188617, 60352, -35402, -108212, 122275, 148227, 340227, -140569, -291176, -248684, 256075, -144173, -178682, -77744, -9655, 50120, -161350, -88352, -237388, -25692, -106830, 107950, 239953, 50818, -111173, -80852, -72783, 16137, 133951, -70383, 15644, -16412, -190663, 7557, 206078, 161031, -60614, -327436, -52314, -241547, -215103, 48724, -40868, -42162, -116308, -207662, -18331, 109787, 383363, -194570, -100889, -101551, 143909, -207031, 105586, 215309, -186690, -299658, -40052, 166015, -44972, -27322, -29389, -14963, -67197, 306577, 220013]
11934B20013a46509q1057B08607I6233a24784n6237L0416H6791i3049l6629I2885
11922B25227c09409A53221Q6741a63953M2794b8011A80730C3157f6502A82012
11911A92317a42804e3729a7363o805A11648c01150j13135A92280A4211R1616f699
11899A02106g7100E4702K79234A12157j6217A8990q726J42582b61727J5655H4084
11887B65714I2036J9837b9606E6030N0883b715C96416a49892A25921Q7362F2568
11875F0159a50998E4845a95092j90399a15345r1955C57479j55713d6451r9015
11865a45466A31303a96877n3889b6857C14622j29666A8875L10581A14649N4880
11855A69529b71318J1910B42926a68396c7197l52600a4500k8240B21594D9841
$$ y = [220013, -146509, -227566, 208607, 96233, -124784, -181021, -150605, 86791, -93049, -129678, 92885, 225227, -309409, 153221, 239962, -163953, -121159, -28011, 180730, 33157, -66502, 182012, 192317, -142804, -53729, -17363, -24168, 111648, -301150, -414285, 192280, 14211, 105827, -6699, 102106, -77100, 54702, 333936, 112157, 95940, 18990, 10264, 152846, -261727, -246072, 84084, 265714, 92036, 111873, -29606, 56030, 106913, -2715, 396416, -149892, 125921, 213283, 62568, 60159, -150998, 54845, -195092, -385491, -115345, -207300, 357479, 201766, -46451, -145466, 131303, -196877, -250766, -26857, 314622, 184956, 18875, 329456, 114649, 169529, -271318, -259408, 242926, -168396, -37197, -389797, -14500, -42740, 221594, 49841]
11844B33030b13239f4360j00461e3100l47574a50114n2302N8099G8246c6552J1118
11833b5434j82686L5002F9224Q5214b9028m0269r9292E5484d2900m33685A07066
11821d77700G1530e9116j67378f3498o2835r8475A79586b11746A67958a35055
11810a02144H8140J03929G3900a18968B53943b30587d3339D0928b78286J14801
11800a63485P18I4712c17391A21636d420n276j70888o5407B13854c20632f5827
11788b07345B1353e7227G0248b72280o714g0694j55487N9789j32393A4934a84790
11776h0634j48026B66917a94094h0906A29248a3459A74857d8269j95855I4939
11765e2731k1303L3659a1466j087A76570K6414f7700l9745G041L29178a47795
$$ y = [233030, -213239, -64360, -164821, -53100, -400674, -150114, -202416, -144317, 78246, -36552, -25434, -208120, -173118, 69224, 154438, -29028, -69297, -168589, 55484, -42900, -476585, 107066, -477700, 71530, -59116, -226494, -63498, -126333, -224808, 179586, -211746, 167958, -135055, -102144, 88140, 192069, 73900, -118968, 253943, -230587, -43339, 40928, -278286, -163485, -162767, 94712, -317391, 121636, -4420, -9696, -180584, -245991, 213854, -320632, -65827, -207345, 21353, -57227, 70248, -272280, -278994, -70694, -226181, -166392, -298785, 14934, -184790, -80634, -228660, 266917, -194094, -80906, 129248, -13459, 174857, -48269, -244124, 94939, -52731, -74034, -40375, -11466, -12553, 176570, 202984, -67700, -107445, 7041, 336219, -147795]
11753f7712A09715L3752h4404B75588d3910j17541A52873a35742A9827a52131
11742A68176o6748b3071l02955J2908B71698a88524e4554j44632m4914B5188J1450
11731C6638b18681C9286J30527a77208n0925J01091A78348F5836J4027c57748
11720c06558j60225F1620E061c1478j8582n8886d3380j15826A48877a62115f9119
11708b76639a20891A8564J67951J26410b52505A2919J51557B1185a03470d5121
11697a44811c5943r5001E4131o818a6686j96767d4973C43173b10875F7128a82356
11685A84291a52362f6444B04451h0259j6789I6029M6360b21466B03838F653i8523
11673d3468j24419A19206j6111a45755j55391E2551d5737j69967j27111e6075
$$ y = [-67712, 109715, 143467, -84404, 275588, -43910, -161451, 152873, -135742, 19827, -152131, 168176, 101428, -23071, -326026, -313118, 271698, -188524, -54554, -199186, -244100, 25188, 36638, -218681, 39286, 169813, -177208, -228133, -127042, 178348, 65836, 79863, -357748, -306558, -466783, 61620, 5061, -31478, -50060, -108946, -43380, -159206, 148877, -162115, -69119, -276639, -120891, 18564, 186515, 312925, -252505, 12919, 164476, 21185, -103470, -45121, -144811, -35943, -130944, 54131, 47313, -16686, -213453, -44973, 343173, -210875, 67128, -182356, 184291, -152362, -66444, 204451, -80259, -97048, 96029, 142389, -221466, 203838, 6653, -98523, -43468, -167887, 119206, 103095, -145755, -301146, 52551, -45737, -215704, -342815, -56075]
11662c12689A6297a9344m3732D70943A78214G3454c4405q7956E8050K86276A2702
11650a14092G2583K76683c8921D3190a33967j16120a14324C24516H1697a01910
11639A71556B7814J81580p9500a97693O5365j49626d6811B17874a44230e8316
11628D8781J46251b85960B30869K237a86934c5108A06734a5798B0439d332p8711
11617h3043L8051j3669H2093b92234F8409a66356B01645I0484d27065B49376a2123
11605A46830a57272J540o4279h2834n7078C0321L136c21096a6858j33573A5170
11593a59151e1107A9535e4442k8181L9055G1921l4399d6279A79565K66594j60963
11582B85196j32804f966l60111L8306b4360B69437b4658j60039M2456I2095j1874
$$ y = [-312689, 16297, -19344, -63076, 470943, 178214, 73454, -34405, -122361, 58050, 344326, 12702, -114092, 72583, 349266, -38921, 43190, -133967, -250087, -114324, 324516, 81697, -101910, 171556, 27814, 209394, 129894, -197693, -132328, -281954, -46811, 217874, -144230, -58316, 48781, 195032, -285960, 230869, 233106, -186934, -35108, 106734, -15798, 20439, -4332, -83043, -44992, -58661, 82093, -292234, 68409, -166356, 201645, 90484, -427065, 249376, -12123, 146830, -157272, -155732, -220011, -82834, -139912, 30321, 33457, -321096, -16858, -150431, 15170, -159151, -51107, 19535, -54442, -82623, -43568, 71921, 37522, -46279, 179565, 446159, 285196, 152392, -6966, -367077, -328771, -24360, 269437, -24658, -184697, -142241, 92095, 80221]
11571H0221l5183g8041C26114r9554A10874n1056a02745A89346I1187o456R4153
11560A78884a20237A6107a65873e4433B40920A02920d9738k26142Q884A56187
11549a48351A14843J8811A6805g6174B55724J25772D8315k170j4921a10521j41109
11538b51630G8523j587f0417I1293k149a41415o0639k1249H9561J1389J96696
11527B97646a08269A24112i070A17126e1721E9466h4927C08640a22548B66156
11516A41648c81697b1956B28734I6420j1498l6520K4982l473O7075j6873K14365
11505C34478o7496P7243b9266B07645d6895B48382F4301K91274A44041n9508P606
11494I2139a33404A43935b9458F1752M4488M2623M277K0482G5198N0589n4538
$$ y = [80221, 45038, -78041, 326114, 226560, 110874, 59818, -102745, 189346, 91187, 84731, 178884, -120237, 16107, -165873, -54433, 240920, 102920, -49738, -275880, -266996, 156187, -148351, 114843, 133654, 16805, -76174, 255724, 381496, 48315, 46145, 31224, -110521, -251630, 78523, 76936, -60417, 91293, 89144, -141415, -202054, -223303, 89561, 100950, 297646, -108269, 124112, -9070, 117126, -51721, 59466, -84927, 308640, -122548, 266156, 141648, -381697, -21956, 228734, 96420, 84922, 48402, 73384, 69911, 136986, 120113, 334478, 266982, 344225, -29266, 207645, -46895, 248382, 64301, 355575, 144041, 84533, 92139, -133404, 143935, -29458, 61752, 106240, 148863, 153140, 173622, 75198, 125787, 71249]
11483G1249L27948a11066H0485P3383b1196A903e4245G0544L7709b34369B01073
11471B3645L9708P6775c5063A03085J71225G258b85997B44026K50868C1687c9676
11459C4254J32464p5558a58835B98715D3256j8087a11367r3840C70699I3142K12738
11448C05880a11208h910A09944b1941r8054M0045j76566B03600c7446J0037j76968
11437b04377B54948m0757b30993D5717a25936A85147k7971b63027C7370K07591
11427B44961d76326c4722m0348j48132A4860a64189L3631j04900D0068c0393A02354
11415B68896C5613c12062H902Q9726P4647R4121a09354G3285J13864J14414a36417
11403a05535E8685O3668o011M1952d0297k61997a4335k79802c3410F6535J94884
$$ y = [71249, 399197, -111066, 80485, 153868, -21196, 1903, -54245, 70544, 108253, -234369, 201073, 23645, 63353, 140128, -35063, 103085, 274310, 7258, -285997, 244026, 494894, 31687, -39676, 34254, 166718, 91160, -158835, 298715, 43256, 25169, -111367, -205207, 370699, 93142, 305880, -111208, -8910, 109944, -21941, -119995, -79950, -256516, 203600, -37446, -27409, -204377, 254948, 214191, -230993, 45717, -125936, 185147, 157176, -263027, 37370, 244961, -476326, -34722, -75070, -223202, 14860, -164189, -130558, -235458, 40068, -30393, 102354, 268896, 35613, -312062, 8902, 98628, 173275, 267396, -109354, 73285, 187149, 301563, -136417, -105535, 58685, 122353, 116342, 158294, -40297, -302294, -14335, -294137, -33410, 66535, 261419]
11392B61419A22844a77518O7959B83337E4975Q3746k5318K21332g2956M891k0777
11381h8842j61683f4177A85627m9992m4443b46437C1237b52073G3474f5675n230
11370g0905o3783B93346i4823M3241k04787J02944A27625h8520b0308B21011k9026
11359A91985b9025j48661g7245j04759C9406g5595C43269H4114B4443g8700j96220
11348b74920b1668L668o6918A02388f3114K001l10043a36236E4444b6439B77357
11336F3319J73066Q1165d4386p8212A12573I782J19116a55723A55728c0628k6163
11325e6791p7645C9391a72241h4308k8019b4000k13223C02690b18010Q7169k07415
11314c38256e3731j98849A73690a36145e2432K3436r9913D1492K56116A38945
$$ y = [261419, 122844, -177518, -109559, 283337, 54975, 138721, 113403, 334735, -72956, -68065, -88842, -250525, -64177, 185627, 135635, 91192, -246437, 31237, -252073, 73474, -65675, -70905, -134688, 293346, -94823, -51582, -256369, -153425, 127625, -88520, -20308, 221011, 191985, -29025, -177686, -77245, -182004, 39406, -75595, 343269, 84114, 24443, -78700, -274920, -21668, -18000, -84918, 102388, -63114, -61113, -371156, -136236, 54444, -26439, 277357, 63319, 236385, 317550, -44386, -122598, 112573, 9782, 128898, -155723, 155728, -30628, -56791, -134436, 39391, -172241, -84308, -112327, -24000, -237223, 302690, -218010, -130841, -338256, -53731, -252580, 173690, -136145, -52432, -28996, -128909, 41492, 297608, 138945]
11303F7048Q9484j4286n6257a39460F1633G098a28126k325l9984D5799g9019a4684
11290G2222e3037i983A8528c91171J91469P5365A13534b13592d7350A64557L2316
11279A96873r1251e8032j40549B20158c2707l47655c8266j81936j6124j21697
11269c58023a26432a592j50169c7790B61149E4243a16171A15837g8422C3012a22033
11257A63635a12846g143C10399b63863C6524J9365M8234f4810A72520b9777j21632
11246a51409k17759J16544L5025O4881A53988i6217d0799A23793b5417l20291
11236c45708J47339f6088a7024j42646H9390d29829a92946j55559C6168g0309
11225b96458j44078a3438j82262j6495M6871k7807B00877c8796A26902M8280R1287
$$ y = [67048, 156532, 142246, 85989, -139460, 61633, 7098, -128126, -130451, -170435, 45799, -79019, -14684, 72222, -53037, -9983, 18528, -391171, -199702, -124337, 113534, -213592, -47350, 164557, 196873, 105622, -58032, -198581, 220158, -32707, -380362, -38266, -220202, -236326, -358023, -126432, -1592, -151761, -37790, 261149, 54243, -116171, 115837, -78422, 33012, -122033, 163635, -112846, -7143, 310399, -263863, 36524, 55889, 104123, -64810, 172520, -29777, -151409, -369168, -252624, -217599, -152718, 153988, -96217, -40799, 123793, -25417, -345708, -198369, -66088, -17024, -159670, 89390, -429829, -192946, -348505, 36168, -70309, -296458, -440536, -13438, -195700, -212195, -165324, -193131, 200877, -38796, 126902, 175182, 266469]
11214B66469e02374a45919K0232k5144J0781n0858B61407a40151M6203B21536
11203c32171J45443O756H4083a41690C2637D689R8945c51759J4958A66799d5787
11191a68678j14900I3043a58668O4777k35804O3630B5631J88176h2660p1953o9367
11180b23980R6530A43424d07731c3505A05178B2013a87123G4819c41124J66857
11170a74267B55978A23083N6839k742g7366l14909A398i0314A6199b7257B2017
11158a61124D1058e5220B56918J9981a76152r9713a25617B57837E3660a34184
11147A98259b03773A53507d48539A07383g2042l43012a4909C1447a52372A14004
11136i6830B0122d08713i3063k96343F6037K48777H4999e8468j12146B50152r4008
$$ y = [266469, -502374, -145919, -125687, -150831, -140050, -190908, 261407, -140151, -93948, 221536, -332171, -186728, -179972, 84083, -141690, 32637, 4689, 103634, -351759, -336801, 166799, -45787, -168678, -283578, 93043, -158668, -93891, -329695, -266065, 25631, 213807, -82660, -154613, -223980, -127450, 143424, -407731, -33505, 105178, 22013, -187123, 74819, -341124, -174267, 255978, 123083, 179922, 177180, -77366, -392275, 1398, -90314, 16199, -27257, 22017, -161124, 41058, -55220, 256918, 276899, -176152, -275865, -125617, 257837, 53660, -134184, 198259, -203773, 153507, -448539, 107383, -72042, -415054, -14909, 31447, -152372, 114004, -96830, 20122, -408713, -93063, -389406, 66037, 314814, 84999, -58468, -170614, 250152, 156144]
11125A56144k553J6082B6673D311J00836K15846c2824j99049A58390o9484k9563
11114E9343d012r0692F6963a79622O0199B8488a13871B98028e4239r1679A12014
11102E72Q3669K83331a02548D16912j16502j26579b17153C21966j4215k5496B2706
11090a04123C4628M5257K27564o0987H2651L21M32020k09300i6267A1355J17931
11079A29286N5540N51C3145J38729J68164o7751A20567c1976D43509J77658D0319
11067E66416B20646d4051A48260J63760J5701L2671A54101K84446L13551B54225
11056D10893J65872J50734k83658Q7340j28370J80667Q3030J14822l31110K5095
11046D75315L13897L3849l27899K59724L1222j62356N5010J92586j53926K06697
$$ y = [156144, 153591, 169673, 26673, 4311, 105147, 320993, -32824, -231873, 158390, 88906, 59343, -4012, -94704, 66963, -179622, -119423, 28488, -113871, 298028, -54239, -145918, 112014, 572, 84241, 367572, -102548, 416912, 300410, 173831, -217153, 321966, 307751, 282255, 22706, -104123, 34628, 79885, 307449, 246462, 82651, 82972, 514992, 305692, -96267, 11355, 129286, 184826, 185377, 33145, 171874, 340038, 272287, 120567, -31976, 443509, 621167, 40319, 566416, 220646, -44051, 148260, 312020, 327721, 360392, 154101, 438547, 752098, 254225, 410893, 576765, 727499, 443841, 531181, 402811, 583478, 666508, 781330, 450220, 475315, 789212, 823061, 495162, 754886, 786108, 623752, 678762, 871348, 717422, 924119]
11036I24119k44864K9351j54751K29154j93066n171o710k1484R8893l8605K78874
11025H95740j57081Q9701j70781j61006j45379L58928l41093J16034k01402J24699
11015D08360J19946N6170J57665C25613K02327j15505O00258k36122B32347K03034
11005D35381L17213C20791J68781j07916M37162k24400B90185L08015r7323k7306
10995D73571J91262k56842L35142j26577R902K66750L4998K9947k83041J17498
10985G92610J9259O566J5571J35370p767K13601k66105K45703K68440m8956N07830
10974A882122j72060M61484L51782J26489n67504M38895M1172k86747p0982q2041
10964B122610p08951q204l441m75979K50375J62964m65799M38019k27432k05841
$$ y = [924119, 679255, 708606, 553855, 783009, 589943, 584772, 578062, 556578, 655471, 616866, 895740, 738659, 828360, 657579, 496573, 351194, 710122, 369029, 485063, 283661, 408360, 528306, 584476, 742141, 325613, 527940, 412435, 1012693, 776571, 232347, 435381, 752594, 320791, 489572, 381656, 818818, 594418, 290185, 598200, 500877, 473571, 664833, 407991, 743133, 616556, 626458, 893208, 928206, 958153, 675112, 792610, 811869, 818435, 834006, 969376, 961609, 1175210, 909105, 1154808, 1423248, 1374292, 1882122, 1710062, 2171546, 2523328, 2649817, 2082313, 2521208, 2562380, 2275633, 2204651, 2122610, 1413659, 1405455, 1402014, 926035, 1176410, 1339374, 873575, 1311594, 1084162, 878321]
10954H78321J07959J19719j56768m51019K1949B11524K58521O1674j15023B01268
10943B68382O5695P0417j66978l3584K00348j51077J34407A51857d0556A90164
10932A22552R9597a39638B02370c5862B18775F8457K03132o5480f9611d102j05144
10921a09246j66450a35916a9861B6186h8669F17K05522i4412B67847A05647e5704
10909F0520a05638b3111B16352a78994F3391i700D96307a94072A69688H3181b29021
10897b09878B6541a65146C10954b29554N239L3517f6801B56608b71226F3620M8710
10886A12330n0474h1019j50128B68088F4413b9100k12901l1792B42376I5973a91401
10874A79348f46913a90386O1480j14873a17675A62145b17305F7724a3314A68694
$$ y = [878321, 986280, 1105999, 949231, 498212, 520161, 211524, 470045, 531719, 416696, 201268, 268382, 334077, 404494, 237516, 203932, 404280, 253203, 387610, 151857, -40556, 190164, 122552, 222149, -139638, 202370, -35862, 218775, 68457, 271589, 206109, -69611, -4102, -109246, -275696, -135916, -19861, 26186, -88669, 617, 206139, -94412, 267847, 105647, -55704, 60520, -105638, -23111, 216352, -178994, 63391, -9700, 496307, -194072, 169688, 83181, -229021, -209878, 26541, -165146, 310954, -229554, -224315, -190798, -66801, 256608, -271226, 63620, 112330, 61856, -81019, -231147, 268088, 64413, -29100, -242001, -273793, 242376, 95973, -191401, 179348, -646913, -190386, -128906, -243779, -117675, 162145, -217305, 67724, -13314, 168694]
10863b68147L0168c4594m140j01660H005a7240j99724I517K52734A3785L597c83202
10850D92805a49539I7343q7c39039A9306i6566A48538Q6784B4886J52721g0280
10838B19767b7913l06119B17271A3478J46561a587k28247C92316g6363A61817
10827b06200F6373g7298L6832j0340l14055B49133f2399B00334p5007K63783a21791
10815b59350O114a217l36985J53759A06740p058f0059A43020d28875A20732b79391
10803A33761a11171e1093p4594a7137m1481j13623a5311j26190H545Q9604b07516
10791c6707k0123A05055A3494c15817c3574B85310H8294J19126D830c81267A14549
10779A39110p692J10783B3445a23285k20965f0730B14257a04673j12030j4112
$$ y = [-268147, -237979, -34594, -38734, -140394, 8005, -17240, -216964, 9517, 262251, 13785, 17382, -383202, 492805, -149539, 97343, 97256, -339039, 19306, -96566, 148538, 235322, 24886, 177607, -70280, 219767, -27913, -334032, 217271, 13478, 160039, -1587, -229834, 392316, -76363, 161817, -206200, 66373, -77298, -40466, -50806, -364861, 249133, -62399, 200334, 125327, 389110, -121791, -259350, -253236, -1217, -338202, -184443, 106740, 99682, -60059, 143020, -428875, 120732, -279391, 133761, -111171, -51093, -125687, -17137, -58618, -172241, -15311, -141501, 8545, 98149, -207516, -36707, -56830, 105055, 13494, -315817, -33574, 285310, 88294, 207420, 4830, -381267, 114549, 139110, 131418, 242201, 23445, -123285, -344250, -60730, 214257, -104673, -216703, -230815]
10769b30815b6374H0429i1510B74370c15752L9241o709A75216b6042g313H667
10757b78300b2560B6066K03781g9551k25127G8606a10955k37070h766j97931n660
10746b12357j16604C45360i4426A45197o2684b5787k86547A30626k9661d4451
10735A24314D2572a37118H8127b54534B35033d38077i1128I6640A9783R8350a09367
10723c3051I0050a63124A47996a68730j757C1705c19844C4472j0247a50259G587
10711b14655e822q109j1954E4915b37310A56738a37963m9163F2359g0649l31364
10700d02013J79641G4509r909a19491I4183d03484D16402j19422a17917j16266
10690b34183Q5523J1219B24951R2296A12413J39248a84326k52620g5973j26587
$$ y = [-230815, -26374, 80429, -91510, 274370, -315752, -276511, -283220, 175216, -26042, -7313, 8667, -278300, -22560, 26066, 229847, -79551, -304678, 78606, -110955, -348025, -8766, -206697, -212357, -328961, 345360, -94426, 145197, 82513, -25787, -312334, 130626, 100965, -44451, 124314, 42572, -137118, 88127, -254534, 235033, -438077, -91128, 96640, 19783, 118133, -109367, -33051, 90050, -163124, 147996, -168730, -170487, 31705, -319844, 34472, 24225, -150259, 7587, -214655, -5822, -13931, -25885, 54915, -237310, 156738, -137963, -187126, 62359, -70649, -402013, -222372, 74509, 64600, -119491, 94183, -403484, 416402, 296980, -117917, -234183, -148660, -137441, 224951, 317247, 112413, 251661, -184326, -436946, -75973, -202560]
10680b02560p0324E7468b2181F8222c9678j74657B19407a92755P5000p1999d8100
10668a74227l2360h0763I5902g4705F5157A9150a07466b6066j90692h7350d1123
10656c3771A98652M2681h3516l3420j4103A75813m2944c62k14256A02510a24425
10644c11222g3023k2932q6668J8738g1591o2753j10229H413h3745o4713A37067
10632d18556A97586c6242A5539d51469C2339b69002A4848c98097f4065D5229K7446
10621G2675N7376h4647o2492m226j94210f2052b8424D555d2465j19935j60434
10610c22834A40328I707Q7600a10678k0746j44599i6257k19769A31866Q1409a82653
10598B11329b21907j17J2840h9160F1672K08737f7927j26031k4553i2226l01342
$$ y = [-202560, -272884, 57468, -22181, 68222, -39678, -214335, 219407, -192755, -117755, -189754, -48100, -174227, -206587, -80763, 95902, -74705, 65157, 19150, -107466, -26066, -216758, -87350, -41123, -33771, 198652, 241333, -83516, -116936, -131039, 175813, 132869, -362, -214618, 102510, -124425, -311222, -73023, -95955, -182623, -163885, -71591, -134344, -244573, 8413, -83745, -148458, 137067, -418556, 197586, -36242, 15539, -451469, 32339, -269002, 14848, -398097, -64065, 45229, 72675, 130051, -84647, -147139, -151365, -345575, -62052, -28424, 4555, -42465, -162400, -322834, 140328, 9707, 97307, -110678, -131424, -276023, -96257, -316026, 131866, 213275, -182653, 211329, -221907, -222024, -209184, -89160, 61672, 270409, -67927, -193958, -218511, -92226, -393568]
10587c93568a73367E5888a36214G5010J94688c15905Q1068A35726a71771P0077
10577a01694A38746J75986a88041k8143c3564m175B94406a77583Q6804B46367
10566a27968A30573g9599A65009i8176k08970D2817a74703k78994i6817l3272
10556a30089C9661A6986b33679a04596k31225B4408b29969A58158c1264B02959
10545a66930O5568D5609a55718f9197B83253H0491J38958r425q7523h3858B8149
10533A6464d3915j93309i4623j31935g6923c3968D7337c37275F233L3359a97056
10521h1143B10523b85293a14951j77779e9298G5351C317a78478I7776a32502k7074
10510a59576j1912Q4099A40919c19875H0497J11048H4321l6245b71308a07182
$$ y = [-393568, -173367, 55888, -136214, 75010, 269698, -315905, -234837, 135726, -171771, -101694, 138746, 314732, -188041, -216184, -33564, -37739, 294406, -177583, -90779, 246367, -127968, 130573, -79599, 165009, -98176, -307146, 42817, -174703, -453697, -96817, -130089, 39661, 16986, -233679, -104596, -335821, 24408, -229969, 158158, -31264, 202959, -166930, -101362, 45609, -155718, -69197, 283253, 80491, 219449, 210024, 122501, -83858, 28149, 16464, -43915, -237224, -94623, -226558, -76923, -33968, 47337, -337275, 6233, 39592, -197056, -81143, 210523, -285293, -114951, -292730, -59298, 75351, 3317, -178478, 97776, -132502, -159576, -171488, -87389, 140919, -319875, 80497, 191545, 84321, 48076, -271308, -107182]
10499c6349n6482l02523A69262D8135c70221N9520C44701A25411b36632J12697
10489a23935j21172l7453b3691A59278G1574f932E2345J15112b17640B14419H876
10477B516a69836o5792A49274J94222L5198e158B46308n1343D2233J76637o79
10466B18191d9201m78050a36529A56380B7591h1281D1044c3516q6031k8667D2688
10454i8281A35652a84372j0917H9687e68302E0105a90912j08409g7955a7886j0361
10443b8247E06351b6058C0690i0638k29789C4525a3540l43794Q5112E0776M6108
10432I6884a26813a7947D33559g9603A8530a31816B878a02754B2486b33540B33142
10420b70174J801A28688a93672F2076L3218K5637P2643n4925m7161a00407k2192
$$ y = [-36349, -92831, -395354, 169262, 48135, -370221, -310701, 344701, 125411, -236632, -123935, -245107, -282560, -23691, 159278, 71574, -6932, 52345, 167457, -217640, 214419, 8876, 2516, -169836, -235628, 149274, 343496, 378694, -5158, 246308, 194965, 42233, 218870, 218191, -49201, -527251, -136529, 156380, 27591, -81281, 41044, -33516, -119547, -148214, 42688, -98281, 135652, -184372, -195289, 89687, -568302, 50105, -190912, -299321, -77955, -17886, -28247, 506351, -26058, 30690, -90638, -320427, 34525, -13540, -357334, -272222, 50776, 96884, -126813, -17947, 433559, -79603, 18530, -131816, 2878, -102754, 22486, -233540, 233142, -270174, -268373, 128688, -193672, 62076, 95294, 120931, 193574, 138649, 91488, -100407, -122599]
10409a22599c7764j82772p726J0608A26644b0928A88387N9423Q2214d7105A10945
10397C62004B4683c0974I7873R7367K7167d898j6333o3814E9214K55595A34202
10385D015K99787k8974N1819F8528J47264J37329o2714j11962J22943O4902J64146
10374E30436c49099B24018I9083R6155M32568k02248j19906j11589J64470K29479
10364E88012B28589K75050j37887j19919m6683C3001J30707J44822A11180K62717
10354C73897B5929a26589D58720j88874M66122e7412B71031L3563j36164R4270
10344B62700j11917J7939L929q1110K11194j02104N3974q9296F0886L47857b40058
10332a57782A70226J58376p1833b5328B4484b6759m0001j08168f4401l4523C79986
$$ y = [-122599, -37764, -220536, -228262, -217654, 126644, -20928, 188387, 247810, 330024, -47105, 110945, 362004, 24683, -30974, 97873, 195240, 222407, -4898, -21231, -85045, 59214, 314809, 134202, 4015, 303802, 274828, 326647, 68528, 215792, 353121, 290407, 178445, 301388, 366290, 530436, -349099, 224018, 99083, 195238, 627806, 425558, 305652, 194063, 358533, 588012, 228589, 503639, 365752, 245833, 199150, 33001, 163708, 308530, 111180, 373897, 25929, -126589, 458720, 269846, 735968, -57412, 271031, 304594, 168430, 262700, 150783, 168722, 172651, 91541, 302735, 200631, 254605, 165309, 60886, 408743, -240058, -157782, 170226, 328602, 256769, -25328, 24484, -26759, -66760, -174928, -64401, -98924, 379986]
10320A62080a7774A78783Q7915C8468a84983M5639A5000a82563A83668o3928J69838
10309B89578d3390p1700C22017F6557J42413a47952j36657J16829p6667C81958
10298e3680A18625l3755d19596C9475c4191C5701c41346g1360A06470c86273d0587
10286a50253j80554A51192J14301i7263l23611d6590j44176A13821c54977D1449
10275B4915m326K03878E6103a7358q44A14148c28700H129P7994J00410i6697B2369
10262A76629H2740c5908B70789h3066B44576g7040A52745O4661j02798k0374o400
10251H7834m0506g7417E49663b579B3200b43041a08707D25416A00517b3985B34618
10239h825p2394r7191Q7803K661k5144D4391J0914h2003C14584c75842H2679a79439
$$ y = [162080, -17774, 178783, 266698, 38468, -184983, -139344, 15000, -182563, 183668, 119740, 289578, -43390, -115090, 322017, 66557, 208970, -147952, -284609, -167780, -244447, 381958, -53680, 118625, 84870, -419596, 39475, -34191, 35701, -341346, -71360, 106470, -386273, -40587, -150253, -330807, 151192, 265493, -97263, -420874, -46590, -190766, 113821, -354977, 41449, 24915, 20589, 224467, 56103, -17358, -18202, 114148, -328700, 8129, 86123, 186533, -96697, 22369, 176629, 82740, -35908, 270789, -83066, 244576, -77040, 152745, 217406, 114608, 94234, 87834, 47328, -77417, 549663, -2579, 23200, -243041, -108707, 425416, 100517, -23985, 234618, -8825, -81219, -178410, -90607, -87946, -113090, 44391, 55305, -82003, 314584, -375842, 82679, -179439]
10226c42449a42323E750g943j5866j1220m6218J9799K6144A02652e0392A65905
10214A0397g1477L2050n7860K5943j00158n1912n9450B0404i293j71707M0325
10203a40675H2597b52080P4568o7030B32767p9635c44850A235a73650N579A71642
10191e7813H1802k4750b45711r2056a2572l650G8323a09936n5950B28803A07187
10179A00364a45000l3557A70227A6961b52275a02381l10659a38306f0071C08818
10168E8648c51344B78017D9406b61329E5908b28543O6251b2294j64495j4764E3787
10156A84008b1026A48391c95683C60362f4010k94496a79092o8062E8894a30581
10145C4317J06323a56394f5373H3620e6751A36420b54618A1660b49149B626d14404
$$ y = [-342449, -142323, 5750, -7943, -23809, -35029, -81247, -61448, -35304, 102652, -50392, 165905, 10397, -71477, -39427, -97287, -71344, -171502, -223414, -282864, 20404, -9293, -181000, -140675, 82597, -252080, -177512, -244542, 232767, 153132, -344850, 1235, -173650, -168071, 171642, -57813, 81802, 57052, -245711, -337767, -12572, -16222, 78323, -109936, -165886, 228803, 107187, 100364, -145000, -178557, 170227, 16961, -252275, -102381, -413040, -138306, -60071, 308818, 58648, -351344, 278017, 49406, -261329, 55908, -228543, -162292, -22294, -186789, -201553, 53787, 184008, -21026, 148391, -395683, 360362, -64010, -358506, -179092, -247154, 58894, -130581, 34317, 140640, -156394, -65373, 83620, -56751, 136420, -254618, 11660, -249149, 2626, -414404]
10133D1289a0678j69612k1519B3952a52474B69682c3857k28820d5641A60194i6575
10121g6356e01A20018D0060f8439j86284a5563B8659J23049b313m71666A37375
10109c11281B3967a50540a7149A96403H3789b52863m8087n6030I2903a78982K8549
10098a50433j64155A66237g2747H0527b26758c6272j56009B61874a62226A2752
10087d60206e0164G4079J45433i0147A81367N974k6862c2173q5831e1955p7451
10076a29406B52310j13241b02724C6064a77648j62655a30292H1177O3929F710
10065B5621Q4616a36594H3563P7129g2258A2510d1727I7442a51937r7109B5484
10053d5004o7854a6283C71330b96930J08921B02458e4357A56092b01850C7147
$$ y = [41289, -10678, -180290, -201809, 23952, -152474, 269682, -33857, -262677, -45641, 160194, -96575, -76356, -501, 120018, 40060, -68439, -254723, -15563, 28659, 151708, -2313, -473979, 137375, -311281, 23967, -150540, -17149, 196403, 83789, -252863, -300950, -356980, 92903, -178982, -150433, -314588, 166237, -72747, 80527, -226758, -36272, -192281, 261874, -162226, 12752, -460206, -50164, 74079, 219512, -90147, 181367, 187341, 160479, -32173, -118004, -51955, -129406, 252310, 139069, -202724, 36064, -177648, -340303, -130292, 81177, 145106, 6710, 25621, 110237, -136594, 83563, 160692, -72258, 12510, -41727, 97442, -151937, -249046, 25484, -45004, -112858, -16283, 371330, -296930, -188009, 202458, -54357, 156092, -201850, 37147]
10042G1782A9983b72122m7998B17057A03224E0009J0451O3651b21561p1257J19236
10031a73582N8402A35464a91992F2251a12236k45790G4608g8734D25458b59140
10020b30542R5942A94991d9263j75315a06510B7648a82284c2787j90582B23378
10009b19511m8768P6154q4850J9209A281J7415c00255A14141b79036C14826a75197
9997H408a48894j9623J9504N4520k2278j02728M0266N9862p3444B49767E7862
9985i1203j01765b2683C44846H1216J58299a0524D3239b31437A1548a35153A28142
9973f2882n5687B0520a37408O4828n4110B19559A2185D313c8485A5264M0080e4497
9960D21128b32535N5143B6383P77a58714A82334o1681b30446k9904E760b9909
$$ y = [71782, 19983, -272122, -320120, 217057, 103224, 50009, 60460, 124111, -221561, -292818, -173582, -115180, 135464, -191992, 62251, -112236, -358026, 74608, -78734, 425458, -259140, -230542, -134600, 194991, -49263, -224578, -106510, 27648, -182284, -32787, -223369, 223378, -219511, -268279, -192125, -276975, -257766, 1281, 18696, -300255, 114141, -279036, 314826, -175197, 8408, -148894, -168517, -149013, -94493, -116771, -219499, -179233, -119371, -192815, 249767, 57862, -91203, -192968, -22683, 344846, 81216, 239515, -10524, 43239, -231437, 11548, -135153, 128142, -62882, -118569, 20520, -137408, -72580, -126690, 219559, 12185, 4313, -38485, 15264, 55344, -54497, 421128, -232535, -177392, 26383, 27160, -158714, 182334, 120653, -230446, -260350, 5760, -29909]
9948d326B12164b36265D8053b3209p4624j9886B53875F128c24031A13606l82c02163
9935a05980I682d09184A57879c84260a68856K3686D82743a70825J6420A68157
9924i0583m3731j48936a27566j60067J7600d9221H9136o535e17578a82223J1856
9913a70367K2363C3233b32157K1117A86437p5527A1354J48617b12245k40666J75797
9902b77114B7208c25091G3293a22136E3971f2261D2289K6594a14903K9722l16671
9891d01852A53738C2709a08778r8008A45980b49072O1518P0170F564b65849B73979
9879A97499C9801N3862J73670c90444C7092a71637A86548j2744a88328i2528j88067
9868b80595A40998a27270k00030A41939a77502j32421J14000A06652c09608J07158
$$ y = [-4326, 212164, -236265, 48053, -23209, -97833, -117719, 253875, 6128, -324031, 113606, 113224, -302163, -105980, 9682, -409184, 157879, -384260, -168856, -145170, 482743, -170825, -154405, 168157, -90583, -134314, -283250, -127566, -287633, -270033, -49221, 89136, 82601, -517578, -182223, -170367, -148004, 33233, -232157, -211040, 186437, 110910, 11354, 159971, -212245, -452911, -277114, 27208, -325091, 73293, -122136, 53971, -62261, 42289, 68883, -114903, -85181, -401852, 153738, 32709, -108778, -206786, 145980, -249072, -187554, -117384, 6564, -265849, 273979, 197499, 39801, 93663, 267333, -390444, 37092, -171637, 186548, 173804, -188328, -92528, -280595, 140998, -127270, -327300, 141939, -177502, -309923, -195923, 106652, -309608, -202450]
9858b02450D3504N7463C688a47348k11446P9393e4492j23162h0420j53137a1187
9846F9851a02226k00625k5871J61856b6675A96153c30168a19966G8671a55298
9835a11654B19313j02788a03462j08816r139A58721k2768l9845J05480b18284
9824c6781F7859a00217I62J71427b13482P3365j95090a36860G9574b49257Q6640
9813a62617j01250H6204N486J29104b5746j02945D19875I6866a31781p3375d2243
9801F6154j7423B0913a00708H3329a5454A7380a93435L2031B5023c63502H9889
9789d6766j78582f2976B00790G5045a24337l7258k70824A54956b57857n8709J26322
9778a90244J6250k20259A38109c62694N9020J0031c5411j75030f6905g038A89773
$$ y = [-202450, 43504, 100967, 3688, -147348, -358794, -279401, -54492, -177654, -80420, -233557, -11187, 69851, -102226, -302851, -328722, -166866, -26675, 196153, -330168, -119966, 78671, -155298, -111654, 219313, 116525, -103462, -212278, -221417, 158721, 135953, 96108, 201588, -218284, -36781, 67859, -100217, 962, 172389, -213482, -140117, -335207, -136860, 79574, -249257, -162617, -263867, 86204, 91690, 220794, -25746, -128691, 419875, 96866, -131781, -205156, -42243, 66154, 48731, 20913, -100708, 83329, -15454, 17380, -193435, -161404, 25023, -363502, 89889, -46766, -225348, -62976, 200790, 75045, -124337, -161595, -432419, 154956, -257857, -316566, -190244, -173994, -394253, 138109, -362694, -303674, -293643, -35411, -210441, -66905, -7038, 189773]
9766E5775a32922j76020p8309c103B02529C0983M1634b27837F2218c3261A74701
9754c116l1301A459a06731B77502a64210O3488k86188f8085k51484A31442a38925
9742c7452b198j28446k14092J29682l8464K5117k5703o0430r8521A38722Q659
9731A47381m3356e3050j36391E0753b96193b6184A90015b36067B02801D2853i4068
9719e3999m3595c0194A41933e3563C9695e5809J8282G72b16549e0621G096N8784
9707F5880c77304c8824j76233j43378J31085b0252r4910L5354B4330b596j77483
9696a80079j5285A1824c08535J17014Q1581C045a40020f8857j79646h9865g356
9684E0458P7517b19666j91515B65342a16324C26500A16793a25501j54468J23184
$$ y = [55775, -132922, -308942, -387251, -3103, 202529, 30983, 72617, -227837, 62218, -33261, 174701, -3116, -34417, 1459, -106731, 277502, -164210, -100722, -386910, -68085, -319569, 131442, -138925, -37452, -2198, -130644, -344736, -215054, -253518, -228401, -254104, -314534, -413055, 138722, 147381, 104025, -53050, -189441, 50753, -296193, -26184, 190015, -236067, 202801, 42853, -94068, -53999, -97594, -30194, 141933, -53563, 39695, -55809, -37527, 772, -216549, -50621, 7096, 65880, -377304, -38824, -215057, -358435, -227350, -20252, -115162, -79808, 24330, -2596, -180079, -195364, 11824, -308535, -191521, -109940, 3045, -140020, -68857, -248503, -89865, -7356, 50458, 127975, -219666, -411181, 265342, -116324, 326500, 116793, -125501, -279969, -156785]
9674a56785D6346K890a25625B90207b14639E8177J55393c60767g7277R657j6906
9663h4526A75310d26651e6372B66954g7071q1897A15066i0967c3494o908k9537
9652f9939H6749J69619a83753j6463f6342j24172O6656I3032a54563o4314e6672
9640G229J34714b0094j21808o5918I4217l6767q871B2641J66950b89573J32156
9629a57417C44626c71691C01500A33877M783C6713J94193a62025q4806H5512c23314
9617g3699A40066a3194B47181c28476b7152m20362A99645E7068R9260a8441k9583
9606d8024k3059A20217N5867b39473A20069a34209G0368J23696d4466j5123p2570
9595a32159b0590j5478l0168G4448K74823g747n1380E4967j4682a09156E2907
$$ y = [-156785, 46346, 49236, -125625, 290207, -214639, 58177, 213570, -360767, -77277, -67620, -84526, 175310, -426651, -56372, 266954, -77071, -158968, 115066, -90967, -33494, -40402, -69939, 86749, 256368, -183753, -200216, -66342, -190514, -123858, 93032, -154563, -218877, -56672, 7229, 141943, -20094, -141902, -207820, 94217, 57450, 48579, 22641, 189591, -289573, -157417, 344626, -371691, 301500, 133877, 138660, 36713, 230906, -162025, -246831, 85512, -323314, -73699, 140066, -13194, 247181, -328476, -27152, -447514, 199645, 57068, 156328, -18441, -48024, -71083, 120217, 176084, -239473, 120069, -134209, 70368, 194064, -44466, -59589, -132159, -20590, -36068, -66236, 74448, 349271, -7747, -59127, 54967, 40285, -109156, 52907]
9583d36037N9200c3505B65555b17238A33194i2596K548r3159k42333e1557l34753
9572c86310h0666I604J03294P5922E7932Q8367c5761k75485J32725j058H0938
9560c9123d994B07118b65440F1454a15872A089a23788b1079j56208j80293B2529
9548b03000j77523A31669r318h1759m2898C5306c91962D2925J07654b89976b0822
9536c53824a45831f9072B37223a04210j30156c0029B17008e1333k72253A21612
9525c28846j07291g8460p0536M1657A03383b73365f8146A78390E2103J72151F1467
9513A24975c2963j66909j02407A78484i3194C00023f1554o6855M9557I2512a70397
9501a27781K5138D0293a23771r0024l1582H2708a6775D6478g90I14c4034Q514
$$ y = [-436037, -376837, -33505, 265555, -217238, 133194, -92596, -90048, -183207, -425540, -51557, -386310, -80666, 9604, 112898, 188820, 57932, 146299, -35761, -311246, -178521, -179579, 80938, -39123, -4994, 207118, -265440, 61454, -115872, 1089, -123788, -21079, -177287, -357580, 22529, -203000, -380523, 131669, 122351, -81759, -124657, 35306, -391962, 42925, 150579, -289976, -20822, -353824, -145831, -69072, 237223, -104210, -234366, -30029, 217008, -51333, -323586, 121612, -328846, -436137, -78460, -148996, -107339, 103383, -273365, -68146, 178390, 52103, 224254, 61467, 124975, -32963, -199872, -302279, 178484, -93194, 300023, -61554, -128409, -78852, 92512, -170397, -127781, -102643, 40293, -123771, -213795, -245377, 82708, -16775, 46478, -790, 914, -34034, -25520]
9489b5520A206b56216C0666b47896D8420B0929c03042B51028o6358C2428h9461
9477G8898a57467P936j36286i575m3790m0448J4918l87284d5466n8630j39658
9466b43754c3605k83913B19789b02203H9400q691C8997e7194a5647k76766H840
9454H7250l1076h5885R237C76862A0438c77336A09896d8809C8469O0956b16279
9442b23897A31456k033b19928N834M4234g0577a7902j29659j18996a16777j95581
9431c12358F5669L50217b09646L2911k4632A2768K02751c1542O169C0320A2641
9419d18633J28341C2008e8588D5789R2176D9253Q0780L681f3740J4783o6012F8810
9406c23576f4786d358j39690e486j20144M6314C6783f2561i292j22740A88919
$$ y = [-25520, 1206, -256216, 30666, -247896, 48420, 20929, -303042, 251028, 184670, 32428, -89461, 78898, -157467, -149531, -285817, -9575, -53365, -93813, -78895, -466179, -45466, -104096, -243754, -33605, -317518, 219789, -202203, 89400, 80709, 38997, -57194, -15647, -292413, 8840, 87250, 56174, -85885, -76648, 376862, 10438, -377336, 109896, -48809, 38469, 99425, -216279, -223897, 131456, 129423, -219928, -214094, -169860, -70577, -17902, -147561, -266557, -116777, -312358, 65669, 415886, -209646, -176735, -201367, 12768, 215519, -31542, -25373, 30320, 12641, -418633, -290292, 32008, -58588, 45789, 137965, 49253, 130033, 133714, -63740, -48957, -114969, 68810, -323576, -64786, -4358, -144048, -5486, -125630, -79316, 36783, -62561, -9292, -132032, 188919]
9394a32601c3142G7096a95993B1630c7996j97086n6936A86946a20879J1340A09215
9382i2102I9126b06776B07295A0029J2613a63697F9676d2530j47317O5479l286
9371a27654n2576d324A30688b9072j2788D61649c7925J1436j12723j391a7099
9359G5804B4105b6136G0273g3511B33206a35693k42491D3772d16530a60915j4955
9348a75870P1354p0000A6925b02035e4111K1844A97936N3418n4288d495B17446
9336c38A33647c43733A21709i0609d5233o7437k8155F3341c148l79306J21987
9325b60467c7008B01018C5421i5535B4570b62961O9018h2320A3847O8939M4917
9314A27703A7570a9777k94822j145d4914a1109B78198i6608l1498f3083R69j255
$$ y = [-132601, -33142, 77096, -195993, 21630, -37996, -235082, -292018, 186946, -120879, -109539, 109215, -92102, 99126, -206776, 207295, 10029, 22642, -163697, 69676, -42530, -189847, -124368, -127654, -180230, -4324, 130688, -29072, -41860, 461649, -37925, -26489, -139212, -140603, -17099, 75804, 24105, -26136, 70273, -73511, 233206, -135693, -378184, 43772, -416530, -160915, -175870, -104516, -174516, 16925, -202035, -54111, -32267, 197936, 251354, 197066, -4495, 217446, -338, 133647, -343733, 121709, -90609, -45233, -112670, -140825, 63341, -3148, -382454, -260467, -37008, 201018, 35421, -95535, 24570, -262961, -193943, -82320, 13847, 82786, 127703, 17570, -19777, -314599, -315744, -44914, -11109, 278198, -96608, -128106, -63083, -62114, -63369]
9302f3369B856a4548k9877A74705c34228a42914f1617R326B37811I1955f0316
9290h2446b4631j54400Q3324c6302C98000a62374O3808A53246j6405d72495a67841
9278D6046K32764c33603E0568e6676H9868a2723A09941j3319B060f6116A99807
9266B43372h260m7475G490L17542e2806K679l8573L4528k11321B8333L1568b78945
9253d4438l4387A18694a35762A62664i4956k51989j24233a59853f6176A29488
9242f1429G8350c6583A11060n1097i357j15798J2040C6725a37676e9270C52597
9230g1379k37494g7756H0314N7410k1948J13323a05794m1661B9739R550O663b57646
9217d8423A69735C4603b13457A583b29775C18952d2688k82293E6228b31717a08059
$$ y = [-63369, 2856, -14548, -44425, 174705, -334228, -142914, -61617, -52291, 237811, 91955, -60316, -82446, -24631, -179031, -95707, -36302, 398000, -162374, -98566, 153246, 136841, -472495, -167841, 46046, 278810, -333603, 50568, -56676, 89868, -12723, 109941, 96622, 2060, -66116, 199807, 243372, -8260, -55735, 7490, 325032, -52806, -50127, -88700, -54172, -265493, 28333, 59901, -278945, -44438, -78825, 118694, -135762, 162664, -94956, -346945, -471178, -159853, -66176, 129488, -61429, 78350, -36583, 111060, 59963, -9357, -125155, -113115, 36725, -137676, -59270, 352597, -71379, -308873, -77756, 80314, 137724, 115776, 229099, -105794, -147455, 29739, 39289, 45952, -257646, -48423, 169735, 34603, -213457, 1583, -229775, 318952, -42688, -324981, 56228, -231717, -108059]
9205b34687E827K21343f4469B08813i248D4309N3062d6502A19735b77843a4647
9193c71686A15291e36080a96602K9454D4170a87097E3922b15330I0098a56922
9182D5202K17870a86746b3496n3041k6172L4415j28739H5514a09681j87693a0604
9170A93868h9402j28304A71624c16294f7237J4244D7860a43275j00035b1233g720
9158E6606N7617N8052g5861B04525E0717b07610D2869f778r0842k212m8945b9442
9145g5149A38021C4494b50064B23755a88960A86924a14163q4108l893O9225l2233
9134a65172j33818B05943a69687o0585e8292A07481b62261C12539b31815E0750
9123A4638c4437j00750n778g497m2675I1217j262b01374l9761E4245J48308c99352
$$ y = [-234687, 5827, 227170, -64469, 208813, -9248, 44309, 97371, -46502, 119735, -277843, -14647, -371686, 115291, -536080, -196602, -167148, 44170, -187097, 53922, -215330, 90098, -156922, 45202, 263072, -186746, -23496, -76537, -102709, -68294, -197033, 85514, -109681, -297374, -10604, 193868, -89402, -217706, 171624, -316294, -67237, -52993, 47860, -143275, -243310, -21233, -7720, 56606, 114223, 172275, -75861, 204525, 50717, -207610, 42869, -6778, -97620, -99832, -148777, -29442, -75149, 138021, 34494, -250064, 223755, -188960, 186924, -114163, -198271, -202164, -132939, -165172, -298990, 205943, -169687, -230272, -58292, 107481, -262261, 312539, -231815, 50750, 14638, -34437, -135187, -140965, -7497, -50172, 91217, 89955, -201374, -241135, 54245, 202553, -399352]
9110C960a28107p1151n8056j12067a26245L2811q4381j0949E4208b6307D05136
9098c00486G4067a94758B7444K27873b84063b1374A46951j6071a30185B11J24710
9087A24921b13522A05022d2285k2539F6847K6759h404k20298q142A80O689f271
9074a26586g916A78301c2878A47558c20651a19643A3908L9978a32400L7888n943
9063a00455G6060a86911D1249p72J69895C4930b27172d3958k8838b6007A11605
9051B1493J42697a6988j12335m0864B43358j8910H4776J08054a01169A07276c25259
9039a96195j44909A51358a30029D009c841B59062D5432b64635J14256E2745e0094
9027d40295F9779c0547A23847d9078A34401b22414N9908K8626B3066P2151a70822
$$ y = [3960, -128107, -199258, -257314, -369381, -126245, -93434, -177815, -188764, 54208, -26307, 405136, -300486, 74067, -194758, 27444, 255317, -284063, -21374, 146951, 130880, -130185, 211, 124921, -213522, 105022, -42285, -64824, 66847, 93606, -8404, -228702, -236844, 180, 6869, -6271, -126586, -7916, 178301, -32878, 147558, -320651, -119643, 13908, 53886, -132400, -94512, -100455, 76060, -186911, 41249, 40477, 210372, 34930, -227172, -43958, -72796, -26007, 111605, 21493, 164190, -16988, -129323, -170187, 243358, 224448, 84776, 192830, -101169, 107276, -325259, -196195, -341104, 151358, -130029, 4009, -3841, 259062, 45432, -264635, -150379, 52745, -50094, -440295, 69779, -30547, 123847, -49078, 134401, -222414, -162506, -133880, 23066, 95217, -170822]
9015F3750c61054e5582q0598q942H0618a67751B53943a33454L7427j02928A04840
9003a62231J8675C8246a448A03062a12730j78516G288c46903G1320i462j00380
8992a09842e3247a7658A97724a68289B0715J0357J06542L381b81942a13673C8569
8980A6142a97967c1852F668J18327h1834B43910c60931B9800a48279E0040a23472
8968a23827L5106A84194J91965D433i5152E8479f50951a22952A9700b4120A14992
8956I171M2035a65118J6483B59171A01497a08860L5007c1809D0079O2854L0553
8945A33486c37655A09753c209C73856c7729B92979A40225a84182p056g2819D90211
8933B01904O1211J08822j52713q8183c1071C57438l292J27063K70129M86420K809646
$$ y = [63750, -361054, -55582, -136180, -145122, 80618, -167751, 253943, -133454, -96027, -198955, 104840, -162231, -143556, 38246, -1448, 103062, -112730, -291246, 7288, -346903, 71320, -9462, -109842, -53247, -17658, 197724, -168289, 20715, 31072, 137614, 140995, -281942, -113673, 38569, 16142, -197967, -31852, 6668, 124995, -81834, 243910, -360931, 29800, -148279, 50040, -123472, -123827, -88721, 184194, 376159, 4433, -95152, 58479, -650951, -122952, 19700, -24120, 114992, 9171, 51206, -165118, -148635, 259171, 101497, -108860, -73853, -31809, 40079, 102933, 133486, -337655, 109753, -3209, 373856, -37729, 292979, 140225, -184182, -191238, -72819, 490211, 201904, 263115, 371937, 219224, 131041, -31071, 357438, 354146, 481209, 751338, 1237758, 4047404]
8922D047404N154962n88519J466902m886639B022428F14435j14306A48032l6147
8913A11885J27267g5591K2036n040B19187E9388J6710i714j08967k3762q9824
8902b32267o9054a29072A39080b54700A18434b26498j13268A76007a46302l1806
8892a78108j61192J00230G8426M940a48445L0115L9874l6638B31735c9957A24079
8880H2546e85325B10480j03278P293b14297P2693p2671N4990A53963f33552b93786
$$ y = [4047404, 9202366, 8613847, 10080749, 5194110, 2022428, 614435, 500129, 148032, 111885, 239152, -75591, -53555, -58595, 219187, 59388, 76098, -9714, -118681, -142443, -232267, -301321, -129072, 139080, -254700, 118434, -226498, -339766, 176007, -146302, -178108, -339300, -239070, 78426, 83366, -148445, -118330, -78456, -115094, 231735, -39957, 124079, 82546, -585325, 210480, 107202, 114495, -214297, -141604, -214275, -159285, 153963, -633552, -293786]
$$ [...]
##END NTUPLES=NMR SPECTRUM
##END=
