
##TITLE=UV1220_M5_1296-1170_90_7229556_2qQ6gD5V1T
##JCAMPDX= 6.0         $$ Bruker NMR JCAMP-DX V2.0
##DATA TYPE= NMR SPECTRUM
##DATA CLASS= NTUPLES
##ORIGIN= BRUKER
##OWNER= Administrator
$$ 1.72 TOPSPIN		Version 2.1
$$ 2013-01-18 01:29:42.584 -0500  Administrator@X
$$ Compression mode = diff/dup
##.OBSERVE FREQUENCY= 400.02188249412
##.OBSERVE NUCLEUS= ^1H
##.ACQUISITION MODE= SIMULTANEOUS (DQD)
##.ACQUISITION SCHEME= undefined
##.AVERAGES= 64
##.DIGITISER RES= 22
##SPECTROMETER/DATA SYSTEM= spect
##.PULSE SEQUENCE= noesygpps1d.comp
##.SOLVENT NAME= COFFEE_meoh
##.SHIFT REFERENCE= INTERNAL, COFFEE_meoh, 1, 14.9619
##AUDIT TRAIL= $$ (NUMBER, WHEN, WHO, WHERE, PROCESS, VERSION, WHAT)
$$ ##TITLE= Audit trail, TOPSPIN		Version 2.1
$$ ##JCAMPDX= 5.01
$$ ##ORIGIN= Bruker BioSpin GmbH
$$ ##OWNER= Administrator
$$ $$ E:\/data/COFFEE/nmr/UV1220_M5_1296-1170_90_7229556_2qQ6gD5V1T/22/pdata/1/auditp.txt
$$ ##AUDIT TRAIL=  $$ (NUMBER, WHEN, WHO, WHERE, PROCESS, VERSION, WHAT)
(   1,<2013-01-18 01:29:36.866 -0500>,<Administrator>,<X>,<go>,<TOPSPIN 2.1>,
      <created by zg
	started at 2013-01-18 01:18:07.038 -0500,
	POWCHK enabled, PULCHK disabled,
       configuration hash MD5:
       86 BA 57 50 F2 9D 5C 9B 26 00 A9 28 5F 66 2E 89
       data hash MD5: 64K
       D2 80 F4 2D 1D 86 EB 7D 79 A5 DD 48 68 66 0A A6>)
(   2,<2013-01-18 01:29:39.881 -0500>,<Administrator>,<X>,<proc1d>,<TOPSPIN 2.1>,
      <Start of raw data processing
       efp LB = 0.3 FT_mod = 6 PKNL = 1 PHC0 = 0 PHC1 = 0 SI = 128K 
       data hash MD5: 128K
       67 26 F9 32 37 75 75 F4 CC 8B DE 9F 5D A3 FF A5>)
(   3,<2013-01-18 01:29:40.913 -0500>,<Administrator>,<X>,<proc1d>,<TOPSPIN 2.1>,
      <pk PHC0 = -79.81018 PHC1 = 0 
       data hash MD5: 128K
       A5 5A 95 F1 6D F2 B0 9D 63 C5 A1 CA AD 5E A1 C9>)
(   4,<2013-01-18 01:29:41.569 -0500>,<Administrator>,<X>,<proc1d>,<TOPSPIN 2.1>,
      <abs ABSG = 1 
       data hash MD5: 128K
       13 BD 07 18 8D 95 C7 89 86 56 26 7B 78 FA 78 DB>)
(   5,<2013-01-18 01:29:41.741 -0500>,<Administrator>,<X>,<proc1d>,<TOPSPIN 2.1>,
      <abs ABSG = 2 
       data hash MD5: 128K
       04 4E 4D 06 6D 3F 55 4F A3 EB 51 D8 56 95 22 FD>)
(   6,<2013-01-18 01:29:41.881 -0500>,<Administrator>,<X>,<proc1d>,<TOPSPIN 2.1>,
      <abs ABSG = 3 
       data hash MD5: 128K
       85 7C C1 27 65 CB A9 52 0B F3 70 A0 41 58 CF AA>)
(   7,<2013-01-18 01:29:42.069 -0500>,<Administrator>,<X>,<proc1d>,<TOPSPIN 2.1>,
      <abs ABSG = 4 
       data hash MD5: 128K
       22 91 A7 D2 39 05 BD 08 74 59 DD 97 E6 82 5F 52>)
(   8,<2013-01-18 01:29:42.225 -0500>,<Administrator>,<X>,<proc1d>,<TOPSPIN 2.1>,
      <abs ABSG = 5 
       data hash MD5: 128K
       58 B1 80 37 3C 21 BA E3 61 C8 3D E0 86 CC 97 00>)
$$ ##END=
$$ 
$$ $$ hash MD5
$$ $$ EC B5 C8 89 C4 D2 58 54 CB 12 97 B4 B6 8E 6D 25
##$RELAX= 
##$RELAX= 
##$RELAX= 
##$RELAX= 
##$RELAX= 
##$RELAX= 
##$RELAX= 
##$RELAX= 
$$ Bruker specific parameters
$$ --------------------------
##$DU= <E:\>
##$EXPNO= 22
$$ [...]
150 150 150 150 150 150 150 150
##$TP07= 0
##$TPNAME0= <>
##$TPNAME1= <>
##$TPNAME2= <>
##$TPNAME3= <>
##$TPNAME4= <>
##$TPNAME5= <>
##$TPNAME6= <>
##$TPNAME7= <>
##$TPOAL= (0..7)
0.5 0.5 0.5 0.5 0.5 0.5 0.5 0.5
##$TPOFFS= (0..7)
0 0 0 0 0 0 0 0
##$TUNHIN= 0
##$TUNHOUT= 0
##$TUNXOUT= 0
##$USERA1= <user>
##$USERA2= <user>
##$USERA3= <user>
##$USERA4= <user>
##$USERA5= <user>
##$V9= 5
##$VALIST= <valist>
##$VCLIST= <CCCCCCCCCCCCCCC>
##$VD= 0
##$VDLIST= <DDDDDDDDDDDDDDD>
##$VPLIST= <PPPPPPPPPPPPPPP>
##$VTLIST= <TTTTTTTTTTTTTTT>
##$WBST= 1024
##$WBSW= 4
##$XGAIN= (0..3)
0 0 0 0
##$XL= 0
##$YL= 0
##$YMAX_a= 6068449
##$YMIN_a= -13422750
##$ZGOPTNS= <>
##$ZL1= 120
##$ZL2= 120
##$ZL3= 120
##$ZL4= 120
##$ABSF1= 14.9619
##$ABSF2= -5.596282
##$ABSG= 5
##$ABSL= 3
##$ALPHA= 0
##$AQORDER= 0
##$ASSFAC= 0
##$ASSFACI= 0
##$ASSFACX= 0
##$ASSWID= 0
##$AUNMP= <proc_prof1d_extract.lims>
##$AXLEFT= 0
##$AXNAME= <>
##$AXNUC= <1H>
##$AXRIGHT= 0
##$AXTYPE= 0
##$AXUNIT= <>
##$AZFE= 0.1
##$AZFW= 0.1
##$BCFW= 0
##$BC_mod= 0
##$BYTORDP= 0
##$COROFFS= 0
##$CY= 15
##$DATMOD= 1
##$DC= 0
##$DFILT= <>
##$DTYPP= 0
##$F1P= 0
##$F2P= 0
##$FCOR= 0.5
##$FTSIZE= 131072
##$FT_mod= 6
##$GAMMA= 0
##$GB= 0
##$INTBC= 1
##$INTSCL= 1
##$ISEN= 128
##$LB= 0.3
##$LEV0= 0
##$LPBIN= 0
##$MAXI= 10000
##$MC2= 0
##$MEAN= 0
##$ME_mod= 0
##$MI= 0
##$NCOEF= 0
##$NC_proc= -2
##$NLEV= 6
##$NOISF1= 0
##$NOISF2= 0
##$NSP= 0
##$NTH_PI= 0
##$NZP= 0
##$OFFSET= 14.9619
##$PC= 1
##$PHC0= -79.81018
##$PHC1= 0
##$PH_mod= 1
##$PKNL= yes
##$PPARMOD= 0
##$PPDIAG= 0
##$PPIPTYP= 0
##$PPMPNUM= 2147483647
##$PPRESOL= 1
##$PSCAL= 4
##$PSIGN= 0
##$PYNMP= <proc.py>
##$REVERSE= no
##$SF= 400.020009276949
##$SI= 131072
##$SIGF1= 0
##$SIGF2= 0
##$SINO= 400
##$SIOLD= 131072
##$SPECTYP= <>
##$SREGLST= <1H.CDCl3>
##$SSB= 0
##$STSI= 131072
##$STSR= 0
##$SW_p= 8223.68421052631
##$SYMM= 0
##$S_DEV= 0
##$TDeff= 65536
##$TDoff= 0
##$TI= <>
##$TILT= no
##$TM1= 0
##$TM2= 0
##$TOPLEV= 0
##$USERP1= <user>
##$USERP2= <user>
##$USERP3= <user>
##$USERP4= <user>
##$USERP5= <user>
##$WDW= 1
##$XDIM= 131072
##$YMAX_p= 446181060
##$YMIN_p= -12584
##$CURPLOT= <Network HP LaserJet P1505>
##$CURPRIN= <$Network HP LaserJet P1505>
##$DFORMAT= <normdp>
##$LAYOUT= <+/1D_H.xwp>
##$LFORMAT= <normlp>
##$PFORMAT= <normpl>
##$SURQMSG= 1
$$ End of Bruker specific parameters
$$ ---------------------------------
##NTUPLES= NMR SPECTRUM
##VAR_NAME=  FREQUENCY,     SPECTRUM/REAL,   SPECTRUM/IMAG
##SYMBOL=    X,             R,               I
##VAR_TYPE=  INDEPENDENT,   DEPENDENT,       DEPENDENT
##VAR_FORM=  AFFN,          ASDF,            ASDF
##VAR_DIM=   131072,        131072,          131072
##UNITS=     HZ,            ARBITRARY UNITS, ARBITRARY UNITS
##FACTOR=    0.0627417313425164, 1,          1
##FIRST=     8223.62146879497, 1197,         -59964
##LAST=      0,             2739,            -60063
##MIN=       0,             -12584,          0
##MAX=       8223.62146879497, 446181060,    0
$$ Real data points
##PAGE= N=1
##DATA TABLE= (X++(R..R)), XYDATA
$$ [...]
$$ plain form
63850 574956 593770 612763 632632 654299 677744 702515 728801 756896 785968 814530 842130
63839 842130 869553 897313 924949 951878 977810 1002034 1023317 1041081 1055942 1068649 1079109
63828 1079109 1086826 1091585 1093220 1091307 1085614 1076439 1064074 1048342 1029082 1006702 981961 955539
63816 955539 927963 899390 869243 836811 802682 768898 737032 706656 676398 645987 616403
63805 616403 588412 561977 537094 514244 493683 474945 457396 440924 425817 412290 400331
63794 400331 389823 380650 372747 365973 359778 353225 345792 338075 331242 325664 320549 315094 309537 304692
63780 304692 300786 297240 293492 289571 285831 282482 279542 276976 274687 272523 270490 268800 267581 266618
63766 266618 265642 264718 264038 263414 262381 260948 259853 259720 260170 260145 259047 257286 255726 254835 254399 253881 252974
$$ packed form
63850E74956J8814J8993J9869K1667K3445K4771K6286K8095K9072K8562K7600
63839H42130K7423K7760K7636K6929K5932K4224K1283J7764J4861J2707J0460
63828A079109P717M759J635j913n693r175j2365j5732j9260k2380k4741k6422
63816I55539k7576k8573l0147l2432l4129l3784l1866l0376l0258l0411k9584
63805F16403k7991k6435k4883k2850k0561j8738j7549j6472j5107j3527j1959
63794D00331j0508r173p903o774o195o553p433p717o833n578n115n455n557m845
63780C04692l906l546l748l921l740l349k940k566k289k164k033j690j219r63
63766B66618r76r24o80o24j033j433j095j33M50k5j098j761j560q91m36n18r07
$$ plain form
63749 252974 251870 251004 250512 250109 249599 249256 249446 250040 250554 250778 250929 251214 251653 252384 253755 255897 258484
63732 258484 261064 263447 265577 267304 268566 269715 271429 274166 277775 281631 285186 288347 291313 294127
63718 294127 296638 298980 301773 305507 309922 314360 318589 322884 327265 331178 334103 336092 337472 338328
63704 338328 338564 338268 337660 336783 335548 334068 332707 331705 331002 330510 330453 331150 332498 333895 334839 335415 335976
63687 335976 336508 336735 336751 337004 337487 337502 336584 335188 334008 333037 331898 330776 330277 330481 330849 331148 331812 333296
63669 333296 335600 338559 342027 345568 348574 350977 353423 356452 359885 363225 366174 368485 369787 370029
63655 370029 369751 369450 368959 367867 366296 364754 363320 361510 359006 356176 353700 351901 350495 348892 346655
63640 346655 343803 340772 338163 336545 336306 337426 339402 341643 344034 346899 350385 354182 357981 361911
$$ packed form
63749B52974j104q66m92m03n10l43J90N94N14K24J51K85M39P31J371K142K587
63732B58484K580K383K130J727J262J149J714K737L609L856L555L161K966K814
63718B94127K511K342K793L734M415M438M229M295M381L913K925J989J380Q56
63704C38328K36k96o08q77j235j480j361j002p03m92n7O97J348J397R44N76N61
63687C35976N32K27J6K53M83J5r18j396j180r71j139j122m99K04L68K99O64J484
63669C33296K304K959L468L541L006K403K446L029L433L340K949K311J302K42
63655C70029k78l01m91j092j571j542j434j810k504k830k476j799j406j603k237
63640C46655k852l031k609j618k39J120J976K241K391K865L486L797L799L930
$$ plain form
63626 361911 366297 371174 376291 381496 386926 392830 399321 406389 414163 423089 433629 445715 458808
63613 458808 472742 488134 505586 524747 544798 565653 587941 611765 636287 660736 685118
63602 685118 709582 733730 757013 779356 800946 821849 842176 862127 881327 898472 912168
63591 912168 921861 927511 928840 925570 918231 908065 896082 882641 867872 852025 835396 818263
63579 818263 800913 783440 765577 747067 728208 709834 692823 677675 664333 652201 640656
63568 640656 629857 620810 614299 610032 607202 605503 605076 605815 607381 609741 613001 616765 620381 623948
63554 623948 628443 634697 642738 652312 663576 677011 693100 712292 734855 760345 787489 814919
63542 814919 841972 868630 894953 920799 945984 970478 994455 1018175 1041588 1063812 1083004
$$ packed form
63626C61911M386M877N117N205N430N904O491P068P774Q926J0540J2086J3093
63613D58808J3934J5392J7452J9161K0051K0855K2288K3824K4522K4449K4382
63602F85118K4464K4148K3283K2343K1590K0903K0327J9951J9200J7145J3696
63591I12168R693N650J329l270p339j0166j1983j3441j4769j5847j6629j7133
63579H18263j7350j7473j7863j8510j8859j8374j7011j5148j3342j2132j1545
63568F40656j0799r047o511m267k830j699m27P39J566K360L260L764L616L567
63554F23948M495O254Q041R574J1264J3435J6089J9192K2563K5490K7144K7430
63542H14919K7053K6658K6323K5846K5185K4494K3977K3720K3413K2224J9192
$$ plain form
63531 1083004 1096968 1104127 1104106 1097614 1085893 1070222 1051736 1031415 1010016 988043 965955 944285
63519 944285 923251 902261 880269 856801 832297 807273 781649 755247 728535 702286 676786
63508 676786 651955 628147 606227 586765 569594 554184 540087 526961 514596 503073 492673
63497 492673 483566 475676 468769 462452 456301 450265 444782 440137 435983 431927 428293 425686 423946 422287
63483 422287 420467 419108 418715 419116 420077 421769 424202 426759 428750 430152 431453 433068 435198 437865 440766
63468 440766 443310 445082 446066 446362 446003 445167 444113 442719 440594 437852 435182 432817 430085 426542 422986
63453 422986 420623 419549 418820 417782 416658 415922 415820 416503 417980 419869 421803 424230 428233 434347 442037
63438 442037 450531 459714 469995 481805 495597 511918 530928 551973 573963 596128 618187 640039
$$ packed form
63531A083004J3964P159k1o492j1721j5671j8486k0321k1399k1973k2088k1670
63519I44285k1034k0990k1992k3468k4504k5024k5624k6402k6712k6249k5500
63508F76786k4831k3808k1920j9462j7171j5410j4097j3126j2365j1523j0400
63497D92673r107p890o907o317o151o036n483m645m154m056l634k607j740j659
63483D22287j820j359l93M01R61J692K433K557J991J402J301J615K130K667K901
63468D40766K544J772R84K96l59q36j054j394k125k742k670k365k732l543l556
63453D22986k363j074p29j038j124p36j02O83J477J889J934K427M003O114P690
63438D42037Q494R183J0281J1810J3792J6321J9010K1045K1990K2165K2059K1852
$$ plain form
63426 640039 661737 683877 707649 734163 763503 794308 824270 851295 874466 894089 911010
63415 911010 926117 940441 955240 971497 989282 1007819 1026211 1044051 1061490 1079008 1097115
63404 1097115 1115917 1134710 1152036 1166295 1176296 1181264 1180509 1173449 1160160 1141834 1120441 1097661
63392 1097661 1074065 1049385 1023536 997164 971042 945208 919057 892275 865304 838718 812490
63381 812490 786244 760156 735261 712744 693073 675886 660661 647426 636797 629268 624496 621500
63369 621500 619643 619219 620876 624700 630258 637398 646525 658008 671738 687512 705446 725681 747924
63356 747924 771647 796634 822994 850556 878543 905969 932301 957732 982810 1007788 1032308
63345 1032308 1055734 1077733 1098306 1117230 1133683 1146595 1155196 1159094 1158029 1151769 1140262 1123802
$$ packed form
63426F40039K1698K2140K3772K6514K9340L0805K9962K7025K3171J9623J6921
63415I11010J5107J4324J4799J6257J7785J8537J8392J7840J7439J7518J8107
63404A097115J8802J8793J7326J4259J0001M968p55p060j3289j8326k1393k2780
63392A097661k3596k4680k5849k6372k6122k5834k6151k6782k6971k6586k6228
63381H12490k6246k6088k4895k2517j9671j7187j5225j3235j0629p529m772k996
63369F21500j857m24J657L824N558P140R127J1483J3730J5774J7934K0235K2243
63356G47924K3723K4987K6360K7562K7987K7426K6332K5431K5078K4978K4520
63345A032308K3426K1999K0573J8924J6453J2912Q601L898j065o260j1507j6460
$$ plain form
63333 1123802 1103193 1079803 1055159 1030172 1004883 979117 953166 927483 901944 875993 849632
63322 849632 823849 799839 778022 758024 739384 721937 705547 689841 674531 659955 647076
63311 647076 636714 628843 622684 617244 611412 603708 592683 578026 561033 543583 526748 510614
63299 510614 495189 480951 468427 457615 448027 439158 430835 423132 416032 409261 402661 396665 391978
63286 391978 388578 385397 381378 376555 371680 367077 362472 357845 353760 350660 348340 346400 344852 343979
63272 343979 343853 344244 344865 345515 346102 346670 347259 347616 347185 345639 343364 341252 339935 339267 338658 337908 337564
63255 337564 338309 340095 342114 343593 344303 344304 343727 343040 343057 344165 345771 346944 347420 347630 347971 348536 349403 350647
63237 350647 352121 353627 355232 356997 358561 359489 359961 360628 361879 363793 366621 370618 375300 379577 382815
$$ packed form
63333A123802k0609k3390k4644k4987k5289k5766k5951k5683k5539k5951k6361
63322H49632k5783k4010k1817j9998j8640j7447j6390j5706j5310j4576j2879
63311F47076j0362p871o159n440n832p704j1025j4657j6993j7450j6835j6134
63299E10614j5425j4238j2524j0812r588q869q323p703p100o771o600n996m687
63286C91978l400l181m019m823m875m603m605m627m085l100k320j940j548q73
63272C43979j26L91O21O50N87N68N89L57m31j546k275k112j317o68o09p50l44
63255C37564P45J786K019J479P10Jn77o87J7J108J606J173M76K10L41N65Q67J244
63237C50647J474J506J605J765J564R28M72O67J251J914K828L997M682M277L238
$$ plain form
63222 382815 385253 387355 389390 391793 395206 399835 405287 411199 417415 423370 428173 431786 435446 440294
63208 440294 446116 451974 457556 463230 469190 475255 481259 486970 491787 495190 497430 499248 500933 502121
63194 502121 502459 502021 501124 500249 500130 501437 504210 507932 512255 517369 523528 530523 537907 545669 554465
63179 554465 565005 577168 589908 602197 613987 626003 638787 652363 666670 681594 696413
63168 696413 709960 721790 732643 743248 753161 761351 767505 772104 775511 777676 778562 778183 776247 772364
63154 772364 766600 759374 750833 740839 729499 717212 704179 690354 675914 661293 646666 631895
63142 631895 617057 602575 588746 575578 563266 552387 543363 535972 529623 523918 518877 514777 511834
63129 511834 509927 508685 508009 508369 510256 513492 517496 522142 527866 534867 542614 550268 557272 563493 569169
$$ packed form
63222C82815K438K102K035K403L413M629N452N912O216N955M803L613L660M848
63208D40294N822N858N582N674N960O065O004N711M817L403K240J818J685J188
63194E02121L38m38q97q75j19J307K773L722M323N114O159O995P384P762Q796
63179E54465J0540J2163J2740J2289J1790J2016J2784J3576J4307J4924J4819
63168F96413J3547J1830J0853J0605R913Q190O154M599L407K165Q86l79j936l883
63154G72364n764p226q541r994j1340j2287j3033j3825j4440j4621j4627j4771
63142F31895j4838j4482j3829j3168j2312j0879r024p391o349n705n041m100k943
63129E11834j907j242o76L60J887L236M004M646N724P001P747P654P004O221N676
$$ plain form
63114 569169 574768 580542 586129 590959 595070 599095 603399 607713 611734 615591 619489 623371 627153 630859
63100 630859 634242 636698 637911 638224 638107 637660 637022 636823 637649 639334 641320 643574 646600 650645 655374 660281
63084 660281 664956 668981 672190 675198 679148 684534 690552 695863 699809 702646 704858 706592 707687 707900
63070 707900 706967 704664 700919 695899 689988 683742 677783 672618 668459 665256 662811 660852 659076 657344
63056 657344 655866 655042 655125 656191 658438 662169 667284 673115 679179 685973 694531 705133 716865 728576
63042 728576 739863 750878 761661 772212 782975 794654 807426 820688 833641 845795 856881
63031 856881 866705 875362 883355 891099 898342 904310 908523 911277 913248 914641 914894 913318 909904 905366
63017 905366 900343 894779 888181 880293 871291 861493 851239 841127 832045 824710 819148 814802 811148 808201
$$ packed form
63114E69169N599N774N587M830M111M025M304M314M021L857L898L882L782L706
63100F30859L383K456J213L13j17m47o38j99Q26J685J986K254L026M045M729M907
63084F60281M675M025L209L008L950N386O018N311L946K837K212J734J095K13
63070G07900r33k303l745n020n911o246n959n165m159l203k445j959j776j732
63056F57344j478q24Q3J066K247L731N115N831O064O794Q558J0602J1732J1711
63042G28576J1287J1015J0783J0551J0763J1679J2772J3262J2953J2154J1086
63031H56881R824Q657P993P744P243N968M213K754J971J393K53j576l414m538
63017I05366n023n564o598p888r002r798j0254j0112r082p335n562m346l654k947
$$ plain form
63003 808201 806438 806402 808480 812982 820127 829810 841615 855313 871186 889454 909491 930150 950997
62990 950997 972687 995836 1019972 1043968 1067167 1089577 1111330 1132485 1153109 1172882 1190726
62979 1190726 1205588 1217714 1228404 1238177 1245790 1249574 1249311 1246251 1241452 1234753 1225383 1213015 1197885
62966 1197885 1180105 1159341 1135224 1107905 1078072 1046598 1014359 982300 951223 921337 892230
62955 892230 863524 835415 808393 782643 757968 734158 711186 689159 668340 649054 631260
62944 631260 614357 597781 581731 566869 553344 540551 527914 515475 503633 492705 482917 474428
62932 474428 467125 460644 454786 449702 445558 442264 439634 437492 435537 433419 431124 428878 426537 423523
62918 423523 419722 416068 413744 412987 413009 412889 412122 410540 408302 406001 404328 403437 402935 402513 402267 402363 402776
$$ packed form
63003H08201j763l6K078M502P145R683J1805J3698J5873J8268K0037K0659K0847
62990I50997K1690K3149K4136K3996K3199K2410K1753K1155K0624J9773J7844
62979A190726J4862J2126J0690R773P613L784k63l060m799o699r370j2368j5130
62966A197885j7780k0764k4117k7319k9833l1474l2239l2059l1077k9886k9107
62955H92230k8706k8109k7022k5750k4675k3810k2972k2027k0819j9286j7794
62944F31260j6903j6576j6050j4862j3525j2793j2637j2439j1842j0928r788q489
62932D74428p303o481n858n084m144l294k630k142j955k118k295k246k341l014
62918D23523l801l654k324p57K2j20p67j582k238k301j673q91n02m22k46R6M13
$$ plain form
62901 402776 403554 404953 407016 409285 411305 413264 415747 418855 421993 424659 427098 429924 433327 437006
62887 437006 440753 444667 448738 452620 456036 459182 462511 466297 470649 475727 481550 487552 492666 496042
62873 496042 497657 498224 498571 499030 499266 498672 497000 494548 491695 488377 484196 478890 472582 465683 458774
62858 458774 452389 446725 441576 436718 432126 427666 422925 417815 413071 409534 407024 404539 401611 398808
62844 398808 396748 395280 394000 393026 392743 393104 393661 394044 394043 393400 392044 390381 388905 387537 385790 383685
62828 383685 382110 382056 383614 385888 387757 388609 388509 387961 387652 388203 389805 391940 393739 394794 395493 396328
62812 396328 397191 397738 398252 399465 401409 403023 403279 402321 401217 400842 401316 402235 403065 403465 403580 403945 404858
62795 404858 406030 407098 408272 410048 412392 414655 416367 417729 419202 420975 423061 425604 428706 432053
$$ packed form
62901D02776P78J399K063K269K020J959K483L108L138K666K439K826L403L679
62887D37006L747L914M071L882L416L146L329L786M352N078N823O002N114L376
62873D96042J615N67L47M59K36n94j672k452k853l318m181n306o308o899o909
62858D58774o385n664n149m858m592m460m741n110m744l537k510k485k928k803
62844C98808k060j468j280r74k83L61N57L83jo43j356j663j476j368j747k105
62828C83685j575n4J558K274J869Q52j00n48l09N51J602K135J799J055O99Q35
62812C96328Q63N47N14J213J944J614K56r58j104l75M74R19Q30M00J15L65R13
62795D04858J172J068J174J776K344K263J712J362J473J773K086K543L102L347
$$ plain form
62781 432053 435135 437938 441130 445355 450578 456462 463214 471498 481401 491989 502245 512063 521909 531861
62767 531861 541569 550939 560136 568907 576640 583263 589444 595597 601248 605706 608861 610883 611590 610646 608098
62752 608098 604231 599109 592661 585064 576604 567312 557147 546420 535614 524828 513781 502365 490939
62739 490939 480108 470414 462114 454945 448174 441201 434124 427552 421955 417384 413664 410608 408172 406613
62725 406613 406240 406744 407134 406827 406530 407398 409430 411403 412473 413126 414332 416407 419114 422398 426469 431457
62709 431457 437452 444692 453272 462796 472778 483344 495069 508043 521628 535398 550028 566868
62697 566868 586770 609591 634689 661499 689593 718610 748468 779480 811994 845932 880790
62686 880790 915944 950811 984924 1018092 1050344 1081414 1110347 1135949 1157567 1175136 1188555
$$ packed form
62781D32053L082K803L192M225N223N884O752Q284R903J0588J0256R818R846R952
62767E31861R708R370R197Q771P733O623O181O153N651M458L155K022P07r44k548
62752F08098l867n122o448p597q460r292j0165j0727j0806j0786j1047j1416j1426
62739D90939j0831r694q300p169o771o973p077o572n597m571l720l056k436j559
62725D06613l73N04L90l07k97Q68K032J973J070O53J206K075K707L284M071M988
62709D31457N995P240Q580R524R982J0566J1725J2974J3585J3770J4630J6840
62697E66868J9902K2821K5098K6810K8094K9017K9858L1012L2514L3938L4858
62686H80790L5154L4867L4113L3168L2252L1070K8933K5602K1618J7569J3419
$$ plain form
62675 1188555 1197448 1201488 1200447 1193810 1180926 1161812 1137437 1108929 1076890 1041754 1004347 965708
62663 965708 926654 887904 850288 814315 779726 745971 713065 681644 652365 625654 601897
62652 601897 581249 563186 546652 530894 515963 502394 490524 480123 470506 461099 452037 444044
62640 444044 437530 432015 426703 421402 416468 412039 407812 403566 399507 396049 393504 391955 391160 390598 389910
62625 389910 389224 388772 388321 387355 385719 383679 381374 378705 375846 373359 371637 370559 369847 369452 369354 369269 368844
62608 368844 368032 367116 366381 365857 365406 365045 365074 365741 366771 367580 368018 368531 369343 369958 369897 369576 369915 371412 374136
62589 374136 378240 383621 389233 393723 396964 400223 404562 409745 414957 419876 424601 429097 433209 436890
62575 436890 440054 442522 444352 445881 447176 447801 447318 445589 442485 437889 432280 426710 421714 416737 411059
$$ packed form
62675A188555Q893M040j041o637j2884j9114k4375k8508l2039l5136l7407l8639
62663I65708l9054l8750l7616l5973l4589l3755l2906l1421k9279k6711k3757
62652F01897k0648j8063j6534j5758j4931j3569j1870j0401r617r407r062p993
62640D44044o514n515n312n301m934m429m227m246m059l458k545j549p95n62o88
62625C89910o86m52m51r66j636k040k305k669k859k487j722j078p12l95r8q5m25
62608C68844q12r16p35n24m51l61K9O67J030Q09M38N13Q12O15o1l21L39J497K724
62589C74136M104N381N612M490L241L259M339N183N212M919M725M496M112L681
62575D36890L164K468J830J529J295O25m83j729l104m596n609n570m996m977n678
$$ plain form
62560 411059 404815 398656 392976 388052 384399 382164 380503 378375 375785 373498 371746 370104 368595 367929
62546 367929 368344 368987 368917 368193 367567 367515 367951 368569 369084 369340 369521 370101 371311 372859 374351 375836 377669 379982
62528 379982 382531 385000 387264 389436 391799 394602 397833 401320 405167 409847 415675 422426 429860 438442
62514 438442 449054 461936 476330 491347 506814 523114 540617 559570 580185 602315 625195
62503 625195 648002 670632 693457 716335 738510 759638 780306 801063 821381 840085 856528
62492 856528 870871 883478 894700 905172 915599 926097 936234 945903 955730 966406 978066 990562
62480 990562 1004033 1018795 1034822 1051441 1067277 1080344 1088656 1091268 1088718 1082166 1072130 1058124
62468 1058124 1039276 1014985 985233 950712 912700 872533 831152 789311 748078 708718 671991
$$ packed form
62560D11059o244o159n680m924l653k235j661k128k590k287j752j642j509o66
62546C67929M15O43p0p24o26n2M36O18N15K56J81N80J210J548J492J485J833K313
62528C79982K549K469K264K172K363K803L231L487L847M680N828O751P434Q582
62514D38442J0612J2882J4394J5017J5467J6300J7503J8953K0615K2130K2880
62503F25195K2807K2630K2825K2878K2175K1128K0668K0757K0318J8704J6443
62492H56528J4343J2607J1222J0472J0427J0498J0137R669R827J0676J1660J2496
62480I90562J3471J4762J6027J6619J5836J3067Q312K612k550o552j0036j4006
62468A058124j8848k4291k9752l4521l8012m0167m1381m1841m1233l9360l6727
$$ plain form
62457 671991 637822 605795 575810 548254 523733 502754 485453 471432 459962 450436 442591 436208
62445 436208 430903 426399 422839 420463 419009 417834 416727 416208 416730 417916 418981 419665 420234 420664 420507 419686
62429 419686 418834 418501 418454 418168 417586 416920 416042 414666 413005 411691 411041 410789 410518 409950 408861 407128 404887
62412 404887 402363 399640 396943 394911 394009 393759 393168 391938 390649 389675 388651 387249 385850 385034 384940 385484
62396 385484 386803 389016 391867 394975 398198 401481 404669 407732 410937 414597 418951 424457 431667 440475
62382 440475 449896 458968 467556 475984 484391 492890 501872 511520 521283 530437 538970 547405 555919 564210
62368 564210 572173 580278 589323 600128 613245 628588 645573 664036 684750 708610 735713 765814
62356 765814 799312 836867 878118 921621 966139 1011351 1057264 1103720 1150618 1197862 1244762
$$ packed form
62457F71991l4169l2027k9985k7556k4521k0979j7301j4021j1470r526p845o383
62445D36208n305m504l560k376j454j175j107n19N22J186J065O84N69M30j57q21
62429D19686q52l33m7k86n82o66q78j376j661j314o50k52k71n68j089j733k241
62412D04887k524k723k697k032r02k50n91j230j289r74j024j402j399q16r4N44
62396C85484J319K213K851L108L223L283L188L063L205L660M354N506P210Q808
62382D40475R421R072Q588Q428Q407Q499Q982R648R763R154Q533Q435Q514Q291
62368E64210P963Q105R045J0805J3117J5343J6985J8463K0714K3860K7103L0101
62356G65814L3498L7555M1251M3503M4518M5212M5913M6456M6898M7244M6900
$$ plain form
62345 1244762 1290035 1332684 1372304 1408323 1439549 1464782 1483333 1494643 1498126 1493977 1483645 1468806
62333 1468806 1450073 1427161 1400021 1369197 1335264 1298529 1259346 1218243 1175720 1132261 1088581
62322 1088581 1045512 1003611 963165 924576 888375 854742 823285 793484 765200 738686 714170
62311 714170 691562 670465 650472 631571 614303 599357 586883 576308 566912 558519 551463 545927
62299 545927 541516 537608 533992 531006 529108 528499 529149 530920 533483 536234 538543 540223 541709 543733 546674
62284 546674 550124 553147 555177 556586 558084 559648 560519 560398 560037 560286 561067 561937 563209 565691 569431 573627
62268 573627 577916 582920 589252 596840 605788 617160 632057 650293 670846 693529 719469 749826
62256 749826 784668 823275 864947 909129 955125 1002208 1049934 1098075 1146302 1194193 1241435
$$ packed form
62345A244762M5273M2649L9620L6019L1226K5233J8551J1310L483m149j0332j4839
62333A468806j8733k2912k7140l0824l3933l6735l9183m1103m2523m3459m3680
62322A088581m3069m1901m0446l8589l6201l3633l1457k9801k8284k6514k4516
62311G14170k2608k1097j9993j8901j7268j4946j2474j0575r396q393p056n536
62299E45927m411l908l616k986j898o09O50J771K563K751K309J680J486K024K941
62284E46674L450L023K030J409J498J564Q71j21l61K49P81Q70J272K482L740M196
62268E73627M289N004O332P588Q948J1372J4897J8236K0553K2683K5940L0357
62256G49826L4842L8607M1672M4182M5996M7083M7726M8141M8227M7891M7242
$$ plain form
62245 1241435 1287611 1331654 1371810 1406459 1434920 1457187 1472914 1480984 1480275 1470640 1452946 1428393
62233 1428393 1398173 1363625 1326091 1286284 1243985 1198751 1150952 1102026 1053821 1007746 964456
62222 964456 924106 886787 852702 821912 794038 768408 744607 722751 703188 686059 671190
62211 671190 658174 646444 635473 625176 616056 608685 602960 598001 592839 587167 581501 576734 573504
62198 573504 571767 570828 569886 568693 567746 567776 569034 571168 573824 577187 581728 587448 593666 599739 605799
62183 605799 612537 620323 628797 637370 645912 654859 664760 675776 687481 699124 710197 720848 731743
62170 731743 743517 756445 770582 786085 803325 822738 844560 868702 894966 923414 954257
62159 954257 987179 1021081 1054914 1088593 1122552 1156415 1188751 1218322 1244897 1268337 1287412
$$ packed form
62245A241435M6176M4043M0156L4649K8461K2267J5727Q070p09r635j7694k4553
62233A428393l0220l4548l7534l9807m2299m5234m7799m8926m8205m6075m3290
62222I64456m0350l7319l4085l0790k7874k5630k3801k1856j9563j7129j4869
62211F71190j3016j1730j0971j0297r120p371n725m959n162n672n666m767l230
62198E73504j737r39r42j193r47L0J258K134K656L363M541N720O218O073O060
62183F05799O738P786Q474Q573Q542Q947R901J1016J1705J1643J1073J0651J0895
62170G31743J1774J2928J4137J5503J7240J9413K1822K4142K6264K8448L0843
62159I54257L2922L3902L3833L3679L3959L3863L2336K9571K6575K3440J9075
$$ plain form
62148 1287412 1300226 1305748 1304368 1297055 1284548 1267447 1246577 1222892 1197203 1170115 1142088 1113464
62136 1113464 1084612 1056077 1028405 1001848 976503 952803 931551 913332 898140 885777 876283
62125 876283 869715 865662 863336 862066 861472 861321 861593 862659 864915 868050 871034 873097 874447 875709 876910
62110 876910 877496 877253 876685 876264 875764 874663 872967 871263 870104 869724 870273 871880 874328 877045 879746 882938
62094 882938 887480 893721 901305 909813 919245 929585 940085 949377 956496 961668 965911 970092 974651 980110
62080 980110 987249 996425 1007014 1017955 1028720 1039448 1050334 1061503 1073484 1087166 1102954 1120308
62068 1120308 1138546 1157825 1178918 1202175 1227017 1252390 1277317 1301110 1323508 1344791 1365499
62057 1365499 1385880 1405763 1424995 1443623 1461466 1477768 1491595 1502489 1510432 1515251 1516338 1513036
$$ packed form
62148A287412J2814N522j380p313j2507j7101k0870k3685k5689k7088k8027k8624
62136A113464k8852k8535k7672k6557k5345k3700k1252j8219j5192j2363r494
62125H76283o568m053k326j270n94j51K72J066K256L135K984K063J350J262J201
62110H76910N86k43n68m21n00j101j696j704j159l80N49J607K448K717K701L192
62094H82938M542O241P584Q508R432J0340J0500R292P119N172M243M181M559N459
62080I80110P139R176J0589J0941J0765J0728J0886J1169J1981J3682J5788J7354
62068A120308J8238J9279K1093K3257K4842K5373K4927K3793K2398K1283K0708
62057A365499K0381J9883J9232J8628J7843J6302J3827J0894P943M819J087l302
$$ plain form
62045 1513036 1505088 1492603 1475781 1454852 1430160 1402126 1371151 1337671 1302214 1265216 1226813
62034 1226813 1187030 1146341 1105904 1067111 1030928 997653 967132 939076 913268 889655 868243
62023 868243 848847 831106 814867 800443 788216 777986 768942 760258 751557 742811 734054 725256 716320
62010 716320 707117 697781 688960 681445 675364 670016 664781 659953 656346 654215 653037 652334 652238 653050 654596
61995 654596 656387 658302 660678 663615 666438 668125 668190 666894 664598 661220 656571 650944 644848 638193 630288
61980 630288 620986 611388 602883 595646 588570 580652 571942 563042 554313 545976 538581 532724 528282 524399
61966 524399 520306 515902 511505 507426 503995 501693 500834 501137 501878 502497 502886 503123 503211 503217 503506 504604 506851
61949 506851 510305 514935 520787 527919 536254 545516 555332 565549 576533 589110 604013 621376 640802
$$ packed form
62045A513036p948j2485j6822k0929k4692k8034l0975l3480l5457l6998l8403
62034A226813l9783m0689m0437l8793l6183l3275l0521k8056k5808k3613k1412
62023H68243j9396j7741j6239j4424j2227j0230r044q684q701q746q757q798q936
62010G16320r203r336q821p515o081n348n235m828l607k131j178p03r6Q12J546
61995F54596J791J915K376K937K823J687O5j296k296l378m649n627o096o655p905
61980F30288r302r598q505p237p076p918q710q900q729q337p395n857m442l883
61966E24399m093m404m397m079l431k302q59L03P41O19L89K37Q8OK89J098K247
61949E06851L454M630N852P132Q335R262R816J0217J0984J2577J4903J7363J9426
$$ plain form
61936 640802 661796 683925 706613 729194 751365 773395 795677 818188 840502 862152 882729
61925 882729 901759 918803 933707 946569 957386 965906 971852 975116 975798 974239 971102 967158 962819
61912 962819 957984 952441 946334 940250 935031 931564 930544 932229 936436 942779 950761 959685 968810 977756
61898 977756 986495 994791 1001943 1007287 1010625 1011791 1010157 1005079 996677 985640 972369 956924 939828
61885 939828 922208 904810 887353 869116 849793 829544 808734 788028 768331 750128 733099
61874 733099 716708 701004 686496 673537 662185 652400 643941 636277 629102 622770 617867 614536 612743
61861 612743 612929 615750 621212 628719 637987 649345 663049 678979 697187 718168 742257 769171 798355
61848 798355 829438 862175 896292 931604 967939 1004837 1041663 1078015 1113505 1147059 1177126
$$ packed form
61936F40802K0994K2129K2688K2581K2171K2030K2282K2511K2314K1650K0577
61925H82729J9030J7044J4904J2862J0817Q520N946L264O82j559l137l944m339
61912I62819m835n543o107o084n219l467j020J685M207O343P982Q924R125Q946
61898I77756Q739Q296P152N344L338J166j634n078q402j1037j3271j5445j7096
61885I39828j7620j7398j7457j8237j9323k0249k0810k0706j9697j8203j7029
61874G33099j6391j5704j4508j2959j1352r785q459p664p175o332m903l331j793
61861F12743J86K821N462P507R268J1358J3704J5930J8208K0981K4089K6914K9184
61848G98355L1083L2737L4117L5312L6335L6898L6826L6352L5490L3554L0067
$$ plain form
61837 1177126 1202894 1224749 1243197 1257887 1268183 1274224 1276840 1276685 1273981 1268927 1262048 1254350 1247391
61824 1247391 1242744 1240883 1240852 1241464 1242563 1244783 1248437 1253184 1258432 1263417 1267016 1268099 1266023 1260447 1250836
61809 1250836 1236673 1217991 1195240 1168808 1139147 1107162 1073844 1039556 1004295 968675 934076
61798 934076 901733 872033 844703 819250 795276 772788 752238 733920 717530 702693 689587
61787 689587 678433 668613 659156 650014 642007 635415 629471 623428 617259 610953 603973 596050 587993 581087
61773 581087 575960 572422 570078 568580 567528 566559 565631 565037 565154 566171 567885 569891 572168 575287 579567
61758 579567 584300 588487 592309 597034 603335 610453 617251 623272 628438 632609 636041 639551 643470 646984
61744 646984 649152 650087 650416 650074 648593 646298 644228 642857 641679 640213 638665 637357 636080 634410 632372
$$ packed form
61837A177126K5768K1855J8448J4690J0296O041K616j55k704n054o879p698o959
61824A247391m647j861l1O12J099K220L654M747N248M985L599J083k076n576r611
61809A250836j4163j8682k2751k6432k9661l1985l3318l4288l5261l5620l4599
61798I34076l2343k9700k7330k5453k3974k2488k0550j8318j6390j4837j3106
61787F89587j1154r820r457r142q007o592n944o043o169o306o980p923q057o906
61773E81087n127l538k344j498j052r69r28n94J17J017J714K006K277L119M280
61758E79567M733M187L822M725O301P118O798O021N166M171L432L510L919L514
61744F46984K168R35L29l42j481k295k070j371j178j466j548j308j277j670k038
$$ plain form
61729 632372 630517 629441 629346 629973 630883 631881 633142 634896 637168 639951 643472 648033 653673 660069 666629
61714 666629 672608 677401 680987 683950 686899 689942 692708 694616 695081 693960 691948 690092 688585 686524
61700 686524 683227 679323 675949 673240 670314 666594 662406 658229 654010 649485 644706 639900 634991 629602
61686 629602 623614 617584 612388 608331 604834 601307 598145 596260 595621 594994 593398 591128 588847 586419 583416
61671 583416 580272 578007 576953 576525 576197 575946 575730 575286 574612 574056 573742 573387 572884 572626 573045 574169 575794
61654 575794 577760 579951 582313 584992 588190 591754 595130 597869 600047 602182 604820 608124 611721 615042
61640 615042 617878 620474 622980 625204 627068 628822 630438 631252 630759 629333 627522 625080 621456 616963 612512
61625 612512 608377 604251 600473 597927 596432 594353 590520 585735 581653 578861 576799 575052 573784 573034
$$ packed form
61729F32372j855j076r5O27R10R98J261J754K272K783L521M561N640O396O560
61714F66629N979M793L586K963K949L043K766J908M65j121k012j856j507k061
61700F86524l297l904l374k709k926l720m188m177m219m525m779m806m909n389
61686F29602n988o030n196m057l497l527l162j885o39o27j596k270k281k428l003
61671E83416l144k265j054m28l28k51k16m44o74n56l14l55n03k58M19J124J625
61654E75794J966K191K362K679L198L564L376K739K178K135K638L304L597L321
61640F15042K836K596K506K224J864J754J616Q14m93j426j811k442l624m493m451
61625F12512m135m126l778k546j495k079l833m785m082k792k062j747j268p50
$$ plain form
61611 573034 572380 571379 569845 567643 564604 560734 556239 551326 546124 540750 535263 529611 523768 517856
61597 517856 512061 506492 501158 495898 490301 484010 477351 471453 467400 465238 463931 462289 459851 456951
61583 456951 454117 451519 449003 446452 443814 440750 436696 431630 426486 422397 419681 417939 416840 416176
61569 416176 415338 413576 410947 408323 406235 404346 402313 400464 399159 398099 396857 395643 394966 394843 394923
61554 394923 395095 395379 395432 394855 393902 393221 392904 392407 391579 391163 391943 393787 395871 397527 398545 398913 398799 398795
61536 398795 399711 401805 404352 406259 407106 407414 407942 409022 410666 412877 415474 417832 419341 420155 420952 421821
61520 421821 421878 420302 417439 414438 412024 410055 408159 406344 404879 403951 403607 403816 404326 404613 404188 402967
61504 402967 401262 399414 397604 395999 394814 394083 393492 392740 391986 391636 391674 391537 390893 390192 390100 390518 390608 389814
$$ packed form
61611E73034o54j001j534k202l039l870m495m913n202n374n487n652n843n912
61597E17856n795n569n334n260n597o291o659n898m053k162j307j642k438k900
61583D56951k834k598k516k551k638l064m054n066n144m089k716j742j099o64
61569D16176q38j762k629k624k088j889k033j849j305j060j242j214o77j23Q0
61554C94923J72K84N3n77r53o81l17m97q28m16P80J844K084J656J018L68j14m
61536C98795R16K094K547J907Q47L08N28J080J644K211K597K358J509Q14P97Q69
61520D21821N7j576k863l001k414j969j896j815j465r28l44K09N10K87m25j221
61504D02967j705j848j810j605j185p31n91p52p54l50L8j37o44p01r2M18R0p94
$$ plain form
61486 389814 388592 387986 388591 389997 391215 391620 391440 391223 391004 390345 389173 388030 387312 386811 386400 386548 387554
61469 387554 388763 389342 389504 390088 391126 391841 392091 392684 393970 395131 395461 395488 396043 396846 396849 395717 394180 393064
61451 393064 392621 392800 393544 394621 395566 396021 396042 396055 396529 397620 398997 400132 400877 401685 403172 405589 408767
61434 408767 412357 415983 419312 422200 424743 427135 429515 431898 434162 436237 438405 441229 444854 448650
61420 448650 451952 454904 458032 461225 463938 466368 469414 473196 476468 478057 478196 477865 477442 476644 475302
61405 475302 473466 471040 467960 464550 461166 457708 453963 450187 446836 444004 441621 439965 439320 439271 438935
61390 438935 437852 436183 434198 432186 430741 430441 431160 432250 433499 435298 437740 440136 441795 442872 444073
61375 444073 445703 447364 448489 448960 449222 449879 451200 452961 454713 456163 457333 458512 460119 462360 464927
$$ packed form
61486C89814j222o06O05J406J218M05j80k17k19o59j172j143p18n01m11J48J006
61469C87554J209N79J62N84J038P15K50N93J286J161L30K7N55Q03Lj132j537j116
61451C93064m43J79P44J077R45M55K1J3M74J091J377J135P45Q08J487K417L178
61434D08767L590L626L329K888K543K392K380K383K264K075K168K824L625L796
61420D48650L302K952L128L193K713K430L046L782L272J589J39l31m23p98j342
61405D75302j836k426l080l410l384l458l745l776l351k832k383j656o45m9l36
61390D38935j083j669j985k012j445l00P19J090J249J799K442K396J659J077J201
61375D44073J630J661J125M71K62O57J321J761J752J450J170J179J607K241K567
$$ plain form
61360 464927 467178 468770 469949 471148 472614 474532 477134 480393 483934 487619 491917 497322 503683 510567
61346 510567 518038 526584 536451 547605 560261 574816 591128 608317 625382 641638 656438 668933
61334 668933 678418 684790 688473 689978 689597 687467 683884 679445 674726 669793 664311 658253 652169 646575
61320 646575 641414 636392 631506 626889 622462 618206 614479 611628 609456 607556 605965 604970 604482 604142 603957
61305 603957 604264 605226 606917 609774 614189 619664 625195 630740 637649 647255 659439 672794 685734 697190
61291 697190 706702 714182 719330 721172 718680 712115 703298 694124 685175 676094 666901 658302 650945 645015
61277 645015 640585 637795 636428 635691 634822 633857 633569 634675 637314 641337 646778 653751 661977 670866 680203
61262 680203 690481 702315 715717 730089 744708 759056 772925 786505 800247 814525 829639
$$ packed form
61360D64927K251J592J179J199J466J918K602L259L541L685M298N405O361O884
61346E10567P471Q546R867J1154J2656J4555J6312J7189J7065J6256J4800J2495
61334F68933R485O372L683J505l81k130l583m439m719m933n482o058o084n594
61320F46575n161n022m886m617m427m256l727k851k172j900j591r95m88l40j85
61305F03957L07R62J691K857M415N475N531N545O909R606J2184J3355J2940J1456
61291F97190R512P480N148J842k492o565q817r174q949r081r193q599p357n930
61277F45015m430k790j367p37q69r65k88J106K639M023N441O973Q226Q889R337
61262F80203J0278J1834J3402J4372J4619J4348J3869J3580J3742J4278J5114
$$ plain form
61251 829639 846162 864768 885283 906217 925574 941801 953633 959719 959340 953294 943304 930634
61239 930634 915915 900105 884576 870123 856695 844340 833580 824578 816731 809592 803622 799467
61227 799467 796975 795388 794108 792835 791347 789706 788467 788234 789132 790966 793684 797269 801387 805462 809024
61212 809024 811715 813164 813199 812118 810432 808358 805781 802679 799402 796497 794387 793199 792833 793149 794005
61197 794005 795133 796329 798000 801309 807299 815952 826518 838715 853077 870069 889455 910760 933861
61184 933861 958799 985276 1012559 1039527 1064729 1086797 1105126 1119898 1131366 1139613 1145149 1149111
61172 1149111 1152369 1154779 1155687 1154805 1152178 1147606 1140658 1131167 1119408 1105937 1091392 1076181 1060059
61159 1060059 1042399 1023129 1003100 983205 963563 944055 925235 908095 893092 880016 868635
$$ packed form
61251H29639J6523J8606K0515K0934J9357J6227J1832O086l79o046r990j2670
61239I30634j4719j5810j5529j4453j3428j2355j0760r002p847p139n970m155
61227G99467k492j587j280j273j488j641j239k33Q98J834K718L585M118M075L562
61212H09024K691J449L5j081j686k074k577l102l277k905k110j188l66L16Q56
61197G94005J128J196J671L309N990Q653J0566J2197J4362J6992J9386K1305K3101
61184I33861K4938K6477K7283K6968K5202K2068J8329J4772J1468Q247N536L962
61172A149111L258K410R08q82k627m572o948r491j1759j3471j4545j5211j6122
61159A060059j7660j9270k0029j9895j9642j9508j8820j7140j5003j3076j1381
$$ plain form
61148 868635 858910 850611 843360 837163 832528 829962 829663 831632 835642 841054 847030 852960 858374 862564
61134 862564 864690 864339 861621 856714 849768 841402 832905 825660 820531 817824 817541 819502 823430 829180 836891
61119 836891 846888 859525 875047 893366 913906 935859 958721 982511 1007431 1033447 1060214 1087341
61107 1087341 1114672 1142235 1169806 1196498 1221049 1242691 1261570 1278118 1292266 1303654 1312390
61096 1312390 1319096 1324068 1326763 1326242 1321850 1313385 1300899 1284556 1264604 1241414 1215549 1187715 1158526
61083 1158526 1128490 1098398 1069390 1042186 1016453 991599 968188 947811 931167 916921 903020
61072 903020 888776 875112 863127 853138 844996 838481 833124 828277 823846 820670 819722 821011 823527 826178
61058 826178 828536 830826 833503 836931 841233 846324 852117 858704 866213 874597 883805 894187 906453 921052
$$ packed form
61148H68635r725q299p251o197m635k566k99J969M010N412N976N930N414M190
61134H62564K126l51k718m907o946q366q497p245n129k707k83J961L928N750P711
61119H36891R997J2637J5522J8319K0540K1953K2862K3790K4920K6016K6767K7127
61107A087341K7331K7563K7571K6692K4551K1642J8879J6548J4148J1388Q736
61096A312390O706M972K695n21m392q465j2486j6343j9952k3190k5865k7834k9189
61083A158526l0036l0092k9008k7204k5733k4854k3411k0377j6644j4246j3901
61072I03020j4244j3664j1985r989q142o515n357m847m431l176r48J289K516K651
61058H26178K358K290K677L428M302N091N793O587P509Q384R208J0382J2266J4599
$$ plain form
61044 921052 937754 956034 975744 997164 1020485 1045506 1071817 1099014 1126772 1155054 1184352
61033 1184352 1215314 1247768 1280408 1311887 1342226 1372719 1404407 1436983 1469325 1500702 1531217
61022 1531217 1561373 1591651 1622442 1654045 1686688 1720749 1756831 1795391 1836422 1879921 1926590
61011 1926590 1977621 2033744 2095144 2162606 2238179 2324191 2421988 2532241 2656283 2796539 2955768
61000 2955768 3136611 3342084 3576087 3843385 4149752 4502752 4912407 5391140 5953302
60991 5953302 6614237 7387594 8279856 9283787 10375684 11521199 12688834 13862644 15044471
60982 15044471 16245371 17476044 18744260 20055983 21412923 22808235 24228195 25659942
60974 25659942 27097422 28544209 30018932 31555685 33175880 34829333 36353131 37509140
$$ packed form
61044I21052J6702J8280J9710K1420K3321K5021K6311K7197K7758K8282K9298
61033A184352L0962L2454L2640L1479L0339L0493L1688L2576L2342L1377L0515
61022A531217L0156L0278L0791L1603L2643L4061L6082L8560M1031M3499M6669
61011A926590N1031N6123O1400O7462P5573Q6012R7797J10253J24042J40256J59229
61000B955768J80843K05473K34003K67298L06367L53000M09655M78733N62162
60991E953302O60935P73357Q92262J003931J091897J145515J167635J173810J181827
60982A5044471J200900J230673J268216J311723J356940J395312J419960J431747
60974B5659942J437480J446787J474723J536753J620195J653453J523798J156009
$$ plain form
60966 37509140 38096024 38052087 37468773 36523544 35408847 34303042 33352479 32621259 32032992
60957 32032992 31377978 30412677 28986047 27099993 24876896 22484480 20078204 17777620
60949 17777620 15661019 13767016 12103467 10660907 9421990 8364545 7463811 6696462
60941 6696462 6042741 5484924 5005914 4590468 4226550 3904645 3616823 3357134 3121799
60932 3121799 2908089 2713464 2535998 2374658 2228579 2096696 1978186 1872234 1777011 1689856
60922 1689856 1608900 1533592 1463439 1397465 1335355 1277853 1225298 1176889 1132105 1091677 1056247
60911 1056247 1025122 997394 973281 953237 936582 922230 910093 900534 893009 886454 880525 875254
60899 875254 869894 863409 855906 848308 840736 832362 822878 812958 803075 792835 781762 769974 757847
$$ packed form
60966C7509140N86884m3937n83314r45229j114697j105805r50563p31220n88267
60957C2032992o55014r65301j426630j886054k223097k392416k406276k300584
60949A7777620k116601j894003j663549j442560j238917j057445r00734p67349
60941F696462o53721n57817m79010m15446l63918l21905k87822k59689k35335
60932C121799k13710j94625j77466j61340j46079j31883j18510j05952r5223q7155
60922A689856q0956p5308p0153o5974o2110n7502n2555m8409m4784m0428l5430
60911A056247l1125k7728k4113k0044j6655j4352j2137r559p525o555n929n271
60899H75254n360o485p503p598p572q374r484r920r883j0240j1073j1788j2127
$$ plain form
60886 757847 745599 733368 721181 708780 695959 683042 670576 658646 646922 635239 623661
60875 623661 612299 601615 592536 585498 579639 573756 567874 562973 559259 555710 551501 547011 543142 540285
60861 540285 538293 537002 536513 537246 539751 544166 549940 556369 563193 570310 577306 583935 590725 598331 606451
60846 606451 614107 620869 627036 632833 638289 643841 650034 656479 661939 665596 667528 667909 666688 664220
60832 664220 661301 658246 654702 650607 646453 642291 637347 631219 624642 618428 612221 605016 596477 587139
60818 587139 577620 568218 559066 550176 541369 532494 523678 515219 507409 500496 494515 489012 483289 477200
60804 477200 471515 467215 464530 462695 460566 457550 454157 451611 450671 450922 451473 452057 453025 454493 456110
60789 456110 457624 459099 460646 462463 465045 468714 472985 477054 480882 485101 489925 494949 500057 505609
$$ packed form
60886G57847j2248j2231j2187j2401j2821j2917j2466j1930j1724j1683j1578
60875F23661j1362j0684r079p038n859n883n882m901l714l549m209m490l869k857
60861E40285j992j291m89P33K505M415N774O429O824P117O996O629O790P606Q120
60846F06451P656O762O167N797N456N552O193O445N460L657J932L81j221k468
60832F64220k919l055l544m095m154m162m944o128o577o214o207p205q539r338
60818E87139r519r402r152q890q807q875q816q459p810o913n981n503n723o089
60804D77200n685m300k685j835k129l016l393k546r40K51N51N84R68J468J617
60789D56110J514J475J547J817K582L669M271M069L828M219M824N024N108N552
$$ plain form
60775 505609 511610 517582 523514 529996 537029 543617 549095 554051 559314 564683 569360 573159 576583 580063
60761 580063 583578 586802 589267 590753 591782 593265 595462 597838 600128 602712 605541 607623 608290 608279 608681
60746 608681 609426 609615 608908 607655 606032 603944 601539 598939 595632 591026 585529 580207 575327 570147 564317
60731 564317 558688 554329 551371 549290 547929 547744 549206 552366 556963 562777 569744 577782 586592 595802
60717 595802 605409 615931 628004 641925 657692 675288 694688 715683 737898 761005 784924 809876
60705 809876 836157 863589 891137 917384 941481 963397 983245 1000784 1015690 1027806 1036846 1042219
60693 1042219 1043449 1040469 1033327 1021984 1006745 988424 967660 944439 918786 891723 864994 839855
60681 839855 816412 794018 772024 750268 729162 709327 691077 674378 659217 645611 633198
$$ packed form
60775E05609O001N972N932O482P033O588N478M956N263N369M677L799L424L480
60761E80063L515L224K465J486J029J483K197K376K290K584K829K082O67j1M02
60746F08681P45J89p07j253j623k088k405k600l307m606n497n322m880n180n830
60731E64317n629m359k958k081j361j85J462L160M597N814O967Q038Q810R210
60717E95802R607J0522J2073J3921J5767J7596J9400K0995K2215K3107K3919K4952
60705H09876K6281K7432K7548K6247K4097K1916J9848J7539J4906J2116R040N373
60693A042219J230k980p142j1343j5239j8321k0764k3221k5653k7063k6729k5139
60681H39855k3443k2394k1994k1756k1106j9835j8250j6699j5161j3606j2413
$$ plain form
60670 633198 621431 610464 601283 594473 589258 584266 578942 573702 568992 564794 560960 557522 554604 552283
60656 552283 550447 548692 546616 544388 542640 541555 540558 539275 538269 538333 539508 541383 543890 547080 550487
60641 550487 553505 556177 558800 560936 561717 561133 560215 559827 560010 560607 561774 563580 565744 568082 570755 573788
60625 573788 576761 579173 580736 581143 580064 577578 574235 570492 566474 562385 558587 554995 550946 546087
60611 546087 540986 536378 532183 527882 523644 520366 518501 517415 516202 514738 513546 512837 512151 511024 509604
60596 509604 508341 507320 506242 505061 504259 504348 505309 506716 508207 509709 511324 513154 515171 517205 519192
60581 519192 521365 523956 526695 528992 530860 533193 536775 541226 545415 548780 551890 555793 561177 568182
60567 568182 576655 586406 597305 609262 622166 635977 650871 667058 684305 701835 718860 735066
$$ packed form
60670F33198j1767j0967r181o810n215m992n324n240m710m198l834l438k918k321
60656E52283j836j755k076k228j748j085r97j283j006O4J175J875K507L190L407
60641E50487L018K672K623K136P81n84r18l88J83N97J167J806K164K338K673L033
60625E73788K973K412J563M07j079k486l343l743m018m089l798l592m049m859
60611E46087n101m608m195m301m238l278j865j086j213j464j192p09o86j127j420
60596E09604j263j021j078j181q02Q9R61J407J491J502J615J830K017K034J987
60581E19192K173K591K739K297J868K333L582M451M189L365L110L903N384P005
60567E68182Q473R751J0899J1957J2904J3811J4894J6187J7247J7530J7025J6206
$$ plain form
60555 735066 750506 765353 779920 794636 809714 825029 840523 856347 872296 887378 900382
60544 900382 910669 918167 922839 924651 924012 921946 919857 919252 921376 926714 934909 945384 957866 972302
60530 972302 988619 1006802 1026706 1047570 1068310 1088761 1110059 1133146 1157407 1181427 1204458
60519 1204458 1226122 1245033 1258986 1266676 1268318 1264551 1255790 1243008 1228143 1213074 1198646 1185082
60507 1185082 1172781 1162248 1153659 1146992 1142382 1140091 1140417 1143842 1150938 1161991 1177052 1196566 1221564
60494 1221564 1252960 1290918 1335060 1384885 1439723 1498727 1561320 1627416 1696829 1768665 1841695
60483 1841695 1915209 1989126 2063183 2136249 2206519 2272188 2331764 2383745 2426271 2457474 2476282
60472 2476282 2482660 2476962 2459335 2429998 2389668 2339220 2279084 2209411 2130761 2044223 1951106 1853142
$$ packed form
60555G35066J5440J4847J4567J4716J5078J5315J5494J5824J5949J5082J3004
60544I00382J0287P498M672J812o39k066k089o05K124N338Q195J0475J2482J4436
60530I72302J6317J8183J9904K0864K0740K0451K1298K3087K4261K4020K3031
60519A204458K1664J8911J3953P690J642l767q761j2782j4865j5069j4428j3564
60507A185082j2301j0533q589o667m610k291L26L425P096J1053J5061J9514K4998
60494A221564L1396L7958M4142M9825N4838N9004O2593O6096O9413P1836P3030
60483A841695P3514P3917P4057P3066P0270O5669N9576N1981M2526L1203J8808
60472B476282O378n698j7627k9337m0330n0448o0136o9673p8650q6538r3117r7964
$$ plain form
60460 1853142 1752997 1653878 1558350 1467822 1383110 1304921 1233632 1169244 1111828 1061596 1018207
60449 1018207 980462 947018 917115 890362 866216 844144 824102 806401 791071 777584 765218
60438 765218 753590 742837 733254 724707 716554 708356 700490 693711 688196 683490 679307 675766 672759 669733
60424 669733 666478 663570 661567 660138 658486 656437 654586 653462 652983 652713 652233 651154 649119 646112 642730
60409 642730 639879 638021 636767 635408 633816 632558 632026 631879 631745 632037 633451 635726 637591 638087 637445 636543
60393 636543 636103 636677 638746 642238 646226 649633 652170 654273 656308 658181 659707 660939 662067 663187 664325
60378 664325 665599 667201 669159 671174 672905 674404 676036 677819 679197 679820 680276 681561 683964 686994 690276
60363 690276 693883 697794 701749 705885 710877 717041 723790 730380 736756 743214 749587 755390 760654 766205
$$ packed form
60460A853142j00145r9119r5528r0528q4712p8189p1289o4388n7416n0232m3389
60449A018207l7745l3444k9903k6753k4146k2072k0042j7701j5330j3487j2366
60438G65218j1628j0753r583q547q153q198p866o779n515m706m183l541l007l026
60424F69733l255k908k003j429j652k049j851j124m79k70m80j079k035l007l382
60409F42730k851j858j254j359j592j258n32j47j34K92J414K275J865M96o42r02
60393F36543m40N74K069L492L988L407K537K103K035J873J526J232J128J120J138
60378F64325J274J602J958K015J731J499J632J783J378O23M56J285K403L030L282
60363F90276L607L911L955M136M992O164O749O590O376O458O373N803N264N551
$$ plain form
60349 766205 773046 781680 791932 803233 815098 827469 840520 854206 868304 882948 898722 915912
60337 915912 933927 951683 968368 983691 997666 1010508 1022613 1034297 1045521 1055809 1064299 1069899
60325 1069899 1071770 1069768 1064104 1054542 1040486 1022159 1001207 979595 958236 937230 917160 899358
60313 899358 884771 873171 863798 856436 851512 849260 849229 850765 853809 858936 866590 876599 888632 902844
60299 902844 919498 937948 956524 973759 989444 1004251 1018686 1032889 1047415 1063610 1082759
60288 1082759 1104665 1127175 1147333 1163166 1174322 1181041 1182997 1179527 1170639 1157173 1140096 1120403
60276 1120403 1099772 1080354 1063315 1047962 1032717 1016581 999274 980457 959597 936565 911861
60265 911861 886271 860632 835824 812538 790978 771057 752895 736852 723060 711171 700682
$$ packed form
60349G66205O841Q634J0252J1301J1865J2371J3051J3686J4098J4644J5774J7190
60337I15912J8015J7756J6685J5323J3975J2842J2105J1684J1224J0288Q490N600
60325A069899J871k002n664r562j4056j8327k0952k1612k1359k1006k0070j7802
60313H99358j4587j1600r373p362m924k252l1J536L044N127P654J0009J2033J4212
60299I02844J6654J8450J8576J7235J5685J4807J4435J4203J4526J6195J9149
60288A082759K1906K2510K0158J5833J1156O719J956l470q888j3466j7077j9693
60276A120403k0631j9418j7039j5353j5245j6136j7307j8817k0860k3032k4704
60265I11861k5590k5639k4808k3286k1560j9921j8162j6043j3792j1889j0489
$$ plain form
60254 700682 691393 683482 677159 672289 668368 664951 662018 659734 657916 656099 654158 652540 651640 651248 650821
60239 650821 650036 648822 647156 645210 643565 642874 643255 644224 645292 646454 648080 650421 653279 656181 658885
60224 658885 661631 664763 668224 671717 675317 679551 684753 690659 696785 702942 709172 715375 721247 726452
60210 726452 730800 734377 737567 740740 743923 746982 750018 753133 755783 756995 756591 755745 755841 756978 757998
60195 757998 757825 756454 754678 753173 751909 750319 747999 745191 742442 739862 737074 733895 730683 727814
60181 727814 725195 722558 719963 717678 715734 713838 711715 709448 707664 707278 708706 711238 713644 715553
60167 715553 717821 721347 725971 730886 735670 740462 745342 750040 754243 757901 761304 764985 769403 774512
60153 774512 779796 784834 789616 794255 798688 802815 806539 809525 811257 811635 811212 810628 810097 809674 809663 810444
$$ packed form
60254G00682r289p911o323m870l921l417k933k284j818j817j941j618r00l92m27
60239F50821p85j214j666j946j645o91L81R69J068J162J626K341K858K902K704
60224F58885K746L132L461L493L600M234N202N906O126O157O230O203N872N205
60210G26452M348L577L190L173L183L059L036L115K650J212m04q46R6J137J020
60195G57998j73j371j776j505j264j590k320k808k749k580k788l179l212k869
60181G27814k619k637k595k285j944j896k123k267j784l86J428K532K406J909
60167G15553K268L526M624M915M784M792M880M698M203L658L403L681M418N109
60153G74512N284N038M782M639M433M127L724K986J732L78m23n84n31m23j1P81
$$ plain form
60137 810444 812084 814324 816703 818685 820110 821694 824531 828778 833286 836848 839400 841662 844133 846885
60123 846885 849853 852724 854813 855592 855212 854183 852752 850835 848193 844439 839348 833502 828170 824161 821307
60108 821307 819360 818586 818882 819120 818351 817119 816592 816803 816849 816623 817160 819196 822384 826126 830304 834869 839459
60091 839459 843861 848430 853774 860242 867681 875285 881814 886514 889826 892692 895282 897025 897751 897975 897850
60076 897850 896647 893662 889094 883624 877542 870667 862830 854174 845138 836314 828063 820179 812110 803548
60062 803548 794612 785554 776651 768337 760990 754494 748326 742149 736001 729984 724151 718751 714195 710620
60048 710620 707780 705336 702958 700195 696685 692683 689039 686503 685140 684409 683654 682617 681677 681443 681918
60033 681918 682313 681955 681070 680280 679704 679062 678320 677484 676053 673475 670056 666553 662895 658211 652345 646373
$$ packed form
60137H10444J640K240K379J982J425J584K837M247M508L562K552K262K471K752
60123H46885K968K871K089P79l80j029j431j917k642l754n091n846n332m009k854
60108H21307j947p74K96K38p69j232n27K11M6k26N37K036L188L742M178M565M590
60091H39459M402M569N344O468P439P604O529M700L312K866K590J743P26K24j25
60076H97850j203k985m568n470o082o875p837q656r036q824q251p884q069q562
60062H03548q936r058q903q314p347o496o168o177o148o017n833n400m556l575
60048G10620k840k444k378k763l510m002l644k536j363p31p55j037r40k34M75
60033F81918L95l58q85p90n76o42p42q36j431k578l419l503l658m684n866n972
$$ plain form
60017 646373 641257 636757 632233 627844 624276 621733 619898 618784 618987 620987 624448 628300 631495 633807
60003 633807 635932 638721 642431 646860 651937 657654 663552 668914 673662 678488 683883 689535 695017 700604
59989 700604 706940 714115 721509 728486 734959 741248 747570 753638 758726 762144 763709 763736 762648 760609 757389
59974 757389 752496 745671 737416 728765 720295 711699 702710 693980 686475 680318 675008 670555 667494 665736
59960 665736 664359 662923 662172 662933 664895 667069 669070 671394 674653 678982 684047 689275 694079 698123 701409
59945 701409 704071 706166 707692 708633 708926 708515 707440 705769 703512 700779 697901 695113 692253 689102 685896
59930 685896 683145 680976 679031 676935 674535 671786 668882 666384 664684 663383 661757 659880 658637 658501
59916 658501 658935 659321 659897 661409 664152 667703 671361 674569 677116 679227 681375 683945 687053 690558 693981
$$ packed form
60017F46373n116m500m524m389l568k543j835j114K03K000L461L852L195K312
60003F33807K125K789L710M429N077N717N898N362M748M826N395N652N482N587
59989G00604O336P175P394O977O473O289O322O068N088L418J565K7j088k039l220
59974G57389m893o825q255q651q470q596q989q730p505o157n310m453l061j758
59960F65736j377j436p51P61J962K174K001K324L259M329N065N228M804M044L286
59945G01409K662K095J526R41K93m11j075j671k257k733k878k788k860l151l206
59930F85896k751k169j945k096k400k749k904k498j700j301j626j877j243j36
59916F58501M34L86N76J512K743L551L658L208K547K111K148K570L108L505L423
$$ plain form
59901 693981 696626 698173 699098 700085 701152 701794 701904 701966 702325 702853 703465 704442 706162 709007 713545 720113 727981
59884 727981 735494 741333 745329 747958 749685 751080 752925 755649 758858 761776 763957 765359 766014 765872 764946
59869 764946 763494 762069 761148 760466 759013 756148 752412 748670 744779 740006 734630 730044 727047 724953 722760
59854 722760 720340 717979 715517 712645 709574 706836 704681 703070 701954 701258 700908 701102 702183 704045 706090
59839 706090 707968 709916 712198 714721 717473 720840 725178 730509 736819 744136 752094 759946 767352 774735
59825 774735 782632 791173 800310 809901 819258 827254 833213 837151 838856 837450 832391 824387 814829 804734
59811 804734 794618 784856 775591 766571 757458 748053 738087 727237 715613 703751 691991 680416 669530
59798 669530 660171 652372 645049 637360 629753 623233 618130 614003 610182 606020 601269 596667 593516 592128
$$ packed form
59901F93981K645J547R25R87J067O42J10O2L59N28O12R77J720K845M538O568P868
59884G27981P513N839L996K629J727J395J845K724L209K918K181J402O55j42r26
59869G64946j452j425r21o82j453k865l736l742l891m773n376m586k997k094k193
59854G22760k420k361k462k872l071k738k155j611j116o96l50J94J081J862K045
59839G06090J878J948K282K523K752L367M338N331O310P317P958P852P406P383
59825G74735P897Q541R137R591R357P996N959L938J705j406n059q004r558j0095
59811H04734j0116r762r265r020r113r405r966j0850j1624j1862j1760j1575j0886
59798F69530r359p799p323p689p607o520n103m127l821m162m751m602l151j388
$$ plain form
59784 592128 591315 589801 587486 584884 582151 579289 576539 573861 570660 566735 562868 559807 557362 555172
59770 555172 553618 553157 553438 553894 554528 555269 555340 554375 553487 554023 555794 557722 559771 562787 566642 570014 572218
59753 572218 574040 576460 579593 583258 587728 593352 599830 606213 611540 615516 618747 622017 625136 627014
59739 627014 627250 626932 627200 627660 627148 625531 623734 622341 621265 620536 620310 620156 619331 617849 616424 615433 614696
59722 614696 614142 613789 613226 611994 610438 609251 608317 607022 605658 605429 606874 609246 611515 613159 613934 613949
59706 613949 614108 615468 617897 620293 622343 625028 629092 634061 639220 644534 650069 655382 660186 664902
59692 664902 669908 674801 679023 682725 686469 690491 694766 699353 704132 708418 711324 712463 712149 711142
59678 711142 710242 709741 709148 707704 705213 701985 698127 693513 688472 683762 679687 675849 671976 668295 664890
$$ packed form
59784E92128q13j514k315k602k733k862k750k678l201l925l867l061k445k190
59770E55172j554m61K81M56O34P41P1r65q88N36J771J928K049L016L855L372K204
59753E72218J822K420L133L665M470N624O478O383N327L976L231L270L119J878
59739F27014K36l18K68M60n12j617j797j393j076p29k26j54q25j482j425r91p37
59722F14696n54l53n63j232j556j187r34j295j364k29J445K372K269J644P75J5
59706F13949J59J360K429K396K050K685M064M969N159N314N535N313M804M716
59692F64902N006M893M222L702L744M022M275M587M779M286K906J139l14j007
59678G11142r00n01n93j444k491l228l858m614n041m710m075l838l873l681l405
$$ plain form
59663 664890 661403 657763 654604 652567 651685 651766 652721 654188 655492 656599 658572 662408 667756 673304 678123
59648 678123 682062 685145 687286 688573 689256 689289 688219 685670 681697 676586 670505 663533 656034 648825 642723
59633 642723 637865 633713 629884 626733 624866 624262 624184 623772 622462 620171 617519 615606 615016 615146 615006 614365
59617 614365 613498 612170 609855 606972 604901 604428 604937 605481 605925 606568 607269 607510 607039 606041 604931 604235 604356
59600 604356 605095 605614 605090 603330 600766 598186 596414 595785 595741 595360 594383 593382 592790 592279 591318 589942 588663
59583 588663 587865 587431 586820 585460 583278 580810 578532 576321 573930 571724 570234 569136 567498 565159 563006
59568 563006 561586 560175 557717 554169 550444 547446 545572 544823 544882 545202 545366 545370 545478 545975 547068 548746 550642
59551 550642 552234 553228 553645 553730 554100 555674 558888 563083 567261 571362 576148 581904 588061 594303 601295
$$ packed form
59663F64890l487l640l159k037q82Q1R55J467J304J107J973L836N348N548M819
59648F78123L939L083K141J287O83L3j070k549l973n111o081o972p499p209o102
59633F42723m858m152l829l151j867o04p8m12j310k291k652j913n90J30j40o41
59617F14365q67j328k315k883k071m73N09N44M44O43P01K41m71r98j110o96J21
59600F04356P39N19n24j760k564k580j772o29m4l81r77j001n92n11r61j376j279
59583E88663p98m34o11j360k182k468k278k211k391k206j490j098j638k339k153
59568E63006j420j411k458l548l725k998j874p49N9L20J64MJ08M97J093J678J896
59551E50642J592R94M17Q5L70J574L214M195M178M101M786N756O157O242O992
$$ plain form
59536 601295 609913 620165 631149 641671 650851 658594 665730 673359 682064 692084 703904 717742 732333
59523 732333 745120 754097 759102 761279 762039 762678 764054 765948 767217 766998 765385 762698 758622 752454 743813
59508 743813 732816 719996 706311 692789 679896 667600 656117 646050 637620 630377 623945 618508
59496 618508 614334 611358 609475 608699 608726 608871 608729 608517 608619 609267 610721 613053 615625 617525 618795 620494
59480 620494 623256 626579 629845 633237 637179 641682 646802 653031 660558 668700 676645 684182 691194 697113
59466 697113 701660 705648 710215 715428 720214 723453 724760 724565 724010 724528 726980 731277 737058 744493 754170
59451 754170 766507 781488 798631 816965 835403 853280 870171 885235 897389 906319 912600 916674
59439 916674 918456 918144 916404 913233 907480 898191 885794 871409 855697 839068 822351 806467 791824
$$ packed form
59536F01295Q618J0252J0984J0522R180P743P136P629Q705J0020J1820J3838J4591
59523G32333J2787Q977N005K177P60O39J376J894J269k19j613k687m076o168q641
59508G43813j0997j2820j3685j3522j2893j2296j1483j0067q430p243o432n437
59496F18508m174k976j883p76K7J45j42k12J02O48J454K332K572J900J270J699
59480F20494K762L323L266L392L942M503N120O229P527Q142P945P537P012N919
59466F97113M547L988M567N213M786L239J307j95n55N18K452M297N781P435R677
59451G54170J2337J4981J7143J8334J8438J7877J6891J5064J2154Q930O281M074
59439I16674J782l12j740l171n753r289j2397j4385j5712j6629j6717j5884j4643
$$ plain form
59426 791824 778606 767179 757672 749703 743148 738661 736794 737190 739369 743863 751799 763628 778866
59413 778866 796758 816547 837217 857510 876106 891739 903610 911968 917807 921886 924725 927555
59401 927555 931891 937393 941132 939960 933044 921560 906940 890485 873765 858061 843796 831497
59389 831497 822611 817945 815492 811106 801553 786346 767015 745724 724555 705032 687779 672809
59377 672809 660001 649086 639702 631946 626363 622866 620372 618137 616729 616754 617464 617760 617981 619389 622261
59362 622261 625747 629396 633507 638071 642617 647221 652620 659189 666743 675345 685394 696825 709172
59349 709172 722486 737358 753985 772075 791715 813443 837336 862721 888916 915529 941990
59338 941990 967475 991289 1012737 1030784 1044618 1054391 1060662 1063267 1061681 1056327 1048505 1038946 1027387
$$ packed form
59426G91824j3218j1427r507p969o555m487j867L96K179M494P936J1829J5238
59413G78866J7892J9789K0670K0293J8596J5633J1871Q358N839M079K839K830
59401I27555M336N502L739j172o916j1484j4620j6455j6720j5704j4265j2299
59389H31497q886m666k453m386r553j5207j9331k1291k1169j9523j7253j4970
59377F72809j2808j0915r384p756n583l497k494k235j408K5P10K96K21J408K872
59362F22261L486L649M111M564M546M604N399O569P554Q602J0049J1431J2347
59349G09172J3314J4872J6627J8090J9640K1728K3893K5385K6195K6613K6461
59338I41990K5485K3814K1448J8047J3834R773O271K605j586n354p822r559j1559
$$ plain form
59325 1027387 1013640 998222 981854 965181 949065 934287 920813 908144 896372 886024 876882
59314 876882 867960 858797 849862 841519 833508 825613 817924 810259 802342 794758 788690 784335 780569 776604
59300 776604 773036 770747 769732 769661 770739 773254 776903 781261 786370 792242 798381 804589 811760 821004 832088
59285 832088 843489 854020 863851 873887 884637 895914 907288 918473 929326 939805 950249 961540
59273 961540 974594 989587 1006121 1024277 1045011 1069109 1096107 1124360 1151554 1174766 1191011
59262 1191011 1198837 1199057 1193169 1181556 1164113 1141951 1117075 1090543 1062365 1033204 1004770 978114
59250 978114 952757 928039 904353 882503 862693 844734 828635 814488 802271 792102 784173 778231
59238 778231 773714 770559 769238 769832 771833 775056 779878 786162 792747 798499 803257 807206 809945 810769 809477
$$ packed form
59325A027387j3747j5418j6368j6673j6116j4778j3474j2669j1772j0348r142
59314H76882q922r163q935q343q011p895p689p665p917p584o068m355l766l965
59300G76604l568k289j015p1J078K515L649M358N109N872O139O208P171R244J1084
59285H32088J1401J0531R831J0036J0750J1277J1374J1185J0853J0479J0444J1291
59273I61540J3054J4993J6534J8156K0734K4098K6998K8253K7194K3212J6245
59262A191011P826K20n888j1613j7443k2162k4876k6532k8178k9161k8434k6656
59250I78114k5357k4718k3686k1850j9810j7959j6099j4147j2217j0169p929n942
59238G78231m517l155j321N94K001L223M822O284O585N752M758L949K739Q24j292
$$ plain form
59223 809477 806341 801554 795108 786973 777143 765750 753358 740839 728820 717522 707143 697970 690014
59210 690014 682980 676775 671660 667895 665626 665031 665972 667465 668215 667877 667298 667402 668375 670010 672188 674735
59194 674735 677351 679976 682890 686370 690614 695908 702327 709343 716308 723331 731009 739340 747606 755394
59180 755394 762970 770572 777994 785078 791979 798828 805678 812744 820092 827242 833776 840191 847269 854861
59166 854861 862390 870390 880162 891701 903385 914118 924446 934912 944642 952440 958250 962478 964619
59153 964619 963564 958858 950985 940791 929185 916922 904221 891000 877785 865648 854899 844660
59141 844660 834321 824685 816925 811023 805950 800962 796098 791788 788552 786780 786386 786954 788364 790818
59127 790818 794134 797813 802025 807656 814958 823109 831646 841346 852910 865677 878663 892206 907467
$$ packed form
59223H09477l136m787o446q135r830j1393j2392j2519j2019j1298j0379r173p956
59210F90014p034o205n115l765k269n95R41J493P50l38n79J04R73J635K178K547
59194F74735K616K625K914L480M244N294O419P016O965P023P678Q331Q266P788
59180G55394P576P602P422P084O901O849O850P066P348P150O534O415P078P592
59166H54861P529Q000R772J1539J1684J0733J0328J0466R730P798N810M228K141
59153I64619j055m706p873j0194j1606j2263j2701j3221j3215j2137j0749j0239
59141H44660j0339r636p760n902n073m988m864m310l236j772l94N68J410K454
59127G90818L316L679M212N631P302Q151Q537R700J1564J2767J2986J3543J5261
$$ plain form
59114 907467 924656 942731 960686 978279 995505 1011979 1026880 1039224 1048456 1055067 1060235 1064460
59102 1064460 1066987 1066960 1064626 1060849 1055937 1049597 1041670 1032242 1021300 1008939 995861 983202 971873
59089 971873 962209 953971 946491 939173 932102 925796 920148 914112 906674 897660 887349 875929 863734
59076 863734 851388 839232 827031 814634 802508 791242 780980 771621 763051 754929 746880 739231
59064 739231 732904 728186 724306 720593 717275 714555 711755 708180 704263 701029 698795 697057 695283 693210
59050 693210 690742 688155 686110 684947 684187 683104 681451 679386 677183 675392 674734 675378 676664 677886 678972
59035 678972 680248 682129 685146 689507 694438 698846 702844 707651 713677 719930 725871 732516 740829 750236
59021 750236 759914 770462 782927 796849 810602 823232 834734 844823 852576 857223 858456 856242
$$ packed form
59114I07467J7189J8075J7955J7593J7226J6474J4901J2344R232O611N168M225
59102A064460K527k7k334l777m912o340p927r428j0942j2361j3078j2659j1329
59089I71873r664q238p480p318p071o306n648o036p438r014j0311j1420j2195
59076H63734j2346j2156j2201j2397j2126j1266j0262r359q570q122q049p649
59064G39231o327m718l880l713l318k720k800l575l917l234k234j738j774k073
59050F93210k468k587k045j163p60j083j653k065k203j791o58O44J286J222J086
59035F78972J276J881L017M361M931M408L998M807O026O253N941O645Q313R407
59021G50236R678J0548J2465J3922J3753J2630J1502J0089P753M647J233k214
$$ plain form
59009 856242 851104 844346 837312 830705 825104 821431 820119 820499 821923 824902 830171 837232 844975 853239
58995 853239 862463 872055 880402 886565 890962 894316 896823 898452 899203 898819 896704 892260 885069 875093 863098
58980 863098 850570 838697 827770 817808 809171 802086 796289 791794 789289 789111 790589 793234 797758 804904
58966 804904 814070 824203 835370 848196 862386 877186 892821 909923 927691 944039 957546 967930
58954 967930 974595 976156 971888 962671 950165 935750 920371 904527 888168 871153 853937 837368
58942 837368 822037 808408 797208 788852 782728 777865 774057 771513 769780 768068 766420 765433 764874 763660
58928 763660 761318 758391 755251 751366 746006 739031 730851 722233 714170 707315 701532 696467 692346 689609
58914 689609 688099 687345 687357 688305 689726 691010 692495 695138 699200 704120 709596 715905 723229 731543 741052
$$ packed form
59009H56242n138o758p034o607n601l673j312L80J424K979N269P061P743Q264
58995H53239R224R592Q347O163M397L354K507J629P51l84k115m444p191r976j1995
58980H63098j2528j1873j0927r962q637p085n797m495k505j78J478K645M524P146
58966H04904R166J0133J1167J2826J4190J4800J5635J7102J7768J6348J3507J0384
58954I67930O665J561m268r217j2506j4415j5379j5844j6359j7015j7216j6569
58942H37368j5331j3629j1200q356o124m863l808k544j733j712j648r87n59j214
58928G63660k342k927l140l885n360o975q180q618q063o855n783n065m121k737
58914F89609j510p54J2R48J421J284J485K643M062M920N476O309P324Q314R509
$$ plain form
58899 741052 751918 763626 775535 787962 801798 817133 833230 849921 868110 888678 911639
58888 911639 936495 962807 990307 1018943 1048701 1078895 1107846 1133761 1155663 1173060 1185445
58877 1185445 1192970 1196939 1198449 1196866 1190685 1179583 1164598 1146711 1126515 1105086 1083905 1063866
58865 1063866 1045288 1028614 1013956 1000199 985845 970733 955773 941126 925918 909719 893043
58854 893043 876228 859074 841720 824839 808779 793529 779557 767602 757579 748703 740653 733497
58842 733497 726554 718614 709481 700145 691350 683089 675505 668949 662974 656586 649824 643911 639554 636131
58828 636131 632826 629398 625618 621180 616586 613028 610981 609821 609092 609119 610109 611679 613583 615985 618772
58813 618772 621561 624519 628201 632386 636101 638931 641243 643112 644214 644871 645894 647214 648011 648397 649453
$$ packed form
58899G41052J0866J1708J1909J2427J3836J5335J6097J6691J8189K0568K2961
58888I11639K4856K6312K7500K8636K9758L0194K8951K5915K1902J7397J2385
58877A185445P525L969J510j583o181j1102j4985j7887k0196k1429k1181k0039
58865A063866j8578j6674j4658j3757j4354j5112j4960j4647j5208j6199j6676
58854H93043j6815j7154j7354j6881j6060j5250j3972j1955j0023q876q050p156
58842G33497o943p940r133r336q795q261p584o556n975o388o762n913m357l423
58828F36131l305l428l780m438m594l558k047j160p29K7R90J570J904K402K787
58813F18772K789K958L682M185L715K830K312J869J102O57J023J320P97L86J056
$$ plain form
58798 649453 651263 652463 652400 652261 653221 654753 655698 655904 655882 655731 655443 655603 656927 659546 663343 668512 675212
58781 675212 683021 691126 698752 705383 711034 716330 721768 726996 731382 734854 737284 737483 734160 727801
58767 727801 720317 712888 705419 698046 691567 686153 681050 675925 671253 667216 663554 660748 659847 660749 662079
58752 662079 663138 664570 666758 669102 671372 674256 678033 682100 686392 691839 698821 706618 714945 724496
58738 724496 735368 746501 757427 769030 781749 794539 806525 818178 829936 841131 851347
58727 851347 861398 871789 881524 889607 896499 902937 908516 912768 916656 921715 928418 936409 945490 955398
58713 955398 965407 975042 984359 992854 999088 1002187 1002659 1000969 996494 988746 978379 965911 950577
58700 950577 931624 909742 886184 861424 835759 810194 785532 761500 737860 715610 696018
$$ packed form
58798F49453J810J200o3j39R60J532R45K06k2j51k88J60J324K619L797N169O700
58781F75212P809Q105P626O631N651N296N438N228M386L472K430J99l323o359
58767G27801p484p429p469p373o479n414n103n125m672m037l662k806r01R02J330
58752F62079J059J432K188K344K270K884L777M067M292N447O982P797Q327R551
58738G24496J0872J1133J0926J1603J2719J2790J1986J1653J1758J1195J0216
58727H51347J0051J0391R735Q083O892O438N579M252L888N059O703P991R081R908
58713I55398J0009R635R317Q495O234L099M72j690m475p748j0367j2468j5334
58700I50577j8953k1882k3558k4760k5665k5565k4662k4032k3640k2250j9592
$$ plain form
58689 696018 679216 664719 652468 642420 633918 626400 619993 614597 609313 603605 598133 593560 589505
58676 589505 585485 581846 578905 576240 573784 572490 572964 574590 577037 581380 588464 597366 606815 617157
58662 617157 629409 643227 657189 670386 682351 691982 697890 699622 697700 692919 686302 679031 671672
58649 671672 664017 656143 648650 641431 633497 624775 616757 610517 605436 600787 597110 594928 593488 592063
58635 592063 591160 591176 591191 590395 589439 588996 588301 586520 584228 581985 578767 573506 567074 561161 556343 552880
58619 552880 552125 555163 561019 568087 576486 587122 599263 611035 621853 632608 643866 655387 666855
58606 666855 677605 686161 691481 694123 695048 694184 691426 687956 684960 681974 678098 673929 670670 668220
58592 668220 665838 663822 662900 662843 663370 665596 670823 678729 688373 699987 713992 729197 743940 758153
$$ packed form
58689F96018j6802j4497j2251j0048q502p518o407n396n284n708n472m573m055
58676E89505m020l639k941k665k456j294M74J626K447M343P084Q902R449J0342
58662F17157J2252J3818J3962J3197J1965R631N908J732j922m781o617p271p359
58649F71672p655p874p493p219p934q722q018o240n081m649l677k182j440j425
58635E92063r03J6J5p96r56m43o95j781k292k243l218n261o432n913m818l463
58619E52880p55L038N856P068Q399J0636J2141J1772J0818J0755J1258J1521J1468
58606F66855J0750Q556N320K642R25q64k758l470k996k986l876m169l259k450
58592F68220k382k016r22n7N27K226N227P906R644J1614J4005J5205J4743J4213
$$ plain form
58578 758153 772454 786107 797910 808220 817984 826549 832579 836534 840178 844279 848874 855137 864674
58565 864674 877407 892238 909427 930198 954352 980241 1006710 1033198 1058476 1081294 1101744
58554 1101744 1119957 1134115 1141918 1143535 1140979 1135153 1125811 1113872 1101223 1088383 1074630 1060218
58542 1060218 1046231 1032498 1017896 1002493 987126 971125 952793 932047 910397 888562 866440
58531 866440 845182 826760 811363 797565 785089 775085 767711 761853 757360 755163 755012 755406 756016
58518 756016 757866 760888 763657 765815 768449 771707 774307 775938 777924 780912 783850 785832 787190 788364
58504 788364 789358 790519 792180 793479 793254 792002 791081 790241 787992 784237 780349 776808 773082 769649 767687
58489 767687 766761 765333 763639 763523 765321 767533 769869 773963 780603 788813 798158 809517 823011 837481
$$ packed form
58578G58153J4301J3653J1803J0310R764Q565O030L955L644M101M595O263R537
58565H64674J2733J4831J7189K0771K4154K5889K6469K6488K5278K2818K0450
58554A101744J8213J4158P803J617k556n826r342j1939j2649j2840j3753j4412
58542A060218j3987j3733j4602j5403j5367j6001j8332k0746k1650k1835k2122
58531H66440k1258j8422j5397j3798j2476j0004p374n858m493k197j51L94O10
58518G56016J850L022K769K158K634L258K600J631J986K988K938J982J358J174
58504G88364R94J161J661J299k25j252r21q40k249l755l888l541l726l433j962
58489G67687r26j428j694j16J798K212K336M094O640Q210R345J1359J3494J4470
$$ plain form
58475 837481 852458 868301 883970 897140 906953 914252 918722 918513 913369 905540 896729 886527 874704
58462 874704 862642 851599 841644 833046 826660 822359 819179 817504 818906 823434 829354 835956 844188 854013
58448 854013 863603 871619 877838 881223 880177 875388 869698 864456 858622 852037 846634 843537 841772 840812
58434 840812 841597 844047 846405 848197 851171 856225 862056 867940 875063 883928 893198 902394 912965 925286
58420 925286 937246 947274 956167 964501 970838 974142 975577 976314 975819 973807 971597 969958 967725 963951
58406 963951 959479 955172 950674 946028 942359 939913 937559 935141 934026 934535 935317 936048 938055 941380 944034
58391 944034 945180 946138 947254 946851 944536 942403 941507 940125 937021 933519 930913 928833 927628 929152 933457
58376 933457 937720 940299 942967 947508 953126 958974 966129 975053 984036 992166 1001114 1012079 1023770 1035170
$$ packed form
58475H37481J4977J5843J5669J3170R813P299M470k09n144p829q811j0202j1823
58462H74704j2062j1043r955q598o386m301l180j675J402M528N920O602Q232R825
58448H54013R590Q016O219L385j046m789n690n242n834o585n403l097j765r60
58434H40812P85K450K358J792K974N054N831N884P123Q865R270R196J0571J2321
58420I25286J1960J0028Q893Q334O337L304J435P37m95k012k210j639k233l774
58406I63951m472m307m498m646l669k446k354k418j115N09P82P31K007L325K654
58391I44034J146R58J116m03k315k133q96j382l104l502k606k080j205J524M305
58376I33457M263K579K668M541N618N848P155Q924Q983Q130Q948J0965J1691J1400
$$ plain form
58362 1035170 1047404 1061099 1074803 1087805 1101558 1116562 1130937 1143737 1156360 1168851 1178327
58351 1178327 1183297 1186253 1189787 1193355 1196042 1199182 1203879 1209060 1214248 1221168 1230544 1240513 1250130 1261016
58337 1261016 1273640 1285786 1296774 1309213 1324288 1339471 1353323 1368222 1385537 1402517 1417100
58326 1417100 1431383 1446935 1460889 1470497 1477610 1484927 1491600 1496315 1500944 1507238 1513454 1518090 1523500
58313 1523500 1532070 1542298 1552333 1563785 1578381 1594480 1610537 1628271 1648745 1669294 1688087
58302 1688087 1707669 1730161 1753223 1774679 1796622 1820649 1843716 1863456 1883055 1905921 1929942
58291 1929942 1952043 1973982 1998295 2023003 2045882 2069740 2097743 2127609 2156087 2185094 2217578
58280 2217578 2251455 2283630 2316045 2351806 2389307 2426129 2464605 2507479 2552292 2596195 2641939
$$ packed form
58362A035170J2234J3695J3704J3002J3753J5004J4375J2800J2623J2491R476
58351A178327M970K956L534L568K687L140M697N181N188O920R376R969R617J0886
58337A261016J2624J2146J0988J2439J5075J5183J3852J4899J7315J6980J4583
58326A417100J4283J5552J3954R608P113P317O673M715M629O294O216M636N410
58313A523500Q570J0228J0035J1452J4596J6099J6057J7734K0474K0549J8793
58302A688087J9582K2492K3062K1456K1943K4027K3067J9740J9599K2866K4021
58291A929942K2101K1939K4313K4708K2879K3858K8003K9866K8478K9007L2484
58280B217578L3877L2175L2415L5761L7501L6822L8476M2874M4813M3903M5744
$$ plain form
58269 2641939 2692760 2746013 2798567 2853789 2916049 2982807 3049439 3117456 3190525 3266916 3343456
58258 3343456 3422323 3506009 3590179 3669765 3747664 3829161 3912448 3993310 4074480 4161317 4252745
58247 4252745 4345576 4443257 4550990 4666651 4785874 4911290 5047248 5190646 5337058 5490552
58237 5490552 5656923 5832885 6013008 6201591 6405970 6623994 6850447 7089853 7349867
58228 7349867 7627928 7918045 8224920 8557320 8913709 9289265 9690745 10128811 10602162
58219 10602162 11105741 11647903 12242161 12889053 13584786 14340636 15174239 16089546 17086956
58210 17086956 18185847 19414721 20787595 22315073 24030898 25982093 28203227 30730944
58202 30730944 33636036 37011374 40940957 45519518 50895655 57259993 64806643 73757272
$$ packed form
58269B641939N0821N3253N2554N5222O2260O6758O6632O8017P3069P6391P6540
58258C343456P8867Q3686Q4170P9586P7899Q1497Q3287Q0862Q1170Q6837R1428
58247D252745R2831R7681J07733J15661J19223J25416J35958J43398J46412J53494
58237E490552J66371J75962J80123J88583K04379K18024K26453K39406K60014
58228G349867K78061K90117L06875L32400L56389L75556M01480M38066M73351
58219A0602162N03579N42162N94258O46892O95733P55850Q33603R15307R97410
58210A7086956J098891J228874J372874J527478J715825J951195K221134K527717
58202C0730944K905092L375338L929583M578561N376137O364338P546650Q950629
$$ plain form
58194 73757272 84422942 97211910 112614043 131251566 153929347 181548114 214911848
58187 214911848 254455307 299607123 347639297 392841769 427483453 444824914 442273307
58180 442273307 422236125 390238260 352158865 312554135 274388046 239350218 208185724
58173 208185724 181029309 157740851 138071551 121656225 108029584 96733940 87386754
58166 87386754 79652155 73219690 67838667 63327170 59524930 56273745 53461032 51046185
58158 51046185 49021428 47370573 46077258 45138934 44549146 44295035 44400607 44936075 45907733
58149 45907733 47096346 48025784 48146986 47110702 44913485 41828032 38222192 34425545
58141 34425545 30693360 27208200 24072783 21314564 18920249 16867317 15123793 13640941
$$ packed form
58194G3757272J0665670J2788968J5402133J8637523K2677781K7618767L3363734
58187B14911848L9543459M5151816M8032174M5202472L4641684J7341461k551607
58180D42273307k0037182l1997865l8079395l9604730l8166089l5037828l1164494
58173B08185724k7156415k3288458j9669300j6415326j3626641j1295644r347186
58166H7386754p734599o432465n381023m511497l802240l251185k812713k414847
58158E1046185k024757j650855j293315r38324n89788k54111J05572N35468R71658
58149D5907733J188613R29438J21202j036284k197217l085453l605840l796647
58141C4425545l732185l485160l135417k758219k394315k052932j743524j482852
$$ plain form
58133 13640941 12368621 11274124 10335597 9526208 8818656 8198323 7657649 7181891 6752972
58124 6752972 6363043 6011484 5691607 5392096 5108863 4844116 4595975 4359762 4137334
58115 4137334 3934454 3750310 3579247 3420975 3279355 3152873 3035768 2926969 2828447 2736273
58105 2736273 2643006 2548156 2457295 2371664 2287566 2205277 2129444 2060659 1994870 1931178 1872464
58094 1872464 1818532 1766291 1716407 1672351 1633163 1594554 1556663 1523285 1493976 1464577 1435178
58083 1435178 1409711 1387519 1363133 1335006 1307108 1281227 1254861 1227474 1201781 1177767 1152145
58072 1152145 1124878 1099827 1077910 1055859 1032821 1011942 994254 977000 959357 944002 931677
58061 931677 919778 907650 897819 890617 882807 872901 862837 853243 841986 828628 815546 803531
$$ packed form
58133A3640941j272320j094497r38527q09389p07552o20333n40674m75758m28919
58124F752972l89929l51559l19877k99511k83233k64747k48141k36213k22428
58115D137334k02880j84144j71063j58272j41620j26482j17105j08799r8522r2174
58105B736273r3267r4850r0861q5631q4098q2289p5833o8785o5789o3692n8714
58094A872464n3932n2241m9884m4056l9188l8609l7891l3378k9309k9399k9399
58083A435178k5467k2192k4386k8127k7898k5881k6366k7387k5693k4014k5622
58072A152145k7267k5051k1917k2051k3038k0879j7688j7254j7643j5355j2325
58061I31677j1899j2128r831p202p810r906j0064r594j1257j3358j3082j2015
$$ plain form
58049 803531 790943 778067 767498 759258 750322 739924 730598 723135 715375 706997 700543 696492 692094
58036 692094 686397 681700 678659 674521 667773 660248 653170 645233 635886 626519 617235 606448 594654 584408
58022 584408 575649 565433 553329 542582 534650 527111 518478 510622 504767 499385 493877 490161 488704
58009 488704 486908 483358 480019 478425 477385 476160 476138 477536 478087 476895 476076 476837 477496 477292 478463 482453
57993 482453 487430 491751 496657 503377 510608 517028 523483 530642 537207 542293 546950 551557 554461 554816
57979 554816 554144 553505 551914 548993 546322 544538 542057 538283 535171 533906 532951 531099 529472 528701 527109
57964 527109 523699 520134 517751 515346 511844 508410 505906 502937 498474 493736 489446 483947 476268 468453
57950 468453 462509 457502 451983 446903 443633 441295 438579 436296 435762 436393 437048 438037 439859 441747 443433
$$ packed form
58049H03531j2588j2876j0569q240q936j0398r326p463p760q378o454m051m398
58036F92094n697m697l041m138o748p525p078p937r347r367r284j0787j1794j0246
58022E84408q759j0216j2104j0747p932p539q633p856n855n382n508l716j457
58009D88704j796l550l339j594j040j225k2J398N51j192q19P61O59k04J171L990
57993D82453M977M321M906O720P231O420O455P159O565N086M657M607K904L55
57979E54816o72o39j591k921k671j784k481l774l112j265r55j852j627p71j592
57964E27109l410l565k383k405l502l434k504k969m463m738m290n499p679p815
57950D68453n944n007n519n080l270k338k716k283n34O31O55R89J822J888J686
$$ plain form
57935 443433 446520 452137 458987 465578 472488 480604 489069 496923 504772 512820 519236 522785 525279 529183
57921 529183 534309 538983 542898 546655 549934 552294 554533 557308 559623 560406 560181 559475 557109 551985 545093
57906 545093 537918 530292 521611 512607 503885 494067 481539 466977 452350 438541 425623 414227 404749
57893 404749 396204 387529 379078 371509 364495 357975 353201 350894 349692 348064 346483 346124 346776 347660 348981
57878 348981 351018 352995 354452 356361 359374 362413 364633 367104 370797 374449 376398 377106 377882 378520 378249
57863 378249 377701 377820 378030 377545 377288 378398 379963 380445 380333 381230 383227 385370 387859 391578 396112 400344
57847 400344 404436 409300 414701 419819 425082 431514 438711 445322 451103 456851 462754 468429 474040 479810
57833 479810 484852 487920 488784 487663 484225 478664 472755 468132 464232 459537 454018 448743 443932 439137
$$ packed form
57935D43433L087N617O850O591O910Q116Q465P854P849Q048O416L549K494L904
57921E29183N126M674L915L757L279K360K239K775K315P83k25p06k366n124o892
57906E45093p175p626q681r004q722r818j2528j4562j4627j3809j2918j1396r478
57893D04749q545q675q451p569p014o520m774k307j202j628j581l59O52Q84J321
57878C48981K037J977J457J909L013L039K220K471L693L652J949P08P76O38k71
57863C78249n48J19K10m85k57J110J565M82j12Q97J997K143K489L719M534M232
57847D00344M092M864N401N118N263O432P197O611N781N748N903N675N611N770
57833D79810N042L068Q64j121l438n561n909m623l900m695n519n275m811m795
$$ plain form
57819 439137 434593 430674 426808 422586 419116 417496 416818 415597 414369 414782 416779 418747 420080 421554 423465
57804 423465 425304 427076 429179 431113 431997 432124 432438 432700 431718 429136 425548 421200 416084 410965 406768
57789 406768 403132 398910 393815 388321 382439 375936 369321 363288 357734 352554 348640 346619 345337 343178
57775 343178 340256 337790 336076 334737 334275 335500 337947 340569 343550 347742 352818 357707 362338 367320
57761 367320 372472 377331 382418 388130 393140 395979 397615 400259 404004 406920 408149 408585 408562 407232 404438
57746 404438 401067 397223 392052 385730 379780 374933 370378 365437 360426 355544 350530 345800 342447 340721
57732 340721 339714 338727 337783 336807 335616 334697 334705 335277 335620 336016 337314 339189 340476 341054 341844 343128 344479
57715 344479 346087 348459 351019 352794 354299 356812 359891 361598 361263 360062 358727 356785 354372 352740
$$ packed form
57819D39137m544l919l866m222l470j620o78j221j228M13J997J968J333J474J911
57804D23465J839J772K103J934Q84J27L14K62r82k582l588m348n116n119m197
57789D06768l636m222n095n494n882o503o615o033n554n180l914k021j282k159
57775C43178k922k466j714j339m62J225K447K622K981M192N076M889M631M982
57761C67320N152M859N087N712N010K839J636K644L745K916J229M36k3j330k794
57746D04438l371l844n171o322n950m847m555m941n011m882n014m730l353j726
57732C40721j007r87r44r76j191r19QN72L43L96J298J875J287N78P90J284J351
57715C44479J608K372K560J775J505K513L079J707l35j201j335j942k413j632
$$ plain form
57701 352740 352350 352283 352122 352751 354687 357172 359491 361783 364151 366306 368410 370838 372937 373605 373344 373985
57685 373985 376078 378273 379699 381136 383266 385566 387793 391067 396652 404923 416178 431196 450409
57672 450409 473838 502373 537826 581090 631218 686433 744498 801845 854210 899221 937540
57661 937540 971265 1002481 1033135 1063820 1091215 1108104 1107380 1085925 1045043 989077 924287 857190
57649 857190 792285 731530 676027 626999 584929 549236 519386 495104 475274 458256 443760
57638 443760 432796 425206 418996 412880 407707 404354 401868 398965 395934 393664 391912 389856 387524 385519
57624 385519 384072 383221 383177 383685 383783 382936 381706 380828 380471 380796 382115 383957 385104 385082 384536 383711 382040 379870
57606 379870 378997 380447 383036 385178 386928 389147 391790 394229 396380 398404 400062 401252 402376 403385
$$ packed form
57701C52740l90o7j61O29J936K485K319K292K368K155K104K428K099O68k61O41
57685C73985K093K195J426J437K130K300K227L274N585Q271J1255J5018J9213
57672D50409K3429K8535L5453M3264N0128N5215N8065N7347N2365M5011L8319
57661I37540L3725L1216L0654L0685K7395J6889p24k1455m0882n5966o4790o7097
57649H57190o4905o0755n5503m9028m2070l5693k9850k4282j9830j7018j4496
57638D43760j0964p590o210o116n173l353k486k903l031k270j752k056k332k005
57624C85519j447q51m4N08R8q47j230q78l57L25J319J842J147k2n46q25j671k170
57606C79870q73J450K589K142J750K219K643K439K151K024J658J190J124J009
$$ plain form
57592 403385 403414 402220 400975 400692 400827 400368 399346 398212 396667 394341 391940 390577 390396 390714 391033 391125 390749
57575 390749 389990 389338 388816 387733 385808 383763 382143 380452 378072 375242 372426 369643 367076 365482 365213
57560 365213 365628 366076 366604 367116 366983 366179 365770 366446 367609 368670 370092 372270 374522 376259 378085 380666
57544 380666 383552 386216 389283 393495 398321 402760 406743 410681 414447 417918 421675 425987 429941 432786
57530 432786 435309 438566 442055 444551 446164 448085 450702 453341 455603 457741 459905 462097 464768 468465
57516 468465 472977 477476 481276 483948 485290 485860 486914 489104 491837 494500 497454 501011 504423 506918
57502 506918 508902 511058 513081 514433 515578 517268 519293 521082 522838 524860 526524 527297 528079 530068 532789
57487 532789 534714 535458 535931 536637 537292 537994 539333 541303 543220 544769 546253 547952 550163 553543 558349
$$ packed form
57592D03385K9j194j245k83J35m59j022j134j545k326k401j363j81L18L19R2l76
57575C90749p59o52n22j083j925k045j620j691k380k830k816k783k567j594k69
57560C65213M15M48N28N12j33q04m09O76J163J061J422K178K252J737J826K581
57544C80666K886K664L067M212M826M439L983L938L766L471L757M312L954K845
57530D32786K523L257L489K496J613J921K617K639K262K138K164K192K671L697
57516D68465M512M499L800K672J342N70J054K190K733K663K954L557L412K495
57502E06918J984K156K023J352J145J690K025J789J756K022J664P73P82J989K721
57487E32789J925P44M73P06O55P02J339J970J917J549J484J699K211L380M806
$$ plain form
57472 558349 563578 567883 571167 574395 578163 582424 587187 592341 597083 600693 603629 606879 610528 614051
57458 614051 617658 622031 626964 631506 635491 639754 644774 650134 655385 660544 665698 670952 676681 683027
57444 683027 689235 694311 698268 701994 706123 710716 715750 721123 726500 731955 738344 746168 754507 762013
57430 762013 768514 774639 780366 785252 789798 795273 802095 809364 816000 821578 826267 830719 835777 841552
57416 841552 847179 852146 857168 862949 868984 874797 881345 889622 898587 906305 912700 919322 926688 933864
57402 933864 940683 948334 957321 966560 975072 983146 991335 999637 1008184 1017527 1027685 1037959 1048054
57389 1048054 1058337 1068722 1078470 1087513 1096818 1106954 1117314 1127306 1137321 1147987 1159238 1170661
57377 1170661 1182099 1193530 1204919 1216441 1228338 1240415 1252259 1263889 1275516 1286816 1297245
$$ packed form
57472E58349N229M305L284L228L768M261M763N154M742L610K936L250L649L523
57458F14051L607M373M933M542L985M263N020N360N251N159N154N254N729O346
57444F83027O208N076L957L726M129M593N034N373N377N455O389P824Q339P506
57430G62013O501O125N727M886M546N475O822P269O636N578M689M452N058N775
57416H41552N627M967N022N781O035N813O548Q277Q965P718O395O622P366P176
57402I33864O819P651Q987R239Q512Q074Q189Q302Q547R343J0158J0274J0095
57389A048054J0283J0385R748R043R305J0136J0360R992J0015J0666J1251J1423
57377A170661J1438J1431J1389J1522J1897J2077J1844J1630J1627J1300J0429
$$ plain form
57366 1297245 1307039 1317055 1327784 1339287 1351837 1365521 1379410 1392335 1404418 1416646 1429066
57355 1429066 1440773 1451795 1463526 1476903 1491390 1506207 1521372 1537060 1552932 1568619 1584055
57344 1584055 1599031 1613248 1627057 1641286 1656161 1671255 1686573 1702661 1719487 1736256 1752581
57333 1752581 1768835 1785209 1801498 1818023 1835594 1854272 1873121 1891479 1909497 1927343 1944972
57322 1944972 1962839 1981576 2000766 2019277 2037152 2055830 2076077 2096984 2117494 2137649 2157748
57311 2157748 2177534 2196975 2216761 2237306 2258142 2278929 2300111 2321985 2344041 2365860 2387822
57300 2387822 2410364 2433338 2456534 2479957 2503189 2525524 2547211 2569588 2593401 2617939 2642287
57289 2642287 2666433 2690628 2714705 2738710 2763264 2788708 2814715 2841198 2868587 2896731 2924611
$$ packed form
57366A297245R794J0016J0729J1503J2550J3684J3889J2925J2083J2228J2420
57355A429066J1707J1022J1731J3377J4487J4817J5165J5688J5872J5687J5436
57344A584055J4976J4217J3809J4229J4875J5094J5318J6088J6826J6769J6325
57333A752581J6254J6374J6289J6525J7571J8678J8849J8358J8018J7846J7629
57322A944972J7867J8737J9190J8511J7875J8678K0247K0907K0510K0155K0099
57311B157748J9786J9441J9786K0545K0836K0787K1182K1874K2056K1819K1962
57300B387822K2542K2974K3196K3423K3232K2335K1687K2377K3813K4538K4348
57289B642287K4146K4195K4077K4005K4554K5444K6007K6483K7389K8144K7880
$$ plain form
57278 2924611 2951801 2979164 3007515 3036608 3066042 3096072 3126808 3157744 3188832 3220945 3254417
57267 3254417 3288194 3321297 3354136 3387427 3420831 3453640 3485915 3517894 3549064 3578889 3607847
57256 3607847 3636881 3666422 3696611 3727620 3758933 3789257 3818128 3846763 3876366 3906489 3936186
57245 3936186 3965979 3997348 4030753 4065353 4100289 4135198 4169797 4203972 4238070 4272331 4306353
57234 4306353 4339775 4372930 4406103 4438687 4469968 4500249 4530337 4560381 4590064 4619435 4648657
57223 4648657 4677274 4704650 4730887 4756624 4782215 4807657 4832949 4858003 4882713 4907619 4933802
57212 4933802 4961470 4989358 5016248 5042378 5068582 5094860 5120825 5146834 5173511 5200495 5226706
57201 5226706 5251597 5275332 5298071 5319828 5340688 5360455 5378532 5394730 5409675 5423753 5436386
$$ packed form
57278B924611K7190K7363K8351K9093K9434L0030L0736L0936L1088L2113L3472
57267C254417L3777L3103L2839L3291L3404L2809L2275L1979L1170K9825K8958
57256C607847K9034K9541L0189L1009L1313L0324K8871K8635K9603L0123K9697
57245C936186K9793L1369L3405L4600L4936L4909L4599L4175L4098L4261L4022
57234D306353L3422L3155L3173L2584L1281L0281L0088L0044K9683K9371K9222
57223D648657K8617K7376K6237K5737K5591K5442K5292K5054K4710K4906K6183
57212D933802K7668K7888K6890K6130K6204K6278K5965K6009K6677K6984K6211
57201E226706K4891K3735K2739K1757K0860J9767J8077J6198J4945J4078J2633
$$ plain form
57190 5436386 5447118 5456682 5466099 5475399 5484153 5492556 5500966 5509018 5516288 5523182 5530067 5536197 5540815 5544761
57176 5544761 5549554 5555222 5560431 5564586 5568438 5572610 5576784 5580533 5583955 5587284 5590667 5594373 5598658 5603546
57162 5603546 5609243 5616323 5624850 5633844 5642510 5651509 5662031 5674041 5686382 5698114 5708709 5717413 5723639
57149 5723639 5727692 5729975 5729771 5725943 5718466 5708028 5694451 5676859 5655289 5630805 5604062 5574956
57137 5574956 5543743 5511314 5478379 5445511 5414075 5386049 5362727 5344404 5331147 5322952 5319349 5319943
57125 5319943 5325157 5335373 5349450 5365166 5380933 5396233 5410950 5425777 5442917 5464921 5493026
57114 5493026 5528124 5572955 5631475 5706098 5797511 5907329 6039001 6195855 6380463 6596822
57104 6596822 6851643 7153036 7509971 7934198 8441365 9049805 9780278 10658292 11715424
$$ packed form
57190E436386J0732R564R417R300Q754Q403Q410Q052P270O894O885O130M618L946
57176E544761M793N668N209M155L852M172M174L749L422L329L383L706M285M888
57162E603546N697P080Q527Q994Q666Q999J0522J2010J2341J1732J0595Q704O226
57149E723639M053K283k04l828p477j0438j3577j7592k1570k4484k6743k9106
57137E574956l1213l2429l2935l2868l1436k8026k3322j8323j3257q195l603N94
57125E319943N214J0216J4077J5716J5767J5300J4717J4827J7140K2004K8105
57114E493026L5098M4831N8520P4623R1413J09818J31672J56854J84608K16359
57104F596822K54821L01393L56935M24227N07167O08440P30473Q78014J057132
$$ plain form
57095 11715424 12987573 14513267 16333828 18491753 21025189 23962338 27318707 31093944
57087 31093944 35266285 39789228 44593791 49592036 54679594 59744413 64683978 69412965
57079 69412965 73840772 77830377 81181480 83667072 85103592 85405530 84594321 82770306
57071 82770306 80074651 76659548 72671328 68245215 63508144 58583575 53592754 48651568
57063 48651568 43865499 39324281 35096556 31226164 27732595 24615523 21860338 19442385
57055 19442385 17330456 15490475 13888601 12492807 11273764 10205983 9268471 8443908
57047 8443908 7717169 7074812 6505323 5998959 5547205 5142684 4779268 4451606 4154660
57038 4154660 3884242 3637790 3413819 3210562 3025729 2857515 2704968 2567107 2442348
$$ packed form
57095A1715424J272149J525694J820561K157925K533436K937149L356369L775237
57087C1093944M172341M522943M804563M998245N087558N064819M939565M728987
57079F9412965M427807L989605L351103K485592J436520L01938q11209j824015
57071H2770306k695655l415103l988220m426113m737071m924569m990821m941186
57063D8651568m786069m541218m227725l870392l493569l117072k755185k417953
57055A9442385k111929j839981j601874j395794j219043j067781r37512q24563
57047H443908p26739o42357n69489n06364m51754m04521l63416l27662k96946
57038D154660k70418k46452k23971k03257j84833j68214j52547j37861j24759
$$ plain form
57029 2442348 2329157 2226648 2134164 2050692 1975161 1907062 1846472 1793650 1748781 1711866 1682739
57018 1682739 1661442 1648678 1645401 1651597 1665663 1685265 1708719 1735427 1765282 1797925 1832370 1866952
57006 1866952 1899762 1929738 1957815 1986967 2020722 2061230 2108478 2161215 2218931 2283795 2361208
56995 2361208 2456987 2570557 2688224 2783947 2830142 2811134 2728510 2596076 2431717 2252870
56985 2252870 2075095 1910500 1766076 1643589 1540625 1451849 1371115 1294372 1220831 1151099
56975 1151099 1085161 1022863 965198 913559 868095 827850 792030 760067 731087 704590 681362
56964 681362 662498 647907 636945 630103 628687 633044 642521 656920 676229 698361 718386 730657
56952 730657 731408 719699 697320 668097 636143 604040 572897 543793 518189 496935 479873 466524
$$ packed form
57029B442348j13191j02509r2484q3472p5531o8099o0590n2822m4869l6915k9127
57018A682739k1297j2764l277O196J4066J9602K3454K6708K9855L2643L4445L4582
57006A866952L2810K9976K8077K9152L3755M0508M7248N2737N7716O4864P7413
56995B361208R5779J13570J17667R5723M6195j9008q2624j32434j64359j78847
56985B252870j77775j64595j44424j22487j02964q8776q0734p6743p3541o9732
56975A151099o5938o2298n7665n1639m5464m0245l5820l1963k8980k6497k3228
56964F81362j8864j4591j0962o842j416M357R477J4399J9309K2132K0025J2271
56952G30657P51j1709k2379k9223l1954l2103l1143k9104k5604k1254j7062j3349
$$ plain form
56940 466524 456510 449480 445593 445901 451307 461351 475168 493435 518065 549820 587102 626632
56928 626632 663716 692017 705287 700797 680589 649230 611195 570248 529555 491222 456237 425171
56916 425171 398288 374990 354258 335917 320597 308336 298184 289243 281070 273143 265171 257932
56904 257932 252479 248432 244484 240635 238237 237533 237010 235807 235113 236424 239919 245384 253155 263223 274855
56889 274855 288196 304987 326609 352478 381131 411410 441347 467193 485167 493776 493747 486816
56877 486816 475514 462833 450609 438796 427179 416794 408749 402922 399232 399069 403883 413162 425470
56864 425470 441009 461625 488740 522790 564334 613824 669449 725716 774428 807174 818332
56853 818332 807509 779454 741081 698394 655847 616860 583419 555736 533588 517719 509066 507257
$$ packed form
56940D66524j0014p030l887L08N406J0044J3817J8267K4630L1755L7282L9530
56928F26632L7084K8301J3270m490k0208l1359l8035m0947m0693l8333l4985l1066
56916D25171k6883k3298k0732j8341j5320j2261j0152q941q173p927p972p239
56904B57932n453m047l948l849k398p04n23j203o94J311L495N465P771J0068J1632
56889B74855J3341J6791K1622K5869K8653L0279K9937K5846J7974Q609k9o931
56877D86816j1302j2681j2224j1813j1617j0385q045n827l690j63M814R279J2308
56864D25470J5539K0616K7115L4050M1544M9490N5625N6267M8712L2746J1158
56853H18332j0823k8055l8373m2687m2547l8987l3441k7683k2148j5869q653j809
$$ plain form
56841 507257 511077 520174 535382 557828 588803 630190 683881 750759 830477 920746 1014773 1099638
56829 1099638 1159664 1183513 1169078 1122805 1055496 978106 899147 824037 755975 696920 647538
56818 647538 607131 574672 550005 533532 525157 524323 530945 545574 568759 600936 642852 695211
56806 695211 757072 823937 886903 934237 955793 947819 914120 862752 801921 738284 676765 620135
56794 620135 569187 524328 486608 456637 433470 415707 403099 396067 394336 397277 405208 419172
56782 419172 439598 466021 497619 532629 567045 594785 609698 607905 589440 558582 521795 484119
56770 484119 447396 412015 379115 350162 325412 304260 286476 271894 259468 248068 237796
56759 237796 229326 222324 215828 209820 205066 201556 198409 195247 192528 190508 188912 187532 186265 184743
$$ packed form
56841E07257L820R097J5208K2446L0975M1387N3691O6878P9718R0269R4027Q4865
56829A099638O0026K3849j4435m6273o7309p7390p8959p5110o8062n9055m9382
56818F47538m0407l2459k4667j6473q375q34O622J4629K3185L2177M1916N2359
56806F95211O1861O6865O2966M7334K1556p974l3699n1368o0831o3637o1519n6630
56794F20135n0948m4859l7720k9971k3167j7763j2608p032j731K941P931J3964
56782D19172K0426K6423L1598L5010L4416K7740J4913j793j8465l0858l6787l7676
56770D84119l6723l5381l2900k8953k4750k1152j7784j4582j2426j1400j0272
56759B37796q470p002o496o008m754l510l147l162k719k020j596j380j267j522
$$ plain form
56745 184743 182826 181201 180566 180559 180414 180177 180185 179843 178185 175410 172660 170567 169052 168140 167702 166845 164918
56728 164918 162784 161743 161601 161237 160631 160601 160857 160282 159197 159428 161728 164785 167226 169042 170612 171824
56712 171824 172750 173856 175000 175409 175072 174992 175683 176670 177780 179561 181934 183834 184731 185222 185548 184929 183166
56695 183166 181509 180928 180640 179424 177472 175790 174518 172960 170870 168741 167044 165893 165213 164701 163877
56680 163877 162622 161448 160880 160835 160854 160650 160269 160032 160381 161393 162462 162935 163026 163464 164260 164519 163611 161878
56662 161878 160037 158442 157064 155666 153910 151709 149451 147459 145458 143082 140590 138408 136302 133795
56648 133795 131052 128508 126002 123288 121004 120024 120118 120474 121297 123549 127245 131420 135790 140999 147110
56633 147110 153268 159125 165236 171716 177852 183366 188756 193947 197969 200489 202466 204700 206835 208315
$$ packed form
56745A84743j917j625o35pj45k37Ql42j658k775k750k093j515r12m38q57j927
56728A64918k134j041j42l64o06l0K56n75j085K31K300L057K441J816J570J212
56712A71824R26J106J144M09l37q0O91R87J110J781K373J900Q97M91L26o19j763
56695A83166j657n81k88j216j952j682j272j558k090k129j697j151o80n12q24
56680A63877j255j174n68m5J9k04l81k37L49J012J069M73R1M38P96K59r08j733
56662A61878j841j595j378j398j756k201k258j992k001k376k492k182k106k507
56648A33795k743k544k506k714k284r80R4L56Q23K252L696M175M370N209O111
56633A47110O158N857O111O480O136N514N390N191M022K520J977K234K135J480
$$ plain form
56619 208315 209279 209977 210313 210461 210942 211676 211919 211520 211250 211568 212155 212964 214501 216611 218243 219010 219841 221496
56601 221496 223435 224663 224652 223025 219618 215445 212373 211066 210248 208619 206401 204416 202864 201811 201705
56586 201705 202552 203481 203965 204552 205668 206696 206972 206799 206756 206938 207507 208959 211070 212680 213319 214049 215847
56569 215847 218175 220058 221567 223219 224864 226302 228203 231345 235581 240492 246355 253473 261165 268441
56555 268441 275213 282018 289064 296290 303803 311423 318309 323801 328188 332118 335837 339503 343492 347725
56541 347725 351417 354154 356488 358869 360790 361654 361634 360918 358986 355535 351393 347636 344455 341615 339204
56526 339204 337027 334007 329281 323439 317836 313109 309038 305287 301511 297306 292783 288763 285783 283335
56512 283335 280542 276994 272539 267052 260916 255019 249832 245246 241518 239226 237882 235902 232642 229221
$$ packed form
56619B08315R64O98L36J48M81P34K43l99k70L18N87Q09J537K110J632P67Q31J655
56601B21496J939J228j1j627l407m173l072j307q18j629k218j985j552j053j06
56586B01705Q47R29M84N87J116J028K76j73m3J82N69J452K111J610O39P30J798
56569B15847K328J883J509J652J645J438J901L142M236M911N863P118P692P276
56555B68441O772O805P046P226P513P620O886N492M387L930L719L666L989M233
56541C47725L692K737K334K381J921Q64k0p16j932l451m142l757l181k840k411
56526C39204k177l020m726n842n603m727m071l751l776m205m523m020k980k448
56512B83335k793l548m455n487o136n897n187m586l728k292j344j980l260l421
$$ plain form
56498 229221 226612 224307 221812 220012 219703 219943 219296 217860 216738 216301 216263 216710 217771 218869 219514 220209
56482 220209 221498 222747 222994 222429 221940 221813 221912 222525 223927 225620 226920 227768 228215 227944 227201 227207 228610 230449
56464 230449 231736 232987 234905 236673 237160 236964 237570 239104 240595 241955 243987 246681 249093 250820 252260
56449 252260 253583 254710 256098 258286 260816 262759 264112 265615 267392 268916 270095 271326 272658 273861
56435 273861 275072 276487 277731 278430 278947 279636 279902 279057 277669 276924 277029 277273 277252 277055 276645 276060 275764 275873
56417 275873 275582 274315 272816 272050 271703 270904 269800 269146 268935 268734 268824 269656 270635 270795 270374 270411 271068 271578
56399 271578 271633 271706 272101 272633 272993 272711 271221 268706 266218 264314 262424 260356 259145 259268 259269 257666 255198
56382 255198 253640 253402 253948 255580 258891 263169 267249 271362 276355 281668 285985 289442 293277 297624 301413
$$ packed form
56498B29221k609k305k495j800l09K40o47j436j122m37l8M47J061J098O45O95
56482B20209J289J249K47n65m89j27R9O13J402J693J300Q48M47k71p43OJ403J839
56464B30449J287J251J918J768M87j96O06J534J491J360K032K694K412J727J440
56449B52260J323J127J388K188K530J943J353J503J777J524J179J231J332J203
56435B73861J211J415J244O99N17O89K66q45j388p45J05K44k1j97m10n85k96J09
56417B75873k91j267j499p66l47p99j104o54k11k01R0Q32R79J60m21L7O57N10
56399B71578N5P3L95N32L60k82j490k515k488j904j890k068j211J23Jj603k468
56382B55198j558k38N46J632L311M278M080M113M993N313M317L457L835M347L789
$$ plain form
56367 301413 304186 306352 308018 309204 310806 313572 316522 318112 318548 319189 320123 320313 319793 319717 320299 320563
56351 320563 320058 319093 317470 314789 311854 310053 309472 309248 309448 310751 312612 313730 314134 314876 315898 316328
56335 316328 316725 318717 322272 325457 327229 328439 329796 330814 331236 331633 332142 332261 332312 333543 336407 340104
56319 340104 343946 347773 351064 353247 354934 357275 360142 362478 364218 366186 368303 369767 370817 372354
56305 372354 373898 373984 372699 371853 372498 374073 376017 378327 380524 382018 383526 386228 389593 392070 393750
56290 393750 396157 399407 401907 403009 403716 404626 405429 406617 409300 412988 415812 417295 418780 420932 423092
56275 423092 425292 428507 432604 436399 439986 444515 449454 452801 454502 456912 461170 465814 469829 474381
56261 474381 480469 487304 494128 501440 509413 517252 525035 534167 545264 557651 571456 587877 606753
$$ packed form
56367C01413K773K166J666J186J602K766K950J590M36O41R34J90n20p6N82K64
56351C20563n05r65j623k681k935j801n81k24K00J303J861J118M04P42J022M30
56335C16328L97J992L555L185J772J210J357J018M22L97N09J19N1J231K864L697
56319C40104L842L827L291K183J687K341K867K336J740J968K117J464J050J537
56305C72354J544Q6j285q46O45J575J944K310K197J494J508K702L365K477J680
56290C93750K407L250K500J102P07R10Q03J188K683L688K824J483J485K152K160
56275D23092K200L215M097L795L587M529M939L347J701K410M258M644M015M552
56261D74381O088O835O824P312P973P839P783R132J1097J2387J3805J6421J8876
$$ plain form
56248 606753 626350 646296 668238 692914 719200 746886 777611 811881 847757 883733 920524
56237 920524 958837 997737 1036366 1074908 1112718 1147866 1179631 1209112 1236399 1259602 1277620
56226 1277620 1291183 1300121 1302513 1297892 1288504 1275843 1258767 1236582 1211249 1184698 1156530 1126229
56214 1126229 1095103 1064215 1032778 1000575 969661 941744 915977 891085 867518 845801 825057
56203 825057 804905 786662 770922 756155 741336 727679 716173 705818 695987 687993 682462 677665
56191 677665 672413 668070 665675 663622 660460 657586 656788 657330 657781 658604 660554 662522 663269 663506 664258 665044
56175 665044 665577 667091 670021 672459 672929 672599 672932 673436 673630 674702 677125 679144 679821 681065 684320 687908
56159 687908 690135 692435 696746 702169 707026 711952 718189 724998 731494 738976 748703 759388 769479 779774
$$ packed form
56248F06753J9597J9946K1942K4676K6286K7686L0725L4270L5876L5976L6791
56237I20524L8313L8900L8629L8542L7810L5148L1765K9481K7287K3203J8018
56226A277620J3563Q938K392m621r388j2661j7076k2185k5333k6551k8168l0301
56214A126229l1126l0888l1437l2203l0914k7917k5767k4892k3567k1717k0744
56203H25057k0152j8243j5740j4767j4819j3657j1506j0355r831p994n531m797
56191F77665n252m343k395k053l162k874p98N42M51Q23J950J968P47K37P52P86
56175F65044N33J514K930K438M70l30L33N04J94J072K423K019O77J244L255L588
56159F87908K227K300M311N423M857M926O237O809O496P482R727J0685J0091J0295
$$ plain form
56145 779774 791330 803086 814296 827027 843412 862543 882862 905474 932334 963301 997796
56134 997796 1037267 1083243 1134990 1191690 1254670 1324855 1400345 1479232 1562369 1650658 1742292
56123 1742292 1835755 1932933 2036151 2144583 2256500 2372197 2491245 2609412 2721615 2825498
56113 2825498 2919200 2998903 3062473 3112777 3153691 3185476 3207426 3221367 3227933 3222459 3199709 3160657
56101 3160657 3110344 3051604 2985497 2915200 2843944 2770500 2691310 2605554 2514175 2416319 2311647
56090 2311647 2204296 2099819 1999888 1904383 1816470 1740493 1676419 1621194 1574112 1536252 1506278
56079 1506278 1481501 1461721 1447665 1437398 1428629 1422685 1421737 1424139 1426954 1430874 1437973 1447034 1455987
56066 1455987 1466528 1481218 1498435 1515408 1533598 1555536 1578932 1599722 1618529 1638214 1657498
$$ packed form
56145G79774J1556J1756J1210J2731J6385J9131K0319K2612K6860L0967L4495
56134I97796L9471M5976N1747N6700O2980P0185P5490P8887Q3137Q8289R1634
56123A742292R3463R7178J03218J08432J11917J15697J19048J18167J12203J03883
56113B825498R3702P9703O3570N0304M0914L1785K1950J3941O566n474k2750l9052
56101C160657n0313n8740o6107p0297p1256p3444p9190q5756r1379r7856j04672
56090B311647j07351j04477r9931r5505q7913p5977o4074n5225m7082l7860k9974
56079A506278k4777j9780j4056j0267q769n944r48K402K815L920P099R061Q953
56066A455987J0541J4690J7217J6973J8190K1938K3396K0790J8807J9685J9284
$$ plain form
56055 1657498 1673219 1686559 1700785 1715118 1727261 1739576 1755976 1774824 1791845 1808130 1828206
56044 1828206 1851955 1875542 1898810 1924755 1953233 1981987 2012197 2046148 2081375 2114221 2147027
56033 2147027 2184539 2225526 2265725 2306574 2352635 2402539 2451245 2499506 2552230 2609051 2665463
56022 2665463 2721820 2782231 2845980 2909182 2973544 3044159 3119979 3195840 3272395 3354409 3440850
56011 3440850 3526790 3613600 3706892 3805882 3905495 4007508 4118495 4238155 4360971 4487969
56001 4487969 4625008 4770892 4919469 5072273 5236517 5411872 5592209 5779045 5979748
55992 5979748 6193951 6415917 6648818 6901680 7173659 7457141 7754988 8078000 8426543
55983 8426543 8792555 9179039 9599014 10055492 10541845 11061988 11630041 12249873 12916200
$$ packed form
56055A657498J5721J3340J4226J4333J2143J2315J6400J8848J7021J6285K0076
56044A828206K3749K3587K3268K5945K8478K8754L0210L3951L5227L2846L2806
56033B147027L7512M0987M0199M0849M6061M9904M8706M8261N2724N6821N6412
56022B665463N6357O0411O3749O3202O4362P0615P5820P5861P6555Q2014Q6441
56011C440850Q5940Q6810R3292R8990R9613J02013J10987J19660J22816J26998
56001D487969J37039J45884J48577J52804J64244J75355J80337J86836K00703
55992E979748K14203K21966K32901K52862K71979K83482K97847L23012L48543
55983H426543L66012L86484M19975M56478M86353N20143N68053O19832O66327
$$ plain form
55974 12916200 13636454 14429722 15303911 16257589 17305169 18475659 19786423 21245286 22879776
55965 22879776 24736386 26851747 29257563 32016546 35221052 38957898 43316092 48434604
55957 48434604 54503829 61721611 70300296 80529249 92794249 107555625 125387008
55950 125387008 147042304 173403743 205320585 243406896 287531329 335684810 382843190
55943 382843190 421383195 443799189 446181060 429787286 399670844 361880937 321421450
55936 321421450 281682796 244666266 211318639 181877063 156234304 134164850 115360732
55929 115360732 99439123 86012871 74735014 65273117 57301781 50548966 44814430
55922 44814430 39929368 35733653 32102214 28954961 26223367 23833400 21728648 19879019
$$ packed form
55974A2916200P20254P93268Q74189R53678J047580J170490J310764J458863J634490
55965B2879776J856610K115361K405816K758983L204506L736846M358194N118512
55957D8434604O069225P217782Q578685J0228953J2265000J4761376J7831383
55950A25387008K1655296K6361439L1916842L8086311M4124433M8153481M7158380
55943C82843190L8540005K2415994K381871j6393774l0116442l7789907m0459487
55936C21421450l9738654l7016530l3347627k9441576k5642759k2069454j8804118
55929A15360732j5921609j3426252j1277857r461897p971336o752815n734536
55922D4814430m885062m195715l631439l147253k731594k389967k104752j849629
$$ plain form
55914 19879019 18253911 16810918 15519068 14367962 13344367 12421827 11581270 10820083
55906 10820083 10132561 9501357 8915923 8380131 7893874 7444892 7025893 6642317 6295697
55897 6295697 5975514 5674719 5397861 5146758 4912768 4690366 4484686 4298662 4125491
55888 4125491 3960533 3808627 3673266 3549848 3435524 3334853 3250149 3176637 3112138 3061187
55878 3061187 3024739 2996005 2971130 2953819 2944774 2936833 2925669 2915616 2909926 2904682 2897255 2891382
55866 2891382 2888438 2882183 2867270 2844708 2814163 2769349 2706530 2630221 2545733 2453454 2354897 2256717
55854 2256717 2163712 2074689 1989554 1913101 1846926 1784538 1719592 1652865 1586897 1520494 1453380
55843 1453380 1389911 1333024 1279870 1227905 1179827 1138260 1101052 1066118 1035539 1010636 988146
$$ packed form
55914A9879019j625108j442993j291850j151106j023595r22540q40557p61187
55906A0820083o87522o31204n85434n35792m86257m48982m18999l83576l46620
55897F295697l20183l00795k76858k51103k33990k22402k05680j86024j73171
55888D125491j64958j51906j35361j23418j14324j00671q4704p3512o4499n0951
55878C061187l6448k8734k4875j7311r045p941j1164j0053n690n244p427n873
55866B891382k944o255j4913k2562l0545m4814o2819p6309q4488r2279r8557r8180
55854B256717r3005q9023q5135p6453o6175o2388o4946o6727o5968o6403o7114
55843A453380o3469n6887n3154n1965m8078m1567l7208l4934l0579k4903k2490
$$ plain form
55832 988146 965427 944434 926697 909549 891268 874792 862271 850896 838067 825690 815277
55821 815277 803778 788649 772461 758245 744659 729880 715921 704770 694348 682495 671201
55810 671201 662885 656244 649645 644892 643707 644115 644153 645689 650813 657903 664985 673578 685383 698287
55796 698287 709196 717751 723929 725315 720375 711375 700664 687144 669732 651038 634010 617908
55784 617908 601076 584720 570488 557205 543550 531216 522025 514585 507167 501166 498376 497412 496151
55771 496151 495075 495011 494267 491413 488309 487045 486344 484253 481721 480022 477276 471243 463272 455828 448213
55756 448213 438410 427193 416761 407032 396794 386905 378976 372327 365423 358873 354032 350192 346007
55743 346007 342040 339051 335571 330142 324199 319709 315737 310493 304984 301332 299013 296120 293072 291733
$$ packed form
55832I88146k2719k0993j7737j7148j8281j6476j2521j1375j2829j2377j0413
55821H15277j1499j5129j6188j4216j3586j4779j3959j1151j0422j1853j1294
55810F71201q316o641o599m753j185M08L8J536N124P090P082Q593J1805J2904
55796F98287J0909Q555O178J386m940r000j0711j3520j7412j8694j7028j6102
55784F17908j6832j6356j4232j3283j3655j2334r191p440p418o001k790r64j261
55771D96151j076o4p44k854l104j264p01k091k532j699k746o033p971p444p615
55756D48213r803j1217j0432r729j0238r889p929o649o904o550m841l840m185
55743C46007l967k989l480n429n943m490l972n244n509l652k319k893l048j339
$$ plain form
55729 291733 291930 291929 291408 291028 290041 287187 283070 279054 274809 269516 264279 260638 257781 253974 249774 247154
55713 247154 246356 246146 246297 247326 248713 249819 251573 254906 258547 260808 262398 264908 267539 268004 265904
55698 265904 262691 259028 254598 249845 245503 241049 235700 230240 225785 221663 216668 211572 208170 206614
55684 206614 205748 205251 205400 205673 205672 206523 209267 212770 215188 216509 217637 218141 217131 215258 213598 211587
55668 211587 208284 204607 202031 200158 197920 196065 195910 196655 196553 195946 196521 198325 200171 202390 206463
55653 206463 212298 218422 224564 231636 239367 246281 251855 256575 260068 261284 260243 257644 253139 245990
55639 245990 237129 228590 221165 214347 207997 202243 196375 189880 183989 180289 178332 176524 174641 173479
55625 173479 172801 171807 170902 170807 170664 169316 167663 167283 167447 166169 163684 162000 161297 159702 156752 154210
$$ packed form
55729B91733J97jn21l80r87k854m117m016m245n293n237l641k857l807m200k620
55713B47154p98k10J51J029J387J106J754L333L641K261J590K510K631M65k100
55698B65904l213l663m430m753m342m454n349n460m455m122m995n096l402j556
55684B06614q66m97J49K73jQ51K744L503K418J321J128N04j010j873j660k011
55668B11587l303l677k576j873k238j855j55P45j02o07N75J804J846K219M073
55653B06463N835O124O142P072P731O914N574M720L493J216j041k599m505p149
55639B45990q861q539p425o818o350n754n868o495n891l700j957j808j883j162
55625A73479o78r94r05r5j43j348j653l80J64j278k485j684p03j595k950k542
$$ plain form
55609 154210 152987 151867 149981 148290 147833 148290 148985 149758 150396 150569 150535 150644 150266 148630 146468 145265 145059
55592 145059 144610 143479 142249 140980 139259 137635 137186 137658 137632 136507 134873 133238 131921 131796 133428 135779
55576 135779 137418 138617 140569 143108 145100 146615 148685 151260 153500 155844 159625 164693 169416 173021
55562 173021 176086 178852 180943 182683 184799 186915 188101 188645 189448 190011 189050 186783 184471 181979 178016
55547 178016 172656 167404 162844 158456 154686 152694 151869 150000 146326 142270 138838 135438 131683 128240
55533 128240 125458 123029 121360 121340 122463 123164 123225 123798 124828 124713 123017 121382 121128 121866 123017 124709
55517 124709 126619 127796 128250 128967 129955 130185 129855 130661 133217 136097 138011 139011 139010 137133 133390 129234
55501 129234 125738 122738 120221 118803 118300 117582 116355 115454 115067 114592 114436 115799 118166 119281 118310 116871
$$ packed form
55609A54210j223j120j886j691m57M57O95P73O38J73l4J09l78j636k162j203k06
55592A45059m49j131j230j269j721j624m49M72k6j125j634j635j317j25J632K351
55576A35779J639J199J952K539J992J515K070K575K240K344L781N068M723L605
55562A73021L065K766K091J740K116K116J186N44Q03N63r61k267k312k492l963
55547A78016n360n252m560m388l770j992q25j869l674m056l432l400l755l443
55533A28240k782k429j669k0J123P01O1N73J030j15j696j635k54P38J151J692
55517A24709J910J177M54P17R88K30l30Q06K556K880J914J000jj877l743m156
55501A29234l496l000k517j418n03p18j227r01l87m75j56J363K367J115r71j439
$$ plain form
55485 116871 116221 115640 114507 113671 113672 113666 113305 113723 115423 117024 117313 116827 116309 115392 113995 113203 113497 113746 113165
55466 113165 112660 113038 113556 113521 113603 114247 114411 113318 112005 111634 111676 111184 110553 110552 110799 110612 110266 110219 110236 110435
55446 110435 111851 114607 116859 117067 116201 116250 117521 118808 119303 118980 117925 116520 115548 115076 114137 112494
55430 112494 111607 112730 115098 117182 118675 119975 120810 120790 120484 120623 120909 120753 120390 120234 120077 120075 121482 125053
55412 125053 129574 133343 136358 139620 142995 145279 146025 146063 146433 147801 150528 154196 157339 158505 157494
55397 157494 155065 151964 148746 145897 143385 140618 137310 133834 130461 127158 124347 122640 121439 119203
55383 119203 115745 112730 111107 109667 107272 104872 103872 103834 103431 102577 101994 101547 100614 99423 98598 98021
55367 98021 97415 97341 98309 99644 100561 101619 103697 106217 107839 108439 108995 109934 110840 111437 111690 111346 110480 110000
$$ packed form
55485A16871o50n81j133q36Jol61M18J700J601K89m86n18r17j397p92K94K49n81
55466A13165n05L78N18l5Q2O44J64j093j313l71M2m92o31jK47j87l46m7J7J99
55446A10435J416K756K252K08q66M9J271J287M95l23j055j405r72m72r39j643
55430A12494q87J123K368K084J493J300Q35k0l06J39K86j56l63j56j57kJ407L571
55412A25053M521L769L015L262L375K284P46L8L70J368K727L668L143J166j011
55397A57494k429l101l218k849k512k767l308l476l373l303k811j707j201k236
55383A19203l458l015j623j440k395k400j000l8m03q54n83m47r33j191q25n77
55367I8021o06p4R68J335R17J058K078K520J622O00N56R39R06N97K53l44q66m80
$$ plain form
55349 110000 110531 111304 111207 110341 109516 108894 108327 108302 109218 110272 110346 109551 108688 107804 106585 105565 105482 105817 105368
55330 105368 104007 102622 101671 101050 100981 101639 102211 101725 100695 100597 101843 103469 104714 105663 106420 106856 107264
55313 107264 108133 109201 109637 109261 108789 108954 109997 111750 113500 114174 113440 112210 111319 110416 109122 108406 109402
55296 109402 111402 112576 112391 111854 111569 111114 110383 110048 110389 110869 111169 111633 112416 113159 113702 114277 114776 114683
55278 114683 113937 113232 113247 114096 115484 116868 117556 117210 116164 114863 113345 111744 110732 110739 111244 111566 111833
55261 111833 112375 112775 112523 112080 112218 112792 113264 113927 115386 117177 118199 118270 118063 117717 116759 115255 113849
55244 113849 112762 111842 111465 112150 113434 114325 114841 115845 117427 118701 119250 119522 119701 119392 118633 117980 117425
55227 117425 116431 115251 114986 115920 116972 117277 117267 117584 117862 117341 116054 114735 113864 113265 112496 111504 110987 111902
$$ packed form
55349A10000N31P73r7q66q25o22n67k5R16J054P4p95q63q84j219j020q3L35m49
55330A05368j361j385r51o21o9O58N72m86j030r8J246J626J245R49P57M36M08
55313A07264Q69J068M36l76m72J65J043J753J750O74p34j230q91r03j294p16R96
55296A09402K000J174j85n37k85m55p31l35L41M80L00M64P83P43N43N75M99r3
55278A14683p46p05J5Q49J388J384O88l46j046j301j518j601j012PN05L22K67
55261A11833N42M00k52m43J38N74M72O63J459J791J022P1k07l46r58j504j406
55244A13849j087r20l77O85J284Q91N16J004J582J274N49K72J79l09p59o53n55
55227A17425r94j180k65R34J052L05j0L17K78n21j287j319q71n99p69r92n17R15
$$ plain form
55209 111902 114259 116789 118300 118926 119406 119678 119279 118725 119206 120924 122866 124317 125524 126702 127490 127732
55193 127732 127834 127965 127664 126560 124858 122891 120839 119012 117753 116904 115992 115038 114586 114857 115516 116297 117185
55176 117185 117974 118313 118306 118421 118741 118878 118676 118439 118420 118571 118742 118708 118212 117448 117246 118222 120022 121904 123615
55157 123615 125067 125805 125668 125452 125939 126714 126981 127019 127554 128175 127785 126450 125408 125245 125421 125578 125976 126503
55139 126503 126599 126377 126580 127156 127083 125934 124532 123740 123604 123945 124745 125640 126001 125834 125716 125640 124894 123255 121358
55120 121358 119715 118372 117667 118242 119985 121930 123441 124561 125126 124714 123758 123575 124833 126856 128711 130039
55104 130039 130653 130416 129852 129878 130633 131474 132225 133256 134260 134293 133417 132955 133599 134486 134677 134360 134031 133671 133380
55085 133380 133649 134310 134283 133102 131668 130861 130463 130132 130273 131058 131650 131407 131005 131356 132184 132620 132520 132278
$$ packed form
55209A11902K357K530J511O26M80K72l99n54M81J718J942J451J207J178P88K42
55193A27732J02J31l01j104j702j967k052j827j259q49r12r54m52K71O59P81Q88
55176A17185P89L39pJ15L20J37k02k37j9J51J71l4m96p64k02R76J800J882J711
55157A23615J452P38j37k16M87P75K67L8N35O21l90j335j042j63J76J57L98N27
55139A26503R6k22K03N76p3j149j402p92j36L41Q00Q95L61j67j18p6p46j639j897
55120A21358j643j343p05N75J743J945J511J120N65m12r56j83J258K023J855J328
55104A30039O14k37n64K6P55Q41P51J031J004L3q76m62O44Q87J91l17l29l60k91
55085A33380K69O61k7j181j434q07l98l31J41P85N92k43m02L51Q28M36j00k42
$$ plain form
55067 132278 131904 131196 130367 129747 129271 128873 128844 129236 129469 129110 128442 127774 126885 125751 125034 125155 125566 125680 125827
55048 125827 126491 127261 127386 126907 126433 126261 126451 127309 128929 130579 131314 131033 130377 129844 129556 129578 129882 130121
55030 130121 129878 129037 127768 126453 125762 126284 127801 129322 130043 129891 129173 128358 128180 129063 130237 130338 129122
55013 129122 127675 126698 125722 124459 123565 123355 122928 121623 120351 120360 121467 122659 123870 125911 128951 132127
54997 132127 134594 136140 136891 137092 137152 137382 137766 138206 138710 139180 139497 139987 141143 142671 143570 143508 143248 143362
54979 143362 143467 143233 143094 143289 143255 142716 142340 142466 142247 141119 140072 140247 141222 141997 142810 144431 146351 147418
54961 147418 147863 148977 150817 151933 151571 150677 150347 150528 150790 151327 152550 154341 156150 157485 158126 158351
54945 158351 158912 160201 161459 161511 160311 159045 158584 158551 158183 157507 157261 157915 159110 160009 160180 160142 160874 162708
$$ packed form
55067A32278l74p08q29o20m76l98k9L92K33l59o68o68q89j134p17J21M11J14J47
55048A25827O64P70J25m79m74j72J90Q58J620J650P35k81o56n33k88K2L04K39
55030A30121k43q41j269j315o91N22J517J521P21j52p18q15j78Q83J174J01j216
55013A29122j447r77r76j263q94k10m27j305j272RJ107J192J211K041L040L176
54997A32127K467J546P51K01O0K30L84M40N04M70L17M90J156J528Q99o2k60J14
54979A43362J05k34j39J95l4n39l76J26k19j128j047J75R75P75Q13J621J920J067
54961A47418M45J114J840J116l62q94l30J81K62N37J223J791J809J335O41K25
54945A58351N61J289J258N2j200j266m61l3l68o76k46O54J195Q99J71l8P32J834
$$ plain form
54927 162708 165058 167407 170054 173536 177851 182787 188573 195505 203196 210885 218305 225699 233154 240518
54913 240518 247736 254655 260565 264460 265702 264110 259748 253145 245428 237588 229726 221493 213059 205105
54899 205105 198062 191903 186522 181750 177149 172430 168065 164977 163595 163477 163780 163871 163693 163816 164884 166832
54883 166832 168960 170952 173262 176246 179658 183505 188692 196029 205029 214418 223456 232112 240346 247940
54869 247940 254695 260162 263534 264399 263223 260494 255976 249553 242123 234677 226972 218244 208943 200571
54855 200571 193898 188410 183495 179118 175223 171477 167845 164635 161790 158906 156107 154124 153209 152644 151592
54840 151592 149886 147764 145412 143036 140990 139530 138660 138308 138371 138639 139012 139755 141187 143088 144748 145645
54824 145645 145831 145743 145823 146196 146545 146443 145888 145246 144656 144026 143702 144327 145686 146513 146113 145426 145713 146816 147660
$$ packed form
54927A62708K350K349K647L482M315M936N786O932P691P689P420P394P455P364
54913B40518P218O919N910L895J242j592m362o603p717p840p862q233q434p954
54899B05105p043o159n381m772m601m719m365l088j382j18L03R1j78J23J068J948
54883A66832K128J992K310K984L412L847N187P337R000R389R038Q656Q234P594
54869B47940O755N467L372Q65j176k729m518o423p430p446p705q728r301q372
54855B00571o673n488m915m377l895l746l632l210k845k884k799j983r15n65j052
54840A51592j706k122k352k376k046j460q70l52O3K68L73P43J432J901J660Q97
54824A45645J86q8Q0L73L49j02n55o42n90o30l24O25J359Q27m00o87K87J103Q44
$$ plain form
54805 147660 147953 148309 148980 149482 149494 149295 149296 149678 150424 151221 151534 151272 151068 151429 152022 152301 152290 152124 151505 150438
54785 150438 149938 150995 153242 155486 157096 157979 157844 156698 155624 155839 157207 158805 160580 163179 166497
54770 166497 169874 173605 178806 185669 193205 200891 209271 218707 228744 238955 249238 258992 267116
54757 267116 273174 277530 280107 280157 277562 273264 267994 261666 254401 247050 240103 233017 225224 217087 209400
54742 209400 202701 197406 193794 191445 189439 187437 185818 184592 183201 181751 181364 182694 185036 187503
54728 187503 190212 193642 197659 201906 206481 211514 216672 221808 227579 234727 243066 251686 259755 266640
54714 266640 271699 274502 274996 273205 269175 263510 257329 251227 244758 237358 229339 221512 214233 207335
54700 207335 200741 194752 189781 185976 182979 180111 177148 174753 173631 173322 172554 170788 168663 166875 165472
$$ packed form
54805A47660K93L56O71N02J2j99JL82P46P97L13k62k04L61N93K79j1j66o19j067
54785A50438n00J057K247K244J610Q83j35j146j074K15J368J598J775K599L318
54770A66497L377L731N201O863P536P686Q380R436J0037J0211J0283R754Q124
54757B67116O058M356K577N0k595m298n270o328p265p351o947p086p793q137p687
54742B09400o699n295l612k349k006k002j619j226j391j450l87J330K342K467
54728A87503K709L430M017M247M575N033N158N136N771P148Q339Q620Q069O885
54714B66640N059K803M94j791m030n665o181o102o469p400q019p827p279o898
54700B07335o594n989m971l805k997k868k963k395j122l09p68j766k125j788j403
$$ plain form
54685 165472 164423 164009 164248 164645 164853 164928 164688 163625 161832 160244 159508 159255 158874 158273 157465 156139 154284
54668 154284 152638 151926 152043 152373 152446 151953 150705 149009 147613 146951 146905 147448 148760 150425 151379 151165 150492
54651 150492 150051 149586 148762 148162 148571 149816 151148 152274 153276 153939 153994 153791 153962 154592 155311 156027 156947 157952
54633 157952 158586 158693 158663 158974 159710 160517 160901 160691 160284 160257 160735 161339 161699 161658 161079 159908 158432 157015 155713
54614 155713 154640 154387 155285 156483 156768 156256 156083 156441 156258 155165 154291 154479 155045 155211 155575 157009 158989
54597 158989 160230 160428 160296 160322 160465 160710 161057 161225 161068 160945 161075 161008 160450 160092 160775 162152 163040 162862 162055
54578 162055 161252 160717 160435 160190 159721 159138 158899 159073 159062 158417 157381 156256 154955 153650 153099 153634 154513 154985
54560 154985 155305 155907 156353 156092 155632 155845 156540 156843 156688 156827 157513 158198 158509 158652 158888 159380 160483 162437
$$ packed form
54685A65472j049m14K39L97K08P5k40j063j793j588p36k53l81o01q08j326j855
54668A54284j646p12J17L30P3m93j248j696j396o62m6N43J312J665R54k14o73
54651A50492m41m65q24o00M09J245J332J126J002O63N5k03J71O30P19P16R20J005
54633A57952O34J07l0L11P36Q07L84k10m07k7M78O04L60m1n79j171j476j417j302
54614A55713j073k53Q98J198K85n12j73L58j83j093q74J88N66J66L64J434J980
54597A58989J241J98j32K6J43K45L47J68j57j23J30o7n58l58O83J377Q88j78q07
54578A62055q03n35k82k45m69n83k39J74j1o45j036j125j301j305n51N35Q79M72
54560A54985L20O02M46k61m60K13O95L03j55J39O86O85L11J43K36M92J103J954
$$ plain form
54542 162437 164796 166801 168210 169180 169611 169301 168557 167950 167661 167700 168472 170359 172902 175112 176501 177241 177599
54525 177599 177825 178298 179112 179843 180333 181222 182856 184190 183850 181991 180053 178818 177810 176514 175127 173989
54509 173989 173229 173059 173637 174582 175416 176404 178096 180152 181586 182121 182307 182270 181456 179847 178385 177773 177721 177652
54491 177652 177407 176997 176456 176233 176892 178147 178947 178853 178525 178518 178493 178079 177674 177709 177791 177317 176516 176195 176735 177859
54471 177859 179128 180225 180980 181582 182549 184150 186015 187639 189035 190515 191996 192956 193145 193000 193168 193765
54455 193765 194251 194162 193788 193817 194345 194567 193735 192057 190382 189325 189015 189373 190116 190715 190833 190685 190531 190141
54437 190141 189250 188276 187880 187960 187776 187066 186361 186143 186276 186334 185954 184814 182819 180483 178689 177959 178195 179041
54419 179041 180058 180697 180686 180478 180834 181987 183585 185314 187062 188595 189699 190548 191404 192052 192094 191653 191170
$$ packed form
54542A62437K359K005J409R70M31l10p44o07k89L9P72J887K543K210J389P40L58
54525A77599K26M73Q14P31M90Q89J634J334l40j859j938j235j008j296j387j138
54509A73989p60j70N78R45Q34R88J692K056J434N35J86l7q14j609j462o12n2o9
54491A77652k45m10n41k23O59J255Q00r4l28pk5m14m05L5Q2m74q01l21N40J124
54471A77859J269J097P55O02R67J601J865J624J396J480J481R60J89j45J68N97
54455A93765M86q9l74K9N28K22q32j678j675j057l10L58P43N99J18j48j54l90
54437A90141q91r74l96Q0j84p10p05k18J33N8l80j140j995k336j794p30K36Q46
54419A79041J017O39j1k08L56J153J598J729J748J533J104Q49Q56O48M2m41m83
$$ plain form
54402 191170 190691 190050 189554 189657 190081 190168 190070 190591 191769 192625 192558 192020 191517 190901 190134 189816 190357 191328 192199
54383 192199 193059 194080 194896 195109 194942 194808 194714 194610 194844 195666 196603 196956 196688 196341 196239 196181 195693 194305 191842
54364 191842 188827 186331 185087 184930 185335 186125 187296 188531 189429 190061 190783 191561 191883 191413 190368 189178
54348 189178 187967 186570 184983 183638 183032 183102 183206 182894 182428 182217 181997 181103 179504 178018 177340 177261 177033
54331 177033 176193 174908 173728 173137 173180 173533 174037 174909 176155 177123 177187 176687 176518 176880 177073 176567 175620 174768
54313 174768 174393 174927 176776 179660 182509 184368 185110 185228 185319 185868 186955 188040 188499 188496 188800 189659 190457 190571
54295 190571 189979 188887 187461 186171 185645 185804 185767 185022 184138 183839 183910 183506 182219 180394 178723 177798 177778 178198
54277 178198 178360 178034 177470 176816 176128 175937 176974 179042 180983 182063 182685 183353 183827 183844 183793 183939 183679 182434
$$ packed form
54402A91170m79o41m96J03M24Q7r8N21J178Q56o7n38n03o16p67l18N41R71Q71
54383A92199Q60J021Q16K13j67j34r4j04K34Q22R37L53k68l47j02n8m88j388k463
54364A91842l015k496j244j57M05P90J171J235Q98O32P22P78L22m70j045j190
54348A89178j211j397j587j345o06P0J04l12m66k11k20q94j599j486o78p9k28
54331A77033q40j285j180n91M3L53N04Q72J246R68O4n00j69L62J93n06r47q52
54313A74768l75N34J849K884K849J859P42J18R1N49J087J085M59lL04Q59P98J14
54295A90571n92j092j426j290n26J59l7p45q84k99P1m04j287j825j671r25k0M20
54277A78198J62l26n64o54o88j91J037K068J941J080O22O68M74J7n1J46k60j245
$$ plain form
54259 182434 180757 179688 179453 179542 179692 179939 180038 179711 179316 179436 179916 180038 179603 179170 179249 179878 180937 182237
54241 182237 183302 183655 183354 182766 181865 180363 178511 177093 176516 176469 176634 177089 177812 178352 178356 177986 177443 176505
54223 176505 174998 173461 172779 173132 173768 173963 173834 173969 174506 174984 175098 175164 175623 176388 177017 177342 177539 177665
54205 177665 177518 177031 176446 175995 175674 175358 174850 173841 172210 170458 169438 169463 170050 170721 171641 173158 175039
54188 175039 176554 177201 177062 176571 176168 176149 176616 177469 178422 179076 179152 178785 178434 178319 178187 177862 177713 178167 178940
54169 178940 179311 178975 178084 176669 174766 173033 172430 173057 173991 174376 174040 173046 171543 170277 170236 171338 172272
54152 172272 172215 171927 172507 173803 174840 175234 175370 175553 175812 176296 177089 177729 177559 176576 175448 174784 174749 175253
54134 175253 176073 176817 177092 176711 175737 174535 173827 174183 175268 176111 176351 176642 177447 178151 178013 177449 177554 178627
$$ packed form
54259A82434j677j069k35Q9J50K47R9l27l95J20M80J22m35m33P9O29J059J300
54241A82237J065L53l01n88r01j502j852j418n77m7J65M55P23N40Ml70n43r38
54223A76505j507j537o82L53O36J95j29J35N37M78J14O6M59P65O29L25J97J26
54205A77665j47m87n85m51l21l16n08j009j631j752j020K5N87O71R20J517J881
54188A75039J515O47j39m91m03j9M67Q53R53O54P6l67l51j15j32l25j49M54P73
54169A78940L71l36q91j415j903j733o03O27R34L85l36r94j503j266m1J102R34
54152A72272n7k88N80J296J037L94J36J83K59M84P93O40j70r83j128o64l5N04
54134A75253Q20P44K75l81r74j202p08L56J085Q43K40K91Q05P04j38n64J05J073
$$ plain form
54116 178627 179915 180669 180804 180533 179982 179282 178671 178379 178559 179187 179926 180304 180293 180444 181246 182562 183851 184670
54098 184670 184810 184384 183951 184141 184878 185468 185576 185572 185722 185805 185865 186530 187959 189262 189630 189426 189411 189490 189079 188277
54078 188277 187820 188143 189137 190498 191689 192050 191621 191427 192214 193369 193837 193512 192867 191840 190274 189053 189450
54061 189450 191371 193399 194588 195200 195656 195852 195761 195797 196245 196987 197911 198969 199907 200622 201714 203835 206548
54044 206548 208727 210106 211536 213642 216204 218945 221895 224699 226643 227795 229225 231594 234347 236838
54030 236838 239505 243239 248149 253561 258837 263686 267989 271804 275355 278782 282150 285804 290184 295069
54016 295069 299483 302709 305015 307127 309433 311975 314777 317720 320353 322175 323021 323024 322403 321334 319760
54001 319760 317323 313829 309853 306395 303875 301875 299977 298262 296785 295072 292607 289507 286419 283922
$$ packed form
54116A78627J288P54J35k71n51p00o11k92J80O28P39L78j1J51Q02J316J289Q19
54098A84670J40m26m33J90P37N90J08mJ50Q3O0O65J429J303L68k04j5P9m11q02
54078A88277m57L23R94J361J191L61m29j94P87J155M68l25o45j027j566j221L97
54061A89450J921K028J189O12M56J96r1L6M48P42R24J058R38P15J092K121K713
54044B06548K179J379J430K106K562K741K950K804J944J152J430K369K753K491
54030B36838K667L734M910N412N276M849M303L815L551L427L368L654M380M885
54016B95069M414L226K306K112K306K542K802K943K633J822Q46Lo21j069j574
54001C19760k437l494l976l458k520k000j898j715j477j713k465l100l088k497
$$ plain form
53987 283922 282198 281002 279781 278023 275711 273324 271421 270426 270701 272423 275339 278946 282945 287351 292298
53972 292298 298051 304923 312641 320043 326031 330689 334766 338147 339682 338533 334858 329088 321546 313124
53958 313124 305309 298854 293085 287103 281099 275870 271615 268000 265056 263185 262349 261896 261361 261014 261447
53943 261447 262761 264347 265528 266465 268179 271442 275887 280589 285270 290214 295104 298871 301081 302804
53929 302804 305635 310186 315819 321419 326121 329740 332827 336004 339064 341138 341873 341912 342058 342564 343534 345298
53913 345298 347859 350565 352869 355019 357554 360579 364075 368412 373867 379919 385712 391050 396382 401981
53899 401981 407695 413403 419129 424714 429802 434195 437862 440595 442004 441960 440848 439327 437868 436448 434678
53884 434678 432339 429688 426919 423554 419015 413853 409549 406626 403700 399097 392943 386847 381858 377541
$$ packed form
53987B83922j724j196j221j758k312k387j903r95K75J722K916L607L999M406M947
53972B92298N753O872P718P402N988M658M077L381J535j149l675n770p542q422
53958C13124p815o455n769n982o004n229m255l615k944j871q36m53n35l47M33
53943B61447J314J586J181R37J714L263M445M702M681M944M890L767K210J723
53929C02804K831M551N633N600M702L619L087L177L060K074P35L9J46N06R70J764
53913C45298K561K706K304K150K535L025L496M337N455O052N793N338N332N599
53899D01981N714N708N726N585N088M393L667K733J409m4j112j521j459j420j770
53884D34678k339k651k769l365m539n162m304k923k926m603o154o096m989m317
$$ plain form
53870 377541 372975 367809 362194 356291 350257 344392 339063 334494 330583 326796 322466 317439 312299 307721
53856 307721 303783 300184 296880 294021 291401 288489 285109 281720 278935 277017 275835 275022 274124 272849 271278
53841 271278 269690 268206 266760 265354 264083 262917 261663 260229 258751 257393 256156 254946 253780 252872
53827 252872 252454 252472 252496 252108 251378 250779 250608 250752 251061 251635 252528 253432 253980 254234 254558 255077 255488 255486 255248 255487
53807 255487 257033 260258 264806 269963 275340 281117 287665 295104 303230 311623 319681 326835 333021 338920
53793 338920 345547 353521 362662 372233 381586 390529 398941 405974 410034 410035 406564 401422 396010 390557 384824
53778 384824 379011 373789 369807 367311 365927 364711 362791 360057 357007 353964 350907 347967 345425 343079
53764 343079 340307 337050 334152 332286 331100 329873 328555 327578 326973 326179 324615 322023 318437 314213 309958
$$ packed form
53870C77541m566n166n615n903o034n865n329m569l911l787m330n027n140m578
53856C07721l938l599l304k859k620k912l380l389k785j918j182q13q98j275j571
53841B71278j588j484j446j406j271j166j254j434j478j358j237j210j166r08
53827B52872m18J8K4l88p30n99j71J44L09N74Q93R04N48K54L24N19M11kk38K39
53807B55487J546L225M548N157N377N777O548P439Q126Q393Q058P154O186N899
53793C38920O627P974R141R571R353Q943Q412P033M060Jl471n142n412n453n733
53778C84824n813n222l982k496j384j216j920k734l050l043l057k940k542k346
53764C43079k772l257k898j866j186j227j318r77o05p94j564k592l586m224m255
$$ plain form
53749 309958 306086 302418 298345 293325 287286 280852 275186 271161 268532 266339 264163 262377 261071 259546
53735 259546 257319 254937 253173 251983 250885 249897 249412 249512 250050 251006 252087 252419 251519 250291 250127 251189
53719 251189 252510 253693 255329 257455 258721 257818 255120 252214 250176 248974 248283 248178 248913 250500 252729
53704 252729 255354 258033 260225 261419 261482 260680 259391 257987 257038 257283 259072 261971 265205 268329 271138
53689 271138 273178 273990 273912 273962 274701 275730 276571 277438 278717 280132 280994 280986 280253 279015 277567 276537 276615 277937
53671 277937 279898 281527 282014 281194 279701 278412 277600 276951 276441 276552 277350 278020 277833 277092 276505 276128 275552
53654 275552 274775 274100 273408 272280 270763 269383 268407 267737 267437 267751 268504 269113 269369 269718 270603 271893 273163
53637 273163 274190 274968 275429 275403 274810 273830 272819 272041 271528 271335 271764 273023 274757 276404 277951 279783 281718
$$ packed form
53749C09958l872l668m073n020o039o434n666m025k629k193k176j786j306j525
53735B59546k227k382j764j190j098r88m85J00N38R56J081L32r00j228j64J062
53719B51189J321J183J636K126J266r03k698k906k038j202o91j05P35J587K229
53704B52729K625K679K192J194O3q02j289j404r49K45J789K899L234L124K809
53689B71138K040Q12p8N0P39J029Q41Q67J279J415Q62qp33j238j448j030P8J322
53671B77937J961J629M87q20j493j289q12o49n10J11P98O70j87p41n87l77n76
53654B75552p77o75o92j128j517j380r76o70l00L14P53O09K56L49Q85J290J270
53637B73163J027P78M61k6n93r80j011p78n13j93M29J259J734J647J547J832J935
$$ plain form
53620 281718 282975 283405 283970 285519 287724 289744 291350 292827 294409 296469 299625 303813 307728 310049 310916
53605 310916 311511 312609 314395 317090 320657 324120 326355 327536 328838 330803 332934 334798 336485 337954
53591 337954 338976 339837 341080 342375 342648 341674 340569 340321 340636 340631 339941 338757 337454 336557 336457 336742 336436
53574 336436 335170 333565 332157 330674 328768 326861 325652 325221 325072 324768 324178 323423 322813 322550 322353 321758
53558 321758 320828 320059 319561 318992 318426 318525 319545 320880 321987 323088 324557 326230 327860 329644 331785 334007
53542 334007 336093 338460 341636 345485 349452 353258 356935 360499 364045 367888 372158 376585 381033 385901
53528 385901 391575 397903 404705 412365 421290 431068 440844 450358 460045 470246 480958 492301 504587
53515 504587 517829 531688 546091 561435 577991 595347 612632 629168 644952 660810 678135
$$ packed form
53620B81718J257M30N65J549K205K020J606J477J582K060L156M188L915K321Q67
53605C10916N95J098J786K695L567L463K235J181J302J965K131J864J687J469
53591C37954J022Q61J243J295K73r74j105k48L15no90j184j303q97j00K85l06
53574C36436j266j605j408j483j906j907j209m31j49l04n90p55o10k63j97n95
53558C21758r30p69m98n69n66R9J020J335J107J101J469J673J630J784K141K222
53542C34007K086K367L176L849L967L806L677L564L546L843M270M427M448M868
53528C85901N674O328O802P660Q925R778R776R514R687J0201J0712J1343J2286
53515E04587J3242J3859J4403J5344J6556J7356J7285J6536J5784J5858J7325
$$ plain form
53504 678135 698073 720566 744216 767313 789120 810162 831307 852777 874157 895156 915870
53493 915870 936202 955595 973812 991626 1010089 1029182 1047772 1064963 1080988 1096774 1113217
53482 1113217 1130964 1150170 1170113 1189545 1207738 1224851 1241090 1256136 1269739 1282248 1293986
53471 1293986 1304501 1313093 1319827 1325459 1330499 1334798 1337936 1339474 1338915 1335928 1330769 1324175 1316730 1308463
53457 1308463 1299006 1287950 1275080 1260499 1244594 1227772 1210252 1192172 1173796 1155439 1137233
53446 1137233 1119036 1100583 1081744 1062724 1043944 1025589 1007394 989125 971202 954443 939235
53435 939235 925286 912242 900142 889166 879386 870925 863943 858289 853549 849671 847158 846434 847363 849623
53421 849623 853128 857811 863453 870197 878848 890128 903800 918949 935014 952112 970466 990023
$$ packed form
53504F78135J9938K2493K3650K3097K1807K1042K1145K1470K1380K0999K0714
53493I15870K0332J9393J8217J7814J8463J9093J8590J7191J6025J5786J6443
53482A113217J7747J9206J9943J9432J8193J7113J6239J5046J3603J2509J1738
53471A293986J0515Q592O734N632N040M299L138J538n59k987n159o594p445q267
53457A308463r457j1056j2870j4581j5905j6822j7520j8080j8376j8357j8206
53446A137233j8197j8453j8839j9020j8780j8355j8195j8269j7923j6759j5208
53435I39235j3949j3044j2100j0976r780q461o982n654m740l878k513p24R29K260
53421H49623L505M683N642O744Q651J1280J3672J5149J6065J7098J8354J9557
$$ plain form
53409 990023 1010705 1032659 1056104 1081081 1107508 1135422 1165114 1196955 1230969 1266607 1303146
53398 1303146 1340375 1378794 1419130 1461751 1506428 1552421 1598858 1645366 1692322 1740280 1789197
53387 1789197 1838528 1887888 1937228 1986405 2035121 2083233 2130626 2176755 2220893 2262902 2303169
53376 2303169 2341666 2377728 2410853 2441056 2468206 2491725 2511237 2526892 2538759 2546531 2550123 2549808
53364 2549808 2545413 2536216 2522230 2504744 2484838 2462016 2435078 2403806 2368855 2330503 2288496 2242976
53352 2242976 2194660 2144137 2091755 2038151 1984249 1930634 1877401 1824560 1772173 1720259 1669023
53341 1669023 1619018 1570687 1523961 1478696 1435165 1393612 1353639 1314621 1276391 1239075 1202706
53330 1202706 1167720 1135274 1106099 1079326 1053467 1028384 1005227 984512 965540 947883 932208
$$ packed form
53409I90023K0682K1954K3445K4977K6427K7914K9692L1841L4014L5638L6539
53398A303146L7229L8419M0336M2621M4677M5993M6437M6508M6956M7958M8917
53387A789197M9331M9360M9340M9177M8716M8112M7393M6129M4138M2009M0267
53376B303169L8497L6062L3125L0203K7150K3519J9512J5655J1867P772L592l15
53364B549808m395r197j3986j7486j9906k2822k6938l1272l4951l8352m2007m5520
53352B242976m8316n0523n2382n3604n3902n3615n3233n2841n2387n1914n1236
53341A669023n0005m8331m6726m5265m3531m1553l9973l9018l8230l7316l6369
53330A202706l4986l2446k9175k6773k5859k5083k3157k0715j8972j7657j5675
$$ plain form
53319 932208 919028 907612 896945 887104 878868 872397 867066 862529 859336 858360 859863 863260 867704 872798
53305 872798 878642 885214 892125 899320 907657 918152 930732 944343 958319 973082 989359 1007382
53293 1007382 1027040 1048247 1070752 1093989 1117512 1141348 1165617 1190089 1214340 1238120 1261312
53282 1261312 1283780 1305527 1326817 1347852 1368353 1387660 1405142 1420416 1433302 1443737 1451728
53271 1451728 1457310 1460592 1461862 1461475 1459531 1455711 1449546 1440875 1430037 1417604 1403899 1388774 1371908
53258 1371908 1353188 1332649 1310215 1285887 1260244 1234255 1208371 1182125 1154866 1126561 1097596
53247 1097596 1068175 1038307 1008084 977631 947045 916689 887153 858553 830291 802069 774728
53236 774728 749419 726217 704250 682967 662509 642988 624207 606185 589215 573205 557560
$$ packed form
53319I32208j3180j1416j0667r841q236o471n331m537l193r76J503L397M444N094
53305H72798N844O572O911P195Q337J0495J2580J3611J3976J4763J6277J8023
53293A007382J9658K1207K2505K3237K3523K3836K4269K4472K4251K3780K3192
53282A261312K2468K1747K1290K1035K0501J9307J7482J5274J2886J0435P991
53271A451728N582L282J270l87j944l820o165q671j0838j2433j3705j5125j6866
53258A371908j8720k0539k2434k4328k5643k5989k5884k6246k7259k8305k8965
53247A097596k9421k9868l0223l0453l0586l0356k9536k8600k8262k8222k7341
53236G74728k5309k3202k1967k1283k0458j9521j8781j8022j6970j6010j5645
$$ plain form
53225 557560 541910 526482 511660 497624 484477 472279 460912 450277 440558 431839 423642 415429
53213 415429 407435 400331 394146 388321 382783 378053 374126 370163 365618 360919 356643 352773 349124 345833
53199 345833 342954 340205 337485 335040 332697 329659 325620 321467 318234 315868 313722 311739 310356 309552
53185 309552 308778 307759 306721 305814 304849 303618 302112 300423 298712 297153 295677 294003 292074 290180 288403
53170 288403 286404 284116 282182 281115 280400 279091 277066 275022 273433 272196 271243 270750 270666 270671 270766 271319 272341
53153 272341 273204 273377 273022 272611 272276 271771 270835 269364 267453 265462 263830 262609 261342 259623 257646 256016
53137 256016 255081 254622 254182 253550 252879 252418 252271 252445 253030 254074 255241 255851 255534 254616 253659 252795 251854 251005
53119 251005 250767 251291 252060 252524 252665 252690 252513 251971 251360 251300 252029 253183 254352 255544 256912 258334 259486
$$ packed form
53225E57560j5650j5428j4822j4036j3147j2198j1367j0635r719q719q197q213
53213D15429p994p104o185n825n538m730l927l963m545m699m276l870l649l291
53199C45833k879k749k720k445k343l038m039m153l233k366k146j983j383q04
53185C09552p74j019j038r07r65j231j506j689j711j559j476j674j929j894j777
53170B88403j999k288j934j067p15j309k025k044j589j237r53m93q4NR5N53J022
53153B72341Q63J73l55m11l35n05r36j471j911j991j632j221j267j719j977j630
53137B56016r35m59m40o32o71m61j47J74N85J044J167O10l17r18r57q64r41q49
53119B51005k38N24P69M64J41K5j77n42o11o0P29J154J169J192J368J422J152
$$ plain form
53102 259486 260182 260399 260079 259199 257950 256594 255138 253433 251661 250356 249743 249278 248124 245989 243288 240623
53086 240623 238353 236693 235927 236326 237812 239735 241086 241163 240111 238690 237464 236383 235185 233871 232629
53071 232629 231611 231020 231092 231629 231837 231116 229842 228903 228596 228476 228191 227810 227288 226263 224722 223374 223005
53054 223005 223728 225097 226672 228170 229323 229851 229568 228492 227018 225907 225709 226104 226200 225598 224763 224233 223985
53037 223985 223885 224206 225184 226389 227113 227267 227417 228011 228992 230071 230941 231144 230222 228262 226044 224397 223474
53020 223474 222766 221790 220636 219764 219355 219017 218224 216960 215702 214874 214543 214601 214917 215214 215163 214784 214481 214485 214511
53001 214511 214177 213502 212811 212340 212208 212487 213033 213414 213356 213107 213081 213291 213470 213591 213855 214193 214177 213529 212416
52982 212416 211184 210085 209320 209088 209444 210249 211302 212386 213207 213573 213686 213986 214576 215075 215258 215572 216621
$$ packed form
53102B59486O96K17l20q80j249j356j456j705j772j305o13m65j154k135k701k665
53086B40623k270j660p66L99J486J923J351P7j052j421j226j081j198j314j242
53071B32629j018n91P2N37K08p21j274r39l07j20k85l81n22j025j541j348l69
53054B23005P23J369J575J498J153N28k83j076j474j111j98L95R6o02q35n30k48
53037B23985j00L21R78J205P24J54J50N94R81J079Q70K03r22j960k218j647r23
53020B23474p08r76j154q72m09l38p93j264j258q28l31N8L16K97n1l79l03MK6
53001B14511l34o75o91m71j32K79N46L81n8k49k6K10J79J21K64L38j6o48j113
52982B12416j232j099p65k32L56Q05J053J084Q21L66J13L00N90M99J83L14J049
$$ plain form
52965 216621 218261 219602 220022 219797 219605 219722 220078 220762 221920 223108 223365 222343 220968 220583 221548 223061
52949 223061 224167 224493 224069 223040 221712 220489 219518 218618 217705 216942 216327 215446 213969 212118 210456 209375
52933 209375 209023 209426 210283 210839 210407 209056 207449 206009 204639 203338 202637 203072 204405 205751 206492 206727
52917 206727 206750 206460 205670 204824 204868 206192 208063 209377 209689 209159 207845 205722 203373 201963 202182 203555 205027
52900 205027 205928 206146 205788 205142 204775 205236 206568 208305 209884 210907 211191 210894 210575 210847 211870 213282 214561
52883 214561 215277 215119 214043 212573 211607 211590 211921 211474 209833 207776 206368 205797 205393 204765 204445 205180 206924
52866 206924 208926 210645 212179 213832 215630 217345 218740 219634 219957 219840 219601 219655 220491 222443 225167 227568
52850 227568 228781 229238 230213 232202 234325 235550 235905 235972 235649 234183 231400 228241 225850 224476 223525 222416
$$ packed form
52965B16621J640J341M20k25j92J17L56O84J158J188K57j022j375l85R65J513
52949B23061J106L26m24j029j328j223r71r00r13p63o15q81j477j851j662j081
52933B09375l52M03Q57N56m32j351j607j440j370j301p01M35J333J346P41K35
52917B06727K3k90p90q46M4J324J871J314L12n30j314k123k349j410K19J373J472
52900B05027R01K18l58o46l67M61J332J737J579J023K84k97l19K72J023J412J279
52883B14561P16j58j076j470r66j7L31m47j641k057j408n71m04o28l20P35J744
52866B06924K002J719J534J653J798J715J395Q94L23j17k39N4Q36J952K724K401
52850B27568J213M57R75J989K123J225L55O7l23j466k783l159k391j374r51j109
$$ plain form
52834 222416 221073 219731 218584 217738 217241 216969 216571 215743 214557 213354 212387 211758 211626 212062 212614 212473 211410
52817 211410 210200 209766 210212 211039 212000 213193 214569 215940 217428 219318 221435 223169 224144 224476 224388 224034
52801 224034 223704 223752 224243 225027 226065 227246 228018 227795 226635 224932 222546 219055 214894 211337 209066 207511
52785 207511 205983 204677 204112 204195 204383 204345 204094 203842 203966 204605 205138 204718 203609 203152 203994 205160 205440 204912
52767 204912 204350 203907 203402 203302 204311 206135 207697 208523 209086 209755 210207 210063 209505 209026 208960 209337 209854 209972
52749 209972 209343 208225 207291 207096 207801 209149 210430 210848 210297 209550 209390 209812 210395 211013 211728 212382 212884 213654
52731 213654 215170 217228 219133 220463 221217 221410 221045 220294 219297 217956 216315 214883 214130 213986 214257 215147
52715 215147 216705 218162 218621 218215 217818 217723 217391 216520 215586 215085 214845 214321 213256 211917 210864 210436 210296
$$ packed form
52834B22416j343j342j147q46m97k72l98q28j186j203r67o29j32M36N52j41j063
52817B11410j210m34M46Q27R61J193J376J371J488J890K117J734R75L32q8l54
52801B24034l30M8M91P84J038J181P72k23j160j703k386l491m161l557k271j555
52785B07511j528j306n65Q3J88l8k51k52J24O39N33m20j109m57Q42J166K80n28
52767B04912n62m43n05j00J009J824J562Q26N63O69M52j44n58m79o6L77N17J18
52749B09972o29j118r34j95P05J348J281M18n51p47j60M22N83O18P15O54N02P70
52731B13654J516K058J905J330P54J93l65p51r97j341j641j432p53j44K71Q90
52715B15147J558J457M59m06l97r5l32q71r34n01k40n24j065j339j053m28j40
$$ plain form
52698 210296 209748 208715 207964 207988 208255 208109 207800 207817 207778 207058 206153 206177 207143 207962 208226 208762 210077 211391 211764
52679 211764 211351 210966 211100 211813 213010 214290 215045 215117 214926 214715 214207 213397 213052 213886 215577 217100 217805 217788
52661 217788 217456 217060 216620 216116 215822 216337 217997 220264 222149 223304 224322 225894 228056 230352 232304 233619
52645 233619 234335 234850 235501 236167 236662 237387 238918 240942 242276 242117 240792 239100 237507 236133 234973 233884
52629 233884 232730 231701 231128 230964 230934 231103 231657 232158 231817 230604 229384 228766 228610 228755 229314 230012 230153 229744
52611 229744 229715 230506 231275 231181 230610 230349 230278 229787 228954 228295 227713 226659 225231 224285 224376 225232 226304 227316 228221
52592 228221 229054 229811 230269 230050 229184 228409 228457 229155 229570 229004 227639 226366 226196 227626 230247 233078 235375
52575 235375 236951 237754 237680 237025 236559 236746 237345 238112 239359 241277 243208 244269 244441 244404 244561 244782 244878 244668
$$ packed form
52698B10296n48j033p51K4K67j46l09J7l9p20r05K4R66Q19K64N36J315J314L73
52679B11764m13l85J34P13J197J280P55P2j91k11n08q10l45Q34J691J523P05j7
52661B17788l32l96m40n04k94N15J660K267J885J155J018J572K162K296J952J315
52645B33619P16N15O51O66M95P25J531K024J334j59j325j692j593j374j160j089
52629B33884j154j029n73j64l0J69N54N01l41j213j220o18j56J45N59O98J41m09
52611B29744k9P91P69r4n71k61p1m91q33o59n82j054j428r46R1Q56J072J012R05
52592B28221Q33P57M58k19q66p75M8O98M15n66j365j273j70J430K621K831K297
52575B35375J576Q03p4o55m66J87N99P67J247J918J931J061J72l7J57K21R6k10
$$ plain form
52557 244668 243729 241768 239255 237099 235717 234931 234690 235206 236297 237215 237441 237181 236801 236163 234921 233216
52541 233216 231676 230756 230376 230215 230099 229902 229309 228118 226898 226940 229107 232815 236500 239007 240169 240205 239276
52524 239276 237842 236808 236770 237332 237574 237066 236235 235851 236329 237393 238384 239071 240108 242341 245695 249160 251937
52507 251937 254082 255907 257398 258503 259488 260580 261623 262377 262801 262787 262046 260592 258912 257330 255563 253243
52491 253243 250456 247524 244733 242627 242007 243087 245022 246710 247754 248303 248454 248359 248471 249023 249570 249616 249432
52474 249432 249718 250683 251992 253392 254852 256268 257540 258833 260367 262103 263956 266031 268288 270284 271660
52459 271660 272599 273435 274165 274752 275461 276369 276916 276505 275204 273350 270982 268304 266175 265223 264726 263316 260735
52442 260735 258124 256598 256221 256347 256312 255762 254902 254413 254664 255081 254760 253551 252023 250670 249725 249453 249857
$$ packed form
52557B44668r39j961k513k156j382p86k41N16J091R18K26k60l80o38j242j705
52541B33216j540r20l80j61j16j97n93j191j220M2K167L708L685K507J162L6r29
52524B39276j434j034l8N62K42n08q31l84M78J064R91O87J037K233L354L465K777
52507B51937K145J825J491J105R85J092J043P54M24j4p41j454j680j582j767k320
52491B53243k787k932k791k106o20J080J935J688J044N49J51r5J12N52N47M6j84
52474B49432K86R65J309J400J460J416J272J293J534J736J853K075K257J996J376
52459B71660R39Q36P30N87P09R08N47m11j301j854k368k678k129r52m97j410k581
52442B60735k611j526l77J26l5n50q60m89K51M17l21j209j528j353r45k72M04
$$ plain form
52425 249857 250235 249799 248671 247618 246985 246596 246502 246925 247539 247760 247805 248581 250353 252350 253845 254867 255646
52408 255646 256144 256435 256889 257707 258818 260399 262816 265868 268713 270837 272618 274764 277721 281626 286169
52393 286169 290434 293663 296364 299880 304590 309284 312598 314308 314805 314138 312183 309195 305631 301841 298324
52378 298324 295662 293736 291609 288772 286048 284621 284627 285324 286250 287439 288689 289431 289417 289000 288616 288369 288255
52361 288255 288455 289169 290245 291138 291293 290647 289726 289170 289220 289768 290700 291927 293241 294513 295883 297388 298581
52344 298581 299056 299260 300087 301628 302945 303246 302691 301917 301397 301531 302698 304762 306955 308641 309987 311710
52328 311710 314483 318559 323464 328058 331584 334747 339026 344735 350632 355709 360345 365130 369625 373188
52314 373188 376241 379618 383079 385651 387246 388991 391885 395909 400463 404993 409083 412571 415792 419383
$$ packed form
52425B49857L78m36j128j053o33l89r4M23O14K21M5P76J772J997J495J022P79
52408B55646M98K91M54Q18J111J581K417L052K845K124J781K146K957L905M543
52393B86169M265L229K701L516M710M694L314J710M97o67j955k988l564l790l517
52378B98324k662j926k127k837k724j427OO97R26J189J250P42j4m17l84k47j14
52361B88255K00P14J076Q93J55o46r21n56N0N48R32J227J314J272J370J505J193
52344B98581M75K04Q27J541J317L01n55p74n20J34J167K064K193J686J346J723
52328C11710K773M076M905M594L526L163M279N709N897N077M636M785M495L563
52314C73188L053L377L461K572J595J745K894M024M554M530M090L488L221L591
$$ plain form
52300 419383 423769 429033 435096 441676 448257 454528 460645 466656 471990 476038 479035 481733 484422 486899
52286 486899 489204 491548 493538 494378 494096 493820 494424 495520 496242 496541 497079 498183 499533 500805 502130 503795
52270 503795 505868 508332 511327 514946 518818 522168 524518 526244 528248 531085 534647 538732 543562 549455
52256 549455 556139 562760 568614 573688 578486 583457 588642 593755 598550 603067 607455 611613 615176 617900
52242 617900 619900 621479 622942 624657 626941 629637 632047 633604 634558 635795 638051 641483 645859 650886
52228 650886 656296 661752 666795 671015 674436 677663 681375 685639 690043 694462 699264 704625 710200 715760
52214 715760 721591 727795 733750 738944 743980 749896 756566 762667 767384 771359 775644 780403 785219 790078
52200 790078 795297 800713 805707 810148 814674 819783 825127 830095 834808 839997 845992 852282 858216 863686
$$ packed form
52300D19383M386N264O063O580O581O271O117O011N334M048K997K698K689K477
52286D86899K305K344J990Q40k82k76O04J096P22K99N38J104J350J272J325J665
52270E03795K073K464K995L619L872L350K350J726K004K837L562M085M830N893
52256E49455O684O621N854N074M798M971N185N113M795M517M388M158L563K724
52242F17900K000J579J463J715K284K696K410J557R54J237K256L432M376N027
52228F50886N410N456N043M220L421L227L712M264M404M419M802N361N575N560
52214G15760N831O204N955N194N036N916O670O101M717L975M285M759M816M859
52200G90078N219N416M994M441M526N109N344M968M713N189N995O290N934N470
$$ plain form
52186 863686 868878 873682 877772 881100 883889 886130 887446 887531 886455 884512 882027 879331 876635 873842 870735
52171 870735 867356 863932 860433 856665 852933 850068 848485 847647 846875 846328 846595 847575 848435 848772 849156 850206
52155 850206 851579 852382 852400 852384 853028 854109 854947 855450 856252 857823 859887 861870 863575 865215 867060 869290
52139 869290 871895 874459 876343 877406 878191 879002 879267 878464 877261 876824 877172 877256 876757 876821 878657 882273 887060
52122 887060 892846 899752 907626 916214 925422 934867 943623 951056 957528 963716 969532 974246 977326 978558
$$ packed form
52186H63686N192M804M090L328K789K241J316Q5j076j943k485k696k696k793l107
52171H70735l379l424l499l768l732k865j583q38p72n47K67R80Q60L37L84J050
52155H50206J373Q03J8j6O44J081Q38N03Q02J571K064J983J705J640J845K230
52139H69290K605K564J884J063P85Q11K65q03j203m37L48Q4m99O4J836L616M787
52122H87060N786O906P874Q588R208R445Q756P433O472O188N816M714L080J232
$$ [...]
##END NTUPLES=NMR SPECTRUM
##END=
