
##TITLE=UV1221_M6_1234-1212_5_7241637_SVRYwP0Gcb
##JCAMPDX= 6.0         $$ Bruker NMR JCAMP-DX V2.0
##DATA TYPE= NMR SPECTRUM
##DATA CLASS= NTUPLES
##ORIGIN= BRUKER
##OWNER= Administrator
$$ 1.72 TOPSPIN		Version 2.1
$$ 2013-01-17 22:51:18.249 -0500  Administrator@X
$$ Compression mode = diff/dup
##.OBSERVE FREQUENCY= 400.02188249412
##.OBSERVE NUCLEUS= ^1H
##.ACQUISITION MODE= SIMULTANEOUS (DQD)
##.ACQUISITION SCHEME= undefined
##.AVERAGES= 8
##.DIGITISER RES= 22
##SPECTROMETER/DATA SYSTEM= spect
##.PULSE SEQUENCE= zg30
##.SOLVENT NAME= COFFEE_meoh
##.SHIFT REFERENCE= INTERNAL, COFFEE_meoh, 1, 14.98509
##AUDIT TRAIL= $$ (NUMBER, WHEN, WHO, WHERE, PROCESS, VERSION, WHAT)
$$ ##TITLE= Audit trail, TOPSPIN		Version 2.1
$$ ##JCAMPDX= 5.01
$$ ##ORIGIN= Bruker BioSpin GmbH
$$ ##OWNER= Administrator
$$ $$ E:\/data/COFFEE/nmr/UV1221_M6_1234-1212_5_7241637_SVRYwP0Gcb/20/pdata/1/auditp.txt
$$ ##AUDIT TRAIL=  $$ (NUMBER, WHEN, WHO, WHERE, PROCESS, VERSION, WHAT)
(   1,<2013-01-17 22:51:10.390 -0500>,<Administrator>,<X>,<go>,<TOPSPIN 2.1>,
      <created by zg
	started at 2013-01-17 22:50:04.421 -0500,
	POWCHK enabled, PULCHK disabled,
       configuration hash MD5:
       86 BA 57 50 F2 9D 5C 9B 26 00 A9 28 5F 66 2E 89
       data hash MD5: 64K
       F8 AF 21 B3 6E 47 DF 75 1A F6 3C AA 56 BC 70 7B>)
(   2,<2013-01-17 22:51:13.374 -0500>,<Administrator>,<X>,<proc1d>,<TOPSPIN 2.1>,
      <Start of raw data processing
       efp LB = 0 FT_mod = 6 PKNL = 1 PHC0 = 0 PHC1 = 0 SI = 32K 
       data hash MD5: 32K
       0F 43 E7 F0 C3 D2 A4 6A 2C 39 A7 8A E2 DE E3 B4>)
(   3,<2013-01-17 22:51:13.843 -0500>,<Administrator>,<X>,<proc1d>,<TOPSPIN 2.1>,
      <pk PHC0 = 95.86121 PHC1 = 0 
       data hash MD5: 32K
       0C 72 26 A8 3F 60 77 49 2E 7F 4B 1D 78 B2 80 95>)
(   4,<2013-01-17 22:51:14.077 -0500>,<Administrator>,<X>,<proc1d>,<TOPSPIN 2.1>,
      <abs ABSG = 1 
       data hash MD5: 32K
       26 FC 1A 9B 87 40 7E C1 55 79 B6 28 EE 1B B2 87>)
(   5,<2013-01-17 22:51:14.218 -0500>,<Administrator>,<X>,<proc1d>,<TOPSPIN 2.1>,
      <abs ABSG = 2 
       data hash MD5: 32K
       81 5D FF 88 2C 0B DD 94 42 E6 C7 71 B8 63 A0 5C>)
(   6,<2013-01-17 22:51:14.374 -0500>,<Administrator>,<X>,<proc1d>,<TOPSPIN 2.1>,
      <abs ABSG = 3 
       data hash MD5: 32K
       43 54 E2 75 FD 75 C7 4C 1A 39 4B 17 B5 F8 52 EF>)
(   7,<2013-01-17 22:51:14.515 -0500>,<Administrator>,<X>,<proc1d>,<TOPSPIN 2.1>,
      <abs ABSG = 4 
       data hash MD5: 32K
       F2 52 52 3A 08 91 17 86 B8 FD 3B E8 69 9C 28 5E>)
(   8,<2013-01-17 22:51:14.656 -0500>,<Administrator>,<X>,<proc1d>,<TOPSPIN 2.1>,
      <abs ABSG = 5 
       data hash MD5: 32K
       5E DB 38 E1 CA 9A 54 39 17 60 44 28 56 45 C6 CC>)
$$ ##END=
$$ 
$$ $$ hash MD5
$$ $$ BC 95 B2 9E 23 07 E3 0F 86 30 BA 5A 22 71 FA F5
##$RELAX= 
##$RELAX= 
##$RELAX= 
##$RELAX= 
##$RELAX= 
##$RELAX= 
##$RELAX= 
$$ Bruker specific parameters
$$ --------------------------
##$DU= <E:\>
##$EXPNO= 20
$$ [...]
150 150 150 150 150 150 150 150
##$TP07= 0
##$TPNAME0= <>
##$TPNAME1= <>
##$TPNAME2= <>
##$TPNAME3= <>
##$TPNAME4= <>
##$TPNAME5= <>
##$TPNAME6= <>
##$TPNAME7= <>
##$TPOAL= (0..7)
0.5 0.5 0.5 0.5 0.5 0.5 0.5 0.5
##$TPOFFS= (0..7)
0 0 0 0 0 0 0 0
##$TUNHIN= 0
##$TUNHOUT= 0
##$TUNXOUT= 0
##$USERA1= <user>
##$USERA2= <user>
##$USERA3= <user>
##$USERA4= <user>
##$USERA5= <user>
##$V9= 5
##$VALIST= <valist>
##$VCLIST= <CCCCCCCCCCCCCCC>
##$VD= 0
##$VDLIST= <DDDDDDDDDDDDDDD>
##$VPLIST= <PPPPPPPPPPPPPPP>
##$VTLIST= <TTTTTTTTTTTTTTT>
##$WBST= 1024
##$WBSW= 4
##$XGAIN= (0..3)
0 0 0 0
##$XL= 0
##$YL= 0
##$YMAX_a= 674808
##$YMIN_a= -573897
##$ZGOPTNS= <>
##$ZL1= 120
##$ZL2= 120
##$ZL3= 120
##$ZL4= 120
##$ABSF1= 14.98509
##$ABSF2= -5.573092
##$ABSG= 5
##$ABSL= 3
##$ALPHA= 0
##$AQORDER= 0
##$ASSFAC= 0
##$ASSFACI= 0
##$ASSFACX= 0
##$ASSWID= 0
##$AUNMP= <proc_prof1d_extract_pilot.lims>
##$AXLEFT= 0
##$AXNAME= <>
##$AXNUC= <1H>
##$AXRIGHT= 0
##$AXTYPE= 0
##$AXUNIT= <>
##$AZFE= 0.1
##$AZFW= 0.1
##$BCFW= 0
##$BC_mod= 0
##$BYTORDP= 0
##$COROFFS= 0
##$CY= 15
##$DATMOD= 1
##$DC= 0
##$DFILT= <>
##$DTYPP= 0
##$F1P= 0
##$F2P= 0
##$FCOR= 0.5
##$FTSIZE= 32768
##$FT_mod= 6
##$GAMMA= 0
##$GB= 0
##$INTBC= 1
##$INTSCL= 1
##$ISEN= 128
##$LB= 0
##$LEV0= 0
##$LPBIN= 0
##$MAXI= 10000
##$MC2= 0
##$MEAN= 0
##$ME_mod= 0
##$MI= 0
##$NCOEF= 0
##$NC_proc= -8
##$NLEV= 6
##$NOISF1= 0
##$NOISF2= 0
##$NSP= 0
##$NTH_PI= 0
##$NZP= 0
##$OFFSET= 14.98509
##$PC= 1
##$PHC0= 95.86121
##$PHC1= 0
##$PH_mod= 1
##$PKNL= yes
##$PPARMOD= 0
##$PPDIAG= 0
##$PPIPTYP= 0
##$PPMPNUM= 2147483647
##$PPRESOL= 1
##$PSCAL= 4
##$PSIGN= 0
##$PYNMP= <proc.py>
##$REVERSE= no
##$SF= 400.02
##$SI= 32768
##$SIGF1= 0
##$SIGF2= 0
##$SINO= 400
##$SIOLD= 32768
##$SPECTYP= <>
##$SREGLST= <1H.CDCl3>
##$SSB= 0
##$STSI= 32768
##$STSR= 0
##$SW_p= 8223.68421052631
##$SYMM= 0
##$S_DEV= 0
##$TDeff= 65536
##$TDoff= 0
##$TI= <>
##$TILT= no
##$TM1= 0
##$TM2= 0
##$TOPLEV= 0
##$USERP1= <user>
##$USERP2= <user>
##$USERP3= <user>
##$USERP4= <user>
##$USERP5= <user>
##$WDW= 1
##$XDIM= 32768
##$YMAX_p= 469152753
##$YMIN_p= -843768
##$CURPLOT= <Network HP LaserJet P1505>
##$CURPRIN= <$Network HP LaserJet P1505>
##$DFORMAT= <normdp>
##$LAYOUT= <+/1D_H.xwp>
##$LFORMAT= <normlp>
##$PFORMAT= <normpl>
##$SURQMSG= 1
$$ End of Bruker specific parameters
$$ ---------------------------------
##NTUPLES= NMR SPECTRUM
##VAR_NAME=  FREQUENCY,     SPECTRUM/REAL,   SPECTRUM/IMAG
##SYMBOL=    X,             R,               I
##VAR_TYPE=  INDEPENDENT,   DEPENDENT,       DEPENDENT
##VAR_FORM=  AFFN,          ASDF,            ASDF
##VAR_DIM=   32768,         32768,           32768
##UNITS=     HZ,            ARBITRARY UNITS, ARBITRARY UNITS
##FACTOR=    0.250966925370066, 1,           1
##FIRST=     8223.43324360094, -54113,       -262030
##LAST=      0,             84319,           -70555
##MIN=       0,             -843768,         0
##MAX=       8223.43324360094, 469152753,    0
$$ Real data points
##PAGE= N=1
##DATA TABLE= (X++(R..R)), XYDATA
$$ [...]
19553C5872b86327K5994c3848q3129N2382G3273J7951b10084F2172L8450a63777
$$ 35872 -286327 -260333 -33848 -116977 -64595 73273 91224 -210084 62172 100622 -163777
19541a32086C7127A2849J41310c01777c3771p0925M9841p1072d8210A09636M5104
$$ -132086 37127 12849 154159 -301777 -33771 -104696 -54855 -125927 -48210 109636 154740
19530A54740e6615m7930k1398N2413C5615e4971q4936B49371h2832k8184M0349
$$ 154740 -56615 -104545 -125943 -73530 35615 -54971 -139907 249371 -82832 -111016 -70667
19519g0667l9109k54562J21508J04524M7000l02553a68607L0808j07566A1813
$$ -70667 -109776 -364338 -242830 -138306 -91306 -393859 -168607 -137799 -245365 11813
19508A1512e0818A91922c51637J38993d6009j7385j82315A24971e290k7670A56007
$$ 11512 -50818 191922 -351637 -212644 -46009 -63394 -245709 124971 -5290 -32960 156007
19496h9558j51079B08366b77770p3868F881K42150q5671K8467A3180a15392o7267
$$ -89558 -240637 208366 -277770 -351638 6881 249031 163360 191827 13180 -115392 -182659
19485a82659e2314A85812P3409k0146b4742I0379a99508K0763j43242I3158J6747
$$ -182659 -52314 185812 259221 239075 -24742 90379 -199508 -178745 -321987 93158 109905
19474A09905b48418A57425G354a50614j80732a39723j9301L8494j7165e3041l20528
$$ 109905 -248418 157425 7354 -150614 -331346 -139723 -159024 -120530 -137695 -53041 -373569
19463c73569G5714A783J21123b05017D2885a22544B51202D8148P2685i4544D1064
$$ -373569 75714 1783 122906 -205017 42885 -122544 251202 48148 120833 -94544 41064
19451i7414r300M3028a8765l03456a49985k21129C71849b91348A14137c17865
$$ -97414 -106714 -63686 -18765 -322221 -149985 -371114 371849 -291348 114137 -317865
19440D1855B879b64922C16575b11385p2985I8903c66090J63582J3791q7088a17168
$$ 41855 2879 -264922 316575 -211385 -284370 98903 -366090 -202508 -188717 -275805 -117168
19428a69940B0818c27150G5036a28487p5292G752R1079b60882J8641r7c3930n8508
$$ -169940 20818 -327150 75036 -128487 -203779 7752 98831 -260882 -242241 -242338 -33930 -92438
19416i2438k8993j32314A91675J62980b35848Q9A37078f7794A21834J57066a01095
$$ -92438 -121431 -253745 191675 354655 -235848 -235759 137078 -67794 121834 278900 -101095
19404f46j00448c0495l66623c1176q6541j03998B71675a42883A14362c1951r9345
$$ -646 -101094 -30495 -397118 -31176 -117717 -221715 271675 -142883 114362 -31951 -131296
19393a31296C2154J3673e1685Q507o7346d0409n9613C31750f6769j22065F2051
$$ -131296 32154 45827 -51685 -43178 -110524 -40409 -100022 331750 -66769 -188834 62051
19381d1359m3745o3221A05002h6455A96574g7240b3793k93161C36175e89138a18409
$$ -41359 -85104 -148325 105002 -86455 196574 -77240 -23793 -316954 336175 -589138 -118409
19369a64087e7801C8625c45333G1814P5567p252D3226b33008h1578a0099j43872
$$ -164087 -57801 38625 -345333 71814 147381 140129 43226 -233008 -81578 -10099 -153971
19358a53971e2634j71868O5667F3244a34758b6686A60346a69062F9776K62443
$$ -153971 -52634 -224502 -158835 63244 -134758 -26686 160346 -169062 69776 332219
19348C32219c8361l74717B32481b28632J13455B04043b2978l06941k0321c7957
$$ 332219 -38361 -413078 232481 -228632 -115177 204043 -22978 -329919 -350240 -37957
19337a15896M1609j53177D43364a70743A45889a10200k15082c7641B2782J27314
$$ -115896 -74287 -227464 443364 -170743 145889 -110200 -325282 -37641 22782 150096
19327A50096h4862j35496A06074A3671c6499l43218A98515c20183h0059F7253
$$ 150096 -84862 -220358 106074 13671 -36499 -379717 198515 -320183 -80059 67253
19316e986j84794b3026j85686F4090b0128A67468b3691o3886C1044p396K43075
$$ -5986 -190780 -23026 -208712 64090 -20128 167468 -23691 -87577 31044 23648 266723
19305B66723b11858j15722H48c08235A44243n4243J15029J4004e1115p4995B03795
$$ 266723 -211858 -327580 848 -308235 144243 90000 205029 219033 -51115 -126110 203795
19293A66783A9454J85340j00287f4023j22274A09175J13120b50291B37571b49591
$$ 166783 19454 204794 104507 -64023 -186297 109175 222295 -250291 237571 -249591
19282B3305a22726k55471J63105k28262a31758d3777j32615q6429a3730k2414
$$ 23305 -122726 -378197 -215092 -443354 -131758 -43777 -176392 -262821 -13730 -36144
19272c6144A25299l6966O2830R0594e3492b626B1154d24116H6424a85700b412
$$ -36144 125299 88333 151163 241757 -53492 -2626 21154 -424116 86424 -185700 -2412
19260a16283j28968A43810A1090R7601b28379A5984c23110L1732I7613b18547
$$ -116283 -245251 143810 11090 108691 -228379 15984 -323110 -291378 97613 -218547
19249A34639a93435M8722B98480I387b04818h6086m0497O2794G3650k2643c50612
$$ 134639 -193435 -144713 298480 9387 -204818 -86086 -126583 -63789 73650 51007 -350612
19237C39656d6942j0519q3058C28691A11022b14695n2565A40280G426b31473A98229
$$ 339656 -46942 -57461 -140519 328691 111022 -214695 -267260 140280 7426 -231473 198229
19225C86513A71338i8605L4016k07521A21046a72983N2153J9390F8734b95411
$$ 386513 171338 -98605 -64589 -272110 121046 -172983 -120830 -101440 68734 -295411
19214i032k22076g8973b3227j04151A37716a35945j38672h7957k69950e6812G7195
$$ -9032 -231108 -78973 -23227 -127378 137716 -135945 -274617 -87957 -357907 -56812 77195
19202b30681a06332a7224q7681e509B9968N1691J48654A2958a23311A24476b14752
$$ -230681 -106332 -17224 -104905 -5509 29968 81659 230313 12958 -123311 124476 -214752
19190a70495k23976i4342c1871A86924b44670d2044n54112b10609N9372j31977
$$ -170495 -394471 -94342 -31871 186924 -244670 -42044 -596156 -210609 -151237 -283214
19180b83214D5529a28027d8880j55150J8896B21561A0847c36893a19774A18022
$$ -283214 45529 -128027 -48880 -204030 -185134 221561 10847 -336893 -119774 118022
19169h2040q7976j22479g6778j08664K3273r594n1926j03373B71857b23918I3791
$$ -82040 -170016 -292495 -76778 -185442 -162169 -171763 -223689 -327062 271857 -223918 93791
19157d4527d178k6141j97159a6792o4759j96740b8856j32724F2426K5491L6666
$$ -44527 -4178 -30319 -227478 -16792 -81551 -278291 -28856 -161580 62426 87917 124583
19146A24583a22008e5069j29238b5795E9856a73895a360j89410I9981a62379a7569
$$ 124583 -122008 -55069 -184307 -25795 59856 -173895 -1360 -190770 99981 -162379 -17569
19134b48570G4828e1366j55137j31034B6172b56248R4364L5666B9081J07108b69454
$$ -248570 74828 -51366 -206503 -337537 26172 -256248 -161884 -126218 29081 136189 -269454
19122c86389A0289J52156p8343d7185G8396l5062a81928p2367P6218F2448k7242
$$ -386389 10289 162445 84102 -47185 78396 43334 -181928 -254295 -178077 62448 35206
19111C5206A4262a33161j85115J31016o9231h3807m0684k073l40440A33110b8134
$$ 35206 14262 -133161 -318276 -187260 -256491 -83807 -124491 -126564 -467004 133110 -28134
19099b75087c5941j05332E8065J3647b33395C3612J84043N0595b81797J3670G7779
$$ -275087 -35941 -141273 58065 71712 -233395 33612 217655 268250 -281797 -268127 77779
19087I422L22492b17902E4286d77j77789L2536F4256K7058d23956q1561B53068
$$ 9422 331914 -217902 54286 -477 -178266 -145730 64256 91314 -423956 -505517 253068
19075a70145M9639j82850a41151n029f0250A36639c32885a47086j06267k12435
$$ -170145 -120506 -303356 -141151 -146180 -60250 136639 -332885 -147086 -253353 -465788
19065d65788I2489N1230f0096j6362c4167q9485A39362c53880C6140d20879f1405
$$ -465788 92489 143719 -60096 -76458 -34167 -123652 139362 -353880 36140 -420879 -61405
19053b16236a5597H8673M8614b00372a5436B75424n5752a52302A23709L63223
$$ -216236 -15597 88673 137287 -200372 -15436 275424 219672 -152302 123709 486932
19043D86932a63682j20867M0767Q8582r99N8234K633n2211C23998c67361F3997
$$ 486932 -163682 -284549 -243782 -155200 -156199 -97965 -95332 -147543 323998 -367361 63997
19031B00756f5990C196P1992L7662J30364j18550n5654J24614n3615J65532A29510
$$ 200756 -65990 3196 75188 112850 243214 124664 69010 193624 140009 305541 129510
19019d4603D1876b11551J0184f9144I8359l7072J58b53203l2895L04A80774l2401
$$ -44603 41876 -211551 -201367 -69144 98359 61287 61445 -253203 -286098 -285794 180774 148373
19007A48373J82179i9686I4377a58553M2202j32087R5256f0797b9533j20463b5590
$$ 148373 330552 -99686 94377 -158553 -116351 -248438 -153182 -60797 -29533 -149996 -25590
18995a24015k9898B38585H891d6207j00328o144D738K1084h7668p1432j80552
$$ -124015 -153913 238585 8891 -46207 -146535 -152679 4738 25822 -87668 -159100 -339652
18984c39652C0555K874b32927A9497Q38Q9347M2822b66591b1831k91832J31412
$$ -339652 30555 33429 -232927 19497 20335 109682 152504 -266591 -21831 -313663 -182251
18973a82251P3512A71532a67120l14943D3515e2336j1311j06863P2898M3430n9310
$$ -182251 -108739 171532 -167120 -482063 43515 -52336 -63647 -170510 -97612 -54182 -113492
18962a13492e392G8410J43199o7211c8308k39004D541i8841D1436i4438C9198
$$ -113492 -5392 78410 221609 154398 -38308 -277312 4541 -98841 41436 -94438 39198
18950a95036n006C1928b02765A84450d067k02975A39423m2285c70292a54476l90276
$$ -195036 -200042 31928 -202765 184450 -4067 -207042 139423 97138 -370292 -154476 -544752
18939e44752f8823d405E7533a07119k8078B5778a87594r5524B5263M5466J67680
$$ -544752 -68823 -4405 57533 -107119 -135197 25778 -187594 -283118 25263 70729 238409
18928B38409h4442G7567J20464a95644J1964b8468I300K39324e00049e2868k45517
$$ 238409 -84442 77567 198031 -195644 -183680 -28468 9300 248624 -500049 -52868 -298385
18917b98385f0281j45643G2420b45989A00551b41557A98316G539J10043n7601
$$ -298385 -60281 -205924 72420 -245989 100551 -241557 198316 7539 117582 59981
18907E9981O5747p23a3672B72975A16242a09251j86875a07090A39440F8588j8699
$$ 59981 125728 125005 -13672 272975 116242 -109251 -296126 -107090 139440 68588 49889
18896D9889J94206c03485r5359a18080C4549e0715m00000H0414b5869j50725p1719
$$ 49889 244095 -303485 -398844 -118080 34549 -50715 -450715 80414 -25869 -176594 -248313
18885b48313B86682c75463L8180J52756D1416f4518K6520B06368g8825I1819N8486
$$ -248313 286682 -375463 -337283 -184527 41416 -64518 -37998 206368 -78825 91819 150305
18874A50305E3098G650a16175p8473J2923M9930E4610f3081o2925l19280d6611
$$ 150305 53098 7650 -116175 -194648 -181725 -131795 54610 -63081 -126006 -445286 -46611
18862H0528O4894b5859C8499c98948a0586l88100h1879c7062q741l40427a15891
$$ 80528 145422 -25859 38499 -398948 -10586 -398686 -81879 -37062 -45803 -386230 -115891
18850G9308a67279b9457A31369J10191a10619K2904E0601b22302a0933j31007
$$ 79308 -167279 -29457 131369 241560 -110619 -87715 50601 -222302 -10933 -141940
18840a41940j73236d1261j3707j96708A67022I416M8468a0038m20360b8522m8881
$$ -141940 -315176 -41261 -54968 -251676 167022 9416 57884 -10038 -430398 -28522 -77403
18829g7403b6173G9525J75082c31535J45037F5418K60575d31928A10151m3143
$$ -77403 -26173 79525 254607 -331535 -186498 65418 325993 -431928 110151 67008
18819F7008Q2155g5051E8656L7954g2428E13686B7776c8946B18383a30647C25689
$$ 67008 149163 -75051 58656 96610 -72428 513686 27776 -38946 218383 -130647 325689
18807H1886b14367F6882a48067O6803k5432A24607a84025B1441b30231D0653J98719
$$ 81886 -214367 66882 -148067 -81264 -106696 124607 -184025 21441 -230231 40653 239372
18796B39372q9068l2285g0367a5423F8965b3980A10225D8646b3127B43596c1621
$$ 239372 150304 118019 -70367 -15423 68965 -23980 110225 48646 -23127 243596 -31621
18784G339J05117g6101A89390d05009J97108o1785a16373D9207a38102j59946
$$ 7339 112456 -76101 189390 -405009 -207901 -269686 -116373 49207 -138102 -298048
18774b98048d2007r7151K3209D7256b8863r3798L1314f622B0121L5378a19809
$$ -298048 -42007 -139158 -115949 47256 -28863 -122661 -91347 -6622 20121 55499 -119809
18762a12913A13910c29764A17769m902a06889l4568o96B36921A15238f5031j36422
$$ -112913 113910 -329764 117769 112867 -106889 -141457 -142153 236921 115238 -65031 -201453
18751b01453R1340o619F0401a51316M0573q0781g7407j41894I222O0020a7719
$$ -201453 -110113 -116732 60401 -151316 -110743 -191524 -77407 -219301 9222 69242 -17719
18739I120d18523J42773M0211o7214B44208a73228A5501a4949A04882a17340C8990
$$ 9120 -418523 -275750 -235539 -302753 244208 -173228 15501 -14949 104882 -117340 38990
18727a88064E6664i8034d8193a4542A34552b79178L0419F0124H998b26431r052
$$ -188064 56664 -98034 -48193 -14542 134552 -279178 -248759 60124 8998 -226431 -235483
18716b35483C09587a87212D4928b97080J3781A7888J60855c34881N7394P7237
$$ -235483 309587 -187212 44928 -297080 -283299 17888 178743 -334881 -277487 -200250
18706b00250B55054H4601l8958K32131a86948H1431b29215L3484h5088j47235
$$ -200250 255054 84601 45643 277774 -186948 81431 -229215 -195731 -85088 -232323
18696b32323m6789i8326a6530o2985K6975a6044j93769j47644A21730j147d13126
$$ -232323 -279112 -98326 -16530 -79515 -52540 -16044 -209813 -357457 121730 120583 -413126
18684f5568k48922J09535K5338r4093F228b29493b1843j59565Q3646j89051I4915
$$ -65568 -314490 -204955 -179617 -273710 6228 -229493 -21843 -181408 -97762 -286813 94915
18672c05781f0285q6966I1182J87852B6287g6611m9389A07311e5340A36527a00080
$$ -305781 -60285 -147251 91182 279034 26287 -76611 -126000 107311 -55340 136527 -100080
18660f4982B9952b19258G9371J39322i4972A38832a10519B13018m8328b59091
$$ -64982 29952 -219258 79371 218693 -94972 138832 -110519 213018 164690 -259091
18649B12512d5431A94317I99c69824c39B37942E9071h0976J478d465B62819e436
$$ 212512 -45431 194317 999 -369824 -339 237942 59071 -80976 -79498 -4465 262819 -5436
18636E4067L7664b94745e8444F698Q9628B3762f3218A95043a1953k10168j90410
$$ 54067 91731 -294745 -58444 6698 96326 23762 -63218 195043 -11953 -222121 -412531
18625d12531Q6354Q1500I708J09524B9966c6502j80358B08179E6210N942a62182
$$ -412531 -326177 -244677 9708 119232 29966 -36502 -216860 208179 56210 62152 -162182
18613A41860e0113A31585D5790N9874a88385P0136D447c05372A12361a87191C49451
$$ 141860 -50113 131585 45790 105664 -188385 -118249 4447 -305372 112361 -187191 349451
18601a15347E4877c3649A37323f6033K0140g802l39134F464i9878k22818N0220
$$ -115347 54877 -33649 137323 -66033 -45893 -7802 -346936 6464 -99878 -322696 -272476
18590b72476h933C0963H110L4863a21847A65201b73664E8337b35371G8787e4293
$$ -272476 -8933 30963 8110 42973 -121847 165201 -273664 58337 -235371 78787 -54293
18578C22049n7955q1299i7145j48202A54706f75l24616I0450b71292d2346J1206
$$ 322049 264094 182795 -97145 -245347 154706 -675 -325291 90450 -271292 -42346 -31140
18567c1140F2655B5128a98777e8890A41748a67494j57265j18156B5014b14444
$$ -31140 62655 25128 -198777 -58890 141748 -167494 -324759 -442915 25014 -214444
18556a93051j32154H8480J68457H2135b82995B58020J8696r7256J93888j48726
$$ -193051 -325205 88480 256937 82135 -282995 258020 276716 179460 373348 224622
18546B24622b16401D1562a02806q2125c735E5474R7473N1875b63531a28832j61
$$ 224622 -216401 41562 -102806 -184931 -3735 55474 152947 204822 -263531 -128832 -128993
18535a28993C01890D9340b15972C4922J07274b47987p2716A81144g180l7153A85120
$$ -128993 301890 49340 -215972 34922 142196 -247987 -320703 181144 -7180 -44333 185120
18523A1753b69763B73154a41062B09946j3019b08752C0935b39502K1480b3087
$$ 11753 -269763 273154 -141062 209946 196927 -208752 30935 -239502 -218022 -23087
18512a05690G8150h2267q116k1497e1205D5107d6101j37627n6570A13626L4476
$$ -105690 78150 -82267 -90383 -111880 -51205 45107 -46101 -183728 -240298 113626 148102
18501A48102F8419J3295B0306a06056L0509A39875c99782E77e1945k54243B25437
$$ 148102 68419 81714 20306 -106056 -75547 139875 -399782 577 -51945 -306188 225437
18489a82281j18821a06855H22a18833K0613M203A812b83505B125P1458i3498J6522
$$ -182281 -301102 -106855 822 -118833 -98220 -94017 1812 -283505 2125 73583 -93498 -76976
18477g6976j02420j68837b7234k55517B21821c0079N062r4326C39775g7781p3473
$$ -76976 -179396 -348233 -27234 -282751 221821 -30079 -25017 -119343 339775 -77781 -151254
18466a51254G5131a2830A85189q0565J00092q3723C1564R0297F509b32675e6758
$$ -151254 75131 -12830 185189 104624 204716 120993 31564 121861 6509 -232675 -56758
18454b79403a9900A76641j0616a07229l8090M0132C5091K3078e4015B62304A21013
$$ -279403 -19900 176641 166025 -107229 -145319 -105187 35091 58169 -54015 262304 121013
18442b10514A32081D2795b097k50512P6826o3753A05583c05354C3841a63850A6530
$$ -210514 132081 42795 -2097 -252609 -175783 -239536 105583 -305354 33841 -163850 16530
18430A44974c67258f7698j01909B01733a49750G9323b03985G3332a37407b126
$$ 144974 -367258 -67698 -169607 201733 -149750 79323 -203985 73332 -137407 -2126
18419a96264Q7426E92825e7418r969c2236j39925b5594H7113f0250j68811j71694
$$ -196264 -108838 592825 -57418 -67387 -32236 -172161 -25594 87113 -60250 -229061 -400755
18408d00755A49172J95338C1137K68583E8197d9192F1513K7132a99311K7888j24218
$$ -400755 149172 344510 31137 299720 58197 -49192 61513 88645 -199311 -171423 -295641
18397b95641A29762C4301O3381o055K75000b17650A6484e39047h3792A31463c38563
$$ -295641 129762 34301 97682 91627 366627 -217650 16484 -539047 -83792 131463 -338563
18385b46228J01876n2699K8270B36h8357j35822D8796j5972a25287A7967K552
$$ -246228 -144352 -197051 -168781 236 -88357 -224179 48796 32824 -125287 17967 20519
18374B0519b01918B03751a48590d027o2670j58356A01606a73645B00324H4533
$$ 20519 -201918 203751 -148590 -4027 -66697 -225053 101606 -173645 200324 84533
18363a5334j48046P9252A209b40918f5837H8266D496O2472J40435f4888G5456
$$ -15334 -163380 -84128 1209 -240918 -65837 88266 4496 66968 207403 -64888 75456
18351D7009J5649b024m07039J46266B90173b1803j66922E7096a06533j34942R6079
$$ 47009 62658 -2024 -409063 -262797 290173 -21803 -188725 57096 -106533 -241475 -145396
18340a45396j30049d6507m4056r6781G6954b60068a14293n6401A98813R7693A06308
$$ -145396 -275445 -46507 -90563 -187344 76954 -260068 -114293 -170694 198813 296506 106308
18328A50925f3695r7487L7946B2886b3590A97176a5360j48665g5488B69276a09100
$$ 150925 -63695 -161182 -123236 22886 -23590 197176 -15360 -164025 -75488 269276 -109100
18316a19817j20256c9316C82193b19252m2811H5616A8492c2834k62342J06490
$$ -119817 -240073 -39316 382193 -219252 -262063 85616 18492 -32834 -295176 -188686
18306a88686L198O3844d5124j63713M7232A7602a46864A9761a82974P6613b2867
$$ -188686 -185488 -121644 -45124 -208837 -161605 17602 -146864 19761 -182974 -106361 -22867
18294b63585i664A29150a90878A48488i0865B35446D2485J70476I8930a01635
$$ -263585 -9664 129150 -190878 148488 -90865 235446 42485 212961 98930 -101635
18283E1378e1740A06424b43926A51010b21929B11816R5041b26543N6047B00442
$$ 51378 -51740 106424 -243926 151010 -221929 211816 306857 -226543 -170496 200442
18272a57915d9634j23439e1298q0033d2257j7000a8716j00659B27877a56628B47904
$$ -157915 -49634 -173073 -51298 -131331 -42257 -59257 -18716 -119375 227877 -156628 247904
18260c9173B03140a12960j28728G8377a25928L1412m8426j83445i1202C8365K13318
$$ -39173 203140 -112960 -241688 78377 -125928 -94516 -142942 -326387 -91202 38365 251683
18249B51683b22987Q4614F2813J0777a71583O7779c558B77488e8747A03885d1660
$$ 251683 -222987 -138373 62813 73590 -171583 -103804 -3558 277488 -58747 103885 -41660
18237d0697A06038L40357D6687K28672a80977A1075J99711H3611K6989l8246k752
$$ -40697 106038 446395 46687 275359 -180977 11075 210786 83611 110600 72354 69602
18226F9602a03474J9750o8997A73557a24819k06640j0058O8286P4608i1240c6270
$$ 69602 -103474 -83724 -152721 173557 -124819 -331459 -341517 -273231 -198623 -91240 -36270
18214b68562Q5033D8919d7160B03553E8749M2066a92178E4559a00913c2825j9578
$$ -268562 -183529 48919 -47160 203553 58749 100815 -192178 54559 -100913 -32825 -52403
18203e2403C00402j38133M9853F9417Q142A2169R8173b2013l11829A5002N7488
$$ -52403 300402 162269 212122 69417 77559 12169 110342 -22013 -333842 15002 72490
18192G2490a96642E6059a5941l64454J69226C3073f137k6683A48494R7720A13620
$$ 72490 -196642 56059 -15941 -380395 -211169 33073 -6137 -32820 148494 246214 113620
18180I006K21273b98392a03334n1370j10278B1126e8766I2833J58882H7361d4824
$$ 9006 230279 -298392 -103334 -154704 -264982 21126 -58766 92833 251715 87361 -44824
18168C64281A39956E2879P0690K7743h3563i100C27540a44176E7315b60717A12749
$$ 364281 139956 52879 123569 151312 -83563 -9100 327540 -144176 57315 -260717 112749
18156h5706H1063J95966F6720g3328q5294A03766b25361k36108A16670R0899E6609
$$ -85706 81063 277029 66720 -73328 -158622 103766 -225361 -461469 116670 207569 56609
18144i5890c4389j60361n9152B44825c22618D927N419a62622I4979a92218o4707
$$ -95890 -34389 -194750 -253902 244825 -322618 4927 10346 -162622 94979 -192218 -256925
18133b56925K1631g638j3757l04127B06809m9874a27569H6000O738b97793a33375
$$ -256925 -235294 -7638 -21395 -325522 206809 156935 -127569 86000 92738 -297793 -133375
18121b9453H9553r415c3512j33433A65882F1795f0229m8202o3579E2037b121j70676
$$ -29453 89553 80138 -33512 -166945 165882 61795 -60229 -108431 -172010 52037 -2121 -172797
18109a72797g1221m1728G8464K7694K79058b61740N0716A74339E5335d6439l22623
$$ -172797 -71221 -112949 78464 106158 385216 -261740 -211024 174339 55335 -46439 -369062
18098c69062O8118g6109a603C42473A01666B1264a29104D4872a6528F2087a26894
$$ -369062 -300944 -76109 -1603 342473 101666 21264 -129104 44872 -16528 62087 -126894
18086h2201j3584B5708a77735C61123A48127a76722D88387j03170c6071C887b00822
$$ -82201 -95785 25708 -177735 361123 148127 -176722 488387 385217 -36071 3887 -200822
18074a10381e790r2850J919A04373b47970m6102J35658a9634H7519A6688a8808
$$ -110381 -5790 -98640 -96721 104373 -247970 -294072 -158414 -19634 87519 16688 -18808
18062A5413b82152G6061b53821l4455A62040a51745B40465A06853a55112j32194
$$ 15413 -282152 76061 -253821 -288276 162040 -151745 240465 106853 -155112 -287306
18052b87306B65255b50926n225B42183c0224H09c59748a67412c6557j24769F6439
$$ -287306 265255 -250926 -256151 242183 -30224 809 -359748 -167412 -36557 -161326 66439
18040I0229J70818h1651r2806A1707d4089J9993c439j20229q9969Q0617c9103
$$ 90229 261047 -81651 -174457 11707 -44089 -24096 -3439 -123668 -213637 -133020 -39103
18028h0776C0286h7144E1961J41506c46977J68926k9857D4943K48177p8363n0457
$$ -80776 30286 -87144 51961 193467 -346977 -178051 -207908 44943 293120 214757 164300
18017A64300b5135C21975n7723c64840Q9291a12035A4996J22909C3759R5934c38819
$$ 164300 -25135 321975 264252 -364840 -275549 -112035 14996 137905 33759 129693 -338819
18005D85392a83916A33282J54064a18075B0116L210a11877o2220f7961C9120a00931
$$ 485392 -183916 133282 287346 -118075 20116 23326 -111877 -174097 -67961 39120 -100931
17993e064I7787K3312n982b6585r6213D3643a25854c508j79505C37058e7167H8685
$$ -5064 97787 121099 115117 -26585 -122798 43643 -125854 -3508 -183013 337058 -57167 88685
17980a70443F3417c62014J56536Q3394C6568b8104E2884Q5284C1306d17670a54297
$$ -170443 63417 -362014 -205478 -122084 36568 -28104 52884 138168 31306 -417670 -154297
17968A41103f0915m36358a10235o6863J4801g5053B41770O7411e8141j89775J04276
$$ 141103 -60915 -497273 -110235 -177098 -162297 -75053 241770 309181 -58141 -247916 -143640
17957a43640I7004i5227k01878a3476o0804B20416A08699i1552B3569b22331m1438
$$ -143640 97004 -95227 -297105 -13476 -74280 220416 108699 -91552 23569 -222331 -263769
17946b63769G7677j0706A5457O6814L2529d0718j52037c1369o0964c2012A70959
$$ -263769 77677 66971 15457 82271 114800 -40718 -192755 -31369 -92333 -32012 170959
17934A8570a8079B3431J84106I6529k4518A0599c13801C2919a26520C08118F3351
$$ 18570 -18079 23431 207537 96529 72011 10599 -313801 32919 -126520 308118 63351
17922e5319L685C8661A0817h2031B47936I5070b71975j44296b8885Q013A40275
$$ -55319 -51634 38661 10817 -82031 247936 95070 -271975 -416271 -28885 -20872 140275
17910b58924k32207a99496B11635a66254M2514G5540J24805b63050B2264b08086
$$ -258924 -491131 -199496 211635 -166254 -123740 75540 200345 -263050 22264 -208086
17899f7912A1119J7804i2687G3392l0594f9392C55526D4665d1649A12371K7436
$$ -67912 11119 28923 -92687 73392 42798 -69392 355526 44665 -41649 112371 139807
17888A39807c64A26679D2922a29959e0383j12646A4005f651k18865d6808G8364
$$ 139807 -364 126679 42922 -129959 -50383 -163029 14005 -6651 -225516 -46808 78364
17876c1906F1622c23191c2413H9673a0198A15074a81297B02152e69211b14084
$$ -31906 61622 -323191 -32413 89673 -10198 115074 -181297 202152 -569211 -214084
17865A41467a38871O6297b2994r2058A02446a54408j66926B39628a37655a3600
$$ 141467 -138871 -72574 -22994 -115052 102446 -154408 -321334 239628 -137655 -13600
17854c6187j6684g726j88445J0155P7039B71526O6768A31259b04622H4992F852
$$ -36187 -52871 -7726 -196171 -186016 -108977 271526 338294 131259 -204622 84992 6852
17842a46259o6170A24137K4843a10506B9810c7202l68861d0647l39282J70560
$$ -146259 -212429 124137 148980 -110506 29810 -37202 -406063 -40647 -379929 -209369
17832b09369O6153n961d6944k4127B07613p1482k6414O363N8200K80772E9554
$$ -209369 -143216 -149177 -46944 -71071 207613 136131 109717 116080 174280 455052 59554
17820A68998b33605B17783A3809a1997k6119g008o8975A59608o2866A7180c15639
$$ 168998 -233605 217783 13809 -11997 -38116 -7008 -75983 159608 96742 17180 -315639
17808a55858A01335l0813a02910j42884h126A06355l5762h2727A02483c02312
$$ -155858 101335 70522 -102910 -245794 -8126 106355 70593 -82727 102483 -302312
17797E78575e6015E9173J04065e1652A01870f0842B48379a49355B70639G0373
$$ 578575 -56015 59173 163238 -51652 101870 -60842 248379 -149355 270639 70373
17786G869d8473E7636M9316K1536J95664h0308A47866l5975i8006C65226F5820
$$ 7869 -48473 57636 106952 128488 324152 -80308 147866 111891 -98006 365226 65820
17774I1333J11899A8034K57078b05538h2996o2325M1900E9394b99100d9237A88581
$$ 91333 203232 18034 275112 -205538 -82996 -145321 -103421 59394 -299100 -49237 188581
17762f5790B78189d9090G004b83883H7551b4150l00330B74631a60027A65654b0416
$$ -65790 278189 -49090 7004 -283883 87551 -24150 -324480 274631 -160027 165654 -20416
17750a29337a4996l34561B4271J2005e013B50952a6435A7116a92549A71763B4607
$$ -129337 -14996 -349557 24271 36276 -5013 250952 -16435 17116 -192549 171763 24607
17738c2248j72079B49387g5269D5600b44572J02768E2538b4170o0873A36917R9267
$$ -32248 -204327 249387 -75269 45600 -244572 -141804 52538 -24170 -85043 136917 236184
17727B36184j00J68178j48844E0833O8864P9431e6197A07912J57776F1165c46904
$$ 236184 236084 404262 255418 50833 119697 199128 -56197 107912 265688 61165 -346904
17715E6587c81939c1917E5769J36905n4928a79176b5512C6051J45622c5987K499
$$ 56587 -381939 -31917 55769 192674 137746 -179176 -25512 36051 181673 -35987 -33488
17704c3488q9590c0149B22557h7153A51932b53972A23192L6942J48766N2279d03440
$$ -33488 -123078 -30149 222557 -87153 151932 -253972 123192 160134 308900 361179 -403440
17692A38521f2057K8615a2491j01474B53295b37462A79893c10790c5922g936o1208
$$ 138521 -62057 -33442 -12491 -113965 253295 -237462 179893 -310790 -35922 -7936 -69144
17681f9144B13911H0026R993d8965q2032B45410O2230B9121d0724k24883I9552
$$ -69144 213911 80026 90019 -48965 -130997 245410 307640 29121 -40724 -265607 99552
17669B78707I5279g385q1654A11243f46k09340M8815j44696A29692b75523D63860
$$ 278707 95279 -7385 -89039 111243 -646 -209986 -161171 -305867 129692 -275523 463860
17657A59365L4056i7327F523e1894B96624j42366a45649A15628g4776B2642J56021
$$ 159365 193421 -97327 6523 -51894 296624 154258 -145649 115628 -74776 22642 178663
17646A78663p9400e13455A92822i3817r1457f80l1000A34291a09663d18A09079
$$ 178663 99263 -513455 192822 -93817 -185274 -680 -31680 134291 -109663 -418 109079
17634i4325b0644c474j89619A68653b98310B8534e6784I4670a05624b2732r4562
$$ -94325 -20644 -3474 -193093 168653 -298310 28534 -56784 94670 -105624 -22732 -117294
17623a17294k96034e8562B00596a39231a7894I2092L11987a80126B29918D3416
$$ -117294 -413328 -58562 200596 -139231 -17894 92092 404079 -180126 229918 43416
17612B44159A08599b42145c5356C56802A12434a31272A07008C5982a22475B32521
$$ 244159 108599 -242145 -35356 356802 112434 -131272 107008 35982 -122475 232521
17601a8023k47686A73602K23750g5327l1517M6566B81516m6200K68496h1088E0546
$$ -18023 -265709 173602 397352 -75327 -106844 -60278 281516 235316 503812 -81088 50546
17589a71800H7907J25755I7985A7597c93653A52478F2399A962M09530d5089j7246
$$ -171800 87907 213662 97985 17597 -393653 152478 62399 1962 411492 -45089 -62335
17578f2335A7172J01197J53533a00668A05573J16533f99467c398A6019a21367
$$ -62335 17172 118369 271902 -100668 105573 222106 -699467 -3398 16019 -121367
17567e4782a7414j05969B67899H7386J15800f1729A11544C6329e6726E19279A2035
$$ -54782 -17414 -123383 267899 87386 203186 -61729 111544 36329 -56726 519279 12035
17555b69210C38050c5372C00027a93771A10211e3746B52884D3934N20261A00910
$$ -269210 338050 -35372 300027 -193771 110211 -53746 252884 43934 564195 100910
17544C35864m5318n8631d7439A9536J68676d7997C12154c19430C0240b6089B37842
$$ 335864 290546 231915 -47439 19536 188212 -47997 312154 -319430 30240 -26089 237842
17532G3460K1674d0438j32299B85081a54690E7243J04617J28375R1268D738a16552
$$ 73460 95134 -40438 -172737 285081 -154690 57243 161860 290235 381503 4738 -116552
17520B93433a13479F7253A95M1815a53421E4653K73057H3009l3389L66608j50922
$$ 293433 -113479 67253 195 42010 -153421 54653 327710 83009 49620 416228 265306
17509B65306l4239K33518a6184m3191H6404J54684g452A45330o1373o028k14r147
$$ 265306 231067 464585 -16184 -59375 86404 241088 -7452 145330 83957 77929 77715 68568
17497F8568A9566J35281D9425h6578I7687C3914l686J65280E173Q0706h384B13641
$$ 68568 19566 154847 49425 -86578 97687 33914 30228 195508 5173 85879 -8384 213641
17484E0245J25718J13354G603a61146L713f8188a6715A72835a04201j01343d9068
$$ 50245 175963 289317 7603 -161146 -157433 -68188 -16715 172835 -104201 -205544 -49068
17472C31572j44754a63499B63036J8399D2920P4107m4131Q5737b16714f3706A37426
$$ 331572 186818 -163499 263036 281435 42920 117027 72896 158633 -216714 -63706 137426
17460a86456C9062L6390l6284c5981I9706Q7482J25127R2455n3137m8481j19271
$$ -186456 39062 75452 39168 -35981 99706 187188 312315 404770 351633 303152 183881
17449A83881L64117k15964J39447B21434K30162A59290P2995d6472a7189E1377
$$ 183881 547998 332034 471481 221434 451596 159290 232285 -46472 -17189 51377
17438A80563H7886L89576A64758K42086A76760R1806i7372C84299A2932J85577
$$ 180563 87886 477462 164758 406844 176760 268566 -97372 384299 12932 198509
17428A98509g3292B42868A4663L92987M6197A91459o5242j3167K21339j24711
$$ 198509 -73292 242868 14663 407650 453847 191459 126217 113050 334389 209678
17418B09678j6535O2471G0840L91503B16251K28767D3491K20288L00997A88776
$$ 209678 193143 255614 70840 462343 216251 445018 43491 263779 564776 188776
17407b7958B11732O9922d0052A72190J39508J0659A112d1162H9707J86579f4291
$$ -27958 211732 281654 -40052 172190 311698 322357 1112 -41162 89707 276286 -64291
17395C23556B7814L15004a3392A3062M26506B10928J25237A11828M229J74421
$$ 323556 27814 342818 -13392 13062 439568 210928 336165 111828 116057 290478
17385B90478m5103n9535p8704J47003p0788J26780e7751E04962H2792g0568L4194
$$ 290478 245375 185840 107136 254139 183351 310131 -57751 504962 82792 -70568 -36374
17374c6374A75704m994E844f9778C62574A27324O0072E2972K46751A03227c8469
$$ -36374 175704 170710 5844 -69778 362574 127324 187396 52972 299723 103227 -38469
17362C34619A05851K95927j90541d1854D6753K73775A16365D3492J01500K5236
$$ 334619 105851 401778 211237 -41854 46753 320528 116365 43492 144992 170228
17352A70228E1303K4015e860B32509J53348H6865K495J41231J57141o7372E6364
$$ 170228 51303 75318 -5860 232509 385857 86865 89360 230591 387732 320360 56364
17340A94862J35775r9989B6516J2482a40817H4744k4210L78519j89663O5038k5827
$$ 194862 330637 230648 26516 38998 -140817 84744 60534 439053 249390 314428 288601
17329B88601A26256k6196N24418a13238A15910K46728G2337L86530B10912J145
$$ 288601 126256 100060 624478 -113238 115910 362638 72337 458867 210912 212057
17319B12057a36593B23109J01325o6679O9753B8901P4410K70529A17912J95628
$$ 212057 -136593 223109 324434 257755 327508 28901 103311 373840 117912 313540
17309C13540M5549I2615N5258d1226H041O0704f5082D08415C5914J74095K00419
$$ 313540 359089 92615 147873 -41226 8041 68745 -65082 408415 35914 210009 410428
17298D10428j98640C9265J91324J85012A13381J63911J87431A81678a9344A76593
$$ 410428 211788 39265 230589 415601 113381 277292 464723 181678 -19344 176593
17287D32103B03560K45777c148D12150A8136f4473B63857F5283a82848f6619B75059
$$ 432103 203560 449337 -3148 412150 18136 -64473 263857 65283 -182848 -66619 275059
17275a33641e2499j4421A30479K4683K21859C0022K90977j13882n9893D762J08492
$$ -133641 -52499 -66920 130479 155162 377021 30022 320999 207117 147224 4762 113254
17264A13254J32723M0381A8143K82887J5614k3956j37533K78058j36462j1313
$$ 113254 245977 286358 18143 301030 316644 292688 155155 433213 296751 285438
17254B85438J4257H713K44834J31495C1884M01735Q627B05405c9074E7780K81261
$$ 285438 299695 8713 253547 385042 31884 433619 442246 205405 -39074 57780 339041
17243C39041L9603b24399C17705N3990j53569G3536J16428F1127i17A97733h3802
$$ 339041 378644 -224399 317705 371695 218126 73536 189964 61127 -917 197733 -83802
17231A24456b30198B88496j07264K47028E9420M0585J32779a6880C44546A69747
$$ 124456 -230198 288496 181232 428260 59420 100005 232784 -16880 344546 169747
17220A1343a2576D24245H6031K14010n8278F4130J80643a88128D79184A09049
$$ 11343 -12576 424245 86031 300041 241763 64130 244773 -188128 479184 109049
17209g2884A75474J43958j55133b35984A98205J9783P7173J4059j05375J40421
$$ -72884 175474 319432 164299 -235984 198205 217988 295161 309220 203845 344266
17199C44266A27074N7305a43611A45431J83954H1607J29069K4698J7655k946P0681
$$ 344266 127074 184379 -143611 145431 329385 81607 210676 235374 253029 250083 320764
17188C20764p9244J75600f8873C38568A30381R8262K3991J54853C6106L40202
$$ 320764 241520 417120 -68873 338568 130381 228643 252634 407487 36106 376308
17178C76308K1009q7368L9409K76581C7599J14155P0314K5849K52454E9434K72316
$$ 376308 397317 309949 349358 625939 37599 151754 222068 247917 500371 59434 331750
17167C31750A40609a32557A43629J46551J88923N6134B41504A05395L02405j15221
$$ 331750 140609 -132557 143629 290180 479103 535237 241504 105395 407800 292579
17157B92579p5176N8045b5473E19766n2489J27227k12225m3242F9637K05614A20831
$$ 292579 217403 275448 -25473 519766 467277 594504 382279 339037 69637 275251 120831
17145B62123l0807H6751N32637k34730A73522P6891K7288M1812P3209K96871B76528
$$ 262123 231316 86751 619388 384658 173522 250413 277701 319513 392722 689593 276528
17133A95077J90753q8523J48207A6647L63330A83687J51177k3136A27011Q9073
$$ 195077 385830 297307 445514 16647 379977 183687 334864 311728 127011 216084
17123B16084M60688k97337R8261Q9010j8607j99009K57568K02126B74143N3130
$$ 216084 676772 379435 477696 566706 548099 349090 606658 808784 274143 327273
17113C27273J13353q9940Q6245k15143K7582q0252N68212l09700L50002B47151
$$ 327273 440626 350686 436931 221788 249370 169118 737330 427630 777632 247151
17102D60568O2316I3818L84421J09002B33353K46481j20813J24836k23007K7885
$$ 460568 522884 93818 478239 587241 233353 479834 359021 483857 260850 288735
17092B88735R8440M9047j71875K27742p7923j01471J71674j47782K92283J25976
$$ 288735 387175 436222 264347 492089 414166 312695 484369 336587 628870 754846
17082G54846l38600N4129R7137m4657K78407C13680N3843K87118n6237I9048M56680
$$ 754846 416246 470375 567512 522855 801262 313680 367523 654641 598404 99048 555728
17071E55728k11332J62377J67117A78545K71698M4915l6865k3432q8801M53180
$$ 555728 344396 506773 673890 178545 450243 495158 458293 434861 346060 799240
17061G99240C83969J99800M6554o1414j06663j13705N38818l36698j49070M88257
$$ 799240 383969 583769 630323 568909 462246 348541 887359 550661 401591 889848
17051H89848j88034m2425P0419k98350M53107l98194k35930K60617j57722J87377
$$ 889848 701814 659389 729808 431458 884565 486371 250441 511058 353336 540713
17041E40713B62607J54295K73186B40887N64238P2389k92493K47153m8246k45576
$$ 540713 262607 416902 690088 240887 805125 877514 585021 832174 783928 538352
17031E38352K10401k70017K66439K37758k75109K76241k00323r3508M6261p5998
$$ 538352 748753 478736 745175 982933 707824 984065 783742 690234 736495 660497
17021F60497N7250C09532O26217o0194o7987j15286Q0644R2764j29353K00509
$$ 660497 717747 309532 935749 875555 807568 692282 772926 865690 736337 936846
17011I36846J1924j72767J11358j29336K4214k54051L03700k23308L37987k40900
$$ 936846 948770 776003 887361 758025 782239 528188 831888 608580 946567 705667
17001G05667M03574l1573j90064C70585N21289l12040K57036k0797m0104j37806
$$ 705667 1109241 1077668 887604 370585 891874 579834 836870 816073 775969 638163
16991F38163K23902J20872r5616j00644L29228L4883L2684E17215K38360R3018
$$ 638163 862065 982937 887321 786677 1115905 1150788 1183472 517215 755575 848593
16981H48593k17529K32199K11473j35398k521o4283j45589K74222K0678j16351
$$ 848593 631064 863263 1074736 939338 936817 872534 726945 1001167 1021845 905494
16971I05494J70807j01265Q3992k74176L80011j27523j00636K1499j00046j3618
$$ 905494 1076301 975036 1059028 784852 1164863 1037340 936704 958203 858157 844539
16961H44539K62574j6204O938j60026L51470m38765J8657L65484j64670k97277
$$ 844539 1107113 1090909 1097847 937821 1289291 850526 869183 1234667 1069997 772720
16951G72720j26621N30569j21804j80336M06769p6675j45407l07426L08020K41673
$$ 772720 646099 1176668 1054864 874528 1281297 1204622 1059215 751789 1059809 1301482
16941A301482k16168p4894L24948m4608L9447L52942m04373j24010L58280n8697
$$ 1301482 1085314 1010420 1335368 1290760 1330207 1683149 1278776 1154766 1513046 1454349
16931A454349j07883J06912K11422k70938O8381m18672K31435J13282K88901r7518
$$ 1454349 1346466 1453378 1664800 1393862 1462243 1043571 1275006 1388288 1677189 1579671
16921A579671Q1921o74896L92068P1237L47520k09254K55045R9132l97389j62803
$$ 1579671 1661592 986696 1378764 1450001 1797521 1588267 1843312 1942444 1545055 1382252
16911A382252L26655k33907K80257q5611M6358j3120M4101J03387O0994q7068
$$ 1382252 1708907 1475000 1755257 1669646 1716004 1702884 1746985 1850372 1911366 1824298
16901A824298O5489k72367J23550K72523o4182R3570k53770M65280n73330R01848
$$ 1824298 1889787 1617420 1740970 2013493 1949311 2042881 1789111 2254391 1681061 2582909
16891B582909n90160K17921O3707l60606L32654Q6022m28466L94054k0789k94093
$$ 2582909 1992749 2210670 2274377 1913771 2246425 2332447 1903981 2298035 2277246 1983153
16881A983153L45328J04745J31129k5808Q8907r6555o8996N9132K44772j17680
$$ 1983153 2328481 2433226 2564355 2538547 2627454 2530899 2461903 2521035 2765807 2648127
16871B648127J64455j60568J18908K14086o2931O4958J963k42936J21163L16739
$$ 2648127 2812582 2652014 2770922 2985008 2922077 2987035 2988998 2746062 2867225 3183964
16861C183964k88269R8716J9892J59948N4333P3571J12649m9308J9680K54582
$$ 3183964 2895695 2994411 3014303 3174251 3228584 3302155 3414804 3365496 3385176 3639758
16851C639758j99136k05784L27043J74399j27249M6241J00166j90198M01531j82929
$$ 3639758 3440622 3234838 3561881 3736280 3609031 3655272 3755438 3565240 3966771 3783842
16841C783842L26625L1176N5325o0619J20382J00347J48842l39730M32253M56701
$$ 3783842 4110467 4141643 4196968 4136349 4256731 4357078 4505920 4166190 4598443 5055144
16831E055144l25170K25347j49376j75827O10689q604K62035j93110J83395j46944
$$ 5055144 4729974 4955321 4805945 4630118 5240807 5232203 5494238 5301128 5484523 5337579
16821E337579K86932r6172J30829L26871R0319K25380Q7242M31188j38556J78694
$$ 5337579 5624511 5528339 5659168 5986039 6076358 6301738 6388980 6820168 6681612 6860306
16811F860306J38375O5167J11670J37437N3825j26806K56824Q19058P44j02208
$$ 6860306 6998681 7063848 7175518 7312955 7366780 7239974 7496798 8315856 8316600 8214392
16801H214392L76439k36600N26709K91413L41859L56306K84808O0539O21601j80475
$$ 8214392 8590831 8354231 8880940 9172353 9514212 9870518 10155326 10215865 10837466 10656991
16791A0656991K56671K67409N93308n1289K68152J39462R25392K37624L78786
$$ 10656991 10913662 11181071 11774379 11723090 11991242 12130704 13056096 13293720 13672506
16782A3672506K27298O59335Q9736N65806J58755R27986L99242P28346N99335
$$ 13672506 13899804 14559139 14648875 15214681 15373436 16301422 16700664 17429010 18028345
16773A8028345J53597J095753N92992K76575P62015Q82605Q05496J105682Q99771
$$ 18028345 18181942 19277695 19870687 20147262 20909277 21791882 22597378 23703060 24602831
16764B4602831J066552O28670J055433J551369Q96877J415247P99424J793024
$$ 24602831 25669383 26298053 27353486 28904855 29801732 31216979 32016403 33809427
16756C3809427J279315J515990J917229J705711J776079K224089K161877K581176
$$ 33809427 35088742 36604732 38521961 40227672 42003751 44227840 46389717 48970893
16748D8970893K096412K905453K860841K956821L035529L659879L790230M058648
$$ 48970893 51067305 53972758 56833599 59790420 62825949 66485828 70276058 74334706
16740G4334706M206334M740216M267702N556551N377469N783590O193203O638962
$$ 74334706 78541040 83281256 87548958 93105509 98482978 104266568 110459771 117098733
16732A17098733O878152O799337P558095P476923P642619P463579P458569O966819
$$ 117098733 123976885 130776222 138334317 145811240 153453859 160917438 168376007 175342826
16724A75342826O703376O029675N275396L639571L508779J231336M77687r25341
$$ 175342826 182046202 188075877 193351273 196990844 200499623 201730959 202208646 201283305
16716B01283305k286929l397439m670731n861177o358650p435334p206600q012660
$$ 201283305 198996376 195598937 190928206 185067029 178708379 171273045 164066445 156053785
16708A56053785q019007p795103p762465p721324p089600p071129o653652o133180
$$ 156053785 148034778 140239675 132477210 124755886 117666286 110595157 103941505 97808325
16700I7808325n592209n487014m999387m907986m505135m155895l721390l302990
$$ 97808325 92216116 86729102 81729715 76821729 72316594 68160699 64439309 61136319
16692F1136319l699298k720625l244518k603416k579590k166528j720112k407062
$$ 61136319 57437021 54716396 51471878 48868462 46288872 44122344 42402232 39995170
16684C9995170j887303j854060j614668j538313j158005j643837j549917r99663
$$ 39995170 38107867 36253807 34639139 33100826 31942821 30298984 28749067 27749404
16676B7749404j251355j207104o12386j234199r52309k97748j641763m93291n48357
$$ 27749404 26498049 25290945 24678559 23444360 22492051 22194303 20552540 20059249 19510892
16667A9510892q02794n70724p01642p13497l92828p20604l85075p66940l67195
$$ 19510892 18708098 18137374 17435732 16722235 16329407 15608803 15223728 14456788 14089593
16658A4089593l90321o49815l41886j39466m51095m87157m57069k06874k84444
$$ 14089593 13699272 13049457 12707571 12568105 12117010 11629853 11172784 10965910 10681466
16649A0681466n7231l84032k75181l92284o4320l48125m36646j71959j58102k95757
$$ 10681466 10624235 10240203 9965022 9572738 9508418 9160293 8723647 8551688 8393586 8097829
16639H097829L44374n17259m81822m2923K35886n89130l64463j37574J5749j76583
$$ 8097829 8442203 7924944 7443122 7400199 7636085 7046955 6682492 6544918 6560667 6384084
16629F384084l20160J78619j32340l38220p5116p8822k81801J37443k75344J63045
$$ 6384084 6063924 6242543 6110203 5771983 5696867 5618045 5336244 5473687 5198343 5361388
16619E361388l13111j95003L20053o60554J45435j36736m57248M63583l40820
$$ 5361388 5048277 4853274 5173327 4512773 4658208 4521472 4064224 4527807 4186987
16610D186987P9394l3645m6870K232j64035n36664J69521q1579K40655l13900
$$ 4186987 4266381 4232736 4185866 4188098 4024063 3487399 3656920 3575341 3815996 3502096
16600C502096M50979l94349j82716l02971M9213J422k04139n3447j10890N02353
$$ 3502096 3953075 3558726 3376010 3073039 3122252 3123674 2919535 2866088 2755198 3257551
16590C257551m34652M759N5089L0287P531p8j32822l42375Q7245n9475k44977
$$ 3257551 2822899 2827658 2882747 2913034 2920565 2920487 2787665 2445290 2532535 2473060 2228083
16579B228083P1656J68334j35451K16566l90766J79615j75267j43064j36148J50801
$$ 2228083 2299739 2468073 2332622 2549188 2158422 2338037 2162770 2019706 1883558 2034359
16569B034359K24295k89636L4649N9205J26385l12133k80588L20981q0393j49091
$$ 2034359 2258654 1969018 2003667 2062872 2189257 1877124 1596536 1917517 1837124 1688033
16559A688033p3298j02108K64525k00699L74860m17231K7407j78505K37725r1404
$$ 1688033 1614735 1512627 1777152 1576453 1951313 1534082 1561489 1382984 1620709 1529305
16549A529305j96055Q3252K33348K0033l1999q5433k1002k18706J24089o5744
$$ 1529305 1333250 1416502 1649850 1669883 1637884 1552451 1531449 1312743 1436832 1371088
16539A371088L380j07230p5090J45677k33760K04726k83612L47507j24236R6143
$$ 1371088 1374468 1267238 1192148 1337825 1104065 1308791 1025179 1372686 1248450 1344593
16529A344593J74363m57119J98057j63303J56068k65443K45292j4813P3696q2514
$$ 1344593 1518956 1061837 1259894 1096591 1252659 987216 1232508 1217695 1291391 1208877
16519A208877k78989J56402N1113k57081J46673J95036m2861j90318L04327j64493
$$ 1208877 929888 1086290 1137403 880322 1026995 1222031 1179170 988852 1293179 1128686
16509A128686o8603j78244N7372n3750N1156j90601K36718j88422j6845P7195
$$ 1128686 1060083 881839 939211 885461 936617 746016 982734 794312 777467 854662
16499H54662N0780l49724L62155q4319j0621J07070j24654j75474K43581N4228
$$ 854662 905442 555718 917873 833554 822933 930003 805349 629875 873456 927684
16489I27684m7478O4363j34462l74979M7382J51668K01988j05599O6254k42813
$$ 927684 880206 944569 810107 435128 482510 634178 836166 730567 796821 554008
16479E54008n4970L31K92593J28193C60918K24481Q3867B23924P09101p6724m11178
$$ 554008 499038 499369 791962 920155 360918 585399 669266 223924 933025 856301 445123
16468D45123M36193m10890K47022k85708K42208M059Q6130l0208m1247m9522R3237
$$ 445123 881316 470426 717448 431740 673948 678007 764137 733929 692682 643160 736397
16457G36397C62648L05369k11647n8530L04555C17355N40301B50724M80047m0681
$$ 736397 362648 668017 456370 397840 702395 317355 857656 250724 730771 690090
16447F90090k02226j5918M72753l50076n9177J26423K8651A82695O79085k67320
$$ 690090 487864 471946 944699 594623 535446 661869 690520 182695 861780 594460
16437E94460B83440J44354J60214k14841J24251q7966L7218J13278k122J88994
$$ 594460 283440 427794 588008 373167 497418 409452 446670 559948 557826 746820
16427G46820l52282K55408A6580M38383m1567o4273J9454M1968A16601n8194P0643
$$ 746820 394538 649946 16580 454963 413396 349123 368577 410545 116601 58407 129050
16416A29050a1189A70520K57994J6298L09993l19447n5074q3873K3728A58638
$$ 129050 -11189 170520 428514 444812 754805 435358 380284 296411 320139 158638
16405B20495C5858K85620L3222J54699k49018A12868E2813K07964B9791N40574
$$ 220495 35858 321478 354700 509399 260381 112868 52813 260777 29791 570365
16395E70365B17740A00704L35152A00757J94174m888q2796J01576J20480A68072
$$ 570365 217740 100704 435856 100757 294931 290043 207247 308823 429303 168072
16384c3053B03124J92934D9338J00990K46327J32329B18063k4644L18117B33363
$$ -33053 203124 396058 49338 150328 396655 528984 218063 193419 511536 233363
16373A62307A8175K45756F452R8943K88392J451j31571Q2857k8537J00630A73949
$$ 162307 18175 263931 6452 105395 393787 395238 263667 346524 317987 418617 173949
16361B85549J52657j63307r5011K65017l712A71420J09953B3764K52159L11342
$$ 285549 438206 274899 179888 444905 441193 171420 281373 23764 275923 587265
16351E87265j87177a7540C79833J30465j54137n0567G0942J45115L0821p9339
$$ 587265 400088 -17540 379833 510298 356161 305594 70942 216057 246878 167539
16341A67539J29904J54601l3447m5454P4466a135C28221q7193E0637K08699j1015
$$ 167539 297443 452044 418597 373143 447609 -1135 328221 241028 50637 259336 248321
16330B48321p1561O8633a21841A3720K8802K19338L1228K3889D2925R3562K91432
$$ 248321 176760 245393 -121841 13720 42522 261860 293088 316977 42925 136487 427919
16319D27919a34566A27501L10048E1873M24333j76852H4583J06617I1175J10847
$$ 427919 -134566 127501 437549 51873 476206 299354 84583 191200 91175 202022
16309B02022K73297c2690A55764J35121F3871P3405J08357j5165K69372A91798
$$ 202022 475319 -32690 155764 290885 63871 137276 245633 230468 499840 191798
16298h9007D30637p2615A72990H1128C4555J44685E6616M58729j25203h5780b9464
$$ -89007 430637 358022 172990 81128 34555 179240 56616 515345 390142 -85780 -29464
16286A72477p2745b79572E17300d7817c741B3153J465G833K3638J74234b49919
$$ 172477 99732 -279572 517300 -47817 -3741 23153 24618 7833 31471 205705 -249919
16274A94403j7631D4269K32186l9942a6296k43708A29114b225G7607k6608J23421
$$ 194403 176772 44269 276455 236513 -16296 -260004 129114 -2225 77607 50999 174420
16263A74420a23176C02638d702k3844A79646A2326a89916e3313J1976n7166A12372
$$ 174420 -123176 302638 -4702 -28546 179646 12326 -189916 -53313 -41337 -98503 112372
16251I5772a9317m9073A29501K21131b741l5386A99248b13501B95647a80330d791
$$ 95772 -19317 -68390 129501 350632 -2741 -38127 199248 -213501 295647 -180330 -4791
16239b0989j7519r4384p432A80441q0519a3907B22602m4338A9900L4064Q8963
$$ -20989 -38508 -132892 -140324 180441 99922 -13907 222602 178264 19900 53964 142927
16228A42927D6631J87545b684C97676a79017g3701C147a30716B5001J18437n6403
$$ 142927 46631 234176 -2684 397676 -179017 -73701 3147 -130716 25001 143438 87035
16217H7035f3436A80350a53818C02299j30222G4934l2097J03683D6554K52141
$$ 87035 -63436 180350 -153818 302299 172077 74934 42837 146520 46554 298695
16207B98695A0291J22423L6740R0015c5824A29512n1227P0403a66347b9617j95899
$$ 298695 10291 132714 169454 259469 -35824 129512 78285 148688 -166347 -29617 -225516
16196b25516O939D05176c60352B88003B1985b84402B07550J00358a5583B84959
$$ -225516 -218577 405176 -360352 288003 21985 -284402 207550 307908 -15583 284959
16185H6480a34394J4704A9988L46110f5276n5510H816K42966g7094B04854b63785
$$ 86480 -134394 -119690 19988 366098 -65276 -120786 8816 251782 -77094 204854 -263785
16173c3602j26792B06540a45864d057k60435B37010d7995m896n9169l28883D07886
$$ -33602 -160394 206540 -145864 -4057 -264492 237010 -47995 -52891 -112060 -440943 407886
16161a65903C30236D2657J7305J31504b65852J21036A85074a19876d1585C9585
$$ -165903 330236 42657 59962 191466 -265852 -144816 185074 -119876 -41585 39585
16150a8040k15852L5119G2826a47252H8667A9768a07085B45579r5220D4511c8962
$$ -18040 -233892 -198773 72826 -147252 88667 19768 -107085 245579 150359 44511 -38962
16138I352b0515q6941D2921g6110n8128a4719G9617J13879a03383P476k23197
$$ 9352 -20515 -107456 42921 -76110 -134238 -14719 79617 193496 -103383 -95907 -319104
16127c19104a01172B2418a10077B37136a05936B56387a64628A17855C9637K18919
$$ -319104 -101172 22418 -110077 237136 -105936 256387 -164628 117855 39637 258556
16117B58556E3413i1073C24846b00562C77892I505b09126B87333b97687I4514
$$ 258556 53413 -91073 324846 -200562 377892 9505 -209126 287333 -297687 94514
16106A97410F6932K15656J725n2900b49543B5027p719J04915J87262h3455B3741
$$ 197410 66932 282588 284313 231413 -249543 25027 17308 122223 309485 -83455 23741
16094h7366A27261l3186b8004k8449A12561D3723b19530B2663K67590g4371A98362
$$ -87366 127261 94075 -28004 -56453 112561 43723 -219530 22663 290253 -74371 198362
16082c8844A4049K90403A41429a47542f3533n3636D8411d52603D0193b39853A25923
$$ -38844 14049 304452 141429 -147542 -63533 -117169 48411 -452603 40193 -239853 125923
16070A56297B8334J51208L66537A03200J50255d64147g7462n9296B88403q8269
$$ 156297 28334 179542 546079 103200 253455 -464147 -77462 -136758 288403 200134
16060B00134H8120b54466A08219A0296a88335b2595G1708a35096B59068A15743
$$ 200134 88120 -254466 108219 10296 -188335 -22595 71708 -135096 259068 115743
16049b37517A00663b93460E7658c47197J11814a04513r0511h9176I628a32750
$$ -237517 100663 -293460 57658 -347197 -235383 -104513 -195024 -89176 9628 -132750
16038b15604o0459B28475a88075c1611B87851r6956a87612g4876A52224b893j41729
$$ -215604 -276063 228475 -188075 -31611 287851 190895 -187612 -74876 152224 -2893 -144622
16027a44622B01702P3806j05147a78121C72100b8707A00138a86224A6144M7979
$$ -144622 201702 275508 170361 -178121 372100 -28707 100138 -186224 16144 64123
16017F4123O8203B8424a0590j59425g1001n9061A3943b6897D3837A577Q925P6611
$$ 64123 132326 28424 -10590 -170015 -71001 -130062 13943 -26897 43837 1577 10502 87113
16005H7113a58068n393A05869a17319c8105B17895h0191C6426g9746e871B79803
$$ 87113 -158068 -163461 105869 -117319 -38105 217895 -80191 36426 -79746 -5871 279803
15993A6109K0832e3362B50696B5283J28736a74943h5482B43131H1737K07191e3968
$$ 16109 36941 -53362 250696 25283 154019 -174943 -85482 243131 81737 288928 -53968
15981H2436J5221L45107A80620C1983b17404A00779i352l14117a7588A40369a91861
$$ 82436 97657 442764 180620 31983 -217404 100779 -9352 -323469 -17588 140369 -191861
15969f7365a8203r8961K7628l7056C01605B9622c16710A32143c4976k1053n3851
$$ -67365 -18203 -117164 -89536 -126592 301605 29622 -316710 132143 -34976 -56029 -109880
15958a09880k03999C04415I127c35756c9377E6527b24202e9739k22411H376a97836
$$ -109880 -313879 304415 9127 -335756 -39377 56527 -224202 -59739 -282150 8376 -197836
15946b79224A36702d0104j0821A84578a58801A78826b46888I4399J424A1994K11114
$$ -279224 136702 -40104 -50925 184578 -158801 178826 -246888 94399 95823 11994 223108
15935B23108d2826A59593h0717j50109H0400j5007a46711l95046b54C42535a55035
$$ 223108 -42826 159593 -80717 -230826 80400 65393 -146711 -541757 -254 342535 -155035
15923d47866J93607A20550P5559C7615a25230b8388l16056C52189b41289B11658
$$ -447866 -254259 120550 196109 37615 -125230 -28388 -344444 352189 -241289 211658
15912i9891F3456a41175k55693a79710A68470n1287i1549B42281a15969K7365
$$ -99891 63456 -141175 -396868 -179710 168470 117183 -91549 242281 -115969 -88604
15902h8604B71035j25467b1873A67569J31986A951d969C19532A2755f907F7207
$$ -88604 271035 145568 -21873 167569 299555 1951 -4969 319532 12755 -6907 67207
15890a94829r5893b9575A45981d11871H9460K9697m5244J17052F6008K3469R1860
$$ -194829 -290722 -29575 145981 -411871 89460 119157 73913 190965 66008 89477 181337
15879A81337b30285A0341e1929r2117j97270J793e6845B66815c39327D966N0356
$$ 181337 -230285 10341 -51929 -144046 -341316 -339523 -56845 266815 -339327 4966 55322
15868E5322hF1520L1273D5313b61652B10534A0864a41584J9297A61923b11497
$$ 55322 -8 61520 92793 45313 -261652 210534 10864 -141584 -122287 161923 -211497
15856D6714a55278A66178e23154J58744C1530N2736K66429a20228O830G7626R5368
$$ 46714 -155278 166178 -523154 -364410 31530 84266 350695 -120228 -113398 77626 172994
15845A72994a64269A02697e2181B58531o6247D9801O0337C1593N1361J822e5005
$$ 172994 -164269 102697 -52181 258531 192284 49801 110138 31593 82954 84776 -55005
15833a56390d8067L864b0634j55547B3809g69D5470c48389D1670N8495a2965j64863
$$ -156390 -48067 -44203 -20634 -176181 23809 -769 45470 -348389 41670 100165 -12965 -177828
15821a77828Q0369A03858C3158A4367g5049j99383a18041J9287B00117q8413N4850
$$ -177828 -97459 103858 33158 14367 -75049 -274432 -118041 -98754 200117 111704 166554
15810A66554p7661a82055A70124c9698k40576d8756Q431F0416Q18f4879c221j39614
$$ 166554 88893 -182055 170124 -39698 -280274 -48756 -40325 60416 61234 -64879 -3221 -142835
15798a42835l36346a29889l28951J28800e2074n6197j44372B03775E6790b21032
$$ -142835 -479181 -129889 -458840 -330040 -52074 -108271 -252643 203775 56790 -221032
15787B28995F5745L6308b10064b9679B32972A7934i5193C1771a35554Q054K7258
$$ 228995 65745 102053 -210064 -29679 232972 17934 -95193 31771 -135554 -127500 -100242
15776a00242K6241H2468C1516a41584f760m8981J7630k36404J36923k28770a61753
$$ -100242 -74001 82468 31516 -141584 -6760 -55741 -38111 -274515 -137592 -366362 -161753
15764D9488g1520q896A19601i3845j58838A35343c66189H7889k6523e6854r0539
$$ 49488 -71520 -80416 119601 -93845 -252683 135343 -366189 87889 61366 -56854 -147393
15753a47393K2202H9499k7040a22802K4228c5335j6216k3766A91019p1693A9800
$$ -147393 -125191 89499 62459 -122802 -98574 -35335 -51551 -75317 191019 119326 19800
15741A95475J38610j65862J18218G8697a85046g8650A51090K8969b38639e2405
$$ 195475 334085 168223 286441 78697 -185046 -78650 151090 180059 -238639 -52405
15730i0750j68508B68553o1500I6410L7281m2843a58031o4620E8589a04135j79156
$$ -90750 -259258 268553 207053 96410 133691 90848 -158031 -222651 58589 -104135 -283291
15719b83291A39135C7275J05181a03252B16626F0120a22134A29584l1524a4806
$$ -283291 139135 37275 142456 -103252 216626 60120 -122134 129584 98060 -14806
15708A49460b41821f7359A03748l5994a96102Q0275J102H233c86925a07736B5547
$$ 149460 -241821 -67359 103748 67754 -196102 -115827 -114725 8233 -386925 -107736 25547
15696C9206a28206D1656K9432K39099C807e5640C077b0544j79995O6090a698k84631
$$ 39206 -128206 41656 71088 310187 3807 -55640 3077 -20544 -200539 -134449 -1698 -286329
15684b86329a37036C3482R7317d9612B49787C7980n628O7615c0727O796A76265
$$ -286329 -137036 33482 130799 -49612 249787 37980 32352 99967 -30727 -23931 176265
15672A86014a80976A40195l3218q396D4708M36685a7903E78b91924J4257A30372
$$ 186014 -180976 140195 106977 98581 44708 481393 -17903 578 -291924 -277667 130372
15660B08153i5698m50353K44399q7138a20892K8516K892j23424o2919i5534H791
$$ 208153 -95698 -546051 -301652 -388790 -120892 -92376 -89484 -212908 -275827 -95534 8791
15648D8008R9491B209N8238D076b37613B98217A3469f178m4970A37631J4606m7535
$$ 48008 147499 2209 60447 4076 -237613 298217 13469 -6178 -51148 137631 152237 104702
15636A04702d2987j6802k76107f0270k20876c0965k7311D2908J55184M860G442
$$ 104702 -42987 -59789 -335896 -60270 -281146 -30965 -58276 42908 198092 202952 7442
15624C9000Q6490d12973a38398B9956f3575J435A36962j7739a45627J4452K0215
$$ 39000 125490 -412973 -138398 29956 -63575 -62140 136962 119223 -145627 -131175 -110960
15613a10960A23602D8012a62840B08170a30944n0914b7521B8601c1891A27039
$$ -110960 123602 48012 -162840 208170 -130944 -181858 -27521 28601 -31891 127039
15602E086c23069B33753a01572m2988A60141D4303R0618Q8725A07380a62319b2561
$$ 5086 -323069 233753 -101572 -144560 160141 44303 134921 223646 107380 -162319 -22561
15590a54539E9102K18698d2959H5764K38592i7586I7929c666j27448C1217g1500
$$ -154539 59102 277800 -42959 85764 324356 -97586 97929 -3666 -131114 31217 -71500
15578a21896B16107H5372a890C4662L0006K0164a64000B69362r0534E0244a49488
$$ -121896 216107 85372 -1890 34662 64668 84832 -164000 269362 178828 50244 -149488
15566I6693J30210c270p1603c0190D04795o0544A2852L51581f6098M09l56047
$$ 96693 226903 -3270 -74873 -30190 404795 344251 12852 364433 -66098 -65689 -421736
15555d21736A64541g6399L4312C33874a02080F2171Q6786a41035N2690A09031
$$ -421736 164541 -76399 -42087 333874 -102080 62171 148957 -141035 -88345 109031
15544A51315g4136K6418H0369l7404J95323a90115B11161r6403D5453c21340J12976
$$ 151315 -74136 -47718 80369 42965 238288 -190115 211161 114758 45453 -321340 -208364
15533b08364n200E1317N754P6101E2762A0091b29402A30233K82080A49138g4225
$$ -208364 -213564 51317 57071 133172 52762 10091 -229402 130233 412313 149138 -74225
15521b84553J37320A23791i9171j48870d4117o7051a1042r726j3405A64701a84316
$$ -284553 -147233 123791 -99171 -248041 -44117 -111168 -11042 -20768 -34173 164701 -184316
15509a00118A42417k9077b96952E9224m683a92026F8186l302a44690B12035a8467
$$ -100118 142417 113340 -296952 59224 54541 -192026 68186 64884 -144690 212035 -18467
15497a01092B89027g6829H0199d2391G1499k3756A590i0009D2123a52879A29936
$$ -101092 289027 -76829 80199 -42391 71499 47743 1590 -90009 42123 -152879 129936
15485a9032B86521b50030A31293m5809a15002n5868B04159a20424k5378k52760
$$ -19032 286521 -250030 131293 85484 -115002 -170870 204159 -120424 -145802 -398562
15475c98562a39803L0464B61395e5248j97797C35112a96822h4071B71185f5425
$$ -398562 -139803 -109339 261395 -55248 -253045 335112 -196822 -84071 271185 -65425
15464A40144M1001A8858a4328p3668F2366J31822b885k13223I5847a58450B13530
$$ 140144 181145 18858 -14328 -87996 62366 194188 -2885 -216108 95847 -158450 213530
15452a2832B9862K0888L82531g4373B57049b02013C31821J86168i8217j00102
$$ -12832 29862 50750 433281 -74373 257049 -202013 331821 517989 -98217 -198319
15442a98319C8445A6134J1838J50022P0819D0918K11287a11923j33780H539e6900
$$ -198319 38445 16134 27972 177994 248813 40918 252205 -111923 -245703 8539 -56900
15430A43282a1985j90205C3203g7869j16693j48941r321B88053B0608K57371f926
$$ 143282 -11985 -202190 33203 -77869 -194562 -343503 -352824 288053 20608 277979 -6926
15418A7567a12712k4781C629K35273a47611F1042b83453F605J85154a24340A37185
$$ 17567 -112712 -137493 3629 238902 -147611 61042 -283453 6605 191759 -124340 137185
15406d391E0887l583O8992A9264a14103H6770p448a21542I7988b72473d9486B25987
$$ -4391 50887 47304 116296 19264 -114103 86770 79322 -121542 97988 -272473 -49486 225987
15393b779j3877o7090A32879e1875B10243a50094D8299d19423A90972m7607F4116
$$ -2779 -16656 -83746 132879 -51875 210243 -150094 48299 -419423 190972 143365 64116
15381b65752c9934m9652F7719i293r0983m9990a2868q6738A61907a8618I0209
$$ -265752 -39934 -89586 67719 -9293 -100276 -150266 -12868 -99606 161907 -18618 90209
15369A76509n3293C2035d2491B02840D1053d9889C4107b57746n8774G6482c37268
$$ 176509 123216 32035 -42491 202840 41053 -49889 34107 -257746 -316520 76482 -337268
15357b42094B22966f7165B8536O6399a09933l440d475B1199J23371K6759b28766
$$ -242094 222966 -67165 28536 94935 -109933 -113373 -4475 21199 144570 171329 -228766
15345F9734c10285A0979J70377L34705H7948c0474q3361A21783K25031G5133f4301
$$ 69734 -310285 10979 181356 516061 87948 -30474 -113835 121783 346814 75133 -64301
15333a08653o8036C7964K3273B5162M48462A11389m4034J16049d3921A45412m681
$$ -108653 -176689 37964 61237 25162 473624 111389 67355 183404 -43921 145412 140731
15322A40731F9009r233K99390b30741b8341C3127J5812a84476E9208J78818a47593
$$ 140731 69009 59776 359166 -230741 -28341 33127 48939 -184476 59208 238026 -147593
15310C0166K04106b04697D5286m70J1906L4456J4141r150B7603M4359J26523F4418
$$ 30166 234272 -204697 45286 44816 56722 91178 105319 96169 27603 71962 198485 64418
15297I3918b6222D6128b81741a1527j01412k28682C46745j36688m1687M5710E7966
$$ 93918 -26222 46128 -281741 -11527 -112939 -341621 346745 210057 168370 214080 57966
15285C16866a06873C06137A50436a09469c460l2887H5045b25062d4565D7799c60473
$$ 316866 -106873 306137 150436 -109469 -3460 -36347 85045 -225062 -44565 47799 -360473
15273A28825K3156b5277m6240k3692C76938G8182R1386g115l9862b091A39555
$$ 128825 151981 -25277 -71517 -95209 376938 78182 169568 -7115 -46977 -2091 139555
15261c07092B26884g7045D6678N3461J4591b30736A36402J23635b1922B55494
$$ -307092 226884 -77045 46678 100139 114730 -230736 136402 260037 -21922 255494
15250B58537P7932K65482P50580J46086l89657L05803m12517A92367R4004p0450
$$ 258537 336469 601951 1352531 1498617 1108960 1414763 1002246 192367 286371 215921
15240B15921L7049E5478J82823P0908h0997F8263L7189J26273n0226F6012J28837
$$ 215921 252970 55478 238301 309209 -80997 68263 105452 231725 181499 66012 194849
15229A94849M8649A10069e788D0578f8451J4664I8064f6508F1789J31079a57930
$$ 194849 243498 110069 -5788 40578 -68451 -53787 98064 -66508 61789 192868 -157930
15217b40261A2947J49800B47b11858E62305k44085a57879C22253J62083j06475
$$ -240261 12947 162747 247 -211858 562305 318220 -157879 322253 484336 377861
15207C77861p4807I8697b83717A5089e2083H6740c86641D2543h673A01244C486
$$ 377861 303054 98697 -283717 15089 -52083 86740 -386641 42543 -8673 101244 3486
15195I6652b19239C42603j39681e0477j07289B43396a85855H8271R9723L7947
$$ 96652 -219239 342603 202922 -50477 -157766 243396 -185855 88271 187994 225941
15185B25941j4925B9649J09852a53655F1025a90035o885B73992R6983I9461J21835
$$ 225941 211016 29649 139501 -153655 61025 -190035 -196920 273992 370975 99461 221296
15174B21296G9863a14613j27587k1271q274F576N5113K74490a52348A15960f3364
$$ 221296 79863 -114613 -242200 -263471 -271745 6576 61689 336179 -152348 115960 -63364
15162B00510f75C11326j09779f6143A33290d647A27215N1709J47094J49691D6218
$$ 200510 -675 311326 201547 -66143 133290 -4647 127215 178924 326018 475709 46218
15150C41323H1477n472C725O800a22859G5677O3073h5910I6277J4200d5793C50892
$$ 341323 81477 76005 3725 10525 -122859 75677 138750 -85910 96277 110477 -45793 350892
15137a0294A35543J47032a88129B01169J08294B64L83661j40817a52892c0052
$$ -10294 135543 282575 -188129 201169 309463 264 383925 243108 -152892 -30052
15126A08765O7773J39493a04869D94420A86477J66512q199K41840b00758d0961
$$ 108765 176538 316031 -104869 494420 186477 352989 344790 586630 -200758 -40961
15115G6739D432O9464L8517Q7968i2236j43669G4210c727j8255C75666j86506
$$ 76739 4432 73896 112413 200381 -92236 -235905 74210 -3727 -21982 375666 189160
15104A89160R8704M7635b0147B1305a82654B39456D10K91204L21859a90690C56341
$$ 189160 287864 335499 -20147 21305 -182654 239456 410 291614 613473 -190690 356341
15092e8480j09581H9183R1833b01555n8239C05300K7892L7852l9254B8749N6084
$$ -58480 -168061 89183 181016 -201555 -259794 305300 333192 371044 331790 28749 84833
15081H4833b49941B46113a25530A97712d1861B01691l9822j2036L3026b56747
$$ 84833 -249941 246113 -125530 197712 -41861 201691 161869 149833 182859 -256747
15070B44539L7736K2250Q2265q7980g8979D27531A44858a18640A22944R3216m5357
$$ 244539 282275 304525 386790 298810 -78979 427531 144858 -118640 122944 216160 170803
15059A70803p5495I890M24322l8941L20069B89960A35158D6906K7577J91537F3406
$$ 170803 95308 9890 434212 395271 715340 289960 135158 46906 74483 266020 63406
15047B23338g3483C60785n8588A13384J20840P4664J61296J807c3349C26191c6447
$$ 223338 -73483 360785 302197 113384 234224 308888 470184 471991 -33349 326191 -36447
15035C75736j35308M30271B68584G4459K48245m894j05823H8663M60438A41538
$$ 375736 240428 670699 268584 74459 322704 317810 211987 88663 549101 141538
15024a17550M5728C01758i1192A43664L2292K41780j26685M90191A44234J2971
$$ -117550 -71822 301758 -91192 143664 175956 417736 291051 781242 144234 157205
15014A57205J62177a13139B07933K2911A5797J18992K76455l8141J38341B23676
$$ 157205 319382 -113139 207933 230844 15797 134789 411244 373103 511444 223676
15003B60094p7193E1977J80298J3557J14538C9012J78904J83649a02001I5533
$$ 260094 182901 51977 232275 245832 360370 39012 217916 401565 -102001 95533
14992B14646J62519j09829F4219K43746C5976L58218K8657A38386N1537a67060
$$ 214646 377165 267336 64219 307965 35976 394194 422851 138386 189923 -167060
14981A34738J04845K61222j85126j24736Q1930A24127J67108P0222f8608B78004
$$ 134738 239583 500805 315679 190943 272873 124127 291235 361457 -68608 278004
14970A07773L49085j5515D9995K03928O1539C8275J04270K58435h4423H4567K31645
$$ 107773 456858 441343 49995 253923 315462 38275 142545 400980 -84423 84567 316212
14959C16212J1654f8477B97039J12736I0327J17605G1394N416P1617j3806J72387
$$ 316212 327866 -68477 297039 409775 90327 207932 71394 76810 148427 134621 307008
14948C07008j46765a20104C41900N9798M3745j99617J17120h784A02464K29851
$$ 307008 160243 -120104 341900 401698 445443 245826 362946 -8784 102464 332315
14938C32315I4676K28759J0701j38603c0641C85660P3632M2970j21430F1494L12020
$$ 332315 94676 323435 334136 195533 -30641 385660 459292 502262 380832 61494 373514
14927C73514k8575P7115k8200n6980J06817A21911n3537J30765K8970J52061j58193
$$ 373514 344939 422054 393854 336874 443691 121911 68374 199139 228109 380170 221977
14916B21977L29845H4892J16631k5626J29529n2806P6104J94582A80047J46971
$$ 221977 551822 84892 201523 175897 305426 252620 328724 523306 180047 327018
14906C27018L64774k87679j19907b1650C41520P485j67052J64330j26529a40078
$$ 327018 691792 404113 284206 -21650 341520 349005 181953 346283 219754 -140078
14895C74861A19490K71704q4312q7926h821D96653D6797K48972K12424A99264
$$ 374861 119490 391194 306882 218956 -8821 496653 46797 295769 508193 199264
14884D64609o2665P1964n1044K68346p4068F2188K69803J45238n9457r7035M8826
$$ 464609 401944 473908 422864 691210 617142 62188 331991 477229 417772 320737 369563
14873C69563L75181j66642q5805N183J9906K35214A41225K63846J14339j841J9073
$$ 369563 744744 578102 492297 497480 517386 752600 141225 405071 519410 517569 536642
14862E36642A45703J90049K92012k50417J28276P4258q1552L49802C93510J10350
$$ 536642 145703 335752 627764 377347 505623 579881 498329 848131 393510 503860
14852E03860l8775L6612n4701L3742c7471E87830j53427o26L68473q4919k21016
$$ 503860 465085 501697 446996 480738 -37471 587830 434403 433777 802250 717331 496315
14841D96315k09898K12204o5542J13646K33342k53349K75956k43757J36342j57149
$$ 496315 286417 498621 433079 546725 780067 526718 802674 558917 695259 538110
14831E38110q6709J17921P1391Q4763k34908Q0265A71969K46785N2285j77067
$$ 538110 451401 569322 640713 725476 490568 570833 171969 418754 471039 293972
14821B93972L72907C22030L1255M19062B63155J35378p8610K06347j61283K44496
$$ 293972 666879 322030 353285 772347 263155 398533 319923 526270 364987 609483
14811F09483K29533l23663J07308K8759K02606k52696N7403j11148k8822k3931
$$ 609483 839016 515353 622661 651420 854026 601330 658733 547585 518763 494832
14801D94832B10168O02123B24806L80664J67276k14352R2336p6653k0507K23190
$$ 494832 210168 812291 224806 605470 772746 558394 650730 574077 553570 776760
14791G76760l42917M50439k98495r9807j85152M04083j21783j05456J21056K13415
$$ 776760 433843 884282 585787 485980 300828 704911 583128 477672 598728 812143
14781H12143k7569j42801O3818o3339q6859j45813L96085j03758K64557j48471
$$ 812143 784574 641773 705591 642252 555393 409580 805665 701907 966464 817993
14771H17993k71125j35643p5412L15433j95895M2731K43384k93057J39925k85286
$$ 817993 546868 411225 335813 651246 455351 498082 741466 448409 588334 303048
14761C03048N12292m6355j0834l10334J65273M4940J91703C05148K74187K73001
$$ 303048 815340 768985 758151 447817 613090 658030 849733 305148 579335 852336
14751H52336R6334D65684J64912J27291L1666K8005O062j79457n7328L37473k64168
$$ 852336 948670 465684 630596 757887 789553 817558 823620 644163 586835 924308 660140
14740F60140j83630K23143J05454Q3589m07534J29367j5168M57532k59133j99929
$$ 660140 476510 699653 805107 888696 481162 610529 595361 1052893 793760 593831
14730E93831M8824p037K29087M6477Q484K04545m77977O3355M41443l15307j38187
$$ 593831 642655 635618 864705 911182 919666 1124211 646234 709589 1151032 835725 697538
14719F97538K37145r0455J15984P7366j67712o1778K47171J63998m16586O0678
$$ 697538 934683 844228 960212 1037578 869866 808088 1055259 1219257 802671 863349
14709H63349K2128M7199k10239J32845Q8741q6561j12568K01566j53662O4439
$$ 863349 885477 932676 722437 855282 944023 857462 744894 946460 792798 857237
14699H57237K3596J32880L9468k63189J45439K45620l69776J90429j65613L37850
$$ 857237 880833 1013713 1053181 789992 935431 1181051 811275 1001704 836091 1173941
14689A173941N418j66529r8551Q4861L3214j579K31115l12905j67748J62468K08727
$$ 1173941 1179359 1012830 914279 999140 1032354 1030775 1261890 948985 781237 943705 1152432
14678A152432n9298J93286N0113j97328l3899J75750k77323J94323J21198k18504
$$ 1152432 1093134 1286420 1336533 1139205 1105306 1281056 1003733 1198056 1319254 1100750
14668A100750O302K52816m8233k16574n19479K50311K60054K56384l98761L50734
$$ 1100750 1107052 1359868 1311635 1095061 575582 825893 1085947 1342331 943570 1294304
14658A294304n1646K31508j33077m6642R2071j35271R476M9171k34238J30872
$$ 1294304 1242658 1474166 1341089 1294447 1386518 1251247 1260723 1309894 1075656 1206528
14648A206528M57623j01884k74479k84016K00767L64180l20827K8156M8961K47842
$$ 1206528 1664151 1562267 1287788 1003772 1204539 1568719 1247892 1276048 1325009 1572851
14638A572851l98037L06536m25771J40715J94085L0417j81792J50967j58224L69123
$$ 1572851 1174814 1481350 1055579 1196294 1390379 1420796 1239004 1389971 1231747 1600870
14628A600870m1727k94427J06818m0982J10979j30084J64965J33917k06116J58730
$$ 1600870 1559143 1264716 1371534 1330552 1441531 1311447 1476412 1610329 1404213 1562943
14618A562943J70650j82521j3906j01080J8764r4607L19951j20641J28195J66710
$$ 1562943 1733593 1551072 1537166 1436086 1454850 1360243 1680194 1559553 1687748 1854458
14608A854458j64326l93079P29173L1468k60044r0926J93646N5198l9616k85216
$$ 1854458 1690132 1297053 2026226 2057694 1797650 1706724 1900370 1955568 1915952 1630736
14598A630736L06617q7191J78959k88628J74790j61921K29709k7693J19090K64723
$$ 1630736 1937353 1850162 2029121 1740493 1915283 1753362 1983071 1955378 2074468 2339191
14588B339191l45434l6889M8278Q8827K44089J03465l88387J89419m7000R1495
$$ 2339191 1993757 1956868 2005146 2093973 2338062 2441527 2053140 2242559 2195559 2287054
14578B287054j10299L5222J30417J71615l76510n4643L00751R9488j48817L1631
$$ 2287054 2176755 2211977 2342394 2514009 2137499 2082856 2383607 2483095 2334278 2365909
14568B365909K01120l43019P16020j73247j87748J52977k16136L45055J45087
$$ 2365909 2567029 2224010 2940030 2766783 2579035 2732012 2515876 2860931 3006018
14559C006018l8963J43564L07803l3940M80201K72467K3323M76501R14538J400715
$$ 3006018 2967055 3110619 3418422 3384482 3864683 4137150 4160473 4636974 5551512 6952227
14549F952227K527831M355244Q245906J6992599N856324k2290626A0592599D659213
$$ 6952227 9480058 13835302 22081208 39073807 44930131 22639505 10592599 4659213
14540C066816m90321k78136j93176J04029n15455K95588R6625K0579N8078r5273
$$ 3066816 2576495 2298359 2105183 2209212 1693757 1989345 2085970 2106549 2164627 2069354
14530B069354K62276K41778k28875L70995l18443L24190p8738L11641k38646J72770
$$ 2069354 2331630 2573408 2344533 2715528 2397085 2721275 2642537 2954178 2715532 2888302
14520B888302k16102l7425l32027K71251L80458M15674l96545J47430j82574J94949
$$ 2888302 2672200 2634775 2302748 2573999 2954457 3370131 2973586 3121016 2938442 3133391
14510C133391j78971J39459M263K1955l8284j8411K63965j32596O2171K04349
$$ 3133391 2954420 3093879 3098142 3120097 3081813 3063402 3327367 3194771 3256942 3461291
14500C461291k42073J15947l0793N03350k67420l0814L81521j99120K81544j11649
$$ 3461291 3219218 3335165 3304372 3807722 3540302 3509488 3891009 3691889 3973433 3861784
14490C861784p1439L62681l90514L18847p9818q9537K53977P3258j38607k34403
$$ 3861784 3790345 4153026 3762512 4081359 4001541 3912004 4165981 4239239 4100632 3866229
14480C866229M01365k30297M41599k02596K00344l1951J16004k2628o7533J49418
$$ 3866229 4267594 4037297 4478896 4276300 4476644 4444693 4560697 4538069 4470536 4619954
14470D619954M71000m63404M59872j82366l2043J36318j36005K41517k84790M65440
$$ 4619954 5090954 4627550 5087422 4905056 4873013 5009331 4873326 5114843 4830053 5295493
14460E295493m1664L29476j50542J24593Q8014J80956l68026M60755J75730M3487
$$ 5295493 5253829 5583305 5432763 5557356 5645370 5826326 5458300 5919055 6094785 6138272
14450F138272k21085J58163J79092P0274K230j0756L04184K39517m79483P8488
$$ 6138272 5917187 6075350 6254442 6324716 6326946 6316190 6620374 6859891 6380408 6458896
14440F458896J79624o7047L2274M62394J0270J01237L16847k59622K84205O6914
$$ 6458896 6638520 6571473 6603747 7066141 7076411 7177648 7494495 7234873 7519078 7585992
14430G585992n3617M83586k25826J36921K6695m5073M46917L94155m83873J6651
$$ 7585992 7532375 8015961 7790135 7927056 7953751 7908678 8355595 8749750 8265877 8282528
14420H282528L30925J91612R6059L01468J99798j89661J75145L35897J36260N8907
$$ 8282528 8613453 8805065 8901124 9202592 9402390 9212729 9387874 9723771 9860031 9918938
14410I918938k01918L72666p6290J87396M39753J25999K75640P9536K64810l81557
$$ 9918938 9717020 10089686 10013396 10200792 10640545 10766544 11042184 11121720 11386530 11004973
14400A1004973M74618K48356M53789J62894J39195K06997o9524K89163O5230P7152
$$ 11004973 11479591 11727947 12181736 12344630 12483825 12690822 12621298 12910461 12975691 13052843
14390A3052843M18438J75290P26861l90684O22047J05099L73421K59211J46077
$$ 13052843 13471281 13646571 14373432 13982748 14604795 14709894 15083315 15342526 15488603
14381A5488603q9828N00310K68414N40601M89912K20643K55792M96083K84656
$$ 15488603 15398775 15899085 16167499 16708100 17198012 17418655 17674447 18170530 18455186
14372A8455186L58061K29018L06269M61840L65598N87229L81275M63546N29650
$$ 18455186 18813247 19042265 19348534 19810374 20175972 20763201 21144476 21608022 22137672
14363B2137672L48972P36512M37198L49040M95114P19049K97517O43544O88116
$$ 22137672 22486644 23223156 23660354 24009394 24504508 25223557 25521074 26164618 26852734
14354B6852734P51420M67107O41171R34387M45594J132690O84083R00072N10957
$$ 26852734 27604154 28071261 28712432 29646819 30092413 31225103 31909186 32809258 33320215
14345C3320215J224551P41416Q26134R79334J017618J116983Q39868J163186J121520
$$ 33320215 34544766 35286182 36112316 37091650 38109268 39226251 40066119 41229305 42350825
14336D2350825J516840J123548J388477J192317J266678J768026J155507J856154
$$ 42350825 43867665 44991213 46379690 47572007 48838685 50606711 51762218 53618372
14328E3618372J935964J485891K426956J879665J881471J590584K828939K220311
$$ 53618372 55554336 57040227 59467183 61346848 63228319 64818903 67647842 69868153
14320F9868153K307420K634414L066917L010988K759164L209491L260718L561120
$$ 69868153 72175573 74809987 77876904 80887892 83647056 86856547 90117265 93678385
14312I3678385M014130L671938M394184L762459N132524N002568M876634N665610
$$ 93678385 97692515 101364453 105758637 109521096 114653620 119656188 124532822 130198432
14304A30198432N730565O396582O371509O870680O807419P786545Q135933Q593787
$$ 130198432 135928997 142325579 148697088 155567768 162375187 170161732 178297665 186891452
14296A86891452Q998680R554828R999643J0291083J0837291J1991943J2043764
$$ 186891452 195890132 205444960 215444603 225735686 236572977 248564920 260608684
14289B60608684J2620438J3149582J3419698J4449041J4231069J4795205J4672864
$$ 260608684 273229122 286378704 299798402 314247443 328478512 343273717 357946581
14282C57946581J4530085J4811947J4420023J4239201J2930230J2212641J0800171
$$ 357946581 372476666 387288613 401708636 415947837 428878067 441090708 451890879
14275D51890879Q561482M997300J877798J020884K56263N48147k03981l251724
$$ 451890879 460452361 465449661 467327459 468348343 468604606 469152753 468948772 465697048
14267D65697048m617806o779251j0390877j1952557j3833834j4195612j5541702
$$ 465697048 461079242 454299991 443909114 431956557 418122723 403927111 388385409
14260C88385409j5578389j5959906j5549549j5760777j5509109j4363385j3464452
$$ 388385409 372807020 356847114 341297565 325536788 310027679 295664294 282199842
14253B82199842j3829262j2920511j2305355j2128088j1234276j0724693j0218607
$$ 282199842 268370580 255450069 243144714 231016626 219782350 209057657 198839050
14246A98839050r415791q951051q092209p895051p759808p254442o978573n871408
$$ 198839050 189423259 180472208 172379999 164484948 156725140 149470698 142492125 136620717
14238A36620717n668065n450945n598747n360112m471101m416564m228339l595553
$$ 136620717 130952652 125501707 119902960 114542848 110071747 105655183 101426844 97831291
14230I7831291l697807l491700l777347l346329l004354k918641k825322k593936
$$ 97831291 94133484 90641784 86864437 83518108 80513754 77595113 74769791 72175855
14222G2175855k440656k494995j759773k589725j756804k219750k129530j739221
$$ 72175855 69735199 67240204 65480431 62890706 61133902 58914152 56784622 55045401
14214E5045401j351085j422322j628001j565789j772607j190907j164454j289948
$$ 55045401 53694316 52271994 50643993 49078204 47305597 46114690 44950236 43660288
14206D3660288j015476j482896r94281j157539j006768o72924j193378r59983
$$ 43660288 42644812 41161916 40167635 39010096 38003328 37330404 36137026 35177043
14198C5177043r24953p83530q96807p49508o78336p95183q48739q91798m54935
$$ 35177043 34252090 33468560 32571753 31822245 31143909 30348726 29499987 28608189 28153254
14189B8153254p68805n27511p34673k76283j078292l43586k31410o42485o41818
$$ 28153254 27384449 26856938 26122265 25845982 24767690 24424104 24192694 23550209 22908391
14180B2908391l53783p12224l0357r64867j55581l65256o48083j7391m7679p49795
$$ 22908391 22554608 21842384 21812027 20847160 20691579 20326323 19678240 19660849 19613170 18863375
14170A8863375m33983l39456n73188k85849K9021k25615m41930p00095K12784
$$ 18863375 18429392 18089936 17516748 17230899 17259920 17034305 16592375 15892280 16105064
14161A6105064n17436k97540j20095j48248n13879m27979K3213k62904k72124
$$ 16105064 15587628 15290088 15169993 15021745 14507866 14079887 14103100 13840196 13568072
14152A3568072J64826p57810q6865n04111M39784n50710J03044m13740p16791
$$ 13568072 13732898 12975088 12888223 12384112 12823896 12273186 12376230 11962490 11245699
14143A1245699L04543k59203j62909L67487q17994j6133k09244l7247j55587j61199
$$ 11245699 11550242 11291039 11128130 11495617 10677623 10661490 10452246 10414999 10259412 10098213
14133A0098213l43505R8375k95986K26076n19188O1074m26445J07264l88339J24300
$$ 10098213 9754708 9853083 9557097 9783173 9263985 9325059 8898614 9005878 8617539 8741839
14123H741839k07856K80341m96191k80229K71394J68606n65972l48615N6658q1502
$$ 8741839 8533983 8814324 8318133 8037904 8309298 8477904 7911932 7563317 7619975 7538473
14113G538473j26767J30372k63589k32285j31843r4889K08741j78800j4824k20341
$$ 7538473 7411706 7542078 7278489 7046204 6914361 6819472 7028213 6849413 6834589 6614248
14103F614248K6696q6051k9090K5062l02853m15898N41089k26025j41001l42280
$$ 6614248 6640944 6554893 6525803 6550865 6248012 5832114 6373203 6147178 6006177 5663897
14093E663897L84132k58970J77784k08517j48962l067j22041j65686R840K42797
$$ 5663897 6048029 5789059 5966843 5758326 5609364 5606297 5484256 5318570 5328410 5571207
14083E571207k01663l14334J63806M2112J68569j77804k69052l2630j31194q2542
$$ 5571207 5369544 5055210 5219016 5261128 5429697 5251893 4982841 4950211 4819017 4736475
14073D736475k59894N47319m68321L17766j46116j15151j13421j28389k03109
$$ 4736475 4476581 5023900 4555579 4873345 4727229 4612078 4498657 4370268 4167159
14064D167159M09143m35206O4792J06783o3878p633k86208L05152k31591j74221
$$ 4167159 4576302 4141096 4205888 4312671 4248793 4241160 3954952 4260104 4028513 3854292
14054C854292O4320n2291p942m3951m10071O07213l77075k74625M47083k40979
$$ 3854292 3918612 3866321 3858379 3814428 3404357 4011570 3634495 3359870 3806953 3565974
14044C565974l44398K64449K7419q9179k10629K27890j29886J51096q4093M1882
$$ 3565974 3221576 3486025 3513444 3424265 3213636 3441526 3311640 3462736 3378643 3420525
14034C420525K22966k05145M920K0123P0701l32676J62490k13458j70932J61847
$$ 3420525 3643491 3438346 3443266 3463389 3534090 3201414 3363904 3150446 2979514 3141361
14024C141361j41118J90140m65722J50512j86283j8164j91572L55767j48450m815
$$ 3141361 3000243 3190383 2724661 2875173 2688890 2670726 2479154 2834921 2686471 2681656
14014B681656r8628J98340o9548l1346n47496L87368M3847J54157m41908M49614
$$ 2681656 2583028 2781368 2711820 2680474 2132978 2520346 2564193 2718350 2276442 2726056
14004B726056l06628k09880j01109m5382J97202K5692N0354j1179l6928J64456
$$ 2726056 2419428 2209548 2108439 2063057 2260259 2285951 2336305 2325126 2288198 2452654
13994B452654M1999k4625K44322n9617O09946J998309K924379P073749J6780031
$$ 2452654 2494653 2470028 2714350 2654733 3264679 5262988 8187367 15261116 32041147
13985C2041147J3832455j8433618A3678175n594095k001507j177246p11532o69131
$$ 32041147 45873602 27439984 13678175 8084080 6082573 4905327 4193795 3524664
13977C524664j44309j39877j62414j48895K28940J6838n57288j56956L10318o52822
$$ 3524664 3380355 3240478 3078064 2929169 3158109 3174947 2617659 2460703 2771021 2118199
13967B118199K97627k6744j85310L83071j20141j2388k57685j58975J31832M19096
$$ 2118199 2415826 2389082 2203772 2586843 2466702 2454314 2196629 2037654 2169486 2588582
13957B588582o34079K16644j66421J47732n6156k29068M84558m04122L67343k57093
$$ 2588582 1954503 2171147 2004726 2152458 2096302 1867234 2351792 1947670 2315013 2057920
13947B057920k9958j89564L96738k42815k7866O4227R2478q8892j91041q2267
$$ 2057920 2027962 1838398 2235136 1992321 1964455 2028682 2121160 2032268 1841227 1758960
13937A758960j3484j65863J95688k3481O0487K4128k788J48372l6470j74598k38646
$$ 1758960 1745476 1579613 1775301 1751820 1812307 1836435 1833647 1982019 1945549 1770951 1532305
13926A532305J33986J22532K000j92439k14358L9375N8992M76571j15714J45015
$$ 1532305 1666291 1788823 1790823 1598384 1384026 1423401 1482393 1958964 1843250 1988265
13916A988265n27031J9268n9170k12053M04335q5552j5118J6902j33858K53898
$$ 1988265 1461234 1480502 1421332 1209279 1613614 1528062 1512944 1529846 1395988 1649886
13906A649886j38110m12893P82649o22263K33852j46459L50360m97263K62453
$$ 1649886 1511776 1098883 1881532 1259269 1493121 1346662 1697022 1199759 1462212
13897A462212l44902K25008K28727k09052J42765j25606j087m6652p8823J10973
$$ 1462212 1117310 1342318 1571045 1361993 1504758 1379152 1378065 1331413 1252590 1363563
13887A363563K6651J44075j58978J29266j04509m6899k10598K25312j25486K97654
$$ 1363563 1390214 1534289 1375311 1504577 1400068 1353169 1142571 1367883 1242397 1540051
13877A540051j48754J19403l39680O0960k11022J54772L8551K50323m77818N0008
$$ 1540051 1391297 1510700 1171020 1231980 1020958 1175730 1214281 1464604 986786 1036794
13867A036794J65723l75307K03351J87483k08539K45098j46360K08338j60076
$$ 1036794 1202517 827210 1030561 1218044 1009505 1254603 1108243 1316581 1156505
13858A156505K71746J1354n59554K10226p4382Q4973R2198P989j72450K59809
$$ 1156505 1428251 1439605 880051 1090277 1015895 1100868 1193066 1201055 1028605 1288414
13848A288414l17434J50710n16229N13170r5892k30868L05497L7753n1581j13514
$$ 1288414 970980 1121690 605461 1118631 1022739 791871 1097368 1135121 1083540 970026
13838I70026R2638k1636j27626J70235J01903J02862Q5816l22763j56469J15005
$$ 970026 1062664 1041028 913402 1083637 1185540 1288402 1374218 1051455 894986 1009991
13828A009991l42283M42372m9589k41633K30979P5183k27324K10177q8350E05821
$$ 1009991 667708 1110080 1060491 818858 1049837 1125020 897696 1107873 1019523 505821
13817A164567k96732J41166q7391J27804q2187k93516M94340n14684J44003M7027
$$ 1164567 867835 1009001 921610 1049414 967227 673711 1168051 653367 797370 844397
13807H44397O6399K78303j32432m29825J72585j2466J12190j56292K58676p1795
$$ 844397 910796 1189099 1056667 626842 799427 786961 899151 742859 1001535 929740
13797I29740j81839K21603l81542L36052K00667k67162K35300n5884j74493q4971
$$ 929740 747901 969504 587962 924014 1124681 857519 1092819 1036935 862442 777471
13787G77471J97715l34145K14354q6569k30725Q4177J66860l01807M47872k46278
$$ 777471 975186 641041 855395 768826 538101 622278 789138 487331 935203 688925
13777F88925k20594K85511K99894m45319j16997J23842p6002R0384K83907j64685
$$ 688925 468331 753842 1053736 608417 491420 615262 539260 629644 913551 748866
13767G48866j94651N5795M60539k78592j76133K90968l36836K38071l03443P2476
$$ 748866 554215 610010 1070549 791957 615824 906792 569956 808027 504584 577060
13757E77060B43410M90993K60290k67099k8752r0j32495O6327k82148L59470q7548
$$ 577060 243410 734403 994693 727594 698842 698752 566257 632584 350436 709906 622358
13746F22358N7296o9520p8629o4637K56108J06673j05381j2331k09156j08482
$$ 622358 679654 610134 531505 466868 722976 829649 724268 711937 502781 394299
13736C94299K33902Q6131M3984L30160D65217M66266k31237k96657L48497k18347
$$ 394299 628201 714332 758316 1088476 465217 931483 700246 403589 752086 533739
13726E33739j99097L81764k24151M47120C70594M01609C83736K68817k33938L2928
$$ 533739 334642 716406 492255 939375 370594 772203 383736 652553 418615 451543
13716D51543N1323O7721N4722N3008C19418M47895k68859A65577O74731k7697
$$ 451543 502866 570587 625309 678317 319418 767313 498454 165577 840308 812611
13706H12611l07963P7766J53482j92287j4154j96244M56313k45624K70622j75712
$$ 812611 504648 582414 735896 543609 529455 333211 789524 543900 814522 638810
13696F38810j37678K09607J15000m9837j15487M456j61509J48532l04013J75240
$$ 638810 501132 710739 825739 775902 660415 664871 503362 651894 347881 523121
13686E23121k5057A91811M94527Q4199C72966J69623k05784L06193A79360M50423
$$ 523121 498064 191811 686338 770537 372966 542589 336805 642998 179360 629783
13676F29783P736k24648j00348a55226E02317O6969J7645o4578N1697K20883l21717
$$ 629783 637519 412871 312523 -155226 502317 569286 586931 522353 574050 794933 473216
13665D73216p3145J15893j14053m7692K30987k14765L70750k44957L7282n309
$$ 473216 400071 515964 401911 354219 585206 370441 741191 496234 533516 528207
13655E28207k49135L83161l07024J25420K54695k68782J70688k27470K10648p9454
$$ 528207 279072 662233 355209 480629 735324 466542 637230 409760 620408 540954
13645E40954p2735j04638J19025j88906R0371K01041j04252j14430J499L39574
$$ 540954 468219 363581 482606 293700 384071 585112 480860 366430 367929 707503
13635G07503k39212N1068k12062K72023q7677o3401J48283N6018j78519R3692
$$ 707503 468291 519359 307297 579320 491643 428242 576525 632543 454024 547716
13625E47716N6652L3488j02134J83517C20465L42146A10878J86434A11006M90800
$$ 547716 604368 637856 535722 719239 320465 662611 110878 297312 111006 601806
13615F01806A45549J5380K80371j82275G4108M76474B74161j8711M81998K3382
$$ 601806 145549 160929 441300 259025 74108 550582 274161 255450 737448 760830
13605G60830A18203L63935A10308M03503n7060R760q3918K17250R9498B68078
$$ 760830 118203 482138 110308 513811 456751 466511 382593 599843 699341 268078
13594D58685O8976A47111M63023A97476M48896B35004D8516L82076q519F3582
$$ 458685 527661 147111 610134 197476 646372 235004 48516 430592 422073 63582
13583D92292k02363J02254A64661M62911k34907j69623R7951a9426B97071L9353
$$ 492292 289929 392183 164661 627572 392665 223042 320993 -19426 297071 336424
13573C36424q0651J23943K48188j90083j91449L9035K90475k19194j0050j72563
$$ 336424 255773 379716 627904 437821 246372 285407 575882 356688 346638 174075
13563A74075N007R2173K34918J1155A48192K25851K88582k18898J3864j04545
$$ 174075 179082 271255 506173 517328 148192 374043 662625 443727 457591 353046
13553C53046G0789J91776A19181L53984j22399k3278J12959j01302j23206C4250
$$ 353046 70789 262565 119181 473165 350766 327488 440447 339145 215939 34250
13542A19639l268m491R9583j7270L92598k26591A25172J06483n9931K65724a99083
$$ 119639 116371 111880 211463 194193 586791 360200 125172 231655 171724 437448 -199083
13530E40055j97469M9057j0740j87756i2101E81222p6199j68416L8558A39969
$$ 540055 342586 391643 380903 193147 -92101 581222 505023 336607 375165 139969
13519A65719F8218M03200A89979L48578F498J42418L80818l1617j23751j09603
$$ 165719 68218 471418 189979 538557 6498 148916 529734 498117 374366 264763
13509B64763J00070M86K1040k7776K00851j93457B427M33806k15979R6337J34539
$$ 264763 364833 365319 386359 358583 559434 365977 2427 436233 220254 316591 451130
13498D51130A50886J21191c2069A00605C8366N03505O1825k62982K7627J79377
$$ 451130 150886 272077 -32069 100605 38366 541871 603696 340714 368341 547718
13488E47718k61799j26368M711L14828j00625j32011J56917j34614Q075E1458
$$ 547718 285919 159551 164262 479090 378465 246454 403371 268757 276832 51458
13477a39438A73081j2261P2757G9426J05111J31782A35692J67804A08205K79048
$$ -139438 173081 160820 233577 79426 184537 316319 135692 303496 108205 387253
13467C87253j6401l4270d0715B2925J06819Q1936K16158a9684A90429K17538o4534
$$ 387253 370852 336582 -40715 22925 129744 211680 427838 -19684 190429 407967 343433
13456C43433j38880J90258d1867B14811a39511B35714A05201L45863k03492D8275
$$ 343433 204553 394811 -41867 214811 -139511 235714 105201 451064 247572 48275
13445G7525L84423A1150N42867j49170j07740r3699R4468K9731G750L06523A13591
$$ 77525 461948 11150 554017 404847 297107 203408 297876 327607 7750 314273 113591
13433B78984K26521e4695C82350d0646A48223K67957q4277j38360K57261A80956
$$ 278984 505505 -54695 382350 -40646 148223 416180 331903 193543 450804 180956
13422B40590M2917c6244C05827l2911K39672j69158F2088J3738J24803P9494j18869
$$ 240590 283507 -36244 305827 272916 512588 343430 62088 75826 200629 280123 161254
13411A61254J27125b388A33092J9066D4008J56882l8361J47081n2345K12768a38583
$$ 161254 288379 -2388 133092 152158 44008 200890 162529 309610 257265 470033 -138583
13399A80774J58465J10516d2654a8671C52879a72019C30030q6971K89029A44527
$$ 180774 339239 449755 -42654 -18671 352879 -172019 330030 243059 532088 144527
13388g8228H2097J57411M09778k8915a03619B07778A9607L16493j05735m858J30928
$$ -78228 82097 239508 649286 620371 -103619 207778 19607 336100 230365 225507 356435
13377C56435j19990a66563C28409j8885i3773B88078j31911O4394J53476j727
$$ 356435 236445 -166563 328409 309524 -93773 288078 156167 220561 374037 372310
13367C72310j50826m2350E0737L87754r0221P9006j07842K0101b0I9704a49757
$$ 372310 221484 179134 50737 438491 348270 427276 319434 339535 -20 99704 -149757
13355B54328J57773j52104e7777J916C33623h2890G7817l1500K47196J31620G0304
$$ 254328 412101 259997 -57777 -55861 333623 -82890 77817 46317 293513 425133 70304
13343D16280A82502J94406J45765B48433j8237j15021K8498J12802j4849K22956
$$ 416280 182502 376908 522673 248433 230196 115175 143673 256475 241626 464582
13333D64582l0710B04132l7114N457N9399e1171A82720m6601L784M975l1647h9749
$$ 464582 433872 204132 167018 172475 231874 -51171 182720 136119 139903 144878 113231 -89749
13320A44744a88712G8484b6788C74205B7058K26982j21394K11106J99476H3595
$$ 144744 -188712 78484 -26788 374205 27058 254040 132646 343752 543228 83595
13309a05802A72710l7441i6212D1365J2770d4629r9187A16966J5935b15180B31893
$$ -105802 172710 135269 -96212 41365 54135 -44629 -143816 116966 132901 -215180 231893
13297B37957l203k6051i5720B49984K24201H490c0977D95521A85819G7481K30281
$$ 237957 234754 208703 -95720 249984 474185 8490 -30977 495521 185819 77481 307762
13286C07762A43977L3594B4782a8537k319A97207J38518c13569G3481o724B6253
$$ 307762 143977 177571 24782 -18537 -20856 197207 335725 -313569 73481 66757 26253
13274A75003B405L91467A01661a75917B19664G9857K99867A65097m4484J09264
$$ 175003 2405 393872 101661 -175917 219664 79857 379724 165097 120613 229877
13264B29877E7792J11136c9581B9255k247J91468m9974J03820g6618E2698L84869
$$ 229877 57792 168928 -39581 29255 27008 218476 168502 272322 -76618 52698 437567
13253D37567A79433K03589j90410K83992A01748A9495a4915B55549i521A62906
$$ 437567 179433 383022 192612 476604 101748 19495 -14915 255549 -9521 162906
13242A85917M3969B3625K48614A33129M8908m9841c8254D53584a12894I640J65657
$$ 185917 229886 23625 272239 133129 182037 132196 -38254 453584 -112894 9640 175297
13231A75297P4085F6990J1660L18824r9290F2156i3269K5456C15852A32042b2756
$$ 175297 249382 66990 78650 397474 298184 62156 -93269 -67813 315852 132042 -22756
13219C40971I6914A2056a45598A36349B0743e4680A7254K2531J30386J9265N320
$$ 340971 96914 12056 -145598 136349 20743 -54680 17254 39785 170171 189436 194756
13208A94756o7114l9859J28682q2499K70260h5521C0324M8609J02376a32850A40262
$$ 194756 127642 87783 216465 133966 404226 -85521 30324 78933 181309 -132850 140262
13196g874A82011D0477M4491k6567m85J62464a010m4543l2250B50121g0616n7232
$$ -7874 182011 40477 84968 58401 57916 220380 -1010 -45553 -77803 250121 -70616 -127848
13184a27848H376a20570q7846h9923k14377A83095f4199l5228B0188c45014A47260
$$ -127848 8376 -120570 -208416 -89923 -304300 183095 -64199 -99427 20188 -345014 147260
13172a17081B45496n7107I0982J05005J39778A06955b1072M966e989q3909c3805
$$ -117081 245496 188389 90982 195987 335765 106955 -21072 -16106 -5989 -89898 -33805
13160D86590n6274b17249G6825a21867B39475g3597C93090B4713Q5848J2218J77002
$$ 486590 430316 -217249 76825 -121867 239475 -73597 393090 24713 110561 122779 299781
13149B99781I441J47391R8054c33837C36124m2965q8556q6816D4370j2371g0419
$$ 299781 9441 156832 254886 -333837 336124 293159 204603 117787 44370 31999 -70419
13137B38304b51837H4816d1287A61205a9877D81633a98076M2830I6990g0980A73329
$$ 238304 -251837 84816 -41287 161205 -19877 481633 -198076 -155246 96990 -70980 173329
13125a0221E39781c8767B50753a12092a3122C70824h6522C3440K6464A6164a7168
$$ -10221 539781 -38767 250753 -112092 -13122 370824 -86522 33440 59904 16164 -17168
13113c0405B94745a98264d091I0668J88502i3013A84340a41765A44524J16715
$$ -30405 294745 -198264 -4091 90668 279170 -93013 184340 -141765 144524 261239
13103B61239G3113C120J4614K84884B8970J12304J71164A21927J17863j6748e487
$$ 261239 73113 3120 17734 302618 28970 141274 312438 121927 239790 223042 -5487
13091B78159A28299K47172F2960C0491J53199G2700K09876A6229O9300K28830
$$ 278159 128299 375471 62960 30491 183690 72700 282576 16229 85529 314359
13081C14359E2314k202a8988C77211A36207Q4860A06897n2245J69278A3030a1461
$$ 314359 52314 50112 -18988 377211 136207 221067 106897 54652 223930 13030 -11461
13069G7073C4434R0757d5165q5769B7065a91784E64386a08000H6121h427E8707
$$ 77073 34434 125191 -45165 -130934 27065 -191784 564386 -108000 86121 -8427 58707
13057f3135J2736C2781g5626K3590k56923A75767J11171G3292Q4908a25326A57212
$$ -63135 -50399 32781 -75626 -52036 -308959 175767 286938 73292 158200 -125326 157212
13045C3708j3195O7435L15065J0882L4394l8532i5881B40176C0331b7445G4060
$$ 33708 20513 87948 403013 413895 448289 409757 -95881 240176 30331 -27445 74060
13033H1010A9386J43847a17140E2887L5090a58510B02930A9692a78801C10499
$$ 81010 19386 163233 -117140 52887 87977 -158510 202930 19692 -178801 310499
13022A33186A2826M912K51570j2657j4627a30300A38832C0817a44284A8245k995
$$ 133186 12826 17738 269308 256651 242024 -130300 138832 30817 -144284 18245 15250
13011A5250Q035K30235g882B23288M5057a59095A80742E5395b4218F3005J30080
$$ 15250 23285 253520 -7882 223288 268345 -159095 180742 55395 -24218 63005 193085
13000A93085h5416B12867L1879i8516m813H4369M1922j9773o255b93232D0496
$$ 193085 -85416 212867 244746 -98516 -103329 84369 126291 106518 100263 -293232 40496
12988a84805H9392a52136A91243a92469e2104C19098b77495a4505A82841J3821
$$ -184805 89392 -152136 191243 -192469 -52104 319098 -277495 -14505 182841 196662
12978A96662n5232N6843b98064B34355D3663a31527B05715b00340E3863J80270
$$ 196662 141430 198273 -298064 234355 43663 -131527 205715 -200340 53863 234133
12968B34133g2555E2495L09861A17857a78854C3854g2275h32C30345I6224c3598
$$ 234133 -72555 52495 362356 117857 -178854 33854 -72275 -832 330345 96224 -33598
12956D3822J43758L2532m2191B2717P2554b32315D2578J77996a20075d7946A83357
$$ 43822 187580 220112 177921 22717 95271 -232315 42578 220574 -120075 -47946 183357
12944C3540K3916c7599l5612C4807b18287A57284J5317d1948J8116k21201K3863
$$ 33540 57456 -37599 -73211 34807 -218287 157284 172601 -41948 -23832 -245033 -221170
12933b21170C45578b7986j06792c4325K308C62392j15349C876J53954g5707r6531
$$ -221170 345578 -27986 -134778 -34325 -32017 362392 247043 3876 157830 -75707 -172238
12922a72238j61067J40585g0177q0654j38614m6385I7399K1513K8739n0933J44586
$$ -172238 -333305 -192720 -70177 -150831 -289445 -335830 97399 118912 147651 96718 241304
12911B41304J50866b03780F4859d4383H7932J71674c60842C4841L75216H9564
$$ 241304 392170 -203780 64859 -44383 87932 259606 -360842 34841 410057 89564
12900a14267M0047D028O7423J07413P030a16864G5143L5611J27645A00784D3595
$$ -114267 -74220 4028 71451 178864 185894 -116864 75143 110754 238399 100784 43595
12888E57061j18107H3395M35839A74680P781b98715H1703J42741b665D3939J31970
$$ 557061 438954 83395 519234 174680 182461 -298715 81703 224444 -2665 43939 175909
12877A75909q0827O5442m9436J48160d98523C7024a52043B70999F6539l1574b55227
$$ 175909 95082 160524 111088 259248 -498523 37024 -152043 270999 66539 34965 -255227
12865C3524J46624b21291a04936j44259D57488c33476J53166D23811E1037n151
$$ 33524 180148 -221291 -104936 -249195 457488 -333476 -180310 423811 51037 45886
12855D5886K59162G0175L02554G2613a55177B56951m4643o5477m5450B9300e6502
$$ 45886 305048 70175 372729 72613 -155177 256951 212308 146831 101381 29300 -56502
12843A29851M15587B15768B4949J85103d7054B16655d90130C7380g8161A16802
$$ 129851 545438 215768 24949 210052 -47054 216655 -490130 37380 -78161 116802
12832A22089J7096l1863b48825c6980k45192C5559F424K11934A5435h8181k2430
$$ 122089 139185 107322 -248825 -36980 -282172 35559 6424 218358 15435 -88181 -110611
12821a10611K9535A02352e8170A7492R173m514j0092Q9167f2260r6853a1590k106
$$ -110611 -81076 102352 -58170 17492 26665 22151 12059 101226 -62260 -159113 -11590 -13696
12809a3696m7046l2362A33218B9266J18265R8523E8062a96640A07746J53697n0799
$$ -13696 -60742 -93104 133218 29266 147531 246054 58062 -196640 107746 261443 210644
12798B10644m5333K09010p0489A11717a40056A14947c015l1698F575J85004H0251
$$ 210644 165311 374321 303832 111717 -140056 114947 -3015 -34713 6575 191579 80251
12786G0054c82924a2942B85310G3024a64725A44140R0128d6395l43984I9223b3456
$$ 70054 -382924 -12942 285310 73024 -164725 144140 234268 -46395 -390379 99223 -23456
12774A35594c6032a0521j89182A84331a9023A62033E1659L0489J49214d1686D4321
$$ 135594 -36032 -10521 -199703 184331 -19023 162033 51659 82148 231362 -41686 44321
12762b4532I9889l056a08678A05320B1493L6737L9766b36507A8829a46555D8566
$$ -24532 99889 96833 -108678 105320 21493 58230 97996 -236507 18829 -146555 48566
12750b18765A89320a13140K9322j79376F3577d7151j06328I790L659P0493c4854
$$ -218765 189320 -113140 -83818 -263194 63577 -47151 -153479 9790 13449 83942 -34854
12738A68103G7442e2910n5347A72120H1500J84603J4880D549J57311m2500a83556
$$ 168103 77442 -52910 -108257 172120 81500 266103 280983 4549 161860 119360 -183556
12726a90960o5750a3600j02591B69682g7072H5013a23244B08683p7291J50677
$$ -190960 -256710 -13600 -116191 269682 -77072 85013 -123244 208683 131392 282069
12716B82069a7730k65344a1984H3477b2615a0754A73588P3804A13913Q9371K05120
$$ 282069 -17730 -283074 -11984 83477 -22615 -10754 173588 247392 113913 203284 408404
12705D08404j83826N47P199C2090K02704M3735C0579i899j16560B8749L34153
$$ 408404 224578 225125 232324 32090 234794 278529 30579 -9899 -126459 28749 362902
12694C62902D8787k1666J19051J05565B0794f1359B00894o7928e72C0096b1210
$$ 362902 48787 27121 146172 251737 20794 -61359 200894 132966 -572 30096 -21210
12682A81927L21224d24306i5312B56394o1880C2444K07369q0787o0341J06436
$$ 181927 503151 -424306 -95312 256394 194514 32444 239813 159026 98685 205121
12672B05121A01080a1974C90011j84390n0983g345B34896p2371N4557D4018O1217
$$ 205121 101080 -11974 390011 205621 154638 -7345 234896 162525 217082 44018 105235
12661A05235b07575B55672A11146K8316D9197N28344k18064a18996C11327n7765
$$ 105235 -207575 255672 111146 139462 49197 577541 359477 -118996 311327 253562
12651B53562a57148b4461C71741f8466A84166g5242C00346i7786C69450b13187
$$ 253562 -157148 -24461 371741 -68466 184166 -75242 300346 -97786 369450 -213187
12640I659b6735n3462B03634E6998O6737J46138B6987R1743L46408j26658N0844
$$ 9659 -26735 -80197 203634 56998 123735 269873 26987 118730 465138 338480 389324
12629C89324j09657R3443P292I1799N2464G0502c1117j9242k27996C86026H4262
$$ 389324 279667 373110 380402 91799 144263 70502 -31117 -50359 -278355 386026 84262
12617A16505f4328A5710g3310H3374b05204A2793b48552G1704J98342F596a49436
$$ 116505 -64328 15710 -73310 83374 -205204 12793 -248552 71704 270046 6596 -149436
12605D34356d09710A62601P2934B5504J81399I800J02187e2796E8791e2120E7942
$$ 434356 -409710 162601 235535 25504 206903 9800 111987 -52796 58791 -52120 57942
12593A4407a81215I3172J64356J68304b3004C69135B343h6960L9701I7134b97079
$$ 14407 -181215 93172 257528 425832 -23004 369135 2343 -86960 -47259 97134 -297079
12581a66905a6680C8762b21582R7841A28058k5372b9569l4597j14535j49113K7777
$$ -166905 -16680 38762 -221582 -123741 128058 102686 -29569 -64166 -178701 -327814 -300037
12570c00037H4420a1819D06241A84692B6066a79241a3900B05665H7327A8120b55332
$$ -300037 84420 -11819 406241 184692 26066 -179241 -13900 205665 87327 18120 -255332
12558d6294D3132n547Q8705D7187A161a3902C32400a23424c4188F6607b09145
$$ -46294 43132 37585 126290 47187 1161 -13902 332400 -123424 -34188 66607 -209145
12546F5081J5390A0379b54991C57678a91601J7842A16442b90563B54492a1240
$$ 65081 80471 10379 -254991 357678 -191601 -173759 116442 -290563 254492 -11240
12535B23486A3166K61026b35169F1878J02329a00664G7341b16730D7997b2409
$$ 223486 13166 274192 -235169 61878 164207 -100664 77341 -216730 47997 -22409
12524C81241c3834B87627i5182B09527q1036f3669A12024b42478M0782H6086a6424
$$ 381241 -33834 287627 -95182 209527 128491 -63669 112024 -242478 -201696 86086 -16424
12512f0928E0101h1314H7395f5659J6326k28384B82587G3750j9160J46336c3940
$$ -60928 50101 -81314 87395 -65659 -49333 -277717 282587 73750 54590 200926 -33940
12500B29142c14271C36004e5347A13161l8763J49718p6329b68849N4551G965L23026
$$ 229142 -314271 336004 -55347 113161 74398 224116 147787 -268849 -214298 7965 330991
12489C30991a12979I9646b22024B02221h8718l321F338a42153C06697a21918d0235
$$ 330991 -112979 99646 -222024 202221 -88718 -92039 6338 -142153 306697 -121918 -40235
12477a46945G5817J33960d90649a49803L8385h890B01372a47435j93363q4323
$$ -146945 75817 209777 -490649 -149803 -111418 -8890 201372 -147435 -340798 -425121
12467d25121c0622j67768A53056b97862a9415n9221j56664j15940J48784C3248
$$ -425121 -30622 -198390 153056 -297862 -19415 -78636 -235300 -351240 -202456 33248
12456a93420m3857B58281J74722p8168a16083b7051A2038c50507J39723j17762
$$ -193420 -237277 258281 433003 354835 -116083 -27051 12038 -350507 -210784 -328546
12446c28546A63486J1957F2779a20641A35696M7276L4855b91050a38466A01623
$$ -328546 163486 175443 62779 -120641 135696 182972 217827 -291050 -138466 101623
12435F6207d1922j10525B00315J72989a82627D00613G9194b16271P8579h422B27505
$$ 66207 -41922 -152447 200315 373304 -182627 400613 79194 -216271 -137692 -8422 227505
12423a78846j65476A50339a40012F7832A601K09134a48331A9033d3147A78192
$$ -178846 -344322 150339 -140012 67832 1601 210735 -148331 19033 -43147 178192
12412f8993B15007b84122a910A61545N0014g2462j45308K9752A1935c0320D5086
$$ -68993 215007 -284122 -1910 161545 211559 -72462 -217770 -188018 11935 -30320 45086
12400G6979g2740k21764D9960a44132B99272A14154C4299b6858j36747l0061E7932
$$ 76979 -72740 -294504 49960 -144132 299272 114154 34299 -26858 -163605 -193666 57932
12388c6723B2362F002K15895D6778L03456c0834C6612d5716F2295h1113A4249
$$ -36723 22362 6002 221897 46778 350234 -30834 36612 -45716 62295 -81113 14249
12376a52446b7397p9257D02641b35798A37698J26469P000A14395a43737M1454
$$ -152446 -27397 -106654 402641 -235798 137698 264167 271167 114395 -143737 -102283
12366a02283A68106g7917j65025o5136B7256M4340A7553J04844A5705i3779B72113
$$ -102283 168106 -77917 -242942 -308078 27256 71596 17553 122397 15705 -93779 272113
12354e47415K68856A32645b42024b6989n6379F7567a19570H3249O4370H981a57936
$$ -547415 -278559 132645 -242024 -26989 -83368 67567 -119570 83249 147619 8981 -157936
12342a28127A30165C094O6628c2434E362J85413k9682d6631C0972J65438a31472
$$ -128127 130165 3094 69722 -32434 5362 190775 161093 -46631 30972 196410 -131472
12330C3837O6044a51219d5660A5866o019a3461C5146g2105m546o4430j2361m42583
$$ 33837 99881 -151219 -45660 15866 9847 -13461 35146 -72105 -76651 -141081 -153442 -596025
12318e96025H414a18076D3772K34169f2668H2705l1175J81456I0602J23852A5573
$$ -596025 8414 -118076 43772 277941 -62668 82705 51530 232986 90602 214454 15573
12306B678Q5604A4634c43224h3422K072q0572j23364b3621B07995i5036i361j60989
$$ 2678 88282 14634 -343224 -83422 -81350 -161922 -285286 -23621 207995 -95036 -9361 -170350
12294a70350j16373d2947D853K54333b10743b4457j07590D5013a39454D1613K8535
$$ -170350 -286723 -42947 4853 259186 -210743 -24457 -132047 45013 -139454 41613 70148
12283G0148O5394J02210P7190A30406R0084a31524A28866P446J53477E9394J46365
$$ 70148 135542 237752 314942 130406 220490 -131524 128866 136312 289789 59394 205759
12272B05759b58333f774A51937J73611G6150m558j3781b74431A73075b61000D06191
$$ 205759 -258333 -6774 151937 325548 76150 71592 57811 -274431 173075 -261000 406191
12260B50578e5990C00193j16458L0136D6152L14667A07380A2402K6a77517I3525
$$ 250578 -55990 300193 183735 213871 46152 360819 107380 12402 12428 -177517 93525
12248B38036A11699K3895P2339A03138K34669a08395H5506L35530r8491b5859
$$ 238036 111699 135594 207933 103138 337807 -108395 85506 421036 322545 -25859
12237B04932l0805J22288j04201G2567a93471D85966D7369N47889B41914H295
$$ 204932 174127 296415 192214 72567 -193471 485966 47369 595258 241914 8295
12226D08L93587m8684o0946n1112O3097f9507A0541K87580p168K3051j12318L0967
$$ 408 393995 345311 284365 233253 296350 -69507 10541 298121 290953 314004 201686 232653
12214B32653a03260C27949n9728j04947p7049O9738g3509K7127D8028a7840A12739
$$ 232653 -103260 327949 268221 163274 86225 155963 -73509 -46382 48028 -17840 112739
12202C25381A20433P7441J530J37628A04673N0593K0813n257J127J50721A06383
$$ 325381 120433 197874 199404 337032 104673 155266 176079 170822 171949 322670 106383
12190E09701B37947q9928n155J51977A15005Q1702B0804O386N0453K90803b4470
$$ 509701 237947 148019 142864 294841 115005 196707 20804 27190 77643 368446 -24470
12178A31543i0534C23810D1913a07104I3160e8982b603D18996f8458A31485J52739
$$ 131543 -90534 323810 41913 -107104 93160 -58982 -2603 418996 -68458 131485 284224
12167B84224D5055N2676J19184p1305a00317B85519m6224r693b3554C28835D469
$$ 284224 45055 97731 216915 145610 -100317 285519 239295 229602 -23554 328835 4469
12155c28904E1643c65305A50428b00229P9983D24731a12593m1389O8681B37919
$$ -328904 51643 -365305 150428 -200229 -120246 424731 -112593 -153982 -85301 237919
12144A47951a59529f0045B84119j18316F0384M35258g9458j61352b682m889B58153
$$ 147951 -159529 -60045 284119 165803 60384 495642 -79458 -240810 -2682 -7571 258153
12132C2164F333d2807j23627o3307i8682A48621H848L21199A23949l3209B6826
$$ 32164 6333 -42807 -166434 -229741 -98682 148621 8848 330047 123949 90740 26826
12120B0314c66621G1193J62119e0918j8373q8088B83526f4018B52525j07854C1140
$$ 20314 -366621 71193 233312 -50918 -69291 -157379 283526 -64018 252525 144671 31140
12108F3691a23638M3482q4550j28022g2692k83678C4830a9828D2533K92059i6993
$$ 63691 -123638 -80156 -164706 -292728 -72692 -356370 34830 -19828 42533 334592 -96993
12096d6701H0645g5431f337k06469E2060Q1550C4625L8470e569A80067a42892
$$ -46701 80645 -75431 -6337 -212806 52060 133610 34625 73095 -5569 180067 -142892
12084a74110A41680j6001K42576a34886C6009P210a8189C593K78220b55j14130
$$ -174110 141680 125679 368255 -134886 36009 43219 -18189 3593 281813 -255 -114385
12073a14385D34651R02267K64742F28569A58144F0863J72385B5304J58890n488
$$ -114385 434651 1336918 1601660 628569 158144 60863 233248 25304 184194 178706
12063A78706G8028d2688J6153j92491B87928A34010c51854B34414f5622B5922
$$ 178706 78028 -42688 -26535 -219026 287928 134010 -351854 234414 -65622 25922
12052e1784p5448K3861B25846m8251c1463j12610M5238o9595d508k0325k77852
$$ -51784 -127232 -103371 225846 177595 -31463 -144073 -98835 -168430 -4508 -24833 -302685
12041c02685g3819l3155L6185B20226a16407M3708a6904A36085a68666B29855
$$ -302685 -73819 -106974 -70789 220226 -116407 -72699 -16904 136085 -168666 229855
12030B42970a44290E920O2755K13817A2294c88787A674h8676B03539A6882P8133
$$ 242970 -144290 5920 68675 282492 12294 -388787 1674 -88676 203539 16882 95015
12019I5015j0597B4438P3332K73756c31435d2651i497A85703b34354a2195D416
$$ 95015 84418 24438 97770 371526 -331435 -42651 -9497 185703 -234354 -12195 4416
12007B28675b3066d73A029J94697g4913A92855B5776a04908c7525I93P3600J84171
$$ 228675 -23066 -473 1029 195726 -74913 192855 25776 -104908 -37525 993 74593 258764
11995B58764c43274d1667l51920e6739H4808R9987i6829A07513b54070a01234
$$ 258764 -343274 -41667 -393587 -56739 84808 184795 -96829 107513 -254070 -101234
11984b7346G6848b51683F3312L3689J23140c58545F079K42626b23078L6580o4410
$$ -27346 76848 -251683 63312 97001 220141 -358545 6079 248705 -223078 -186498 -250908
11973b50908E4384a49170A25873a05136M0386B66344K8586b24929a8558Q934B6075
$$ -250908 54384 -149170 125873 -105136 -64750 266344 294930 -224929 -18558 -9624 26075
11961E9160b92131a45164k4379B7387e4873D49440A63910a48610f0122l6000B66697
$$ 59160 -292131 -145164 -169543 27387 -54873 449440 163910 -148610 -60122 -96122 266697
11949b80193g8008A26262F1908N6471a247A38731n0915f8070o3245o2277a7523
$$ -280193 -78008 126262 61908 118379 -1247 138731 87816 -68070 -131315 -193592 -17523
11937I9785g2256m6942k09406A38112e50924F6604a26284B04835b2454A19046
$$ 99785 -72256 -119198 -328604 138112 -550924 66604 -126284 204835 -22454 119046
11926B99024q8644m9920e7940n5802L8595B3123a07310A3245b45416a4677F0754
$$ 299024 210380 160460 -57940 -113742 -75147 23123 -107310 13245 -245416 -14677 60754
11914a40485l0144B6907a38525j03138A63494M2657a18855n4602P167a8178B49901
$$ -140485 -170629 26907 -138525 -241663 163494 206151 -118855 -173457 -166290 -18178 249901
11902E93472A68821j4075J35296g9372j33241f9755B3965B804M126L25964h197
$$ 593472 168821 154746 290042 -79372 -212613 -69755 23965 2804 6930 332894 -8197
11890e10448b6194m9311D748Q2053O9845b46218J02596g77A95150c6747B6762
$$ -510448 -26194 -75505 4748 86801 156646 -246218 -143622 -777 195150 -36747 26762
11878d5093E1728i0254A39927i1167n7104l0848j4007A38385c15219h5553E6778
$$ -45093 51728 -90254 139927 -91167 -148271 -179119 -193126 138385 -315219 -85553 56778
11866a97554c7685A67705B3574M9438Q0679G3774c05116e9436M410j39162j6978
$$ -197554 -37685 167705 23574 73012 153691 73774 -305116 -59436 -55026 -194188 -211166
11855b11166A160Q9009J52822a80422n7993q5128n4963L041J01900j05102h0509
$$ -211166 1160 90169 242991 -180422 -238415 -323543 -378506 -375465 -273565 -378667 -80509
11843e28j1003m6840l97328A3752O2096a38056C50516c25365e0785B50953g9457
$$ -528 -11531 -58371 -455699 13752 75848 -138056 350516 -325365 -50785 250953 -79457
11831B78609b11985j5210J527B31493a88354p166j54072C15730b56223A94264
$$ 278609 -211985 -227195 -225668 231493 -188354 -195520 -349592 315730 -256223 194264
11820E2884a15386b409A30586o3922K33995A2082O1668a56246C7773a96734G0737
$$ 52884 -115386 -2409 130586 66664 300659 12082 73750 -156246 37773 -196734 70737
11808c78109K3889f3190m7481A1150J56561a96690K5160f0769m0151E9820b19194
$$ -378109 -354220 -63190 -110671 11150 167711 -196690 -171530 -60769 -100920 59820 -219194
11796B5818J07766f9244A69707b47794M7553B70905n4467J3897a10695A24844
$$ 25818 133584 -69244 169707 -247794 -200241 270905 216438 230335 -110695 124844
11785F6052N5397n7719M7971c1371C09632a6381A55679c7945B15504L3873D0828
$$ 66052 121449 63730 111701 -31371 309632 -16381 155679 -37945 215504 249377 40828
11773g5735O298B49434a22857C9823J5389b098l51032E861a3539K922A73960R850
$$ -75735 -69437 249434 -122857 39823 55212 -2098 -353130 5861 -13539 -10617 173960 183810
11761A83810b83881H1500J00152a01142A55479a7A11671M5138a04274m0316k16439
$$ 183810 -283881 81500 181652 -101142 155479 -17 111671 156809 -104274 -144590 -361029
11750c61029B32412d9489m0710J3637b5428m9840B19679a25005A10164e088G5979
$$ -361029 232412 -49489 -90199 -76562 -25428 -75268 219679 -125005 110164 -5088 75979
11738d6195J1762j08714j057a0979A84658a11612B4410K28519f3770j17109c3558
$$ -46195 -34433 -143147 -144204 -10979 184658 -111612 24410 252929 -63770 -180879 -33558
11726D7818J94888g5605r5853Q515J8944O6594L1816K318D32839f1126A14873
$$ 47818 242706 -75605 -171458 -162943 -143999 -77405 -45589 -43271 432839 -61126 114873
11714c05390a38297B30849d3723B06976I433R5311C5924a49666A16389M6261c35247
$$ -305390 -138297 230849 -43723 206976 9433 104744 35924 -149666 116389 162650 -335247
11702b08909n829M5065F9723J74193G9205E678a23548e8915j2368j01937C57293
$$ -208909 -214738 -169673 69723 243916 79205 5678 -123548 -58915 -71283 -173220 357293
11690A83027A3274J41324o2605M0849e1325A7555a19916B07162c06223N2782d4090
$$ 183027 13274 154598 91993 132842 -51325 17555 -119916 207162 -306223 -253441 -44090
11678B6461d4931j80830B54339b22784D30625a92442B22554b4597a1314A24105
$$ 26461 -44931 -225761 254339 -222784 430625 -192442 222554 -24597 -11314 124105
11667B48279E4978b425F8280J75031a95069B12615b35543d9333o8384A7730K15127
$$ 248279 54978 -2425 68280 243311 -195069 212615 -235543 -49333 -117717 17730 232857
11656B32857K44172A37323F2464L7743J72707h0504q080A89311I4029a28078C7886
$$ 232857 477029 137323 62464 100207 272914 -80504 -88584 189311 94029 -128078 37886
11644f0533J537B26910E769a15518B52584H7952J82271a88811c713C2207K33327
$$ -60533 -58996 226910 5769 -115518 252584 87952 270223 -188811 -3713 32207 265534
11633B65534C2159A3952e6622H9389a08174J0795n338F1173q982a34468A25556
$$ 265534 32159 13952 -56622 89389 -108174 -97379 -102717 61173 52191 -134468 125556
11621A59119b95244E6669J65840B924f4191G7858J0938J44968A01880J0736r608
$$ 159119 -295244 56669 222509 2924 -64191 77858 88796 233764 101880 112616 103008
11610A03008a92276m1036H4894C7276d56328I2942m2545M25201B19362K85777
$$ 103008 -192276 -233312 84894 37276 -456328 92942 50397 475598 219362 505139
11600E05139D7949J6135a09606j16573f8967B10212m2961D8111K4162b1495C47587
$$ 505139 47949 64084 -109606 -226179 -68967 210212 167251 48111 72273 -21495 347587
11588C2101h6751K8951A43836m1042l9161K64717b8739B7624J5972b53452D5481
$$ 32101 -86751 -57800 143836 102794 63633 328350 -28739 27624 43596 -253452 45481
11576a7490n4929k8481A9810a43648A87193f6419A32690B232J22764J07924a51770
$$ -17490 -72419 -100900 19810 -143648 187193 -66419 132690 2232 124996 232920 -151770
11564C59014j78313J0711I856a48759G2236K03430k0770i5796b6200B473J64090
$$ 359014 180701 191412 9856 -148759 72236 275666 254896 -95796 -26200 2473 166563
11553A66563B0992k832L10966A09320c5969B0795d9277B74440I812J60112j6615
$$ 166563 20992 18160 329126 109320 -35969 20795 -49277 274440 9812 169924 153309
11542A53309J4693J43488N546j8567B7309Q8136J5634K0423F489K91583e0599
$$ 153309 168002 311490 317036 298469 27309 115445 131079 151502 6489 298072 -50599
11530B36778G417L40878A37142E2770B1834J14336a26379A28628L8536D742b2673
$$ 236778 7417 348295 137142 52770 21834 136170 -126379 128628 167164 4742 -22673
11518F2504B3913J28960B027M02970A40378h1566G2791N8651C2449J10412D428
$$ 62504 23913 152873 2027 404997 140378 -81566 72791 131442 32449 142861 4428
11506B92676q1746k5912m2162F1137J97505a99081A61384D3893M33230B22547
$$ 292676 210930 185018 142856 61137 258642 -199081 161384 43893 477123 222547
11495b9840E23082k24594C1631O1162K0843J3913J11492J19165A11393K51327
$$ -29840 523082 298488 31631 92793 113636 127549 239041 358206 111393 362720
11485C62720H6836M5148a01729C21492b2197B75664o2716K15299j86966K01616
$$ 362720 86836 131984 -101729 321492 -22197 275664 212948 428247 241281 442897
11475D42897B07527j0292G5079M8840J59937j19046K68226b643C18313a38096
$$ 442897 207527 197235 75079 123919 283856 164810 433036 -2643 318313 -138096
11464A11919J74787n9224k4150i4303H3210K18266A15142d3093F2301B5901L16196
$$ 111919 286706 227482 203332 -94303 83210 301476 115142 -43093 62301 25901 342097
11453C42097J6642e1955H8023a90779A38573n0483A3395J86168i4C02657D1209
$$ 342097 358739 -51955 88023 -190779 138573 88090 13395 199563 -94 302657 41209
11441E8858K12204c6033B26885L5262I2460a19759B58496a34113j20684J054C25388
$$ 58858 271062 -36033 226885 262147 92460 -119759 258496 -134113 -254797 -253743 325388
11429B55109a48450A25441b995D6312f3045p0218C22670e0658A48662g28966B11983
$$ 255109 -148450 125441 -2995 46312 -63045 -133263 322670 -50658 148662 -728966 211983
11417i6142M7444B6091k332g7845j03166A60904n7674a25374o9194G1886i0366
$$ -96142 -48698 26091 23759 -77845 -181011 160904 103230 -125374 -194568 71886 -90366
11405D55380a28991F7667i418B28845H1751l820J19819b88270A37692N5831p0810
$$ 455380 -128991 67667 -9418 228845 81751 77931 197750 -288270 137692 193523 122713
11394A22713d8466j00961p4678g9315j50395b6665j05304c9349k96626e9879o3462
$$ 122713 -48466 -149427 -224105 -79315 -229710 -26665 -131969 -39349 -335975 -59879 -123341
11383a23341A00018a66731H1549J71911P4401A51597p0261c0488l72343c1087
$$ -123341 100018 -166731 81549 253460 327861 151597 81336 -30488 -402831 -31087
11372a3260C21221a45313e1688H4263d6547k07287Q1348j93635J62916e503A97289
$$ -13260 321221 -145313 -51688 84263 -46547 -253834 -172486 -366121 -203205 -5503 197289
11360d47974C0162b11584A94226b05144O4900j9584n9490h4820A61589a84800
$$ -447974 30162 -211584 194226 -205144 -140244 -159828 -219318 -84820 161589 -184800
11349b4283H4587a88663A35918a60797B18248a59904c8986D46975b8395j00862
$$ -24283 84587 -188663 135918 -160797 218248 -159904 -38986 446975 -28395 -129257
11339a29257k29590c9456j25887A79636D2371b8350A50052a59433A49752l0272
$$ -129257 -358847 -39456 -165343 179636 42371 -28350 150052 -159433 149752 119480
11329A19480b2078A72137a90382j800I5646b1549B28198a21159B42529h7069j05624
$$ 119480 -22078 172137 -190382 -192182 95646 -21549 228198 -121159 242529 -87069 -192693
11318a92693c4506j2188D6894K98792j9484b40418B33515c95267P6468f0159j5214
$$ -192693 -34506 -46694 46894 345686 326202 -240418 233515 -395267 -318799 -60159 -75373
11307g5373G7234f4709B03192d44403a22061L8865b523A11932b21244O9300j94874
$$ -75373 77234 -64709 203192 -444403 -122061 -83196 -2523 111932 -221244 -151944 -346818
11296c46818b6553n407g557k75006J251A11507a6298A73740o4718b14767C0028
$$ -346818 -26553 -31960 -7557 -282563 -281312 111507 -16298 173740 109022 -214767 30028
11284A79368a22915O806Q081j53567F2755O3937c0621j5411m60521J75176A9235
$$ 179368 -122915 -116109 -108028 -261595 62755 126692 -30621 -46032 -506553 -331377 19235
11272H8790a14784B57440d0148l54928A31461j9456b05671j8484A60242g3166
$$ 88790 -114784 257440 -40148 -395076 131461 112005 -205671 -224155 160242 -73166
11261d65453A57169b91815c6399k2047k90990J65901c2425q9144A504J6034e1316
$$ -465453 157169 -291815 -36399 -58446 -349436 -183535 -32425 -121569 1504 17538 -51316
11249c84790B7931J181J82585a37049m6538L3671A46694E6523a52168A45235k5396
$$ -384790 27931 29112 211697 -137049 -183587 -149916 146694 56523 -152168 145235 119839
11238A19839K25809g4558q0680n2922A11795M8198G7018J62299L2004A03387h2697
$$ 119839 345648 -74558 -155238 -208160 111795 159993 77018 239317 271321 103387 -82697
11226d17440J24622K7754Q8138A73544A6133g1216E3048m889a79094h8674A40222
$$ -417440 -292818 -265064 -176926 173544 16133 -71216 53048 48159 -179094 -88674 140222
11214b67611A11665k9464a36223A20011b65906I9067B7816e3076G0804d01589
$$ -267611 111665 82201 -136223 120011 -265906 99067 27816 -53076 70804 -401589
11203B81486c11329a01617A42823d69415B46488j11170c3081l65512J89724p3704
$$ 281486 -311329 -101617 142823 -469415 246488 135318 -33081 -398593 -208869 -282573
11193b82573J6391q6668A22269a43524E6167k0510d5289j14832G1940a53233A91807
$$ -282573 -266182 -352850 122269 -143524 56167 35657 -45289 -160121 71940 -153233 191807
11181a4901C21128A195a41580D880b34603P6304A68533J054A3340O9506h1405
$$ -14901 321128 1195 -141580 4880 -234603 -158299 168533 169587 13340 82846 -81405
11169b72661C15790e9223A9323K91298i2780F9353i8567C20568h1474L0046k45530
$$ -272661 315790 -59223 19323 310621 -92780 69353 -98567 320568 -81474 -51428 -296958
11158b96958B5658P3671A2753A650c19004A30876i2094b6508j01321L7620k9429
$$ -296958 25658 99329 12753 1650 -319004 130876 -92094 -26508 -127829 -90209 -119638
11147a19638K3041k4211c5084F5317i6150A53932e286k00926k75895a3713G2196
$$ -119638 -96597 -120808 -35084 65317 -96150 153932 -5286 -206212 -482107 -13713 72196
11135f2927H3507J31880l7736a64885g7593A2095J16043R7292a67274D13225r1973
$$ -62927 83507 215387 177651 -164885 -77593 12095 128138 225430 -167274 413225 321252
11124C21252i3735E1530J01223l657h2133j60658C6067K61613e4026j28376e5667
$$ 321252 -93735 51530 152753 149096 -82133 -242791 36067 297680 -54026 -182402 -55667
11112B35771B1774M54405B37205c631g46C45214j43246J21744b84721A77626A5264
$$ 235771 21774 476179 237205 -3631 -746 345214 201968 323712 -284721 177626 15264
11100A57872D5745K74565B2802K88630R5205F8L41641j37715f4094j92917g4949
$$ 157872 45745 320310 22802 311432 406637 68 341709 203994 -64094 -257011 -74949
11088C71126j61768J15164b33913A95229J54320b5664B0998M99920j8424j06761
$$ 371126 209358 324522 -233913 195229 349549 -25664 20998 520918 502494 395733
11078C95733j29897K06505A58270m9085D5941K78280j54044N7011q498L47360
$$ 395733 265836 472341 158270 109185 45941 324221 170177 227188 218690 566050
11068E66050k59976J30084o8335p8664K25394k3237k18454K35806J69151q7792
$$ 566050 306074 436158 367823 289159 514553 491316 272862 508668 677819 590027
11058E90027K46069k38800k3525M8985J21084L9538C42212N37938J40384l86469
$$ 590027 836096 597296 573771 622756 743840 783378 342212 880150 1020534 634065
11048F34065K69773Q7278m03556K4235O3681j87500J28721R5228j90458o5876
$$ 634065 903838 991116 587560 611795 675476 487976 616697 711925 521467 455591
11038D55591K36476j4428j68472K57814m428j50913j08047J55321M8235j70122
$$ 455591 692067 677639 509167 766981 762553 611640 503593 658914 707149 537027
11028E37027M22341l55464P6025K263J26366j03986J16096p1711l8128M7862k11153
$$ 537027 959368 603904 679929 682192 808558 704572 820668 748957 710829 758691 547538
11017E47538L89616k37185j09995j66497J19863J25203J75237k83431J53000A65340
$$ 547538 937154 699969 589974 423477 543340 668543 843780 560349 713349 165340
11006F84584o1615B71094J40164L16833k70198R5635K74993B84704L61298K4197
$$ 684584 622969 271094 411258 728091 457893 553528 828521 284704 646002 670199
10996F70199j49956J23919j68643M26609O0497O0730q8282k65372J93299m6833
$$ 670199 520243 644162 475519 902128 962625 1023355 935073 669701 863000 816167
10986H16167L39127j62302q5690R4414J05959k80400M15064r4337J49176N86159
$$ 816167 1155294 992992 907302 1001716 1107675 827275 1242339 1148002 1297178 1883337
10976A883337r3140M22895K24227L23356L00411j87952J63933k81892l7363o28661
$$ 1883337 1790197 2213092 2437319 2760675 3061086 2873134 3037067 2755175 2717812 2089151
10966B089151J67189l72423l5061o24108N85951m62979K30962L31993k41196j01022
$$ 2089151 2256340 1883917 1848856 1224748 1810699 1347720 1578682 1910675 1669479 1568457
10956A568457K63343k43787m23899J69305J46834m67721j63497k94237r3186j46645
$$ 1568457 1831800 1588013 1164114 1333419 1480253 1012532 849035 554798 461612 314967
10946C14967J54018A80185P2013J20570N4651H26a9142B01983m6218a0538D15051
$$ 314967 468985 180185 252198 372768 427419 826 -19142 201983 155765 -10538 415051
10934I6182J79784A15113J32326B6332L02106b5800m3312A58272F4931e42433
$$ 96182 275966 115113 247439 26332 328438 -25800 -69112 158272 64931 -542433
10923h8951C32637j14925a13456I3237L211J10548b03519A10563J12692k072b02008
$$ -88951 332637 217712 -113456 93237 96448 206996 -203519 110563 223255 221183 -202008
10911A28949c9440k34640A5513M8455C1295L6662a79645F964R2302j0894a87654
$$ 128949 -39440 -274080 15513 63968 31295 67957 -179645 6964 99266 88372 -187654
10899e8540j33640M2797C6884K14043a12381o1824B39007d69460a38100D1557
$$ -58540 -192180 -149383 36884 250927 -112381 -174205 239007 -469460 -138100 41557
10888a6727k52773D4477i612o4442F0469a86918j35255K5264Q5358A55683n9567
$$ -16727 -269500 44477 -9612 -74054 60469 -186918 -322173 -296909 -211551 155683 96116
10877I6116Q1713a75739j73858E099K3452K25889B4965P1023A8879a23089A97524
$$ 96116 177829 -175739 -349597 5099 28551 254440 24965 95988 18879 -123089 197524
10865I196g4004A37841a9303G7545a81821j2026A0826e2247j8833m8736c6126
$$ 9196 -74004 137841 -19303 77545 -181821 -193847 10826 -52247 -71080 -119816 -36126
10853B04649r1930e099A94274M3257P1625E7165a53638b1060B2771J56529d8442
$$ 204649 112719 -5099 194274 237531 309156 57165 -153638 -21060 22771 179300 -48442
10841A62356A2844L43184E956b02923H9632c36296A77a24402l9111P6620j55076
$$ 162356 12844 356028 5956 -202923 89632 -336296 177 -124402 -163513 -86893 -241969
10830b41969J00633j00324N6291c0283F9043I150Q2954N4235d35669A74148o0433
$$ -241969 -141336 -241660 -185369 -30283 69043 9150 92104 146339 -435669 174148 113715
10819A13715d3867A28640m7824d4359B2076f4523A48380b08235c3985A03273g4749
$$ 113715 -43867 128640 80816 -44359 22076 -64523 148380 -208235 -33985 103273 -74749
10807b08680c4330m6230k97698i2894n6279b6968A81133a74820E1288h5097L4525
$$ -208680 -34330 -80560 -378258 -92894 -149173 -26968 181133 -174820 51288 -85097 -50572
10796e0572j28367f4125I3435h2882A91907b31722G9814R0454a33648e0793j62250
$$ -50572 -178939 -64125 93435 -82882 191907 -231722 79814 170268 -133648 -50793 -213043
10785b13043A28264Q6194F1809a17335j16876R1489A59014n9074b73337g283k80522
$$ -213043 128264 214458 61809 -117335 -234211 -142722 159014 99940 -273337 -7283 -287805
10774b87805L8073i4908E5294e8862B10732a6219I9632b02648a48j18659k62946
$$ -287805 -249732 -94908 55294 -58862 210732 -16219 99632 -202648 -148 -118807 -381753
10763c81753A22168A19a39491q097B6040a73999k41188J27859J28305d8041j50568
$$ -381753 122168 119 -139491 -147588 26040 -173999 -415187 -287328 -159023 -48041 -198609
10752a98609o3432M820M0365e8316k76292i1007q6072A2597J57763k1779k116
$$ -198609 -262041 -257221 -216856 -58316 -334608 -91007 -177079 12597 170360 148581 146465
10741A46465b23558N4171O798q1085M5654g2607A83462j9689D5293b52249J16612
$$ 146465 -223558 -169387 -162589 -243674 -198020 -72607 183462 163773 45293 -252249 -135637
10730a35637k29366C20521c4951n5096B43032a2882A12971O3335i5507A38578
$$ -135637 -365003 320521 -34951 -90047 243032 -12882 112971 176306 -95507 138578
10719a95196g5607A2024n825c74063J46707J3725I9883j164K3887i8863d2353
$$ -195196 -75607 12024 6199 -374063 -227356 -213631 99883 98719 122606 -98863 -42353
10707d13791J47059F0185j920b31197C2270d3025p4657A53502i3796l19539a61780
$$ -413791 -266732 60185 58265 -231197 32270 -43025 -117682 153502 -93796 -413335 -161780
10695A6653J04106a81683q4610C7629c55330R1653A44324a79963b0384j9445l3948
$$ 16653 120759 -181683 -266293 37629 -355330 -263677 144324 -179963 -20384 -39829 -73777
10684g3777j86439a1835j44517j00053J22363o5139D16365I394K26935d2768L453
$$ -73777 -260216 -11835 -156352 -256405 -134042 -199181 416365 9394 236329 -42768 -39315
10673c9315j40244B23311B562i116A11404c12041a29045G0178C3653c44745J46722
$$ -39315 -179559 223311 2562 -9116 111404 -312041 -129045 70178 33653 -344745 -198023
10662a98023B10452a80943b8457A21395a66159D3180K0755h5142c1298B2691J85818
$$ -198023 210452 -180943 -28457 121395 -166159 43180 63935 -85142 -31298 22691 208509
10651B08509f6760j05869b9785B71778A14531b26684A68826b09846d7132l63945
$$ 208509 -66760 -172629 -29785 271778 114531 -226684 168826 -209846 -47132 -411077
10641d11077J82467g2553A20819a88896b044m11786K01351B5212J44486C0980
$$ -411077 -228610 -72553 120819 -188896 -2044 -413830 -212479 25212 169698 30980
10630d09937C78373A01912a60500H1984K22108g3873K9648B39339c48762A47076
$$ -409937 378373 101912 -160500 81984 304092 -73873 -44225 239339 -348762 147076
10619c36981A07236d8792q2732A22128e5307A24348j0021g393A60314D9873C107
$$ -336981 107236 -48792 -131524 122128 -55307 124348 114327 -7393 160314 49873 3107
10607B7321d18107a59002p3203a883j4478q3930C8425e752k4969B14455K0064
$$ 27321 -418107 -159002 -232205 -1883 -16361 -100291 38425 -5752 -30721 214455 234519
10596B34519G310i7637G3402Q5010g5950A82142a70491j55167G4150b68414f6135
$$ 234519 7310 -97637 73402 158412 -75950 182142 -170491 -325658 74150 -268414 -66135
10584a25557I0358b19117g8212A20096a72776n4273I0753l8459g9101b7630j30244
$$ -125557 90358 -219117 -78212 120096 -172776 -227049 90753 52294 -79101 -27630 -157874
10573a57874j87205J60994C3029a46061r098B07714a06883n036k18629D526a11121
$$ -157874 -345079 -184085 33029 -146061 -155159 207714 -106883 -111919 -330548 4526 -111121
10561d204A90897b01176d0522J1852A59756E2994c6453j71975h2594A61607b88196
$$ -4204 190897 -201176 -40522 -28670 159756 52994 -36453 -208428 -82594 161607 -288196
10549I0261d5647k01360A40068n2497f0574m3593k80108A04568A4199a74208m8365
$$ 90261 -45647 -247007 140068 87571 -60574 -104167 -384275 104568 14199 -174208 -222573
10538b22573R4461d619p6181F0043b78626H8124j971a8512k96843b1492k5527
$$ -222573 -128112 -4619 -80800 60043 -278626 88124 86153 -18512 -315355 -21492 -47019
10527d7019j14561A1648J88715G2878d141k0982A96513b87048F047R6092a94477
$$ -47019 -161580 11648 200363 72878 -4141 -25123 196513 -287048 6047 102139 -194477
10515B52624F7906b8606D0768L14299A03285c67709C5529b34949B2748K91750
$$ 252624 67906 -28606 40768 355067 103285 -367709 35529 -234949 22748 314498
10505C14498b71131d9039C8986d0584n8160I2495i9891E0906b10055j10701B8540
$$ 314498 -271131 -49039 38986 -40584 -98744 92495 -99891 50906 -210055 -320756 28540
10493a75357k80588b23776n6270Q4834c3047A43251a83453I1791a11556A26535
$$ -175357 -455945 -223776 -280046 -195212 -33047 143251 -183453 91791 -111556 126535
10482A58024a88501C80704K36054B99526P0208B2057a48306e6994A62117L1438
$$ 158024 -188501 380704 616758 299526 369734 22057 -148306 -56994 162117 193555
10472A93555p6145N5872a72816o1905A87934a1974A83709c02738B40061G2446
$$ 193555 117410 173282 -172816 -234721 187934 -11974 183709 -302738 240061 72446
10461a93605P9560K975a2679A7531J28056J02394p7580b76664B56049E7629a76808
$$ -193605 -114045 -111070 -12679 17531 145587 247981 170401 -276664 256049 57629 -176808
10449F131K2520a7904j03833G5188b47003h1872A29801b00558j23591i505n8116
$$ 6131 28651 -17904 -121737 75188 -247003 -81872 129801 -200558 -324149 -9505 -67621
10438f7621l4196B6548k533a29344F5923b85941a02052A58011N4806d7915C77885
$$ -67621 -101817 26548 24015 -129344 65923 -285941 -102052 158011 212817 -47915 377885
10426h0075n3215e7769j98580N3110C06910A20825K7726a97758g861A42708b35522
$$ -80075 -133290 -57769 -256349 -203239 306910 120825 148551 -197758 -7861 142708 -235522
10414b747j95313j6648j35371A89584a70335M0576B88957A18215D9832J25716
$$ -2747 -198060 -214708 -350079 189584 -170335 -129759 288957 118215 49832 175548
10404A75548K031G7685c49606G1400l4325g2962j64968K7819B4680K00017P3527
$$ 175548 177579 77685 -349606 71400 37075 -72962 -237930 -210111 24680 224697 298224
10393B98224d3140A92437b39903A14573a35740E6424c6876j61185i5981a0685
$$ 298224 -43140 192437 -239903 114573 -135740 56424 -36876 -198061 -95981 -10685
10382E6533Q0199l7032K12274e5598B78639b60473E3146L16698N5644R0357A75947
$$ 56533 136732 99700 311974 -55598 278639 -260473 53146 369844 425488 515845 175947
10370C18013J06195O4387J21567k12662n536D5900M70341a7836C13923o3506A02905
$$ 318013 424208 488595 610162 397500 391964 45900 516241 -17836 313923 250417 102905
10358C00242A41988b63574d9179D1J48192J67663k631J858K64548j18746j8375
$$ 300242 141988 -263574 -49179 41 148233 315896 313265 315123 579671 460925 442550
10347D42550A87176l8963Q7303J44066j73027K02581P6747r3797a2530A49315
$$ 442550 187176 148213 235516 379582 206555 409136 485883 392086 -12530 149315
10336B35857L02556A99646P0446m9689B8520F388L52495D5421B1743a56192E6236
$$ 235857 538413 199646 270092 220403 28520 6388 358883 45421 21743 -156192 56236
10324A47059A4040i5362E37650B56637j7317a29874B8571a58123A41028a5613
$$ 147059 14040 -95362 537650 256637 239320 -129874 28571 -158123 141028 -15613
10313A29799k1306k1264A6282J36593M5371e0149A39266b46846J21826A59389
$$ 129799 108493 87229 16282 152875 198246 -50149 139266 -246846 -125020 159389
10302a42635A96460I480K64593E704d0309A61822b12829H8985a82396Q657O4397
$$ -142635 196460 9480 274073 5704 -40309 161822 -212829 88985 -182396 -173739 -109342
10291a09342A3091K34498a63775j40887A5791b16096B47894H4800f7417j4534
$$ -109342 13091 247589 -163775 -304662 15791 -216096 247894 84800 -67417 -81951
10281h1951m0642I660a36615O0231g164A9600e8753C55727c09561a46618A33937
$$ -81951 -122593 9660 -136615 -76384 -7164 19600 -58753 355727 -309561 -146618 133937
10269c870l9107p4438A45967l5222m0251a26984A05500d13753E41951D4622L50907
$$ -3870 -42977 -117415 145967 110745 70494 -126984 105500 -413753 541951 44622 395529
10258C95529K31003E7058K27630F940L97837E0719N1311A9202h4805c6208k5562
$$ 395529 626532 57058 284688 6940 404777 50719 102030 19202 -84805 -36208 -61770
10247f1770K4424A27713c8213H7368N879b37645C8400A2979a06884j71387C50428
$$ -61770 -37346 127713 -38213 87368 93247 -237645 38400 12979 -106884 -278271 350428
10235F9222c02315k20930c8613E4715J32507i6567F9129a2715m2655m7619n0695
$$ 69222 -302315 -523245 -38613 54715 187222 -96567 69129 -12715 -55370 -102989 -153684
10224a53684L9234k29471a60785O5420p6484M3830j50049A08392e23008h3495
$$ -153684 -114450 -343921 -160785 -95365 -171849 -128019 -278068 108392 -523008 -83495
10213c36677b2406F7240a94315k48223D2300b7262J461j13740B29312b19997F4869
$$ -336677 -22406 67240 -194315 -442538 42300 -27262 -25801 -139541 229312 -219997 64869
10201c16927R5291K1104E1489a28895C6506h2936A01857a83483n9229A44055a7410
$$ -316927 -221636 -200532 51489 -128895 36506 -82936 101857 -183483 -242712 144055 -17410
10189A11720d23334a97516a6532l04567A86117A6180e1209r2425A52539b0905
$$ 111720 -423334 -197516 -16532 -321099 186117 16180 -51209 -143634 152539 -20905
10178A45675P3687j5604d3067k28293A34753a57900M9545l9124e8903J665F166
$$ 145675 219362 203758 -43067 -271360 134753 -157900 -108355 -147479 -58903 -57238 6166
10166d07940A09763a31620j69206l8837b7724A516i0410L1873k08045A16018A1436
$$ -407940 109763 -131620 -300826 -339663 -27724 1516 -90410 -58537 -266582 116018 11436
10154b37253f6127a8187A45012b25301q2803H8781b41064k03107a4240A28843
$$ -237253 -66127 -18187 145012 -225301 -308104 88781 -241064 -444171 -14240 128843
10143A41845d9290k68117A36827M9715d36566f1933A79705b55996C7984e8282
$$ 141845 -49290 -317407 136827 186542 -436566 -61933 179705 -255996 37984 -58282
10132a83122D214J83039a51825A1540J02170A3848b33708a15495j27514C00654
$$ -183122 4214 187253 -151825 11540 113710 13848 -233708 -115495 -243009 300654
10121G4522j895d55403A7818a25075k00756C4700b33259N5324L8331B27250f11510
$$ 74522 72627 -455403 17818 -125075 -325831 34700 -233259 -177935 -139604 227250 -611510
10109d2159B9576R2069j2062e8097l4580A55056F5106P2547a81448L6849l88l38683
$$ -42159 29576 121645 109583 -58097 -92677 155056 65106 137653 -181448 -144599 -144987 -483670
10097d83670J23270c460k13518p2491a40247c9200C2161a11705l2935G36a11706
$$ -483670 -360400 -3460 -216978 -289469 -140247 -39200 32161 -111705 -144640 736 -111706
10085b21251C2461A089b58432P2298e3113B8711a02969K5061G9969e4361m99207
$$ -221251 32461 1089 -258432 -186134 -53113 28711 -102969 -77908 79969 -54361 -553568
10074e53568A90522d52011O9780p9094D80315e1230A79593b04008d6451j97093
$$ -553568 190522 -452011 -382231 -461325 480315 -51230 179593 -204008 -46451 -243544
10064b43544C42022G720J43190a60082C6720L3819M9763m2534B6245N880N9651
$$ -243544 342022 7720 150910 -160082 36720 70539 120302 77768 26245 32125 91776
10053I1776a81562j0708L597B33239D270b99538i9982k2268M2010A72734o258
$$ 91776 -181562 -192270 -188673 233239 4270 -299538 -99982 -122250 -80240 172734 166476
10042A66476i0746I3275b58969J09694j5512B1924J68333M501J12782j02217p0447
$$ 166476 -90746 93275 -258969 -149275 -164787 21924 190257 194758 307540 205323 134876
10031A34876a11793E8257a45490A45220b27322j77132a22390A56862h80o9199
$$ 134876 -111793 58257 -145490 145220 -227322 -404454 -122390 156862 -880 -70079
10021g0079J6602j16660e2444j12659q143d2706j38195A9450d13102A18365N8320
$$ -70079 -53477 -170137 -52444 -165103 -173246 -42706 -180901 19450 -413102 118365 176685
10010A76685b12232E2756c80858J76678a958A13055b47702B40358a48315B48846
$$ 176685 -212232 52756 -380858 -204180 -1958 113055 -247702 240358 -148315 248846
9999d61962C0427P649d8429l8415I5711K10099A4615i5649k33030C4525a72519
$$ -461962 30427 38076 -48429 -86844 95711 305810 14615 -95649 -328679 34525 -172519
9987a98462C91205H1334c32514A53465o8739j3212b83579A28934A2939b70099
$$ -198462 391205 81334 -332514 153465 84726 71514 -283579 128934 12939 -270099
9976d10717a77268A60716A0220O4194M5565A5599J23179b36718A41345d65094
$$ -410717 -177268 160716 10220 74414 119979 15599 138778 -236718 141345 -465094
9965a17085j39133k3675J19519A71509B3400J50249k3386A4998J44776p7477J3924
$$ -117085 -256218 -279893 -160374 171509 23400 173649 150263 14998 159774 82297 96221
9954I6221c29926B20434E1756K5246b4779j60264r5755j75187a28935q3640K5854
$$ 96221 -329926 220434 51756 77002 -24779 -185043 -280798 -455985 -128935 -212575 -186721
9943a86721A58642o6466k225a2475j95671a8456C28401c5070a3462E9657J8680
$$ -186721 158642 92176 89951 -12475 -208146 -18456 328401 -35070 -13462 59657 78337
9932G8337J05365d1253q8705A70174a15394I7699f0607G7847i1764j24145B15512
$$ 78337 183702 -41253 -129958 170174 -115394 97699 -60607 77847 -91764 -215909 215512
9920a10478A72658o8428a91119D8625K55555b93917E8173J53120L4646B3859a95441
$$ -110478 172658 104230 -191119 48625 304180 -293917 58173 211293 245939 23859 -195441
9908B7865g6757A51996a99432G109b73286A21125a41969l57044a89717d7399j13448
$$ 27865 -76757 151996 -199432 7109 -273286 121125 -141969 -499013 -189717 -47399 -160847
9897a60847K911A03425c27454A13972m1732a3260p2540j5777F5563b87341R9171
$$ -160847 -157936 103425 -327454 113972 72240 -13260 -85800 -101577 65563 -287341 -188170
9886a88170J4412L9419j98543J33244B68734D5768b81777l1436h8745C5054a07534
$$ -188170 -173758 -134339 -332882 -199638 268734 45768 -281777 -313213 -88745 35054 -107534
9874a78716k1751A45711a59772j16929P6131l9821k96411J72752j8171J81142
$$ -178716 -200467 145711 -159772 -276701 -200570 -240391 -536802 -364050 -382221 -201079
9864b01079C1975g1307b1303A31607a62706e2842j03120D6852A5768f0018j95753
$$ -201079 31975 -71307 -21303 131607 -162706 -52842 -155962 46852 15768 -60018 -255771
9853b55771A20375h9153A07910h045j08855A3953M1502b32603g3953D4533O9767
$$ -255771 120375 -89153 107910 -8045 -116900 13953 55455 -232603 -73953 44533 114300
9842A14300J41838H0800a37742j02851D6190J73238a59481f218l276k81995J10826
$$ 114300 256138 80800 -137742 -240593 46190 219428 -159481 -6218 -9494 -291489 -180663
9831a80663b4899c406j50876e1183A80179f7292K0933k75603A8971J12158a69872
$$ -180663 -24899 -3406 -154282 -51183 180179 -67292 -46359 -321962 18971 131129 -169872
9819D5318b91276K8756k64012J09226b07785A21534a24787N9752a9582j9586B42874
$$ 45318 -291276 -262520 -526532 -417306 -207785 121534 -124787 -65035 -19582 -39168 242874
9807a07542q3402C1116B539c00284c3727q0178d5463j94026A49605c06973J51139
$$ -107542 -190944 31116 2539 -300284 -33727 -113905 -45463 -239489 149605 -306973 -155834
9796a55834j8137A48627j0208b26893J01375A96196d34537H6099J02726j9166
$$ -155834 -173971 148627 138419 -226893 -125518 196196 -434537 86099 188825 169659
9786A69659a93765h0462J548p0063j18004g8433j41069j95459i1108A44555A5184
$$ 169659 -193765 -80462 -78914 -148977 -266981 -78433 -219502 -414961 -91108 144555 15184
9774A8770d4547j51953N8000O3864E6546L21694H8877c24879h4079j21610f8707
$$ 18770 -44547 -196500 -138500 -74636 56546 378240 88877 -324879 -84079 -205689 -68707
9762a70535Q0621j67791A32978d1278p8772r2888A328e7171A66899c91989A87811
$$ -170535 -89914 -257705 132978 -41278 -120050 -212938 1328 -57171 166899 -391989 187811
9750b10882C54345D6587a82368C31133b72409k73812B1132m550b9645l62655A40863
$$ -210882 354345 46587 -182368 331133 -272409 -546221 21132 16582 -29645 -392300 140863
9738a70598o9436e2373j30047O3226B07259b43024A96181b5505p9215j23101A01900
$$ -170598 -240034 -52373 -182420 -119194 207259 -243024 196181 -25505 -104720 -227821 101900
9726a61316j29890c7288A29278m5091A8119M10976l3771c53754a18740j55914
$$ -161316 -291206 -37288 129278 84187 18119 429095 395324 -353754 -118740 -274654
9716b74654J35361N3673H1663b3385j50498E5594k3014d636j45755n6359m3688
$$ -274654 -139293 -85620 81663 -23385 -173883 55594 32580 -4636 -150391 -206750 -250438
9705b50438A03513L3743c371k50157J1955n3789m2497B0890b6359j3449g938k86389
$$ -250438 103513 137256 -3371 -253528 -241573 -295362 -337859 20890 -26359 -39808 -7938 -294327
9693b94327j23616J43711a00442B0629c00569L2459f2379K2191A91083I5458i5787
$$ -294327 -417943 -274232 -100442 20629 -300569 -268110 -62379 -40188 191083 95458 -95787
9681C67564A3227a52566A23851N2365o4294b21625k8219c3323r071A53505B7892
$$ 367564 13227 -152566 123851 176216 111922 -221625 -249844 -33323 -42394 153505 27892
9669d0682H9908B0791J33118D4808j1203b09276f9022B58390c05049J41908a4445
$$ -40682 89908 20791 153909 44808 33605 -209276 -69022 258390 -305049 -163141 -14445
9657b560I0424f1374B63219a00747l53978h6359j25591i7144A64836d07043i3041
$$ -2560 90424 -61374 263219 -100747 -454725 -86359 -211950 -97144 164836 -407043 -93041
9645A69451a98029e3969j43934P7921b3268j41520J6902d1456k64920L0410J6464
$$ 169451 -198029 -53969 -197903 -119982 -23268 -164788 -147886 -41456 -306376 -275966 -259502
9634b59502a22895d4981j75442j71977M6690a0733j01755j5124e463j04837K8004
$$ -259502 -122895 -44981 -220423 -392400 -345710 -10733 -112488 -127612 -5463 -110300 -82296
9623h2296l18868A50898h2727q482j68186A18800B0864L44851b69235A95702a49717
$$ -82296 -401164 150898 -82727 -91209 -259395 118800 20864 365715 -269235 195702 -149717
9611I4385a37250q0465B5381g6643r0974A88462M3789c02649M8086H3530K1471
$$ 94385 -137250 -217715 25381 -76643 -167617 188462 232251 -302649 -254563 83530 105001
9600A05001b18286a567p0303D2673J11993F2906J09641i4251H4091l6495J27690
$$ 105001 -218286 -1567 -71870 42673 154666 62906 172547 -94251 84091 47596 175286
9589A75286a37920A03939i5608n5328K6967B78891a92628g2510C5346a27625G3610
$$ 175286 -137920 103939 -95608 -150936 -123969 278891 -192628 -72510 35346 -127625 73610
9577b67686A60020K1593a28569k07166a42011N3709A34568k3281m1177K6780d40801
$$ -267686 160020 181613 -128569 -335735 -142011 -88302 134568 111287 70110 96890 -440801
9565F4628a60776D2800i0237B37150b25827A92894b82502B7259J04721B3981b39852
$$ 64628 -160776 42800 -90237 237150 -225827 192894 -282502 27259 131980 23981 -239852
9553b57642B7362r452d3557l47992p5279E6891a97563B76377n0939i0130n9209
$$ -257642 27362 17910 -43557 -391549 -466828 56891 -197563 276377 225438 -90130 -149339
9542a49339I213Q9526b45771J7430H0633j5022b61197f2309K444f191p1901j46219
$$ -149339 9213 98739 -245771 -228341 80633 65611 -261197 -62309 -59865 -6191 -78092 -224311
9530b24311J07212A39942g2760j27727j16580d9922A99090n9972a51090I5919
$$ -224311 -117099 139942 -72760 -200487 -317067 -49922 199090 139118 -151090 95919
9519C55765A02038h1971J0610l5198G3096c06240G4898P9735j3828i05k73020
$$ 355765 102038 -81971 -71361 -106559 73096 -306240 74898 154633 140805 -905 -273925
9508b73925Q2667A3893J44465p5119B9806b62191D0989b9852I3808h2092C53680
$$ -273925 -191258 13893 158358 83239 29806 -262191 40989 -29852 93808 -82092 353680
9496G5123K054b28111A48935a38288D9384k4450K208a89841G7720L7857m3381
$$ 75123 77177 -228111 148935 -138288 49384 24934 27142 -189841 77720 115577 72196
9485G2196a04579b9879k50439i6736a4139j71434j84180B7918a3640n4724D2623
$$ 72196 -104579 -29879 -280318 -96736 -14139 -185573 -369753 27918 -13640 -68364 42623
9473e16666A28819g8313p9897M9910N87j39052D86c0289H7883a48601N3435j9082
$$ -516666 128819 -78313 -158210 -108300 -107713 -246765 486 -30289 87883 -148601 -95166 -114248
9461a14248j7554n1519n4008D9500a57911A43957c34594A69116a69653g9195A05569
$$ -114248 -131802 -183321 -237329 49500 -157911 143957 -334594 169116 -169653 -79195 105569
9449c3985j27558e2265D4747K32188b62182D2622b96494A5300J46676G7140A8315
$$ -33985 -161543 -52265 44747 276935 -262182 42622 -296494 15300 161976 77140 18315
9437B8967b57286J20745j06534f6421p9247I333a13601k158n7278A33479d7868
$$ 28967 -257286 -136541 -243075 -66421 -145668 9333 -113601 -115759 -173037 133479 -47868
9425a83349o6886j28990A05737j9062D402Q8498D0641Q6641C4949b81095P6589
$$ -183349 -250235 -379225 105737 86675 4402 92900 40641 127282 34949 -281095 -204506
9414b04506J9919l8650F267K36201f00691A98986N0868c82119D4119a46799A42361
$$ -204506 -184587 -223237 6267 242468 -600691 198986 249854 -382119 44119 -146799 142361
9402g6771B44659N789o9131a6190p2845J4247q4609B2294c14125a33166K189A03808
$$ -76771 244659 250448 181317 -16190 -89035 -74788 -159397 22294 -314125 -133166 -130977 103808
9389B75049a2873j19985f34I5271b76003K4488Q8753F3658a65863A83263a04455
$$ 275049 -12873 -132858 -634 95271 -276003 -251515 -162762 63658 -165863 183263 -104455
9377c16598o573n0349k312b2769F1451J2185a87430A81989b56797l506J08304
$$ -316598 -323171 -373520 -375832 -22769 61451 73636 -187430 181989 -256797 -260303 -151999
9366a51999A08119j5013b65989K7873J05911K8058a6335j52A68548a17581D8103
$$ -151999 108119 93106 -265989 -238116 -132205 -104147 -16335 -16487 168548 -117581 48103
9354a32797J0428L916F7208a3150J41A40183a94482k08619e3609j23365j5216
$$ -132797 -122369 -118453 67208 -13150 -13009 140183 -194482 -403101 -53609 -176974 -192190
9343a92190F8228J19632a75751j0394j64983B8185b9661a1926k9561I3972B0336
$$ -192190 68228 187860 -175751 -186145 -351128 28185 -29661 -11926 -41487 93972 20336
9331C791a53014C6110d01434j66551A35965R8043b38954A16373c9328j36885F1067
$$ 3791 -153014 36110 -401434 -567985 135965 234008 -238954 116373 -39328 -176213 61067
9319a22084G9953J22692a80991J1938m1342O1137q1226i6983B6180g1485A96290
$$ -122084 79953 202645 -180991 -169053 -210395 -149258 -230484 -96983 26180 -71485 196290
9307b74517d7685j94254a17823A22591a16368A38791e7617j39950Q205b2441A669
$$ -274517 -47685 -241939 -117823 122591 -116368 138791 -57617 -197567 -189362 -22441 1669
9295c11312J27175h4702A0152K08637b20204j5987i5738j69752a6347q27421a42922
$$ -311312 -184137 -84702 10152 218789 -220204 -236191 -95738 -265490 -16347 -843768 -142922
9283I0702c8130C51594a608o140j4499E5795R025h1912A59641e8754m6186B29976
$$ 90702 -38130 351594 -1608 -7748 -22247 55795 64820 -81912 159641 -58754 -104940 229976
9270b02732C9464d4217j42396N8134j39126g4673G7521K5839J170I621M21375
$$ -202732 39464 -44217 -186613 -128479 -267605 -74673 77521 103360 104530 9621 430996
9259D30996I5780b93831A57602a9751E00782a58896A0102b17443B6855f4457A32404
$$ 430996 95780 -293831 157602 -19751 500782 -158896 10102 -217443 26855 -64457 132404
9247g1807k36227A37090A6283b11983H0861L7207o820P4493P1848i4907A06077
$$ -71807 -308034 137090 16283 -211983 80861 118068 111248 185741 257589 -94907 106077
9235G236g3380J7807I7090j0705l9842M3539b78502d2445A29690D1100b14037
$$ 7236 -73380 -55573 97090 86385 46543 90082 -278502 -42445 129690 41100 -214037
9223b59058J09048k05685a8741l23213E5523J63992a55788d4518H1483N0889b23385
$$ -259058 -150010 -355695 -18741 -341954 55523 219515 -155788 -44518 81483 132372 -223385
9211b36680k29493a06327l7879A53319C3297a32890g541A43885a41254B918N9207
$$ -236680 -466173 -106327 -144206 153319 33297 -132890 -7541 143885 -141254 2918 62125
9200F2125D956d06295a20993l4219K1025B4214h6729j05786B0306J72656b43151
$$ 62125 4956 -406295 -120993 -155212 -134187 24214 -86729 -192515 20306 192962 -243151
9188a27837K6049M3308j0620K0553J7841o1825j35274K7800b648j7856B34407
$$ -127837 -101788 -58480 -69100 -48547 -30706 -92531 -227805 -200005 -2648 -20504 234407
9176c64291a39226c2804p7688j39098i1711l42461i2493E9494a56892A9851J73498
$$ -364291 -139226 -32804 -110492 -249590 -91711 -434172 -92493 59494 -156892 19851 193349
9165A93349a04911C28578b79356A55674c68442B13705g9461G9270h5231r0806
$$ 193349 -104911 328578 -279356 155674 -368442 213705 -79461 79270 -85231 -176037
9155a76037f044j1341l94328h9084M0544A06945a62991P0634j0571K2384c1074
$$ -176037 -6044 -17385 -411713 -89084 -48540 106945 -162991 -92357 -102928 -80544 -31074
9143c2044l29107G5866b0819A66913C3178a00375J631k35792J63393k47081E8028
$$ -32044 -361151 75866 -20819 166913 33178 -100375 -98744 -334536 -171143 -418224 58028
9131E1001c18714f8300A20560a73371O4608n7833A2868i8740M2696J3046B7550
$$ 51001 -318714 -68300 120560 -173371 -108763 -166596 12868 -98740 -56044 -42998 27550
9119a55763k19848a14927j40511A46286J50061A08873d6731H6283c40787A28419
$$ -155763 -375611 -114927 -255438 146286 296347 108873 -46731 86283 -340787 128419
9108I0994A3728a32816k4471A01786a56755A59249a22611G237J01780B6972a05543
$$ 90994 13728 -132816 -157287 101786 -156755 159249 -122611 7237 109017 26972 -105543
9096A36381b96970f0516k4713r8408m7451J05177e5625C1542M9494Q5879m7201
$$ 136381 -296970 -60516 -85229 -183637 -231088 -125911 -55625 31542 81036 166915 119714
9085A19714A3660b3703B0423b01156r987Q7619b9502j71833g5920B28510c93456
$$ 119714 13660 -23703 20423 -201156 -211143 -123524 -29502 -201335 -75920 228510 -393456
9073a64509j00468E3568K57655a47256B0166O1907B2777b05472O3719C0891a54851
$$ -164509 -264977 53568 311223 -147256 20166 82073 22777 -205472 -141753 30891 -154851
9061I3882J10265a05327R634A66651b16576A58236a96048H9442f8978H5386g1661
$$ 93882 204147 -105327 -95693 166651 -216576 158236 -196048 89442 -68978 85386 -71661
9049D818a05370l7357a228B4774a52186g5986k1261j71062r3700N5101J49444
$$ 4818 -105370 -142727 -1228 24774 -152186 -75986 -97247 -268309 -362009 -306908 -157464
9038a57464j5667O7217o5698c5892k85414P8996g5480D03822g2852K6362A56384
$$ -157464 -173131 -105914 -171612 -35892 -321306 -242310 -75480 403822 -72852 -46490 156384
9026H6889b4476l37760f2549j96084D1530J17706c43837h0704j30316k04380b05739
$$ 86889 -24476 -362236 -62549 -258633 41530 159236 -343837 -80704 -211020 -415400 -205739
9014d60478J91645a16710o3395m2097C01127i1361A78446a53820H0060a81782
$$ -460478 -268833 -116710 -180105 -222202 301127 -91361 178446 -153820 80060 -181782
9003b11943l0477a03031m0545I725f3886k36574A32195a23689d4325C35075b33984
$$ -211943 -242420 -103031 -143576 9725 -63886 -300460 132195 -123689 -44325 335075 -233984
8991g8546l8760M8953q1391d1798D4663a4442B1822J97435c5600B19302e4357
$$ -78546 -117306 -68353 -149744 -41798 44663 -14442 21822 219257 -35600 219302 -54357
8979a06841C96047j79626b02650q4584b2395l21903D498d67414K01730C00183
$$ -106841 396047 216421 -202650 -287234 -22395 -344298 4498 -467414 -265684 300183
8968B07500D8388a55511E9348a72821C0197c6926g441k89867F154Q6470B3290
$$ 207500 48388 -155511 59348 -172821 30197 -36926 -7441 -297308 6154 92624 23290
8956A39320c3117j31645f4955D0885K93157H0687N330B0177e7667A82563H7014
$$ 139320 -33117 -164762 -64955 40885 334042 80687 86017 20177 -57667 182563 87014
8944a66094B07323I9066c26095h2876A81307q9781c97244a18343B76750J23234
$$ -166094 207323 99066 -326095 -82876 181307 91526 -397244 -118343 276750 399984
8934C99984j64278q5869J3669m1984g9360k60951D28249n0446M72803P11155O55589
$$ 399984 235706 149837 163506 121522 -79360 -340311 428249 377803 850606 1561761 2217350
8923B217350K551628J0223318J739509D627593A396041F71169j41367B13219q7991
$$ 2217350 4768978 14992296 16731805 4627593 1396041 671169 529802 213219 125228
8914A25228P5363H512h339k01075D35423j40926D9332K99882c61723a14854a5943
$$ 125228 200591 8512 -8339 -209414 435423 294497 49332 349214 -361723 -114854 -15943
8902a44504L9523j08281r2760J22674M4927n6217a3381k76601K5032C54519l9076
$$ -144504 -104981 -213262 -306022 -183348 -138421 -194638 -13381 -289982 -264950 354519 315443
8891C15443j50926n1019l7649P5331K87599a63595L7364d7616a8897j72290A75146
$$ 315443 164517 113498 75849 151180 438779 -163595 -126231 -47616 -18897 -191187 175146
8879a89018L1964A51198e57321a2006j08186j2447b0485k60717N194P4015B442
$$ -189018 -157054 151198 -557321 -12006 -120192 -132639 -20485 -281202 -276008 -201993 2442
8867h3610E3015d112j39457D9606N7438c5579A91367D4737a65919L9138A14978
$$ -83610 53015 -4112 -143569 49606 107044 -35579 191367 44737 -165919 -126781 114978
$$ [...]
##END NTUPLES=NMR SPECTRUM
##END=
