
##TITLE=UV1221_M6_1234-1212_5_7241637_SVRYwP0Gcb
##JCAMPDX= 6.0         $$ Bruker NMR JCAMP-DX V2.0
##DATA TYPE= NMR SPECTRUM
##DATA CLASS= NTUPLES
##ORIGIN= BRUKER
##OWNER= Administrator
$$ 1.72 TOPSPIN		Version 2.1
$$ 2013-01-17 23:04:19.671 -0500  Administrator@X
$$ Compression mode = diff/dup
##.OBSERVE FREQUENCY= 400.02188249412
##.OBSERVE NUCLEUS= ^1H
##.ACQUISITION MODE= SIMULTANEOUS (DQD)
##.ACQUISITION SCHEME= undefined
##.AVERAGES= 64
##.DIGITISER RES= 22
##SPECTROMETER/DATA SYSTEM= spect
##.PULSE SEQUENCE= noesygpps1d.comp
##.SOLVENT NAME= COFFEE_meoh
##.SHIFT REFERENCE= INTERNAL, COFFEE_meoh, 1, 14.96091
##AUDIT TRAIL= $$ (NUMBER, WHEN, WHO, WHERE, PROCESS, VERSION, WHAT)
$$ ##TITLE= Audit trail, TOPSPIN		Version 2.1
$$ ##JCAMPDX= 5.01
$$ ##ORIGIN= Bruker BioSpin GmbH
$$ ##OWNER= Administrator
$$ $$ E:\/data/COFFEE/nmr/UV1221_M6_1234-1212_5_7241637_SVRYwP0Gcb/22/pdata/1/auditp.txt
$$ ##AUDIT TRAIL=  $$ (NUMBER, WHEN, WHO, WHERE, PROCESS, VERSION, WHAT)
(   1,<2013-01-17 23:04:14.093 -0500>,<Administrator>,<X>,<go>,<TOPSPIN 2.1>,
      <created by zg
	started at 2013-01-17 22:52:44.390 -0500,
	POWCHK enabled, PULCHK disabled,
       configuration hash MD5:
       86 BA 57 50 F2 9D 5C 9B 26 00 A9 28 5F 66 2E 89
       data hash MD5: 64K
       2C CB 05 21 EF 80 B9 74 75 8C FE C3 57 49 15 7C>)
(   2,<2013-01-17 23:04:17.093 -0500>,<Administrator>,<X>,<proc1d>,<TOPSPIN 2.1>,
      <Start of raw data processing
       efp LB = 0.3 FT_mod = 6 PKNL = 1 PHC0 = 0 PHC1 = 0 SI = 128K 
       data hash MD5: 128K
       E7 33 93 5C FC EA B1 B1 3A 71 85 F1 5D 03 C6 D9>)
(   3,<2013-01-17 23:04:18.093 -0500>,<Administrator>,<X>,<proc1d>,<TOPSPIN 2.1>,
      <pk PHC0 = -81.87012 PHC1 = 0 
       data hash MD5: 128K
       6C C4 99 36 14 74 F3 16 C6 BA 0C B8 70 EC EE 94>)
(   4,<2013-01-17 23:04:18.781 -0500>,<Administrator>,<X>,<proc1d>,<TOPSPIN 2.1>,
      <abs ABSG = 1 
       data hash MD5: 128K
       6E D5 02 19 06 38 88 87 C0 94 4C AF 88 AC 1C 61>)
(   5,<2013-01-17 23:04:18.937 -0500>,<Administrator>,<X>,<proc1d>,<TOPSPIN 2.1>,
      <abs ABSG = 2 
       data hash MD5: 128K
       CD C4 43 18 AD 61 F7 6D DE 35 BB 8F 59 CB B2 C1>)
(   6,<2013-01-17 23:04:19.093 -0500>,<Administrator>,<X>,<proc1d>,<TOPSPIN 2.1>,
      <abs ABSG = 3 
       data hash MD5: 128K
       92 03 2D ED DD BE 2E 5D F5 A6 89 27 F0 D9 55 E8>)
(   7,<2013-01-17 23:04:19.265 -0500>,<Administrator>,<X>,<proc1d>,<TOPSPIN 2.1>,
      <abs ABSG = 4 
       data hash MD5: 128K
       6F 7B DD C6 56 CD 0C 8D 29 10 12 B1 8B 69 C3 5C>)
(   8,<2013-01-17 23:04:19.406 -0500>,<Administrator>,<X>,<proc1d>,<TOPSPIN 2.1>,
      <abs ABSG = 5 
       data hash MD5: 128K
       42 04 B5 83 F6 4A 6C F9 51 9C 86 69 C8 E7 F5 F6>)
$$ ##END=
$$ 
$$ $$ hash MD5
$$ $$ 1C 53 39 C5 2A 63 CF 89 A3 A8 45 0D 17 C8 58 F5
##$RELAX= 
##$RELAX= 
##$RELAX= 
##$RELAX= 
##$RELAX= 
##$RELAX= 
##$RELAX= 
##$RELAX= 
$$ Bruker specific parameters
$$ --------------------------
##$DU= <E:\>
##$EXPNO= 22
$$ [...]
##$TP07= 0
##$TPNAME0= <>
##$TPNAME1= <>
##$TPNAME2= <>
##$TPNAME3= <>
##$TPNAME4= <>
##$TPNAME5= <>
##$TPNAME6= <>
##$TPNAME7= <>
##$TPOAL= (0..7)
0.5 0.5 0.5 0.5 0.5 0.5 0.5 0.5
##$TPOFFS= (0..7)
0 0 0 0 0 0 0 0
##$TUNHIN= 0
##$TUNHOUT= 0
##$TUNXOUT= 0
##$USERA1= <user>
##$USERA2= <user>
##$USERA3= <user>
##$USERA4= <user>
##$USERA5= <user>
##$V9= 5
##$VALIST= <valist>
##$VCLIST= <CCCCCCCCCCCCCCC>
##$VD= 0
##$VDLIST= <DDDDDDDDDDDDDDD>
##$VPLIST= <PPPPPPPPPPPPPPP>
##$VTLIST= <TTTTTTTTTTTTTTT>
##$WBST= 1024
##$WBSW= 4
##$XGAIN= (0..3)
0 0 0 0
##$XL= 0
##$YL= 0
##$YMAX_a= 6324822
##$YMIN_a= -13533205
##$ZGOPTNS= <>
##$ZL1= 120
##$ZL2= 120
##$ZL3= 120
##$ZL4= 120
##$ABSF1= 14.96091
##$ABSF2= -5.597272
##$ABSG= 5
##$ABSL= 3
##$ALPHA= 0
##$AQORDER= 0
##$ASSFAC= 0
##$ASSFACI= 0
##$ASSFACX= 0
##$ASSWID= 0
##$AUNMP= <proc_prof1d_extract.lims>
##$AXLEFT= 0
##$AXNAME= <>
##$AXNUC= <1H>
##$AXRIGHT= 0
##$AXTYPE= 0
##$AXUNIT= <>
##$AZFE= 0.1
##$AZFW= 0.1
##$BCFW= 0
##$BC_mod= 0
##$BYTORDP= 0
##$COROFFS= 0
##$CY= 15
##$DATMOD= 1
##$DC= 0
##$DFILT= <>
##$DTYPP= 0
##$F1P= 0
##$F2P= 0
##$FCOR= 0.5
##$FTSIZE= 131072
##$FT_mod= 6
##$GAMMA= 0
##$GB= 0
##$INTBC= 1
##$INTSCL= 1
##$ISEN= 128
##$LB= 0.3
##$LEV0= 0
##$LPBIN= 0
##$MAXI= 10000
##$MC2= 0
##$MEAN= 0
##$ME_mod= 0
##$MI= 0
##$NCOEF= 0
##$NC_proc= -2
##$NLEV= 6
##$NOISF1= 0
##$NOISF2= 0
##$NSP= 0
##$NTH_PI= 0
##$NZP= 0
##$OFFSET= 14.96091
##$PC= 1
##$PHC0= -81.87012
##$PHC1= 0
##$PH_mod= 1
##$PKNL= yes
##$PPARMOD= 0
##$PPDIAG= 0
##$PPIPTYP= 0
##$PPMPNUM= 2147483647
##$PPRESOL= 1
##$PSCAL= 4
##$PSIGN= 0
##$PYNMP= <proc.py>
##$REVERSE= no
##$SF= 400.020009671536
##$SI= 131072
##$SIGF1= 0
##$SIGF2= 0
##$SINO= 400
##$SIOLD= 131072
##$SPECTYP= <>
##$SREGLST= <1H.CDCl3>
##$SSB= 0
##$STSI= 131072
##$STSR= 0
##$SW_p= 8223.68421052631
##$SYMM= 0
##$S_DEV= 0
##$TDeff= 65536
##$TDoff= 0
##$TI= <>
##$TILT= no
##$TM1= 0
##$TM2= 0
##$TOPLEV= 0
##$USERP1= <user>
##$USERP2= <user>
##$USERP3= <user>
##$USERP4= <user>
##$USERP5= <user>
##$WDW= 1
##$XDIM= 131072
##$YMAX_p= 417846633
##$YMIN_p= -28857
##$CURPLOT= <Network HP LaserJet P1505>
##$CURPRIN= <$Network HP LaserJet P1505>
##$DFORMAT= <normdp>
##$LAYOUT= <+/1D_H.xwp>
##$LFORMAT= <normlp>
##$PFORMAT= <normpl>
##$SURQMSG= 1
$$ End of Bruker specific parameters
$$ ---------------------------------
##NTUPLES= NMR SPECTRUM
##VAR_NAME=  FREQUENCY,     SPECTRUM/REAL,   SPECTRUM/IMAG
##SYMBOL=    X,             R,               I
##VAR_TYPE=  INDEPENDENT,   DEPENDENT,       DEPENDENT
##VAR_FORM=  AFFN,          ASDF,            ASDF
##VAR_DIM=   131072,        131072,          131072
##UNITS=     HZ,            ARBITRARY UNITS, ARBITRARY UNITS
##FACTOR=    0.0627417313425164, 1,          1
##FIRST=     8223.62146879497, -1451,        -67472
##LAST=      0,             676,             -68787
##MIN=       0,             -28857,          0
##MAX=       8223.62146879497, 417846633,    0
$$ Real data points
##PAGE= N=1
##DATA TABLE= (X++(R..R)), XYDATA
$$ [...]
61581C19389o78j46m30j248j634j115k71P8j50m62n68n60n14l83j98n0Q2J97J48
61562C11487k1J02P29J360J396R89P16O50M80L70P59J311J126K73M7J168K577
61545C25519K763J680N41J47K82M86O39Q11J130J856L043M087M116L010J639R31
61529C52680Q96Q18K44m64o89m64n52j429k583l137k967k694k581k108q86N53
61513C34637J301J076L72j82l12j56j00m39j023j361j193p44l79k92n85j209j688
61496C27723j456o38n0q7j90J71O00M72L2j6L43N61N88Q95J431J558J191J139
61478C34267J839K583K518J856J370J164P85K73K86J016J707J568O85k55p58p62
61462C50142l76J56M55L80K44L65N08K39k51k96K57P64P26M71N37Q83J191J506
$$ y = [319389, 318711, 318565, 318135, 316887, 315253, 314138, 313867, 313945, 313795, 313333, 312765, 312205, 311691, 311308, 311110, 311060, 311142, 311339, 311487, 311466, 311568, 312297, 313657, 315053, 316042, 316758, 317408, 317888, 318258, 319017, 320328, 321454, 321727, 321774, 322942, 325519, 328282, 329962, 330503, 330650, 330932, 331418, 332057, 332868, 333998, 335854, 338897, 342984, 347100, 350110, 351749, 352680, 353576, 354394, 354638, 354174, 353485, 353021, 352469, 351040, 348457, 345320, 342353, 339659, 337078, 334970, 334084, 334637, 335938, 337014, 337386, 337204, 336892, 336736, 336636, 336197, 335174, 333813, 332620, 331876, 331497, 331205, 330620, 329411, 327723, 326267, 325629, 325579, 325492, 325302, 325473, 326073, 326545, 326577, 326561, 326904, 327465, 328053, 328948, 330379, 331937, 333128, 334267, 336106, 338689, 341207, 343063, 344433, 345597, 346382, 346655, 346941, 347957, 349664, 351232, 351917, 351662, 350904, 350142, 349766, 349922, 350377, 350757, 351001, 351366, 351874, 352113, 351862, 351566, 351823, 352587, 353313, 353784, 354321, 355204, 356395, 357901]
61444C57901J973K296K069J524J314J609J995K243K558L009L340L449L504L414
61430C92198K812J801J089J066J276J224J151J523K152K457K303K106K185K477
61416D17820K787K917K646J975J302J053J126J014M20m81j306j759j769j636j847
61401D24262k520l128l113k644k346k446k575k454k180j823j242n66l26p83j416
61386C94700j546j205r63j009r33m78JJ05K1K73J011J875K473K663K441J908J381
61369D02718J212J381J515J401J218J135R84N96J92J60O22J475K670M089N304
61354D26672N835N676N333N292N699O469P423Q324R007R458R608R134P780N853
61340E27563M162L357L489M127M687M729M198L396K584J672N10o23j246j350j513
$$ y = [357901, 359874, 362170, 364239, 365763, 367077, 368686, 370681, 372924, 375482, 378491, 381831, 385280, 388784, 392198, 395010, 396811, 397900, 398966, 400242, 401466, 402617, 404140, 406292, 408749, 411052, 413158, 415343, 417820, 420607, 423524, 426170, 428145, 429447, 430500, 431626, 432640, 433060, 432579, 431273, 429514, 427745, 426109, 424262, 421742, 418614, 415501, 412857, 410511, 408065, 405490, 403036, 400856, 399033, 397791, 397225, 396899, 396116, 394700, 393154, 391949, 390986, 389977, 389044, 388566, 388567, 388672, 388693, 388966, 389977, 391852, 394325, 396988, 399429, 401337, 402718, 403930, 405311, 406826, 408227, 409445, 410580, 411564, 412160, 412352, 412512, 413134, 414609, 417279, 421368, 426672, 432507, 438183, 443516, 448808, 454507, 460976, 468399, 476723, 485730, 495188, 504796, 513930, 521710, 527563, 531725, 535082, 538571, 542698, 547385, 552114, 556312, 559708, 562292, 563964, 564474, 563851, 562605, 561255, 559742]
61325E59742k179l075l536l246k553k002j705j284n08K61N65O64J281K521L699
61310E48645M416N110O066O712O585O397P137Q533R449R550R533R696R359P896
61296F55084N466K435j030m446o845p722p620p482p777q409r030r192q665p813
61282E76954p212o852o226n227m263l457k408j008K97J348K580M123N331N666
61268E59646N444N207N061N050N555O588P316O989O055N661O321P604Q859R742
61254F51098J0136J0088R716Q976P643N822M105K909J979Q19o54k154l435m409
61240G02639n107n702o289o594o260n493m859m403l689k748k220k217k010j248
61226F43800n46k72L68K127M370N808O067N688N074M342L834L865M208M514M942
$$ y = [559742, 557563, 554488, 550952, 547706, 545153, 543151, 541446, 540162, 539654, 539915, 540480, 541144, 542425, 544946, 548645, 553061, 558171, 564237, 570949, 577534, 583931, 591068, 599601, 609050, 618600, 628133, 637829, 647188, 655084, 660550, 662985, 661955, 657509, 650664, 642942, 635322, 627840, 620063, 611654, 602624, 593432, 584767, 576954, 569742, 562890, 556664, 551437, 547174, 543717, 541309, 540301, 540598, 541946, 544526, 548649, 553980, 559646, 565090, 570297, 575358, 580408, 585963, 592551, 599867, 606856, 612911, 618572, 624893, 632497, 641356, 651098, 661234, 671322, 681038, 690014, 697657, 703479, 707584, 710493, 712472, 713291, 712637, 710483, 707048, 702639, 697532, 691830, 685541, 678947, 672687, 667194, 662335, 657932, 654243, 651495, 649275, 647058, 645048, 643800, 643254, 642982, 643350, 645477, 649847, 655655, 661722, 667410, 672484, 676826, 680660, 684525, 688733, 693247, 698189]
61211F98189N631N958N258L898K788K069J268N49O86J686K526K552K387L090M918
61196G43453P252R329J0870J2241J4028J6200J7856J8202J7500J6551J5416J3461
61184I12359J0600P756N778M526L347K088J167Q37O56j15j628l134l886m257n396
61169I30698p555r520j0137r915j0327j1850j3493j4218j4123j4073j4657j5671
61157G85159j6408j6360j5622j4575j3244j1327q882o436m249k105p2J224J481
61144F78584J181O98l28k121m034n394o365p189p331o327m838l778k933j567J49
61129F28407J538K810M647O730Q075Q859J0361J2989J5602J7239J8285J9562K1238
61116G76342K3093K4952K6466K7241K7524K8006K8758K9064K8583K7746K6876
$$ y = [698189, 703820, 709778, 715036, 718934, 721722, 723791, 725059, 725608, 726294, 727980, 730506, 733058, 735445, 738535, 743453, 750705, 760034, 770904, 783145, 797173, 813373, 831229, 849431, 866931, 883482, 898898, 912359, 922959, 930715, 936493, 941019, 944366, 946454, 947621, 948458, 949114, 948999, 947371, 944237, 940351, 936094, 930698, 923143, 913623, 903486, 893571, 883244, 871394, 857901, 843683, 829560, 815487, 800830, 785159, 768751, 752391, 736769, 722194, 708950, 697623, 688741, 682305, 678056, 675951, 675879, 677103, 678584, 679765, 680463, 680135, 678014, 673980, 668586, 662221, 655032, 647701, 641374, 636536, 632758, 629825, 628258, 628407, 629945, 632755, 637402, 644132, 652207, 661066, 671427, 684416, 700018, 717257, 735542, 755104, 776342, 799435, 824387, 850853, 878094, 905618, 933624, 962382, 991446, 1020029, 1047775, 1074651]
61105A074651K5700K3988K1905J9478J6538J3386J0608P932M255q21o229j0691
61093A200700j3994j6679j9269k2119k5246k7868k8955k8631k8153k8179k7972
61082I33635k6878k5463k4403k3237k1299j9107j7635j6707j5299j3247j1470
61071G18890j0447r468p671n201k993j721j197o31N67K142L351L930M401N180
61057F99132N931O240O533P639R617J1634J3035J3973J4889J5869J6787J7718
61045H38997J8894K0398K2140K4110K6373K8846L1196L3171L4799L6120L6899
61034A151943L6961L6768L7229L8849M1330M4091M6758M9063N0803N2135N3458
61023A639388N4750N5555N5911N6675N8630O1963O7040P4780Q5465R8007J11275
$$ y = [1074651, 1100351, 1124339, 1146244, 1165722, 1182260, 1195646, 1206254, 1214186, 1218441, 1217620, 1211391, 1200700, 1186706, 1170027, 1150758, 1128639, 1103393, 1075525, 1046570, 1017939, 989786, 961607, 933635, 906757, 881294, 856891, 833654, 812355, 793248, 775613, 758906, 743607, 730360, 718890, 708443, 698975, 691304, 686103, 683110, 681389, 680192, 679561, 680128, 682270, 685621, 689551, 693952, 699132, 705063, 711303, 717836, 725475, 735092, 746726, 759761, 773734, 788623, 804492, 821279, 838997, 857891, 878289, 900429, 924539, 950912, 979758, 1010954, 1044125, 1078924, 1115044, 1151943, 1188904, 1225672, 1262901, 1301750, 1343080, 1387171, 1433929, 1482992, 1533795, 1585930, 1639388, 1694138, 1749693, 1805604, 1862279, 1920909, 1982872, 2049912, 2124692, 2210157, 2308164, 2419439]
61012B419439J25535J41722J60183J81318K06670K38002K75908L20799L74718
61003D444294M40627N20659O17176P34965Q80029J056491J266853J511987J780480
60994A3253561K029877K181911K149606J884339J409900Q21545K54520j60415
60986B3824844l40319k80854o1445J82373L09325K22113j02664o09768j183902
60977B1959703j689186k019907k138592k077347j903675j680197j446595j224190
60969G780014j024532q51741p03866n77769m72419l86846l17733k61417k16487
60960B967204j82242j55970j34095j15189r9692q7172p5880o4798n4310m4766
60950A953090l5901k7962k2085j8988j8064j8100j8384j8963k0255k2368k4623
$$ y = [2419439, 2544974, 2686696, 2846879, 3028197, 3234867, 3472869, 3748777, 4069576, 4444294, 4884921, 5405580, 6022756, 6757721, 7637750, 8694241, 9961094, 11473081, 13253561, 15283438, 17465349, 19614955, 21499294, 22909194, 23730739, 23985259, 23824844, 23484525, 23203671, 23142226, 23324599, 23633924, 23856037, 23753373, 23143605, 21959703, 20270517, 18250610, 16112018, 14034671, 12130996, 10450799, 9004204, 7780014, 6755482, 5903741, 5199875, 4622106, 4149687, 3762841, 3445108, 3183691, 2967204, 2784962, 2628992, 2494897, 2379708, 2280016, 2192844, 2116964, 2052166, 1997856, 1953090, 1917189, 1889227, 1867142, 1848154, 1830090, 1811990, 1793606, 1774643, 1754388, 1732020, 1707397]
60939A707397k6019k6513k7324k9442l2340l4769l6268l7237l7970l8406l8511
60928A342598l8219l7364l6108l5038l4242l2944l0754k8582k7432k6906k5918
60917I89091k4409k3189k2391k1273j9500j7577j5904j4294j2569j0930r587q547
60905G88921p739o965n881m538l604l586m006l990l397k777k548k758l324l876
60891G29932l796l087k765l585m852n419n382n717o543p028o966p127p856q421
60877F51388q114p126o026n159m876n564o961q028p953o887n491m221l332l065
60863E68585l390l798l753l334l137l474l820l287j792m26k88j125j752j665j463
60848E32081j580j636j378j281j641j955j909j991k407k386j582j229k517m607
$$ y = [1707397, 1681378, 1654865, 1627541, 1598099, 1565759, 1530990, 1494722, 1457485, 1419515, 1381109, 1342598, 1304379, 1267015, 1230907, 1195869, 1161627, 1128683, 1097929, 1069347, 1041915, 1015009, 989091, 964682, 941493, 919102, 897829, 878329, 860752, 844848, 830554, 817985, 807055, 797468, 788921, 781182, 774217, 768336, 763798, 760194, 756608, 752602, 748612, 745215, 742438, 739890, 737132, 733808, 729932, 726136, 723049, 720284, 716699, 711847, 706428, 701046, 695329, 688786, 681758, 674792, 667665, 659809, 651388, 643274, 636148, 630122, 624963, 620087, 614523, 607562, 599534, 591581, 584694, 579203, 574982, 571650, 568585, 565195, 561397, 557644, 554310, 551173, 547699, 543879, 540592, 538800, 538374, 538086, 536961, 535209, 533544, 532081, 530501, 528865, 527487, 526206, 524565, 522610, 520701, 518710, 516303, 513917, 512335, 511106, 508589, 503982]
60834E03982n582m980m003l515l232k744k052j092J37J093J336J470K266L155
60820D86239K902J662Q43R46R66K51n57p97p12n76j68L85L22n04j143r49n54q02
60802D87754j555k189k543k721k586k109j700j699j981k402l055l751l961l659
60788D51843l573m129m788m891m524m015l241k045q98m33o13r25j193j694k497
60773D12384l095k869j810p16m17p18n34O45J918K247K016K418L614M611M811
60758D24505M612M348L852L209K858K651J898O57q3N0K59P3K11J218K291K381
60742D54990J651Q63M6j244k885m353n564o677p390p229o319n305m626m379m546
60727C97033m876m868m381l933l969m148l835k917j692m05O17Q79L31l16m21k10
$$ y = [503982, 498400, 493420, 489417, 485902, 482670, 479926, 477874, 476782, 476919, 478012, 479348, 480818, 483084, 486239, 489141, 490803, 491646, 492592, 493558, 493809, 493252, 492455, 491743, 491167, 490999, 491384, 491706, 491202, 490059, 489110, 488556, 487754, 486199, 484010, 481467, 478746, 476160, 474051, 472351, 470652, 468671, 466269, 463214, 459463, 455502, 451843, 448270, 444141, 439353, 434462, 429938, 425923, 422682, 420637, 419739, 419306, 418693, 417768, 416575, 414881, 412384, 409289, 406420, 404610, 403894, 403477, 402759, 402225, 402870, 404788, 407035, 409051, 411469, 415083, 419694, 424505, 429117, 433465, 437317, 440526, 443384, 446035, 447933, 448590, 448507, 448557, 448816, 448889, 449100, 450318, 452609, 454990, 456641, 457504, 457550, 456306, 453421, 449068, 443504, 436827, 429437, 422208, 415889, 410584, 405958, 401579, 397033, 392157, 387289, 382908, 378975, 375006, 370858, 367023, 364106, 362414, 362009, 362626, 363505, 363836, 363520, 363099, 362889]
60711C62889k13m13n57q54j507j925j311P3J092J151P67O33Q31J106J314J353
60695C64429J141R17J219K267L572M402M522M288M125M048L804L359L063L225
60681D08381L690M102M413M883N527N933N676M719L418K340J959K217K436K036
60667D61730J127J25r89k388l694m264m158m045m137m021l614l369l317k875j931
60652D20180j260j364j687j501q84j93O16J560K071J678P35j17p96j534k253k841
60636D12410l525m315m474l356j537l35k46n23l35K34M95Q5o09q76m98RJ27J27
60618C92858N94J371J642J167N72K46j85r25j394j120m57J09O47J181J199N14
60602C98019j13k5L12J70j58O5P12J125J366K016K903L129K392J427J047J352
$$ y = [362889, 362676, 362263, 361706, 360852, 359345, 357420, 356109, 356182, 357274, 358425, 359192, 359825, 360656, 361762, 363076, 364429, 365570, 366487, 367706, 369973, 373545, 377947, 382469, 386757, 390882, 394930, 398734, 402093, 405156, 408381, 412071, 416173, 420586, 425469, 430996, 436929, 442605, 447324, 450742, 453082, 455041, 457258, 459694, 461730, 462857, 462982, 461993, 459605, 455911, 451647, 447489, 443444, 439307, 435286, 431672, 428303, 424986, 422111, 420180, 418920, 417556, 415869, 414368, 413484, 413291, 413907, 415467, 417538, 419216, 419951, 419834, 419038, 417504, 415251, 412410, 408885, 404570, 400096, 396740, 395203, 394868, 394622, 394099, 393764, 393998, 394493, 394578, 393969, 393093, 392595, 392604, 392731, 392858, 393452, 394823, 396465, 397632, 398204, 398450, 398265, 397340, 395946, 394826, 394369, 394478, 395125, 396306, 397505, 398019, 397906, 397881, 398193, 398363, 398205, 398270, 398982, 400107, 401473, 403489, 406392, 409521, 411913, 413340, 414387, 415739]
60586D15739J916K133J539L99k78J04Q16P72O1k82J94J028J798K463K825K651
60570D33878K427L025M521O187P680R337J1124J2316J2539J2230J1713J0625Q721
60557E46323O446M176J596j516m499o442p248p408p115o171m600k721p16J333
60543E11438L071M083M554N285O783Q721J0449J1869J3368J5054J6385J6774J6218
60530F44052J5030J3230J0610P300L792M05k722n149o289o288o058o162o267o071
60516F49413n951o085n743m372k724j877j533n54J075K192K447K964M584O615
60502F40451Q092R293J1176J3979J7288K1068K5673L0912L5830L9593M2181M4082
60490I39618M5511M5951M4425M0335L4115K6837J9097J0656J312q432j7852k6733
$$ y = [415739, 417655, 419788, 421327, 421726, 421448, 421552, 422368, 423140, 423201, 422919, 423113, 424141, 425939, 428402, 431227, 433878, 436305, 439330, 443851, 450038, 457718, 467055, 478179, 490495, 503034, 515264, 526977, 537602, 546323, 552769, 556945, 558541, 557025, 552526, 546084, 538836, 531428, 524313, 518142, 513542, 510821, 510105, 511438, 514509, 518592, 523146, 528431, 535214, 543935, 554384, 566253, 579621, 594675, 611060, 627834, 644052, 659082, 672312, 682922, 690222, 694014, 694419, 691697, 686548, 680259, 673971, 667913, 661751, 655484, 649413, 643462, 637377, 631634, 627262, 624538, 622661, 621128, 620574, 621649, 623841, 626288, 629252, 633836, 640451, 648543, 657836, 669012, 682991, 700279, 721347, 747020, 777932, 813762, 853355, 895536, 939618, 985129, 1031080, 1075505, 1115840, 1149955, 1176792, 1195889, 1206545, 1207857, 1199425, 1181573, 1154840]
60478A154840l5005m2039m6948m9511n0199m9309m6776m2942l8812l5116l1681
60467F86502k8109k4670k1877j9507j6838j3812j1281r909r418r148q795q251
60455E04887p256n770m396l843m075m420m417m121l691l185k716k377k047j589
60441D50984j190j090j125r73p09o14n60k36R5k14j158j974k177k072j992j767
60425D33228j232o56k91k9K37L70M29P26J252J549J502J589K035K340K079J583
60409D46711J351J331J275J210J148Q97O40J076K368L541L581K624J494O08K1
60394D69876RP15J582J949J943K156K660L054L196L237L173K973K839K847K605
60379E04814J923J370J532K108K423K429K440K348J933J600J847K314K302J973
$$ y = [1154840, 1119835, 1077796, 1030848, 981337, 931138, 881829, 835053, 792111, 753299, 718183, 686502, 658393, 633723, 611846, 592339, 575501, 561689, 550408, 540499, 531081, 521933, 513138, 504887, 497631, 491861, 487465, 483622, 479547, 475127, 470710, 466589, 462898, 459713, 456997, 454620, 452573, 450984, 449794, 448704, 447579, 446606, 445897, 445283, 444723, 444487, 444582, 444368, 443210, 441236, 439059, 436987, 434995, 433228, 431996, 431340, 431049, 431020, 431257, 431627, 432056, 432782, 434034, 435583, 437085, 438674, 440709, 443049, 445128, 446711, 448062, 449393, 450668, 451878, 453026, 453923, 454563, 455639, 458007, 461548, 465129, 467753, 469247, 469855, 469876, 469885, 470600, 472182, 474131, 476074, 478230, 480890, 483944, 487140, 490377, 493550, 496523, 499362, 502209, 504814, 506737, 508107, 509639, 511747, 514170, 516599, 519039, 521387, 523320, 524920, 526767, 529081, 531383, 533356]
60365E33356K032K421K390J837J501J773K262K676L145L593L686L645M212N540
60351E74069O955Q119R513J1398J3027J3500J2769J1356R569P440N022K256j067
60338F83926m811q176j0287j0968j0742j0225r691r066q162p006n945n318n068
60325E78461m847m471m077l854l795l628k981j792n79K6J21N03J553K654L149
60310E56443L334M092N876Q490J1470J4297J6689J9061K2068K5233K6800K5598
60298G39451K2343J8255J3257O660j050q456j4837k0196k3993k5336k4458k2648
60286F58992k0585j7930j4722j1849r827q160o383m781l720l143k975l310l871
60273E47736m114m045m180m602m823m686m499m170l237j885r17n21j33K64q7j249
$$ y = [533356, 535388, 537809, 540199, 542036, 543537, 545310, 547572, 550248, 553393, 556986, 560672, 564317, 568529, 574069, 581024, 589143, 598656, 610054, 623081, 636581, 649350, 660706, 670275, 677715, 682737, 684993, 683926, 679115, 670939, 660652, 649684, 638942, 628717, 619026, 609960, 601798, 594792, 588847, 583529, 578461, 573614, 569143, 565066, 561212, 557417, 553789, 550808, 549016, 548437, 548463, 548584, 549087, 550640, 553294, 556443, 559777, 563869, 569745, 578235, 589705, 604002, 620691, 639752, 661820, 687053, 713853, 739451, 761794, 780049, 793306, 799966, 798916, 790460, 775623, 755427, 731434, 706098, 681640, 658992, 638407, 620477, 605755, 593906, 584079, 575919, 569536, 564755, 561035, 557892, 554917, 551607, 547736, 543622, 539577, 535397, 530795, 525972, 521286, 516787, 512617, 509380, 507495, 506578, 506057, 505924, 506188, 506101, 504852]
60257E04852k066j709p67j49Q9J95qn31o72O2J098J595J501J195O80r3o44m92
60239E04136M4K60J8k60l36l14k14J41Q31J633K105J907J305J140J869K839L129
60222E20233K932L176L914M139L360K339J948K255L090M450N856O420O124O123
60208E76359P062Q021P914P062O486O381O319O320O676P122P096O626O132N504
60194F71080M257K461R42L64M78L35q27k763m248m337l527l063l257l365l271
60179F51259l946n664o963o401m572l250l129l440l386k910k165j211l18Q3j33
60164F03854p28j411j904j967j731j687j990k171j833j214o97k41K72P01J025
60149E88278J586K392K824K582K273K485K788K525J983J990K678L494M162M858
$$ y = [504852, 502786, 501077, 500310, 500161, 500250, 500445, 500437, 499906, 499234, 499296, 500394, 501989, 503490, 504685, 505365, 505272, 504628, 504136, 504180, 504440, 504458, 504198, 503862, 503548, 503334, 503475, 504306, 505939, 508044, 509951, 511256, 512396, 514265, 517104, 520233, 523165, 526341, 530255, 534394, 537754, 540093, 542041, 544296, 547386, 551836, 557692, 564112, 570236, 576359, 583421, 591442, 599356, 606418, 612904, 619285, 625604, 631924, 638600, 645722, 652818, 659444, 665576, 671080, 675337, 677798, 678740, 679104, 679582, 679917, 679090, 676327, 672079, 667742, 664215, 661152, 657895, 654530, 651259, 647313, 641649, 634686, 628285, 623713, 620463, 617334, 613894, 610508, 607598, 605433, 604222, 603904, 603987, 603854, 603126, 601715, 599811, 597844, 596113, 594426, 592436, 590265, 588432, 587218, 586521, 586280, 586552, 587253, 588278, 589864, 592256, 595080, 597662, 599935, 602420, 605208, 607733, 609716, 611706, 614384, 617878, 622040, 626898]
60135F26898N660O457P201P741P715P153O741O821O635N375L522K225J644J003
60121G02791Q7l91o7M66O31O75J081J764K217K208J930J650J365Q15j67j295k045
60104G13715k292k405k603k677k591k882l910n084n485m981m253l743l183k121
60090F65505n63R68J848J873J494J396J759K170K281K162J949J628J302J125Q12
60075F87709k16j959l707m988n999o832p091o701o368o646p180p449p565p752
60061F07256p665o985o048n279m474l402k585k645l290l677l518l121k669k059
60047E49839j217m4J610L486M838N330N506N907O276O147N652N144M616M026L563
60032F10679L039J753l21k041k563k568l145m263n251o018o769p182p016o869
$$ y = [626898, 632558, 639015, 646216, 653957, 661672, 668825, 675566, 682387, 689022, 694397, 697919, 700144, 701788, 702791, 702878, 702487, 702420, 702886, 703517, 704192, 705273, 707037, 709254, 711462, 713392, 715042, 716407, 717222, 717055, 715760, 713715, 711423, 709018, 706415, 703738, 701147, 698265, 694355, 689271, 683786, 678805, 674552, 670809, 667626, 665505, 664942, 665910, 667758, 669631, 671125, 672521, 674280, 676450, 678731, 680893, 682842, 684470, 685772, 686897, 687709, 687493, 685534, 681827, 676839, 670840, 664008, 656917, 650216, 643848, 637202, 630022, 622573, 615008, 607256, 599591, 592606, 586558, 581279, 576805, 573403, 570818, 568173, 564883, 561206, 557688, 554567, 551898, 549839, 548622, 548578, 550188, 553674, 558512, 563842, 569348, 575255, 581531, 587678, 593330, 598474, 603090, 607116, 610679, 613718, 615471, 615150, 613109, 610546, 607978, 604833, 600570, 595319, 589301, 582532, 575350, 568334, 561465]
60018E61465p258p575p172o703p062p561o780m832l290k972l280l589l799l578
60004D86014k484j012j86p2J62O47O87K40J41N61O52J59L5R00K023K518K605K957
59986D96547L519L740L455K994K689K600K455J788N13p95j574k039k699l398l580
59971E06215l293l053k880k387j714j408j390j005j48N59Q13R62J222J432J598
59956D95523J854J912J391O78N39R14J067Q54P91Q30L00p91j461j106j99N35P82
59939E04413L86n75j377j256n72l98q65j041m83K91R56J722K344K184J610J932
59923E09271L411M722M955M895N525O441O766O586O557O770O855O617N928M595
59909E89894K848J335K34q89k064k628k357j931j837j734j411j332j672j800j336
$$ y = [561465, 554207, 546632, 539460, 532757, 525695, 518134, 511354, 506522, 503232, 500260, 496980, 493391, 489592, 486014, 483530, 482518, 482332, 482260, 482422, 483069, 483756, 483996, 484137, 484698, 485350, 485509, 485544, 486444, 488467, 490985, 493590, 496547, 500066, 503806, 507261, 510255, 512944, 515544, 517999, 519787, 520300, 519505, 517931, 515892, 513193, 509795, 506215, 502922, 499869, 496989, 494602, 492888, 491480, 490090, 489085, 488937, 489496, 490309, 491271, 492493, 493925, 495523, 497377, 499289, 500680, 501358, 501897, 502811, 503878, 504732, 505523, 506353, 506653, 505862, 504401, 503295, 503096, 503631, 504413, 504799, 504224, 502847, 501591, 501019, 500621, 499756, 498715, 498232, 498523, 499479, 501201, 503545, 505729, 507339, 509271, 512682, 517404, 522359, 527254, 532779, 539220, 545986, 552572, 559129, 565899, 572754, 579371, 585299, 589894, 592742, 594077, 594311, 593422, 591358, 588730, 586373, 584442, 582605, 580871, 579460, 578128, 576456, 574656, 573320]
59894E73320p48l29L92J562K404K469K488L111L827M061M333N260O292O620O549
59879F21611O847P332P318O855O413N789M502K884J674Q20k56j526k547l474m745
59864F59497n892n869m681l635l724m531n052m870m255l545k800j868o67N27J252
59849F09887J481J887L193N442P992R957J0528R391P153M891L030J092j089k609
59835F72226k476r01Q91J884J855J151K82m85j409k829m385n270n400n527n965
59820F43642o073n474m843m797m861m329l408k704k226j762j645k119k581k402
59806E94418k075k516l522l980l429k517j995k121k846l819m304l873l041k622
59792E51758k649k577k265j948j583j039o95r78j505j580j404j783k606k724j497
$$ y = [573320, 572572, 572243, 572635, 574197, 576601, 579070, 581558, 584669, 588496, 592557, 596890, 602150, 608442, 615062, 621611, 628458, 635790, 643108, 649963, 656376, 662165, 666667, 669551, 671225, 672045, 671789, 670263, 667716, 664242, 659497, 653605, 647736, 643055, 639420, 635696, 631165, 626113, 621243, 616988, 613443, 610643, 608775, 608108, 608635, 609887, 611368, 613255, 616448, 621890, 629882, 639839, 650367, 659758, 666911, 671802, 674832, 675924, 674835, 672226, 669750, 668849, 669740, 671624, 673479, 674630, 674912, 674427, 673018, 670189, 665804, 660534, 655134, 649607, 643642, 637569, 632095, 627252, 622455, 617594, 613265, 609857, 607153, 604927, 603165, 601520, 599401, 596820, 594418, 592343, 589827, 586305, 582325, 578896, 576379, 574384, 572263, 569417, 565598, 561294, 557421, 554380, 551758, 549109, 546532, 544267, 542319, 540736, 539697, 539002, 538024, 536519, 534939, 533535, 531752, 529146, 526422, 524925]
59777E24925L48J672K042J664R47M17M91J008J369J340J312J643K234K863L451
59762E47726L846L723L046K292K056K526L375L967L806L021K349K421L134L941
59748E91229M530M887M979M840M769M951N034M550L664K971K670K428K022J539
59734F45063R78J98n98r00o25l48n80j140j550j687j755j788j568j026m80l31
59718F31863o16r74j097j025r25p61m83l42o12j008q58M0J132J831K102K105J798
59701F32170J226Q03Q71J179J217R38P53R29J332J706J941K026J879J360N04k60
59685F50574l91R6M30k5r45j562j752j954k223k259k402l588n911q056q662p746
59669F03624o309n108m268l746l568l716l987l906k961j312j9J14k41K49J631
$$ y = [524925, 525273, 526945, 528987, 530651, 531598, 532015, 532506, 533514, 534883, 536223, 537535, 539178, 541412, 544275, 547726, 551572, 555295, 558341, 560633, 562689, 565215, 568590, 572557, 576363, 579384, 581733, 584154, 587288, 591229, 595759, 600646, 605625, 610465, 615234, 620185, 625219, 629769, 633433, 636404, 639074, 641502, 643524, 645063, 646041, 646239, 645641, 644741, 644116, 643768, 643188, 642048, 640498, 638811, 637056, 635268, 633700, 632674, 632194, 631863, 631247, 630273, 629176, 628151, 627226, 626465, 625982, 625640, 625028, 624020, 623162, 623202, 624334, 626165, 628267, 630372, 632170, 633396, 634199, 635070, 636249, 637466, 638404, 639157, 640086, 641418, 643124, 645065, 647091, 648970, 650330, 650834, 650574, 650183, 650279, 650709, 650684, 649739, 648177, 646425, 644471, 642248, 639989, 637587, 633999, 628088, 620032, 611370, 603624, 597315, 592207, 587939, 584193, 580625, 576909, 572922, 569016, 566055, 564743, 564724, 564838, 564597, 564846, 566477]
59654E66477K573K332J676J562J972K532L213L784L617K634J595Q42k48j956l425
59639E89180l920l936m147m285l935l515l386k893j439K24R57Q22N81K01p87j983
59623E57739k468k198j892j781j533j195j214j617k087k535k855k562j542o56
59609E31604n49m53O56K205K721K104J747K349L024K774J709M74n52j174j260
59594E47379r96o94k85M20J124J293R66N83K68j12l42j66L1m14j453k406k827
59577E42369k722k205j610j552k137k516j964r94n56p14r63j243j569j309j27
59562E20188R12O05m30n38M78J261J115P37O95P43Q42J367K048K097J673J827
59546E35620K701L191K901K992M414O464P875Q449Q924J0011J2098J5081J8006
$$ y = [566477, 569050, 571382, 573058, 574620, 576592, 579124, 582337, 586121, 589738, 592372, 593967, 594809, 594561, 592605, 589180, 585260, 581324, 577177, 572892, 568957, 565442, 562056, 559163, 557724, 557948, 558905, 559727, 560308, 560509, 559722, 557739, 555271, 553073, 551181, 549400, 547867, 546672, 545458, 543841, 541754, 539219, 536364, 533802, 532260, 531604, 531055, 530602, 531258, 533463, 536184, 538288, 540035, 542384, 545408, 548182, 549891, 550365, 549813, 548639, 547379, 546383, 545689, 545404, 545824, 546948, 548241, 549207, 549790, 550058, 549946, 549604, 549438, 549469, 549055, 547602, 545196, 542369, 539647, 537442, 535832, 534280, 532143, 529627, 527663, 526669, 526113, 525399, 524436, 523193, 521624, 520315, 520188, 521100, 521705, 521275, 520737, 521215, 522476, 523591, 524328, 525023, 525766, 526608, 527975, 530023, 532120, 533793, 535620, 538321, 541512, 544413, 547405, 551819, 558283, 566158, 574607, 583531, 593542, 605640, 620721, 638727]
59533F38727J9393J8303J4644Q732J481n001q424q409o658m758k869p36J289K832
59519F68546M043M875M668L105Q66j214k982m598o023p250q422r397r859j0026
59505F26332j0460j1012j0843r687q212o917n701m693m320m150k958n96J377J698
59491E49858J009O22O12K21n75r72n13N12J610K462K919L162L613M429N298N917
59475E80184O296O462O395O394O862P500P412O235M575L068J674K88o51o05L82
59460F42471J797L031L652L762M140N421P157Q339Q760R077R628J0074J0238J0270
59446G37817R928Q738O955N289L514N76l616p730j0677j2612j3794j3726j2123
59433F98539r684p285n261l897l599l983l873k696j069M72K209M276O193P938
$$ y = [638727, 658120, 676423, 691067, 699799, 701280, 696279, 687855, 679446, 672788, 668030, 665161, 664425, 665714, 668546, 672589, 677464, 682132, 685237, 686103, 684889, 681907, 677309, 671286, 664036, 655614, 646217, 636358, 626332, 615872, 604860, 594017, 584330, 576118, 569201, 563500, 558807, 554487, 550337, 547379, 546783, 548160, 549858, 550867, 551489, 552101, 552322, 551747, 550775, 550262, 550774, 552384, 554846, 557765, 560927, 564540, 568969, 574267, 580184, 586480, 592942, 599337, 605731, 612593, 620093, 627505, 633740, 638315, 641383, 643057, 643345, 642694, 642089, 642471, 644268, 647299, 650951, 654713, 658853, 664274, 671431, 679770, 688530, 697607, 707235, 717309, 727547, 737817, 747745, 756483, 763438, 768727, 772241, 772817, 769201, 761471, 750794, 738182, 724388, 710662, 698539, 688855, 681570, 676309, 672412, 668813, 664830, 660957, 658261, 657192, 657664, 659873, 664149, 670342, 678280]
59419F78280J0277J3377J6220J8126J9648K1307K2818K4294K6639K9549L0601
59408I11136K7649K1037J2264J992q952j7984k2481k2519k0024j5719q982n43
59396H56874O696R943Q320K377o525j6030k3469k7510k8515k7230k4090j9891
59384G10950j5887j2706r946p248n001l607k700j582j4J712L134L882L904L620
59370F68511L545L694L688L434L286L434L613L561L469L715M291M749M729M419
59356G22138M459N297O787Q440R904J1022J1717J2171J2931J4280J5732J6559
59344H51437J6728J6712J6646J6330J5875J5466J4564J2348Q974N449K136j550
59332I91115n736r599j2571j5034j7263j8800j9368j9440j9312j8557j7007j5315
$$ y = [678280, 688557, 701934, 718154, 736280, 755928, 777235, 800053, 824347, 850986, 880535, 911136, 938785, 959822, 972086, 974078, 965126, 947142, 924661, 902142, 882118, 866399, 857417, 856874, 863570, 873513, 881833, 884210, 877685, 861655, 838186, 810676, 782161, 754931, 730841, 710950, 695063, 682357, 672411, 665163, 660162, 656555, 653855, 652273, 652259, 653971, 657105, 660987, 664891, 668511, 672056, 675750, 679438, 682872, 686158, 689592, 693205, 696766, 700235, 703950, 708241, 712990, 717719, 722138, 726597, 731894, 738681, 747121, 757025, 768047, 779764, 791935, 804866, 819146, 834878, 851437, 868165, 884877, 901523, 917853, 933728, 949194, 963758, 976106, 985080, 990529, 992665, 991115, 985379, 975780, 963209, 948175, 930912, 912112, 892744, 873304, 853992, 835435, 818428, 803113]
59320H03113j3884j2239j0173q563q244q813r337r370q678o930m560k915k629
59307F96778k685k024j127q73q10J20J785L218M366O141Q826J1534J3143J2930
59293G51322J0494N946J15o015j1781j6363j8565j7941j5618j3166j0977q541
59281F48910n769l130r10Q78K189L267M757O776Q444R194R842J1421J3547J5041
59267G24457J5588J5595J4886J2910J0006P253N041K854L80k106m493o955r272
59254G86144j0801j1260j0945j0261r466q719p899o630m982l636k879k009m20
59241F96237J395K729L828N169O267O376N980O345P670Q816Q837P786O101M103
59227G77639K168O54m99j599k789m159n813p398q057p457o369n687n494n656o421
$$ y = [803113, 789229, 776990, 766817, 758254, 750010, 741197, 731860, 722490, 713812, 706882, 702322, 699407, 696778, 694093, 692069, 690942, 690069, 689259, 689379, 691164, 694382, 698748, 704889, 713715, 725249, 738392, 751322, 761816, 767762, 767877, 761862, 750081, 733718, 715153, 697212, 681594, 668428, 657451, 648910, 643141, 640011, 639101, 639979, 642168, 645435, 650192, 656968, 665412, 674606, 684448, 695869, 709416, 724457, 740045, 755640, 770526, 783436, 793442, 800695, 805736, 808590, 808970, 806864, 802371, 795416, 786144, 775343, 764083, 753138, 742877, 733411, 724692, 716793, 710163, 705181, 701545, 698666, 696657, 696237, 697632, 700361, 704189, 709358, 715625, 722001, 727981, 734326, 741996, 750812, 759649, 767435, 773536, 777639, 779807, 780461, 779962, 778363, 775574, 771415, 765602, 758204, 750147, 742690, 736321, 730634, 725140, 719484, 713063]
59212G13063p639q309p913p364p559p845p182n981n354n149m399l191k489k320
59198F30369j762p38k69p98j520j589r50J02J146J532R75K69M47J428K306K731
59182F33679K987L109L031L247M124M953M935M729N547P017P595O994O586P214
59168G05747Q189Q699Q864Q993R025R030R184R032P876O025M530L486J845r36
59154G99589m182p167r807j1889j2869j2876j2868j3301j3499j2817j1610j0607
59142F66097r994r497q839p903o878o234o114n983n402m701m296l795k737j627
59128E82097j204j195q80l76j16M16J972L960N154N642O492P691Q173P846P832
59113F33504Q528R090R078R076R338R361R007Q693Q251P052N433M468M187L563
$$ y = [713063, 705424, 697115, 689202, 681838, 674279, 666434, 659252, 653271, 647917, 642768, 638369, 635178, 632689, 630369, 628607, 627869, 627600, 626802, 625282, 623693, 622743, 622845, 623991, 625523, 626498, 626767, 627214, 628642, 630948, 633679, 636666, 639775, 642806, 646053, 650177, 655130, 660065, 664794, 670341, 677358, 684953, 691947, 698533, 705747, 713936, 722635, 731499, 740492, 749517, 758547, 767731, 776763, 784639, 790664, 795194, 798680, 800525, 799589, 795407, 788240, 778433, 766544, 753675, 740799, 727931, 714630, 701131, 688314, 676704, 666097, 656103, 646606, 637767, 629864, 622986, 616752, 610638, 604655, 599253, 594552, 590256, 586461, 583724, 582097, 580893, 579698, 578818, 578442, 578326, 578742, 580714, 584674, 589828, 595470, 601962, 609653, 617826, 625672, 633504, 642032, 651122, 660200, 669276, 678614, 687975, 696982, 705675, 713926, 720978, 726411, 730879, 735066, 738629]
59099G38629K475J926K070J755N22o74j246j812k608k810k153j632j764j653p15
59084G30310J55qr04j926l139m519n516o142p247q852r609q807p608p268p327
59069F51593o704n466m371l546k702j954j513j244j226j901l008l409k734k159
59055F09656k643l384l033j654m56k23q16j664k054j520n38j82o61r91n76q8k08
59038E88965n20m00o4Q1K17N18N73K50L43J499L205M575N519O468P546Q611R582
59021F36968J0266J0520J0829J1856J3155J3315J1817R668P701N500K631j52j914
59008G42160k787l440m002m246m100l363j677P24K909M352N355O183O712P123
58994G51903P733P977O930N118M277M824N192M249K661J108r73l778o035o858
$$ y = [738629, 741104, 743030, 745100, 746855, 747377, 746703, 745457, 743645, 741037, 738227, 736074, 734442, 732678, 731025, 730310, 730465, 730457, 729553, 727627, 724488, 719969, 714453, 708311, 701064, 692212, 682603, 673796, 666188, 658920, 651593, 644889, 639423, 635052, 631506, 628804, 626850, 625337, 624093, 622867, 620966, 617958, 614549, 611815, 609656, 607013, 603629, 600596, 598942, 598486, 598263, 597447, 595783, 593729, 592209, 591671, 591489, 590828, 589837, 589261, 589173, 588965, 588445, 588045, 587981, 588062, 588279, 588797, 589370, 589620, 589963, 591462, 594667, 599242, 604761, 611229, 618775, 627386, 636968, 647234, 657754, 668583, 680439, 693594, 706909, 718726, 728394, 736095, 741595, 744226, 744074, 742160, 739373, 735933, 731931, 727685, 723585, 720222, 718545, 719269, 722178, 726530, 731885, 738068, 744780, 751903, 759636, 767613, 774543, 779661, 783938, 788762, 793954, 798203, 800864, 801972, 800999, 797221, 791186, 784328]
58980G84328p057p306o561l942p80R85J408J972L317N116P200R261J0283R890
58966H08114R489J0528J2315J3124J2751J2318J2093J1275R600P612N408K554
58954I27181p99l908o548r157j1901j4450j6462j7676j7877j7380j6952j6666
58942G77405j5567j3255j0875r569q877p805o541n787n192l948k441j820k197
58929F83531k579k364j777j083m31k63q31j537j684j519j658j865j488p37m26
58914F63289o19m71N42K054L332L833L518L087L558N123O902Q234R510J1221J3056
58899G36169J4542J5775J6802J7124J6583J5879J5442J4740J3534J2884J3869
58888I03343J6151J8763K1418K4047K5918K6343K5515K3758K0733J6377J1668
$$ y = [784328, 777271, 769965, 763404, 759462, 758682, 759667, 761075, 763047, 766364, 771480, 778680, 787941, 798224, 808114, 817603, 828131, 840446, 853570, 866321, 878639, 890732, 902007, 911607, 919219, 924627, 927181, 926382, 922474, 915926, 906769, 894868, 880418, 863956, 846280, 828403, 811023, 794071, 777405, 761838, 748583, 737708, 728139, 719262, 711457, 704916, 699129, 693937, 689989, 687548, 685728, 683531, 680952, 678588, 676811, 675728, 675297, 675034, 674203, 672666, 670982, 669463, 667805, 665940, 664452, 663715, 663289, 662670, 662199, 662741, 664795, 668127, 671960, 675478, 678565, 682123, 687246, 694148, 702382, 711892, 723113, 736169, 750711, 766486, 783288, 800412, 816995, 832874, 848316, 863056, 876590, 889474, 903343, 919494, 938257, 959675, 983722, 1009640, 1035983, 1061498, 1085256, 1105989, 1122366, 1134034]
58877A134034P421L255j245n451q837j2140j6037j9704k2066k3365k4114k3554
58865I88197k0924j7359j4804j3535j2475j1345j0803j0851j0755j0427j0439
58854H44480j0878j1349j1852j2509j2823j2242j1041r794q548p411p047p514
58842G21472p682o972o555p385q315p853o691o494p076o894n749m891m764m588
58828F29563l996l323k501j304l65l43m37O41K500L592L562L404L598L769L940
58813F42300M433M776M311L610L600L713K698R72K31P49R98M5j405k568l482m138
58797F60843m169l744l543l721l895m089m587n064n007m601m173l307j694k07
58783F09042L07O14J924L756M687M635M620M763M320L316K390J379k79k102l211
$$ y = [1134034, 1141455, 1144710, 1143465, 1138014, 1129177, 1117037, 1101000, 1081296, 1059230, 1035865, 1011751, 988197, 967273, 949914, 935110, 921575, 909100, 897755, 886952, 876101, 865346, 854919, 844480, 833602, 822253, 810401, 797892, 785069, 772827, 761786, 751992, 743444, 736033, 728986, 721472, 713790, 706818, 700263, 692878, 684563, 676710, 670019, 663525, 656449, 649555, 643806, 638915, 634151, 629563, 625567, 622244, 619743, 618439, 618074, 617731, 617294, 617935, 620435, 624027, 627589, 630993, 634591, 638360, 642300, 646733, 651509, 655820, 659430, 663030, 666743, 669441, 670413, 670644, 671393, 672391, 672436, 671031, 668463, 664981, 660843, 656674, 652930, 649387, 645666, 641771, 637682, 633095, 628031, 623024, 618423, 614250, 610943, 609249, 609042, 609349, 609963, 611887, 615643, 620330, 624965, 629585, 634348, 638668, 641984, 644374, 645753, 645474, 643372, 640161]
58768F40161l891m882n734n619n073n026m851l506j871j590k193j771j03J260
58754E95311J782K289K866K776K333K429K484J357m8K97K203L612M113N123O628
58739F35555O869N686N025N581N867N306N259O158O551N969N896O819P189O395
58725G20125O059O952P392O275N138N493O416O635O856Q118R640J0125R778R367
58711H24369Q726P598O607O044M954K611k99k990n644q369j0587j2357j4748j7871
58697G88044k0202k0771k0497k0341j9841j8522j7068j5909j4261j1680r160p545
58685E92247o331n071m455m860n228m597l522k961k927l034l136k789j474J26
58671E41988O00J44O05K617M673N778O939Q941J0750J1400J1591J1986J1677R696
$$ y = [640161, 636270, 631388, 625654, 620035, 614962, 609936, 605085, 601579, 599708, 598118, 595925, 594154, 594051, 595311, 597093, 599382, 602248, 605024, 607357, 609786, 612270, 613627, 613579, 613876, 616079, 619691, 623804, 628927, 635555, 642424, 648110, 653135, 658716, 664583, 669889, 675148, 681306, 687857, 693826, 699722, 706541, 713730, 720125, 726184, 733136, 740528, 746803, 751941, 757434, 763850, 770485, 777341, 785459, 795099, 805224, 815002, 824369, 833095, 840693, 847300, 853344, 858298, 860909, 860610, 857620, 851976, 843607, 833020, 820663, 805915, 788044, 767842, 747071, 726574, 706233, 686392, 667870, 650802, 634893, 620632, 608952, 599792, 592247, 585916, 580845, 576390, 571530, 566302, 561705, 558183, 555222, 552295, 549261, 546125, 543336, 541862, 541988, 542588, 542732, 543337, 545954, 550627, 556405, 563344, 572285, 583035, 594435, 606026, 618012, 629689, 639385]
58657F39385O664L567M76k442m174m405m347m894n396n274n200n531n301l971
58643E99157k613k105j753q31J4J80L46J087J836K298L299N034O165N878N167
58628F23159M892M462L661L824N528O975O447M778L652K955J750M88K96R96J560
58613F75423J825K298L045L780M368M366L180J273q3p77j997l808m624l909l308
58598F81052l929m625m284l725l814l752k833j966j811j250N61K473L391M233
58584F59721O058Q035R079R837J1114J2024J1620J0840J0878J1026J0040Q321
58572G78593P009O181N644O135Q094J0616J3006J5910J9510K2384K3676K4581
58560I41339K6116K7233K6883K5915K5144K3457J9812J5163J0546N217j203o778
$$ y = [639385, 646049, 649616, 650092, 647650, 643476, 639071, 634724, 629830, 624434, 619160, 613960, 608429, 603128, 599157, 596544, 594439, 592686, 591855, 591869, 592049, 592395, 593482, 595318, 597616, 600915, 605949, 612114, 617992, 623159, 628051, 632513, 636174, 639998, 645526, 652501, 658948, 663726, 667378, 670333, 672083, 672571, 672867, 673863, 675423, 677248, 679546, 682591, 686371, 690739, 695105, 698285, 699558, 699475, 698698, 696701, 692893, 688269, 684360, 681052, 677123, 672498, 668214, 664489, 660675, 656923, 654090, 652124, 650313, 649063, 649624, 652097, 655488, 659721, 665779, 673814, 682893, 692730, 703844, 715868, 727488, 738328, 749206, 760232, 770272, 778593, 785602, 791783, 797427, 803562, 811656, 822272, 835278, 851188, 870698, 893082, 916758, 941339, 967455, 994688, 1021571, 1047486, 1072630, 1096087, 1115899, 1131062, 1141608, 1146825, 1145622, 1138844]
58548A138844r699j0828j1631j1588r962q131p634p773p728r040j3135j8126k1077
58535I92492k2002k2752k3343k2372k0004j7605j5308j2500r809q091o454l777
58523H08475j050J31L42J140K197K106R50k64j559l117l796k922k224l339m813
58508G92257m258k232j202j755k568l112l678l666k539j542k020k992k812j989
58494G55892j944k213j573o08n17n95L51J460J393J142K405M544N978P215R567
58479G82497J2229J3718J4747J6552J7898J7046J5142J4176J3009R272L890k06
58467I29970k820n945r363j0901j0519j0185j0037q461n679l496j779J100M603
58454H56488O508O933Q166J0530J1985J1771J0984R580O307J752j981m650p684
$$ y = [1138844, 1129145, 1118317, 1106686, 1095098, 1085136, 1077005, 1069371, 1061598, 1053870, 1044830, 1031695, 1013569, 992492, 970490, 947738, 924395, 902023, 882019, 864414, 849106, 836606, 826797, 818706, 812252, 808475, 807425, 807556, 807898, 809038, 811235, 813341, 814291, 814027, 812468, 809351, 805555, 802633, 800409, 797070, 792257, 787999, 785767, 784565, 782810, 780242, 777130, 773452, 769786, 767247, 765705, 763685, 760693, 757881, 755892, 753948, 751735, 750162, 749554, 749037, 748442, 748793, 750253, 751646, 752788, 755193, 759737, 765715, 772930, 782497, 794726, 808444, 823191, 839743, 857641, 874687, 889829, 904005, 917014, 926286, 930176, 929970, 927150, 921205, 911842, 900941, 890422, 880237, 870200, 861739, 856060, 852564, 850785, 851885, 856488, 862996, 869929, 878095, 888625, 900610, 912381, 923365, 932945, 939252, 941004, 939023, 934373, 926689]
58441I26689j0737j1776j0640r186p941n807l073j392p52M55K319L427L803M774
58427H80163O238P090P916J0028J2368J2756J1652J1166J0924Q687M701J528k78
58414I84939k528n551p643q439r233j0029r745r116r855j1200j0904r222q303
58401H73171q041o524m040k678k303j039P17J022O70K203M980N835M560L986M658
58386H77177M239K473J835K791L081K348K825M812N956N726O140P440P474O004
58372I40321N327N999O233N919O848Q628Q913Q086R032J1876J3610J3343J3226
58359A057361J3878J3737J3157J4046J5259J3633R862P828P848O369K860R12J614
58346A178364K051J495K839O342Q190P130O629Q544J0324J0475J1157J3366J4935
$$ y = [926689, 915952, 904176, 893536, 884350, 876409, 870602, 867529, 866137, 865385, 865840, 868159, 871586, 875389, 880163, 886401, 893491, 901407, 911435, 923803, 936559, 948211, 959377, 970301, 978988, 983689, 985217, 984939, 982411, 976860, 969217, 960778, 951545, 941516, 931771, 922655, 912800, 901600, 890696, 881474, 873171, 865130, 858606, 854566, 851888, 849585, 848546, 849263, 850285, 850955, 853158, 858138, 863973, 868533, 872519, 877177, 881416, 883889, 885724, 888515, 891596, 893944, 896769, 901581, 907537, 913263, 919403, 926843, 934317, 940321, 945648, 951647, 957880, 963799, 970647, 979275, 988188, 996274, 1005306, 1017182, 1030792, 1044135, 1057361, 1071239, 1084976, 1098133, 1112179, 1127438, 1141071, 1150933, 1158761, 1166609, 1172978, 1175838, 1176750, 1178364, 1180415, 1181910, 1184749, 1191091, 1199281, 1206411, 1213040, 1221584, 1231908, 1242383, 1253540, 1266906, 1281841]
58333A281841J5240J6573J9118J9932J8501J7804J8450J7435J4155J1753J0989
58322A461791Q892N042K913L334K996J171J255L855N200M426N388R001J0960R697
58308A535921R408J2288J4876J5124J5990J8834K0257J8898J8516K0963K2822
58297A723897K2113K1590K2395K1591J8975J8961K2601K5184K4784K5410K8509
58286A976010K9749K7748K7468L0951L3350L2225L2074L5263L7412L6451L7161
58275B335862M1663M4630M3255M2860M6899N0665N0742N1447N5753N9101N8588
58264B881465N9062O3612O7460O7685O9327P5108P9168P8073P7765Q2116Q5158
58253C685999Q2732Q1107Q5457R0387R0870R1993R8476J05113J07278J10503J19704
$$ y = [1281841, 1297081, 1313654, 1332772, 1352704, 1371205, 1389009, 1407459, 1424894, 1439049, 1450802, 1461791, 1470683, 1475725, 1478638, 1481972, 1484968, 1486139, 1487394, 1491249, 1496449, 1500875, 1506263, 1515264, 1526224, 1535921, 1545329, 1557617, 1572493, 1587617, 1603607, 1622441, 1642698, 1661596, 1680112, 1701075, 1723897, 1746010, 1767600, 1789995, 1811586, 1830561, 1849522, 1872123, 1897307, 1922091, 1947501, 1976010, 2005759, 2033507, 2060975, 2091926, 2125276, 2157501, 2189575, 2224838, 2262250, 2298701, 2335862, 2377525, 2422155, 2465410, 2508270, 2555169, 2605834, 2656576, 2708023, 2763776, 2822877, 2881465, 2940527, 3004139, 3071599, 3139284, 3208611, 3283719, 3362887, 3440960, 3518725, 3600841, 3685999, 3768731, 3849838, 3935295, 4025682, 4116552, 4208545, 4307021, 4412134, 4519412, 4629915, 4749619]
58242D749619J29431J34729J40969J52804J64422J71090J78976J92942K06488
58233F221470K14780K25197K43370K61691K73816K87269L08934L31967L50453
58224H718947L72501M04613M38168M66509M99667N46184N96894O43745O97407
58215A3384635P67919Q46182R24459J016098J133646J267551J409891J578315
58207B2328696J791508K043489K329526K673097L096039L586979M132933M755292
58199D6737559N478180O293658P204995Q275998R591283J1204605J3181441J5644427
58191A23612146J8696141K2330775K6481077L1019421L5458408L8605718L8771911
58184C34975597L4606588K5879091J3604527l47652j3743554k4519719l1431613
$$ y = [4749619, 4879050, 5013779, 5154748, 5307552, 5471974, 5643064, 5822040, 6014982, 6221470, 6436250, 6661447, 6904817, 7166508, 7440324, 7727593, 8036527, 8368494, 8718947, 9091448, 9496061, 9934229, 10400738, 10900405, 11446589, 12043483, 12687228, 13384635, 14152554, 14998736, 15923195, 16939293, 18072939, 19340490, 20750381, 22328696, 24120204, 26163693, 28493219, 31166316, 34262355, 37849334, 41982267, 46737559, 52215739, 58509397, 65714392, 73990390, 83581673, 94786278, 107967719, 123612146, 142308287, 164639062, 191120139, 222139560, 257597968, 296203686, 334975597, 369582185, 395461276, 409065803, 408718151, 394974597, 370454878, 339023265]
58177C39023265l4476396l4641611l3141627l0819488k8084557k5132149k2091152
58170A30636285j9069820j6194029j3603999j1380134r504370p922893o609423
58163D6351617n543161m673622l949445l352931k874420k480967k140629j852191
58155A9484251j621863j432905j264572j119675j007077r15326q28046p48617
58147A0546170o86414o33782n78375n24352m80823m42202l99310l57668l26405
58138F116839l00632k72194k46687k32640k24452k12468j99910j93806j88991
58129D045059j77110j62546j53902j48005j37290j25179j19236j16259j08610
58120B796922r8841r4187r2471q6788p8718p4253p1764o6130n9778n8008n8142
$$ y = [339023265, 304546869, 269905258, 236763631, 205944143, 177859586, 152727437, 130636285, 111566465, 95372436, 81768437, 70388303, 60883933, 52961040, 46351617, 40808456, 36134834, 32185389, 28832458, 25958038, 23477071, 21336442, 19484251, 17862388, 16429483, 15164911, 14045236, 13038159, 12122833, 11294787, 10546170, 9859756, 9225974, 8647599, 8123247, 7642424, 7200222, 6800912, 6443244, 6116839, 5816207, 5544013, 5297326, 5064686, 4840234, 4627766, 4427856, 4234050, 4045059, 3867949, 3705403, 3551501, 3403496, 3266206, 3141027, 3021791, 2905532, 2796922, 2698081, 2603894, 2511423, 2424635, 2345917, 2271664, 2199900, 2133770, 2073992, 2015984, 1957842]
58109A957842n4471m9228m7884m8335m5371m1120m0658m1781l9457l5936l6248
58098A477353l8010l5791l1487l0453l1285k9286k6195k6679k8622k6633k2064
58087A150848k0159k0281j8150j4958j5149j7683j8199j7315j8433k0016j8404
58076I52101j5714j6519j9226j9003j6732j6743j8069j6483j3097j2403j3607
58065G74505j2235q893q070r473q719n791m956o762p600o790p109q633q788q040
58051F62646r086j1023j0600q517q228r309q325n485m188m620m055k855l930o744
58037E65681p835o949o836p513o579m765n269p835r099q582q834r996r665p954
58023D57970p351p813p082n534n543o512n689l463k698l297k636q55m78j222n42
$$ y = [1957842, 1903371, 1854143, 1806259, 1757924, 1712553, 1671433, 1630775, 1588994, 1549537, 1513601, 1477353, 1439343, 1403552, 1372065, 1341612, 1310327, 1281041, 1254846, 1228167, 1199545, 1172912, 1150848, 1130689, 1110408, 1092258, 1077300, 1062151, 1044468, 1026269, 1008954, 990521, 970505, 952101, 936387, 919868, 900642, 881639, 864907, 848164, 830095, 813612, 800515, 788112, 774505, 762270, 753377, 745307, 735834, 727115, 721324, 716368, 709606, 702006, 695216, 688107, 679474, 670686, 662646, 653560, 642537, 631937, 623420, 615192, 605883, 597558, 592073, 587885, 583265, 579210, 576355, 572425, 565681, 557846, 550897, 544061, 536548, 529969, 525204, 519935, 512100, 503001, 494419, 485585, 475589, 465924, 457970, 450619, 442806, 435724, 430190, 424647, 418135, 412446, 408983, 406285, 402988, 400352, 399497, 399019, 397797, 397255]
58008C97255J051O18j514j998l30P57O13J163K205J573l5L25K250K241k31k063
57992D03880k245k977m654m899l385k679l477l656k733k667l566l230j602j185
57978C60925k327k654j792k068l759m252k777j615j645j117K97O09l97m30R65
57963C37963J475L91k47K39R2r10p16P79J011n81j389l63K35q13j694j377j372
57946C32723k222k075m16N57l6l3J831L741M286M738O162P496Q084R050J0618
57931C84504J1130J0131R381R507Q755O376M137L049J772m54k367l433m826o437
57917D31225o256m223l296m962o902o895n875n244m211j988J02P87Q37J109Q76
57902C85084l34j504k064k869m072m478m008m236n358n425l756k265k140k074
$$ y = [397255, 398306, 398924, 397410, 395412, 395082, 395839, 396452, 397615, 399820, 401393, 401358, 401683, 403933, 406174, 405943, 403880, 401635, 398658, 394004, 389105, 385720, 383041, 379564, 375908, 373175, 370508, 366942, 363712, 362110, 360925, 358598, 355944, 354152, 352084, 348325, 344073, 341296, 339681, 338036, 336919, 337216, 337825, 337428, 336998, 337963, 339438, 339829, 339582, 339821, 339913, 339003, 338287, 339066, 340077, 339496, 338107, 337744, 337979, 337166, 335472, 334095, 332723, 330501, 328426, 328010, 328567, 328531, 328498, 330329, 334070, 338356, 343094, 349256, 356752, 364836, 373886, 384504, 395634, 405765, 415146, 424653, 433408, 439784, 443921, 446970, 448742, 448288, 445921, 442488, 437662, 431225, 424969, 420746, 417450, 412488, 405586, 398691, 392816, 387572, 383361, 381373, 381475, 382262, 383099, 384208, 385084, 384750, 383246, 381182, 378313, 374241, 369763, 365755, 361519, 356161, 350736, 346980, 344715, 342575, 340501]
57888C40501j142m63n59n8J453K184J376Q35J591J909N03j154j651j930k828l075
57872C37492j841o85q76j207n07J58j82l67N35J271R62J116K829M382M025K958
57856C50063L103L963M112L900M228M379L426K220J845J605N15q36j767l007m859
57841C72890n768m776l532l773m649m752m723n536o034m892l326l167l666k945
57827C11351j369p38j080r25p4L87L53O82J313J413J112J268J848K115K011J999
57811C21666J949J412M19r94l147n677p140o855n958n656n582n027m348l927l124
57796B68011j650n30m01k41Q30K010K494L067M382N310M851M142M622N558N416
57781C07871M442L915L947L952M212N052N505M705L577L357L426K505R78R4k91
$$ y = [340501, 339359, 338896, 338337, 338279, 339732, 341916, 343292, 344127, 345718, 347627, 348130, 346976, 345325, 343395, 340567, 337492, 335651, 334966, 334090, 332883, 332376, 332534, 332352, 331985, 332520, 333791, 334753, 335869, 338698, 343080, 347105, 350063, 353166, 357129, 361241, 365141, 369369, 373748, 377174, 379394, 381239, 382844, 383359, 382523, 380756, 377749, 372890, 367122, 362346, 358814, 355041, 350392, 345640, 340917, 335381, 329347, 324455, 321129, 317962, 314296, 311351, 309982, 309244, 308164, 307239, 307165, 307552, 307905, 308587, 309900, 311313, 312425, 313693, 315541, 317656, 319667, 321666, 323615, 325027, 325446, 324452, 321305, 315628, 308488, 301633, 295675, 290019, 284437, 279410, 275062, 271135, 268011, 266361, 265831, 265430, 265189, 266019, 268029, 270523, 273590, 277972, 283282, 288133, 292275, 296897, 302455, 307871, 312313, 316228, 320175, 324127, 328339, 333391, 338896, 343601, 347178, 350535, 353961, 356466, 357444, 357538, 357247]
57766C57247j234k684l801m553n359n891n828n927o720p142o167m810m651n247
57752B87233m949l495j932o41O91J756K163K656M059N535N643M564L622L135K440
57737C12480J604J367J693J901J936K179K398K126J639J463J425J211J037Q78
57723C35337K8j466k216j544p48r93j437j079q71k013l577m002l726m021m386
57708C03286l557k235k231l471m232l952l468k890j539J79J052J115J439K047
57694B81543K063J602J528J513M06j514k682k679k535k627k172r73J27Q04J634
57679B76038K803L911N134P088R510J1506J3135J5381J8638K2576K7406L3764
57667D46890M1276M8279N2817N2878M6470L3152J5318l347k0442l4786m4814m9074
$$ y = [357247, 356013, 353329, 349528, 344975, 339616, 333725, 327897, 321970, 315250, 308108, 301941, 297131, 292480, 287233, 282284, 278789, 276857, 276216, 276907, 278663, 280826, 283482, 287541, 293076, 298719, 303283, 306905, 310040, 312480, 314084, 315451, 317144, 319045, 320981, 323160, 325558, 327684, 329323, 330786, 332211, 333422, 334459, 335337, 335365, 333899, 331683, 330139, 329391, 328398, 326961, 325882, 325011, 322998, 319421, 315419, 311693, 307672, 303286, 299729, 297494, 295263, 291792, 287560, 283608, 280140, 277250, 275711, 275890, 276942, 278057, 279496, 281543, 283606, 285208, 286736, 288249, 288655, 287141, 284459, 281780, 279245, 276618, 274446, 273473, 273600, 274404, 276038, 278841, 282752, 287886, 294974, 304484, 315990, 329125, 344506, 363144, 385720, 413126, 446890, 488166, 536445, 589262, 642140, 688610, 721762, 737080, 733733, 713291, 678505, 633691, 584617]
57655E84617m8150m4306l9240l3486k7663k2624j8577j5353j3180j1948j0396
57644B99694p646m845l609l540l126k291j990j926j001L76P16N6j35N07R49R17
57628B73106J159J503Q72o19j603j649j545j386n67L96K27p35q33N7L12m70p43
57611B67482J39P75K89k02K78R49R09O13N89K84p04j571j572j156j006j022r56
57594B64118j032j358j637j861k274k548k090j241r53j192j021k24N50J161J928
57579B50326K341J574K38k30Q0k12j136j230k35L00l04q82p31p26j228j135l5
57562B46775P57M14J5M73R54O09K49Q38J808K177K167K449K890L138L418L793
57546B72924L718L087K643K692K622K324K639L701M358M052L793M311M786M415
$$ y = [584617, 536467, 492161, 452921, 419435, 391772, 369148, 350571, 335218, 322038, 310090, 299694, 292048, 287203, 283594, 280054, 276928, 274637, 272647, 270721, 269720, 270096, 270812, 270868, 270733, 271240, 272189, 273106, 274265, 275768, 276640, 276021, 274418, 272769, 271224, 269838, 269271, 269667, 269894, 269159, 268326, 268383, 268695, 268225, 267482, 267621, 268396, 268685, 268483, 268761, 269710, 270619, 271232, 271821, 272105, 271401, 269830, 268258, 267102, 266096, 265074, 264118, 263086, 261728, 260091, 258230, 255956, 253408, 251318, 250077, 249124, 247932, 246911, 246687, 247237, 248398, 250326, 252667, 254241, 254479, 254249, 254329, 254117, 252981, 251751, 251516, 251816, 251512, 250630, 249899, 249173, 247945, 246810, 246775, 247532, 247946, 247961, 248434, 249388, 249997, 250246, 251084, 252892, 255069, 257236, 259685, 262575, 265713, 269131, 272924, 276642, 279729, 282372, 285064, 287686, 290010, 292649, 296350, 300708, 304760, 308553, 312864, 317650, 322065]
57532C22065L835L886M280M516M848N370N419M851M582M960M960M021L159L152
57518C83904L093K065Q41N21P03M43q1l03n74j406k278k492k455k837l330l367
57502C72447l199l154k776j792j040j198j572j330j039j569k335k132j099m18
57488C47794m30l53L01J150J669J711J449J275J492J796J653J317J570K207K028
57473C66629Q44J53R56K220K444J719J175J347K110L301M507M972M550L953L498
57458D04378K745J872J981L196L999L490K886L478M526M592L732K826J983J087
57444D46771R44K118L555L875L349L089L150K951K792L260L788L500K902L195
57430D89239M228M774M476M065L875L584L313L646M519N178N236M905M388L775
$$ y = [322065, 325900, 329786, 334066, 338582, 343430, 348800, 354219, 359070, 363652, 368612, 373572, 377593, 380752, 383904, 386997, 389062, 389903, 390424, 391127, 391570, 391489, 391186, 390612, 389206, 386928, 384436, 381981, 379144, 375814, 372447, 369248, 366094, 363318, 361526, 360486, 359288, 357716, 356386, 355347, 353778, 351443, 349311, 348212, 347794, 347364, 347011, 347312, 348462, 350131, 351842, 353291, 354566, 356058, 357854, 359507, 360824, 362394, 364601, 366629, 367473, 367626, 368582, 370802, 373246, 374965, 376140, 377487, 379597, 382898, 387405, 392377, 396927, 400880, 404378, 407123, 408995, 410976, 414172, 418171, 421661, 424547, 428025, 432551, 437143, 440875, 443701, 445684, 446771, 447715, 449833, 453388, 457263, 460612, 463701, 466851, 469802, 472594, 475854, 479642, 483142, 486044, 489239, 493467, 498241, 502717, 506782, 510657, 514241, 517554, 521200, 525719, 530897, 536133, 541038, 545426, 549201]
57416E49201L379L438L757M156M690N113M937M494M829N939O399N594M840N221
57402F15987N806N451M893N284N903N369M144L855M723N580N993O477P062P236
57388F93763P112P108O968O480O533P846R301R337Q374Q087Q686Q923Q440Q115
57374H05073Q179P907P257P027P233P002O195N630N548N427N311N856O923P583
57360H98151P650P837Q368Q739Q886R225R605R578R553J0275J1225J1190J0395
57347A020677J0343J1370J2056J1486J0559J0470J1176J1899J2174J1884J1162
57336A145256J0496J0253J0168R993J0267J1373J2419J2330J1603J1508J1974
57325A267640J1964J1585J1875J2697J2850J2386J2750J4251J5403J5341J5010
$$ y = [549201, 552580, 556018, 559775, 563931, 568621, 573734, 578671, 583165, 587994, 593933, 600332, 605926, 610766, 615987, 621793, 627244, 632137, 637421, 643324, 648693, 652837, 656692, 661415, 666995, 672988, 679465, 686527, 693763, 700875, 707983, 714951, 721431, 727964, 735810, 745111, 754448, 762822, 770909, 779595, 788518, 796958, 805073, 813252, 821159, 828416, 835443, 842676, 849678, 855873, 861503, 867051, 872478, 877789, 883645, 890568, 898151, 905801, 913638, 922006, 930745, 939631, 948856, 958461, 968039, 977592, 987867, 999092, 1010282, 1020677, 1031020, 1042390, 1054446, 1065932, 1076491, 1086961, 1098137, 1110036, 1122210, 1134094, 1145256, 1155752, 1166005, 1176173, 1186166, 1196433, 1207806, 1220225, 1232555, 1244158, 1255666, 1267640, 1279604, 1291189, 1303064, 1315761, 1328611, 1340997, 1353747, 1367998, 1383401, 1398742, 1413752]
57314A413752J5279J5575J5297J5002J5271J5706J5852J5980J6295J6444J6424
57303A586877J6801J7507J7622J6889J6262J6435J7003J7570J8403J9417J9797
57292A780583J9371J9137J9749K0602K1116K1716K2727K3490K3475K3286K3685
57281B018937K4456K5102K5800K6803K7646K7821K7638K7678K7920K8067K8188
57270B316056K8494K8915K9394L0066L0758L0867L0148K9120K8364K7974K7911
57259B638067K8319K9095K9754K9951K9797K9592K9754L0785L2568L3861L3503
57248B975046L2008L1057L1398L2178L2443L2167L1788L1711L2339L3619L4534
57237C330288L4191L3232L3088L3885L4551L4793L5371L6293L6564L6100L6178
$$ y = [1413752, 1429031, 1444606, 1459903, 1474905, 1490176, 1505882, 1521734, 1537714, 1554009, 1570453, 1586877, 1603678, 1621185, 1638807, 1655696, 1671958, 1688393, 1705396, 1722966, 1741369, 1760786, 1780583, 1799954, 1819091, 1838840, 1859442, 1880558, 1902274, 1925001, 1948491, 1971966, 1995252, 2018937, 2043393, 2068495, 2094295, 2121098, 2148744, 2176565, 2204203, 2231881, 2259801, 2287868, 2316056, 2344550, 2373465, 2402859, 2432925, 2463683, 2494550, 2524698, 2553818, 2582182, 2610156, 2638067, 2666386, 2695481, 2725235, 2755186, 2784983, 2814575, 2844329, 2875114, 2907682, 2941543, 2975046, 3007054, 3038111, 3069509, 3101687, 3134130, 3166297, 3198085, 3229796, 3262135, 3295754, 3330288, 3364479, 3397711, 3430799, 3464684, 3499235, 3534028, 3569399, 3605692, 3642256, 3678356, 3714534]
57226C714534L7357L8531L8715L8309L7938L7554L7359L8090L9493L9978L8767
57215D136625L7047L6129L5713L5061L4456L4268L3734L2084L0050K8943K8767
57204D502877K8390K7097K5136K3212K2127K2377K3449K4108K3918K3760K4392
57193D770843K5393K6099K6712K7724K8982K9933L0198K9545K8048K6515K5837
57182E075829K5710K5107K4104K3824K4212K3693K1691J9769J9221J9172J8378
57171E320710J7375J7280J7629J7069J5487J3982J3248J3171J3504J3882J3759
57160E487096J3214J3244J4503J6401J8180K0032K2326K4657K6570K8311L0106
57149E714640L1537L2458L3471L4644L4876L3458L1154K8771K5886K2038J7949
$$ y = [3714534, 3751891, 3790422, 3829137, 3867446, 3905384, 3942938, 3980297, 4018387, 4057880, 4097858, 4136625, 4173672, 4209801, 4245514, 4280575, 4315031, 4349299, 4383033, 4415117, 4445167, 4474110, 4502877, 4531267, 4558364, 4583500, 4606712, 4628839, 4651216, 4674665, 4698773, 4722691, 4746451, 4770843, 4796236, 4822335, 4849047, 4876771, 4905753, 4935686, 4965884, 4995429, 5023477, 5049992, 5075829, 5101539, 5126646, 5150750, 5174574, 5198786, 5222479, 5244170, 5263939, 5283160, 5302332, 5320710, 5338085, 5355365, 5372994, 5390063, 5405550, 5419532, 5432780, 5445951, 5459455, 5473337, 5487096, 5500310, 5513554, 5528057, 5544458, 5562638, 5582670, 5604996, 5629653, 5656223, 5684534, 5714640, 5746177, 5778635, 5812106, 5846750, 5881626, 5915084, 5946238, 5975009, 6000895, 6022933, 6040882]
57138F040882J4188R943M517j036n263q253j0591j1421r394m868N09N982J1833
57125F037028J7792K2853K6495K8899L0367L1571L3820L7981M3702N0629N9547
57114F420684P1180Q4849R9672J16113J34981J55987J78978K05723K38787K79471
57104G986425L28539L88076M60779N48141O51328P73189R17459J086519J281728
57095A4422183J505226J759226K043910K357708K698509L061896L438035L811533
57087C5098226M162875M468043M699355M831949M850640M748950M524322M179292
57079G1563652L724483L169831K508309J716825P84108k59834j344166k385733
57071G9477475l316772m093362m691200n101213n326977n381198n282724n056148
$$ y = [6040882, 6055070, 6065013, 6069530, 6068494, 6063231, 6054978, 6044387, 6032966, 6023572, 6018704, 6019213, 6025195, 6037028, 6054820, 6077673, 6104168, 6133067, 6163434, 6195005, 6228825, 6266806, 6310508, 6361137, 6420684, 6491864, 6576713, 6676385, 6792498, 6927479, 7083466, 7262444, 7468167, 7706954, 7986425, 8314964, 8703040, 9163819, 9711960, 10363288, 11136477, 12053936, 13140455, 14422183, 15927409, 17686635, 19730545, 22088253, 24786762, 27848658, 31286693, 35098226, 39261101, 43729144, 48428499, 53260448, 58111088, 62860038, 67384360, 71563652, 75288135, 78457966, 80966275, 82683100, 83467208, 83207374, 81863208, 79477475, 76160703, 72067341, 67376141, 62274928, 56947951, 51566753, 46284029, 41227881]
57063D1227881m731575m341639l917111l484020l062651k667307k306729j985352
57055A4731497j704542j463110j257623j083327r35407q09733p02921o12008n34287
57046E628539m67491m10054l60905l18966k83015k52057k25381k02175j81395
57037B927100j62277j44650j28518j13619r9649q6600p4388o2301m9315l4967
57027A970816j9483k790J5960L6803N6422O7840O3802M1300L417m2273q6496j20741
57015A984577j39770j43535j36389j23650j08830r3840q0225o8963n9733n1582
57005I78060m4230l7998l2851k8377k4502k1430j9074j7152j5608j4386j3203
56994G09249j2086j1616j1904j1944j0781q795o892n011k487O11L605O222Q288
$$ y = [41227881, 36496306, 32154667, 28237556, 24753536, 21690885, 19023578, 16716849, 14731497, 13026955, 11563845, 10306222, 9222895, 8287488, 7477755, 6774834, 6162826, 5628539, 5161048, 4750994, 4390089, 4071123, 3788108, 3536051, 3310670, 3108495, 2927100, 2764823, 2620173, 2491655, 2378036, 2278387, 2191787, 2117399, 2055098, 2005783, 1970816, 1951333, 1948543, 1964503, 2001306, 2057728, 2125568, 2189370, 2230670, 2234087, 2191814, 2105318, 1984577, 1844807, 1701272, 1564883, 1441233, 1332403, 1238563, 1158338, 1089375, 1029642, 978060, 933830, 895832, 862981, 834604, 810102, 788672, 769598, 752446, 736838, 722452, 709249, 697163, 685547, 673643, 661699, 650918, 642123, 635231, 630220, 627733, 628344, 631949, 638171, 646459]
56981F46459Q742O326J236n048j1412j7460k2440k5170k5247k3352k0295j6677
56969D95662j3302j0674q166m834j039J914L789N780Q795J2607J6808K1252K5155
56956E53747K6998K5783K1568J4653N424m811j4074k1261k6371k9115k8696k5435
56944D98410k1187j7383j3731r583n386j826J426N084R034J2760J6499K1042K6585
56931E21744L2273L6578L7626L3669K4062J0007n808k0255l0885l6757l8581l7772
56919E25901l5309l1716k7625k3592j9596j5579j2266j0457r648q513o725n113
56907C19762m018k832j452p63j096j492j188o40l27L62K031L973N071N431O102
56892C28924P562R367J1073J2781J4820J7361K0205K2580K3264K1213J6112Q429
$$ y = [646459, 655201, 661527, 662763, 657715, 646303, 628843, 606403, 581233, 555986, 532634, 512339, 495662, 482360, 471686, 463520, 458686, 457647, 459561, 463350, 469130, 477925, 490532, 507340, 528592, 553747, 580745, 606528, 628096, 642749, 648173, 643362, 629288, 608027, 581656, 552541, 523845, 498410, 477223, 459840, 446109, 436526, 431140, 429314, 430740, 435824, 444858, 457618, 474117, 495159, 521744, 554017, 590595, 628221, 661890, 685952, 695959, 690151, 669896, 639011, 602254, 563673, 525901, 490592, 458876, 431251, 407659, 388063, 372484, 360218, 349761, 340113, 331600, 324875, 319762, 315744, 312912, 311460, 310697, 309601, 308109, 306921, 306281, 305954, 306316, 308347, 312320, 317391, 322822, 328924, 336486, 345853, 356926, 369707, 384527, 401888, 422093, 444673, 467937, 489150, 505262, 513691]
56880E13691o01r106j5320j8531j9108j7754j5103j1863q514m912p78L473P180
56867D02754J0654J5047K0883K7540L4332M1279M8621N6079O2527O5699O2579
56856H47994N1250L2739J0448j1927l1296m4885n1054n0680m6373m0086l2477
56845F33653k4288j6493q784J76J0403K0237K8977L8184M9354O1913P4575Q7001
56833I54908R8269J04785J01557Q5573N7455K0842j8523n3909p9864r4293r8317
56822A078483r4563q5853p4599o2327m9680l7176k5571j5249n815L402J2946K3333
56810F67331L4814M6736N7819O6974P2873P2778O3439M4025J7363j1942l9612
56799A092598o1942p6029q1193p9345p3077o4066n3642m3436l4477k6540j9182
$$ y = [513691, 513090, 503984, 488664, 470133, 451025, 433271, 418168, 406305, 397791, 392879, 392101, 395574, 402754, 413408, 428455, 449338, 476878, 511210, 552489, 601110, 657189, 719716, 785415, 847994, 899244, 931983, 942431, 930504, 899208, 854323, 803269, 752589, 706216, 666130, 633653, 609365, 592872, 584088, 584264, 594667, 614904, 643881, 682065, 731419, 793332, 867907, 954908, 1053177, 1157962, 1259519, 1345092, 1402547, 1423389, 1404866, 1350957, 1271093, 1176800, 1078483, 983920, 898067, 823468, 761141, 711461, 674285, 648714, 633465, 627650, 631052, 643998, 667331, 702145, 748881, 806700, 873674, 946547, 1019325, 1082764, 1126789, 1144152, 1132210, 1092598, 1030656, 954627, 873434, 794089, 721012, 656946, 603304, 559868, 525391, 498851, 479669]
56788D79669j2555o529k22O809J3886K0470K6937L3215L7739L8621L4902K6072
56776F99014J2018n440k2311l5224m3615m8255m9107m6158m1079l6099l1783k7487
56764C24474k3340k0150j7774j5230j2313r759p951o610n625n098m719m044l254
56751A88607k924l211l855m558m842m178k805j798j646j564r01k28k53n84n36
56736A54724k81k28j82p3m78j416j619l02J424K052J648J056K71q14j185j3J505
56719A56089J526K14o57l52L42Q48J332J636J289N81K45K45R4O9P19J498J346
56702A67064M57K5M22R47J251J584J789J388O61L44M31L16rr9q8l37m00L22J211
56683A77279J109J03o83q74r49r01l88P2l51j095p31P10J704J669J680K347K708
$$ y = [479669, 467114, 460585, 460363, 467172, 481058, 501528, 528465, 561680, 599419, 638040, 672942, 699014, 711032, 705592, 683281, 648057, 604442, 556187, 507080, 460922, 419843, 383744, 351961, 324474, 301134, 280984, 263210, 247980, 235667, 225908, 217957, 211347, 205722, 200624, 195905, 191861, 188607, 185683, 182472, 178617, 174059, 169217, 165039, 162234, 160436, 158790, 157226, 156325, 156097, 155844, 155260, 154724, 154443, 154215, 154033, 153960, 153482, 152066, 150447, 150145, 151569, 153621, 155269, 156325, 156596, 155782, 154597, 154584, 156089, 157615, 157829, 157172, 156820, 157162, 158010, 159342, 160978, 162267, 162848, 163093, 163338, 163432, 163501, 164220, 165718, 167064, 167521, 167546, 167968, 168915, 170166, 171750, 173539, 174927, 175588, 175932, 176363, 176679, 176670, 176571, 176483, 176146, 175746, 176068, 177279, 178388, 178491, 177808, 176934, 175985, 175084, 174696, 174768, 174417, 173322, 172591, 173301, 175005, 176674, 178354, 180701, 183409]
56666A83409J994J084J216K274L223L551L551L587L616L320K620K150K836M685
56652B23116O479P214P233P238P069O410N870O110O524O200N589N604N642M227
56638C10525J455r71k226l226m735o120o505o017n465n538o415p512p734o728
56624B42788n533n108m879l877k638k472l249l534k786j895j628j876k401k970
56610A97942k921j831m85O9N5L35P60O57L36M66M77n61j875j817n12L63K50J24
56592A91832L32J99j41K90J313J625J060P61R03M83l42j23J158J603M15q22p78
56575A99768j52K00P63J854K565K488K757M040N095M709L642L298L785M506N531
56560B44849P098Q699R826J0699J1386J1130R437O952M575K529R38K28L34M69
$$ y = [183409, 185403, 186487, 187703, 189977, 193200, 196751, 200302, 203889, 207505, 210825, 213445, 215595, 218431, 223116, 229595, 236809, 244042, 251280, 258349, 264759, 270629, 276739, 283263, 289463, 295052, 300656, 306298, 310525, 311980, 311009, 308783, 305557, 300822, 294702, 288197, 282180, 276715, 271177, 264762, 257250, 249516, 242788, 237255, 232147, 227268, 223391, 220753, 218281, 215032, 211498, 208712, 206817, 205189, 203313, 200912, 197942, 195021, 193190, 192705, 192774, 192829, 193164, 193924, 194581, 194917, 195383, 195860, 195299, 193424, 191607, 191095, 191458, 191708, 191832, 192164, 192363, 192222, 192512, 193825, 195450, 196510, 197271, 198174, 198657, 198315, 198192, 199350, 200953, 201368, 200546, 199768, 199616, 199816, 200579, 202433, 204998, 207486, 210243, 214283, 219378, 224087, 227729, 231027, 234812, 239318, 244849, 251947, 260646, 270472, 281171, 292557, 303687, 313124, 320076, 324651, 327180, 328118, 328346, 328680, 329149]
56546C29149K61J13N8n03j523k078j920j954k629l275l546m042m851m983m045
56531B94232l036k737k705k628l138m366n138m657l673l053k454j440o30o45r87
56516B52945j017j024j398j748j662j514j671j782j531j173q34k60L54M22J04
56501B38211O8m3j285l125l440j607K77K32j148k149k271j956j400q14o81q64
56485B18005n58J80L43r6R6J077J240j04j400j366q83r41o94P27K224K430J889
56468B22169J783J793J083J62k2K29K86O35J731K482J708K12l65M4K97J05J7J5
56450B34364k79m98m1P19R05L70m15j124j365o67N55J003L85O3Q70J684J337O01
56432B38467P02J263J190N75O6n46j548k011j016N68J139N86P7J98N59Q24R63
$$ y = [329149, 329410, 329523, 329581, 329078, 327555, 325477, 323557, 321603, 318974, 315699, 312153, 308111, 303260, 298277, 294232, 291196, 288459, 285754, 283126, 279988, 275622, 270484, 265827, 262154, 259101, 256647, 255207, 254577, 253932, 252945, 251928, 250904, 249506, 247758, 246096, 244582, 242911, 241129, 239598, 238425, 237591, 237331, 237685, 238107, 238211, 238279, 238236, 236951, 233826, 230386, 228779, 229056, 229288, 228140, 225991, 223720, 221764, 220364, 219550, 218869, 218005, 217447, 217627, 217970, 217874, 217970, 219047, 220287, 220183, 218783, 217417, 216534, 215593, 214899, 215626, 217850, 220280, 222169, 223952, 225745, 226828, 226990, 226968, 227197, 227483, 228118, 229849, 232331, 234039, 234251, 233886, 233930, 234227, 234332, 234349, 234364, 234085, 233587, 233546, 234265, 235170, 235540, 235125, 234001, 232636, 231969, 232524, 233527, 233912, 233975, 234845, 236529, 237866, 238467, 239169, 240432, 241622, 242197, 242263, 241717, 240169, 238158, 237142, 237710, 238849, 239435, 239512, 239710, 240269, 241093, 242056]
56415B42056R48J030J617K293J961O62q2M96J232J073O82Q49R41L21k32k0J44
56398B55971m16p42O1R84P28j50m74n32j111j661j250k92L75J100K492L995M929
56381B64007N758O761O834N302L510K810K381R70o74j169r64j246j651j260o95
56366B90674r76j393p04N32J002R83J413J715R00j14K97J668K194J591J027Q60
56350C01669N41J43M5j98r01j089j23P49L93n1Q26K002J862J312K166L690L719
56333C16755K416J829K386K751K693L159L850L522K482K224K769K822K252J997
56319C53907J974J417P96J012J354O53k81PO96L5j215q02J052J964J448J385K450
56302C67852L177K925K849L497M070M350N003N696N331M175L575L608L231K572
$$ y = [242056, 243004, 244034, 245651, 247944, 249905, 250567, 250485, 250981, 252213, 253286, 253968, 254817, 255758, 256079, 255847, 255827, 255971, 255555, 254813, 254874, 255858, 256586, 256436, 255962, 255430, 254319, 252658, 251408, 251116, 251491, 252591, 255083, 259078, 264007, 269765, 276526, 283360, 288662, 292172, 294982, 297363, 298333, 297659, 296490, 295526, 294280, 292629, 291369, 290674, 289698, 288305, 287601, 288133, 289135, 290118, 291531, 293246, 294146, 294032, 294329, 295997, 298191, 299782, 300809, 301669, 302210, 302353, 302398, 302200, 301299, 300210, 300087, 300836, 301229, 301178, 302004, 304006, 305868, 307180, 309346, 313036, 316755, 319171, 321000, 323386, 326137, 328830, 331989, 335839, 339361, 341843, 344067, 346836, 349658, 351910, 353907, 355881, 357298, 358094, 359106, 360460, 361113, 360832, 360839, 361535, 361570, 360355, 359553, 360605, 362569, 364017, 365402, 367852, 371029, 373954, 376803, 380300, 384370, 388720, 393723, 399419, 404750, 408925, 412500, 416108, 419339, 421911]
56288D21911K674L295L345L186M093N791O915P459Q278Q850Q186P213P443Q062
56274E06701P405O466P541J0070J1452J1511J2432J4507J5773J5955J6896J8887
56262F55596K0261K0995K3036K6604K9754L2075L5272L9605M3438M6869N2149
56251A025654N9651O7005P3108P9582Q7318R4995J01881J08763J15149J18910
56241A932016J19697J19445J18680J15495J08954J00155Q9102P4067N5140L4990
56231B867741J5090n455k6447m5537o1706p6267q9256r8445j03268j06139j08442
56220B161869j08630j05878j02124r8823r4871q9443q3742p8498p2723o6406o1325
56209A199406n7770n3669m8283m3501m0213l6784l2545k9310k7773k5870k2428
$$ y = [421911, 424585, 427880, 431225, 434411, 438504, 444295, 451210, 458669, 466947, 475797, 483983, 491196, 498639, 506701, 514106, 520572, 528113, 538183, 549635, 561146, 573578, 588085, 603858, 619813, 636709, 655596, 675857, 696852, 719888, 746492, 776246, 808321, 843593, 883198, 926636, 973505, 1025654, 1085305, 1152310, 1225418, 1305000, 1392318, 1487313, 1589194, 1697957, 1813106, 1932016, 2051713, 2171158, 2289838, 2405333, 2514287, 2614442, 2703544, 2777611, 2832751, 2867741, 2882831, 2877376, 2850929, 2805392, 2743686, 2667419, 2578163, 2479718, 2376450, 2270311, 2161869, 2053239, 1947361, 1845237, 1746414, 1651543, 1562100, 1478358, 1399860, 1327137, 1260731, 1199406, 1141636, 1087967, 1039684, 996183, 955970, 919186, 886641, 857331, 829558, 803688, 781260]
56198G81260j9143j7223j5396j2939j1278j0817r619p067n429n847o217n017l870
56185F51398m138m347l187j975j861j625m37K09n55j013J29J579K123K563L315
56170F42178L112J851J569K930L906L551L623M899N583N090N593P833R346Q950
56156G10014Q997J0925J2593J2584J3075J5646J8219J9058K0063K3075K6555K9004
56144I19808L2108L7448M3503M8946N5500O4465P3831Q1729Q9374R7519J03447
56133A647678J04517J01433R5330Q5334P2079N9850N1929M6998M2923M0172L8465
56122B386708L4198K4940J3073J710r256j9941k7730l1641l5614m3504n4275o5543
56110B173125p7724r0670j00363j03441j01550r7358q9995p8610o6382n6573m8005
$$ y = [781260, 762117, 744894, 729498, 716559, 705281, 694464, 684845, 677778, 672349, 666502, 660285, 655268, 651398, 647260, 642913, 639726, 637751, 635890, 634265, 633828, 634037, 633482, 632469, 632598, 634177, 636300, 638863, 642178, 645290, 647141, 648710, 651640, 655546, 659097, 662720, 667619, 673202, 678292, 683885, 691718, 701064, 710014, 719011, 729936, 742529, 755113, 768188, 783834, 802053, 821111, 841174, 864249, 890804, 919808, 951916, 989364, 1032867, 1081813, 1137313, 1201778, 1275609, 1357338, 1446712, 1544231, 1647678, 1752195, 1853628, 1948958, 2034292, 2106371, 2166221, 2218150, 2265148, 2308071, 2348243, 2386708, 2420906, 2445846, 2458919, 2460629, 2451373, 2431432, 2403702, 2372061, 2336447, 2292943, 2238668, 2173125, 2095401, 2004731, 1904368, 1800927, 1699377, 1602019, 1512024, 1433414, 1367032, 1310459, 1262454]
56099A262454l8758l0590k5389k1040j5316j0216p942o336k916K55N30j70J107
56086A105673L219L997M769P114Q844Q043P311R126J0928R864Q390R794J2111
56073A209183J2015J0997J1993J3559J3129J2501J4376J6874J7097J6751J8609
56062A367084K0916K0836J9973K0988K2371K1907K1442K2832K3424K1009J8821
56051A601603J9890K1292J9936J8853K1298K3934K2948K1581K4123K7650K7655
56040A850763K6811K9807L4248L5177L4299L6155L9391M0230M0450M3466M6835
56029B257632M7019M7035N0875N5215N5471N4850N8242O2438O2231O0798O3807
56018B875613O8541O9463O9298P3573P9404Q1148Q1962Q7906R5707R8544R8948
$$ y = [1262454, 1223696, 1193106, 1167717, 1146677, 1131361, 1121145, 1113203, 1106867, 1103951, 1104206, 1104736, 1104566, 1105673, 1108892, 1112889, 1117658, 1124772, 1133616, 1141659, 1148970, 1158096, 1169024, 1178888, 1187278, 1197072, 1209183, 1221198, 1232195, 1244188, 1257747, 1270876, 1283377, 1297753, 1314627, 1331724, 1348475, 1367084, 1388000, 1408836, 1428809, 1449797, 1472168, 1494075, 1515517, 1538349, 1561773, 1582782, 1601603, 1621493, 1642785, 1662721, 1681574, 1702872, 1726806, 1749754, 1771335, 1795458, 1823108, 1850763, 1877574, 1907381, 1941629, 1976806, 2011105, 2047260, 2086651, 2126881, 2167331, 2210797, 2257632, 2304651, 2351686, 2402561, 2457776, 2513247, 2568097, 2626339, 2688777, 2751008, 2811806, 2875613, 2944154, 3013617, 3082915, 3156488, 3235892, 3317040, 3399002, 3486908, 3582615, 3681159, 3780107]
56007C780107J03622J10505J13740J16241J24141J33960J38924J42757J53072
55998D917069J66486J74896J81089J92906K07503K17168K25151K39333K56039
55989F777640K67270K77991K98224L24003L44987L64717L93562M28076M58357
55980I934827M89383N32781N84063O31506O80967P46914Q25850R05183R91539
55971A6323013J101931J234068J376033J538269J743294J991514K272802K603755
55963C0184679L013656L501123M048094M669108N399087O241629P186937Q277909
55955G2522222R600179J1214661J3169841J5570557J8543435K2128393K6281907
55948A89031195L0913931L5649882L9407691M0416812L7004455K8569126J5923125
$$ y = [3780107, 3883729, 3994234, 4107974, 4224215, 4348356, 4482316, 4621240, 4763997, 4917069, 5083555, 5258451, 5439540, 5632446, 5839949, 6057117, 6282268, 6521601, 6777640, 7044910, 7322901, 7621125, 7945128, 8290115, 8654832, 9048394, 9476470, 9934827, 10424210, 10956991, 11541054, 12172560, 12853527, 13600441, 14426291, 15331474, 16323013, 17424944, 18659012, 20035045, 21573314, 23316608, 25308122, 27580924, 30184679, 33198335, 36699458, 40747552, 45416660, 50815747, 57057376, 64244313, 72522222, 82122401, 93337062, 106506903, 122077460, 140620895, 162749288, 189031195, 219945126, 255595008, 295002699, 335419511, 372423966, 400993092, 416916217]
55941D16916217R30416j4045772k6655676l5184892l9136371l9254007l6873647
55934B26696268l3190725k9001528k4817590k0960013j7558210j4612993j2111273
55927G4443936j0046856q367857o987378n848599m928762m189399l575593l059753
55919B7439739k640305k300366k007792j751791j541388j370252j217111j077634
55911A3533100r63345q71330p85170p03392o38095n87382n36595m85122m45533
55902G517136m17182l86067l50425l22336l03629k83189k58792k39829k27277
55893D728410k11627j92031j78010j70679j60771j46590j36248j30811j22409
55884C279234j10288j02146r8146r0035p7633p0313p0266o9651o6263o6825p2283
$$ y = [416916217, 417846633, 403800861, 377145185, 341960293, 302823922, 263569915, 226696268, 193505543, 164504015, 139686425, 118726412, 101168202, 86555209, 74443936, 64397080, 56029223, 49041845, 43193246, 38264484, 34075085, 30499492, 27439739, 24799434, 22499068, 20491276, 18739485, 17198097, 15827845, 14610734, 13533100, 12569755, 11698425, 10913255, 10209863, 9571768, 8984386, 8447791, 7962669, 7517136, 7099954, 6713887, 6363462, 6041126, 5737497, 5454308, 5195516, 4955687, 4728410, 4516783, 4324752, 4146742, 3976063, 3815292, 3668702, 3532454, 3401643, 3279234, 3168946, 3066800, 2968654, 2878619, 2800986, 2730673, 2660407, 2590756, 2524493, 2457668, 2385385]
55873B385385p4521p0794o7837o8629o7989o4183o2457o3964o2977n8019n4532
55862A669483n3851n0535m3321l8074l7185l6117l2892l1170l1618k9960k5857
55851A258903k4229k5791k5509k2408k1438k3769k4578k2576k2336k4913k5321
55840I96035k1975j9756k0966k1623j9462j7586j7568j6698j4438j3991j5275
55829G96697j3943r522o899p702p819n662n038p468r228q658r018j1443j2305
55816F81992j0327r297j0885j1600r664q209q836q536n913m050m311l588n17J707
55802E87966J589K272N308P469O839O281P638Q054N375K039M18r29l428n598o628
55787F24665q303j0867j1578r591p773p646p300o209p038j0489j3343j3789j3773
$$ y = [2385385, 2310864, 2240070, 2172233, 2103604, 2035615, 1971432, 1908975, 1845011, 1782034, 1724015, 1669483, 1615632, 1565097, 1521776, 1483702, 1446517, 1410400, 1377508, 1346338, 1314720, 1284760, 1258903, 1234674, 1208883, 1183374, 1160966, 1139528, 1115759, 1091181, 1068605, 1046269, 1021356, 996035, 974060, 954304, 933338, 911715, 892253, 874667, 857099, 840401, 825963, 811972, 796697, 782754, 773232, 766333, 758631, 750812, 745150, 740112, 732644, 723416, 714758, 705740, 694297, 681992, 671665, 662368, 651483, 639883, 630219, 622010, 613174, 604638, 598725, 594675, 590364, 586776, 586259, 587966, 589555, 591827, 597135, 604604, 611443, 617724, 625362, 633416, 638791, 640830, 641248, 640319, 636891, 631293, 624665, 616362, 605495, 593917, 584326, 576553, 568907, 561607, 555398, 548360, 537871, 524528, 510739, 496966]
55774D96966j4085j2267p707l551j176K037P006J0218R378O710L985n10p053j1767
55760D78184j2168j0877j0671j0430r041q642j0495j1933j0925r565r758r540
55748C54139p184m976n298o505o215n365n604n835m614l096k606k117q33l08j471
55733B92112k570k416k444l302k940n92R12m75k755l618l929m817m934l485k555
55718B52192l418l842k061m4J53J7J382K892K937K968M604O287O066M909M156
55703B79198K681k60k395k072j669l841o976p999p170o546n953m227k402k093
55689B28276k472j999j425j975k456j293L99Q18P89K058M012M978N088N148M440
55674B44386K427P62P62Q11q79k902l009j891j586j906j533r91j368j703o80N85
$$ y = [496966, 482881, 470614, 462907, 459356, 458180, 460217, 467223, 477441, 486819, 493529, 497514, 497004, 489951, 478184, 466016, 455139, 444468, 434038, 424997, 416355, 405860, 393927, 383002, 373437, 363679, 354139, 346955, 341979, 336681, 330176, 323961, 318596, 312992, 307157, 302543, 299447, 296841, 294724, 293891, 293583, 292112, 289542, 287126, 284682, 281380, 278440, 277848, 278760, 278285, 275530, 271912, 267983, 263166, 258232, 254747, 252192, 248774, 244932, 242871, 242827, 242980, 242997, 244379, 247271, 250208, 253176, 257780, 264067, 270133, 275042, 279198, 281879, 281619, 279224, 277152, 275483, 271642, 264666, 256667, 249497, 242951, 236998, 232771, 230369, 228276, 225804, 223805, 222380, 220405, 217949, 216656, 217055, 217873, 218662, 220720, 224732, 229710, 234798, 239946, 244386, 246813, 247575, 248337, 249148, 248269, 245367, 242358, 240467, 238881, 236975, 235442, 234451, 233083, 231380, 230700, 231285]
55658B31285M65m7Q16K237K425K114L113M662M564L026K132K215J815O18l76j073
55642B59991k145l220l557l818m993o387o819o793p316p713o819n289m434l921
55628A86767k818j763j774k143j796j463k140k703j626K04Q61M44K25K7j006k096
55612A67200k013j546k192l344l388k590k317k280j329p9l6p76p03N1O3o11p18
55595A43392l12m74j005q46l28o34j462j467o06J60Q30J893K557J800N07L20R59
55578A45284R86N81J082K375L218L625M548N562N365M292L990M831N699O027N944
55563B03409M914K419m34k147l148m728o421o788o232o442p400p486o299m986
55549A48231l949k628j374j141j414p68N39Q67j8o56m11r4q0R1K15l79j178j014
$$ y = [231285, 231750, 231703, 232519, 234756, 237181, 239295, 242408, 247070, 251634, 254660, 256792, 259007, 260822, 261440, 261064, 259991, 257846, 254626, 251069, 247251, 242258, 235871, 229052, 222259, 214943, 207230, 200411, 195122, 190688, 186767, 183949, 182186, 180412, 178269, 176473, 175010, 172870, 170167, 168541, 168745, 169606, 170050, 170275, 170302, 169296, 167200, 165187, 163641, 161449, 158105, 154717, 152127, 149810, 147530, 146201, 146122, 146086, 145310, 144607, 144658, 144721, 144110, 143392, 143080, 142606, 141601, 140755, 140427, 139793, 138331, 136864, 136258, 136418, 137248, 139141, 141698, 143498, 144005, 144325, 145284, 146270, 146851, 147933, 150308, 153526, 157151, 161699, 167261, 172626, 176918, 180908, 185739, 191438, 197465, 203409, 208323, 210742, 210308, 208161, 205013, 200285, 193864, 187076, 180844, 174402, 167002, 159516, 153217, 148231, 144282, 141654, 140280, 139139, 137725, 136957, 137496, 138363, 138345, 137689, 137278, 137184, 137104, 137195, 137410, 137031, 135853, 134839]
55531A34839j71N0l13j04N60L21j043k326l005l608m021l563k757k965m120m825
55515A02949m735m922n746o316o248o172o319o198n612m587k682J32K486L329
55501D9359L720N026O263N707M206M056N146N316M199L505L538K699R60M21J646
55486A05767K456J497K03kJ15m18r11o11k08l29k43O44J517J558J269J360J624
55469A15288J693J726J637R27j84p42o54r32j883k511k142j298n67J7J67n57j527
55452A08458j404j33R35J128J117J319J263R00Q46R41K61j084j819j533j194j225
55436A08776q76N2N89L24J13N05R52J047J122J191Q23L10M06P98N46N7O40J981
55418A19356K261J160L74O86R29N79Q42K120K787J851O07K86N8j038k119k072
$$ y = [134839, 134668, 134718, 134405, 134301, 134861, 135182, 134139, 131813, 128808, 125200, 121179, 117616, 114859, 111894, 107774, 102949, 98214, 93292, 87546, 81230, 74982, 68810, 62491, 56293, 50681, 46094, 43412, 43544, 46030, 49359, 53079, 58105, 64368, 70075, 74281, 78337, 83483, 88799, 92998, 96503, 100041, 102740, 103700, 104121, 105767, 108223, 109720, 109923, 109921, 110036, 109618, 108707, 108096, 107888, 107559, 107316, 107960, 109477, 111035, 112304, 113664, 115288, 116981, 118707, 120344, 121271, 121087, 120345, 119691, 118759, 116876, 114365, 112223, 110925, 110358, 110375, 110542, 109985, 108458, 107054, 106921, 107856, 108984, 110101, 111420, 112683, 113583, 114429, 115370, 115631, 114547, 112728, 111195, 110001, 108776, 107900, 107952, 108541, 108865, 108978, 109483, 110435, 111482, 112604, 113795, 114618, 114928, 115334, 116132, 116678, 116735, 117375, 119356, 121617, 122777, 123151, 123837, 124766, 125345, 126187, 128307, 131094, 132945, 133552, 133838, 133896, 132858, 130739, 128667]
55402A28667j519j554j871j719j396j369j149m13mm53p26J17J126Q46m91j532
55386A16560j748j497r30j08M19K70j4J87N75N76K89L8k58o03n43j7K67j00n11
55367A12852l85l2R6J54L11K57r3k76j22p4l44n82p33j061j186m12P34P45n67
55348A09282j592j296n25k77l04k45m98j006p47M91J278O89j63JO53O84L06K86
55330A07017L11l07j163j377j049q19o64k42J78K03J05K69M93O24J089J950K304
55313A08922J500J59p86j217j271p10K94P77L73P3O20J221Q41j62p90q71p63m54
55295A07756rK9l81l19N66J131M30p26j081p37m29k8P61J182M54o62q79l44j59
55276A06555n05o88n86n66l30O99J948K052P18q70j550j309q57p40r23q02J33
$$ y = [128667, 127148, 125594, 123723, 122004, 120608, 119239, 118090, 117677, 117673, 117220, 116494, 116611, 117737, 118583, 118092, 116560, 114812, 113315, 112385, 112277, 112696, 112966, 112952, 113139, 113714, 114290, 114579, 114617, 114359, 113756, 113213, 113196, 113463, 113363, 112852, 112467, 112435, 112531, 112685, 112996, 113253, 113160, 112884, 112762, 112688, 112344, 111762, 111029, 109968, 108782, 108370, 109104, 109849, 109282, 107690, 106394, 105869, 105592, 105288, 105043, 104545, 103539, 102792, 103283, 104561, 105250, 105087, 105088, 105741, 106425, 106731, 107017, 107328, 107021, 105858, 104481, 103432, 102613, 101949, 101707, 101885, 102088, 102193, 102462, 102955, 103579, 104668, 106618, 108922, 110422, 110581, 109795, 108578, 107307, 106597, 106891, 107668, 108041, 108114, 108734, 109955, 110796, 110634, 109844, 108973, 108210, 107756, 107747, 107776, 107395, 107076, 107642, 108773, 109203, 108477, 107396, 106659, 106230, 106202, 106963, 108145, 108599, 107937, 107058, 106714, 106555, 106050, 105362, 104776, 104210, 103880, 104579, 106527, 108579, 109297, 108427, 106877, 105568, 104711, 103971, 103048, 102246, 102379]
55259A02379J384J796J028l7o58r95j070l10J115J823J125K30L95J078J186R92
55243A11461J258J475P63l00n31k32o29j585j734p46K33M74M67O13N67J63j55
55226A11562j37n5k5J42L48L08K26N43J078J196Q37N88P12Q34O17J25n04j099
55208A17296j262p18J84P22N60j09q67j276j088o30n37q11p76k52K5l26n41N0
55190A09644Q28Q40K83P0L80O06L84j07n70o40lJ029J549J214P17O00M76K5k42
55171A17083oQ1l37l71N73J333N51j026j456l62P77R02L67k60r57j516j331l15
55153A13730P41J115R38Q53J231J761J677O27o71j138p38l83l47Q4J043J521J063
55136A23107O43R71J225N50m26q08r45j386j521p88j81p91j807j738q11l17k93
$$ y = [102379, 103763, 105559, 106587, 106550, 105892, 104897, 103827, 103517, 104632, 106455, 107580, 107810, 108205, 109283, 110469, 111461, 112719, 114194, 114957, 114657, 114126, 113894, 113265, 111680, 109946, 109200, 109433, 109907, 110374, 110987, 111554, 111717, 111562, 111425, 111370, 111345, 111487, 111835, 112143, 112369, 112912, 113990, 115186, 116023, 116611, 117323, 118157, 118774, 118899, 118395, 117296, 116034, 115316, 115500, 116222, 116782, 116673, 115806, 114530, 113442, 112812, 112275, 111464, 110688, 110436, 110461, 110135, 109594, 109644, 110472, 111312, 111595, 111665, 112045, 112651, 113035, 112928, 112358, 111718, 111715, 112744, 114293, 115507, 116224, 116824, 117300, 117325, 117083, 117077, 117158, 116821, 116450, 117023, 118356, 118907, 117881, 116425, 116063, 116840, 117742, 118109, 117849, 116892, 115376, 114045, 113730, 114471, 115586, 116524, 117377, 118608, 120369, 122046, 122673, 122002, 120864, 120126, 119743, 119396, 119480, 120523, 122044, 123107, 123750, 124721, 125946, 126496, 126070, 125262, 124317, 122931, 121410, 120622, 120441, 119650, 117843, 116105, 115294, 114977, 114684]
55119A14684K41J149J325O72J43k1l48o65l15L34K68k91j08R72J832J959J879
55102A23710J640O29q38j418o18N53J195J421J412R27J08l90m21m38m79j37M24
55085A27280O18O30J136J801J472Q3j040j107p57o73o05k77o7k40l84j54K58O39
55067A28613R55R17K27o53q67m02mR3L00N95L75m44j239j650j822j720j283j073
55049A20918j577k007j153O20J657J357O90K93l26j221j397l92Q13J214R78O44
55033A21111K19k63l95j43m0j96q3L19K94k61l99L86J304J528J298J085O89m5
55015A26408n28k24L88L80m65j540k090j699n59N93J213J589K186K617K143J026
54999A31438K94K09Q1k89k21N57J292J292O73j69r37j186o70p2l10j084j222n22
$$ y = [114684, 114925, 116074, 117399, 118071, 118214, 118193, 117845, 117180, 116865, 117199, 117467, 117176, 117068, 118040, 119872, 121831, 123710, 125350, 125979, 125141, 123723, 123105, 123658, 124853, 126274, 127686, 128613, 128721, 128331, 127910, 127472, 126993, 126856, 127280, 127898, 128528, 129664, 131465, 132937, 133020, 131980, 130873, 130116, 129443, 128838, 128561, 128494, 128254, 127870, 127716, 127974, 128613, 129568, 130485, 130712, 130059, 129192, 128790, 128786, 128879, 129179, 129774, 130149, 129705, 128466, 126816, 124994, 123274, 121991, 120918, 119341, 117334, 116181, 116801, 118458, 119815, 120505, 120798, 120472, 119251, 117854, 117462, 118275, 119489, 120467, 121111, 121330, 121067, 120672, 120529, 120489, 120293, 120210, 120529, 120823, 120562, 120163, 120549, 121853, 123381, 124679, 125764, 126453, 126408, 125880, 125656, 126044, 126424, 125959, 124419, 122329, 120630, 120071, 120664, 121877, 123466, 125652, 128269, 130412, 131438, 131732, 131941, 132022, 131733, 131512, 132069, 133361, 134653, 135326, 135157, 134220, 133034, 132364, 132292, 131982, 130898, 129676, 129154]
54981A29154N7J22L50R91J310R25M27J91j13m80k86M08O58J24l95l98l00k23L70
54962A32892J297J438N74m5L02P20M63K47P53J244R12L41L81O24K50n07r26r92
54944A39968r79o30K01Q77Q78O32N52K12o48j225q82k75j92j38P20K003K738K860
54926A46672K919K905K548K214K373K598K291J870K254L410M527N218N606N506
54912A92911M474K518R1k367m268m897m332l765m142m971n235m856m362l765k799
54897A50235j812j329j128o69j15N2L8L73Q13O81J08j1O49J438J735J658J667
54880A54383J985K533L102L535L877M205M360M193M018M169M171L211J500J46
54866A99388n65j516l013m053m043l941m624n406n241m375l539k562j179k33n77
$$ y = [129154, 129211, 129333, 129683, 130674, 131984, 132909, 133336, 133527, 133414, 132934, 132648, 133056, 133714, 133838, 133443, 133045, 132745, 132522, 132892, 134189, 135627, 136201, 136156, 136458, 137178, 137641, 137888, 138641, 139885, 140797, 141138, 141519, 142143, 142393, 141886, 140960, 139968, 138989, 138359, 138560, 139437, 140315, 140947, 141499, 141711, 141063, 139838, 138956, 138681, 138489, 138351, 139071, 141074, 143812, 146672, 149591, 152496, 155044, 157258, 159631, 162229, 164520, 166390, 168644, 172054, 176581, 181799, 187405, 192911, 197385, 199903, 199994, 197627, 193359, 188462, 184130, 180365, 176223, 171252, 166017, 161161, 156799, 153034, 150235, 148423, 147094, 145966, 145297, 145182, 145234, 145272, 145645, 146458, 147139, 147247, 147236, 147885, 149323, 151058, 152716, 154383, 156368, 158901, 162003, 165538, 169415, 173620, 177980, 182173, 186191, 190360, 194531, 197742, 199242, 199388, 198823, 197307, 194294, 190241, 186198, 182257, 177633, 172227, 166986, 162611, 159072, 156510, 155331, 155098, 154521]
54851A54521j450j545j142j545k770l485l123k520k308k101j463n81K83J015J262
54836A33048O94k63q14q70r15r34m67L13O05J85l07m27l73k80P4N79O45O3n72
54817A29984o20j43L14L62O2j92j4N25R12Q47O14O07Q42J164J490J529Q79j88
54799A38974o66j25N17K69m64n40K67J152J495J355R01K34k77j80N35J476K191
54782A47114K262J450J78o11n14p5K82Q93J890K519K248J779J954K441K538K578
54766A68926L295M361M894M955N289N847N932N580N437N274L985J271j734l843
54752B19469m985n773o566p190p096n917m165l051l073l357k974k235j870j660
54738A59557j036l75m48r81j064o38l05j2P60J723K097J940J881J722Q74k2N03
$$ y = [154521, 153071, 151526, 150384, 148839, 146069, 142584, 139461, 136941, 134633, 132532, 131069, 130488, 130771, 131786, 133048, 133742, 133479, 132665, 131795, 130880, 129946, 129479, 129792, 130397, 130582, 130275, 129848, 129475, 129195, 129269, 129848, 130493, 130556, 129984, 129364, 129221, 129535, 129897, 129959, 129767, 129753, 130278, 131190, 132037, 132651, 133258, 134100, 135264, 136754, 138283, 139162, 138974, 138308, 138183, 138700, 138969, 138505, 137965, 138232, 139384, 140879, 142234, 143135, 143369, 143092, 142912, 143447, 144923, 147114, 149376, 150826, 151004, 150393, 149879, 149804, 150086, 150979, 152869, 155388, 157636, 159415, 161369, 163810, 166348, 168926, 172221, 176582, 181476, 186431, 191720, 197567, 203499, 209079, 214516, 219790, 223775, 225046, 223312, 219469, 214484, 208711, 202145, 194955, 187859, 181942, 177777, 174726, 171653, 168296, 165322, 163087, 161217, 159557, 158521, 158146, 157698, 156717, 155653, 155015, 154710, 154698, 155458, 157181, 159278, 161218, 163099, 164821, 165695, 165673, 166176]
54721A66176K505M383N099N230N487N606N191M357L052Q77j836l874m551m406
54707A93296m157l922l804m176m890n150m591l739l073k498j954j656j457q87
54693A47342j49n5p22j291j278j131j117q33k38k6l44k32Q98K146K357J656R46
54676A47929N17J7o39j070r85m53K23N74L42j52l54k83m27q50j060q92o97n93
54658A41147k88J68L41K20K52L71J5p18r36l55K51L72M75Q36Q35J47m02k3P98
54639A43506J115Q63N14Q7n99j169j060l36M98J161J502J202K15q86j469j498
54623A43646j191n59K91Q87R69R11J072J201Q89K72k42m49k50L70R45P42j59p45
54605A48600n24l21q98j587j254n6Q17Q28N19L81L14J94J60J92N3j72q0L73O74
$$ y = [166176, 168681, 173064, 178163, 183393, 188880, 194486, 199677, 204034, 207086, 207963, 206127, 202253, 197702, 193296, 189139, 185217, 181413, 177237, 172347, 167197, 162606, 158867, 155794, 153296, 151342, 149686, 148229, 147342, 147193, 147138, 146416, 145125, 143847, 142716, 141599, 140766, 140528, 140502, 140158, 139926, 140824, 142970, 145327, 146983, 147929, 148446, 148463, 147824, 146754, 145769, 145316, 145539, 146113, 146455, 146303, 145949, 145666, 145239, 144389, 143329, 142437, 141740, 141147, 140859, 141027, 141368, 141588, 141840, 142211, 142226, 141508, 140572, 140217, 140468, 140840, 141315, 142151, 142986, 143133, 142731, 142708, 143506, 144621, 145484, 145998, 146085, 145486, 144317, 143257, 142921, 143419, 144580, 146082, 147284, 147499, 146613, 145144, 143646, 142455, 141896, 142187, 143074, 144043, 144954, 146026, 147227, 148116, 148388, 148146, 147697, 147447, 147817, 148762, 149504, 149345, 148600, 148076, 147755, 146857, 145270, 144016, 143960, 144777, 145605, 146124, 146505, 146819, 147013, 147173, 147365, 147418, 147246, 147166, 147539, 148213]
54586A48213L91k92q21q41m71j14n3j52o6K39M25K83L5mK55P66J431J856J494
54567A52574K88r88j406p79K74R54R14M74K31L33K28m96j301j281m83Q2j43n81
54549A48894m87J08P30J122J221R53N00K64K94K13l2J46J090K226K637K062R45
54532A62886o8m73j59L55K93m27r53n43N40J365J250J58j359k414k419j701j157
54515A55174j145j185q34k59K50O92R77P89J66k48KN68P94M36k96r95j212p80
54497A52894j53P1j0J42M29J62p03j296j163q61q30o12J36P82O75L05O47J705
54479A52320K506K277J146o2m36K58J173J249O17M33J150J878J846J451J251R42
54463A69999J76m88m08O3K87M75J067J520Q97o20j834k062j696j294r37n07l2
$$ y = [148213, 148604, 148312, 147491, 146650, 146179, 146065, 146012, 145860, 145794, 146033, 146458, 146741, 146776, 146772, 147027, 147793, 149224, 151080, 152574, 152862, 151874, 150468, 149689, 149963, 150917, 151831, 152305, 152536, 152869, 153097, 152601, 151300, 150019, 149536, 149618, 149475, 148894, 148407, 148515, 149245, 150367, 151588, 152541, 153041, 153305, 153599, 153812, 153780, 153926, 155016, 157242, 159879, 161941, 162886, 162818, 162345, 162186, 162541, 162834, 162407, 161454, 160911, 161451, 162816, 164066, 164224, 162865, 160451, 158032, 156331, 155174, 154029, 152844, 152010, 151751, 152001, 152693, 153670, 154459, 154625, 154377, 154379, 154947, 155741, 156177, 155881, 154886, 153674, 152894, 152741, 152812, 152802, 152944, 153373, 153535, 152832, 151536, 150373, 149512, 148682, 148070, 148206, 148988, 149663, 149968, 150615, 152320, 154826, 157103, 158249, 158187, 157751, 158009, 159182, 160431, 161048, 161481, 162631, 164509, 166355, 167806, 169057, 169999, 170175, 169687, 169279, 169342, 169629, 170104, 171171, 172691, 173588, 172968, 171134, 169072, 167376, 166082, 165145, 164638, 164606]
54446A64606K55k6j057k210k306r79O54J268P69k9o37j037j077o15RL71O09J104
54428A59672J714J933J607R97L55q3l8M22P67O84M75L97K15j57k64Qn4q63j579
54409A66208j218q9P70J053J159J113O40kk09J29P50J597K472K636J737P33P77
54392A80256J507J616Q59K26K14K38o9j85K26N81K14o95j492j770j485p82N2P29
54374A80240J139J214Q08M3n28m81qN01R79J343J219N97K21O20J318J661J841
54357A92727K246K539K379K359L039L598K931J545Q60Q97K99j320k752l111k893
54342B05343k697k384j944j887k192k064j331j047j912l149l558k940j822o12
54328A75804L44N83P5m94n65l20j44j4J74K98L04K99J51l99r97q62NO01K75m22
$$ y = [164606, 164861, 164835, 163778, 161568, 159262, 158283, 158937, 160205, 160974, 160945, 160308, 159271, 158194, 157579, 157588, 157959, 158568, 159672, 161386, 163319, 164926, 165923, 166278, 166195, 166157, 166579, 167346, 168030, 168505, 168902, 169117, 168960, 168696, 168704, 168650, 167787, 166208, 164990, 164901, 165671, 166724, 167883, 168996, 169636, 169634, 169425, 169554, 170304, 171901, 174373, 177009, 178746, 179479, 180256, 181763, 183379, 184238, 184464, 184678, 184916, 184847, 184662, 184888, 185469, 185683, 184988, 183496, 181726, 180241, 179459, 179511, 180240, 181379, 182593, 183401, 183444, 182916, 182435, 182427, 182928, 183907, 185250, 186469, 187066, 187287, 187907, 189225, 190886, 192727, 194973, 197512, 199891, 202250, 205289, 208887, 211818, 213363, 214223, 215120, 215419, 214099, 211347, 208236, 205343, 202646, 200262, 198318, 196431, 194239, 192175, 190844, 189797, 187885, 184736, 181178, 178238, 176416, 175804, 176148, 176731, 176806, 176312, 175747, 175427, 175283, 175269, 175443, 175741, 176045, 176344, 176495, 176096, 175099, 174237, 174242, 174843, 175118, 174696]
54308A74696p24o47n21k74J44L00q5n39n10j72rpR8J36k34q06r58m84K01N85N27
54287A70717K32M9K02N69Q34Q81Q67Q62P28L89k6k87j73M33J208J445Q60J66J89
54268A80145O98P92K19m32q05j026r79l29N65Q35M88M88J128J429P67L7L04J167
54250A85491J427Q11L5m25o81q25p90p52r54j244j298j222j359j548j204j47J021
54233A76336J573J395R53O72N00J19n20j053j210j100q20j44Q88J482R87M1r2
54216A80007O83J155O74jp3M9l84j106j284p76k34j64n60j146j485j059J20J207
54198A75623J301M63m49q09p04n33n02n46n21l89k27j5M00R28J058N17j71l53
54180A75071k93p06j379j255p7J098J439J386J602J760J250L32k86n23p65j035
$$ y = [174696, 173972, 173325, 172804, 172530, 172674, 172974, 172889, 172350, 171840, 171668, 171659, 171652, 171750, 171886, 171652, 170846, 169888, 169404, 169605, 170190, 170717, 170949, 170998, 171200, 171769, 172603, 173484, 174351, 175213, 175941, 176330, 176304, 176017, 175844, 176277, 177485, 178930, 179790, 179956, 180145, 180843, 181635, 181854, 181422, 180617, 179591, 178612, 178283, 178848, 179683, 180171, 180659, 181787, 183216, 183983, 184020, 184324, 185491, 186918, 187729, 187764, 187339, 186658, 185833, 185043, 184291, 183337, 182093, 180795, 179573, 178214, 176666, 175462, 175315, 176336, 177909, 179304, 180257, 180929, 181429, 181548, 181028, 179975, 178765, 177665, 176845, 176701, 177589, 179071, 180058, 180099, 180007, 180690, 181845, 182519, 182518, 182445, 182494, 182110, 181004, 179720, 178944, 178710, 178546, 177986, 176840, 175355, 174296, 174416, 175623, 176924, 177387, 176938, 176129, 175425, 174892, 174390, 173844, 173323, 172934, 172707, 172692, 173092, 174020, 175078, 175595, 175424, 175071, 174778, 174072, 172693, 171438, 171361, 172459, 173898, 175284, 176886, 178646, 179896, 180228, 179942, 179419, 178654, 177619]
54164A77619j077r58q71o27j5N97O85M13L16M61M66K92K76M53M30J4n05p42o07
54145A76620k75l8j07l92n83n53m64l43k6L56L63L2J38J097K148K278J562Q96
54127A82709O99O39M79M24N19L91j93q57r71k78Q65J780K012J730J400J099N20
54110A92967l02p89o24k73k67m72m92l55k56k6M86Q91P62L79K58K36k04q35p91
54091A90293J43J103J247O84J14K9M83J248J933K253K311K437K718K972L224L789
54075B16981M819N992O885P397P675P714P176N649L114J12k647m761o129o657
54061B53320o368n784n585n703n336m144k862k248j990j324l01L50M29N18J005
54046B13977J594J934K100K246K252K073K086K716L867M920N327N118M815M885
$$ y = [177619, 176542, 175584, 174713, 174086, 174071, 174668, 175353, 175766, 176082, 176543, 177009, 177301, 177577, 178030, 178460, 178474, 177969, 177227, 176620, 176345, 176307, 176200, 175808, 175225, 174672, 174208, 173865, 173839, 174195, 174558, 174590, 174728, 175825, 177973, 180251, 181813, 182709, 183408, 184047, 184526, 184950, 185469, 185860, 185667, 184810, 183839, 183561, 184426, 186206, 188218, 189948, 191348, 192447, 192967, 192665, 191876, 191252, 190979, 190712, 190240, 189748, 189393, 189137, 189111, 189597, 190488, 191250, 191629, 191887, 192123, 191919, 191084, 190293, 190436, 191539, 192786, 193470, 193584, 193613, 194096, 195344, 197277, 199530, 201841, 204278, 206996, 209968, 213192, 216981, 221800, 227792, 234677, 242074, 249749, 257463, 264639, 270288, 273402, 273514, 270867, 266106, 259977, 253320, 246952, 241168, 235583, 229880, 224544, 220400, 217538, 215290, 213300, 211976, 211675, 212025, 212454, 212972, 213977, 215571, 217505, 219605, 221851, 224103, 226176, 228262, 230978, 234845, 239765, 245092, 250210, 255025, 259910]
54032B59910N300N711N945O041N862N069L710K423J769J639J610J550J542J526
54018C09607J472J581J897J977J494R08R08J298J159K60m95l03L90M83l90j636
54002C20610k730l827n147o247o428n788n256n441n865n717m992m363m147m002
53988B50660l617l095k602k133j733j486j261q85n98p27r82p78k91l63j092j482
53972B27535r17j52j76q33j281j242j041p87l66M8J69J03K20O68J361K173K790
53955B28272K797K251J773J734J851J917K229K759K780K005J374J843K983L743
53941B60311L993M333M865N292N820O798P695P645O918O687P377Q294Q959R709
53927C54696J0857J2294J4081J6324J8171J7945J4779R468L445k263o847r499
$$ y = [259910, 265210, 270921, 276866, 282907, 288769, 293838, 297548, 299971, 301740, 303379, 304989, 306539, 308081, 309607, 311079, 312660, 314557, 316534, 318028, 318936, 319844, 321142, 322301, 322561, 322066, 321763, 322153, 322636, 322246, 320610, 317880, 314053, 308906, 302659, 296231, 290443, 285187, 279746, 273881, 268164, 263172, 258809, 254662, 250660, 247043, 243948, 241346, 239213, 237480, 235994, 234733, 233848, 233250, 232523, 231541, 230763, 230472, 230109, 229017, 227535, 226618, 226466, 226290, 225457, 224176, 222934, 221893, 221106, 220740, 220788, 220957, 221060, 221280, 221948, 223309, 225482, 228272, 231069, 233320, 235093, 236827, 238678, 240595, 242824, 245583, 248363, 250368, 251742, 253585, 256568, 260311, 264304, 268637, 273502, 278794, 284614, 291412, 299107, 306752, 313670, 320357, 327734, 336028, 344987, 354696, 365553, 377847, 391928, 408252, 426423, 444368, 459147, 468615, 472060, 469797, 462950, 453451]
53915D53451j0038r186p701n727l348j163K31R08J294J430J015Nj170j928k011
53900D16062j714j624k019k628l124l537l899l955l732l962n160o638p271p071
53886C59728p053p586p974p690p070o469n711m751m005l643l282k841k862l563
53872B85228m176l938l097k472k407k722l187l547l435k786k096j822j774j485
53858B46284r38n88p82j439k102k248j731j114j129j712j956j248p6N88L44l87
53842B29766r67j061p79m63k92j10K42N91P33Q12R74Q69J57o63o82J15Q12Q84
53824B30938P32P50O90L36M4J60N72J174K064K882K783J663O98Q87J707J953J495
53807B51528J246J738K578L268L737M033M048L841L751M038M537M802M508L790
$$ y = [453451, 443413, 434227, 426526, 420799, 417451, 416288, 416519, 417427, 418721, 420151, 421166, 421171, 420001, 418073, 416062, 414348, 412724, 410705, 408077, 404953, 401416, 397517, 393562, 389830, 385868, 380708, 374070, 366799, 359728, 352675, 345089, 337115, 329425, 322355, 315886, 310175, 305424, 301419, 297776, 294494, 291653, 288791, 285228, 281052, 277114, 274017, 271545, 269138, 266416, 263229, 259682, 256247, 253461, 251365, 249543, 247769, 246284, 245346, 244758, 243976, 242537, 240435, 238187, 236456, 235342, 234213, 232501, 230545, 229297, 229221, 229809, 230153, 229766, 228799, 227738, 226959, 226496, 226204, 226094, 226336, 226927, 227660, 228472, 229446, 230315, 230472, 229809, 229127, 229242, 230054, 230938, 231670, 232420, 233110, 233446, 233490, 233650, 234222, 235396, 237460, 240342, 243125, 244788, 245486, 246373, 248080, 250033, 251528, 252774, 254512, 257090, 260358, 264095, 268128, 272176, 276017, 279768, 283806, 288343, 293145, 297653, 301443]
53793C01443L212L196L473L427L004K779K937K800J771K85p40j016r72r84j130
53778C23485j550k447l707m870n521n562n128m552m173l991l646l000k476k463
53764B70399k667k503k013j858k391l152l484l265k861k541k197j669j079p43
53750B37976p73r25r00o96m98l82l04k62j92J39Q17J414J357O84Q1P0M75P81P53
53731B39615N63N32P85J102J129Q65P09Q34Q99P34Q44J588K249J828N59k31J04
53714B54708R00J386J578J765J967K225K636K815K181J187J183K574L993M035
53700B85133L021K232K208K625L252L997M421M149L545L180K902K176J082K22
53686C24145j82l85m16q9L92N07J33l37n93p03q29j131j748k483k670j916p60
$$ y = [301443, 304655, 307851, 311324, 314751, 317755, 320534, 323471, 326271, 328042, 328327, 327587, 326571, 325599, 324615, 323485, 321935, 319488, 315781, 310911, 305390, 299828, 294700, 290148, 285975, 281984, 278338, 275338, 272862, 270399, 267732, 265229, 263216, 261358, 258967, 255815, 252331, 249066, 246205, 243664, 241467, 239798, 238719, 237976, 237203, 236278, 235378, 234682, 234184, 233802, 233498, 233236, 233044, 233183, 234000, 235414, 236771, 237455, 237536, 237606, 238081, 238862, 239615, 240178, 240710, 241495, 242597, 243726, 244591, 245300, 246134, 247033, 247767, 248611, 250199, 252448, 254276, 254835, 254604, 254708, 255608, 256994, 258572, 260337, 262304, 264529, 267165, 269980, 272161, 273348, 274531, 277105, 281098, 285133, 288154, 290386, 292594, 295219, 298471, 302468, 306889, 311038, 314583, 317763, 320665, 322841, 323923, 324145, 323963, 323578, 323162, 323073, 323465, 323972, 324105, 323768, 323175, 322472, 321643, 320512, 318764, 316281, 313611, 311695, 310935]
53669C10935j26k38o32r76j277j329p60L16J178J284P33p7q32j271j227q68n52
53652C04281l75j00L89Q68J057R03N24J47Q9N30J208J554J264O57L59O40J194
53635C15189J572J782K197K820K998K241J044L61N28J222K229L441M195L748K555
53620C48122K073K824L751L953L983M601N266M993M083L806M656N901O694O778
53606D11484O329N800N762O214O378N761M974M748M647L673J783j70j681k755
53592D62947l170k744k158k311k942l002k420k202k692l029k684k299k492k893
53578D25909k975k865k695k087j016l72p74j477j302k69N15L28m98j203j278o63
53562D07278K44P69O55L78N20R36J000N24j2j36J37N11Q25J024R58N30L8J75J376
$$ y = [310935, 310809, 310571, 309939, 308963, 307686, 306357, 305597, 305913, 307091, 308375, 309108, 309031, 308199, 306928, 305701, 304833, 304281, 303906, 303806, 304195, 305063, 306120, 307023, 307547, 307694, 307783, 308313, 309521, 311075, 312339, 312996, 313355, 313995, 315189, 316761, 318543, 320740, 323560, 326558, 328799, 329843, 330204, 330732, 331954, 334183, 337624, 341819, 345567, 348122, 350195, 353019, 356770, 360723, 364706, 369307, 374573, 379566, 383649, 387455, 392111, 398012, 404706, 411484, 417813, 423613, 429375, 435589, 441967, 447728, 452702, 457450, 462097, 465770, 467553, 467383, 465702, 462947, 459777, 457033, 454875, 452564, 449622, 446620, 444200, 441998, 439306, 436277, 433593, 431294, 428802, 425909, 422934, 420069, 417374, 415287, 414271, 413899, 413125, 411648, 410346, 410077, 410592, 410920, 410422, 409219, 407941, 407278, 407522, 408291, 408946, 409324, 409844, 410780, 411780, 412304, 412292, 412156, 412293, 412804, 413629, 414653, 415611, 416141, 416179, 416354, 417730]
53543D17730L205M641N100M923M736M704M686M709M839M902M893N354O717Q412
53529D89551R437R730J0143J1000J1637J1719J2056J3405J5119J5862J5413J4936
53517F40008J5499J6930J8324J9172J9689K0306K1234K2484K3987K5529K6688
53506H69850K7192K7215K7114K6831K6038K4871K4067K4041K4282K4046K3226
53495A148773K2145K0925J9668J8859J8829J9076J8820J8131J7759J7953J8236
53484A359174J8326J8429J8535J8236J7533J7028J6968J6633J5172J2575R574
53473A538183O912M984L687K447O61j708m280o982j0026j3128j5372j6244j6266
53460A472868j6324j6787j7508j8248j8781j9017j9300k0165k1526k2490k2347
$$ y = [417730, 420935, 425576, 430676, 435599, 440335, 445039, 449725, 454434, 459273, 464175, 469068, 474422, 481139, 489551, 498988, 508718, 518861, 529861, 541498, 553217, 565273, 578678, 593797, 609659, 625072, 640008, 655507, 672437, 690761, 709933, 729622, 749928, 771162, 793646, 817633, 843162, 869850, 897042, 924257, 951371, 978202, 1004240, 1029111, 1053178, 1077219, 1101501, 1125547, 1148773, 1170918, 1191843, 1211511, 1230370, 1249199, 1268275, 1287095, 1305226, 1322985, 1340938, 1359174, 1377500, 1395929, 1414464, 1432700, 1450233, 1467261, 1484229, 1500862, 1516034, 1528609, 1538183, 1545095, 1550079, 1553766, 1556213, 1556874, 1555166, 1550886, 1543904, 1533878, 1520750, 1505378, 1489134, 1472868, 1456544, 1439757, 1422249, 1404001, 1385220, 1366203, 1346903, 1326738, 1305212, 1282722, 1260375]
53449A260375k1416k0579k0315k0372k0203j9469j8285j7131j6281j5375j3811
53438A057138j1538r079o836m832l085j620j59J592L259M133M256M482N277O354
53424A049342P582R360J1665J3680J4994J6281J8096J9853K0838K1540K2922K4881
53412A251034K6453K7344K8328L0142L2740L5554L7871L9083L9234L9343M0554
53401A627680M3002M5910M8642N1057N2974N4152N4863N5848N7330N8587N8843
53390B208888N8280N7769N7733N7628N6677N4917N3148N1755N0034M7142M3425
53379B797396M0010L7113L3643K8838K3355J8260J3619Q869L883j143o422j2246
53367B985175j8259k3986k9905l6879m4485n0922n4921n7021n8532n9897o0591
$$ y = [1260375, 1238959, 1218380, 1198065, 1177693, 1157490, 1138021, 1119736, 1102605, 1086324, 1070949, 1057138, 1045600, 1036521, 1029685, 1024853, 1021768, 1020148, 1019989, 1021581, 1024840, 1028973, 1033229, 1037711, 1042988, 1049342, 1056924, 1066284, 1077949, 1091629, 1106623, 1122904, 1141000, 1160853, 1181691, 1203231, 1226153, 1251034, 1277487, 1304831, 1333159, 1363301, 1396041, 1431595, 1469466, 1508549, 1547783, 1587126, 1627680, 1670682, 1716592, 1765234, 1816291, 1869265, 1923417, 1978280, 2034128, 2091458, 2150045, 2208888, 2267168, 2324937, 2382670, 2440298, 2496975, 2551892, 2605040, 2656795, 2706829, 2753971, 2797396, 2837406, 2874519, 2908162, 2937000, 2960355, 2978615, 2992234, 3001103, 3004986, 3003843, 2997421, 2985175, 2966916, 2942930, 2913025, 2876146, 2831661, 2780739, 2725818, 2668797, 2610265, 2550368, 2489777]
53356B489777o0250n9323n8583n8278n7797n6272n3562n0497m8017m6272m4840
53345A896086m3578m2770m2507m2382m1823m0476l8346l5917l3892l2430l0736
53334A471229k7986k4540k1657j9956j8790j7309j5488j3845j2643j1828j1414
53323A275773j1470j1781j1937j1652j0914r822q490p074n769m718l914l172k263
53310A172797j104K44J774L552N436P053Q286R478J0903J2266J3155J3842J5148
53297A272830J7482K0374K3007K4960K6391K7737K9244L0593L1091L0437K9138
53286A563284K7845K6521K4691K2360K0093J8157J6226J3992J1581R096O249K735
53274A762830j331n576r621j3055j5584j7420j9207k1233k3127k4585k5929k7540
$$ y = [2489777, 2429527, 2370204, 2311621, 2253343, 2195546, 2139274, 2085712, 2035215, 1987198, 1940926, 1896086, 1852508, 1809738, 1767231, 1724849, 1683026, 1642550, 1604204, 1568287, 1534395, 1501965, 1471229, 1443243, 1418703, 1397046, 1377090, 1358300, 1340991, 1325503, 1311658, 1299015, 1287187, 1275773, 1264303, 1252522, 1240585, 1228933, 1218019, 1208197, 1199707, 1192633, 1186864, 1182146, 1178232, 1175060, 1172797, 1171693, 1171937, 1173711, 1177263, 1182699, 1189752, 1198038, 1207516, 1218419, 1230685, 1243840, 1257682, 1272830, 1290312, 1310686, 1333693, 1358653, 1385044, 1412781, 1442025, 1472618, 1503709, 1534146, 1563284, 1591129, 1617650, 1642341, 1664701, 1684794, 1702951, 1719177, 1733169, 1744750, 1753846, 1760095, 1762830, 1761499, 1755923, 1746302, 1733247, 1717663, 1700243, 1681036, 1659803, 1636676, 1612091, 1586162, 1558622]
53262A558622k9086k9952l0177l0414l0985l1599l2079l2710l3607l4206l3814
53251A209993l2437l0723k9208k7977k6983k6241k5697k5197k4790k4759k5150
53240I10831k5459k5082k3975k2665k1581k0581j9202j7215j4916j2944j1742
53229F95469j1131j0473r412q335p817p819p810p724q135r318j0540j0821j0209
53216E75925r810j0528j2093j3399j3615j2847j1784j0888j0060r133q382q203
53204D45183q369q140p210o202n885o253o678o714o415o032n722n513n313m980
53190C55757m519m077l703l331l103l345l982m305l749k543j409q19r36j777k935
53175C11224l477k818j550p65p67j077j482k135k678k303j040l4l7m51m01r7k02
$$ y = [1558622, 1529536, 1499584, 1469407, 1438993, 1408008, 1376409, 1344330, 1311620, 1278013, 1243807, 1209993, 1177556, 1146833, 1117625, 1089648, 1062665, 1036424, 1010727, 985530, 960740, 935981, 910831, 885372, 860290, 836315, 813650, 792069, 771488, 752286, 735071, 720155, 707211, 695469, 684338, 673865, 664453, 656118, 648301, 640482, 632672, 624948, 616813, 607495, 596955, 586134, 575925, 566115, 555587, 543494, 530095, 516480, 503633, 491849, 480961, 470901, 461768, 453386, 445183, 436814, 428674, 421464, 415262, 409377, 403124, 396446, 389732, 383317, 377285, 371563, 366050, 360737, 355757, 351238, 347161, 343458, 340127, 337024, 333679, 329697, 325392, 321643, 319100, 317691, 316872, 315936, 314159, 311224, 307747, 304929, 303379, 302614, 301847, 300770, 299288, 297153, 294475, 292172, 291132, 291098, 291061, 290610, 290209, 290112, 289910]
53158B89910n10k93K78J87q76j975k271k051j917j695r02K24Q83Q22N02K22j94
53141B80344p36r33n95k35k98m30l3P54J302J451J586J813J750J265Q06P59R06
53124B89476Q35M92J18j54l27l80k36K10R84J737J784Q71k09m21R3J63o99j554
53106B92783j432o69k64n93j368k346l281l596k927j764r04m93k20k1nN9L58M53
53088B73770q5p64q11m97p56j566j828j010J78R74J405J560J131K26k82O0M83
53071B72188J03q29j473j611j521j166m52O0l12j215j557r79k55q8l02m82o92
53054B59417j091j299p13O65K099K739K283J133J34l8M51O95L1j092j592j109
53038B62713m33m15q26p93j04N58O90O02P06P53L05m09o87l36J60M16N62P84R13
$$ y = [289910, 289400, 289107, 289385, 289572, 288696, 286721, 284450, 282399, 280482, 278787, 277885, 278109, 278992, 279814, 280316, 280538, 280344, 279608, 278675, 278080, 277845, 277547, 277117, 277084, 277838, 279140, 280591, 282177, 283990, 285740, 287005, 287811, 288570, 289476, 290311, 290803, 290921, 290767, 290440, 290060, 289824, 290034, 291018, 292755, 294539, 295410, 295201, 294780, 294873, 295036, 294337, 292783, 291351, 290682, 290418, 289825, 288457, 286111, 282830, 279234, 276307, 274543, 273639, 273146, 272926, 272905, 272900, 272959, 273317, 273770, 273685, 272921, 272110, 271613, 270857, 269291, 267463, 266453, 266631, 267605, 269010, 270570, 271701, 271927, 271645, 271705, 272188, 272291, 271462, 269989, 268378, 266857, 265691, 265239, 265299, 264987, 263772, 262215, 261236, 260981, 260893, 260591, 260109, 259417, 258326, 257027, 256314, 256979, 259078, 261817, 264100, 265233, 265367, 265329, 265780, 266475, 266506, 265414, 263822, 262713, 262280, 261865, 261039, 260246, 260142, 260700, 261390, 261992, 262698, 263451, 263756, 263347, 262660, 262324, 262484, 262900, 263462, 264246, 265159]
53019B65159P47L99J58J76M51Q73J142R16K38m30p20p26o81m79J16R63J469J168
53001B70939J62r71j682j781j390p44q0M16P42J096J530J631R86Mk18P67J970
52984B73377K102J232O37J094K034K503K306J844J368Q98N92O21P93O78J97k60
52968B92016l84l08k67j56K83R09J268J283J436J954K215J548L05n54q71j371
52952B99306k240k648k122j508j772k559k777k103j080j90K97J4r85j721j335
52937B76577m03j36n13m33L12O71J02n70o19m63o54q55n43Q3N59Q04P52J30q00
52918B74001j065k61P45J063R29Q67N92k45r66p18L6J47m51q05o32o43j101j315
52900B70178r20n91r13j364j097j89N88Q62R44J151J356J346J190J037P12r5j149
$$ y = [265159, 265906, 266305, 266463, 266639, 267090, 267963, 269105, 270021, 270259, 269829, 269109, 268383, 267702, 267223, 267339, 268302, 269771, 270939, 271101, 270130, 268448, 266667, 265277, 264533, 264453, 264869, 265611, 266707, 268237, 269868, 270854, 270858, 270640, 271407, 273377, 275479, 276711, 277348, 278442, 280476, 282979, 285285, 287129, 288497, 289395, 289987, 290608, 291401, 292079, 292276, 292016, 291632, 291324, 291057, 290901, 291184, 292093, 293361, 294644, 296080, 298034, 300249, 301797, 302102, 301548, 300677, 299306, 297066, 294418, 292296, 290788, 289016, 286457, 283680, 281577, 280497, 280307, 280604, 280618, 279633, 277912, 276577, 276174, 276038, 275525, 275092, 275404, 276075, 276177, 275607, 274988, 274525, 273871, 273016, 272473, 272556, 273115, 273919, 274671, 274801, 274001, 272936, 272675, 273420, 274483, 275412, 276279, 276871, 276626, 275660, 274942, 274978, 275125, 274674, 273869, 273237, 272594, 271493, 270178, 269258, 268667, 267754, 266390, 265293, 265104, 265692, 266554, 267498, 268649, 270005, 271351, 272541, 273578, 274290, 274195, 273046]
52883B73046j537o23R74J952J847J325R67M98l46j025r32l91j16j23Q6N32Q75
52866B77009J223J960K822L030K456J816J574J384Q51J98j41r2J42K92Mr32k216
52849B91380l283m006m639n049m642l337j962j297j179r99o80o92j283k086k438
52834B53808j970r64k11k21n88m68K89R74J103J030J207J384J069L39l41p71r42
52817B54727o34K96J326J628J095M63L07M65N72O98J110J683J966J701J021K07
52801B68631m75q36q86r69j532k614l673m028l465k349j187k74L20N50M67L10
52785B47990L33M80M76L36M94J247K159K406J704O27r7l23l35k87j18R8J11j31
52767B57170m10n86p54r06p81k88J93K25m9p2L97J018J325J254J074R75Q11K61
$$ y = [273046, 271509, 270886, 271860, 273812, 275659, 276984, 277951, 278449, 278103, 277078, 276146, 275755, 275639, 275516, 275602, 276134, 277009, 278232, 280192, 283014, 286044, 288500, 290316, 291890, 293274, 294125, 294323, 294182, 294090, 294232, 294524, 294528, 293596, 291380, 288097, 284091, 279452, 274403, 269761, 266424, 264462, 263165, 261986, 260987, 260307, 259615, 258332, 256246, 253808, 251838, 250874, 250663, 250442, 249854, 249386, 249675, 250649, 251752, 252782, 253989, 255373, 256442, 256781, 256440, 255669, 254727, 254093, 254389, 255715, 257343, 258438, 258901, 259208, 259673, 260245, 260943, 262053, 263736, 265702, 267403, 268424, 268631, 268156, 267320, 266434, 265465, 263933, 261319, 257646, 253618, 250153, 247804, 246617, 246343, 246663, 247213, 247680, 247990, 248323, 248803, 249279, 249615, 250109, 251356, 253515, 255921, 257625, 258252, 258155, 257832, 257497, 257210, 257092, 257190, 257301, 257170, 256760, 256174, 255420, 254514, 253733, 253445, 253638, 253863, 253814, 253742, 254139, 255157, 256482, 257736, 258810, 259785, 260596, 260857]
52749B60857p03j538j556o96L63J046J471J947K261K034J481J224J368J445J250
52734B72254J106J199J251J127J145J454J650J386R99J042J466J604R10n60k151
52719B85882l056k938k260j676j222n66k9m43j770k665k101p34K8j69n26m39l1
52702B65285L94P06O56kr00j160k82J237K362K471J828J212J004P33j56j201j306
52685B72881l46M50J54o39q79n75l61k40J65N90M75M7l0J64P6r2L57J149J239
52666B74585N46K03P32J269J136Q56R29P94m7q58p15KK89J71N77J761K862L077
52648B88169K496J672R46K67n84j653k484k449j605p87n03k54M79J140Q26k00
52632B85476p14j84O25Q81P22P32J045J418J710J852J596P54m59j597k423k959
$$ y = [260857, 260154, 258616, 257060, 256364, 256727, 257773, 259244, 261191, 263452, 265486, 266967, 268191, 269559, 271004, 272254, 273360, 274559, 275810, 276937, 278082, 279536, 281186, 282572, 283571, 284613, 286079, 287683, 288593, 288033, 285882, 282826, 279888, 277628, 275952, 274730, 274164, 274135, 273692, 271922, 269257, 267156, 266422, 266450, 266281, 265755, 265316, 265285, 265679, 266385, 267041, 267039, 266139, 264979, 264697, 265934, 268296, 270767, 272595, 273807, 274811, 275544, 275388, 274187, 272881, 272535, 272985, 273139, 272500, 271621, 271046, 270685, 270445, 270610, 271200, 271675, 271722, 271692, 271856, 271932, 271840, 272197, 273346, 274585, 275131, 275334, 276066, 277335, 278471, 279327, 280256, 281050, 281003, 280145, 279430, 279432, 279721, 279892, 280469, 282230, 285092, 288169, 290665, 292337, 293283, 293550, 292966, 291313, 288829, 286380, 284775, 283988, 283485, 283231, 283710, 284850, 285676, 285476, 284762, 284578, 285203, 286084, 286806, 287538, 288583, 290001, 291711, 293563, 295159, 295913, 295454, 293857, 291434, 288475]
52616B88475l204l019k362j437n75k9J19n1l05l41k0N10R93J419J927K350K097
52599B86547R11m81r62l04N68P15K13k41k75o1J81L90M78L33Q4P6N04J224J975
52580B91875K594K921K653J601Q8j082j230m49M51O88J62o41j163j159p87n09
52564B96013p60j474k036j951j386q30m18P2O35R37Q01M43R5k56o90j128j341
52547B86726j073k53P07J059N31k09l71j15j92o70q25l23K82M82M83O27P69P34
52529B88369P03Q03P96O43Q06J438J820J282K47k74j7L98M61L03K57M91R71J492
52511C00989J720J620J642K196L078L731L884L561K789J663M78o08j779l009l679
52496C18276l277k225j438j227j237j223j243j235j120j140j492j708j218m16
$$ y = [288475, 285271, 282252, 279890, 278453, 277878, 277849, 277968, 277917, 277612, 277271, 277251, 277761, 278754, 280173, 282100, 284450, 286547, 287458, 286977, 286015, 285711, 286279, 286994, 287207, 286966, 286691, 286630, 286811, 287201, 287679, 288012, 288096, 288172, 288676, 289900, 291875, 294469, 297390, 300043, 301644, 301732, 300650, 299420, 298971, 299422, 300110, 300272, 299631, 298468, 297309, 296522, 296013, 295253, 293779, 291743, 289792, 288406, 287576, 287158, 287230, 287865, 288802, 289603, 290046, 290141, 289885, 289195, 288067, 286726, 285653, 285400, 286107, 287166, 287697, 287488, 287117, 287002, 286810, 286140, 285315, 284992, 285274, 285756, 286239, 286866, 287635, 288369, 289072, 289875, 290671, 291314, 292120, 293558, 295378, 296660, 296907, 296633, 296616, 297014, 297475, 297778, 298035, 298526, 299497, 300989, 302709, 304329, 305971, 308167, 311245, 314976, 318860, 322421, 325210, 326873, 327351, 326743, 324964, 321955, 318276, 314999, 312774, 311336, 310109, 308872, 307649, 306406, 305171, 304051, 302911, 301419, 299711, 298493, 298077]
52482B98077k41p11q01p6O24N40J67L50R79J384J514J803K140J893J019L37M97
52465C09495J199J798K176K636L174L351K911K164J525R88K61o75j515k128k687
52450C24673l191l330l053k872l105l233k671j884j895k697l050k147p01R4Rl29
52434B90618m77m04k0P49J507J687J317R86J005J106J008P92N49J81k47l71n9
52417B99927L55O30J046J828K567K732K584K852L591M110M206M645O050P921R363
52402C54407J0255J0922J1001R600O591K906n98l820o736q858r799r805r168p725
52388C49173n523l461k461k256j802p80Q4K27J2J08P27J719K851L682L689K938
52372C48927K343K782M080N196N308M517L519K896K686K482J855P24n91j618k041
$$ y = [298077, 297836, 297125, 296324, 296248, 296872, 297412, 297579, 297929, 298908, 300292, 301806, 303609, 305749, 307642, 308661, 308998, 309495, 310694, 312492, 314668, 317304, 320478, 323829, 326740, 328904, 330429, 331417, 331678, 331003, 329488, 327360, 324673, 321482, 318152, 315099, 312227, 309122, 305889, 303218, 301334, 299439, 296742, 293692, 291545, 290844, 290938, 290947, 290618, 290141, 289737, 289717, 290466, 291973, 293660, 294977, 295963, 296968, 298074, 299082, 299874, 300423, 300604, 300357, 299986, 299927, 300282, 300912, 301958, 303786, 306353, 309085, 311669, 314521, 318112, 322222, 326428, 331073, 337123, 345044, 354407, 364662, 375584, 386585, 396185, 402776, 405682, 405084, 401264, 394528, 385670, 375871, 366066, 356898, 349173, 343650, 340189, 337728, 335472, 333670, 332890, 332974, 333201, 333213, 333321, 334048, 335767, 338618, 342300, 345989, 348927, 351270, 354052, 358132, 363328, 368636, 373153, 376672, 379568, 382254, 384736, 386591, 387315, 386724, 385106, 383065]
52357C83065j889j488j164r21m96J30N70N39K96K83N95J126J916K856L333K916
52341C91667K317K762M306N613N731N223N051N249N453O072P728R878J1192J1399
52327D79641J1684J2924J4466J5218J5287J5697J6886J8210J8871J8692J7985
52316F55561J7074J6196J5524J5120J5013J5368J6271J7326J7833J7589J7106
52305H35981J6815J6402J5459J4434J4217J4798J5103J4381J3066J1898J0779
52294I93333R151P012M767K355n99l778o155p195p430p601p888q193q518q646
52280I50615q091o866n697m944l866j733Q92K901M294N928P792Q810Q705Q782
52266I67522J0099J1820J2414J1800J1261J1500J1968J2127J2247J2627J2901
$$ y = [383065, 381176, 379688, 378524, 377603, 377107, 377237, 377807, 378346, 378642, 378925, 379520, 380646, 382562, 385418, 388751, 391667, 393984, 396746, 401052, 406665, 412396, 417619, 422670, 427919, 433372, 439444, 447172, 457050, 468242, 479641, 491325, 504249, 518715, 533933, 549220, 564917, 581803, 600013, 618884, 637576, 655561, 672635, 688831, 704355, 719475, 734488, 749856, 766127, 783453, 801286, 818875, 835981, 852796, 869198, 884657, 899091, 913308, 928106, 943209, 957590, 970656, 982554, 993333, 1002484, 1009496, 1014263, 1016618, 1016019, 1012241, 1006086, 998891, 991461, 983860, 975972, 967779, 959261, 950615, 942524, 935658, 929961, 925017, 921151, 919418, 920310, 923211, 927505, 933433, 941225, 950035, 958740, 967522, 977621, 989441, 1001855, 1013655, 1024916, 1036416, 1048384, 1060511, 1072758, 1085385, 1098286]
52255A098286J2773J2752J3484J4611J5016J4084J2288J0441Q813P092M839J904
52243A226383j422m477o616p710q205q677r363j0106j0612j0805j0962j1463j2246
52230A113719j2601j1819j0064q377p647p784p996p690o881n908m977m059l021
52217A014895j818n48N92J468K099K638L259L996M643M896M803M980O000P486
52203A059389Q133P001M637K681K288L176M207M664M734M862M995M744M168L901
52189A123580M328N002N229M993M699M193K799M39j976l750n280p206r139j0065
52175A117846r735q941q389q030p642p357p254o894n750l939k194j119o07%J258
52160A041253L015M545N287N370N225M884L998K474P12p59j585j538p09K44N43
$$ y = [1098286, 1111059, 1123811, 1137295, 1151906, 1166922, 1181006, 1193294, 1203735, 1212548, 1219640, 1224479, 1226383, 1224961, 1220484, 1213868, 1206158, 1197953, 1189276, 1179913, 1169807, 1159195, 1148390, 1137428, 1125965, 1113719, 1101118, 1089299, 1079235, 1070858, 1063211, 1055427, 1047431, 1039741, 1032860, 1026952, 1021975, 1017916, 1014895, 1013077, 1012529, 1013121, 1014589, 1016688, 1019326, 1022585, 1026581, 1031224, 1036120, 1040923, 1045903, 1051903, 1059389, 1067522, 1074523, 1079160, 1081841, 1084129, 1087305, 1091512, 1096176, 1100910, 1105772, 1110767, 1115511, 1119679, 1123580, 1127908, 1132910, 1138139, 1143132, 1147831, 1152024, 1154823, 1155262, 1153286, 1149536, 1144256, 1137050, 1127911, 1117846, 1108111, 1099170, 1090781, 1082751, 1075109, 1067752, 1060498, 1053604, 1047854, 1043915, 1041721, 1040602, 1039995, 1039995, 1041253, 1044268, 1048813, 1054100, 1059470, 1064695, 1069579, 1073577, 1076051, 1076763, 1076004, 1074419, 1072881, 1072172, 1072416, 1072959]
52145A072959K28K17J123K392L031K839K395K114J817J303P86O22Q99J461K160
52130A096346K994M203O183R081J2392J5263J7349J9122K1171K3455K5491K7074
52118A280124K8322K9153K9169K8280K7008K5891K4832K3394K1582J9882J8542
52107A556179J7154J5089J2193Q995O359M921M627M775M676M226L654K866J492
52094A647206m34k355l948n497p380r552j1896j4527j7322j9511k0295j9678j8300
52081A496511j6585j4549j2242r829p323m746k452q77P6R63K210L903O075Q552
52067A449687J0721J1971J2466J2930J3606J4030J3890J3500J3161J2664J1792
52056A590418J0822J0145R715R145Q155O674M794K819R90q72l198o042r011j1851
$$ y = [1072959, 1073187, 1073404, 1074527, 1076919, 1079950, 1082789, 1085184, 1087298, 1089115, 1090418, 1091204, 1091826, 1092725, 1094186, 1096346, 1099340, 1103543, 1109726, 1118807, 1131199, 1146462, 1163811, 1182933, 1204104, 1227559, 1253050, 1280124, 1308446, 1337599, 1366768, 1395048, 1422056, 1447947, 1472779, 1496173, 1517755, 1537637, 1556179, 1573333, 1588422, 1600615, 1609610, 1615969, 1620890, 1625517, 1630292, 1634968, 1639194, 1642848, 1645714, 1647206, 1646772, 1644417, 1640469, 1634972, 1627592, 1618040, 1606144, 1591617, 1574295, 1554784, 1534489, 1514811, 1496511, 1479926, 1465377, 1453135, 1443306, 1435983, 1431237, 1428785, 1427908, 1427984, 1428947, 1431157, 1435060, 1441135, 1449687, 1460408, 1472379, 1484845, 1497775, 1511381, 1525411, 1539301, 1552801, 1565962, 1578626, 1590418, 1601240, 1611385, 1621100, 1630245, 1638400, 1645074, 1649868, 1652687, 1653677, 1652805, 1649607, 1643565, 1634554, 1622703]
52042A622703j4555j6837j8187j8738j9290k0100k0344j9394j7908j6937j6484
52031A423929j5827j4854j4040j3363j2299j0935j0173j0515j1452j2301j2994
52020A285176j3597j3726j3001j1727j0641j0115r954r855r705r490r185q810
52008A155370q541q628r204j0093j1017j2011j3415j5279j7014j8042j8543j9071
51996I94512j9533j9212j7813j5919j4138j2454j0768r538r317r966j0848j1578
51984H33428j2076j2113j1473j0573j0318j1061j2196j3003j3518j4196j5020
51973F97881j5328j4538j2725j0404q037n833l854k074l69J428L393N445P382
51960F42367Q914R664R350Q100O469M926L292R40k317n739q188r055q490o967
$$ y = [1622703, 1608148, 1591311, 1573124, 1554386, 1535096, 1514996, 1494652, 1475258, 1457350, 1440413, 1423929, 1408102, 1393248, 1379208, 1365845, 1353546, 1342611, 1332438, 1321923, 1310471, 1298170, 1285176, 1271579, 1257853, 1244852, 1233125, 1222484, 1212369, 1202415, 1192560, 1182855, 1173365, 1164180, 1155370, 1146829, 1138201, 1128997, 1118904, 1107887, 1095876, 1082461, 1067182, 1050168, 1032126, 1013583, 994512, 974979, 955767, 937954, 922035, 907897, 895443, 884675, 875137, 865820, 855854, 845006, 833428, 821352, 809239, 797766, 787193, 776875, 765814, 753618, 740615, 727097, 712901, 697881, 682553, 668015, 655290, 644886, 636849, 631016, 627162, 625088, 624719, 626147, 629540, 634985, 642367, 651281, 660945, 670295, 678395, 684864, 689790, 693082, 694022, 691705, 685966, 677778, 668723, 660233, 653266]
51946F53266m929k834j081K93J638L259N111P034R009J0947J2487J3293J3492
51933G20985J3455J3196J2254J0203P059L224p09m171o876q941j0531j1571j2041
51920G25536j2340j2778j2779j1265q016m023k56L234O624R454J1070J1415J0620
51907G16496Q226L759k065p471j1043j2471j2063j0334q143o390n296m451l757
51894F44997l754m872o945r655j2775j5692j7354j7214j5757j3666j1007p714
51882E08592m416j996n25O88K078L477M772O370Q642J1237J3197J3746J2850J1072
51868E89784Q964O683M145J319j771n063q156j0199j0602r763q567p235n323k870
51854E41346o93P32J812K826L159K283P94l91j340k669m135m809m608m616n570
$$ y = [653266, 648337, 645503, 644422, 644715, 646353, 649612, 654723, 661757, 670766, 681713, 694200, 707493, 720985, 734440, 747636, 759890, 770093, 777152, 780376, 779667, 775496, 768620, 759679, 749148, 737577, 725536, 713196, 700418, 687639, 676374, 668358, 664335, 664079, 667313, 673937, 683391, 694461, 705876, 716496, 724722, 728481, 726416, 718945, 707902, 695431, 683368, 673034, 664891, 658501, 653205, 648754, 644997, 641243, 636371, 629426, 619771, 606996, 591304, 573950, 556736, 540979, 527313, 516306, 508592, 504176, 502180, 501655, 502343, 504421, 507898, 512670, 519040, 527682, 538919, 552116, 565862, 578712, 589784, 598748, 605431, 609576, 610895, 609124, 604061, 595905, 585706, 575104, 565341, 556774, 549539, 544216, 541346, 540653, 541385, 543197, 546023, 549182, 551465, 552259, 551868, 550528, 547859, 543724, 538915, 534307, 529691, 524121]
51839E24121o912p674p640p162o370n150l611k124r02J28J081J820K047J640R61
51824D84253N74N95M34m94j973l232l803l778l274k222q25L07P45P39Q44J272
51808D70162J811K256K563K622K144R22q00k386l333l631l554l196k475j588j024
51793D60493j056j475j951k340k455k067j352r43j058j031j97J098J967K100J734
51778D51467Q79n64j952k237j301j54N24J241K656M453N867O831P878R199J0480
51763D95267J1530J2435J3008J2635J0812P595L460r44m865p623r028r517r738
51750E25027r979j0128j0047r795r415q759p677o267m687k888p86J306K891L972
51736D52768N118O648Q185R231R783R927R294P478M827K248L56p33r42k40Q66
$$ y = [524121, 517209, 509535, 501895, 494733, 488363, 483213, 479602, 477478, 476576, 476704, 477785, 479605, 481652, 483292, 484253, 484827, 485422, 485856, 485362, 483389, 480157, 476354, 472576, 469302, 467080, 466255, 466562, 467307, 468046, 468890, 470162, 471973, 474229, 476792, 479414, 481558, 482480, 481680, 479294, 475961, 472330, 468776, 465580, 463105, 461517, 460493, 459437, 457962, 456011, 453671, 451216, 449149, 447797, 446854, 445796, 444765, 444568, 445666, 447633, 449733, 451467, 452346, 451782, 449830, 447593, 446292, 446138, 446662, 447903, 450559, 455012, 460879, 467710, 475588, 484787, 495267, 506797, 519232, 532240, 544875, 555687, 563282, 566742, 565798, 560933, 553310, 544282, 534765, 525027, 515048, 504920, 494873, 485078, 475663, 466904, 459227, 452960, 448273, 445385, 444599, 445905, 448796, 452768, 457886, 464534, 472719, 481950, 491733, 501660, 510954, 518432, 523259, 525507, 525863, 525130, 524188, 523948, 524814]
51721E24814J428Q72n67k253l689m665n220n456n174l893j636N11J193J38j721
51706D94682l239l680k700n60J659K897L271L646M049L573K023N29k1j45n85q86
51690E04513j35J415K561K664K075J132l63k565n052p046p826p068n163l135j840
51675D74167j230o28M27J790K963L383K816J810J433K227L676N091O479P875Q441
51660E20720P198M527J886lj729l725n212n135l448q20K309N690Q682J0493J0917
51645E52350J0165Q056M063j580p352j1546j3646j4374j4532j4263j3451j2296
51633D71594j1128r891q228o112l973k204q20K66R82J342J603J895J895J220O0
51618D38501r41j352j226p46j6P94J330J296O92k60j247j954k183k017j715j381
$$ y = [524814, 526242, 527114, 526547, 524294, 520605, 515940, 510720, 505264, 500090, 496197, 494561, 495072, 496265, 496403, 494682, 491443, 487763, 485063, 484503, 486162, 489059, 492330, 495976, 500025, 503598, 505621, 506150, 506129, 505984, 505399, 504513, 504378, 505793, 508354, 511018, 513093, 514225, 513862, 511297, 506245, 499199, 491373, 484305, 479142, 476007, 474167, 472937, 472309, 472736, 474526, 477489, 480872, 483688, 485498, 486931, 489158, 492834, 497925, 504404, 512279, 520720, 527918, 532445, 534331, 534328, 532599, 528874, 523662, 518527, 515079, 514259, 516568, 522258, 530940, 541433, 552350, 562515, 570571, 574634, 573054, 565702, 554156, 540510, 526136, 511604, 497341, 483890, 471594, 460466, 450575, 442347, 436235, 432262, 430058, 429238, 429504, 430486, 431828, 433431, 435326, 437221, 438441, 438501, 437560, 436208, 434982, 434236, 434220, 435014, 436344, 437640, 438332, 438072, 436825, 434871, 432688, 430671, 428956, 427575]
51602D27575q15K11J583K852L615L853L968M479N648P281Q826R757R891R320P956
51587E06000N385J540k574n326n993n388m651l768j922J023M159O767R098J1732
51573E16082J4690J7558J9969K1663K2511K2819K3286K4315K5602K6552K6781
51562G61828K6211K5197K4744K5957K8958L2904L7198M1855M6181M8141M5961
51551A145135L9714L0612J9409O627o370j8013k8051l7132m4942n0160n2434n2946
51539I51449n2559n0693m6794m1845l7358l3583k9733k5484k1409j8074j5543
51528E78374j3700j2404j1291r919q210o451m902l651k758k229j938j651j141
51515D98129j75J241K529K840J978P89J59j2n48j844l521m981n910o178n732m736
$$ y = [427575, 426760, 426971, 428554, 431406, 435021, 438874, 442842, 447321, 452969, 460250, 469076, 478833, 488724, 498044, 506000, 511385, 512925, 510351, 505025, 499032, 493644, 488993, 485225, 483303, 484326, 488485, 495252, 504350, 516082, 530772, 548330, 568299, 589962, 612473, 635292, 658578, 682893, 708495, 735047, 761828, 788039, 813236, 837980, 863937, 892895, 925799, 962997, 1004852, 1051033, 1099174, 1145135, 1184849, 1215461, 1234870, 1241497, 1235127, 1217114, 1189063, 1151931, 1106989, 1056829, 1004395, 951449, 898890, 848197, 801403, 759558, 722200, 688617, 658884, 633400, 611991, 593917, 578374, 564674, 552270, 540979, 531060, 522850, 516399, 511497, 507846, 505088, 502859, 500921, 499270, 498129, 497954, 499195, 501724, 504564, 506542, 507331, 507490, 507478, 506930, 505086, 501565, 496584, 490674, 484496, 478764, 474028]
51499D74028l596k705k221k110k243k463k630k611k258j550p62k98k36k87l06
51484D47752n28j092j594j511r37o18j254k850m646n566n030l578k422k146k195
51469D11785j901j591k052l147l792l307k138j036j75O15J294J716J926J955J631
51454D01783R30K56N8L53R72J970L378M824N900O749P789Q987J0052J1295J3404
51439D78700J6096J7750J6895J3671R295M660J82l377m989m483l028k170k811
51426E36391n065q408j1681j3490j3206j1421r244p341n844m661l548k179n87
51413D39716P41J529K158L054L993M532M756M950M806L761K110Q98O33Q39J103
51398D79579J641K487K952K610K209K784M211N450O087O867Q586J1183J4066J6825
$$ y = [474028, 470432, 467727, 465506, 463396, 461153, 458690, 456060, 453449, 451191, 449641, 448879, 448581, 448345, 448058, 447752, 447224, 446132, 444538, 443027, 442090, 441472, 440218, 437368, 432722, 427156, 422126, 418548, 416126, 413980, 411785, 409884, 408293, 406241, 403094, 399302, 395995, 393857, 392821, 392646, 393261, 394555, 396271, 398197, 400152, 401783, 402713, 402969, 403027, 403380, 404352, 406322, 409700, 414524, 420424, 427173, 434962, 443949, 454001, 465296, 478700, 494796, 512546, 529441, 543112, 552407, 557067, 557249, 553872, 548883, 544400, 541372, 539202, 536391, 531326, 522918, 511237, 497747, 484541, 473120, 463876, 456535, 450691, 446030, 442482, 440303, 439716, 440457, 441986, 444144, 447198, 451191, 455723, 460479, 465429, 470235, 473996, 476106, 477004, 477637, 478476, 479579, 481220, 483707, 486659, 489269, 491478, 494262, 498473, 503923, 510010, 516877, 525463, 536646, 550712, 567537]
51384E67537J9376K1817K4531K8105L2841L8383M4040M9349N4253N8860O3170
51373A002262O6845O8874O7692O2027N1887L8589K3686Q102p601k2473l5290m5453
51361A279147n3359n9557o3868o5706o5039o2665n9453n5663n1107m5697l9744
51350F57289l3808k8403k3687j9471j5623j2461j0474r653r395r160q960r031
51338D67163r146q613p041m976l596l568m276m461l683k767k542k706k499k055
51324D05234k145k689k571j307R4N00J46Q7O57J375J955K536K999K959K562K572
51308D14964L415M546N024M381K802Q63p79j678j920k006k372l051l761m155m137
51293D12136m009m176m490m242l076j630p45l67J94J113J948K527L221M093M629
$$ y = [567537, 586913, 608730, 633261, 661366, 694207, 732590, 776630, 825979, 880232, 939092, 1002262, 1069107, 1137981, 1205673, 1267700, 1319587, 1358176, 1381862, 1389964, 1382363, 1359890, 1324600, 1279147, 1225788, 1166231, 1102363, 1036657, 971618, 908953, 849500, 793837, 742730, 697033, 657289, 623481, 595078, 571391, 551920, 536297, 523836, 513362, 503709, 494314, 485154, 476194, 467163, 458017, 449404, 442363, 437387, 433791, 430223, 425947, 421486, 417803, 415036, 412494, 409788, 407289, 405234, 403089, 400400, 397829, 396522, 396616, 397116, 397262, 397349, 398006, 399381, 401336, 403872, 406871, 409830, 412392, 414964, 418379, 422925, 427949, 432330, 435132, 435995, 435216, 433538, 431618, 429612, 427240, 424189, 420428, 416273, 412136, 408127, 403951, 399461, 395219, 392143, 390513, 389768, 389401, 389595, 390708, 392656, 395183, 398404, 402497, 407126]
51278D07126M563M351M382M336L729K645J542O85J55K8J93L21L60O50J311J905
51262D38282K120K224K405K161J054m28j417j808k072k284k143j782j660j679
51248D32973j314o88n90j189j642j381j001j288k033k480k429k270k146j837j359
51233D09326j092j211j423j357j003o30m37l83l32l28n70r76j038m56K51K94k11
51216C98424k88N83J807K653L208L868M491M709M663M733M799M438L732L245L205
51201D48270L237K927K150R91k74j148j371j286j334j461j443j570k228k972k877
51186D39611j867q61m80m12k66k14l85m25j30R2l7p8L91R99J193J147J320J526
51168D41124J251O34K94K61m2o56q10n7R40J271R67Q46J317J905J880J122J39
$$ y = [407126, 411689, 416040, 420422, 424758, 428487, 431132, 432674, 433359, 433514, 433542, 433735, 434056, 434416, 435066, 436377, 438282, 440402, 442626, 445031, 447192, 448246, 447818, 446401, 444593, 442521, 440237, 438094, 436312, 434652, 432973, 431659, 430971, 430381, 429192, 427550, 426169, 425168, 423880, 421847, 419367, 416938, 414668, 412522, 410685, 409326, 408234, 407023, 405600, 404243, 403240, 402610, 402173, 401790, 401458, 401130, 400560, 399584, 398546, 398090, 398341, 398635, 398424, 398136, 398719, 400526, 403179, 406387, 410255, 414746, 419455, 424118, 428851, 433650, 438088, 441820, 445065, 448270, 451507, 454434, 456584, 457575, 457301, 456153, 454782, 453496, 452162, 450701, 449258, 447688, 445460, 442488, 439611, 437744, 436883, 436403, 435991, 435725, 435511, 435126, 434701, 434571, 434663, 434626, 434548, 434939, 435938, 437131, 438278, 439598, 441124, 442375, 443009, 443303, 443564, 443522, 442866, 442056, 441999, 442939, 444210, 445177, 446023, 447340, 449245, 451125, 452247, 452386]
51151D52386n54r06j165j386j313q15k62k52r77j936k401k201j946k358l320l875
51135D26719l280j946r19o86q75j014j000p46pJ150K119K419K299K398L031L989
51119D33651M722M628L554K257J843K488L241L356L225L487L906L826L263K703
51105D80150K181J409O32M77R44J347J318J142J023P06Pq25j473j846j906j621
51089D83665j214r83q54n35o0K40L11L80M59L65K18K48J96l29r21o65M63J378
51071D82362J435J335J956L042L758L950M180M806N735O852Q186R739J1541J3614
51057E62491J5618J6821J6809J5934J4740J3284J1542J0171J0240J2113J4910
51046G14673J7039J7250J5409J2525R711O957L279j713o935j0917j3248j4355
$$ y = [452386, 451832, 450926, 449761, 448375, 447062, 446247, 445985, 445733, 444756, 442820, 440419, 438218, 436272, 433914, 430594, 426719, 423439, 421493, 420574, 419888, 419013, 417999, 416999, 416253, 416246, 417396, 419515, 421934, 424233, 426631, 429662, 433651, 438373, 443001, 446555, 448812, 450655, 453143, 456384, 459740, 462965, 466452, 470358, 474184, 477447, 480150, 482331, 483740, 484372, 484849, 485793, 487140, 488458, 489600, 490623, 491329, 491336, 490511, 489038, 487192, 485286, 483665, 482451, 481468, 480614, 480079, 480019, 480259, 480570, 480950, 481409, 481774, 481992, 482240, 482436, 482107, 481186, 480521, 480984, 482362, 483797, 485132, 487088, 490130, 493888, 497838, 502018, 506824, 512559, 519411, 527597, 537336, 548877, 562491, 578109, 594930, 611739, 627673, 642413, 655697, 667239, 677410, 687650, 699763, 714673, 731712, 748962, 764371, 776896, 786607, 793564, 796843, 795130, 788195, 777278, 764030, 749675]
51034G49675j4380j3148j1209r965j0443j2357j4461j5604j5340j3991j2227j0454
51022E96096q550o295l862j611M25K423M297N735O715P565Q439R079R220R017
51008F38693Q900R140R598R943J0104J0534J1730J3391J4439J4176J3146J2393
50996G76187J2137J1686J0570R125P814O594N220L844K830K155J346O5j419k443
50982H45711k475j371Q16M012P922J1778J4550J5604J5083J3760J2652J2762J4672
50969I65476J8221K2679K7380L2055L6664M1198M5731N0193N4104N6947N8993
50958A409641O1152O3625O5308O5026O2915N9955N6540N2250M6859M0800L4588
50947B018659K8480K2779J7842J3597R541N624K754J974L117M510M148J259l286
$$ y = [749675, 735295, 722147, 710938, 700973, 690530, 678173, 663712, 648108, 632768, 618777, 606550, 596096, 587546, 581251, 577389, 575778, 576203, 578626, 582923, 588658, 595373, 602938, 611377, 620456, 629676, 638693, 647593, 656733, 666331, 676274, 686378, 696912, 708642, 722033, 736472, 750648, 763794, 776187, 788324, 800010, 810580, 819705, 827519, 834113, 839333, 843177, 846007, 848162, 849508, 849573, 848154, 845711, 843236, 841865, 842681, 846693, 854615, 866393, 880943, 896547, 911630, 925390, 938042, 950804, 965476, 983697, 1006376, 1033756, 1065811, 1102475, 1143673, 1189404, 1239597, 1293701, 1350648, 1409641, 1470793, 1534418, 1599726, 1664752, 1727667, 1787622, 1844162, 1896412, 1943271, 1984071, 2018659, 2047139, 2069918, 2087760, 2101357, 2110898, 2116522, 2119276, 2121250, 2124367, 2128877, 2133025, 2134284, 2130998]
50934B130998p995j2018j5292j7860j9736k1397k3640k6528k9242l1401l3912
50923A891977l7744m2470m6843n0373n3374n5703n6599n5873n4249n2260m9628
50912A336861m6077m2032l8117l4486l1055k7887k5075k2545k0289j8418j6893
50901A013987j5561j4461j3660j2802j1410r712q521q060p617o632n388m239k924
50888H93000j250J88P26O49Q05J429K020K282K461K818L334L982M872N989P123
50873I30428Q130R063J0047J1172J2489J3926J5276J6418J7517J8889K0737K3084
50861A107176K5760K8475L1163L4299L8479M3484M8258N2147N5820O0558O6927
50850A592546P4541Q2689R0724R8097J04741J11320J18493J25898J32421J37463
$$ y = [2130998, 2123003, 2110985, 2095693, 2077833, 2058097, 2036700, 2013060, 1986532, 1957290, 1925889, 1891977, 1854233, 1811763, 1764920, 1714547, 1661173, 1605470, 1548871, 1492998, 1438749, 1386489, 1336861, 1290784, 1248752, 1210635, 1176149, 1145094, 1117207, 1092132, 1069587, 1049298, 1030880, 1013987, 998426, 983965, 970305, 957503, 946093, 936381, 927860, 919800, 912183, 905551, 900163, 895924, 893000, 891750, 891938, 892664, 893313, 894118, 895547, 897567, 899849, 902310, 905128, 908462, 912444, 917316, 923305, 930428, 938558, 947621, 957668, 968840, 981329, 995255, 1010531, 1026949, 1044466, 1063355, 1084092, 1107176, 1132936, 1161411, 1192574, 1226873, 1265352, 1308836, 1357094, 1409241, 1465061, 1525619, 1592546, 1667087, 1749776, 1840500, 1938597, 2043338, 2154658, 2273151, 2399049, 2531470, 2668933]
50840B668933J41264J43889J44415J41653J35258J25738J13654R9175Q2414O3844
50830C860237M4381K5175P375q081k0531k9635l5410l8171l8169l5356k9782k2253
50818C679780j4302p359k206N96J37m501j3317k5231l8853n3224o7807q2167r5899
50805C275647j08551j19371j27366j31930j33324j32219j28850j23037j14985
50796B156014j05571r5696q5646p5403o5182n5412m6322l7856k9896k2400j5493
50785A521137r605n288k677j223k18N50Q19K97j087l092n109o502p358q501j0391
50770A461752j2401j3702j4467j5478j6846j8019j8966k0330k2207k3674k3887
50759A261775k3023k1709k0224j8603j6949j5145j2750r680o624m328k765j353
$$ y = [2668933, 2810197, 2954086, 3098501, 3240154, 3375412, 3501150, 3614804, 3713979, 3796393, 3860237, 3904618, 3929793, 3937168, 3929087, 3908556, 3878921, 3843511, 3805340, 3767171, 3731815, 3702033, 3679780, 3665478, 3658119, 3655913, 3656509, 3656646, 3652145, 3638828, 3613597, 3574744, 3521520, 3453713, 3371546, 3275647, 3167096, 3047725, 2920359, 2788429, 2655105, 2522886, 2394036, 2270999, 2156014, 2050443, 1954747, 1869101, 1793698, 1728516, 1673104, 1626782, 1588926, 1559030, 1536630, 1521137, 1511532, 1506244, 1503567, 1502344, 1502126, 1502676, 1503495, 1503792, 1502705, 1499613, 1494504, 1488002, 1480644, 1472143, 1461752, 1449351, 1435649, 1421182, 1405704, 1388858, 1370839, 1351873, 1331543, 1309336, 1285662, 1261775, 1238752, 1217043, 1196819, 1178216, 1161267, 1146122, 1133372, 1123692, 1117068, 1112740, 1109975, 1108622]
50747A108622M02K770N832R224J2285J4950J8038K2228K7139L1923L6420M1025
50735A330858M5827N0456N4716N8655O2177O5122O7633O9926P1783P2828P3166
50724B023147P3198P2814P1454O8927O5640O1821N7039N0590M2004L1228J8751
50713B636613N624p075j8858k9477l8027m3075m3930m1314l6582l0643k3909j6746
50701B312601r650l180K000N246O281N129J580m814j3919k4555l5339m5669n5400
50688B140311o3815o9571p1913p1425o9227o5759o0748n4185m6806l9382l1947
50677A495533k4149j6170q711k062M318J0960J7566K3359K7989L1622L4415L6327
50665A630997L7265L6978L5008L1331K6962K3298K0790J8879J7189J6109J5939
$$ y = [1108622, 1109024, 1111794, 1117626, 1126850, 1139135, 1154085, 1172123, 1194351, 1221490, 1253413, 1289833, 1330858, 1376685, 1427141, 1481857, 1540512, 1602689, 1667811, 1735444, 1805370, 1877153, 1949981, 2023147, 2096345, 2169159, 2240613, 2309540, 2375180, 2437001, 2494040, 2544630, 2586634, 2617862, 2636613, 2642237, 2635162, 2616304, 2586827, 2548800, 2505725, 2461795, 2420481, 2383899, 2353256, 2329347, 2312601, 2302951, 2299771, 2301771, 2307017, 2313298, 2318427, 2320007, 2315193, 2301274, 2276719, 2241380, 2195711, 2140311, 2076496, 2006925, 1935012, 1863587, 1794360, 1728601, 1667853, 1613668, 1566862, 1527480, 1495533, 1471384, 1455214, 1446503, 1444441, 1448759, 1459719, 1477285, 1500644, 1528633, 1560255, 1594670, 1630997, 1668262, 1705240, 1740248, 1771579, 1798541, 1821839, 1842629, 1861508, 1878697, 1894806, 1910745]
50654A910745J6242J6446J6511J6568J6440J6101J6151J7222J9155K1388K3897
50643B106866K7107L1117L5614M0386M5178M9176N1522N2493N3244N4090N3872
50632B600665N1578M7869M4239M1217L8384L5790L4213L3713L2711K8913K0572
50621C009864O865j1984l3960n4939p0201p6956p5576o8619n8880m8181l7363
50610B480070k6859j7136q665j733L437O399O545L644k042j0142k0326l1814m3196
50597B338182n3219o1532o8184p2809p4954p4993p3874p1857o8353o3239n7567
50586A597601n2459m7896m3203l8340l4061l0954k8812k6963k4832k2252j9526
50575A228303j7125j5148j3122j0521p361m084j038J703M203O528Q696J0638J2340
$$ y = [1910745, 1926987, 1943433, 1959944, 1976512, 1992952, 2009053, 2025204, 2042426, 2061581, 2082969, 2106866, 2133973, 2165090, 2200704, 2241090, 2286268, 2335444, 2386966, 2439459, 2492703, 2546793, 2600665, 2652243, 2700112, 2744351, 2785568, 2823952, 2859742, 2893955, 2927668, 2960379, 2989292, 3009864, 3016729, 3004745, 2970785, 2915846, 2845645, 2768689, 2693113, 2624494, 2565614, 2517433, 2480070, 2453211, 2436075, 2427410, 2425677, 2429114, 2435513, 2442058, 2445702, 2443660, 2433518, 2413192, 2381378, 2338182, 2284963, 2223431, 2155247, 2082438, 2007484, 1932491, 1858617, 1786760, 1718407, 1655168, 1597601, 1545142, 1497246, 1454043, 1415703, 1381642, 1350688, 1321876, 1294913, 1270081, 1247829, 1228303, 1211178, 1196030, 1182908, 1172387, 1165026, 1160942, 1159904, 1161607, 1165810, 1172338, 1181034, 1191672, 1204012]
50562A204012J4055J6133J8585K1109K3611K6257K8921L1153L2976L5017L7465
50551A489294L9459M0181L9917L9360L8397L6552L4202L2351L1322L0705L0582
50540A882322L1666L4133L7352M1125M6143N2718N9954O6856P3481Q0344Q7332
50529B493426R4066J00839J08266J16165J23626J30111J35730J40423J43498J44218
50519C730368J42387J38045J31014J20936J07666R1395P2508N1475K8849N322
50509D619965j8295m1285o3220q3752j02111j17035j27387j32764j33391j29584
50499C671141j21522j09471r3925p5627n5518l4599j3674O618K5323M0944N1971
50488C291661N7565N7394N0961L7677J7864o668l3410o0300q5795j08173j25531
$$ y = [1204012, 1218067, 1234200, 1252785, 1273894, 1297505, 1323762, 1352683, 1383836, 1416812, 1451829, 1489294, 1528753, 1568934, 1608851, 1648211, 1686608, 1723160, 1757362, 1789713, 1821035, 1851740, 1882322, 1913988, 1948121, 1985473, 2026598, 2072741, 2125459, 2185413, 2252269, 2325750, 2406094, 2493426, 2587492, 2688331, 2796597, 2912762, 3036388, 3166499, 3302229, 3442652, 3586150, 3730368, 3872755, 4010800, 4141814, 4262750, 4370416, 4461811, 4534319, 4585794, 4614643, 4619965, 4601670, 4560385, 4497165, 4413413, 4311302, 4194267, 4066880, 3934116, 3800725, 3671141, 3549619, 3440148, 3346223, 3270596, 3215078, 3180479, 3166805, 3173423, 3198746, 3239690, 3291661, 3349226, 3406620, 3457581, 3495258, 3513122, 3506454, 3473044, 3412744, 3326949, 3218776, 3093245]
50477C093245j36819j42552j44129j42649j38611j32445j24724j15819j05942
50468A909555r5624q5705p6556o7898n9650n2423m6567m1256l5349k8965k3339
50457A296223j9115j5598j1983q487n860m361l616l149k555j546j56J307K726
50444A223830M271N911P317Q549J0179J2350J4189J4764J4139J2874J1056Q660
50432A348089O505N729O413P606Q845J0644J3227J5732J7240J7900J8482J9362
50420A495774K0536K2153K4352K6844K9336L2187L6021M0731M5542N0076N4813
50409A878365O0233O5909P0722P3774P4906P4541P3202P1080O7881O3149N6771
50398B630533M9106M0621L1489K1491J0153k906j7525l2758m7354o0466p1639
$$ y = [3093245, 2956426, 2813874, 2669745, 2527096, 2388485, 2256040, 2131316, 2015497, 1909555, 1813931, 1728226, 1651670, 1583772, 1524122, 1471699, 1425132, 1383876, 1348527, 1319562, 1296223, 1277108, 1261510, 1249527, 1241040, 1235180, 1230819, 1227203, 1224054, 1221499, 1219953, 1219797, 1221104, 1223830, 1228101, 1234012, 1241329, 1249878, 1260057, 1272407, 1286596, 1301360, 1315499, 1328373, 1339429, 1348089, 1354594, 1360323, 1366736, 1374342, 1383187, 1393831, 1407058, 1422790, 1440030, 1457930, 1476412, 1495774, 1516310, 1538463, 1562815, 1589659, 1618995, 1651182, 1687203, 1727934, 1773476, 1823552, 1878365, 1938598, 2004507, 2075229, 2149003, 2223909, 2298450, 2371652, 2442732, 2510613, 2573762, 2630533, 2679639, 2720260, 2751749, 2773240, 2783393, 2780487, 2762962, 2730204, 2682850, 2622384, 2550745]
50387B550745q0216q5257q6384q4284p9933p3583o4971n4354m2741l1080j9727
50376A848215q822J253J0025J7168K2374K5142K4979K1587J4900N166o766j9576
50364A955645l2022m3230n2500n9273o3514o5698o6153o4818o1939n8411n4985
50353A333102n1522m7717m4049m1194l8711l5365l0810k6106k2189j8744j4948
50342I61747j0666o309k081K024N809R092J2016J4491J5616J4272J0430N214k43
50329A031412n462r998j2945j3652j2619j1063r639p935n417k408J94J967L279
50316I45714M549N569N817N194M143L148K422K024J952K141K537L206M082M759
50302I97257M837M523M462M893N449N870O437P347Q174Q471Q588R280J0544J1542
$$ y = [2550745, 2470529, 2385272, 2298888, 2214604, 2134671, 2061088, 1996117, 1941763, 1899022, 1867942, 1848215, 1839393, 1840646, 1850671, 1867839, 1890213, 1915355, 1940334, 1961921, 1976821, 1981987, 1975221, 1955645, 1923623, 1880393, 1827893, 1768620, 1705106, 1639408, 1573255, 1508437, 1446498, 1388087, 1333102, 1281580, 1233863, 1189814, 1148620, 1109909, 1074544, 1043734, 1017628, 995439, 976695, 961747, 951081, 944772, 942691, 944715, 950524, 959616, 971632, 986123, 1001739, 1016011, 1026441, 1031655, 1031412, 1025950, 1015952, 1003007, 989355, 976736, 965673, 956034, 948099, 942682, 940274, 940468, 942435, 945714, 950263, 955832, 961649, 966843, 970986, 974134, 976556, 978580, 980532, 982673, 985210, 988416, 992498, 997257, 1002094, 1006617, 1011079, 1015972, 1021421, 1027291, 1033728, 1041075, 1049249, 1057720, 1066308, 1075588, 1086132, 1097674]
50288A097674J1880J2373J4057J6647J8454J7866J4561R163K331n282j2361j7052
50276A180311j8264j6538j3351r861o592l887j909l81J036K123K397K031J715
50263A118830J520P04r80k558k920k086q53L41J475K380K873L431M951P725J1090
50248A145923J4223J6868J9243K1554K3768K5641K6907K7484K7503K7026K5998
50237A402138K4570K3168K2082K1200K0349J9443J7998J5010R870L139m199j1837
50225A562931j9874k7700l4033l8133m0219m0632l9279l6138l1648k6471k1428
50214A207376j7743j6507j7605j9883k2628k6033k9728l1936l1184k8256k5276
50203I40597k3063k0636j7336j4127j2226j1385j0389q724o954n689m957m621
$$ y = [1097674, 1109554, 1121927, 1135984, 1152631, 1171085, 1188951, 1203512, 1212675, 1215006, 1209724, 1197363, 1180311, 1162047, 1145509, 1132158, 1122297, 1115705, 1111818, 1109909, 1109528, 1110564, 1112687, 1115084, 1117115, 1118830, 1120350, 1121054, 1120074, 1117516, 1114596, 1112510, 1111657, 1111998, 1113473, 1115853, 1118726, 1122157, 1127108, 1134833, 1145923, 1160146, 1177014, 1196257, 1217811, 1241579, 1267220, 1294127, 1321611, 1349114, 1376140, 1402138, 1426708, 1449876, 1471958, 1493158, 1513507, 1532950, 1550948, 1565958, 1575828, 1578967, 1574768, 1562931, 1543057, 1515357, 1481324, 1443191, 1402972, 1362340, 1323061, 1286923, 1255275, 1228804, 1207376, 1189633, 1173126, 1155521, 1135638, 1113010, 1086977, 1057249, 1025313, 994129, 965873, 940597, 917534, 896898, 879562, 865435, 853209, 841824, 831435, 822711, 815757, 810068, 805111, 800490]
50191H00490m730n226n728n889n676n211m622m215m400n122n661n428m741m339
50177G29502m306m060l345k644k321j999j204j47O27J115J765K645L238L155K686
50162G24707K487K969M057N293O149O495O781P556Q789R964J0795J1567J2649
50149H20258J3908J4766J4634J3285J1001Q448O285M713L551K734K562L394N285
50136I24824Q039J1468J5512K0124K5136L0238L5164L9901M4563M8900N2178N3738
50124A309785N3630N2486N0895M9232M7880M7177M7040M7052M6850M6076M3914
50113A842017L9186L1288K0715Q490m601j7938l0633m1672n0513n7215o1879o4293
50101A612952o4233o2110n8988n5767n2373m8037m2575l7015l2631k9604k7081
$$ y = [800490, 795760, 790534, 784806, 778917, 773241, 768030, 763408, 759193, 754793, 749671, 744010, 738582, 733841, 729502, 725196, 721136, 717791, 715147, 712826, 710827, 709623, 709476, 710103, 711218, 712983, 715628, 718866, 722021, 724707, 727194, 730163, 734220, 739513, 745662, 752157, 758938, 766494, 775283, 785247, 796042, 807609, 820258, 834166, 848932, 863566, 876851, 887852, 896300, 902585, 907298, 910849, 913583, 916145, 919539, 924824, 932863, 944331, 959843, 979967, 1005103, 1035341, 1070505, 1110406, 1154969, 1203869, 1256047, 1309785, 1363415, 1415901, 1466796, 1516028, 1563908, 1611085, 1658125, 1705177, 1752027, 1798103, 1842017, 1881203, 1912491, 1933206, 1941696, 1937095, 1919157, 1888524, 1846852, 1796339, 1739124, 1677245, 1612952, 1548719, 1486609, 1427621, 1371854, 1319481, 1271444, 1228869, 1191854, 1159223, 1129619, 1102538]
50090A102538k4413k1686j9072j6393j3567j0928q689o618m546k785j558m93Q11
50077I72601K031K515K246J766J366Q19K0p23j053r75q66j290k645m596o104o481
50061I58631o239o310o675o533n763n256n478n692n123m046l121k281j163r8L58
50046H95211O29J795L990O123P364Q071Q876R736J0365J0959J1743J2368J2434
50033I99664J2319J2741J3668J4335J4262J3609J2566J1171R751Q814Q209P102
50021A138211N190L305K350K089J745J310J558K739M082M740M822N273P077J0618
50007A195109J5385K0051K3242K4539K4634K4361K3834K2857K1888K2113K4228
49996A442241K7428K9863L0085K7810K3282J6326O661n053j7098k8010l7444m5453
$$ y = [1102538, 1078125, 1056439, 1037367, 1020974, 1007407, 996479, 987790, 981172, 976626, 973841, 972283, 971790, 972601, 974632, 977147, 979393, 981159, 982525, 983344, 983364, 982641, 981588, 980613, 979747, 978457, 975812, 971216, 965112, 958631, 952392, 946082, 939407, 932874, 927111, 921855, 916377, 910685, 905562, 901516, 898395, 896114, 894951, 894853, 895211, 895840, 897635, 901625, 907748, 915112, 923183, 932059, 941795, 952160, 963119, 974862, 987230, 999664, 1011983, 1024724, 1038392, 1052727, 1066989, 1080598, 1093164, 1104335, 1114086, 1122900, 1131109, 1138211, 1143401, 1146706, 1149056, 1151145, 1152890, 1154200, 1155758, 1158497, 1162579, 1167319, 1172141, 1177414, 1184491, 1195109, 1210494, 1230545, 1253787, 1278326, 1302960, 1327321, 1351155, 1374012, 1395900, 1418013, 1442241, 1469669, 1499532, 1529617, 1557427, 1580709, 1597035, 1603696, 1598643, 1581545, 1553535, 1516091, 1470638]
49984A470638n1482n4825n5739n5239n3826n1264m7665m3923m0602l7219l3178
49973I45676k8850k5026k1750j8535j5407j2943j1328j0153r168q479p870o676
49961G69491m694k640j284o10j09N21J442L026N460Q178J0295J1566J2458J3262
49947H26362J3665J3345J2479J1483J0458R166P320M852K063m29k159l391m951
49934I00263p354j0341j3408j6376j9212k1513k2598k2057k0102j7478j5126j3585
49922G01113j2448j0741q120n327l156j439L54J954K681K820L492M987O195O197
49908F88562N614N736O836Q091Q830R261J0027J1534J3587J5458J6452J6626J6551
49895H33165J6252J4939J2235R001O308M064J498j487m365p129j0200j3246j5197
$$ y = [1470638, 1419156, 1364331, 1308592, 1253353, 1199527, 1148263, 1100598, 1056675, 1016073, 978854, 945676, 916826, 891800, 870050, 851515, 836108, 823165, 811837, 801684, 792516, 784037, 776167, 769491, 764797, 762157, 760873, 760263, 760154, 760675, 762117, 765143, 770603, 778781, 789076, 800642, 813100, 826362, 840027, 853372, 865851, 877334, 887792, 896958, 904278, 909130, 911193, 910764, 908605, 905214, 900263, 892909, 882568, 869160, 852784, 833572, 812059, 789461, 767404, 747302, 729824, 714698, 701113, 688665, 677924, 669804, 664477, 661321, 659882, 660236, 662190, 664871, 667691, 671183, 676170, 682365, 688562, 694176, 699912, 706748, 714839, 723669, 732930, 742957, 754491, 768078, 783536, 799988, 816614, 833165, 849417, 864356, 876591, 885592, 891900, 895964, 897462, 895975, 891610, 884481, 874281, 861035, 845838]
49882H45838j5800j6086j6872j7672j7694j7136j6664j6159j4903j2825j0745
$$ y = [845838, 830038, 813952, 797080, 779408, 761714, 744578, 727914, 711755, 696852, 684027, 673282]
$$ [...]
##END NTUPLES=NMR SPECTRUM
##END=
