
##TITLE=UV1221_M6_1234-1212_5_7241637_SVRYwP0Gcb
##JCAMPDX= 6.0         $$ Bruker NMR JCAMP-DX V2.0
##DATA TYPE= NMR SPECTRUM
##DATA CLASS= NTUPLES
##ORIGIN= BRUKER
##OWNER= Administrator
$$ 1.72 TOPSPIN		Version 2.1
$$ 2013-01-24 00:33:57.513 -0500  Administrator@X
$$ Compression mode = diff/dup
##.OBSERVE FREQUENCY= 400.02188249412
##.OBSERVE NUCLEUS= ^1H
##.ACQUISITION MODE= SIMULTANEOUS (DQD)
##.ACQUISITION SCHEME= undefined
##.AVERAGES= 8
##.DIGITISER RES= 22
##SPECTROMETER/DATA SYSTEM= spect
##.PULSE SEQUENCE= zg30
##.SOLVENT NAME= COFFEE_meoh
##.SHIFT REFERENCE= INTERNAL, COFFEE_meoh, 1, 14.98509
##AUDIT TRAIL= $$ (NUMBER, WHEN, WHO, WHERE, PROCESS, VERSION, WHAT)
$$ ##TITLE= Audit trail, TOPSPIN		Version 2.1
$$ ##JCAMPDX= 5.01
$$ ##ORIGIN= Bruker BioSpin GmbH
$$ ##OWNER= Administrator
$$ $$ E:\/data/COFFEE/nmr/UV1221_M6_1234-1212_5_7241637_SVRYwP0Gcb/30/pdata/1/auditp.txt
$$ ##AUDIT TRAIL=  $$ (NUMBER, WHEN, WHO, WHERE, PROCESS, VERSION, WHAT)
(   1,<2013-01-24 00:33:49.356 -0500>,<Administrator>,<X>,<go>,<TOPSPIN 2.1>,
      <created by zg
	started at 2013-01-24 00:32:43.294 -0500,
	POWCHK enabled, PULCHK disabled,
       configuration hash MD5:
       86 BA 57 50 F2 9D 5C 9B 26 00 A9 28 5F 66 2E 89
       data hash MD5: 64K
       C1 86 FC CA 87 96 4C 23 71 CE 8E A6 5E 03 46 3D>)
(   2,<2013-01-24 00:33:52.403 -0500>,<Administrator>,<X>,<proc1d>,<TOPSPIN 2.1>,
      <Start of raw data processing
       efp LB = 0 FT_mod = 6 PKNL = 1 PHC0 = 0 PHC1 = 0 SI = 32K 
       data hash MD5: 32K
       DC C3 E8 74 04 B9 D6 C3 0C 41 A3 BF 4B E0 45 3D>)
(   3,<2013-01-24 00:33:52.856 -0500>,<Administrator>,<X>,<proc1d>,<TOPSPIN 2.1>,
      <pk PHC0 = 99.75037 PHC1 = 0 
       data hash MD5: 32K
       3A 16 EF 0B 07 E7 3F D4 C3 7E 7F A3 4D EB F0 FA>)
(   4,<2013-01-24 00:33:53.091 -0500>,<Administrator>,<X>,<proc1d>,<TOPSPIN 2.1>,
      <abs ABSG = 1 
       data hash MD5: 32K
       C7 61 48 EE 32 47 71 46 DD E7 01 3B 80 D3 01 AC>)
(   5,<2013-01-24 00:33:53.247 -0500>,<Administrator>,<X>,<proc1d>,<TOPSPIN 2.1>,
      <abs ABSG = 2 
       data hash MD5: 32K
       2B 09 6D B2 44 DB 16 B5 DF A5 0B 64 2D FB 9F 24>)
(   6,<2013-01-24 00:33:53.403 -0500>,<Administrator>,<X>,<proc1d>,<TOPSPIN 2.1>,
      <abs ABSG = 3 
       data hash MD5: 32K
       D8 BF 94 A5 56 F9 43 D4 7C 78 26 A9 8A 6F 81 FF>)
(   7,<2013-01-24 00:33:53.559 -0500>,<Administrator>,<X>,<proc1d>,<TOPSPIN 2.1>,
      <abs ABSG = 4 
       data hash MD5: 32K
       7C 53 48 7C 2F DB 06 E3 DA 4B C4 2B FA EA 82 C8>)
(   8,<2013-01-24 00:33:53.700 -0500>,<Administrator>,<X>,<proc1d>,<TOPSPIN 2.1>,
      <abs ABSG = 5 
       data hash MD5: 32K
       65 EA 21 ED 29 1F 47 2C D9 B0 90 31 02 FB 5C 20>)
$$ ##END=
$$ 
$$ $$ hash MD5
$$ $$ 4D F2 97 56 54 F0 07 91 6C 53 EA 40 CA AB 3F 5D
##$RELAX= 
##$RELAX= 
##$RELAX= 
##$RELAX= 
##$RELAX= 
##$RELAX= 
##$RELAX= 
$$ Bruker specific parameters
$$ --------------------------
##$DU= <E:\>
##$EXPNO= 30
$$ [...]
##$TP= (0..7)
150 150 150 150 150 150 150 150
##$TP07= 0
##$TPNAME0= <>
##$TPNAME1= <>
##$TPNAME2= <>
##$TPNAME3= <>
##$TPNAME4= <>
##$TPNAME5= <>
##$TPNAME6= <>
##$TPNAME7= <>
##$TPOAL= (0..7)
0.5 0.5 0.5 0.5 0.5 0.5 0.5 0.5
##$TPOFFS= (0..7)
0 0 0 0 0 0 0 0
##$TUNHIN= 0
##$TUNHOUT= 0
##$TUNXOUT= 0
##$USERA1= <user>
##$USERA2= <user>
##$USERA3= <user>
##$USERA4= <user>
##$USERA5= <user>
##$V9= 5
##$VALIST= <valist>
##$VCLIST= <CCCCCCCCCCCCCCC>
##$VD= 0
##$VDLIST= <DDDDDDDDDDDDDDD>
##$VPLIST= <PPPPPPPPPPPPPPP>
##$VTLIST= <TTTTTTTTTTTTTTT>
##$WBST= 1024
##$WBSW= 4
##$XGAIN= (0..3)
0 0 0 0
##$XL= 0
##$YL= 0
##$YMAX_a= 679433
##$YMIN_a= -579601
##$ZGOPTNS= <>
##$ZL1= 120
##$ZL2= 120
##$ZL3= 120
##$ZL4= 120
##$ABSF1= 14.98509
##$ABSF2= -5.573092
##$ABSG= 5
##$ABSL= 3
##$ALPHA= 0
##$AQORDER= 0
##$ASSFAC= 0
##$ASSFACI= 0
##$ASSFACX= 0
##$ASSWID= 0
##$AUNMP= <proc_prof1d_extract_pilot.lims>
##$AXLEFT= 0
##$AXNAME= <>
##$AXNUC= <1H>
##$AXRIGHT= 0
##$AXTYPE= 0
##$AXUNIT= <>
##$AZFE= 0.1
##$AZFW= 0.1
##$BCFW= 0
##$BC_mod= 0
##$BYTORDP= 0
##$COROFFS= 0
##$CY= 15
##$DATMOD= 1
##$DC= 0
##$DFILT= <>
##$DTYPP= 0
##$F1P= 0
##$F2P= 0
##$FCOR= 0.5
##$FTSIZE= 32768
##$FT_mod= 6
##$GAMMA= 0
##$GB= 0
##$INTBC= 1
##$INTSCL= 1
##$ISEN= 128
##$LB= 0
##$LEV0= 0
##$LPBIN= 0
##$MAXI= 10000
##$MC2= 0
##$MEAN= 0
##$ME_mod= 0
##$MI= 0
##$NCOEF= 0
##$NC_proc= -8
##$NLEV= 6
##$NOISF1= 0
##$NOISF2= 0
##$NSP= 0
##$NTH_PI= 0
##$NZP= 0
##$OFFSET= 14.98509
##$PC= 1
##$PHC0= 99.75037
##$PHC1= 0
##$PH_mod= 1
##$PKNL= yes
##$PPARMOD= 0
##$PPDIAG= 0
##$PPIPTYP= 0
##$PPMPNUM= 2147483647
##$PPRESOL= 1
##$PSCAL= 4
##$PSIGN= 0
##$PYNMP= <proc.py>
##$REVERSE= no
##$SF= 400.02
##$SI= 32768
##$SIGF1= 0
##$SIGF2= 0
##$SINO= 400
##$SIOLD= 32768
##$SPECTYP= <>
##$SREGLST= <1H.CDCl3>
##$SSB= 0
##$STSI= 32768
##$STSR= 0
##$SW_p= 8223.68421052631
##$SYMM= 0
##$S_DEV= 0
##$TDeff= 65536
##$TDoff= 0
##$TI= <>
##$TILT= no
##$TM1= 0
##$TM2= 0
##$TOPLEV= 0
##$USERP1= <user>
##$USERP2= <user>
##$USERP3= <user>
##$USERP4= <user>
##$USERP5= <user>
##$WDW= 1
##$XDIM= 32768
##$YMAX_p= 474352887
##$YMIN_p= -693412
##$CURPLOT= <Network HP LaserJet P1505>
##$CURPRIN= <$Network HP LaserJet P1505>
##$DFORMAT= <normdp>
##$LAYOUT= <+/1D_H.xwp>
##$LFORMAT= <normlp>
##$PFORMAT= <normpl>
##$SURQMSG= 1
$$ End of Bruker specific parameters
$$ ---------------------------------
##NTUPLES= NMR SPECTRUM
##VAR_NAME=  FREQUENCY,     SPECTRUM/REAL,   SPECTRUM/IMAG
##SYMBOL=    X,             R,               I
##VAR_TYPE=  INDEPENDENT,   DEPENDENT,       DEPENDENT
##VAR_FORM=  AFFN,          ASDF,            ASDF
##VAR_DIM=   32768,         32768,           32768
##UNITS=     HZ,            ARBITRARY UNITS, ARBITRARY UNITS
##FACTOR=    0.250966925370066, 1,           1
##FIRST=     8223.43324360094, -92933,       67665
##LAST=      0,             -171793,         10538
##MIN=       0,             -693412,         0
##MAX=       8223.43324360094, 474352887,    0
$$ Real data points
##PAGE= N=1
##DATA TABLE= (X++(R..R)), XYDATA
$$ [...]
23845 -234082 31951 -69452 9147 -186065 11816 58120 181072 -138533 250271 74797 -183843
23833 -91125 66067 -262488 -32784 257947 -192797 -402490 -134046 60073 117859 53840 193708
23822 193708 -120990 -307149 4816 84930 53799 36633 105128 59436 -354474 222860 -48579
23810 30116 160466 16346 11044 62985 201142 -53621 18284 -155977 186207 18400 8497
23798 -92441 44029 78093 -150153 87190 549 84911 -154253 -102580 -72414 93299 -23995 -160748
23786 -160748 -323944 -101138 -54361 -160999 246385 -368416 -194656 94859 106261 -266072
23775 -10679 -198641 28436 -80875 -207845 36449 -261207 -108963 -10975 -36242 -140883 -7001
23763 -24983 132164 278459 -292647 329292 258656 90326 -26258 -209983 131258 12916
23752 -8623 42653 94867 -17493 173205 200195 277387 128098 -234677 168903 269559 -102842
23740 234252 -10465 54527 -366788 -73537 -40083 246837 -31255 140537 145676 -224652 147449
23728 140579 -30609 116204 13387 -61617 -83833 -78364 -119798 -74832 229392 -124081 -363698
23717 -363698 112811 -142673 -317837 142068 -77372 82557 -101057 234993 -148145 46270
23706 -189991 -244368 313767 38085 35698 305556 141890 -16514 110318 -136045 169936
23695 -11558 -68556 37394 19611 36320 -285549 130442 368139 -94405 -159301 15364 110049
23684 110049 70490 113869 -147770 222533 -93301 -202466 154098 -13488 -40526 -67719 -149441
23673 -149441 -258031 -183136 -120987 54003 148030 107713 -137746 -40728 -14248 -126051 144523
23661 15747 -187415 160112 54631 -152929 20491 -75147 52189 -360927 156706 -17888 98249
23649 35806 -18469 267789 462460 146443 -195560 -33433 -132249 202812 289883 -29831 -30960
23638 -30960 -37073 -114914 -186821 -179280 56577 -94983 224935 15578 42565 -104327 254782
23626 90868 11277 46883 -98968 -199517 -267770 144423 31305 102059 -272742 18341 -29926
23614 -82456 106634 -487944 -34901 -81463 49914 -146678 81432 -106407 172645 63889 -47067
23602 347515 -307147 -93489 276669 252395 -30994 -271859 7649 195832 78933 -159743 -72578
23590 71332 236287 -58262 -28454 -36024 -1214 132333 186574 42037 -166916 -4663 -123094
23579 -123094 488414 152477 -137863 197237 95488 -184507 -261499 -8210 -94093 -114257 -163446
23568 -163446 -2964 -226916 360289 175867 -24830 355006 76636 98449 -85852 149435 109434
23557 109434 -212226 118647 332728 -78466 -76509 279664 36817 259960 48682 -359735
23546 -16807 89491 -30906 -98467 -177933 78168 -232494 -74401 35833 -21064 -26885 197913
23534 -299592 212350 -343767 -106191 -194065 46165 -287530 182183 -110331 -303428 17995
23523 -47745 -142516 123683 29905 139652 -88963 -32133 378381 -296103 226918 68943 -165211
23511 5796 -29075 -215889 -91935 -19983 616653 -109706 -63274 134112 -218366 -48976 335893
23499 -154812 178121 298303 -107034 -148387 188514 -130928 -3289 -296766 -262170 106209
23488 -361757 368610 -27971 -280180 -186920 -191093 264276 -322947 -32355 -37213 -406519 -39333
23476 -137176 -179865 24559 78673 48869 -410302 182981 142103 -355749 -166247 -355485
23466 -355485 -58411 -54275 106123 -190222 -238646 247395 -124790 -346855 96016 -307065
23455 -92957 174314 211983 -124421 -16076 25558 -26794 -54189 167452 215955 -63098 23344
23443 -43050 133674 125174 -138837 -172042 52423 183709 -238413 44013 -338323 311289 201603
23432 201603 255341 -110950 7009 -186442 -220689 5539 -149183 -140198 270711 70375 -10717
23420 97339 -173920 249678 46678 -53033 -116997 9246 181816 -239360 -272885 78865 -251119
23408 17159 -50793 77239 -49206 131253 235789 32915 315917 154317 -292036 -155345
23398 -155345 1513 -105265 -141504 -1841 -85052 411350 -29791 -36250 -74370 58055 124602 -156249
23385 -56684 -169927 -290322 -155164 -123643 -251885 -292941 24550 -25822 128944 -141887
23374 233023 94211 -363735 200661 90224 -56985 238944 70828 -76014 10159 -55130 38138
23362 255851 -152601 -25950 -126847 -57461 -285630 -126083 -169815 -385631 166137 -289691
23351 -147935 -164364 -134985 -135028 52594 -213968 -76603 -221654 -215469 -280879 -242743 193876 201668
23339 201668 99264 217711 68976 184213 -158844 -227431 22251 74932 -143401 -27520 251868
23327 229804 -18776 -273803 -76130 -226077 -297265 -315908 302229 -10746 -61217 83633 -145169
23315 -338561 -253196 -375775 -176811 84741 229836 340751 -43133 178602 26781 109102
23305 109102 -293418 10852 -39512 78206 565 -79380 -112699 97085 221254 -114724 205591
23293 -424529 -74855 -105726 183996 166991 -40974 -73234 -247470 96563 11061 -594 -23556
23282 -23556 -72266 140423 -232218 -77465 -32050 -226815 -50747 106311 195430 -99858 -216214
23271 -216214 179190 28415 -12960 273838 -10805 181907 -348560 42524 8983 -294180 9794
23259 179038 -176079 -39 -906 -47692 -344742 -35660 -41525 -288780 256430 -231435 58196 -106655
23246 97554 -137976 174713 69563 -45042 43746 8884 180351 -35567 -91803 -198647 41414
23234 -1462 20845 61207 -41953 232028 -168827 -59678 139253 124958 107851 161832 6911
23222 -91847 -146073 149730 -177940 -32684 65585 -437500 312372 -182470 20386 63260 -16984
23210 50908 55628 216716 32514 226738 -123135 30982 -37411 199996 -76781 177010 -244088
23198 14302 204173 159390 270385 605 -314859 241884 -227766 -132087 11994 -98233 -71055
23187 -71055 -67539 -13276 86098 186441 96904 -97289 -225543 199114 26550 -136775 226146
23175 -84598 8097 -80030 49699 -401320 -183717 64868 210959 -48536 15010 -218045 214231
23163 132756 196336 33258 31379 140039 14382 -268482 -160636 -207815 561 -265408 33079
23151 7215 184788 -105231 143782 146764 -35961 11252 -252743 -49275 -128986 -47283 -82184
23140 -82184 307419 -311711 239459 103271 -4082 42523 -315341 -431169 -76414 115730
23129 54184 -260520 -239542 175885 -258024 112074 -85859 -286516 -154383 28715 -37359
23118 18904 -44757 -63320 195125 -101757 16895 69230 -123323 -292716 -203732 -360207 32665
23106 -8802 -136273 279730 49289 4265 -196056 -113291 353 18504 128409 173828 -38040 1522
23093 201082 290045 -54306 78923 -203989 24553 -218584 -249500 -118666 307632 171125
23083 171125 -81521 -1004 146113 -113421 8758 27960 -12446 58868 -179007 449413 80890
23071 166790 31075 -181167 136465 89323 -245782 16454 135278 -194338 315138 281606
23061 281606 -362400 -148613 2558 74823 -102511 20221 -108841 -128287 119222 -49465 197718
23049 95835 -125134 -236582 10819 114929 84568 -71064 -126666 270854 -587518 -28234 226939
23037 106004 -177356 -338045 -194976 51878 103192 -123535 -110763 414976 -28480 55696
23026 -161287 -7724 265350 -150143 -145368 98412 -152381 -82770 79892 356278 113185 9343
23014 107137 -141008 14580 5983 -25197 184314 50570 31808 261175 90219 -326049 -151849
23002 200191 -138914 89730 -214016 381718 57005 184390 -153129 66735 34659 -147645
22991 268794 88383 71958 -163289 -65665 179124 -29515 -150321 -143346 -76614 -142760 130553
22979 -88975 76132 142477 -336188 -48438 -27986 -152864 -32437 34687 40625 -241517 17615
22967 43297 -197828 -44198 -222748 -234199 -1832 -81191 192420 35762 215711 25437 199702
22956 199702 -238376 69205 -171205 -58308 192859 -12972 -216724 -78132 -305919 146487
22945 474292 23906 -206168 197572 156017 25783 260206 -290526 -98898 -37786 48103 -108721
22933 -102850 122535 -96834 -121025 259464 -252238 -35863 198883 312354 -12973 -188091
22923 -188091 62257 -67540 100727 -92038 58506 65095 -148244 105548 -410174 20070 -364507
22911 -75983 -227818 -166271 53168 282632 -200029 138503 -75941 219893 -227142 78311
22900 -462462 96188 -71942 143247 -83376 -230997 -330679 -40441 181471 -256651 -89312 74463
22888 208507 -148264 81517 184390 -60153 109891 283325 -145328 230597 101797 -282093
22877 -186662 195296 -128786 -329391 118668 -177875 -67080 69546 -58945 -100402 103509
22866 50627 -341400 94151 194414 -124137 -368104 -125246 8001 -221776 -53854 -80310 -265836
22855 -265836 -346731 184539 266190 423886 -259453 -27886 108388 -283471 -36310 6795 -45711
22843 1022 -82003 153190 156877 96552 97703 -57088 -87957 -17073 26141 -60926 252104 186945
22831 186945 -116766 -170611 -229775 -130573 -101064 113236 -27914 37069 -118067 -69850 -325705
22820 -325705 -417839 184331 -43109 140257 55432 -34886 -160745 -57532 343499 17796 7100
22808 270947 76677 -12384 -309461 23445 -13532 157788 210588 -252371 92174 -69905 -197695
22797 -197695 -169125 -21615 -33452 -40081 -96820 -120151 -57251 -174628 -76517 -204066 12945
22785 -369691 -530049 -116719 -202557 -150024 262694 -150014 217672 157456 -103529 -129606
22775 -129606 -283026 262441 228532 -69593 -170845 38797 -72780 -113895 125794 140880 -87236
22763 543356 -41858 -83009 -178675 38076 42830 82557 -48356 -27827 -134194 -246775 -171208
22752 -171208 -238018 121739 2393 -155931 265822 -211022 -22309 -8518 -181273 110730 427345
22741 427345 85393 -49019 95585 69513 -34977 -194796 -168764 291475 241067 118787 -124648
22729 87617 -106899 -69706 -23999 -259599 -47048 -166563 -214494 -24628 -253928 -164295 -109495
22718 -109495 -16310 48149 -165822 -133525 -278056 290998 160443 -196491 380518 -105516
22707 -300926 49640 224266 -139466 69404 125415 -178131 327087 215760 -284304 182714
22696 -535701 -116348 -446987 -290916 139540 -247316 -382206 426216 54093 86471 -154132
22685 -275585 -271267 -37210 -58432 -18591 6458 32549 -310173 243656 114 21333 -11529 18853
22672 123709 308043 -157416 -40174 45482 -106505 -192170 127950 -107807 -154587 12332
22661 7920 -80686 337843 103188 160788 -150793 149198 -434501 -137573 109947 259370
22651 259370 280521 -227271 -34860 58116 -30176 -186582 296832 -74803 54031 23625 -248459
22639 154169 75374 -95004 -77891 -68199 -2380 -31385 191626 95222 -41078 -40494 64535 -84829
22626 -47803 21861 -424727 -125923 123301 120843 -121351 47547 -22349 -190325 -88139 -195500
22615 -195500 -40858 -12409 -68505 -166437 -241706 -69907 153306 -132785 -155551 -82371 -36132
22603 -8305 106128 6801 -65772 -271149 -258183 -156431 218483 192366 105733 318231 -23564
22591 256470 -136339 -177406 -16396 -260021 88223 -189772 238671 48251 -125927 192298
22580 64008 -133157 -22397 -199344 54390 184824 -6841 -408176 296366 -150443 -97028 -272491
22569 -272491 32473 -83112 -3679 -9875 -39409 -60703 190172 -162232 -167327 -204938 -10491 -141474
22557 -141474 -185338 153758 -130472 39430 -60089 -178640 47445 -132720 -156851 25722 -35930
22545 -89754 92404 261695 -296894 -51062 -320540 107366 136424 122822 -60210 294549 13234
22533 211669 -63871 -31941 111860 -300810 -379 -450465 37503 219089 196953 -7274 -71304
22522 -71304 -229174 -77141 -77561 -232093 -313252 -242130 385957 70797 217506 -55810 189372
22510 -113320 -321059 -310171 -35600 56697 8508 -59393 44063 -250637 -203492 -73631 -309134
22499 -309134 -85332 -198685 91778 127592 -70788 -40421 -97120 -71274 -17057 -57386 225621
22487 -107468 -183460 -309732 285030 -246704 -219084 -206779 -150751 -23050 -39568 -70374 67798
22475 -131400 170292 -165643 203178 62679 16435 179367 -325261 -281696 -281231 -233670 -205621
22464 -205621 136557 108973 -92410 -11426 311629 -154411 22552 -392765 -85111 -327192
22454 -327192 22637 239921 -116877 46565 -5252 -271575 -195857 21292 10049 -282153 36093
22442 112695 -246765 -54861 -87265 285153 47104 186925 -3681 -442610 -8132 298851 -142227
22430 -136215 -2123 320291 -275058 -111432 158241 160252 -50521 -280691 -205913 -225650 -28548
22418 -35578 -286786 117273 112030 186562 157292 151352 201917 81868 -254961 -338057 35177
22406 109622 93022 -331430 165647 159458 -87331 -606 -102760 -1338 -5054 -76033 107160 -3917
22393 42272 -181593 120856 -9014 -83867 -54201 -162539 -127250 179388 322898 247822 125467
22382 125467 -172963 12109 -34070 6890 274539 84713 -297590 -192798 -69175 -116632 109097
22370 142615 285023 -270500 -65513 -76823 69373 -174991 76486 -334417 26838 -235906
22359 -72879 -166719 -51081 -214656 -50695 2858 220554 81662 287679 -258195 -424827 145494
22347 36116 369 -143459 -43575 182114 33119 -77052 108101 160822 -143771 117299 5803
22335 225125 -160159 -3814 -13285 173180 337079 427612 -222515 -22617 -125981 -270241 -46851
22323 217816 -194611 23366 -76175 -103313 -363071 -69347 -336625 20083 28742 91671 -59470
22311 -42316 -89298 51649 -79903 -8339 -111802 7727 -57358 80748 138231 -165572 282911
22299 93875 61568 -235763 -7585 -55495 -165203 -334043 709 21090 -131371 64678 -261019
22287 -184502 -17283 -45458 -280797 233702 69932 -127510 243445 119467 -138653 -468016
22277 -468016 101777 93189 3895 -271953 55545 -196214 108458 178863 -84040 254914 -65854
22265 75663 -127042 -14764 -89646 116736 42531 16027 -116695 -207064 108106 15260 -185958
22253 88269 103655 -14720 -180925 -71549 27835 74993 287529 -211246 374618 26498 223708
22242 223708 -299730 -237960 175240 -394538 53448 182608 91291 -136622 47058 -69031
22231 298200 -236179 -69343 -52793 9243 81127 440289 -153456 112755 -16580 -219526 -216403
22220 -216403 42691 149440 -21314 58106 -159848 -99464 -39138 59638 -272997 -99960 141577
22208 1118 -203487 -195857 -278912 -513042 65372 -119131 -207611 -131579 548237 -122575 106824
22196 -46946 -30895 99135 96349 -124603 -130252 71161 -35345 49186 -105750 -237226 126308
22184 -285931 -229904 249414 -223734 -223835 -123373 32559 -91427 -175987 -12770 -52693 -223644
22173 -223644 35139 -215821 -221449 96206 -77542 -63399 -140221 -186172 -368943 -182020 -310688
22162 -310688 340566 148704 -173953 241793 8557 108850 67761 -197248 87229 462592
22152 462592 -65631 -64886 -124428 226005 -40785 -53232 -147893 -9132 163617 -185627 -181502 -251475
22140 -251475 -175472 -175277 18181 48355 -123320 -265806 12495 317763 3399 -245154 -52970
22128 -129857 134801 277310 26325 39862 -54662 -91476 75372 -165579 81265 -89187 50565
22116 -132719 -165177 -161895 48999 86947 -32148 -48886 -42994 7237 12729 18530 -10633 -340178
22104 -340178 101134 107962 -226734 119473 -526 120743 -317794 -209950 92517 134227 -98212
22092 -14775 14338 29172 23045 -171886 -56009 -258824 -167016 -71413 280937 -251450 -45619
22080 -56135 -14073 -49807 -19379 -357604 -7169 -104376 -141543 1760 16767 -175544 19671 57705
22068 57705 -31716 -209539 -394428 -189538 -85932 38639 -314517 131709 -298240 -68858
22057 -99246 101230 -93396 -64258 -60699 161077 46318 43562 164546 113873 49291 47405 -47089
22044 -124856 -90284 141932 36622 43801 -113339 146650 -166680 117259 100648 -41047 -339198
22033 -339198 -195708 -353599 -24998 -185274 -62114 -283141 -330366 55903 307417 122406
22022 -217147 -125401 223670 -299678 -127910 -50923 -126120 -176328 -113462 31391 116194 79512
22011 79512 184332 134364 238686 -82392 -70371 -75221 -70212 -99897 261877 128272 -183800
21999 -232606 93868 -309180 -129659 -251924 -126810 -249190 102337 203385 -80883 8199
21988 18545 159377 -22272 31526 -101173 388766 124783 -424705 -73832 -53620 -203970
21978 -203970 -96282 117651 -131420 30408 -211004 123747 -23777 161892 -298450 58192
21967 244536 -189747 -149148 -142534 -303393 217487 -171701 242093 49026 190421 -219973
21956 -285422 -43455 62369 -175924 -164548 -89373 -394067 -152046 -33534 -85851 -164263 -17849
21944 75296 21314 91635 -105487 202392 -247550 240189 -52341 228792 222659 -107310 -123559
21933 -123559 -37340 -65854 -335578 -272985 -128164 -271548 440630 196184 -212227 183994
21922 -305773 57834 288945 -4252 165582 -80347 -150 -252101 -333307 51420 -114289 -212566
21911 -212566 131447 -212856 -21218 289638 207068 -2705 -90783 -85810 -150389 171043 -69795
21899 -45958 -130055 -165886 -26342 -136903 70493 -119517 -130200 -214555 -95862 -225332 -288838
21888 -288838 -213990 226762 -66201 -338566 323692 244649 -140151 -321816 -211377 -50111
21877 14794 -160234 177531 -82138 -18341 -424136 -23909 31507 6457 -208390 -11208 -205170
21866 -205170 -154958 259495 163350 234355 192048 -21931 185527 -193732 223819 118372
21856 118372 111816 -316427 -202093 61006 85490 -371444 254723 293164 -356541 32566 -208909
21844 -12049 36068 -312029 -263284 -73590 -288671 357833 -94968 49644 90515 -33966 -151074
21833 -151074 212815 56298 169600 190294 -79577 190713 -263085 4804 -187587 -106575 -145542
21822 -145542 135141 173973 125577 -234314 114223 -237993 268660 -235619 11498 -123759
21811 -180964 197844 -148281 -49306 -28506 -330692 -214049 77809 139531 15093 -124323
21800 -45033 -49700 -133162 303879 117585 26009 -30448 -57789 90535 -75371 -290859 113276
21788 -23274 153155 -32100 -39643 38934 -9353 214219 -114359 -205316 -361100 -410628 261047
21776 -175485 349749 333658 61190 37287 -34746 257196 58417 -59140 256700 -61567 -219427
21765 -219427 -52012 29846 -331392 43463 -107501 -27688 -250930 -5473 72160 -109364 371371
21753 156398 -253722 333648 -80496 -10647 -55020 -121870 -41350 3565 274717 -168450 259641
21741 -19310 -52985 -37311 87475 242662 -215759 280392 -280350 58772 -364507 86164 12897
21729 -152147 167524 -69194 -110895 21253 32995 185030 -90754 -148096 -93496 -398106 76351
21717 36076 100074 34687 62446 -137280 63779 -12980 -404318 -52099 3859 -317866 82788
21705 -149196 -259310 -120523 -237 -233948 47398 -151670 116458 257439 39984 -94723 188701
21693 -43803 -34086 -40210 -394634 165789 -59826 -302400 -380270 -312663 100777 130086 -76264
21681 -304638 143044 -182452 -283857 199576 -241699 140515 46747 46884 117357 303153
21671 303153 -570707 -11591 -30306 385136 -300247 126562 -339171 2781 49887 -89057 -21635
21659 347501 -306730 160756 160259 -98047 -154166 -383639 -119036 -269304 207163 7 -367675
21647 15871 -55812 -201493 38964 -183955 -141248 37811 -165138 -159646 129389 120908 -95784
21635 147460 60474 21492 -196300 6938 -108612 131761 -217446 -17785 -169412 49373 -301199
21623 -249581 -100453 271639 -6943 -251081 -139701 40734 28267 88959 -54676 -71580 -137635
21612 -137635 -352271 -150055 -92699 14197 -348408 -52150 -63985 -27873 -45548 -412449 -109377
21600 -165862 101795 -36564 -266244 -32799 -102264 2712 -127149 -246241 -88149 -311225 107459
21588 -207244 -341992 -133654 -276871 337481 -420092 -195055 -406033 117789 -28864 27674
21577 133789 -143775 -51397 -69619 54788 -268486 -398503 -322280 -76791 82854 -402972 -102846
21565 -203213 50259 -9294 -100325 -41704 20574 355959 -36267 -143306 -768 -208362 -298986
21554 -298986 -98492 -312165 155585 198722 -190829 -141996 -188838 15977 -154317 -297449
21544 -297449 -138297 -350378 40683 -158666 -326354 -159317 163154 339796 -51850 -93195
21534 -93195 -165388 113262 27309 406714 177764 -316655 -207231 -58273 -13241 -66655 34432
21522 -216392 -36387 -93710 162030 108978 -150332 -70670 185828 30802 -128136 104045
21511 705 28478 -27842 -258114 9972 -112274 250615 196881 -193908 -82072 6144 -6366 -62281
21499 -62281 -172810 40840 -30749 -455001 -50381 119967 -244390 110113 59938 -257381
21488 -133666 -79032 7015 -127294 -253961 -46780 -103413 -177572 -87088 -564154 -128339 41773
21476 80119 61225 206826 -9923 82329 -51699 -56052 -155854 -183993 -31036 14578 -79389 39404
21463 28608 79033 112802 248272 -22258 -8133 313164 15357 -10261 -39580 125598 -245429
21451 -70347 63631 63578 82815 18828 -463 -1250 39829 -26538 24917 204854 255089 -32376 333354
21437 369338 272046 253199 503995 117566 153273 35919 -33505 -166943 119864 -256894
21426 -217499 -234734 -99067 15392 259027 -12701 159140 -120223 -25148 -67512 86308 -309456
21414 185259 -70075 80187 -450229 -3050 -270285 -310857 212455 -29075 -296868 209659 21392
21402 4088 123175 29296 -337324 138551 280991 -230856 -85162 -286265 -193810 -20250 -94806
21391 -94806 -213584 -228714 110119 -68867 -239529 -235537 -167669 -454145 -10890 -59361 271326
21379 67839 -27568 -377992 -2769 294963 208746 -596 134373 54037 -102688 -229550 149816
21367 -201044 -140823 -122315 105858 -256761 -41070 192929 304306 -44323 -62443 -175317
21357 -175317 -117482 72000 84236 192771 -34872 -7015 8573 317343 25217 171294 -143677
21345 -177729 13575 -171533 70542 28554 -110064 -14629 -168434 -165408 -180335 -59555 217275
21333 -93526 194052 52530 153674 -84829 -157132 337085 -164018 159799 -54597 -98809 -441161
21322 -441161 109146 293079 -373606 150231 -228263 -372659 -152203 -67616 -20439 -111914
21312 -111914 55926 -157513 -225944 -391825 -69085 -279065 91753 -107723 223339 93709
21301 -477623 -99599 -276210 175670 71437 -130155 -163680 -317909 -115728 35832 -273597
21290 -48088 138842 56794 -11522 -86171 495480 218445 -251687 -196635 -161443 -23450 1040
21278 -261387 -152983 -158732 250437 -204229 190227 -67736 20372 75872 -59110 -93472 -156721
21267 -156721 -244582 -29117 -253511 -183613 113363 58588 -173502 -346729 163880 -85709
21256 -99588 -329934 -310311 1858 230049 -11379 179551 11528 -14040 -443774 -94263 -49396
21245 -49396 -160663 -215197 33132 23327 37752 -26476 -380639 -395932 168855 -147747 124307
21233 -123053 -67466 -553617 54069 79506 -79085 -97019 150203 -118098 24774 107467 -127721
21221 -60589 35386 320893 154122 61690 -130884 -153893 173133 55235 114640 -61398 -217527
21210 -217527 100675 61132 110093 136190 102572 -6492 -102987 -59336 -86003 421727 -354652
21198 -306942 60579 78653 -267050 -36936 29148 -89360 -187829 12357 36814 -158950 49455
21186 57391 -92902 381641 -139019 -242583 -39355 -57426 -330446 -24119 29122 -259102 151325
21174 166309 -180509 54603 -7073 27566 -160128 -72284 -293207 -151646 -454813 190385
21163 -49728 -42185 -208802 -4665 335489 -258992 161240 186088 133927 37014 -203541 13870
21151 214504 70517 -12558 -20006 -113029 -48294 -362149 -10641 -91846 -74802 -163219 -86971
21140 -86971 -6437 -336167 -189759 133595 -321664 -40455 455659 -89952 -16272 168994 28143
21128 121719 30541 110453 -786 178374 -42150 158654 -65373 190683 -198835 -31643 -477505
21117 -477505 -365227 -218199 140432 -124794 -388438 364130 -136267 231735 -52213 102739
21106 -253566 -42593 -173166 182813 221337 -129149 -7730 179113 168489 -228291 -247727 113482
21094 -157438 -317429 -150793 -198359 -53579 -277935 -79354 -173323 -103518 -57889 119771 -45718
21082 -229737 -257802 242008 85659 88841 63502 36910 -193458 -86919 -149451 -195148 153954
21070 237636 145194 -149641 189550 -117540 -160470 240195 116806 42211 140780 -16450
21059 213159 159964 -89812 -429970 -285939 87353 -173312 -322770 -64914 -10741 -221865
21049 -221865 -102033 45999 70628 -232098 -50537 -4760 -92734 115636 -115275 -269444 -60498
21037 -27528 -27826 38699 15024 -215540 256 -302959 127253 -134854 -102112 108960 200856
21026 200856 -31753 148899 -131010 4779 -16085 -234430 -459181 335204 72655 195584
21016 195584 -225588 95467 30084 -229792 -92658 -158285 -93729 -153751 -294463 -11145 257326
21004 -377940 -356867 -50830 62255 248219 33537 80819 312066 34169 137169 232062 -130443
20992 -6184 -105358 46496 74086 308119 74345 -103584 -95327 -186228 -223265 -202712 105738
20980 -29517 -52530 -235655 -123840 -42421 169946 207132 -111293 -72554 58423 -224724 123749
20968 -120568 70358 -498081 56373 -212120 43 -12108 151602 -66964 -356560 -77204 -103625
20957 -103625 -354168 73667 -97744 -402184 -50277 -113297 -89951 126018 -341178 74068 141256
20946 141256 197355 299647 84310 -59481 137624 80269 21865 54829 148452 17925 91585
20935 91585 -65756 -139808 135925 -27570 -461259 -71167 212289 -170481 65976 19334 -115049
20923 -42568 -163381 -103763 25134 163879 -245830 -146552 114648 8382 -276252 155232 -99703
20911 35846 -255407 78439 218121 -117418 -205636 -256537 49801 279051 -185548 -65630 -307381
20900 -307381 -150641 28527 -32373 -222687 -87148 194602 -342588 -123228 32440 187298
20890 187298 -336093 -13831 -24809 279404 86416 -180 -169479 -334351 93740 25531 -28060
20878 90733 134477 282079 -121473 37345 -194875 239923 115495 346684 -649570 -71006
20867 -194026 -138267 -121916 -409064 -301696 -278839 69376 -231236 -301185 -13764 -121132 107011
20855 -114949 -96681 -174773 52162 -87367 256940 -169619 -130903 63513 -77989 121488 -168835
20843 -28964 159986 -94923 -82378 26044 -23000 -177955 -241755 -16637 -48428 217595 27386
20831 -195972 -133915 -211541 -96358 -353376 -87647 -145981 12033 -25079 9521 186166 -69758
20819 134872 -390971 -128892 192071 50162 -192694 3590 -32349 97928 77796 109813 -473410
20807 10565 77786 -304630 -148446 199245 -290543 -43468 19443 -17705 -278026 -348323 -15614
20795 -189581 106158 -138842 -62619 56905 -370784 260000 -45059 145212 59988 -360319
20784 -42978 -29562 -51579 63858 -156626 53534 53877 -141932 343331 11565 -655 201871 -177809
20771 253106 210817 -109274 8768 -35452 -39924 -261358 -41054 -113645 -125623 99073 -87700
20759 293007 33695 -306824 -300340 30307 8228 -152071 -205167 76277 -17964 -28138 -48446
20748 -48446 335616 -149553 -37120 245323 -49360 -85861 -200337 8852 62726 -108880 26367
20736 -93494 72133 -284729 189362 -174356 -426287 180159 -66205 -4586 303098 9619 214419
20725 214419 -90492 -120047 -308930 -153081 -350202 45060 -253827 -10886 -225126 109562
20714 -271683 75315 187003 -22420 -370157 -83083 34749 -109403 4774 8812 361742 63266
20702 -258563 168720 34347 6331 84122 -113859 111237 -236510 -64464 101475 -184891
20691 -93594 -141409 -233947 -53799 65245 -198549 -34979 -33154 -267377 -46804 280560 430091
20680 430091 136142 237341 -256677 44410 -19494 -88088 -35728 -235008 -460383 191789
20669 72252 -98408 -266174 -378650 255077 157603 -155012 -75253 -77215 50399 -69051 -220953
20658 -220953 -390966 -169424 174421 170858 -323889 -390847 174056 -245365 331860 416015
20648 416015 -36531 -42509 161100 174519 11685 -125360 15400 -118206 209720 -204544 119140
20636 59442 -142689 86906 -126650 -73756 -200023 -48240 43817 -110237 411628 31504 -86285
20624 -78739 328725 -75205 118383 12641 -165168 1091 -158816 51565 -201954 74371 -281254
20612 -22676 121018 -96163 60891 -177503 -90325 -64894 -90101 -99915 -40070 -9749 -395596
20601 -395596 -315126 -130685 149562 72996 80807 -75991 165738 -222524 -163589 -41940 170641
20589 136565 -46875 -76975 91822 -161071 32428 39225 185331 -56295 -50860 113468 -83546
20577 -85896 37787 37886 -265707 -137883 81682 84615 87167 21905 -189682 182722 -145669 -156604
20565 -156604 -46456 -105552 96432 -361564 203798 -150313 -93645 -418916 -238352 8240 -188479
20553 218514 -252966 127806 -112564 150119 -140734 -377101 87440 -124914 -301916 180547
20542 -42947 38677 -205155 17423 1670 133561 279611 -312604 -58380 -337094 116486 42574
20530 -192246 -426794 -29827 -270695 -36189 -131461 -213511 -48758 -4095 55367 43458 -13834
20518 -21431 191399 -222420 -20366 -101259 9541 74235 49444 125849 -200140 -69605 -333868
20507 -333868 38812 1924 10850 103987 -79603 -366370 -206040 80803 -86018 1752 -219148
20495 -452047 96610 -139046 212032 -268037 -60261 -289482 -224907 65315 -98085 -151214 376775
20483 -34902 247404 -121861 296695 55003 -66548 -19192 -149414 -546545 -245031 29020
20472 6613 -38104 -31066 -25728 -294580 -183549 2204 -59853 -94437 129504 -127749 335582
20460 -167036 -213394 -195623 -33936 336541 -16777 -169782 212772 134046 56783 282534 69813
20448 -26412 -230428 -191463 -110141 248243 -320555 -67056 8607 105490 -3331 59027 -108931
20436 -12224 -106708 60037 -156849 -280076 159912 -308786 -82743 -182604 -70021 -179182 49553
20424 -147096 -321388 122988 312393 -21801 -298553 -43175 36685 100316 -262607 -271319 -102791
20412 -94047 -158105 -20133 -168387 -141778 -84074 -353797 201805 86932 -150323 -130572 -434550
20401 -434550 174082 -113931 37660 -142930 -384146 -109953 169101 -87891 -49546 39752
20390 131355 -8858 212544 -178504 -128561 69081 -33412 -185504 -410304 -187974 205179
20379 -36322 -270037 -111325 -77678 -74540 -135264 54584 -162377 -257989 257837 -191598 -354319
20368 -354319 150422 -6416 -64982 -141541 139545 -51269 -50112 123804 -67983 62186 -187465
20356 5054 -180661 -282843 115442 -3770 119457 257014 33806 -244632 -52086 -249687 -63985
20344 6604 -1130 -120923 15239 75376 79250 -4192 -17387 76900 29069 197005 -348045 -22089
20331 -185588 -238314 -89334 -355292 28908 183206 -261781 -40361 -95215 295376 129736
20320 237286 -376813 -106912 304704 83832 -175447 -59182 -262143 -37395 408957 -89791
20309 64253 -178091 -150818 -173139 -317413 10017 -17759 -317992 184187 23026 -245279 104056
20297 -483971 37111 97679 86897 -105350 -76008 98591 -149259 -241752 -10442 -327821 -26575
20285 273794 144431 -37721 -263071 -265295 -104030 -139190 72062 -109715 -237646 -106728
20274 23461 23468 -370146 -257352 -46523 125040 -65603 248078 -291033 38476 51700 65300
20263 65300 -9233 -212381 -10027 75951 110638 83787 -4315 42622 -205722 -2650 269207 323152
20251 323152 117493 -323356 -609375 16831 -129850 -104579 107042 -214141 -63488 -117546
20241 -117546 -119559 176842 77424 -211815 -115772 -159866 -38655 173787 -289645 112078 305149
20230 305149 -97735 -329820 -174479 -96260 -46204 -268317 -226606 -104517 -60582 -248629
20220 -248629 148328 35081 -81253 70747 121212 -166209 -197389 -144910 221014 257435 -256578
20208 338577 -182076 -169639 -238147 -318418 -24364 115004 -126606 -116437 143883 84637 -7343
20196 67527 198601 67900 -355038 -263549 93246 -116390 19523 19530 -39356 -202048 -25735 11156
20183 164116 195392 127704 331483 52939 -78729 -77974 87540 -241255 -382263 -343736 -6725
20171 -182225 -27178 62357 -117685 -26794 64420 482000 153808 21058 236014 -116239
20160 -135847 -254771 68208 62675 -127331 -16551 -40079 -221316 145101 37397 72236 -50095
20148 -24121 154263 264927 -142326 -4152 50689 -27354 67275 135515 -280481 146080 169055
20137 169055 42263 -230607 -89713 -219297 -266270 -3576 -61061 -126641 -62089 99124 -29416
20125 -185119 127690 128269 25605 47425 -97818 279580 -151406 -235701 54858 -81236 166038
20113 -369271 24180 -216027 -98528 -104978 -192679 -329128 11259 83411 12765 -37399 119040
20101 -2563 181575 127803 -44472 -263725 -19290 -181619 26400 -137605 -86358 125352 -131953
20089 238115 -7656 117275 12626 -169448 -43575 -106238 -90676 -148752 -75614 -466096 -227115
20077 -29737 43621 -7928 -65075 148281 -117875 -290406 -53189 267845 -101752 98929 -106500
20065 -439844 -95439 -126415 19673 -106878 116333 -266678 -3662 -17771 45851 10726 -33115
20053 -85999 -499428 171769 -338069 54125 91652 -144136 118045 43892 139164 -173376
20042 15732 -592892 -22024 -206793 -47130 -229555 -121001 -259185 -157601 -135701 -334025
20032 -334025 225199 -53370 63228 150106 -305692 -280310 48206 6263 -279317 141198 217805
20021 217805 -318200 -30822 -253834 -10856 -351841 -137086 -112139 -450766 134366 138654
20011 138654 -302418 -137960 17017 252202 -20496 72719 -71916 136760 -97219 -55401 -9811
19999 -95324 126288 -54901 -245949 -38713 8587 -209519 166946 -182446 110501 14938 -117121
19987 -245024 -58281 56687 26010 274996 -118678 115642 40466 334473 -336970 -75925
19976 38604 -68677 143676 18827 -167703 149250 -152795 -136997 110603 152141 -349018
19965 -389439 51418 -3241 123679 108351 196336 -9242 -119165 -63527 -149069 -15626 91157
19953 61067 -375976 -402950 -65793 78597 115049 -320983 -271223 -184267 9320 37609 92091
19942 92091 -412955 -232612 -205282 -309877 -554867 -104840 -46771 114941 -135157 -76188
19932 -76188 70492 91148 -189458 370916 42633 42737 -121657 -225322 -242538 -35424 -118052
19921 -118052 62697 165175 63620 156372 121151 208326 -89332 -67665 -13511 -69634 -204406
19910 -204406 297586 -242612 58932 72474 -7423 113247 364865 150972 106018 -189850
19899 -80710 -37452 -114143 -22647 -40764 245184 -233367 -214704 -16347 19656 -112329 204891
19887 -224286 21811 -481463 -167845 -89537 161204 109068 -243207 -61378 -259774 319181
19876 -88467 -8019 -281759 -92397 -506923 -180210 -223264 -147173 -20547 287869 -31104 93159
19864 296578 -127846 -12810 -129367 -168853 173027 94229 -142729 -15831 -400536 311270
19853 95544 -337948 -73429 -276490 10035 -259185 146878 -106885 -271201 -294066 36229
19842 -12273 -230969 -17074 -389740 -110098 -111133 158576 -122710 -41221 -156305 -237034 305272
19830 -242658 -77840 -169503 -11177 -84683 -97630 -222002 209174 -41100 335020 6041 100351
19819 100351 -75656 -28702 112189 -183584 -187371 34996 -272482 -186753 -73753 -4716 -120040
19808 -120040 -118524 -158248 -44620 -144613 24201 111308 -95007 184700 -477802 -96556 -34034
19796 -43261 235099 -53247 5882 -85356 -128559 -195192 -180649 37249 -120562 83092 -217250
19784 371680 335404 -40564 -126455 -149493 134123 -3975 92824 69115 -131731 -24813 -206997
19773 -206997 -71969 -65049 159234 -82783 84434 219946 -326895 -32231 -203139 -98206 -469351
19762 -469351 -249138 -210965 -265958 10022 288530 -64460 78481 69440 -88870 -1675 128852
19750 -230615 -214343 47833 -91479 -167467 64220 52420 -12604 -279058 -128626 -84570 111799
19738 -273837 -65006 93552 145258 -205987 67686 23705 -382443 -363005 -127029 -36818 -354515
19727 -354515 405649 -303411 -157527 103697 73255 -31318 -96476 -97943 -202688 -1512 -113996
19716 -113996 -56174 -62613 -51189 -4579 -80438 -72690 105897 -20365 -683759 179938 42542
19704 -198013 118549 -133452 -476921 215471 26513 219985 -116611 -49478 232077 116498
19694 116498 -2041 -10245 282194 -30177 -236199 -30378 -50938 13708 -70457 166764 -133543
19682 -421861 8584 23472 130866 270785 -3953 -141833 -125727 127255 -4267 138391 8426
19670 166180 -39820 394461 62765 -111378 223758 -160715 335341 -127259 -298455 -336534
19660 -336534 -127158 107682 -4713 -176333 -31947 -259157 -75274 -40419 -178987 -74832 162600
19648 120113 98118 84807 40481 117291 -341956 -171356 6803 155704 -48672 -69312 -178842
19637 -178842 -49382 102488 111975 5480 245989 -38948 -204558 143024 -15113 -282445 5382
19625 -67564 -411818 12535 -395167 -6397 -274459 18911 -27676 -183427 -15081 -232600 5201
19613 173301 -97545 -42520 -23250 -41641 -151109 -145423 -143748 -23491 -159515 -91859 7904 -19043
19600 -237615 126836 -29303 -62543 -162216 -271117 -14802 -53901 80865 -249510 54561 100877
19589 100877 -392248 -4746 4005 -48968 237873 -237046 311711 -197322 122362 -424644
19578 -7893 75058 18688 106118 -97722 -468314 -332627 -56420 -259690 -156709 -172946 254177
19566 -118820 -254355 -104595 -153140 -119762 11286 -81662 346112 17703 -366796 -128266
19555 -412642 -204484 54358 -62215 -413116 10859 -288222 -178666 34378 -124017 134030
19544 275266 -183085 -159934 11049 126928 -326425 -164173 -119278 -5505 -170262 269067
19533 -198802 -67205 -189372 -131016 -253549 113793 -211660 131131 143276 37467 246518
19523 246518 -211403 162015 -179754 -146426 281212 -150655 -102624 -10848 -84928 36212
19512 253118 -2088 -9270 -13853 -274849 -194279 -156573 -206420 -43272 -9845 -104637 91085 262056
19500 262056 -148554 -231533 -202370 -143896 -27650 -186609 -265470 -108910 -4654 -100897 -709
19488 411609 -248493 -243436 -372478 -223056 191284 -338683 32832 -92222 -23708 -70081 -103017
19477 -103017 -53030 248183 -305331 -77831 -37174 -245986 -69157 -137632 56702 -219389 -405635
19466 -405635 102874 32531 -13093 332488 2046 -108888 -48428 -165374 24100 338762 -109761
19454 -120640 -135230 4691 -53469 124917 55296 102118 -47150 -156301 -158585 -106606 -333481
19443 -333481 -27544 -68793 -127504 19662 -32462 -151347 302718 129986 -269672 -178883 -183417
19432 -183417 -64253 128005 -292231 16638 110515 -100066 -170855 13742 -19538 207605 -133082
19420 49181 232552 -190567 -329716 -84825 42171 -59679 -162536 15067 32086 296255 -185763
19408 -483850 -197910 -85258 -25705 77015 231277 187368 -35929 -190546 169013 -118827
19397 6532 -54153 111010 -132316 141661 -203088 -47075 10832 -61909 58084 167808 180165
19386 180165 -56460 340895 82055 -82194 297731 -9544 223698 -118441 148918 -27240 -335700
19375 -335700 258341 -228651 11002 -134506 243133 -473799 70421 -219044 -145161 18039
19364 38867 -379054 -232682 -121935 -147520 -250192 -143313 -51595 140885 -112805 137573
19353 -86904 -67797 76712 114622 13013 -409959 -180493 -160940 -12921 -118934 -385254 -13706
19341 -1789 110641 121708 160178 -11191 -115708 19929 -217131 11527 -145695 -35487 -97699
19330 -97699 -155596 -152796 -382287 -103002 213029 78682 -235413 -18615 215322 -146163 27394
19318 166319 4410 444330 -202528 -181342 -214848 101880 -164184 17950 22000 -15649 185011
19306 -86814 12952 -292805 -34347 102981 236392 220507 61908 93684 198582 89292 -184885
19294 13295 -112966 -247227 297181 -122965 341 -213377 201244 -397303 -46644 -197079
19284 -197079 -131398 21542 39361 155351 240006 153290 121277 14793 74395 155488 -176055
19272 -126799 -72582 -326061 93644 173033 -28897 -167399 98849 -12420 -100207 54972 -115728
19260 -197778 -226692 59407 53986 80319 -142624 -158526 -108389 -124294 -98247 -12946 -186486
19249 -186486 -7701 -322216 -233910 -41481 -360392 -269387 300037 -20880 -283605 -104572 30600
19237 -101884 -61765 143574 27623 -79152 -45238 -141035 -289323 -155284 -432289 -195695
19226 -413795 -161342 -40852 52041 57125 98350 -78869 -294262 195189 -375585 -192266 -10869
19214 129709 8561 153679 -133108 151959 71241 -149718 123017 20670 199715 73323
19203 -205520 -252498 -132755 232374 -474901 -91826 -157130 -144801 -427683 -86077 -197168
19193 -197168 -337281 144796 -280958 -75012 -144487 -252180 59165 -208848 -162226 -73881
19182 -171784 -153661 -110161 -150063 145610 -50576 -98748 -44315 -105031 55796 188 123069
19171 123069 78799 -264888 -262395 -368201 -164366 93651 47926 -336905 145101 -15451 -252786
19160 -252786 188159 -10618 -188900 66054 -119894 -292865 -578217 -292738 -37304 -557833
19150 -557833 -53978 47566 39645 -23552 204844 -6103 20263 18038 -180427 -240650 238393
19138 -54105 -93431 -208110 49713 -167687 -51783 -170514 114093 4829 -169901 -23455 -80399
19127 -80399 -92588 -33143 228227 -158875 -119127 105111 -91359 -251741 48709 69974 -7951
19115 -270443 -239048 -269031 -269961 -163020 -192347 -32689 -138526 4180 -225941 381999 -93040
19103 67362 -9830 -83344 -215334 -164418 97274 294383 309522 -214622 -38029 -58604 -334799
19092 -334799 226923 -16085 -163353 17598 45617 85686 -176675 102323 118033 -48891 271333
19080 234188 -20988 -45885 -243971 -9228 -133548 -273844 -104289 166808 -28267 533926
19069 127393 -21911 -197087 36969 -65446 105518 -140846 253043 -77745 100820 260204
19059 260204 139562 -13112 -423473 5204 41085 -144574 -113426 163038 -96227 -92258 -213691
19048 -213691 -178120 -331738 -182341 -264458 114724 -13163 -62744 -85874 -154935 -48634 -53075
19037 -53075 263242 102663 -42903 82646 -85219 -183153 -154469 238503 1858 101405 385501
19026 385501 78142 6323 -225756 -84476 41726 64042 -112438 5536 139296 52483 16564
19014 -43516 51146 -21403 146485 -407127 -141760 -118271 8589 308813 -59462 -259779 -116352
19002 -17551 -112153 -135770 -88258 7540 332757 189813 236784 -84760 128151 164015 -80470
18990 416378 45627 7054 34982 -218473 -214747 226562 85623 186201 -195674 -40149 16371
18978 61001 -127573 -369491 89477 -117916 90837 -95213 -197423 107297 293617 -200980
18967 -162175 33164 16926 -65344 -67291 -2867 12574 -76985 -161203 -359109 249018 153682
18956 153682 180138 361927 123250 229139 -133462 -102991 -234838 -250984 115572 -556204
18945 -160481 -114329 154844 53642 113416 -95881 -248285 -85310 225712 296963 233767 -90819
18933 -57759 108904 -478 -72856 27311 367227 182134 18270 321349 -40112 72630 325464
18922 325464 167157 -62068 -277763 243192 -74896 136245 3692 -131462 82304 -273943
18911 -137467 -278516 15863 -280580 -142361 -222015 32333 -97284 -209872 -270834 -295946 -141432
18899 -145462 78997 -22917 -21602 -13221 -18508 54956 -159959 -208248 94825 149238 -6964 -500660
18887 -500660 -80656 -170393 -80735 134698 195441 -487517 -131116 113175 65550 -52220 -431788
18876 -431788 -154639 136785 -198153 -266251 -11013 -71340 -37949 -8283 22767 -178640 224813
18864 -170985 -233369 45630 -194316 -323297 -50234 -494305 152893 76066 -83179 2498 -227320
18852 -262171 51533 88485 -10051 204680 232750 217623 -319417 129557 -157459 182349
18841 -167791 -263152 57316 -132751 127452 -28683 -137221 70477 -116471 -352485 -12768
18830 -325725 -196397 34737 -146186 -87039 -358968 -63555 71714 -78054 -116247 -27151 -225756
18819 -225756 -240134 191712 -217281 32444 149015 -117250 378501 84703 388608 225968
18809 225968 210494 175177 -69186 -48570 -26921 178489 88934 244989 64027 -145340 -220155
18798 -220155 50593 -317081 11716 -102595 -213730 68467 238854 -166721 16680 -98669
18787 -207746 105865 154871 460054 183140 112455 130438 -133413 -80786 222271 -306521
18776 20188 161690 -102796 -219795 -289497 -137116 89940 274177 -137129 33487 96770
18766 96770 233966 -335944 3062 -251449 -524445 138518 166995 33330 -264210 26211 -65110
18754 57424 48968 250083 -19652 -156980 161382 -204995 -200030 -226946 -228961 -307543 370350
18742 251057 -298038 -67755 91376 64585 22795 64445 -295644 -69809 26506 -154954 -273085
18731 -273085 -46986 -202791 -40809 -126753 -391966 -268413 -110520 66675 129287 -61828 -260648
18720 -260648 -194847 -142846 -356147 48929 -123101 134093 -241301 197555 -33305 -297478
18710 -297478 -517168 -16204 247728 -17339 42545 -411162 25213 -314382 261166 -157975
18699 -65675 -141386 -60311 -129974 128366 -6444 -39613 10653 -214652 56589 -100476 -46879
18687 -315001 -6582 -182858 -177018 15718 207015 50345 85012 -284314 -73242 -94657 228361
18675 69975 227285 129187 -207060 129211 38560 -103120 -15323 -76578 -228369 -436557
18665 -436557 -218231 196519 -385877 23 74668 -162010 103338 -119018 -83299 53436 -169921
18653 133667 165092 27699 -168066 -151607 -246817 -166219 43766 104952 -47431 102926 131288
18642 131288 -2328 -63272 201717 -105165 122595 -70201 -3966 -57751 154497 135827 -316423
18630 -25611 -125042 205582 -3208 14591 137447 -120505 -140816 65735 -186330 121296 -55209
18618 -359475 -86876 -17628 -403281 -120700 -574018 167086 -147659 -37406 113686 136330
18608 136330 -101729 -183364 169932 -250337 -38681 -145483 38628 76916 -13226 -125039
18598 -125039 84493 97373 -351117 117377 35126 -107074 -75115 -125872 73427 72446 -127670
18586 -160758 44310 -318579 230558 151770 17348 -213167 121273 -3334 -15300 -138753 -580900
18575 -580900 -215470 -209447 28548 -116178 -155184 129145 -65119 342632 -42690 -8435 39240
18563 -15201 96018 -54857 253579 77911 103941 -121682 -380734 -136655 121307 231443
18553 231443 62196 154336 -171873 -4411 96237 -85652 -369135 -29874 -224613 48821 324594
18542 324594 -347986 -144546 156686 -476384 -77977 321699 7422 347039 104236 235260
18532 235260 -140298 -509423 26098 -44187 -192061 177984 101727 -171009 -255116 -76096
18521 -295364 -143184 -64328 31482 -14740 144746 -40427 199187 415927 -137251 -206902
18511 -206902 -66259 50571 -98947 147211 68219 -77251 -88380 -170381 23570 22131 -193968
18499 29926 -115437 -64739 -257067 -248621 127843 -120692 105686 -77183 8393 -245348 153029
18487 -102887 -50520 -116152 -257809 -114008 -341133 -2768 46084 -98111 -444095 137741 -328354
18475 -409814 -232276 -190243 -150341 276120 11093 44051 -56432 -100784 -57754 -209646 172323
18463 4963 37853 -298999 128783 133648 -171284 -53894 -155626 -81279 -292295 -289691 -49 140918
18450 -175198 254718 128918 -70071 69241 -50904 119826 -193258 -258101 -101229 -36322
18439 -93178 -6404 155980 -241117 -177889 54964 -99784 180290 -58481 -166887 -88979 -366961
18428 -366961 89629 -590157 97363 168361 -167128 15381 -208320 -53417 65687 -123687 -181997
18417 -181997 190675 172707 -174772 123128 -241515 26017 -74835 109289 24907 -83361
18406 216162 134339 173699 4514 -63785 197232 -16086 -162895 316483 101025 -93210 -193162
18395 -193162 -207901 26743 -136501 7992 -90507 -54255 161916 -278425 22202 -317872 -62907
18383 -50200 -79564 -360600 -310375 -89512 -42274 89278 -209823 -219429 269860 351320 111521
18371 497120 -139871 220683 -96142 46438 50567 -83694 -78 48560 119763 59783 2837 -161092
18358 42748 -106927 -388976 251346 -42400 136882 -132096 -80013 -307917 178281 152654
18348 152654 129452 -36096 -105121 23651 4172 -347295 -521980 -389556 -58253 -101741 100018
18336 168106 -193857 300284 124728 8857 95302 -240468 -37483 -29281 -17139 130477 131118
18325 131118 -32571 -36144 12957 -295112 -186197 -168997 -139638 -128493 57095 70498 -309813
18313 -213961 -46496 112749 -278851 194884 232038 121937 18495 30444 -299102 -51687
18302 -372291 27705 -436162 -111129 -92820 147237 148898 -186410 -408609 -415704 -249532 -219772
18291 -219772 256372 -62346 -50857 -188226 212745 -20476 178431 -522564 -352366 -197414
18281 -197414 88706 -215733 -43624 -61884 -155021 -16801 -60004 135311 -67405 18118 -359546
18269 -283972 -173781 104352 -35455 -4466 -350453 -23227 150611 -242442 -264469 -97261 -141597
18258 -141597 -347205 250094 -246735 -63605 -194711 -81854 -126907 -32669 56408 33183 -21012
18246 236068 -27161 -14923 121932 102277 -70348 24268 -58209 95763 19056 -52716 -166737
18235 -166737 -169346 191818 258134 -9703 -66255 214720 -181413 -64038 153717 268617 -174707
18223 48821 -250688 -133953 -48137 -15785 39530 16993 360536 270270 -90894 93330 -327749
18211 33970 50180 -208009 -267319 -264813 -330311 -238067 -174036 42752 -233385 -674 -183110 -320809
18199 -320809 93386 61101 -247615 26846 -189410 -220006 -187524 -105470 40803 -99358 18382
18187 -3038 -119843 -95230 110756 -207835 -391724 -148971 219664 -203553 108490 -261368
18176 76571 -23816 -38063 -135991 -27133 143928 -501415 -30585 46135 312710 56673 -331111
18164 -150194 211517 -196525 160958 447336 -413919 -125959 91496 324052 -155146 40238
18153 -76635 -209338 186591 -50535 -10182 336052 61344 -48786 217569 -158017 242076
18142 154455 66711 -82378 203490 -97813 60391 -87080 172550 74109 -153347 135329 -173258
18130 -100167 24001 -91378 115443 -100906 183695 -74028 253099 33808 37722 -105208 224460
18118 48181 -64238 173537 -186522 -2892 -63244 27904 135276 18977 -217754 56974 136791
18107 136791 -225640 -253303 -335822 167459 -250345 13418 -47688 61832 -281549 220995
18096 -169233 -210508 334806 154163 -303156 261441 -238908 9020 -6737 77351 156127 107504
18085 107504 -291846 -256016 -111831 -33760 62668 60875 5013 -39799 213514 246563 -4063
18073 -120492 -155541 -265136 152121 -119596 192605 29153 -179823 186373 41458 -36730
18062 -20665 -129976 6224 168031 -184493 103099 -72562 26133 -18443 -77624 186639 -132191
18050 92244 140136 -97652 -44326 -98485 -402757 -142022 -171089 -26336 59552 -119122 138012
18038 64266 62525 -43191 20813 -9103 -258438 87731 -230155 -463960 66926 -54574 -12728
18026 108253 -155360 -184459 -218213 66734 -289121 294461 197598 269082 -83549 -119851 30657
18014 -115031 230980 -446254 -105946 13956 -24647 98477 -108067 -303697 -178598 -58156
18003 -9600 -181354 -40553 -465390 8750 102582 169582 3230 117151 -109015 -127054 -80650
17992 -80650 -272364 3884 -47399 -294969 -234725 269374 -152718 -51683 59176 -410387 7285
17980 93243 -138894 74052 105585 -127762 -187303 403794 -265728 -45725 227225 222976 42511
17968 241259 4036 -123712 214935 -136916 -108104 -41374 6692 -102593 257148 -63044 -103028
17957 -103028 -118071 20960 17691 -213190 190990 238651 -154849 -231965 195518 62677 69116
17946 69116 -39523 -54662 123222 -140068 -17667 -118721 -178750 132346 -41393 -77495 -170119
17935 -170119 12221 -208348 10002 -75072 8556 57768 46213 78001 74016 4707 52117 -36913
17922 75459 93606 -18887 144072 -85674 -26748 -101946 -70213 51104 156597 -427809 37667
17910 -209726 206749 161200 25624 52259 -195179 -126917 -153287 -129737 -119627 -283473 9331
17898 -129842 -415198 241511 -381393 -81017 13475 246212 -164415 -49749 -160384 24552
17887 20665 174347 -334350 277342 -32117 332115 -34295 10397 -21912 70204 234248 -240818
17875 -59458 -12845 -293950 9042 -10356 -234451 -115974 -125985 151433 5128 41195 79110
17864 79110 -86118 48710 111010 -117157 -255130 -84327 -156272 137325 -207019 -180034 -219911
17853 -219911 -40001 -169901 -3170 -132770 285618 298987 -57281 -3748 -64159 147932 74910
17842 74910 132125 -13154 54532 -85944 44042 -104096 -294593 163179 133974 -115196 -379346
17831 -379346 126091 23218 -81345 -41893 -17963 180643 -248862 92854 99157 509495 133590
17819 -101102 -40772 168972 -230915 200558 89311 496016 114793 230620 131390 63952
17808 172383 -137345 -70440 -140433 182850 -440498 -67073 -196471 -72745 -209584 -1029 6019
17796 -108857 50744 -203298 -33068 148482 132443 44817 -151448 118539 -25225 -119381 86537
17784 -269477 -1767 18084 63639 -37717 249112 -56813 -203391 -90538 -295323 -28469 54884
17772 62045 239707 -97815 -70171 -113448 -104578 259137 -13424 -34951 -268217 28992 100581
17761 100581 110419 -211017 -101847 37446 -246178 105940 315802 169338 -89407 155522
17750 91505 57463 -115487 -214948 -210627 108669 -186725 -134994 24092 226197 3505 -135158
17738 138959 114523 15164 175267 278905 101664 186132 -119163 9952 -173893 53353 74410
17727 74410 -160558 240015 -83426 -60413 34444 39719 171262 214296 187396 86220 -39731
17715 16304 27408 206692 82128 86836 -229353 -271248 -138106 235883 -55033 315491 -23639
17703 83203 -207181 34361 -2811 -181408 179569 102830 15218 201618 125269 61673 -114670
17691 -52601 -199951 206511 -153707 -97805 -100611 39936 -255940 129123 -205198 221333
17680 -186221 50426 82411 177189 -69970 248677 93232 -123319 -8971 -231632 -195450 133309
17668 4885 -51665 -350552 -70858 -154249 -104029 -135255 -132977 -251762 -3279 147813 195348 50875
17655 160904 -114649 -55576 197714 28436 201323 -11436 78888 119997 -133423 161998
17644 104700 264606 -27926 109171 102550 245502 85223 75024 -310439 -89674 80659 129111
17633 129111 114834 152480 78368 -359552 210120 -56103 -215668 -135394 -44909 -91050 -44215
17621 -6994 394072 -193162 68953 -329703 16236 -173216 -454841 185783 -84654 255763
17610 -179302 -109466 60133 99758 360215 -227395 103507 28630 211418 113810 101893 174493
17599 174493 171518 -11353 -198338 -115149 -73112 390274 140775 -115092 148863 -39479 204890
17587 144302 182591 -107516 -294069 -263339 80220 -274169 190702 243847 -268207 71334
17576 -99929 -172646 -19997 -139842 132622 -118925 95019 -97285 131191 145943 31859 88803
17565 88803 -4479 142458 167223 -66135 -24448 -25457 105669 -176008 138347 -176425 185987
17553 107124 -309522 -100670 -50404 23271 30314 237781 -152684 -35539 -60168 -210555 -27249
17541 244585 166280 64958 67031 93433 -91034 -144868 485601 1915 -151952 47981 316541
17530 316541 31379 50661 97776 -107178 138554 20498 -154951 158827 1631 24667 35787
17519 35787 164409 333749 -120477 -136846 87782 108608 -86224 80548 260870 -144363 114819
17507 92027 82957 200829 167213 327506 -114108 123752 90164 2435 -131197 -143665 74531
17495 -181841 -217252 309439 226794 333100 184098 155304 182947 481052 -125440 -29305
17484 103601 106955 -48188 100484 168466 -56821 292381 271316 274060 170006 145579 -93852
17472 319537 -35732 45187 -109896 4108 -20063 -130767 -68924 -148975 -46902 172601 76157
17460 592115 41256 168150 -20546 62547 218674 396723 316521 328993 37753 232980 367396
17449 367396 -28175 295809 105241 255465 487635 136778 116019 259880 185180 248177
17439 248177 224537 196497 -39900 -54924 367091 -172239 279624 198581 96092 -135313 -112405
17428 -112405 419020 246289 44407 585356 294592 165522 401739 173841 -31913 196791
17417 581092 350223 536457 520451 298853 184234 314373 259802 -8155 88399 -74137 245029
17405 139068 155619 143647 378566 120329 1675 153006 21107 -36698 243408 40770 177673
17394 177673 86345 357441 259368 206731 372453 -217252 -149850 362579 410282 321022 -54606
17382 -71347 -28589 51436 80128 274532 218032 445249 -98205 58617 189073 159948 369448
17371 369448 229924 189253 -100108 33253 65992 123280 241205 126040 114624 227602
17361 227602 -99412 39611 104073 23557 280421 310398 -254498 158804 134720 422971 233261
17350 233261 205183 -5205 169525 60350 -115232 25356 214531 -80991 307588 -7615 -55790
17339 -55790 313907 -42096 72509 366456 356536 -93551 189346 109939 86610 116316 273267
17328 273267 9629 83089 66102 128981 219668 291688 292079 -3233 185590 36998 -104111 -121770
17316 -121770 370506 106224 369754 -47380 161757 142865 445619 145574 168972 410989
17306 410989 177193 102470 99264 130507 69651 176980 288946 60705 218320 297093 143185
17294 55425 121814 286925 149561 283550 461629 125631 144150 8845 99315 -113739 288837
17282 226868 291923 102505 93966 19105 130419 240416 462426 15333 266666 96461 74453
17271 74453 382327 204366 125395 18775 82465 282237 118916 246677 277310 413425
17261 413425 23743 127945 253966 281699 147200 117502 178793 168002 148726 519996 205787
17249 268287 209266 124239 78179 -135568 316657 142093 173557 39638 105549 275991 2911
17237 -39650 204528 25195 354211 153446 293286 449841 170008 -2787 396762 165358
17226 323103 397538 35205 77619 -5061 364169 144024 -53768 300133 49916 -131763 141809
17214 82752 179537 413247 150543 242576 232290 54582 205532 438543 52796 126220 375729
17203 375729 429997 168355 381352 535266 370600 303973 513065 221839 234845 225807
17193 225807 304496 63671 299303 375974 51096 230044 563282 63529 407483 216721
17183 216721 282490 157588 313950 378367 242708 21887 55106 396839 405019 527659 330216
17172 330216 -133746 482616 184038 272636 197668 681264 149707 313516 188463 574831
17162 574831 154818 216012 103281 475029 373640 297238 160403 153594 33658 127522 196881
17151 196881 426739 333381 271052 290072 -56065 549695 168525 212581 220916 26358 341827
17140 341827 285422 460631 327816 222581 881716 378063 345743 -26587 207549 382083
17130 382083 608038 281513 125736 393238 424382 -8561 319640 497705 290221 571687
17120 571687 46743 324301 492892 93144 698590 182550 415325 272549 535527 241805
17109 476183 620466 241373 450131 -16991 337630 364321 297300 552916 297613 224810
17099 224810 485449 436291 708700 340668 348801 460907 468762 475567 723790 226775 411216
17088 411216 128180 158805 257674 402230 270405 510944 631806 323684 261986 765053
17078 765053 315889 242291 342811 306858 496094 378826 409908 124685 347144 682446
17068 682446 666429 335660 581154 402834 414953 571133 278744 481287 231157 388868
17058 388868 488240 463672 351724 653364 582300 338795 420954 696432 334319 856236
17048 856236 771787 430657 686638 444735 535374 702697 283886 502229 359499 266930
17038 266930 607874 992541 579723 395190 489768 343168 720853 596755 312842 661785
17028 661785 816344 740021 566801 514390 561952 664879 494911 927725 554679 497436
17018 497436 896872 716301 571041 537656 400674 1040982 902728 804611 555032 893068
17008 893068 574000 566834 716150 560164 829045 814590 354025 732907 515866 756453
16998 756453 782491 624988 669775 836352 615513 789658 499674 558986 1205667 1033590
16988 1033590 802328 414493 955124 554578 1109792 723491 889533 623614 633295 682588
16978 682588 617892 882522 1064062 589559 585940 1109181 1029658 1052953 1078328 1125888 1004366
16967 1004366 1241222 1095776 1302271 1285555 876800 903835 1007818 735538 1363379 1013017
16957 1013017 1160816 1020696 1095520 765342 945974 1393538 1245845 1454118 924965 1490613
16947 1490613 1307324 1263643 1244365 1247017 1104949 1006199 1153978 1255376 1130840 1414828
16937 1414828 1381902 1387692 868150 1399752 1520522 1439762 1275335 1450669 1305080 1252282
16927 1252282 1163935 1110986 1458234 1456475 1386659 1454273 1328288 1506615 1274189 1267407 1524519
16916 1524519 1625849 1595040 1538289 1466896 1995436 1744299 1709446 1687632 1559597 1637729
16906 1637729 1603452 1793517 1614865 1400178 2066922 1791708 1657530 2000161 1902969 1674509
16896 1674509 2155967 1800809 2089758 1749726 1623506 2007058 2047919 2100248 2360799 2539197
16886 2539197 2189958 2273218 2127578 2180272 2212993 1761257 2109879 2172150 2355684 2334577
16876 2334577 2025413 2341721 2490350 2311520 2320043 2694520 2814287 2725269 2704442 2481057
16866 2481057 2637864 2712826 2708008 2758047 2762838 3021377 2728633 3308519 2880295 2976675 2969697
16855 2969697 3084451 3134192 3193415 3068521 3079694 2849246 3178627 3265367 3359190 3485586
16845 3485586 3481972 3671778 3469428 3810622 3999264 3862791 4065494 4208675 4421236 4400208
16835 4400208 4261238 4073480 4434888 4469018 4272892 4853926 4815681 5020698 4939548 4537142
16825 4537142 5040190 4877811 5178986 5164269 5764691 5734779 5531027 5701317 5757189 6123758
16815 6123758 5769247 6094262 6630527 6352708 6798803 6560940 6890834 6922758 7361656 7392389
16805 7392389 7377237 7384476 7888415 7388234 7880995 8400728 8394016 9174175 8721640 9016112
16795 9016112 9526931 9297876 9720057 10287376 10525347 10316030 10629934 10972175 11497436
16786 11497436 11781964 12360843 12283019 12597332 12864997 13710567 13925845 14266435 14976480
16777 14976480 14806148 15650840 16171320 16631102 16862395 18024222 18007865 19043856 19834482
16768 19834482 20354541 21153751 21707524 23099834 23599383 24528094 25010018 26246033 27187063
16759 27187063 28667497 29356085 31046390 32584043 33750034 35397280 37011608 38778697
16751 38778697 40487012 42185756 44445890 46877811 49000093 51691051 54686647 57411594
16743 57411594 60834708 64147287 67635579 71592417 75850523 79766374 85022780 89964344
16735 89964344 95321096 100902294 107065933 113745456 120556275 127438748 134777442 142058327
16727 142058327 150142865 157557928 165052651 172658997 179050127 185703206 190998013 195578630
16719 195578630 199000819 201299473 202084015 201287751 199782097 196490018 192313535 187254858
16711 187254858 180900864 174082739 166476614 159242322 151399537 143909145 135855505 128367187
16703 128367187 120928070 114153639 107589835 101287073 95055980 89596129 84297099 79697681
16695 79697681 74977215 70995683 67201335 62587380 59661807 56460813 53792061 50766358
16687 50766358 48281881 45509465 43509240 41562625 39529160 37935050 35623150 34093919
16679 34093919 32796796 31002626 29874710 28734118 27302243 26204871 25210024 24391159
16671 24391159 23372026 22755220 21537816 20822171 19769845 19355689 18669947 17941827 17143723
16662 17143723 16414612 16060443 15524435 15157207 14870536 13947416 13327754 13316557 12769103
16653 12769103 12617650 12167453 11594796 11454321 11096251 10461343 10304548 10368375 9661869
16644 9661869 9890401 9639032 9314281 8970023 8713633 8730540 8202150 8379307 8047964 7517489
16634 7517489 7560842 7094612 6914072 6794455 6601125 6755747 6475101 6329368 5924134 6021473
16624 6021473 5708489 5722127 5935604 5465836 5317339 5418734 5214578 4904373 4885308 4884504
16614 4884504 4826506 4579664 4721559 4366373 4135656 4328537 4375236 4093296 4359216 3817291
16604 3817291 3821665 4023687 3776408 3819508 4019616 3423470 3721942 3146186 3348192 3399490
16594 3399490 3788272 3213909 3489411 3194362 3284273 3073323 2933562 3058356 2926086 2704778
16584 2704778 2663298 2666212 2657072 2678238 2777651 2558649 2571088 2563268 2627441 2776563 2415113
16573 2415113 2504988 2295511 2232999 2626239 2551954 2117032 2351593 1886493 1987964 1952352
16563 1952352 1980683 2121285 2335816 2065402 1728239 2156595 1946731 1761624 1879450 1900191
16553 1900191 1933926 2055581 1684128 1658094 1629115 1701963 1642404 1653267 1756683 1854210 1625627
16542 1625627 1336114 1217942 1556546 1466396 1426988 1347549 1652216 895364 1265728 1464028
16532 1464028 1283129 1310922 1220081 1188875 1320353 1189592 1471923 1221110 1202235 1169214
16522 1169214 1275570 1079579 1118375 1373744 1332729 1184239 952691 1167571 1142849 1120826
16512 1120826 1055444 884307 1177860 966761 913380 669777 1050135 910457 1083203 916298
16502 916298 879220 966691 926010 1254779 743009 954970 1000712 672745 831984 856830
16492 856830 1254731 651393 741112 916492 981399 1001672 882882 754797 698260 568913
16482 568913 431707 636653 538180 1000799 397299 722021 1132450 967373 620107 805654
16472 805654 774078 314944 766183 384462 884602 565642 561972 525928 729756 608124
16462 608124 694809 665541 941137 962236 416717 762438 340662 438342 779322 717168
16452 717168 913731 390363 717803 266265 506038 685065 1009515 728698 488152 661689
16442 661689 498417 896330 611853 222761 543560 415610 583619 408412 559509 313428
16432 313428 643839 378244 584735 526547 722342 648637 245823 386050 723138 625168
16422 625168 787765 681241 281190 545542 246320 484554 606951 150616 431893 689945
16412 689945 345250 562425 533055 443354 591703 442352 299282 348639 304395 462838
16402 462838 377876 572095 520792 -85475 162581 223774 424188 182912 413379 128264
16391 422326 362245 480324 192372 320045 363925 184685 509529 553626 -67631 174087
16380 314304 378577 232648 443789 439997 371000 680007 129413 134166 66480 352431 156515
16368 145049 264868 310448 296232 -48479 412435 364115 161938 310972 203348 -77154
16357 431733 318251 -67321 -12146 69123 315360 323964 71792 -122140 446929 53733 359096
16346 359096 -239395 494859 231732 436796 44728 24799 452925 344129 20318 381261
16336 381261 258406 194477 388897 102871 318682 199510 326433 68456 94260 299069
16326 299069 343622 97846 254898 385453 68043 52781 266858 46663 380662 437447 365201
16315 365201 511794 -82127 -54721 218655 111393 54568 83780 215245 91264 97350 381462
16304 381462 168822 123751 84923 488078 190467 250549 118590 -108274 -27176 107244
16293 123947 481173 199632 119401 -11686 128543 -212896 182496 137038 -165815 227563
16282 280506 113354 329369 173609 213290 19533 166549 166996 176986 -10299 84641 178722
16271 178722 33788 -120349 278072 283451 521221 13253 360532 -223201 300227 35539
16260 -42427 14408 437271 62353 334754 -19956 238012 -214412 123726 386683 -180594
16249 532147 171029 -91156 146526 423438 556936 352758 -177754 179531 95438 218261
16239 218261 140661 274347 -173809 74020 -54174 231286 -191573 -189904 41410 257218 163838
16228 163838 537709 143960 185776 260915 294629 254506 360678 241501 269915 156682
16218 156682 -173087 222515 20953 -90879 114495 -103774 106612 -200740 83262 304185
16208 304185 195491 168954 365831 340157 42730 -97134 13464 -1425 -200895 -26186 -142385
16197 -142385 -1624 69782 46810 -18710 105375 104184 81411 85859 -201821 -204244 -89598 53077
16184 332444 246461 42060 364755 75788 188052 -42941 -43 61987 320599 44478 210248
16173 210248 381442 176519 271666 -96108 12979 118447 41056 -148045 55560 -29250 -138762
16162 -138762 396074 84289 60537 -139685 176134 38725 247186 -43218 168662 34556
16151 83924 191034 -82982 -60704 -185880 140187 186086 121261 -119967 10199 -37490 201559
16139 -13987 21529 252295 159327 137123 -87244 -156800 -220266 299159 -18743 115235 -293251
16127 -86297 -212785 -63812 -36387 27134 112904 -111700 -248742 -395169 -97065 145857 170212
16116 170212 -63911 -317969 -225121 63195 55046 -57157 -279656 -204558 8324 -87344 -26113
16104 -94809 193229 -334589 375393 92207 41862 -282 -78430 -96685 -198998 150179 132618
16093 132618 -39309 -10513 141613 306996 -156008 -126347 -51440 -103775 -259386 -302900 430236
16081 180523 60340 -98020 323052 61966 100289 56013 -206152 -97251 -41664 -11587 14602
16069 407624 -137492 -146810 89680 3080 -331074 492656 60019 22975 -68474 194058 -269955
16057 239534 226280 93317 -19803 -247974 190163 198580 -315418 -247920 96782 -138247 336909
16045 131721 118825 -70358 -52215 147047 89204 3811 -216059 81896 -170093 117297 141879
16034 141879 6778 -141120 149288 190124 143924 12018 -96631 -34695 129409 71315 126923
16023 126923 -228825 -188282 -111046 -156599 51854 50716 -452217 115687 190849 -87254 98566
16011 -95820 -190665 -123777 -153961 -182502 265870 -14097 -93366 282723 -69438 -203952 123089
15999 -25401 -196681 -222455 -175381 -135576 -229028 -239691 -233204 -68740 -95862 18400 99863 368275
15987 368275 -56131 118234 -80473 -276733 19427 23325 236759 439588 407295 187476 126095
15976 126095 -137116 -378194 318227 -269992 -137780 -45398 214313 -57284 63812 -137435
15965 51024 254281 175185 168176 23440 110199 -39545 417178 16006 -296458 301573 -203626
15953 -6528 3660 289904 -225105 54801 -22091 -19767 -160283 124414 -20033 72423 -74926
15941 -304437 -376834 35607 -276042 56729 -252341 -26269 -231841 -157422 -285580 450845
15930 -36732 -147511 119786 -215485 -41338 172306 16819 -142835 -273232 7553 72885 -74993
15918 -37587 26867 426724 -573337 -109059 183266 194315 -280903 -82998 -404368 176834
15907 198376 78560 -92299 240912 -56634 8514 -359397 -229514 -105837 308023 -179611
15896 -150618 -309806 190651 120866 -112848 114881 -95970 16944 -220152 -180289 -87973
15885 327915 -92508 8450 -255959 150118 28811 32289 40872 -553996 142579 336326 81330
15873 253779 83902 125063 -36019 -16124 103 -66193 -33434 -241553 -51179 -225626 159047
15861 -259509 -164504 -279063 160727 -18580 54125 -128388 -247735 -468982 38894 -228208
15850 339779 -175870 -385962 -360084 7016 46920 27336 178941 139664 -107902 -86732 134536
15838 -107759 114909 260386 -145180 -265642 -228851 96417 -15545 -346 -21651 -231905 195262
15826 -257587 -109261 -306675 94905 151593 245384 -8474 -26239 121847 -1386 82918 -185920
15814 -252608 -233811 97777 18975 -5195 -207230 -12323 -242057 8489 -216857 -211906 -109818
15803 -109818 247698 244119 157823 -143225 -171967 114983 120801 -203689 -83519 83224 73962
15792 73962 7950 43575 -131437 -11342 174267 10519 -210909 -19041 -133305 -137026 26962
15780 -115979 -171742 -300143 -144735 -142689 -31969 99741 -355667 -54407 -255994 -204920 -7823
15768 -180661 -78920 -73631 130290 204429 -74786 -71892 60736 17824 164174 -65123 -2046 168766
15755 100761 -160156 -109865 156260 -172736 521546 -188165 -132957 157411 310594 -191068
15744 -193088 141514 -36610 85871 95926 -92336 171692 2731 -163592 19608 162414 149457
15733 149457 -13357 33284 -120634 -198921 -99391 386874 -198995 71054 -196819 -137102 96803
15721 49623 -203535 -194926 242520 15503 -363654 191061 -171058 -305901 83642 236036
15711 236036 -78409 -348849 -200698 -180907 -128913 156490 -80935 -91540 -177496 61867 -303631
15699 61561 -196972 41154 -207963 -53973 -162662 177135 -3620 -27922 -417100 559518 200407
15687 82991 256656 346188 264958 237110 -65970 -280987 -94799 80038 -21640 247335 -99373
15675 -238062 -231346 -136758 175514 -83190 -65695 68290 239913 -86723 15965 -82040 95289
15663 153269 -102696 90366 -156420 207151 -390885 -225398 141311 -16439 -148228 -55693
15652 -13044 139840 221927 -124610 -48419 166284 -28666 264096 165182 -210914 -176135 295896
15640 142139 85451 -66292 91017 -242264 77839 175536 -4041 -234204 88149 -331882 -216875
15629 -216875 280949 -155846 -57483 -38295 145131 192378 74090 116474 73350 273866 148107
15618 148107 39277 -108429 310185 -9623 87193 -234502 -181064 -150061 -227743 -60061 564
15606 -202586 275750 -84958 100894 142699 265377 -211986 -108739 64914 -110179 -69798
15596 -69798 121028 -252076 172072 -55437 -183093 -10283 13942 28370 -100135 202218
15585 38794 -9924 13075 124899 -197127 -205453 49097 -208687 -166053 -387355 231540 -454643
15573 -81766 -59561 -37055 -286196 24934 96043 -292553 78325 211683 161427 109144 14451
15561 93352 55686 77485 -107791 251322 348136 25981 -170014 -115692 -31104 -82664 82260
15549 129120 -83064 -278879 92096 -44680 -244828 -249790 -87553 -239833 40120 431176 256539
15538 256539 204325 195939 29271 56404 73520 3998 -166412 10140 -119904 -62627 106330
15526 89620 -65630 29640 59464 -429437 149713 -23178 -8887 31403 -80487 208395 147268
15515 147268 22620 -289217 -93210 10978 29975 329311 206171 -360226 -42194 -129750 -315998
15504 -315998 -79642 -27127 -263535 465216 93462 -328451 -163851 114859 -301253 107696
15493 150707 246334 -107563 56716 -149673 10666 127631 -346929 125614 -42386 66666
15482 -198996 73778 84652 181269 31341 -108485 -384626 89091 61572 9128 117836 182403
15471 182403 -65788 -38778 114911 -30779 90219 -87542 32053 -24939 293398 -19764 -206632
15460 -206632 -188896 -65181 -139305 -172370 143359 222291 138193 -372176 -340894 -56847 -85328
15449 -85328 102250 -168127 -255337 42630 205364 -266067 135940 -140719 285889 -259564
15438 129537 224451 -320438 -73578 -171831 127244 99538 58577 -263614 -138284 -160390 22220
15426 -235731 202059 103796 60481 -385332 88574 62986 163627 -74984 162588 7579 -280788
15414 127968 -46701 -69861 -161224 -121939 -220897 54171 173551 42075 -51542 242437 -134488
15402 -78951 -294117 -220476 201907 166651 -956 25253 -96954 -269783 -492737 38222 -44403
15390 -295708 291054 -60343 -242192 63348 113564 362831 16800 -1980 69300 24773 178065
15379 178065 -65996 -126185 162875 113331 124750 -133496 -235493 -37434 76301 -237205 -86234
15367 91533 132075 210206 -199872 -213934 -401661 -181509 -59139 -23328 -95907 554675 -371484
15355 -150252 72923 -127010 -238055 -108889 37717 -218279 -69984 -203230 213796 -85172
15344 -208251 312536 311330 -300390 125194 -46564 280717 228346 232998 93694 -367214 288231
15332 291434 -98277 87034 130018 -1689 79858 211030 247402 174628 -127564 225631 26602
15320 120298 -51798 -139578 207696 298191 105014 12642 9077 -111112 230910 -178694 -119757
15309 -119757 -16141 473526 228339 -68983 -166009 50071 72656 -277034 -117933 -132953 -286079
15298 -286079 338888 227140 -78057 -26609 314669 -33974 -96951 -17972 305323 131460
15287 147795 148008 -207376 156483 116566 29599 85781 -84265 123417 237872 157287 340717
15276 340717 3038 -24645 129606 140650 37178 200658 221240 119458 195767 -184019 492776
15264 -95511 126578 61940 344508 113000 -37261 335297 -12769 -75707 506520 219426
15253 306997 -34331 199555 325507 186689 523467 937198 1940119 1291438 1645560 1289699
15243 1289699 278386 114747 118914 127022 105938 325338 189069 572927 -2073 184960 500393
15232 500393 -430 20741 -38612 148052 -11035 -79891 -68261 79861 280794 199625 254093
15221 254093 304509 -112442 -81358 -9546 -207088 2086 167863 -27695 -38808 538961 123575
15209 267139 -84873 -111450 14205 -3410 216506 234636 346596 86807 -182265 39382 -123214
15197 355426 333486 326362 256055 95683 -36033 -109554 -105804 54211 268688 54749 128966 418829
15185 418829 56890 313508 26046 -2531 -7288 305069 -38285 374543 -200027 -149450 214630
15173 -286452 -111661 -118767 499306 -14481 -378601 -179593 -38902 389250 220623 251478
15163 251478 109752 212211 188571 1732 211375 169460 -321327 275438 55913 142094 113414
15152 113414 138427 113512 -205172 -138649 459644 -3910 -115902 -108320 282943 -196196 219917
15140 -34722 15922 -94869 63605 352691 95881 136618 157533 -4236 418985 88697 433906
15129 433906 9431 226334 404429 287109 225529 132449 -101411 168558 -199120 56427
15118 209657 204410 183946 194237 166067 -43746 -55554 225468 3460 -47616 -103841 -50142 -30638
15106 -30638 -3870 137046 -28275 -38039 84922 258802 167750 135534 51724 382342 172665
15094 219354 370248 118589 264185 -180167 10548 -197277 201877 -40216 -17998 27709
15083 145464 -245036 92522 146493 288134 -202625 309656 277865 179242 96574 456419
15073 456419 149445 261293 338054 398339 -62584 337562 347196 90693 101076 -222300 264991
15061 236186 205338 -56931 -620 640833 409813 343046 63134 -31732 18430 -23644 208329
15049 400323 189549 -180266 85250 24182 226278 -234442 347525 272680 -19796 121217
15038 286923 431158 420040 -39938 -15947 191852 128176 414376 174171 -62855 168872
15027 191984 67816 141511 334683 184645 316314 248383 189176 192625 364177 80740 184238
15016 184238 1869 -2387 252613 -200743 273957 349968 221153 369900 121866 343275
15006 343275 219231 315777 294646 247571 61106 338455 188876 387028 397261 67007 287852
14995 287852 211757 254818 147344 44110 190028 301213 51941 425477 204200 159108
14985 159108 195189 325582 151219 1460 510775 112826 189699 390414 226826 -7468 50240
14973 136037 28593 362583 76282 200894 675355 111618 398019 258225 512878 157268
14962 477690 242601 406073 160375 291003 -154164 185966 634121 159203 49427 -97254
14951 72229 223250 211010 107056 -72688 436732 385096 192003 265962 274521 97997 265331
14940 265331 423469 75578 -122796 141771 439285 526619 239066 36768 190971 459839
14930 459839 81132 181624 278645 371011 139541 -45845 232180 53815 346315 281253 342920
14919 342920 191763 332437 581310 246188 217867 297061 217735 448131 142923 183868
14909 183868 551361 420701 286560 529380 678643 427312 181341 312048 262063 431916
14899 431916 285610 189032 673533 554387 629063 320095 390540 208474 431598 265307
14889 265307 205677 282745 262139 614538 479819 99463 8184 161024 231215 99232 467296
14878 467296 535792 460462 16499 518790 322510 216897 721068 310669 275861 451791
14868 451791 266899 700167 671518 311302 409751 516930 348569 409432 497001 703356
14858 703356 216181 93384 240988 23905 342548 576275 343195 420929 349445 219093
14848 219093 379313 744475 532023 428795 569492 641485 538303 626717 250767 430351
14838 430351 492658 212647 231551 399630 420804 366941 285462 629622 738252 827235 680847
14827 680847 616407 352487 337939 407058 833694 642658 362267 295931 326374 435897
14817 435897 569656 726181 566799 828057 457190 518770 679087 343044 343117 249778 959117
14806 959117 663097 403286 165499 384550 807730 313006 506671 690920 645648 545128
14796 545128 481061 587430 427490 629387 732144 539466 778848 517666 553276 490049
14786 490049 456053 653242 624992 833737 450465 529312 534260 510552 405322 785981 608244
14775 608244 778268 564262 438129 748416 682882 515026 844295 467467 311445 579712
14765 579712 515691 465553 775170 478623 416301 813410 891096 253881 568038 747529
14755 747529 659098 367251 700381 792888 653058 698981 672797 625656 811880 707907
14745 707907 719079 663731 541163 777264 569613 582099 1052493 620437 650660 889054
14735 889054 805455 783129 884904 791226 968021 946514 1219952 843075 957438 545068
14725 545068 846082 928290 793223 800474 738861 670219 774505 997339 1154589 806432
14715 806432 879629 693087 1111342 1018697 537127 455426 804190 701412 1057417 716188
14705 716188 896121 1094840 1028930 1084343 900807 685151 652640 1276990 1115176 896634
14695 896634 950935 878420 1022106 744640 1234495 697275 1133733 761769 888171 674829
14685 674829 867856 1196041 1037066 956503 1275614 894203 997524 915707 1030887 1023253
14675 1023253 871472 774423 1141292 909004 1249337 1009225 1305363 863696 1048341 1226387
14665 1226387 1001370 740644 1094880 1387650 1068428 998315 1315335 982155 1381872 494115
14654 1069475 964963 921431 1011025 1258650 1334163 1153173 1161856 1080333 1151976 1365324 936847
14643 936847 1142899 1480603 1447725 1440812 1018318 1288660 1367829 1202259 1163469 1322685
14633 1322685 1812361 1301629 1379104 1311712 1309888 1529596 1595775 1584626 1507873 1589944 1352591
14622 1352591 1408890 1693714 1452651 1418921 1478913 1660601 1978480 1581858 1363737 1709976
14612 1709976 1688826 1848853 1500788 1359482 1474121 1724407 1589153 1843597 1619960 1370669
14602 1370669 1674589 1914658 1645886 1906740 1434939 1742763 1824859 2082451 1698731 1921912
14592 1921912 1650300 1766227 1820511 2224262 1734544 1942142 1790624 2014151 1969033 2050706
14582 2050706 1864831 1957622 1972980 1943192 2326366 2255131 2103886 2011243 2459741 2068654
14572 2068654 2403371 2120767 1891965 2654068 2574023 2465649 2540713 2563636 2859112 2792798
14562 2792798 2571015 2769895 2554514 2774635 2801685 3290972 3356995 3353960 3854306 4437527
14552 4437527 3968300 4954608 5948983 8206714 12455528 19206790 34636972 51376726
14544 51376726 25827988 11482966 5332228 3458553 2763774 2136380 2276705 2243037
14536 2243037 2352341 1893462 2076591 2132853 2288090 2364345 2577964 2104690 2223986 2274770
14526 2274770 2357060 2746500 2682828 2565826 2837071 2423551 2710560 2256782 2869482 2660376
14516 2660376 2880805 2839140 2829665 2675926 3068858 2975854 2781546 3186627 3054691 3042558
14506 3042558 2799897 3373978 3058944 3302186 3228571 3305956 3602648 3507672 3335045 3613980
14496 3613980 3476643 3682284 3372326 3324310 3738105 3621645 3554632 3776661 3776347 3603386
14486 3603386 3702356 3970467 3728020 4002538 3677201 4044577 4361114 4108046 4107021 3974569
14476 3974569 4094784 4271981 4735309 4349636 4543764 4661284 4318618 4634043 4722432 4563050
14466 4563050 4550231 4584850 4605666 4947340 4908981 4962783 5239735 5166543 5292539 4990674
14456 4990674 5305511 5000413 5437947 5544810 5595268 5306817 5577445 5456635 5773742 5834744
14446 5834744 5966999 5805334 6037948 6175340 6064868 6089057 6310684 6489039 6683276 6606950
14436 6606950 7081942 6725539 6782880 6773504 7109752 7138089 7211487 7063001 7517453 7571893
14426 7571893 7159602 7643911 7741571 7999642 8071846 8214831 8292500 8077444 8611057 8644881
14416 8644881 8490897 8958573 8844298 8799379 9134055 9521747 9295076 9659632 9918791 10298559
14406 10298559 10127913 10423908 10413088 10411099 10848452 10901576 11243829 11119296 11250277 11692984
14396 11692984 11785911 12068797 11931544 12346897 12490868 12523716 13028360 13063484 13337451 13499494
14386 13499494 14008595 14077848 14196536 14617900 14824402 15211400 15197754 15735540 16010705 16446084
14376 16446084 16745068 17027836 17121790 17563687 17828017 18326905 18364211 18963789 19109328 19706493
14366 19706493 19953157 20507641 20963080 21514134 21956985 22541241 22686109 23369199 23628514
14357 23628514 24451626 25206528 25641827 26193823 26700944 27259371 28197294 28261334 29294244
14348 29294244 30103663 31011026 31411794 32473603 32814339 33985413 34968644 35819890 36674680
14339 36674680 37543905 38671059 40344568 41022736 42202802 43571426 44759127 46393187
14331 46393187 47585041 49091669 50897438 52245112 53594071 55623837 57317952 59480262
14323 59480262 61121674 63543835 65581623 67523675 70290520 72978864 75406394 78376615
14315 78376615 81321539 84370159 87674904 91524404 95269396 98700611 103295086 107351660
14307 107351660 111970145 116792664 121893836 127668595 133091092 139196443 145912331 152439622
14299 152439622 159977803 167768377 175637787 184196174 193249843 202923564 213027559 223594503
14291 223594503 235301523 246960189 259359650 272491273 285999920 299884409 314354813
14284 314354813 329614383 344415617 359658022 374966149 390033163 404591286 418792358
14277 418792358 431785876 443884751 454718177 463733917 469459679 471031262 471614225 473769820
14269 473769820 474352887 471029695 468119930 462803295 454737203 444682238 433190407 419973571
14261 419973571 405419205 390442957 374848862 359226774 343408195 327915448 312586527
14254 312586527 298628354 284570754 270947156 257523400 244894510 233109513 221774960
14247 221774960 210873276 200817952 190904335 182432842 173923654 165567672 157928145 150774896
14239 150774896 143856780 137849967 132077842 126738799 120768598 115651896 111031920 106443922
14231 106443922 102523690 98778168 94420654 90997623 87288152 83883468 81072476 78306170
14223 78306170 75439091 72584303 70548641 68053277 65546226 63302891 61384582 59264614
14215 59264614 57353177 55506223 54313921 52450141 50675270 49515434 47551257 46497588
14207 46497588 45403469 44353393 42926108 41557455 40347760 39447213 38290206 38021584
14199 38021584 36582895 35748448 34436541 33786590 32521708 32219342 31334731 30509771 29573749
14190 29573749 29124155 28355396 27561198 26801467 26463741 25902799 25143102 24491523 24094663
14181 24094663 23747119 22800729 22590340 21872231 21493813 21757904 20643507 20394243 20093202
14172 20093202 19592874 19402312 18984507 18469069 17993009 17310785 17622472 16884736 16495719
14163 16495719 16382700 16361738 15770085 15636729 15073888 15035408 14835131 14512719 14387207 14267881
14153 14267881 13573273 13516752 13404692 12860698 12912069 12643842 12849353 12333617 12179199 11635748
14143 11635748 11678101 11709237 11623990 11318976 11170483 10897301 10885525 10808630 10359470 10146802
14133 10146802 10265021 10242547 9757630 9504341 9660834 9845638 8844579 9276820 8869648
14124 8869648 9075853 8564376 8596483 8670267 8412745 8402209 8074333 8300118 8115967 7866610
14114 7866610 7967195 7588046 7841249 7924961 7087556 7565476 7340397 7368223 7067989 7077167
14104 7077167 7148831 6880310 6654828 6489037 6594427 6584866 6465816 6327071 6365882 5993584
14094 5993584 6011916 5860326 6052819 5976983 6063967 5678318 5448154 5607572 5407061 5506005
14084 5506005 5416532 5536924 5389642 5274372 5287397 4883562 5160518 5274860 5214524 4729879
14074 4729879 4903287 4755251 4675894 4428079 4398312 4483761 4624145 4605760 4558645 4588784
14064 4588784 4721388 4399357 4535610 4227869 4468629 4426880 4215499 4019555 4036298 4345693
14054 4345693 4313626 3948465 4196775 3903713 4369198 3945366 3825467 3761125 3664971 3472887
14044 3472887 3328841 3744653 3727533 3430729 3315790 3596343 3478286 3282279 2982298 3737142
14034 3737142 3601508 3146059 3486965 3113569 3291678 3194916 3257550 3062343 3206691 2842992
14024 2842992 3090604 2887875 2855650 2536251 2961307 2742949 2696921 2499865 3055887 3004446
14014 3004446 2996003 2483687 2538743 2629683 2398379 2605689 2482739 2551783 2541046 2281887
14004 2281887 1970046 2353186 2330256 2431902 2351683 2170748 2374303 2356574 2299671 2517456
13994 2517456 2086901 2041826 2662320 2465497 2888280 4139003 7252858 13153808 26980513
13985 26980513 51192763 30636896 15192209 9260447 6400958 5245620 4637871 4264580
13977 4264580 3601492 3768699 3312544 3175341 3210992 2962597 2900445 2655345 2317417 2674656
13967 2674656 2515688 2418484 2706742 2351368 2376029 2631795 2660958 2700275 2310442 2112254
13957 2112254 2102826 2119052 2263347 2047469 2207649 2117147 1984462 2186563 1798299 1885772
13947 1885772 2214452 2188474 1927613 1837239 1572502 1748331 1805465 1560683 1553390 1855734
13937 1855734 1803019 2044451 1603415 1813938 1940525 1758657 1752063 1775456 2163935 1548693
13927 1548693 1461184 1686270 1702325 1592576 1724064 1520390 1530468 1417350 1454474 1956445
13917 1956445 1683431 1456367 1619776 1592251 1759653 1565944 1566805 1445620 1443857 1531294 1547225
13906 1547225 1407186 1386462 1723849 1810459 1525426 1546300 1323930 1607286 1285140 1240010
13896 1240010 1344021 1294199 1679102 1574762 1779925 1226379 1870531 1540967 1530621 1222757
13886 1222757 1505073 1267542 1514114 1665349 1618179 1287668 1157185 1173701 1489044 1245408
13876 1245408 1600009 1168268 1301941 1028539 1130652 1460932 1107586 1094881 1301598 1393267
13866 1393267 1291866 1364119 1194564 1573561 1287563 1421237 1267716 1202463 1468006 1401676
13856 1401676 797867 1195331 1153913 1449337 1042264 1410983 908169 1290439 954073 1336334
13846 1336334 1112574 1317710 975720 1091989 1455306 1263839 1402721 1022764 1123410
13837 1123410 1227422 864500 1290853 815716 1164031 944664 1156255 693432 841125
13828 841125 760612 886668 1118261 1043310 1157368 1167462 717011 788285 1062365 888094
13818 888094 1054773 963516 1012220 1055915 1285494 751232 928181 997031 915237 632081
13808 632081 1121498 1060850 933865 840309 557243 877092 981194 835211 808963 733402
13798 733402 991994 747945 794925 560853 833736 867291 703412 804900 856180 806028
13788 806028 656910 637369 554771 631081 791096 886471 870868 1062707 887168 601609
13778 601609 729698 719326 800495 690623 756507 716624 854608 1006806 603384 797281
13768 797281 752893 816725 883083 566460 728927 972792 192825 897604 602175 899665
13758 899665 627903 781119 654275 676853 690271 839140 805524 829808 402472 674829
13748 674829 1109129 775665 638149 641278 433945 371389 507919 600258 390043 928802
13738 928802 908154 551854 799984 640309 479057 593053 324120 874399 748076 853780
13728 853780 492956 533745 549051 474504 782217 615464 510974 554516 229698 606479
13718 606479 849221 408032 891382 629756 932687 349172 540952 516561 445112 503374
13708 503374 888141 701271 325431 554029 648765 660875 868974 537446 608915 485300
13698 485300 312544 659439 800296 628762 550254 830178 464161 564264 322884 528768
13688 528768 762065 358905 231349 707253 642233 424046 358259 451968 697616 463236
13678 463236 917964 340067 277175 410380 264260 530360 512044 653019 283538 445260
13668 445260 822769 555092 247156 748633 576489 570014 459061 537970 634848 705110
13658 705110 189043 330405 381509 376389 533564 362340 684282 238118 350809 681883
13648 681883 649343 514192 486870 80398 787958 329019 898248 371039 450257 153820
13637 465288 553660 420484 628565 335520 176387 61299 357915 510553 559928 142823
13626 496160 781546 557654 283024 256982 4485 471777 369341 238062 342548 58385
13615 426122 238443 321434 229240 736172 179855 431942 199618 339762 536371 300956
13605 300956 577804 475846 503184 494297 316011 437547 367371 508167 351967 414308
13595 414308 123983 573348 307159 365209 410499 489079 295014 139694 349871 425846
13585 425846 514645 378650 548706 393220 501743 328341 594279 440433 47081 562273
13575 562273 342882 225098 687079 476518 441832 371819 277022 127586 542180 667012
13565 667012 542347 118325 273373 418565 120883 -7153 404854 202878 287597 516425
13555 516425 529682 446670 521429 305212 676295 513339 423343 493160 459756 337105 366188
13544 366188 140551 450054 299014 725970 120946 401860 -50286 -15934 337836 348374
13534 348374 312279 213985 398895 -45965 621222 427954 420284 457381 32962 42138 204162
13523 204162 465579 504805 309651 289414 299903 241683 497456 298557 58750 94291 195333
13512 195333 174475 443735 272825 116685 151263 209787 639991 110922 -37609 497334
13501 218326 518363 367913 72386 47259 81831 164922 260187 129264 330685 134114
13490 220525 632920 281885 420463 201609 86221 296525 298806 525178 320348 80022
13479 122077 606146 391120 114415 411426 470472 476733 391016 510942 308466 485537
13469 485537 245874 344008 428357 244515 453631 191452 436848 260559 94601 -159877
13458 224734 148185 246489 328854 207484 106542 47654 82236 286468 329394 224387 503751
13447 503751 131435 192155 222679 641221 291392 369271 454361 262213 590942 -16781
13436 284290 271707 103852 222282 257254 671381 5397 180582 321975 -42627 304443
13425 301338 252105 249807 351731 243377 120819 -135040 -72039 218489 -23086 88287 148692
13414 148692 163238 -83479 179883 -67688 -19554 415379 295453 128096 480964 337086
13404 337086 229566 664773 352465 237214 172456 453682 27667 211903 26888 128956
13394 128956 79991 454584 196281 169316 135770 193970 235674 159332 70910 272003 609056
13383 609056 165009 54163 203886 351749 294943 -22452 466667 114090 149105 314752
13373 314752 284696 501616 351784 -46068 -79770 368941 371035 276182 136415 -94232 75410
13361 292494 228979 74730 343546 274962 381835 -5436 211258 3209 478347 402306 363563
13350 363563 120539 203383 308011 307641 574666 457118 268394 387918 293090 23436 539749
13339 539749 305704 264399 386730 527084 545490 203835 379467 109803 548014 281278
13329 281278 -187039 166218 -126701 -90878 105267 3129 294761 -107675 34927 405004
13319 405004 303528 249689 451965 487153 586032 133781 170798 162669 217599 526603 40027
13307 281565 140713 162998 355130 177813 225565 -47033 69319 43747 323550 -60443 265488
13295 -199553 42192 -129516 79327 -125294 14456 61517 63867 207389 -50211 61963 269726
13284 269726 248623 -202835 83937 141571 -115133 -18669 429858 251281 -25303 231357
13273 119419 -42732 171037 130463 62251 121532 -8103 319001 91167 125660 293936 5429
13261 386541 -200471 72452 328883 74374 377944 206464 196571 -70565 412156 176953
13250 109645 109589 -84001 254883 -50986 381168 -37637 224612 -38590 -26338 91313 -24887
13238 170591 79594 194107 382491 278384 -148992 46573 317008 206987 22876 49788
13228 49788 305153 -219412 38529 223117 349820 194299 49002 -199218 384285 104285
13217 -29426 -241482 208968 233440 174264 109743 125089 386622 477846 247120 227011 -190975
13205 -5047 194002 301041 171897 55721 167513 210596 58556 4605 -203635 -229580 164686
13193 24447 272180 -91959 43594 -124961 -116952 -91235 175090 66505 114014 342116 -292328
13181 215189 2877 405755 100944 245201 -5645 4145 146401 264415 501413 69350 224794
13170 224794 -75873 -86464 56884 160008 -163308 -160644 341714 -43952 -97042 -65965 -267185
13159 -267185 52023 108607 36520 -194352 167436 382712 -2234 143998 -20603 180158 4654
13147 53318 202729 21493 83029 -76726 102501 -266981 -222616 380962 -170253 -221925 -138591
13136 -138591 74857 46377 235436 229610 329230 308080 210294 5518 -333671 13732 -36248
13124 198498 290003 2037 -8023 124445 -150963 191583 411329 54539 385292 123106 59784
13112 110111 44437 205452 291209 184871 154499 251511 150173 20448 97417 127499 -138217
13100 309158 232537 306905 160367 74046 171203 250896 315098 39454 -126353 386977 161762
13088 110849 194186 208197 -9930 137464 -248522 142328 249439 96090 255902 85068 69850
13077 69850 136731 -21663 248782 343622 -53380 38401 197546 131171 -273730 347423 -76535
13065 -92761 79588 242910 420519 151679 549153 37721 37608 308007 147768 -44938 132580
13053 -28903 72157 -100416 100108 -125146 139423 245801 202074 -24740 82081 66130 106333
13042 106333 261043 293244 190936 202494 -383263 -94169 -61048 88128 236172 684153
13032 684153 -99347 309973 511142 239421 109369 133931 124142 183070 179907 188768 301004
13021 301004 59720 -62557 195349 -6508 -66177 283604 -43301 -12530 163198 81654 220325
13010 220325 96587 38281 -172234 229232 136469 310223 53593 103652 169613 129452 -141277
12998 60223 87033 94319 214737 -6973 79253 -200219 221796 349841 -37381 407992 -42400
12986 124731 -174408 53267 162794 228491 46368 259218 -77354 -13276 -222331 127466
12975 171244 223602 5928 49790 -174634 -28490 -57079 -176985 106156 185669 221246 19568
12963 6315 -43037 -76378 108493 -23046 75082 267406 -119153 -444528 161183 41575 148783
12952 148783 -42196 169518 322024 43892 97390 -49218 37858 275348 -145261 41429 -190716
12940 88180 153231 -196726 -112851 159246 -183829 204527 -147512 17324 173672 304830
12930 304830 -218898 466544 47009 -149361 -65903 206894 -14757 120952 -277268 228790
12919 -192532 19242 392396 -153669 -40199 -143359 33709 145752 -76687 186977 106641
12909 106641 34654 -238756 -123241 257431 -93218 65210 -228850 -4515 82430 -147547 298171
12897 226644 140513 284135 -309401 -28166 -148242 -169376 386056 56706 -264156 289088
12886 219938 -47508 91547 21377 119100 -17916 57314 337020 333708 311617 -134029 -33061
12874 -3063 30016 87392 -309205 295340 11334 -13678 -21533 -472 -268719 -139311 -282874
12863 -282874 -41312 -171472 -121452 -121659 -31977 -243647 172445 18474 89086 -20291 81141
12851 -67437 77413 216770 67477 75908 -84585 173847 100932 -589624 288760 -206121 -111831
12840 -111831 161995 -84783 -181097 219084 -1727 -188311 -127858 123019 156179 -69963 -144173
12829 -144173 10746 85147 117456 -8146 107654 106721 1010 237708 61525 -62951 366514 31837
12816 -16997 -15973 -128839 -46405 -168030 -211338 -107838 160292 -54862 264515 85346 -32827
12804 -93123 36474 -21504 96974 3558 -247795 59754 97634 123037 135194 119550 -13092 294133
12791 23764 274347 -430320 -37787 -92360 187898 179770 268453 358440 322993 -157785 -198228
12780 -198228 -11773 -73452 17663 234462 42445 20834 -101915 6492 -216277 -94167 166927
12768 -33526 399736 100793 -23307 -16960 -89927 70662 207677 93856 74370 -47855 345345
12756 -84157 221561 -185629 26394 -270120 -45651 -214514 158610 251692 194581 -29602 -45241
12745 -45241 -76331 91344 -244 129389 87450 235474 -14708 221066 6776 -74875 299450
12733 209605 77829 192770 101752 -71061 193030 -137016 204537 -314022 -173739 -54972
12722 -14565 -53346 66395 -123221 -124710 48338 -16565 29243 159870 -19228 63564 75522
12711 75522 -135127 -119325 223998 167784 -57628 -33132 336399 218735 -50564 166221 148726
12700 148726 -115564 -6796 170619 408749 -197166 -5284 123025 -42821 41707 47055 77449
12689 77449 407056 91554 -5393 -31076 99332 -58971 228703 -79651 450341 85002 49992
12678 49992 77256 51172 252634 153938 5041 148779 -118179 71287 -101170 161806 -30125
12666 -132451 -124268 -160032 72836 86446 216946 74447 159995 -138244 74688 27006 102876
12655 102876 -55920 226036 208889 265994 229647 178954 -122844 113850 427465 172373
12644 -200578 -11433 174321 -107634 -165293 -274026 -152079 158152 170971 -2267 181518
12633 323103 227298 335955 -6436 360726 87040 367259 -9735 -43978 395063 169088 336500
12622 336500 933 160723 -2048 -103345 -61706 17938 88376 -192916 14722 -152920 -50459
12610 260430 141540 104374 158153 41675 149024 -17094 70169 353340 -177248 -49533 234260
12598 416655 232098 73602 15667 -221540 30375 -161256 256763 110248 -74863 193148
12587 10450 337780 143771 137069 -32311 113430 370454 99480 -136197 148517 -92828 1069
12575 91237 -177154 -56257 -239782 -99346 78488 311339 108788 61964 -128712 321267
12564 8671 24455 -78713 276884 237776 -43868 90398 22218 48826 231000 -352532 12740
12552 73837 141843 -87870 2917 116984 -151810 100234 143500 225379 -158670 -226446 -118740
12541 -118740 203795 -35233 -19125 60998 16953 311496 -116577 163489 -46317 199160
12530 33745 105971 -153033 226310 136654 87263 -223392 43842 79455 45242 134896 -123964
12518 -156526 68551 7222 -265691 20859 21887 -22889 156864 -215146 9727 -106472 -3387
12506 -74412 -25552 -36420 -228287 161635 -80425 -83558 173711 -38337 5491 -21521 -179078
12495 -179078 -154607 -255203 -140540 -100573 93957 37077 79326 1837 101782 -47157 -81712
12484 -81712 -52562 59670 -138295 172221 137153 -188782 54052 -8604 -200449 -16390 174980
12472 15893 135844 -190139 -112501 7600 118280 -42785 47961 221151 -218736 -31906 -94739
12461 -94739 180222 -58255 281775 -35768 -294845 45413 -16450 -1745 -160225 204625 19390
12449 33915 -15955 359103 -194051 65378 904 70036 -165905 287499 -152276 -464921 221885
12437 334971 -121881 -303990 -83112 63035 32248 -29124 -8479 -14172 -19153 -31892 -87142 -69478
12425 -69478 -118249 -140605 -16261 12796 -123099 158161 26359 -23405 -109112 51618 300952
12414 300952 -196788 -180596 178734 -346219 127034 -73043 148806 134459 -102889 91638
12403 207158 -43598 -311425 134966 -83851 90580 -130591 -96604 4981 -249179 135693 -6736
12391 -409560 -10196 120839 -15692 -232749 138204 12767 -7669 -108281 -45940 -371097 24466
12379 -210026 -44823 47295 38606 175058 -5270 -164476 -88560 18674 302065 -40814 116007
12367 118008 191413 -28889 75509 -180015 304012 196422 -34797 125010 -241 268740 39564
12355 16448 -45173 -111573 -162267 -6247 50851 -46816 -99320 -93872 20080 -15587 17314 -336370
12342 80352 -72149 -31242 145115 103802 -33719 173751 -223815 125248 83500 -254215 -17561
12330 75007 218006 -48948 53137 441499 199130 -174301 -166404 -32326 -156000 176032 -111831
12318 116973 -488 -44339 -147766 6045 -190919 299416 -99370 289405 180551 42974 83955
12307 83955 -296405 -237482 -48754 211683 -33562 52008 -98746 117263 -160907 434689 -63096
12295 3648 34202 67551 44668 207954 473555 -196712 -13363 69367 30659 -17580 96322
12283 61790 82975 159536 -21247 -163199 -479770 -305238 -42545 42916 -2835 103514 304216
12272 304216 111146 -69405 165459 179758 155652 337929 -60314 286677 135205 165150
12262 165150 4690 -33832 186073 -207496 40099 -93420 345548 369383 168404 -1458 329970
12250 40752 322489 75609 -53560 232705 260261 -143304 -11035 -37802 392070 6961 -424658
12238 401534 -179674 160339 486972 321203 41649 409291 442350 -105765 136256 104455
12228 104455 78244 37231 3555 359216 165555 196472 347673 174674 471065 401095 -162677
12216 60843 375474 384678 351890 3210 119814 286720 201508 340935 103003 -368212 113183
12204 15342 104192 43617 118558 188985 387026 181158 151669 304124 32067 240824 -58359
12192 514083 235496 -104933 41383 60780 -223102 -337718 40560 55008 342691 148653
12181 15600 7908 -120114 220880 74139 202881 128597 -96887 -22621 234204 151532 -411484
12169 72952 202102 338273 62088 65430 141634 281389 -197091 -49492 -12210 -6579 275450
12157 -76337 235718 231839 387971 226728 -157442 -27399 173555 43675 -29474 -559280 181969
12145 -99117 -87631 90858 29253 -530991 151385 -104344 -112601 515038 12603 -328292 16630
12133 294193 -306610 -151556 86793 60990 200084 214986 -39350 -221127 -137435 303996
12122 147837 227229 336483 164658 93863 155963 -155549 398632 -78950 265793 -159056
12111 102973 -37125 -337724 57211 -100516 -308399 165054 8999 32882 12990 229998 -54348
12099 86360 -187540 -152973 8103 -316388 -80969 -229366 740 136424 3196 -10205 8387 386504
12087 386504 117259 -80715 -187518 -92384 241049 288072 -20781 143979 141051 -76560 3003
12075 -188154 -1853 -70220 63072 628536 1958956 797365 276959 -338498 235684 -139739
12064 5091 230070 -49076 -337717 192181 -125718 32903 99589 29318 32396 -230230 -124907
12053 -124907 -2862 311100 12406 -150234 77663 397593 -47748 274681 -172105 -19847 -118711
12042 -118711 216250 -8718 209511 -90054 -204570 -117616 212519 166253 313657 76653 -320518
12030 -75453 102917 31389 30670 -75535 -142152 -247091 433836 261531 72140 -50147 -36304
12019 -36304 -235341 69258 -142408 61781 259028 -100778 -68861 -193525 -26401 199434
12008 207842 -132510 340809 283280 -88355 -293526 107260 288356 72854 271973 -104994
11997 42448 -77210 -82404 36213 -221698 -98204 -269610 -145799 -114796 -65254 20708 218142
11986 218142 114521 201082 217918 17331 -136534 92613 -232124 -57170 183353 -32946 -92927
11975 -92927 8512 -188665 -212923 -171806 14693 26014 -263055 52052 -102270 451534 -195456
11963 7121 240398 -123071 -188771 -283115 -223118 24148 -108876 -19266 -198849 60007 199563
11952 199563 13507 63243 -69297 169151 -78589 65649 -197341 -201406 -403632 92789 11183
11940 257842 242389 62322 148405 58207 -260027 223996 120950 -151886 -324797 -204516
11930 -204516 -72251 -125438 -325972 -78624 -139395 -386390 117109 -211427 154278 231781
11920 231781 -32677 39776 -77315 -183235 -81979 -194245 -41741 162827 105490 21799 307168
11909 307168 28263 -125945 106421 -408776 120657 61841 130449 -145018 -60214 152440
11898 -328117 -80040 -159472 -256418 140643 328976 -115089 -113544 27668 -74381 -69519 -281264
11887 -281264 -233375 -221223 72348 64608 68956 -153414 -36536 38764 -109833 -68708 -75379 255006
11874 -180649 -186961 313596 -146663 -153803 35150 -142256 -39489 -5920 -210144 -164036 307568
11862 -7872 -51402 260742 96590 -125603 -218795 -39835 -266938 100860 -194000 -7812 72979
11850 250799 -202119 -14842 -118800 -67035 -19642 155182 64784 -198209 26361 -181449
11839 -45226 387452 75828 -377343 -57123 62197 -244528 -94926 -238168 -599178 -44959 353990
11827 32404 -133042 -364043 -58003 88177 -11462 -55491 -289751 129558 39610 -96766 -115505
11816 -115505 -95585 486492 57721 -75498 -47414 107839 -149768 355602 -198932 -137163
11806 -137163 33020 -322831 -223654 -179779 121794 4609 105235 214554 -3718 -196148 143183
11794 477759 -135372 290382 -92300 135922 -54537 -179049 36074 -341450 125856 -101335
11783 -258355 -60984 -24858 63721 -51694 45096 -54501 1734 94827 221410 62935 -42414
11771 85908 -17965 -331199 -42855 -145823 54794 -67863 541025 -176476 -80868 55777 120348
11760 120348 251369 -136895 101975 -96586 94382 -28575 -169263 -131350 138191 94074
11750 94074 190766 -214987 -20019 137559 -172717 178164 100468 -286987 118894 170359
11740 170359 -232477 -261344 -329359 198310 -5014 44819 -73107 -16562 -183613 -42281 40303
11728 59549 -224615 -68070 54469 20085 -314977 -96333 -87938 109551 -127710 -557246 -333235
11717 -333235 -117396 -124449 -7962 247488 71734 -13897 430293 17893 -255522 146372 -318515
11705 118045 152607 -60012 28907 -77175 38200 184000 346547 -46343 -45817 -74680 -36643
11693 287416 329784 144171 -17491 123707 -150120 66787 299028 161083 282560 99444
11682 -189589 -85803 -209472 203607 78392 -227362 -74275 348112 37528 223088 -14933
11671 -148916 118780 150767 63474 7528 -8865 49268 -69981 140984 72279 -272302 -73875
11659 -75498 -23071 -33431 -36746 20633 -26976 -89037 -222182 -30611 32787 -204788 -279133
11648 -279133 -102752 -5308 627 49932 -248885 -67622 -108141 210551 186600 -92916 235603
11636 -96376 156735 219854 -109674 -16225 11226 150976 164816 200877 -62002 253476 80590
11624 53456 -124836 207298 -195752 45705 -304264 84396 -102727 -3840 -208186 26000 -338551
11612 -9506 -166930 123694 25940 -269511 17550 3121 112654 2072 382282 254658 -60525
11600 -128730 -238764 105274 -100568 52936 170663 -87304 -165196 -97616 46930 174869
11590 174869 -133967 149735 -129162 -179419 -148187 -103319 296799 214635 -13232 154998
11579 335337 69419 12843 336832 -418572 115574 -126351 -17768 6803 99929 201762 178755
11568 178755 10657 167431 -28834 94680 211897 -109365 187373 263641 203868 -11528 123000
11556 92905 75630 193914 131891 381405 -74990 -58961 -301607 289794 -75576 142674 47780
11544 154101 45083 -39189 109922 -42970 196233 217265 129606 12639 106900 -94451 208270
11532 4952 321579 256396 -78750 -204053 -157997 -184671 151665 82071 77327 -2661 10844 363245
11520 363245 292837 36819 42924 133389 232255 -57585 196482 -180647 175971 76503 91670
11509 91670 316285 46765 -78497 -255248 110171 -161561 187097 -104286 164624 -195717
11498 275982 98638 265376 224093 424038 68577 357366 187131 219813 -210743 35969
11487 87721 -22645 -18728 310132 303594 55759 458420 266078 480857 230068 178880 250916
11476 250916 268758 188145 168672 179364 102686 68949 133395 -15887 52330 87170 275559
11465 275559 -108892 250192 -38919 448410 139590 245836 -56077 -43697 -87760 200377
11454 373888 -96888 349386 -93951 -65538 -239620 -105392 121748 361 -74166 337918 -112892
11442 79740 444554 -27456 89091 252038 212124 -31219 60054 -180237 110627 97756 9456
11430 -168812 -228762 -219319 253285 -45879 7080 -86371 -396027 -38411 -9208 7478 79809 46743
11418 46743 -43140 147699 -341066 -38365 -144044 -274449 80107 27616 154521 -138206
11407 117510 136038 -159580 -53816 -126123 366370 247960 177424 221108 97844 187092 264164
11396 264164 209288 -128465 -70158 68005 148881 -310997 257069 -456637 -83867 -12818 34485
11384 -478132 98738 83255 -66603 11082 -45325 30496 103199 -285376 325306 -89679 110433
11372 81132 84417 85662 -41599 -23458 45714 -38396 58664 79194 128089 146566 -84392 -82245
11360 -82245 47236 79006 -113885 -308901 -305696 109861 388827 -379130 -82649 -172398 -218648
11349 -218648 243241 101995 44470 -50141 416 79296 94562 40875 -180699 183939 -114135
11337 -64613 68904 -250839 36208 341794 152888 232840 336823 -462945 -156619 230984
11326 -192606 51937 -257389 63271 -2727 -106992 73349 -195199 183328 -22255 -145272 312353
11314 11838 33158 101105 -231596 62418 -42562 -1574 -10089 178256 -131079 -24952 139353
11302 -132301 -130295 -143979 241676 80908 66269 117704 130661 -86769 204140 114989 -25238
11290 111913 -221118 -370869 81663 51344 -327462 -266721 88383 -189006 93439 -29385 -151337
11279 -151337 124617 -64767 -51018 96032 -150193 -56258 51347 -253883 331839 -64634 -434460
11268 -434460 129712 -19266 131730 111749 175489 -112499 -159914 -43688 -61203 49518 129332
11257 129332 -109045 47789 -11337 -115732 39104 -19444 -42593 -146057 -71599 -181638 333332
11245 -34948 -24591 73922 64734 40839 -129432 -78096 -68616 -36051 199614 -331897 693 -143935
11232 96591 -257125 225960 50219 -49391 -223983 62090 96033 -92174 133931 52516 119329
11221 119329 101439 -245389 -39330 -128360 -94024 -55587 166013 163204 -68879 -258854 -401772
11210 -401772 -118521 -86281 208169 -171666 -211258 90255 -346984 -151601 -226042 44813
11199 -142284 -30804 43745 -150045 1901 -36830 -8311 160425 -145510 -52380 -152160 98563
11187 108524 -239861 -232633 68310 10382 -85428 -26372 15909 12990 -6478 -121810 -129166 193047
11174 -351299 88521 48873 -35101 176368 -34201 50275 72003 -139543 292580 -349741 251774
11162 -61020 144562 -146402 -252132 10800 -112360 -200822 -178210 -107736 -361150 50544 -44169
11150 130131 9944 -25898 -90160 -85378 -8629 340955 200214 128542 282777 268469 368430
11139 368430 -19800 141198 230047 136507 -68655 -18850 127334 37587 -81290 -145314 388560
11127 102871 83807 43562 -265365 -259864 -208411 5351 443638 -73918 24481 90241 -213288
11115 265521 395266 63458 -257229 -91710 76649 -360789 -355048 235943 -13070 -37446 -134737
11104 -134737 338726 125143 -2959 39308 220528 162780 299516 507538 617518 70345
11093 470242 356911 203364 -14545 -88119 217920 30409 176200 349935 284432 373569
11083 373569 166773 210516 346412 190452 214769 324020 295696 443576 162498 40994
11072 269704 233276 426062 332793 275406 210440 -30313 553677 62152 549320 196570 305339
11061 305339 934278 521188 415934 167175 498666 415500 663585 607377 505267 516810
11051 516810 728696 824496 893869 842458 514457 1005393 710430 758061 978586 562447
11041 562447 1246866 937639 567365 665279 765059 1038680 835894 695616 796814 839820
11031 839820 824865 489924 759517 710600 696735 906655 652724 750039 997805 427883
11020 766653 557520 477363 636317 753612 529215 851169 288065 488652 775855 610200
11010 610200 381692 876473 378677 328350 401148 788563 788000 741494 509471 751178 800149
10999 800149 718309 684060 573012 659206 980194 865623 592364 763790 988667 415604
10988 829850 892215 938504 821144 1069920 1057069 1241771 1527003 1284622 1292330 1345271 1701405
10977 1701405 1739413 1961545 2112950 2359682 2938197 2950029 2936290 2812336 2596297 2618697
10967 2618697 2551012 2207322 1634893 1656019 2158388 1520346 1620043 1793481 1715986 1673742
10957 1673742 1673114 1801473 1705109 1827700 1132592 1304307 1143478 991108 647833 314117
10946 611401 410774 384010 257640 211820 255865 173365 341819 290106 194631 270713 79431
10934 208096 441256 166405 -4676 52092 -5065 -14828 -75385 -86895 400465 -213889 -44685
10922 -286992 202227 154844 -211496 130912 101536 127622 -131275 -81745 75978 -153010
10911 -126785 290328 -364914 -201570 -24786 -249323 -42694 -6484 -238811 -228349 233637
10900 6365 -32992 25856 -264339 74672 -186278 339958 78770 46709 139041 -22960 -38426
10889 -38426 24049 -23327 -321104 341842 -165717 -117409 -25380 98755 74055 -80122 -308387
10878 -308387 -14814 -203912 144537 101513 -210355 -240261 40011 -165627 -52018 -118008 -516
10866 -199252 -169804 -113024 36029 295072 213317 -10862 8518 -250358 -105 -42622 135774
10854 -127768 -196593 38264 80566 -102966 3334 39942 64904 57408 27335 -340274 -192258
10843 -192258 -232783 18052 214900 38946 -241431 149256 -118868 -261043 -218754 -204739
10833 -204739 -50104 -41405 -75216 1592 -65384 413832 -214587 87008 23044 -27364 5874 262680
10821 262680 191230 -121027 -93120 -285415 -43274 -68386 373871 144002 92831 -155642
10810 13312 -390437 77885 -61866 -174860 -106902 -270539 -58645 109229 -93654 230064 -29264
10798 -9822 61578 -149765 62906 133180 -154176 -162024 -77226 275764 -114374 -148679 -370331
10787 -370331 -15543 355538 15901 102200 -32597 275844 -43334 78688 24755 -146407 42413
10775 -213998 109128 -157933 -120743 163634 -315394 -213278 142379 67430 111314 -242156
10764 -179214 -70631 -61877 111847 -174347 -211038 -200973 -163434 100088 -95111 -186071 -53420
10752 149089 174215 75911 -262445 -160540 154996 115938 -71366 239201 -27737 -182513
10742 -182513 -129232 20285 -31627 -75508 74380 83891 96925 -256600 -22956 -246121 18903
10730 -297554 76674 -352650 7644 243331 -150945 -112731 -416958 61789 -234712 -201594 93857
10718 -347518 473063 -303130 157964 48230 243682 103047 -211506 -369799 -57222 -74540
10708 -74540 -315232 20551 -168529 24204 -391760 -61517 315051 139533 -67381 238309
10697 -52980 -177923 93762 186271 223109 72523 -236093 -53316 255418 88440 82090 -5405
10685 -41461 -234873 -257550 -246415 93369 -31046 -264679 -174749 -85322 5586 178058 -378042
10673 475480 -45301 220519 -148756 274666 117815 53435 -239612 -167976 -336003 -156170
10662 -304425 -259874 -349475 253100 55079 186056 64913 25460 -231090 255950 -577202
10651 -168359 -185711 117027 -203680 39572 94138 -163929 -222913 -188096 -107601 -76345 145314
10639 323988 -347051 -149436 -162528 -216460 59775 -304326 -70169 188093 -188444 -337479
10629 -337479 -115185 71310 -45632 -49724 -385361 -182003 -69333 -147234 153102 -34660 -238730
10618 -238730 144780 -205562 161060 -104072 52455 -258204 9176 -130196 151742 -351603
10607 205252 -88282 -71535 -36016 -186392 100667 -233575 -204802 -192580 99763 117252 54975
10595 -103657 90356 16159 -16505 -240544 78652 -74534 113763 -114302 -246504 179345
10584 -164778 -76760 -116709 -368995 -100527 53725 125960 -237046 318283 -94451 -115325 136960
10572 -1933 -135204 316305 -120248 82494 88394 91264 246631 -74871 -71565 -174504 324623
10560 89004 -71846 -51085 -185351 -439286 -128457 15188 93452 -42015 148772 68838 112302
10549 112302 -57457 -47360 103844 24508 -124127 -74335 -8430 77353 -31119 18108 -103448
10537 3114 -112874 587393 236182 -83320 245274 -117417 -119753 -117116 -445113 -226056 -10570
10525 54786 -206854 119448 138196 12424 -31163 -108908 465529 -40939 -170322 -260217 -115644
10513 -158285 -415120 -213244 -28348 -128490 243483 30976 -59383 103791 -65977 -117532
10503 -117532 -69552 -230911 -369577 282828 -215935 128650 -240510 -142403 -6036 31653
10492 68280 18488 -39319 221531 50218 213513 -204519 -202526 69354 304503 23079 343906
10481 343906 413466 266367 691087 174599 90366 261185 212377 168643 -182897 -229744
10471 -229744 -7415 -61209 251009 -25080 143534 175951 153725 -64107 42847 46269 77555
10460 77555 -69179 110908 -41570 58540 -130853 75388 27733 -107210 -108335 162056 -49220
10448 -43896 -49435 354440 131024 -67943 55061 -182363 54248 -48956 -302971 -3977 -115564
10437 -115564 -183549 -46283 172024 -143830 50355 -167409 -74288 7186 -232616 -6470 203558
10425 -55468 -189535 139783 -134483 -31531 36522 -237364 248405 -15937 68083 -283261
10414 -219506 76969 53576 -159347 -218288 112532 -131778 90749 -52585 130855 -237188
10403 208457 -48451 -33902 -283073 -69400 -50598 -74473 415390 32320 353501 101226 -100621
10391 103257 75605 144877 -154212 465274 343193 289269 130944 304702 145258 37942
10380 155466 -228212 453600 253163 -69349 -97744 377327 336276 299942 455026 333468
10370 333468 192975 368316 470745 76316 415383 688353 467176 239164 180395 78623
10359 236002 90862 107283 264888 -87154 146935 111193 338386 391617 333202 766013 409481
10348 409481 -71908 435957 320908 348312 308373 544887 233697 132624 20627 -103422
10337 143720 196864 360076 296828 344769 428613 255016 -263999 48296 254535 240761 334415
10326 334415 213386 -34142 389916 290247 -66130 132465 -17775 10776 333098 -192939
10315 466592 -14897 22595 58717 -140561 103722 211247 -74607 -211472 -2986 4666 405710
10304 405710 -119614 -107872 38183 79782 -108862 205893 277939 38423 248064 -3706 27233
10292 -48122 82525 55151 128819 -227331 -224017 177256 -448353 -234040 200681 -149046 -71441
10280 -247200 -125211 -154588 24338 92413 -31597 -6667 -76204 73362 22230 -54827 188811
10268 67030 212867 28652 -351273 -336265 -89727 92842 8840 104199 99795 364504 353126
10257 353126 465807 391390 -34224 263134 174854 -79797 75320 117521 -96812 -230093 -60601
10245 -80559 23139 -78759 -130619 -265931 64377 372561 -76447 -50809 65771 -366016 -75888
10233 -6334 6395 -232443 -48971 -54652 -292423 215927 166196 110000 -134466 -60727 -74602
10222 -74602 -60943 -181192 -169263 32202 58481 150289 -124173 -2990 -64264 -118643 256035
10210 192447 51741 86857 15206 207210 -43718 137484 131669 -696 -466557 -106205 -31010
10198 -182061 -77291 -375350 -124199 4517 92079 -136693 -54822 30115 233244 93375 -303358
10186 132916 -241928 -134919 -44597 95492 -123421 -271588 -140410 -75172 -70840 -48356 87135
10174 -287201 -208898 156873 -112523 -146680 35826 85758 -112517 -37396 80963 71536 -78918
10162 -15971 -69744 -161555 -209723 -139858 147721 57041 90576 194065 186326 -27336 82964
10150 176734 -56764 -73313 90578 -191341 -160382 -55457 -162953 -207058 -96246 -153272 -422071
10139 -422071 157052 25770 382598 -48361 -175723 14955 -344012 49448 -8095 -172119 32194
10127 -15778 -140808 -277491 181343 -104630 70712 -171851 -38464 -238504 -62161 -48787
10117 -48787 -590591 -140338 40105 -199486 -143638 55964 -339290 -297180 156421 170249 55972
10105 157497 81376 -369672 -149269 -429041 -35719 -270115 -5288 94623 128086 154187 -106696
10093 -258763 -188088 -121565 -68541 361073 184687 421743 108025 -248000 -388693 -270844
10083 -270844 -327241 14474 -175134 -58985 66252 -196886 343013 -158014 -121676 -92384 -105490
10072 -105490 11542 5422 -99997 5722 -94079 190891 -184206 -421077 -273581 -102220 -50961
10060 -532310 138119 -118401 -52427 -41615 -196963 58384 109027 -325685 6829 -160207 -188669
10049 -188669 -39090 -2403 37110 -265630 -202709 111410 -8435 155918 -25878 -423190 -186624
10037 1415 -108957 239895 -339814 -67183 50285 -362198 -125741 -84550 -108130 115712 -311435
10025 356426 118092 81957 290518 217372 435938 -111097 67949 -59501 -282665 95401
10014 -47792 -231855 -86410 155646 19184 -62656 -122901 136857 -78871 71125 -85349 82069
10002 -384080 -236486 -171111 -305126 -43481 -373738 -31134 -173129 -190893 -399934 -394971 243921
9990 -54255 -206469 -269259 -97123 104176 -282764 -379662 -154387 -87221 36913 -167673 -50563
9978 -20101 286631 -7402 -30000 40333 -13521 94591 -32733 -12720 -8161 -135539 -34658 -96957
9966 -96957 -108048 -219701 -14976 330695 -23155 -213025 -211628 161153 -37337 186544 82025
9954 -53861 22693 -142168 225640 112165 -256433 106422 -151270 -190339 223670 370 -60767
9942 110519 -130958 -108453 34780 -177777 -169730 -214142 -132061 117385 -181232 98196 52395
9931 52395 -131576 -114690 -218555 -201919 -253536 -181512 -127783 -98059 83152 171283 35878
9919 15507 -193579 167427 -150053 111453 -110233 98116 -191657 -239334 -58912 -45386 -273023
9908 -273023 -145356 -401234 8628 17151 -301069 105869 -122271 114582 -125818 -226511
9898 -226511 -47818 203078 358529 60320 -256676 -8849 164085 -147475 177684 -160302
9887 13837 -69968 39607 -31409 156335 -380174 -129989 31534 -219978 -359102 -43634 -120649
9876 -120649 39277 -51329 -130887 -92576 -41592 -313151 -8716 32857 -416439 267423 -60096
9864 199247 -73958 -142910 -209915 231545 -191228 -116983 97061 -189245 107142 -59639 -183210
9853 -183210 -259499 18575 -417931 -166253 -289973 -107625 -90661 153539 -54631 110899
9842 42842 491485 -77959 -203081 -196965 -258562 -20896 -154269 -218628 -49397 -191305 -180648
9831 -180648 261922 -21283 -119499 202316 -87541 -363741 -231257 -121359 -39825 -203236
9821 -203236 65541 188759 -344106 -23033 192483 -276938 27427 226482 -156271 97614
9810 101714 224347 -227850 -302931 -195854 90989 -112914 -150260 218586 -157018 -203370
9800 -203370 -163445 340670 -75065 -184253 -64009 103478 8166 -86883 114958 23676 -6237
9788 -2312 -54792 14333 -41190 68258 144023 -39944 -9749 -45909 118158 45009 1329 -285671
9775 176539 -479391 10173 -291119 100787 -90863 -371043 -129378 -240987 111619 41091
9764 302698 74899 45793 242945 -51296 48111 -46799 -360186 217439 -365508 -184866 -314310
9753 -314310 38441 -231816 363885 -51127 -111944 -206620 99286 -68146 -199899 248485 -74787
9741 132988 -130134 80772 -166253 13674 -225549 -263681 76268 -257359 -62385 258022 -100578
9729 -46460 -103910 177813 139911 -172825 244590 -326986 93698 -255430 -6640 -227841 13359
9717 -38201 -23551 -289416 175831 -9042 18006 11284 -222123 193530 -811 -28761 126800 -239347
9704 -280564 -280130 -2103 76200 -7024 -195523 78135 307248 169592 -258027 -269674 -61248 37225
9691 180414 -9585 2362 3033 -232942 -76980 -189297 -257838 200929 -283161 -439436 -50733
9679 -74134 -383628 -193792 -139137 31095 -328388 -178758 104509 -326362 21186 196364
9669 196364 177712 -4827 -190476 -352834 -381300 127119 -88772 -276158 32613 -322696 -139818
9657 -363607 -113099 -224746 -69709 -88046 -99416 -273560 62564 -45620 184666 208665 -311865
9645 -84166 -287020 317281 -378309 -371154 -402010 -168640 -136161 85032 -89979 31985 433956
9634 433956 -159460 -89325 35450 -88524 -272644 112033 111474 -264339 -191967 29372 -332106
9622 164018 -260669 -86463 -98536 225642 166732 -21439 -144698 -333382 -56632 145664 80646
9611 80646 2122 -185477 -119600 -41173 3368 -134985 -198758 -213072 121986 133896 -63094 -180460
9599 -180460 -211498 -157259 -37302 146388 110190 36789 -56345 113030 256502 -241357 38679
9587 -276480 262215 84515 -109705 -131291 -119412 5026 -233803 449849 146644 -42567 192714
9575 -9393 -86156 -37909 279929 214452 -18234 -280147 -56796 -108370 -124421 50156 -33615 361094
9562 -17959 64454 -67630 -294851 -166260 291681 7120 -553410 -104525 66802 -123539 -75858
9551 -75858 33648 -184671 -115831 160044 -121950 -311423 60199 -94014 -233766 -318383 312820
9539 221589 4023 138677 19870 359827 105918 74708 76742 -101823 -147793 7586 -165480
9527 -28018 -176686 101067 -104673 -66819 -137864 -275254 -7283 102961 -222547 -238990 -81424
9515 29331 -109997 -1426 -42444 75957 198268 -303549 -123690 -120000 -32189 100427 20597
9503 76671 -137024 -12471 206260 -173312 -229155 -50945 -544123 33116 -7440 204881 -151052
9491 -26363 134320 15876 -411219 121620 51735 -203048 63446 -14296 -108097 -244480 -183965
9480 -183965 -158269 -439545 33625 32700 -84903 79996 -97880 29258 -65850 -26322 11635 -216945
9467 -133050 400567 -20743 169698 386380 -237345 -132863 -430425 -1991 82528 -169430
9456 -105191 -155763 -252337 293722 -94415 -310658 -313433 -321445 157657 -352618 -130664 16254
9444 -277170 119946 157839 73827 -173042 -67498 88060 70278 155661 -25316 -74617 165310
9432 241539 -33171 -289189 -185618 54090 -18795 -66277 -49002 22560 -332369 145827 -172419
9420 -276903 -148434 86805 -8821 -27596 -142954 296408 -237982 112984 165442 -166834 250598
9408 -311462 -219205 -323557 254686 214317 -196601 -15345 -109692 -229691 79702 94534 165319
9397 165319 -261691 47101 -296271 34479 14644 -55140 -148491 128832 295265 -78905 -121756
9386 -121756 -180783 -5872 -14426 -333759 32876 -412598 -9239 -56921 62584 -52685 544068 -58000
9373 -44494 155246 -82054 -58112 307641 -133566 -280845 56209 194594 -75564 27533 184697
9362 184697 166231 132547 -65097 -33125 278372 -124457 -180022 -98134 -75248 -249288 154975
9350 19453 -136296 -147954 164028 248633 107444 364485 164220 -40492 98486 231837 -11806
9338 14379 -146881 191322 49620 223545 -121379 -214770 -189691 -130969 -77146 -35548 9739
9326 -226489 69575 -212341 169591 -320534 -37070 -126969 248447 62655 130853 12791 -367287
9314 -419636 750 -13084 57033 55884 -104690 -21433 -333 218601 -165269 56878 -32095 -55305
9302 -55305 131034 118094 -215059 -51322 128554 -107853 -216280 -223115 251038 -105538 -204012
9291 -204012 -192285 -96423 -53467 80392 97014 -263840 -352871 -4752 -420288 140287 6309
9279 28177 344413 -333400 60040 -27751 -196020 -24018 111895 -152823 -216382 276989 -114606
9267 -422157 -170372 -144845 25001 224314 357150 -65747 -470603 -191169 -10122 281341
9256 81050 60923 88121 -24618 -211024 97418 306906 -307078 -89834 -144973 48468 -131831
9244 -216209 -313283 -168344 -94556 -175086 -296967 -122670 -100384 -152701 92867 -171323 229597
9232 -92658 -198123 15141 -155 -64817 -50578 -112639 84236 -252275 89040 -122065 -175838 -787
9219 -202939 176254 -248190 -184881 92535 -4086 75531 -354795 60963 11872 294936 -272962
9207 130155 -72647 29529 -265542 -356473 -153211 -469106 12599 -162406 261258 -278641
9196 -32856 -75768 -58630 -82392 75336 -53799 -189640 -156821 -181523 -136964 -7009 326583 -98734
9183 134255 157689 -366218 58126 50695 -94454 74362 -146918 -192550 194507 -209312 -65198
9171 -23458 -131160 123243 -393149 -251276 -235939 -88161 -85489 419753 -362990 -281010 40580
9159 -312518 -157254 -42034 -196052 84527 250964 -83856 -270262 -6028 -43136 58969 -264426
9147 25860 -66927 165845 -62759 14811 -112859 -21212 -214983 -28482 -157214 -130918 432167
9135 -153301 -157415 63617 -215661 -42771 -192343 -226096 13342 -6206 -130301 -191087 -165737
9124 -165737 253736 -194366 140666 106780 -254368 213425 17395 -148873 -52683 -141809
9114 -141809 -354407 -50748 -116048 -220194 -193484 292470 -299974 -9198 -284210 -323598 76595
9102 57649 -120977 148453 -137247 -164075 -142734 42926 21755 -172798 57619 177290 179519
9091 179519 -234176 -42144 85170 67742 -140742 215801 133626 -150063 28681 157170 229539
9080 229539 -379120 98280 41919 10638 82276 138292 26042 346389 -273437 -357481 -59555
9068 -240758 30217 -148322 -53649 -158815 -93648 -99726 -278393 -256787 232783 177350 84885
9056 -233321 71431 163509 9429 83990 120383 -403053 11975 273780 -173145 -36159 -171840
9045 -171840 -10092 -1268 -304512 126138 -445767 -105809 56388 120422 -159227 -210571 119646
9033 46290 -228123 -92357 -128397 175619 17213 31796 -57205 27960 -50260 138853 -9693
9021 -163798 -48976 -102681 -310770 -285928 107776 -337100 -129074 -171886 139695 -169296
9010 -81647 -217505 37434 125979 -193999 184217 -110527 292086 -168695 80714 -44806 -173183
8999 -173183 140877 219872 -190002 -34391 -31253 -98676 -34907 -337556 -70983 143321 67270
8987 26855 -99065 -75606 -27711 -113350 378232 -533696 -191987 -71349 -104624 -333855 -27257
8975 -67055 72542 -152828 -101714 -178691 -264021 155452 129353 -279267 -150698 63306 -64815
8963 88904 106534 -131985 -147496 -119116 -115685 10099 104556 -116577 -178150 -67318 754 88672
8951 88672 -120551 62782 -124610 -32938 -191630 -6677 -202664 -151352 -24773 172769 35136
8939 3713 -141494 -69581 -12255 -139166 245085 400112 -17118 77083 239532 48846 9026
8927 -140192 495158 430696 810595 1679187 3542116 10709400 17733938 4929924 1865030
8917 1137967 763502 494557 220584 102798 154190 -90473 -141093 200586 142879 541607
8907 541607 177380 195270 -65025 -157629 -233586 17299 108034 -79380 -282383 395427 -151345
8895 200304 -307409 193916 2872 288796 -37339 -321346 -199826 -162399 -35489 -169547 73020
8883 66230 4546 -179913 12673 97188 215486 145757 -34846 146801 32761 -126653 112264
8871 234455 -56586 -113423 -14932 294060 85630 -212506 200875 -332688 -99236 -57793 -138736
8860 -138736 -50410 -6876 -143419 -244230 114213 -41391 -165485 -10424 -121666 -366184 7746
8848 16139 -87493 47227 -122867 71738 -44783 137952 -239209 -40379 196691 -220110 -80617
8836 75386 -51175 -177029 14906 164239 -107145 64899 487801 131315 -70737 -12199 37220
8824 276861 -182300 18538 299413 -298214 186025 -181317 -30743 184139 -321263 -47534
8813 -253179 -189780 -228686 43261 -28621 327884 -163062 -121971 -56999 92943 38185 137444
8802 137444 223423 77349 -348938 -86898 -171060 -50790 -179774 -313244 179785 -460857 -183970
8790 -61456 199581 -43893 -154942 -134183 -51931 -147259 -90196 -268519 -307586 -240354 -79285
8778 -131608 -406152 -242720 -45047 140105 54078 -376745 -33805 264260 -132766 -49529
8767 106355 -86085 -106636 137869 -86456 -169143 145859 109778 239878 25506 -79824 276395
8755 35444 -76117 -115817 -50384 135898 -118657 -212508 -40238 -107302 199952 239599 -134661
8743 -204550 71148 -43371 236785 -442001 19368 166392 -261123 -101894 -230631 -109504
8732 98743 -240457 47181 141456 -23093 30627 -90950 -26196 -5442 -15366 -30432 4911 -301917
8719 -188660 109662 144716 74614 -115676 -194696 -161074 31542 209136 77273 -130891 -128613
8708 -128613 118604 253227 -279664 207915 84607 -128964 80507 162301 35617 132804 109848
8697 109848 -7457 114391 -143711 -30065 -693412 225907 -161753 -72377 41015 62946 -17328
8685 -191910 98033 46553 307515 105186 -13045 -83410 -153941 227469 -198973 70712 -406316
8673 -7584 -42073 5143 -45159 233377 -380454 -356531 -27571 -459873 -69251 1927 -222435 -46786
8660 -45151 42981 -39771 -75894 -92173 -136236 -70609 -249556 106808 25939 280556 175548
8649 175548 91821 68487 129746 253158 -67925 -29139 150347 -400997 -103505 -158323 -602646
8638 -602646 -90479 -181507 -173223 36040 -104120 -95298 -225018 49945 213950 16841 -265325
8626 8996 -12331 60759 245161 98239 -181713 100753 -76373 32058 -349575 -24030 16924
8614 -39984 -302097 -194094 -120778 -160142 -201683 18047 7517 -245183 -73004 22239 -193034
8602 -154339 482187 -187465 -218537 160669 53797 208660 -60442 -191680 23344 52199 -434568
8590 -29853 -129414 -199938 105138 -196679 -96057 2043 102626 -114519 -28102 118596 27956
8578 120389 -82990 -176002 -67568 -459981 -16951 243039 101351 -594899 21785 -154976 -432644
8567 -432644 -187916 -387693 -23580 41426 138008 -442393 237850 120434 524 -19888 430036
8555 -97639 -198842 -63316 -55063 122527 151909 -151860 74594 -26217 -230250 -64904 122775
8543 -294113 -302954 -99762 -63860 -373229 -32023 -314385 422185 -289393 27284 -93126 -80810
8532 -80810 56380 -32938 -206988 -47616 -50224 146426 -166195 -26856 -175515 43110 -273929
8520 -144049 63413 149662 -7254 -4081 85852 34968 -56410 -346428 -191952 11339 -253436
8508 -464008 175348 -148644 206665 259247 20044 13934 -53553 55829 30444 -238870 212236
8496 -34151 -48374 -47018 22378 -378705 -79927 -35847 -160632 70838 -47858 -586460 273410
8484 147086 -207312 -214393 248577 101791 232001 145695 -364256 -63808 -268168 -24529 43744
8472 137991 -65065 -173082 -127914 157242 -166119 162964 -126539 -223761 168297 120995
8462 120995 -346349 -97134 -49191 -100355 -239063 -60134 -177675 82318 134206 132561 -100620
8450 -227330 62937 -72556 114186 -322839 -156546 88444 108520 -27991 209833 -70 -41148
8439 -41148 209502 -78229 -148881 339253 -428467 -484343 -74479 -394590 -5844 33116 -83727
8427 105103 -132552 -65097 -109392 244361 -251850 135460 -261243 -120711 62025 -161901
8416 -368162 -165048 277861 151147 7633 203879 63478 -25555 19341 -176676 -25557 -202670
8405 -202670 -252372 182487 23026 91040 -262697 -320316 -66077 188505 134279 11821 165542
8394 165542 -74032 -220972 -244955 -3912 6791 90459 12658 246449 31689 -218030 62444
8382 34467 187081 34865 -202891 164738 133407 -92639 2057 -227812 -49135 -43696 -3049 -95698
8370 -95698 170236 -98772 -33905 300160 387065 -45980 62273 -400307 -152880 -144146 246839
8358 -135754 300257 -12812 -306009 -171430 -326123 11533 -160204 -48939 -37123 23297 28976
8347 28976 185088 -155992 -364358 33975 129585 -149795 -101627 -50412 -3543 -247162 34147
8335 101509 262014 -91740 -47914 -28721 -104099 -223272 -3136 -147522 -106015 -265277 -216076
8324 -216076 43762 33285 -3425 -79182 218265 27160 141069 -218520 436503 5295 -235379
8312 -46345 -37722 -74401 45051 124879 -218538 -27497 -276665 -192570 -81021 -114168 -70406 -123279
8300 -123279 50562 173559 -47663 -298252 -124712 147014 122510 -91610 -102683 -134187 -280426
8289 -280426 222617 34840 21208 -334035 -25033 -336687 -133240 -245942 38986 -356995
8278 -38670 32750 232323 -9143 -322003 -5793 112330 68585 -48499 171656 -264814 -199586
8267 -199586 -22345 -158544 129026 50274 -289875 198467 -214688 -33424 -172356 -71524
8256 -255223 196487 -441890 -43389 -109843 116184 -153510 -507 137061 -126901 171408 -340550
8244 -58703 65760 193810 22466 -258309 -63389 -460805 62806 -1237 -83616 -69325 -108692
8233 -108692 -32063 -13943 233291 81731 113035 -47617 -23302 -171989 -156692 -155057 -336157
8222 -336157 -548010 63493 -143824 15055 -177608 -400571 81576 114963 -97578 165615 -47095
8210 -26686 -145207 -120959 -84600 35122 126049 169804 -14030 -202841 7922 17234 10293 -84364
8197 -236412 -191639 59715 -63477 85853 -93438 -30624 94603 -244265 -103327 142646 -56849
8185 51334 -370842 -89455 -269650 -242253 33778 -236171 -269135 -74861 175309 -135274 -290905
8174 -290905 279364 46689 244479 -170478 68862 -122457 -145862 156922 -160153 166820
8163 -248550 -320838 -288396 -207652 -25735 -217662 -157035 -141831 -46631 103765 -158403 20323
8151 -163306 -149285 -18144 189904 -351194 84256 -223347 -118097 -241515 42354 172073
8141 172073 -19635 -103109 56082 -32344 -132850 -132669 24941 -74731 67641 186819 -51297 -243274
8129 -243274 -111176 -299853 -80513 -415304 -51220 -138287 -191876 -20910 -69525 7650 -85634
8117 -106087 351502 -41961 -100250 19671 -318673 266185 134414 -154154 43118 29059 -166897
8105 144907 -228241 52933 -17749 -97702 -112662 36238 60974 -77011 233740 82406 -98122
8093 479609 138447 -189004 -348732 110814 -256773 137685 -149711 48645 -114638 -202231
8083 -202231 -233959 -268179 143590 -389383 -28741 -398579 118695 102678 -166539 -16497 67670
8071 -96627 -235778 -5367 -312676 267906 3357 85336 -34143 422123 -197955 -193904 224334
8059 -37110 -3987 85672 10999 34326 -55131 -2482 51663 -128127 -118668 70948 -126570 -250008
8047 -250008 174868 -29718 87436 -166604 -57151 294634 -61617 -36933 -3258 -280811 -145541
8036 -145541 333936 -62786 -205287 141466 -82310 -48068 66467 -178559 54442 -39643 224048
8024 132146 -72502 39066 60602 370144 -189808 -137080 -138719 -74788 73920 -45031 -37572 -119366
8012 -119366 -88365 2573 -222781 189186 -194396 65992 21824 -7072 8440 -262602 -60603
8000 141001 -140829 8288 -64336 -130836 -34131 -139725 -106630 95520 -19631 148424 341587
7989 341587 -52575 156997 -22402 172186 -8646 66578 -107605 -212353 95242 288080 -340729
7977 14776 -15910 -36481 93544 -235635 145870 109616 -311670 -135220 -4214 215941 108498
7966 108498 -328479 118629 14190 123937 -105689 -248890 9928 -217866 -109016 12723
7955 112254 -27653 -27828 -52423 285713 83423 -186615 -82071 112449 -36838 -161163 -252687
7944 -252687 -6638 71264 182923 -86815 181272 -214568 -456211 382713 -252353 -204538 66561
7932 -11790 -417133 -155239 -5275 -235038 -204013 -22543 122729 -195700 73874 150486 -198355
7920 -314401 -195492 -28358 -189909 -182899 261463 -121671 219951 1432 -127515 126687 -147685
7908 -200032 -179779 -140002 -135431 -160736 -70180 -101144 -110938 -398521 -285339 208062 92802
7896 235188 66888 421375 -240777 306820 19058 117576 69836 -74720 155521 -22795 -125627
7885 -125627 -137271 15047 -287993 -20846 -125652 145047 -24339 -123847 -184115 -38407 -70417
7874 -70417 5370 64460 81840 -4182 -214771 2198 -141648 -144344 -268523 -64684 -136889 -249858
7862 -249858 -234306 4751 -81434 -139370 177805 -161356 168200 115156 149346 -337419 -281330
7851 -281330 50290 -198401 -72301 -1155 -136197 -147325 -325609 122727 20915 53426 -378171
7839 21985 -211652 -71981 -414713 -89432 136308 -104947 -106933 183593 -236324 -11974 -106577
7828 -106577 -125114 -178243 -174717 66142 -92632 151136 -195015 148421 -315256 -116226 -175303
7817 -175303 112064 -133069 -28797 -60373 42238 -99807 -418542 -108374 -83384 240885 -438211
7805 99990 -176506 -30510 -58260 -105622 380161 -479732 -103297 -176389 -4990 -25832 -91873
7794 -91873 191740 -367497 -329954 -189230 -43833 -282669 -106029 -162590 91278 -106555 183427
7782 -399928 11454 -25580 -525957 80644 158597 37012 -213204 250044 118022 183650 -17455
7770 -198827 60373 -12951 -274107 -413803 -50441 1379 -127860 9164 -77450 -100306 132296
7758 56213 -22055 25090 -157054 3096 21731 -347455 170742 -272088 -220877 309601 14133
7746 -198649 -249449 -25042 -81698 -235556 202414 113106 45790 189622 -34493 -283346 -310545
7735 -310545 -232419 24135 -6579 121220 -49618 -95419 54792 131372 330633 -417094 -85547
7723 3575 151947 152513 -272378 -64763 153324 79956 214326 7416 211678 230074 147175 -186208
7710 6439 122397 -71494 37491 -37764 157135 -120045 76858 -211184 27751 -71636 158194
7698 -233459 131424 -187579 317321 -45046 -98790 -60615 64389 -169733 161244 291260
7688 291260 268482 177092 -171311 -268005 -95016 50499 -48861 -20059 -167938 34001 352639
7677 352639 -322863 362192 -326716 -271806 -21743 55616 -190327 -246597 -35358 110257 85971
7666 85971 -32065 -98011 -147125 -74410 -185735 -226169 -45717 -103798 -49755 127889 -222874
7654 -317147 -294676 -9426 199182 -132994 -81348 -180950 167082 48281 -157791 -450770 -127994
7642 21387 -129193 171669 90764 -26498 -163513 -243619 80681 -119429 -13421 331728 53443
7630 91159 156154 219915 191506 145259 99657 356142 -153964 114775 53391 201360 -242605
7618 331705 -241510 34249 -140639 -214218 141672 -299660 41558 -136294 -179736 -15060 -335502
7607 -335502 341159 -192562 -92848 276315 189067 67081 -83293 -97185 270170 91137 87565
7596 87565 106050 -100489 -237503 57156 19393 -195345 162082 -148693 -27756 -158178 -89683
7585 -89683 -243788 -308317 109426 -49016 -29538 -37924 -75576 -88651 63585 -229720 272930
7573 -54212 -97980 113837 -116398 -161307 -70472 43969 20114 -98499 214966 -290287 -89117
7561 348492 180275 -78662 -48157 -293357 -224228 309812 148343 -29480 -95628 29096 -39321
7549 142392 -400987 -23039 68607 14460 -226958 139231 22385 65070 -234899 -112199 -39234
7537 -105855 -52629 -59352 -324804 28066 -235931 -219076 -286516 -18418 93383 -22725 54331
7525 34510 105675 -219740 -3216 -349420 9902 -123963 -144351 -298506 -76957 -19771 147878
7513 78444 197189 -35078 -476752 -97590 -362389 -46971 -102874 -217587 -129561 25153 36817
7502 36817 27130 -315517 -103880 46354 -41001 2579 72830 -206311 159674 -212997 86448
7490 -113894 21525 6821 243420 -202892 -125627 -27712 -146190 -62312 -50613 -87482 -44742
7479 -44742 -209321 -41826 -94944 63432 -90142 -160411 165941 -203515 171879 -57050 4781
7467 19415 134170 -152293 168446 182939 -21253 -53901 -551415 -55034 -88077 -73936 -497076
7456 -497076 22355 -279949 -117642 -300094 146227 -38181 68004 91089 -76264 -25226 -370915
7445 -370915 -240573 273975 -286564 24138 -132350 -11906 -111753 -17262 -130835 -80334 263359
7433 -831 -209174 137659 177724 200578 -211411 -310272 2997 -200040 108502 -149857 -134036
7422 -134036 -230861 -164951 -178094 110504 72244 24159 -182439 253546 -82050 70125 26649
7410 -147873 129971 259473 -127281 9081 -305024 226991 174761 58573 -252507 16923 -444641
7398 31817 2410 122017 14229 -166789 40391 145601 120450 17495 -170398 -163712 -34527
7386 180046 177792 -85751 -198764 -132720 62 -97310 108022 386975 112720 224716 188158
7375 188158 99070 -96146 54582 94139 74588 334973 -16151 115459 178746 -359373 224113
7363 -427028 80773 -192208 121534 -271982 119444 -96730 -227544 -207441 -4003 90975 -1740
7351 219899 -123681 -450692 95735 -55531 -87251 -91966 430186 6197 -367875 360967 -77373
7339 96831 105497 -85504 -92274 -190121 -90426 50134 -18001 137466 -270648 -50586 -6778 178239
7326 5009 -127584 130609 -73916 199277 146558 -190475 -128249 -101474 -98018 -219578 -40901
7314 -210408 -378939 128812 71669 -123392 -114212 -18482 -321427 -141110 -244248 -46662 -50816
7303 -50816 10830 3691 -38848 194710 3740 -285815 73136 214776 -104622 -28966 161109
7291 -197582 -320997 201309 -300062 -150151 22698 -13282 -175056 -89673 -39071 203605
7280 211692 -115432 135537 -362955 -46257 201156 42314 -1681 -142048 87859 -77973 29399
7268 79994 -1215 -325999 -56312 178116 175671 285697 -80027 9055 192542 10413 263894
7257 263894 131964 -992 13148 144213 -216998 -171044 -30525 -57160 35382 -125798 -155203
7246 -155203 -156686 46299 210266 -332465 -115342 30534 163970 -192848 274626 -217231
7235 -143152 298295 -269017 110128 -254151 100925 -28239 -112171 -368 -183388 130552 -162396
7223 -36702 81738 433668 -256063 -271832 342985 132827 -445132 -64578 48709 104849 -196281
7211 73169 -75941 -272920 -256222 373128 123827 72022 20032 -315005 -220773 -254950 55065
7199 -70325 470714 -24653 -168169 -67157 -153513 336437 -506234 -515272 185719 -97576 192765
7187 165403 153455 127246 -46784 -137051 -250182 131234 149136 -113401 -44372 21145 251329
7176 251329 201890 36367 -112810 -159349 -483606 -144237 -67350 -298883 470586 70255 282233
7165 282233 123893 -71683 193653 -41945 98139 -79738 -138511 326810 -85640 827 -317121
7153 -12311 176032 127101 48487 -49953 42051 -142658 119133 -203765 -182985 -196039 -331836
7142 -331836 6335 -255553 -214115 -29407 22791 107062 -130962 -25330 -54672 -15727 -164100
7131 -164100 79810 -283153 -54965 58557 -84702 -142416 -298069 18319 -149525 -84381 -34743
7119 -53067 -31279 53890 209870 30385 -280121 -81297 -539654 -171798 284971 40865 -11087
7107 -84935 -72709 116225 127802 -281795 23873 -7161 -86327 159527 77699 -147925 89759
7095 6140 131980 183235 -319742 -347277 -25498 -90204 449085 -322247 -26028 168192 -113106
7083 128594 459497 63662 -273230 112439 28278 94836 -25438 -219579 14201 196214 -97042
7071 178569 -57932 83060 367751 -31682 -118936 92019 -54332 -123865 94216 -237484 77768
7059 -238889 11510 34575 84422 -121006 -13398 -86602 56206 4618 -9486 157616 214424 75828
7046 -6097 204190 -86290 -361796 -46593 68550 -247871 -149986 -108818 284294 36934 -201568
7034 -22034 75784 23702 -196425 -1694 -266786 -112271 116806 329296 -8363 -86454 -157242
7023 -157242 66531 -431595 -153211 176819 185389 -125090 -141158 -144911 -307398 -193683 -245625
7012 -245625 -171582 10325 -764 -337366 112592 49490 -175018 -71039 -73626 -83442 22488 -448441
6999 -79162 -234028 -156581 315011 -82062 -204255 138269 -156673 237315 -246692 -93969
6988 108626 -94999 -30690 -132657 -136493 -199497 -35837 -253029 215810 -52174 168625 -300349
6976 -134971 -64758 100436 -60248 386 248329 -20776 143910 -82251 -202013 -98716 -179085
6965 -179085 -121372 121084 -316615 -108039 165834 -282858 -21771 106605 -67837 52876
6954 15720 68009 -311573 -44193 -107864 -170838 38944 -134072 -188647 115112 109628 -270183
6942 60059 63821 -205444 227039 -328279 -87795 -49810 -391169 -237010 111950 281175 251984
6931 251984 312260 -255887 131105 135203 108309 178819 253359 -239516 37301 112612 194823
6920 194823 -251291 -39554 -67459 138777 219153 46304 -19099 145859 50403 -212029 -339859
6909 -339859 162809 328175 -210644 79871 40979 127614 -49267 -84157 -113871 22109 175315
6898 175315 74399 70480 -25621 -198109 214586 398663 -99735 5071 22023 -148591 248839
6886 220916 7078 -24383 78076 69100 -311212 -53322 -46324 140428 5065 -63383 19743 187076
6874 187076 13946 -182938 202062 338142 -62166 -191441 276076 50860 56047 40856 35189
6863 35189 -12887 -245020 -75342 247187 -113271 11561 261921 -13963 -317619 141492 25947
6851 -13249 217741 -248835 243207 -136020 -39390 -414213 151274 1209 78678 170154 -81483
6839 45839 348378 -80625 42631 -242980 91210 180084 20483 -18579 -69490 -9339 -48632 -350062
6827 -350062 -213422 -248272 118079 -202916 -8414 -378940 -300751 12447 -37484 179402 -107072
6815 82531 7861 73620 42598 105635 -280881 -189609 -43888 -111764 -113370 148945 -292780 -233921
6803 -233921 221507 -362100 443852 58027 -259444 -91422 -210992 188888 -236838 -153669
6793 -153669 -12011 38977 485930 -122843 -70647 -226303 -50704 -503191 59542 396124 159604
6781 -85063 -62207 69961 -94279 -5477 138469 -275238 -116213 66767 960 -28340 -65515 98852
6768 23700 129028 -31190 518841 -80819 43521 -106485 69090 -9965 -135548 -116686 9250
6756 254748 84086 -397789 102102 -222663 -66933 -118057 45463 85930 -154902 -69432 -13734
6744 -64272 259637 -166859 110128 69050 362956 22766 153752 -28142 -94453 241958 250150
6733 250150 -48172 246245 -38389 13807 205762 20891 -31673 190941 158388 58361 -149475
6721 370366 -185804 238456 2704 -76002 -281975 124546 -57377 -9686 -69815 282109 -309647
6709 256121 55190 -151104 -175592 53732 206335 -194743 -251430 -189498 -48069 -151841 -225568
6698 -225568 133600 93077 278952 -56808 118498 404416 96921 -62739 -121702 -190337 -119709
6687 -119709 -229886 217544 53283 -328309 120960 186973 416037 -157776 -195272 -184483
6677 -184483 82162 88832 -226112 183265 98108 -138051 -61684 -200373 -425183 124951 -95915
6665 -112332 -178645 -154410 26679 -31271 -43738 -67548 -277542 -70443 105334 -362173 139783
6653 -7556 219120 60336 -38827 -168489 -207379 72312 185651 23640 28153 101365 11679 -5943
6640 -105716 -200316 -42107 102283 192493 101945 -60360 -103895 -184128 302584 -29013 78388
6628 146722 -37062 100864 -144325 -20811 -180470 -39958 240374 -158857 -13543 109329
6617 135412 -159560 -91082 -30608 32102 -397383 155621 -99068 -134913 99515 -105358 117310
6605 -256801 73109 67381 -98859 203362 63608 -145096 251542 -44791 23506 -151228 -278758
6594 -278758 245502 20081 -290565 69017 310440 8076 -289552 90412 -38897 210500 52372
6582 205886 -123193 2071 -299784 219154 76723 -94812 132845 85377 105027 -34427 138717
6570 -75670 -127242 -79225 107834 193683 -11902 -74443 -98029 -110005 -366459 -206861 -87577
6558 -358909 -56953 -12845 19768 -143024 -108762 -101004 212019 149403 -109342 54252 257808
6547 257808 -32171 -25464 23587 23061 -49423 220167 -366661 -212550 -292221 109761 87495
6536 87495 -47432 80479 -183524 -52045 17010 -90251 25170 89558 177569 11448 14031 -119145
6523 -274616 -89017 183872 -222347 4431 80617 98234 194065 -172741 22425 184160 -165797
6511 118 -36393 22936 135346 -86009 22122 147998 -97825 268703 -257968 -509463 165086
6499 89079 283081 75718 -181995 -136587 218458 325015 48337 -185166 15338 65528 -131691
6487 211394 351573 -173253 -181913 66422 66116 222149 411186 76250 -316451 12176 -165572
6475 -48129 379013 139014 402131 425659 251104 89231 -94117 -114091 -73615 -111753 -175018
6464 -175018 -152925 41041 -472733 -108282 224317 -140692 -195643 194298 -166311 -254546
6454 -254546 76120 238074 54943 -32287 57691 -44134 242187 26973 -141007 51057 134205
6443 134205 281391 70840 -73821 -244921 -171875 -143053 -182544 106800 -305221 -230391 -139394
6432 -139394 -93423 -363456 -70129 294382 45408 -198803 -110776 -280345 18605 117014 -166302
6420 83454 -295517 243259 98121 115232 -47221 345114 172547 194269 -64823 -232195 -186658
6409 -186658 255025 -12014 -67211 -118882 277012 -334903 5388 12629 87797 134736 76648
6398 76648 219099 -13696 212476 266654 -111639 -519504 85105 255533 94072 243095 57189
6386 96900 -295661 -94447 -31900 131745 -160704 46658 -458093 66694 -40509 -289951 241905
6374 5511 -62845 -129698 -53328 -237752 176290 -78076 -32084 42969 233265 123758 -226750
6362 101523 -28359 214264 -133269 163819 -151646 -259664 -176512 -136499 133268 -25916
6351 309156 -66327 -104074 -61033 -133116 -43045 -351267 -80246 -49729 -158775 -107681 -43074
6339 44711 112688 -173271 -95355 58178 107306 -194723 -213224 105467 -376442 163034 75998
6327 98398 -238878 -324169 204354 -20335 189574 -107157 41896 -53370 109474 -331739 -168564
6316 -168564 144304 4988 -172686 51893 -111108 -38486 -101033 159786 -12288 -131308 -165801
6305 -165801 -57269 -22313 -409401 38358 -227578 222701 11149 273366 -27150 15303 60662
6294 60662 -88375 -130147 -40395 347879 85533 241393 -73250 221360 -12101 -19689 -154276
6283 -154276 70222 -78268 100799 163253 -92176 285685 -153553 37776 -626100 -69192 -90188
6272 -90188 448773 183675 -10347 -39297 123752 -7570 -60790 77467 274224 224220 -135277
6260 338558 62615 -222797 166705 177241 351822 292589 96033 29905 1135 27285 6639
6248 -145582 -211644 65791 -160585 192135 119486 -42786 -100742 -118173 181428 610930 -206625
6236 -258281 176561 36219 86649 114910 -139479 21934 -14288 57551 16610 205137 55618
6224 -138673 -183060 9234 -121059 -220072 3937 -18122 -677 354284 -271024 247001 104709
6212 32488 119187 -97088 -130377 192544 -24077 -179066 -93189 73310 -175467 -125593 -290912
6201 -290912 238351 -216663 -46363 70354 396557 196874 -3146 -159345 -79436 55435 28975
6190 28975 -101246 -272970 -22920 -208964 -236355 -30830 -174174 -149170 -26519 76045 -94363
6178 -150840 -1497 -126803 -22501 3610 335517 -70324 -182934 -197816 -27040 -267944 -63353
6166 -278738 269357 -201963 167579 121640 -421328 -121086 274159 -310262 144342 129003
6156 129003 122082 146459 -128230 -45275 177778 -143683 186912 93380 -256998 -427081 193793
6144 -254408 -66972 91161 -35423 128456 -200525 228589 31915 -410657 -220465 -154931 -98083
6133 -98083 27684 -138275 -91198 -146350 214761 -59938 142893 -382041 -6642 22530 -138706
6121 212989 -161765 148680 -10851 70929 10026 67915 -170033 -244720 -244355 -296853 -210163
6110 -210163 -22875 -88942 -163419 79318 39380 63743 -315353 -201346 25630 358164 -134637
6098 -146536 9577 164289 66801 149117 195309 -112025 -129810 -312849 -114820 -154609 -189061
6087 -189061 -88214 34183 209127 -14149 -72068 -29990 -180 -110541 111306 -190701 95364
6075 -62065 -52167 -132219 -330949 -122758 -389403 99321 -38421 -194799 -113999 58722 -73809
6063 -58595 -20160 166784 458106 -201410 -73143 -139387 296882 -74347 -289333 171913 -410737
6051 -189406 -105788 -101050 -195321 -76998 -65557 115465 142517 1853 160753 -215825 -185979
6040 -185979 -44330 -71024 121895 -72058 -174934 -156582 60957 155489 -350535 -78670 -55192
6029 -55192 39538 -99035 -7058 -249930 -17553 -83915 -47876 -297576 23366 -153896 -154460 251906
6016 145432 226751 27112 76591 -11767 79946 32951 82413 -68910 -204159 29089 -218932
6004 -205987 -2983 -143878 71641 -91656 -47875 -225407 306615 49488 216199 -67544 16245
5992 82091 -49290 232275 196602 169731 -10404 75958 -132020 -9069 85991 18390 128543
5981 128543 212589 78914 -118371 158591 -237686 248512 -161485 194469 -175035 118804
5970 -31234 -110625 -172007 273548 248744 -94409 -242463 -54157 449563 293664 -241399 563380
5958 27976 -168030 23984 57440 -165760 -105151 -92056 139056 -263000 -135855 239438 -14896
5946 156774 144340 287614 212224 -257438 -33578 -54823 -39521 -236441 128812 -146150 81204
5934 200977 -22997 243427 409338 -119300 -77964 -92408 489178 -120415 -277686 -261872
5924 -261872 236060 -246162 -424954 161664 116105 47393 330308 31875 -191917 -3434 -241179
5913 -241179 24000 10157 -12072 -35223 -367320 -242171 88206 -199224 15053 -183092 175681
5901 -68119 79490 -59804 65166 63676 62726 37813 -21029 223354 65155 58508 -26543 -97048
5889 -97048 -234500 73275 -134810 -49584 -198709 343662 -160572 -80814 -22201 -64376 123266
5877 -219634 -284355 156806 233219 188305 -112831 -89664 92024 13904 43613 -82199 25183
5865 245694 175569 108542 -186351 -213011 -225890 -83910 -111328 -123871 186887 -265583 235632
5853 -232488 -276883 -58288 321765 -86106 48989 55164 133123 -82436 198993 -237058 86091
5841 -414531 -101610 -63180 137711 -212079 -128605 -276982 -517558 455800 151810 -24092
5830 -285906 -148141 220682 -145778 60726 -15020 -309900 18780 -254412 53664 54249 186874
5819 186874 -259917 299703 13088 -231400 334100 41536 -172927 -117028 1309 129143 146633
5808 146633 143555 128314 227863 -105214 117105 -50607 64861 78869 168230 67952 -26791
5796 -187976 11449 -53021 -186751 328220 197972 90788 -142601 -59003 274091 119985
5785 155009 -167133 222493 98762 115624 -195332 180023 28566 14292 -36468 -97734 40063
5773 337337 -77941 227967 123251 7281 -149369 -114972 74789 46468 -437657 -311404 5639
5761 -199245 -233534 -134585 -195225 -94616 -244300 291432 75546 -2927 -30168 -69973 207606
5749 116843 4070 35294 -200477 -34262 32952 204772 7568 -84486 349806 763 49691 265591
5737 265591 -105399 -83590 125785 519380 -192404 -182942 -125955 1232 -76728 -148402 58362
5725 -162250 55576 202558 26030 -26498 343067 -359543 -29120 45349 -56645 100463 -81177
5713 -237934 285015 49619 -168031 -166709 237554 -224451 -421520 -166615 70900 69827 172725
5702 172725 185488 184906 -234145 231154 -18729 -110927 124594 158811 23495 164375 -59454
5690 277132 -29041 118764 3186 -241794 -34189 -24442 142911 273785 -207873 -37591 162688
5678 -356880 80120 -67013 220744 278816 -168028 -101036 44357 -306146 98416 126294 -100438
5666 31423 -206284 144668 1817 -72597 -174951 63054 261830 342057 187645 -299541 -150472
5655 -150472 30996 80250 -9629 449378 -96237 311937 336137 -62937 -66258 -444762 -163771
5643 199570 316246 12815 250479 316887 -92539 -12263 69656 -28904 366547 305454 135376
5631 108921 -166956 -292609 -307892 40457 215869 19230 -161010 154526 -193312 -301536
5621 -301536 105077 218499 51143 99379 122121 158677 -40064 50560 39698 -241985 269587
5609 318432 -92015 -129840 -275792 -165543 -58469 -99459 -97359 -177248 76986 -257868 151139
5597 -447885 -84784 68120 23680 -36229 -357463 87204 -74397 12266 276688 -173476 -301693
5586 -301693 481224 58020 -30818 -226143 -223383 -30139 126772 -158426 77382 -45880 498750
5574 -186131 178866 -140105 -288521 -171112 488577 -104408 269328 32074 130542 -115844
5563 -40530 -230212 162201 509132 -128543 138965 37438 198082 371924 165154 -52618
5552 -14685 135548 34135 -129402 -66775 -159350 -399183 -79170 24674 -146107 136202 -115656
5540 78029 -212805 91376 -244690 -43309 43382 237126 -215527 110525 142760 -10170 -178901
5529 -178901 -185796 -97870 188311 142516 -218829 28050 -126191 -334688 477795 -255334 160221
5517 -20965 155517 -14435 -47575 -6260 13527 -205833 -93085 96097 -254722 -28637 167957
5505 171513 74166 -16901 -3117 -100440 196790 214315 37246 -83705 -134430 -34176 27115 46371
5493 46371 12776 -213859 -211677 -251848 -210522 -73857 -184846 -87298 359511 -70894 -115368
5482 -115368 -58495 125653 -168799 -129874 -341002 170502 -9112 -131966 167222 -9875 39699
5470 232486 140930 310208 -2008 127088 107349 35956 184908 -278870 57699 188800 86643
5458 -284617 -144785 -450003 34058 42952 -127496 110030 41060 211498 204895 -160379 -135261
5447 -135261 312781 -53596 94832 -54261 -132597 85428 -122283 -127098 161732 -441821 -89298
5435 83085 -214240 130337 -40097 169602 10225 -201575 60572 84314 -179773 -120952 -95608
5424 -95608 68782 -32042 -149578 204662 -14240 -75178 -110093 -186711 -297220 139580 10525
5412 215773 -154716 314855 -300831 205756 -109779 184440 -408729 -7235 -102003 -140192
5402 -140192 -12349 -103398 67632 43813 -62625 107780 77222 -9738 128573 -128796 -301365
5391 -301365 -175011 -86135 -227046 6739 125113 -199484 161526 -87788 -107698 -248681 -178637
5380 -178637 236670 -108817 129292 33508 -32862 -176107 -216593 -21273 -212953 33615 -12725
5368 321751 -62720 436890 -131952 -106532 -65036 -118557 73037 447422 343866 -100346 -268791
5357 -268791 214035 -135584 -41077 125609 25818 -136224 -176453 -9167 43237 -139262 33245
5345 -120876 -174333 177999 -6090 46914 157304 162496 -159615 -152449 -116632 136994 -136067
5333 -113680 -22958 -132401 -2373 41296 52088 148822 -349991 160700 286552 171327 158786
5322 158786 164205 -4771 117773 560444 68443 257821 230423 -23051 -106575 47994 34666
5311 34666 -3163 -271428 -231330 -12246 2698 -87663 118944 13789 -75253 -10604 358707 41241
5298 327660 62724 -133956 223968 -64650 -66210 -205493 10015 209998 11945 43835 -201010
5286 -179593 -81269 -317796 -133395 65066 356255 79463 30496 -171207 -111354 108135 103752
5275 103752 -40340 -150344 -72079 293328 648046 -78573 61006 -27215 -340265 107946 482463
5264 482463 -134330 -213374 67466 -135262 -11755 19884 197065 -8783 -67475 46671 -240760
5252 67146 100665 176038 82174 -204855 34764 -117032 -89253 -1980 -125742 120500 121469 53289
5239 113205 153323 -81081 126331 -121669 -30432 197195 139185 101800 -289309 53624 41331
5228 41331 83421 -45415 -173667 -326953 -80171 87515 59121 128168 -213661 -45644 99711
5216 -148387 -75272 -226050 153401 313246 67260 147530 -27834 277151 -195691 86212 -53433
5204 -144724 -366607 -96804 -344238 97423 -562 -185 -12004 139248 -279170 -85433 -179870 190850
5191 -123232 126109 12834 91051 222178 166287 149745 204259 63902 -47683 39122 276710
5180 276710 -316642 253774 -159862 248269 321996 430637 155605 -121867 -83801 -252729
5170 -252729 -157839 -142648 -122143 39460 -33858 334702 134449 116798 -160470 145705 42003
5158 145189 163124 -148300 36480 71541 -157491 213543 -282088 6582 -118319 -152909 36221
5146 -191393 -36561 -83312 305480 -270406 330879 -92837 344330 -74494 -130544 1218 24832
5135 24832 279365 -144047 310954 -46903 -162192 -208264 157216 450289 -96748 -204897
5125 -204897 -76183 64753 -21238 -47511 61829 -17159 -186804 190223 181838 93801 240296
5114 240296 20608 -114403 -45415 58370 177674 -224087 -508508 192596 -157069 17746
5103 -258096 -252519 -159023 -43361 -25294 143926 228439 149025 -216570 -46328 -27587 -153361
5092 -153361 -13831 33666 5944 -392005 -110578 -68144 389718 -54731 181886 -78464 73709
5080 143432 254851 44510 -57904 -117513 -130576 37969 172255 -207764 55221 -155459 237015
5068 -122824 35808 -65446 23311 -199540 95688 176611 209940 -305613 -151443 -456622 -410956
5057 -410956 -34253 -234717 -15789 50380 519710 178880 229752 -19687 85173 -276893 -63331
5045 51087 39967 84815 157226 30477 -146867 213709 160652 11998 -239472 -163363 -1428
5033 -301219 121854 129244 82017 202515 -43369 156147 47692 169479 -1785 352782 109772
5021 152023 326402 78482 -80221 -231451 -251799 185977 31488 100885 -101165 -125979 -166547
5010 -166547 317358 75726 30096 76281 -1117 -285797 -171753 118761 147581 169832 -135239
4998 45319 154502 -251318 -14544 -28865 -65328 -240375 -241860 94467 5294 -128110 -123495 104020
4985 -226818 10897 145083 -4779 -3786 83884 -46746 228438 -87345 48577 358319 246495
4974 246495 49957 217907 39336 -306323 55955 -1629 -114907 135967 -47632 -27249 54962
4962 145041 -22056 156967 20920 119430 344390 -230857 -447527 173343 -172900 227986
4951 -145599 -114928 64345 237999 -22634 -135820 -181008 -135054 -312614 -13581 -9335 -161514
4940 -161514 27582 -122563 -132810 110792 203049 -130657 -29375 18065 -141381 261249 217072
4929 217072 172648 58363 -200754 -314179 -37619 134527 -54395 -255368 141958 -348676
4918 -74275 -206163 163610 -359008 -347267 -288220 -160806 -101894 353115 5880 196368 169525
4907 169525 -328999 636141 109743 -273929 72416 25131 -233579 -288940 -110696 67310
4896 150686 -99363 173751 -370904 -251461 -221826 -185372 138637 36587 -13703 -251222 -102895
4884 -54055 308085 138113 62801 -92885 220996 -5060 -189098 -228419 -126783 110515 -252397
4872 133556 -117828 462916 86838 10962 471055 -11635 123547 -416600 144606 308552
4862 308552 -23480 -85692 -2923 -87182 29560 154776 78133 9659 -161383 211755 -284303
4850 -140437 5965 132378 329886 -51127 -307280 52359 53392 61724 173775 107725 -139296
4838 -150884 -53681 60466 170330 74705 -30757 84552 255621 244654 34717 -229399 179715
4826 -95817 238190 96803 8620 -98320 -222409 21384 -81505 -232149 184561 27380 -18914
4814 174683 -456195 -17717 347736 -212385 -141685 110865 320810 -216799 224986 -414564
4803 118131 436530 163592 -165177 -110199 58117 116809 120634 88953 -149592 -117488 13800
4791 155070 81644 -182349 16619 -3808 25513 -62981 324978 -147010 254308 -64658 94926
4779 305355 309650 174303 -20285 19036 -54620 -104664 -178110 171647 42378 171755 125667
4768 125667 32043 41108 -223732 -39318 -36395 217780 78162 -106889 -217886 -67144 167884
4756 143694 48700 113088 -29924 30824 294898 225816 20411 -241844 43052 -31085 184979
4744 -126800 -10863 -6653 -2726 -138162 -142329 246945 70068 46661 -92108 -75811 23975 17911
4732 17911 106733 -179317 356171 -10659 101976 18865 124360 -20633 24639 -112337 219432
4720 91011 180917 230016 -61500 152041 124999 87517 77825 6432 -120132 229812 -413223
4708 173001 51748 29805 151491 -106417 -26880 -16875 -201377 90082 -165453 -60456 133456
4696 98425 255204 90937 27363 317949 349140 181672 -39264 138444 -142179 -165305 -129733
4685 -129733 -3149 -161704 -85163 155269 -91958 186722 -46436 -26267 -104517 -81944 -136588
4674 -136588 239467 253443 -35057 278305 -100377 39192 347746 488897 134211 -248328
4663 98758 161783 -24009 -104642 -134299 -135777 887 190281 394524 -167083 -316898 142709
4651 221315 124474 -73465 -123046 -149010 -15757 26698 176968 -369010 -70311 62150 3266
4639 -92962 74280 -18757 -125423 -175594 -99557 -18390 -141070 -199345 -61293 217237 -15666
4627 57192 55899 -263140 -272687 -90959 -43128 -83829 -23820 98369 226773 186292 -66193 -74925
4615 -74925 190546 9608 41899 105018 -183081 200257 -128028 92885 158507 165325 409382
4604 409382 17766 30570 -198278 147962 314623 -3484 -174706 -138572 219103 46288 90762
4593 90762 56282 -196814 -26437 -422740 -254062 76796 -298857 321584 -21267 268767 63272
4581 -29348 135583 173370 177992 231166 -55280 185495 -104075 177209 298462 160408 224492
4570 224492 12008 -8674 -83675 -44751 -25736 53472 176681 -18747 96281 296273 -241121
4558 -141130 -267565 -342018 129387 55282 -247997 304946 -23223 -264528 29949 -21340 185224
4546 -165935 68182 -14547 -24047 193533 102475 260094 -18412 -59968 108990 201577 -179522
4534 -181024 -457312 -304800 -202830 -194816 29019 -212857 -40622 146269 235623 -1579 230857
4522 93071 81033 39456 -43691 183163 59587 154284 13638 -192794 -91563 234809 128755
4511 128755 -275038 -110164 168527 -177326 194967 -75013 99877 48125 245742 -219365
4500 8402 280546 2016 137016 -158112 -84735 -60668 212588 -21885 -308240 171168 -7203
$$ [...]
##END NTUPLES=NMR SPECTRUM
##END=
