
##TITLE=UV1222_M6_1234-1212_10_7231161_mgfaJ3Nj4P
##JCAMPDX= 6.0         $$ Bruker NMR JCAMP-DX V2.0
##DATA TYPE= NMR SPECTRUM
##DATA CLASS= NTUPLES
##ORIGIN= BRUKER
##OWNER= Administrator
$$ 1.72 TOPSPIN		Version 2.1
$$ 2013-01-17 21:02:22.555 -0500  Administrator@X
$$ Compression mode = diff/dup
##.OBSERVE FREQUENCY= 400.02188249412
##.OBSERVE NUCLEUS= ^1H
##.ACQUISITION MODE= SIMULTANEOUS (DQD)
##.ACQUISITION SCHEME= undefined
##.AVERAGES= 8
##.DIGITISER RES= 22
##SPECTROMETER/DATA SYSTEM= spect
##.PULSE SEQUENCE= zg30
##.SOLVENT NAME= COFFEE_meoh
##.SHIFT REFERENCE= INTERNAL, COFFEE_meoh, 1, 14.98509
##AUDIT TRAIL= $$ (NUMBER, WHEN, WHO, WHERE, PROCESS, VERSION, WHAT)
$$ ##TITLE= Audit trail, TOPSPIN		Version 2.1
$$ ##JCAMPDX= 5.01
$$ ##ORIGIN= Bruker BioSpin GmbH
$$ ##OWNER= Administrator
$$ $$ E:\/data/COFFEE/nmr/UV1222_M6_1234-1212_10_7231161_mgfaJ3Nj4P/20/pdata/1/auditp.txt
$$ ##AUDIT TRAIL=  $$ (NUMBER, WHEN, WHO, WHERE, PROCESS, VERSION, WHAT)
(   1,<2013-01-17 21:02:14.555 -0500>,<Administrator>,<X>,<go>,<TOPSPIN 2.1>,
      <created by zg
	started at 2013-01-17 21:01:08.586 -0500,
	POWCHK enabled, PULCHK disabled,
       configuration hash MD5:
       86 BA 57 50 F2 9D 5C 9B 26 00 A9 28 5F 66 2E 89
       data hash MD5: 64K
       EC DC FF 89 5C 2E 67 16 08 B6 55 3C 84 AB 37 13>)
(   2,<2013-01-17 21:02:17.617 -0500>,<Administrator>,<X>,<proc1d>,<TOPSPIN 2.1>,
      <Start of raw data processing
       efp LB = 0 FT_mod = 6 PKNL = 1 PHC0 = 0 PHC1 = 0 SI = 32K 
       data hash MD5: 32K
       E8 00 35 13 02 1B 14 5D E1 2D 13 BD D9 F5 BF 2E>)
(   3,<2013-01-17 21:02:18.071 -0500>,<Administrator>,<X>,<proc1d>,<TOPSPIN 2.1>,
      <pk PHC0 = 96.27319 PHC1 = 0 
       data hash MD5: 32K
       90 C8 BF 20 61 3D 83 A9 E9 44 3D 89 F8 90 68 30>)
(   4,<2013-01-17 21:02:18.289 -0500>,<Administrator>,<X>,<proc1d>,<TOPSPIN 2.1>,
      <abs ABSG = 1 
       data hash MD5: 32K
       08 00 4B 0B 2F 65 E9 16 C3 EB D2 2B 2C 03 9C 1D>)
(   5,<2013-01-17 21:02:18.430 -0500>,<Administrator>,<X>,<proc1d>,<TOPSPIN 2.1>,
      <abs ABSG = 2 
       data hash MD5: 32K
       7C 2C 3F 4F A4 AD 74 48 EF 22 E5 62 72 09 DD 8F>)
(   6,<2013-01-17 21:02:18.571 -0500>,<Administrator>,<X>,<proc1d>,<TOPSPIN 2.1>,
      <abs ABSG = 3 
       data hash MD5: 32K
       F8 04 76 CB 26 30 5C 49 45 B3 DC 70 50 11 A4 2C>)
(   7,<2013-01-17 21:02:18.711 -0500>,<Administrator>,<X>,<proc1d>,<TOPSPIN 2.1>,
      <abs ABSG = 4 
       data hash MD5: 32K
       02 0C 26 18 24 A4 AF 30 7D B7 85 A6 AC 9C EE AE>)
(   8,<2013-01-17 21:02:18.867 -0500>,<Administrator>,<X>,<proc1d>,<TOPSPIN 2.1>,
      <abs ABSG = 5 
       data hash MD5: 32K
       65 43 24 23 79 F6 BA E8 7D AC 33 C1 45 39 3A AD>)
$$ ##END=
$$ 
$$ $$ hash MD5
$$ $$ E8 FB 5C 97 FF 78 75 99 09 3A 96 0E 97 91 3E CE
##$RELAX= 
##$RELAX= 
##$RELAX= 
##$RELAX= 
##$RELAX= 
##$RELAX= 
##$RELAX= 
$$ Bruker specific parameters
$$ --------------------------
##$DU= <E:\>
##$EXPNO= 20
$$ [...]
##$TP= (0..7)
150 150 150 150 150 150 150 150
##$TP07= 0
##$TPNAME0= <>
##$TPNAME1= <>
##$TPNAME2= <>
##$TPNAME3= <>
##$TPNAME4= <>
##$TPNAME5= <>
##$TPNAME6= <>
##$TPNAME7= <>
##$TPOAL= (0..7)
0.5 0.5 0.5 0.5 0.5 0.5 0.5 0.5
##$TPOFFS= (0..7)
0 0 0 0 0 0 0 0
##$TUNHIN= 0
##$TUNHOUT= 0
##$TUNXOUT= 0
##$USERA1= <user>
##$USERA2= <user>
##$USERA3= <user>
##$USERA4= <user>
##$USERA5= <user>
##$V9= 5
##$VALIST= <valist>
##$VCLIST= <CCCCCCCCCCCCCCC>
##$VD= 0
##$VDLIST= <DDDDDDDDDDDDDDD>
##$VPLIST= <PPPPPPPPPPPPPPP>
##$VTLIST= <TTTTTTTTTTTTTTT>
##$WBST= 1024
##$WBSW= 4
##$XGAIN= (0..3)
0 0 0 0
##$XL= 0
##$YL= 0
##$YMAX_a= 631729
##$YMIN_a= -538382
##$ZGOPTNS= <>
##$ZL1= 120
##$ZL2= 120
##$ZL3= 120
##$ZL4= 120
##$ABSF1= 14.98509
##$ABSF2= -5.573092
##$ABSG= 5
##$ABSL= 3
##$ALPHA= 0
##$AQORDER= 0
##$ASSFAC= 0
##$ASSFACI= 0
##$ASSFACX= 0
##$ASSWID= 0
##$AUNMP= <proc_prof1d_extract_pilot.lims>
##$AXLEFT= 0
##$AXNAME= <>
##$AXNUC= <1H>
##$AXRIGHT= 0
##$AXTYPE= 0
##$AXUNIT= <>
##$AZFE= 0.1
##$AZFW= 0.1
##$BCFW= 0
##$BC_mod= 0
##$BYTORDP= 0
##$COROFFS= 0
##$CY= 15
##$DATMOD= 1
##$DC= 0
##$DFILT= <>
##$DTYPP= 0
##$F1P= 0
##$F2P= 0
##$FCOR= 0.5
##$FTSIZE= 32768
##$FT_mod= 6
##$GAMMA= 0
##$GB= 0
##$INTBC= 1
##$INTSCL= 1
##$ISEN= 128
##$LB= 0
##$LEV0= 0
##$LPBIN= 0
##$MAXI= 10000
##$MC2= 0
##$MEAN= 0
##$ME_mod= 0
##$MI= 0
##$NCOEF= 0
##$NC_proc= -8
##$NLEV= 6
##$NOISF1= 0
##$NOISF2= 0
##$NSP= 0
##$NTH_PI= 0
##$NZP= 0
##$OFFSET= 14.98509
##$PC= 1
##$PHC0= 96.27319
##$PHC1= 0
##$PH_mod= 1
##$PKNL= yes
##$PPARMOD= 0
##$PPDIAG= 0
##$PPIPTYP= 0
##$PPMPNUM= 2147483647
##$PPRESOL= 1
##$PSCAL= 4
##$PSIGN= 0
##$PYNMP= <proc.py>
##$REVERSE= no
##$SF= 400.02
##$SI= 32768
##$SIGF1= 0
##$SIGF2= 0
##$SINO= 400
##$SIOLD= 32768
##$SPECTYP= <>
##$SREGLST= <1H.CDCl3>
##$SSB= 0
##$STSI= 32768
##$STSR= 0
##$SW_p= 8223.68421052631
##$SYMM= 0
##$S_DEV= 0
##$TDeff= 65536
##$TDoff= 0
##$TI= <>
##$TILT= no
##$TM1= 0
##$TM2= 0
##$TOPLEV= 0
##$USERP1= <user>
##$USERP2= <user>
##$USERP3= <user>
##$USERP4= <user>
##$USERP5= <user>
##$WDW= 1
##$XDIM= 32768
##$YMAX_p= 467584134
##$YMIN_p= -682644
##$CURPLOT= <Network HP LaserJet P1505>
##$CURPRIN= <$Network HP LaserJet P1505>
##$DFORMAT= <normdp>
##$LAYOUT= <+/1D_H.xwp>
##$LFORMAT= <normlp>
##$PFORMAT= <normpl>
##$SURQMSG= 1
$$ End of Bruker specific parameters
$$ ---------------------------------
##NTUPLES= NMR SPECTRUM
##VAR_NAME=  FREQUENCY,     SPECTRUM/REAL,   SPECTRUM/IMAG
##SYMBOL=    X,             R,               I
##VAR_TYPE=  INDEPENDENT,   DEPENDENT,       DEPENDENT
##VAR_FORM=  AFFN,          ASDF,            ASDF
##VAR_DIM=   32768,         32768,           32768
##UNITS=     HZ,            ARBITRARY UNITS, ARBITRARY UNITS
##FACTOR=    0.250966925370066, 1,           1
##FIRST=     8223.43324360094, -153718,      -5201
##LAST=      0,             59400,           56728
##MIN=       0,             -682644,         0
##MAX=       8223.43324360094, 467584134,    0
$$ Real data points
##PAGE= N=1
##DATA TABLE= (X++(R..R)), XYDATA
$$ [...]
$$ plain form
19561 226135 136927 -205133 -355586 -69145 -72876 43817 381012 -236359 -143044 -77437 -172393
19550 -172393 65645 19523 -398177 299294 -14772 274831 52392 -1634 151723 -111276 -10736
19538 106208 196877 -309796 21588 99797 64020 -47022 -92929 386645 -80238 -63122 108179
19526 -240197 -135244 88685 -231152 -332040 -35651 -112840 -45298 18021 -135969 -329938
19516 -329938 -35576 -37439 126603 -78727 -85553 7350 -127757 -34626 157476 14676 -38133
19504 -487712 38566 -229529 68569 409471 -199177 -269995 -253992 197523 -324150 220765
19493 33313 -66824 67314 -541550 -64294 -125343 -5320 -154670 -13580 -119751 -139539 109670
19481 -25513 6023 96550 -16579 -322761 37031 139424 148654 -156756 126802 -346327 -114032
$$ packed form
19561B26135q9208b05133j50453f9145l731D3817L37195b36359R3315O5607r4956
19550a72393F5645A9523c98177B99294a4772B74831E2392a634A51723a11276a0736
19538A06208R0669c09796B1588P8209l5777d7022m5907C86645h0238J7116A08179
19526b40197J04953H8685b31152j00888c5651p7189d5298A8021a35969j93969
19516c29938c5576j863A26603g8727o826G350a27757c4626A57476A4676c8133
19504d87712C8566b29529F8569L40902a99177p0818J6003A97523c24150B20765
19493C3313f6824F7314e41550f4294o1049e320j49350a3580j06171j9788A09670
19481b5513F023R0527a6579l06182C7031J02393R230a56756A26802c46327a14032
$$ plain form
19469 -21339 -422177 -129710 -116417 -64463 -197266 403330 -449806 62928 -14520 66307 -233686
19457 -65290 -227039 -15602 -28945 114231 -97512 44132 -305742 394867 -266863 -260001 -221704
19446 -221704 -320944 -82469 -41367 -10339 91142 -287794 -102406 -425113 -72445 -42529 -26494
19435 -26494 95414 -152647 26811 -315028 -141914 92471 364909 -6500 58242 -195774 80053
19423 -39165 -215147 -304792 159334 -48602 -339058 124605 -71775 -179221 109327 -109297
19412 203010 -209673 -166587 62509 250279 257430 -67918 -352021 -105209 8104 62866 -198196
19400 -239901 -50556 -110466 20819 148532 -71838 -100189 -171162 -168208 -49147 165558 241411
19389 241411 -7986 -86161 -98556 -226729 -13340 -131293 -42168 -184268 -73415 -105008 -170089
$$ packed form
19469b1339m00838a29710J3293N1954j32803D03330d49806F2928a4520F6307b33686
19457f5290j61749a5602j3343A14231i7512D4132c05742C94867b66863O862L8297
19446b21704r9240h2469M1102a0339I1142b87794a02406l22707g2445K9916J6035
19435b6494I5414a52647B6811c15028a41914I2471K72438f500E8242a95774H0053
19423c9165j75982q9645A59334d8602k90456A24605g1775j07446A09327a09297
19412B03010b09673M3086F2509J87770P151f7918k84103a05209H104N4762a98196
19400b39901e0556n9910B0819J27713g1838k8351p0973K954d9147A65558P5853
19389B41411g986p8175j2395j28173a3340j17953d2168j42100g3415l1593o5081
$$ plain form
19378 -170089 -94953 -59200 -62937 -249857 -145929 -46850 -251642 -69682 -50394 105854 -214640
19366 44213 -145675 122351 -151745 -263267 -129737 -162496 -182062 -349803 -192131 -311811
19356 -311811 -277513 -57897 24317 -31977 -218772 182883 -112897 112461 -178723 103910
19345 64669 -4615 -186 96501 -143070 -422990 12728 -23935 -32481 -101705 39411 -86570 60310
19332 -199770 156473 -57436 -76295 -274706 -306705 -10734 -12265 -140214 -48011 -61845 -70843
19321 -70843 60040 -7373 -200027 187245 -83177 -140210 -138530 17759 -21424 -125877 -4253 233091
19308 -476968 -171400 126795 -60375 -20592 -80563 239119 32483 -172739 -242465 -378782
19298 -378782 -251674 52928 282904 -237679 -200428 96500 209208 -128474 -34700 -171338
$$ packed form
19378a70089P5136L5753l737j86920J03928d6850k04792f9682J9288A05854b14640
19366D4213a45675A22351a51745j11522a29737l2759j9566j67741J57672j19680
19356c11811L4298e7897B4317c1977j86795A82883a12897A12461a78723A03910
19345F4669d615a86I6501a43070k79920A2728b3935q546o9224C9411h6570F0310
19332a99770A56473e7436j8859j98411l1999a0734j531j27949d8011j3834q998
19321g0843F0040g373j92654A87245h3177n7033J680A7759b1424j04453d253B33091
19308d76968a71400A26795f0375b0592n9971B39119C2483a72739o9726j36317
19298c78782J27108E2928K29976b37679L7251I6500J12708a28474c4700j36638
$$ plain form
19288 -171338 -207449 109991 318702 164990 -98365 134383 60762 -106140 -123807 -428325
19278 -428325 22041 -355893 -181398 -209407 -48031 -207045 176421 -280831 298072 104416
19267 -25335 -52097 222652 138222 -16669 -300421 198814 68257 -104663 133764 -202824
19256 -229088 -290066 85040 -98957 -147842 -191872 85951 -367700 66228 -367258 43750 32801
19245 32801 -240452 78168 1984 125988 -98892 -438183 -93348 246412 -79690 13872 -202929
19233 83492 -11919 -239794 -38059 -204790 -57549 199947 -126472 24492 -88406 240630 156767
19222 156767 -184030 -83435 -71156 -78185 -518507 -22089 97514 222287 102866 90351 206910
19211 206910 129807 22544 -30576 46514 80190 -324001 -10608 -23869 69807 14865 127929
$$ packed form
19288a71338l6111A09991K08711j53712i8365A34383F0762a06140j7667l04518
19278d28325B2041c55893J74495k8009d8031j59014A76421b80831B98072A04416
19267b5335k6762B22652q4430a6669k83752A98814F8257a04663A33764b02824
19256b29088o0978H5040i8957m8885m4030H5951c67700F6228c67258D3750j0949
19245C2801b40452G8168A984J24004i8892l39291i3348B46412g9690A3872b02929
19233H3492a1919k27875c8059j66731e7549A99947a26472B4492h8406B40630q3863
19222A56767a84030h3435J2279p029m40322b2089I7514J24773A02866j2515J16559
19211B06910p7103B2544c0576D6514L3676c24001a0608j3261F9807A4865J13064
$$ plain form
19200 127929 55929 -103227 -351218 131650 -328581 113896 -412950 40797 -93350 -411315
19190 -411315 -118106 -8970 -251983 -12070 -194599 -163061 -76835 49399 -153008 -230864 -8752
19178 -204862 10135 -242590 -209773 -272056 -66563 -67806 44984 -120819 -172233 11531 -9250
19166 19741 -440362 -67582 -233315 -8139 -358860 -458010 293078 86399 -157265 -124497 -274981
19155 -274981 -56768 172572 -204349 -307339 -341636 -92497 -199326 62243 202490 86464
19144 -132085 -414356 -17217 -253123 -44048 -116147 -171764 94622 12771 -131251 -73520 90572
19132 -66910 16533 -159370 152665 240172 31476 112009 -149510 288175 -33643 -327490 38666
19120 -80501 -404886 110035 15344 -194170 76743 84234 6052 28252 -139470 -266506 98538
$$ packed form
19200A27929E5929a03227k47991A31650c28581A13896d12950D0797i3350l17965
19190d11315a18106h970k43013a2070j82529L1538g6835D9399a53008p7856h752
19178b04862A0135b42590L2817o2283f6563j243D4984a20819n1414A1531i250
19166A9741d40362f7582j65733h139l50721r9150B93078H6399a57265L2768j50484
19155b74981e6768A72572b04349j02990l4297i2497j06829F2243J40247H6464
19144a32085k82271a7217k35906d4048p2099n5617I4622A2771a31251N7731I0572
19132f6910A6533a59370A52665Q7507C1476Q0533a49510B88175c3643k93847C8666
19120h0501l24385A10035A5344a94170G6743P491F052K2200a39470j27036I8538
$$ plain form
19108 -139336 -306156 -238190 125148 104002 -198386 -80485 -275448 -163084 -108874 -251008
19098 -251008 -59213 84897 -140186 324849 -76487 -274291 -2965 250221 210782 -190448 -65541
19086 -157168 243982 -384382 -66681 172509 110808 -458203 -75527 9234 -32456 -124755 -72513
19075 -72513 -130951 -228650 -154276 -252834 -495 -13601 -102342 -249640 136946 -84130 -97531 -216346
19063 -216346 96287 76943 -48328 42291 -397488 -360927 -144484 31576 44967 264663 -51759
19051 -96346 56599 105910 -275434 -215951 -65700 16404 -274408 167847 -25694 251566 -208824
19039 -249183 196343 -207742 -221490 214847 -348297 150850 -74670 -56724 803 120747 48180
19027 203109 70874 205344 212539 291885 152215 -159988 189698 131291 512205 19720 33950
$$ packed form
19108a39336j66820O7966A25148k1146a98386h0485j94963J12364N4210j42134
19098b51008e9213H4897a40186C24849g6487j97804b965B50221l9439a90448f5541
19086a57168B43982c84382f6681A72509o1701d58203g5527I234c2456r2299N2242
19075g2513n8438r7699P4374r8558d95j3106q8741j47298A36946h4130j3401j18815
19063b16346I6287j9344d8328D2291c97488L6561a44484C1576J3391K19696e1759
19051i6346E6599M9311b75434N9483f5700A6404b74408A67847b5694B51566b08824
19039b49183A96343b07742j3748B14847c48297A50850g4670J7946H03J19944D8180
19027B03109G0874J34470P195P9346j39670a59988A89698n8407L80914A9720J4230
$$ plain form
19016 33950 97658 152363 229737 -67363 -9923 -59484 -1317 -92877 73850 -76649 73916 -140990
19003 -244491 -92485 120199 -96172 -135267 -5774 -52169 -98795 -76369 212218 -180756 -24529
18991 -98643 184818 -221897 -193988 -159872 -179712 -291007 -23997 -131343 39232 -227820 188140
18979 169924 -369449 -181848 -309809 442094 271677 -75291 -138340 32453 182745 -293093
18968 -183908 -30923 -420585 154034 -29796 -180212 -131835 34140 -50190 62340 -54698 -231673
18957 -231673 -167797 55261 -173917 165731 -209644 -49088 124205 -326387 -356783 -151498
18946 -288178 -201399 -184639 -285111 -58359 -50261 -369463 -196441 -20952 -6370 -231286 68776
18934 36741 -258341 259735 -7137 -112421 -220093 -362238 -50547 -117828 220726 -65755 -77462
$$ packed form
19016C3950O3708N4705P7374f7363i923m9561a317r1560G3850g6649G3916a40990
19003b44491i2485A20199i6172l9095e774m6395m6626K2426B12218a80756b4529
18991i8643A84818b21897K7909L4116j9840j11295b3997j07346C9232b27820A88140
18979A69924c69449a81848j27961D42094j70417g5291o3049C2453J50292b93093
18968a83908c0923l89662A54034b9796j50416M8377C4140e0190F2340e4698j76975
18957b31673O3876E5261a73917A65731b09644d9088A24205c26387l0396a51498
18946b88178Q6779J6760j00472e8359Q098l19202J73022b0952f370k24916F8776
18934C6741b58341B59735g137j05284j07672j42145e0547o7281B20726f5755j1707
$$ plain form
18923 -77462 -55991 -203893 -330919 236183 -80351 309965 137895 -205706 31516 99725
18913 99725 105584 -124095 95777 83769 -236079 -225853 263007 -39382 -258391 -441351 194201
18901 58407 289656 -89012 -46210 -229501 123504 191436 -221443 -244467 -257206 -117006 147642
18889 53676 86969 364513 220757 100612 -6786 -111263 -186407 -137612 123369 187899 -33570
18877 106220 -110753 85372 -307565 -19798 28045 -136920 -125610 280156 -104879 -142190
18867 -142190 49792 156482 62574 -302890 62902 188029 -111043 -13497 122151 148646
18857 148646 -18274 -449494 -147631 -134681 168696 -53506 -66319 182219 -58443 -3317 169963
18845 130260 -393910 -285518 38281 46051 138108 374512 -52545 -67209 192664 170146 42107
$$ packed form
18923g7462K1471j47902j27026B36183h0351C09965A37895b05706C1516O8209
18913I9725N859a24095I5777j2008b36079J0226B63007c9382k19009j82960A94201
18901E8407K31249h9012M2802j83291A23504O7932b21443k3024j2739a17006A47642
18889E3676L3293K77544j43756A00612f786j04477p5144M8795A23369O4530c3570
18877A06220a10753H5372c07565a9798B8045a36920J1310B80156a04879l7311
18867a42190D9792J06690F2574c02890F2902J25127a11043a3497A22151K6495
18857A48646a8274m31220a47631J2950A68696e3506j2813A82219e8443c317A69963
18845A30260c93910J08392C8281P770R2057K36404e2545j4664A92664k2518D2107
$$ plain form
18833 72938 -115503 -61700 -171691 -193466 23075 -338866 -36603 137313 247102 -61474 -337619
18822 -337619 103277 297127 37189 -160723 -165189 285346 -179567 -112559 305327 -244835
18811 -177378 -7129 140785 41184 -204863 -77945 -229939 -91679 34147 294652 179361 14544
18799 264865 -52325 -101046 119071 950 335464 -252330 -132975 -171655 -189043 -97554 -85823
18788 -85823 131622 -5837 -260459 -3290 70450 -20097 54919 -235948 -175894 -165611 -236963
18777 -236963 135512 276309 -174537 102938 -249455 -12295 -38352 144164 90601 -246990
18766 -464114 -366864 191955 51217 24843 89055 -220778 -301541 254467 -255921 24049 241651
18755 241651 -196512 -19091 -72728 6931 67680 144007 -375527 -189336 -201595 -82195 -277385
$$ packed form
18833G2938a15503N3803j09991k1775B3075c38866c6603A37313J09789f1474k76145
18822c37619A03277J93850C7189a60723m466B85346a79567O7008C05327b44835
18811a77378g129A40785D1184b04863g7945j51994i1679C4147K60505j15291A4544
18799B64865e2325m8721A19071I50L34514b52330J19355l8680j7388R1489J1731
18788h5823A31622e837k54622c290G0450b0097E4919b35948O0054J0283p1352
18777b36963A35512J40797a74537A02938b49455a2295k6057A44164n3563b46990
18766d64114R7250A91955E1217B4843O4212b20778q0763B54467b55921B4049K17602
18755B41651a96512a9091n3637F931O0749P6327c75527J86191j2259h2195j95190
$$ plain form
18744 -277385 -90290 81138 43067 -419456 -195966 192186 12237 -29265 15483 -261515 -114385
18732 -179394 -122087 -240438 -2208 133765 49561 -85516 -4194 -38125 219082 -142821 -113898
18721 -113898 150420 -291509 98750 90099 -6733 133682 -407563 97136 -146684 139003 -139986
18709 -233568 -265730 -181004 19107 5936 50859 120835 28564 -195330 -200371 -172437 108421
18697 -175190 -123471 445870 139020 -187074 -332062 -284400 -371573 -2990 -337640 -246801 74927
18685 -45128 -107270 -65157 261299 -170885 73987 -138018 -128626 154575 -158562 -11811 -2634
18673 -216187 42563 73915 34761 -80845 -201198 182721 -333611 -14458 -127652 61353 -106796
18661 -300890 -383732 244200 -257925 83332 -125718 -420552 260544 30930 54133 20271
$$ packed form
18744b77385i0290H1138l8071d19456a95966A92186A2237b9265A5483b61515a14385
18732a79394N7307j18351b208A33765D9561h5516d194l3931B19082a42821K8923
18721a13898A50420b91509I8750q651f733A33682d07563I7136a46684A39003a39986
18709b33568l2162Q4726A9107E936M4923O9976B8564a95330n041K7934A08421
18697a75190N1719D45870A39020a87074j44988M7662q7173b990l34650R0839G4927
18685d5128o2142M2113B61299a70885G3987a38018R392A54575a58562a1811b634
18673b16187D2563L1352C4761h0845j20353A82721c33611a4458j13194F1353a06796
18661c00890q2842B44200b57925H3332a25718k94834B60544C0930K3203B0271
$$ plain form
18650 -92772 -250802 -191210 18059 -16944 -17462 -26204 -274314 -136510 94093 -200567 25300
18638 -144882 -35198 -189301 322824 -146748 163760 -30658 -119329 -235338 -276679 -269139 -85481
18626 -152825 79219 -282324 117696 8943 -236272 192905 44410 -133702 -40220 -70778 -127905
18615 -127905 -39453 -216667 118314 129976 272655 46382 -312348 -431358 -55062 145007
18604 14639 37298 -255078 -11408 -186301 84306 -117008 -116288 -77425 75534 -11718 -223987
18593 -223987 -99296 -315687 -271837 44985 -334368 109575 -286665 4249 -76670 26460 -145377
18581 141138 -75168 -25571 159253 206568 -28858 -446 -1866 41260 -301236 234563 104270
18569 301948 66577 27080 177236 -65837 -90389 -77949 286138 -352458 -45328 -331812 -275321
$$ packed form
18650i2772j58030N9592A8059a6944n18q742k48110a36510I4093b00567B5300
18638a44882c5198j54103C22824a46748A63760c0658q8671j16009m1341P540h5481
18626a52825G9219b82324A17696H943b36272A92905D4410a33702d0220l0558n7127
18615a27905c9453j77214A18314J1662J42679D6382c12348j19010e5062A45007
18604A4639K2659b55078a1408j74893H4306a17008P20L8863G5534a1718k12269
18593b23987i9296k16391M3850D4985c34368A09575b86665D249g6670B6460a45377
18581A41138g5168b5571A59253M7315b8858d46j420D1260c01236B34563A04270
18569C01948F6577B7080J50156f5837k4552J2440B86138c52458d5328k86484N6491
$$ plain form
18558 -275321 -333525 -250232 -94460 35665 333537 -278171 -18588 -207317 -234390 -380768 217137
18546 -242131 -148979 -220933 -422576 -88315 -96368 -155645 -54185 189531 -352755 51275 -349809
18534 -168185 167507 73320 192187 -14164 -153823 -311083 -193874 -81494 68977 122897
18524 122897 226059 204698 -198655 -244957 28124 -1972 -50 -453560 -134122 205236 -95269
18512 62644 172178 6918 85191 -135080 345683 231571 74591 125720 -71632 -71337 -51612
18501 -51612 -220113 -234123 -99165 -116704 383238 4397 -42560 -374062 -53017 -73228 102892
18489 -477621 172492 -59717 -113031 -114805 -344790 64454 12940 87167 -177844 54196 198992
18478 198992 331445 215766 370663 32814 -17205 -18832 -259102 186484 300356 119236
$$ packed form
18558b75321n8204Q3293i4460C5665K97872b78171a8588j88729k7073j46378B17137
18546b42131R3152p1954k01643h8315q053n9277e4185A89531c52755E1275c49809
18534a68185A67507G3320J18867a4164j39659j57260J17209h1494F8977N3920
18524A22897J03162k1361a98655m6302B8124a972e0m53510a34122B05236i5269
18512F2644J09534F918P8273a35080C45683j14112G4591N1129g1632K95J9725
18501e1612j68501j4010i9165j7539C83238D397d2560l31502e3017k0211A02892
18489d77621A72492e9717n3314j774k29985F4454A2940P4227a77844E4196J44796
18478A98992J32453j15679J54897C2814a7205j627k40270A86484J13872A19236
$$ plain form
18467 -213308 -275721 33227 -16190 -18103 -180038 -162991 20783 -140745 389 -177788 347129
18455 57951 -301341 -569060 -405632 -87987 1604 45364 176892 -290956 24326 -29296 7949
18443 92316 79406 123656 74079 -176337 -91877 89126 -120279 121006 -77907 -179663 -328809
18432 -328809 126755 -9915 3256 32281 390920 -81954 62752 122932 -350751 -12296 -130019
18421 -130019 139853 34516 -325852 -61242 -3330 -317346 37683 -319164 -60066 -216691 1912
18409 80778 91539 -123251 -657 35602 498294 -11169 372076 -132225 -383183 -22513 30635
18397 203545 196130 -18316 -125505 -23976 -60167 -4243 205220 -67480 57887 68770 -326594
18385 -272359 -216851 -259769 -82757 46419 -3866 294879 -63541 -337202 -156593 -11768 -22073
$$ packed form
18467b13308o2413C3227a6190j913j61935J7047B0783a40745C89a77788C47129
18455E7951c01341k67719J63428h7987A604M3760J31528b90956B4326b9296G949
18443I2316j2910M4250m9577a76337Q4460H9126a20279A21006g7907j01756j49146
18432c28809A26755i915C256K9025L58639h1954F2752O0180c50751a2296j17723
18421a30019A39853C4516c25852f1242c330l14016C7683c19164f0066j56625A912
18409H0778J0761a23251f57C5602M62692a1169C72076a32225k50958b2513C0635
18397B03545p415a8316j07189b3976l6191d243B05220f7480E7887J0883c26594
18385b72359N5508m2918h2757D6419c866B94879f3541k73661a56593a1768j0305
$$ plain form
18374 -22073 -223918 -242226 50750 61514 -37615 -140754 -44000 -112212 -2533 -102132 -41379
18362 200899 -380630 60359 -391263 149776 28461 241352 199477 -56431 29775 -55149 -182881
18351 -182881 -308391 84516 48176 197424 -209890 -23664 -329748 -250132 -292054 35650 -142571
18339 57380 78027 62969 170632 -44713 265089 13722 -3093 35423 71018 103566 16255
18327 85429 331143 -336965 164820 -216926 -150476 79944 -281790 101187 29921 89965
18317 89965 -80328 210953 -434843 -26536 9281 -71127 -429399 -106525 219401 -52631 -87275
18306 -87275 196635 148430 -96870 23881 -58707 -182242 116435 -48692 25956 -155742 -36713
18294 -68137 -297013 -29304 -79988 -7295 -87846 44965 -76583 -12604 -13626 -40095 -154055 -193268
$$ packed form
18374b2073k01845j8308E0750J0764c7615j03139d4000o8212b533r9599d1379
18362B00899c80630F0359c91263A49776B8461K12891m1875e6431B9775e5149j27732
18351a82881j25510H4516l6340J49248b09890b3664l06084P9616m1922C5650a42571
18339E7380K0647j5058J07663d4713B65089A3722c093C5423L5595L2548A6255
18327H5429K45714c36965A64820b16926O6450G9944b81790A01187B9921O0044
18317H9965h0328B10953d34843b6536I281g1127l58272a06525B19401e2631l4644
18306h7275A96635m8205i6870B3881e8707j23535A16435d8692B5956a55742c6713
18294f8137k28876b9304n0684g295q0551D4965g6583a2604j022k6469j13960l9213
$$ plain form
18282 -193268 -195193 -32265 -30377 -142425 -154398 -34338 -208189 -14166 -43757 192236 351405
18271 351405 209748 -197734 212566 24659 125981 -92391 375507 -79786 -78849 -278032 -25001
18259 24283 232918 -439854 79295 -143614 178108 -91220 -141367 -29174 50159 -218013 54806
18247 -202925 -16795 -70219 -107836 -150646 -464740 -177387 118675 134720 -132619 411468
18236 85084 -197135 -121569 190281 17843 -149744 -222905 80604 -100626 -325622 102023
18225 31724 271809 64123 172242 38308 -140626 -214221 -86519 -133535 -135807 -44449 -309115
18214 -309115 63861 64643 -197162 177567 214642 375630 326472 189886 -252563 232218 24708
18202 -87543 51209 50545 13957 -145052 260679 -149801 -235058 -273619 129070 -250996 -26773
$$ packed form
18282a93268j925c2265J888j12048j1973c4338j73851a4166k9591A92236J59169
18271C51405j41657a97734B12566B4659J01322i2391C75507g9786R37j99183b5001
18259B4283K08635d39854G9295a43614A78108i1220n0147b9174E0159b18013E4806
18247b02925a6795n3424l7617m2810l14094a77387A18675J6045a32619D11468
18236H5084a97135P5566A90281A7843a49744p3161H0604a00626k24996A02023
18225C1724K40085F4123J08119C8308a40626p3595h6519m7016k272d4449k64666
18214c09115F3861P82a97162A77567L7075J60988m9158j36586b52563B32218B4708
18202h7543E1209o64A3957a45052B60679a49801q5257l8561A29070b50996b6773
$$ plain form
18190 -5919 292741 -55541 195520 -102800 -158292 -398461 20433 62166 -202516 -205092 54960
18178 3319 -210826 -47840 -110695 -168704 -221760 -213618 79210 -326756 -429431 -330701 -188641
18167 -188641 252284 68961 -85317 17375 -15351 -96255 -63646 -161927 97535 -80183 -113244
18156 -113244 -37492 -40599 -176750 -292155 67595 -194870 -8467 -117349 -298533 64108 -183296
18144 25234 315924 -121126 -36806 345865 -35659 197440 -148328 -80873 -86586 196360 -313589
18132 -157713 -3450 -52426 54511 -441 28357 -482286 -72855 -104469 -60212 58438 -260656 -56388
18119 -198440 -124967 140812 -226954 -136492 -46617 155397 317021 -136078 -184607 141052
18108 -247429 -65757 -18571 54907 -263322 -17031 120570 -74205 91680 -491627 -71604 -23954
$$ packed form
18190e919B92741e5541A95520a02800n5492k40169B0433M1733b02516k576E4960
18178C319b10826d7840o2855n8009n3056Q142G9210c26756j02675R8730J42060
18167a88641B52284F8961h5317A7375a5351q0904L2609r8281I7535h0183l3061
18156a13244c7492l107j36151j15405F7595a94870h467j08882j81184F4108a83296
18144B5234K90690a21126c6806C45865c5659A97440a48328O7455n713A96360c13589
18132a57713c450m8976E4511d41B8357d82286g2855l1614M4257E8438b60656e6388
18119a98440P3473A40812b26954R0462d6617A55397J61624a36078m8529A41052
18108b47429f5757a8571E4907b63322a7031A20570g4205I1680d91627g1604b3954
$$ plain form
18096 -62827 -52054 -144674 443467 -2936 87810 422665 -79241 -76961 42952 -16397 191515
18084 23055 -12812 -220126 266643 -146121 -7542 193425 -183012 197943 20789 30119 105033
18073 105033 218004 -14077 6097 -148555 -337592 36323 -54147 -182225 -155659 -215114 49644
18061 -267933 -58095 157258 257302 -13628 126628 -201213 -15379 136374 -291208 114195
18050 37949 131961 -258553 148326 33664 68203 97993 337517 -42947 102289 -115317 -149477
18039 -149477 -124922 -106996 19473 -47859 -118285 6789 -284698 282248 -29416 -45059 -30713
18028 -30713 172988 188760 179231 -186872 19020 128562 -308938 143667 -106069 205299
18017 90410 -446612 26680 -66456 49592 302349 -106085 -113483 6281 126547 -106663 -310903
$$ packed form
18096f2827J0773r2620D43467b936H7810L34855g9241K280D2952a6397A91515
18084B3055a2812k07314B66643a46121g542A93425a83012A97943B0789R330P4914
18073A05033J12971a4077F097a48555j89037C6323e4147j28078K6566n9455D9644
18061b67933e8095A57258J00044a3628A26628b01213a5379A36374b91208A14195
18050C7949R4012b58553A48326C3664L4539K9790K39524d2947A02289a15317l4160
18039a49477K4555J7926A9473d7859p0426F789b84698B82248b9416j5643J4346
18028c0713A72988J5772r529a86872A9020J09542c08938A43667a06069B05299
18017I0410d46612B6680f6456D9592K52757a06085p398F281J20266a06663k04240
$$ plain form
18006 -310903 -171393 -433138 -566 134209 -56911 144099 -86916 185753 190551 -328972 -96384
17994 -206791 -41188 -2952 95311 -598 162592 -20099 -90621 32451 12688 34278 -431251 -107203
17981 -108485 96878 63137 140258 -55401 -222203 167321 -9772 -24160 168548 66496 201133
17970 201133 -277111 -252540 -197806 -15306 -289175 -221064 92032 104736 -51012 96278 -62545
17958 -176863 -209363 -100017 -242787 -53453 -57826 243166 3313 5220 14868 108753 -153267
17946 -71461 -201033 -93949 -405397 7640 68430 -93852 197560 -199169 -200755 27263 -79718
17934 168868 -173939 -61607 207553 228124 -50750 -182579 76221 40328 26460 -112192 24452
17922 -38394 82892 -134781 165665 -62395 -60025 181434 -409271 -115830 98701 -319649 313406
$$ packed form
18006c10903J39510k61745e66A34209e6911A44099h6916A85753M798c28972i6384
17994b06791d1188b952I5311e98A62592b0099p0522C2451A2688K1590d31251a07203
17981a08485I6878l3741P7121e5401j66802A67321i772j4388A68548F6496J34637
17970B01133b77111K4571N4734a5306k73869O8111I2032J2704e1012I6278f2545
17958a76863l2500a00017j42770e3453m373B43166C313J907R648R3885a53267
17946g1461j29572i3949l11448G640O0790i3852A97560a99169j586B7263g9718
17934A68868a73939f1607B07553K0571e0750j31829G6221l5893j3868a12192B4452
17922c8394H2892a34781A65665f2395K370A81434d09271a15830I8701c19649C13406
$$ plain form
17910 229527 -79575 -83075 -294197 212745 -280555 -300076 -22395 523 152581 -110797 29262
17898 -292749 -195013 72539 -113893 182398 64389 18609 199560 100640 359594 -113080
17887 -116538 -45939 -309946 47095 -144348 -315809 -39744 -158226 -172351 159376 -130893
17876 98265 157209 -189804 -158069 -88092 -11800 -384615 414485 -192896 -138216 -148912 -231463
17865 -231463 -280652 -163402 -83469 85094 45702 102885 -227981 -131015 146536 21702 67929
17854 67929 -294264 195989 -125609 128731 -12214 -91805 -64156 -286742 24692 166660
17844 166660 -213866 332023 -386125 -207061 133762 27903 -185744 272437 144151 206874
17834 206874 -5473 -186469 244077 -68906 -67414 160695 191987 167781 -31460 359738 -132856
$$ packed form
17910B29527g9575l500k11122B12745b80555j9521b2395E23J52058a10797B9262
17898b92749R7736G2539a13893A82398F4389A8609J80951r8920K58954a13080
17887a16538d5939k64007D7095a44348j71461c9744j18482j4125A59376a30893
17876I8265N8944a89804L1735O9977a1800l72815D14485a92896N4680j0696q2551
17865b31463m9189J17250P9933H5094l9392N7183b27981R6966A46536B1702M6227
17854F7929b94264A95989a25609A28731a2214p9591K7649k22586B4692J41968
17844A66660b13866C32023c86125J79064A33762B7903a85744B72437j28286O2723
17834B06874e473j80996B44077f8906J492A60695L1292k4206c1460C59738a32856
$$ plain form
17822 -22921 43621 -250978 68359 -133463 211301 -236166 -224429 -63959 -60388 -98376 -136841
17811 -136841 -94621 96430 7832 -281796 -254032 320362 35709 415787 27258 214692 -117456
17799 -264262 81603 74534 -62664 -483759 -46122 126547 147288 -89478 -122645 184513 -83959
17787 -160782 -141356 -176396 28667 -55975 84810 -256976 447792 182378 66455 -80551 -135053
17776 -135053 295531 20388 -32663 7157 61021 155688 164554 285750 -226704 141195 238051
17765 238051 -391879 -144551 217041 137889 -46021 738 -40893 -263679 -22070 135185 94645
17754 94645 -66764 951 -222942 -303176 -141311 -94429 209033 321783 -74179 15251 -196918
17742 380956 -284518 105177 441931 143633 375667 96759 34016 -132880 -68611 95656
$$ packed form
17822b2921D3621b50978F8359a33463B11301b36166J1737f3959L571l7988l8465
17811a36841M2220I6430G832b81796K7764C20362C5709L80078B7258J87434a17456
17799b64262H1603p069f2664m21095d6122A26547K0741h9478l3167A84513h3959
17787a60782J9426l5040B8667e5975H4810b56976D47792A82378F6455h0551n4502
17776a35053B95531B0388c2663G157N3864R4667Q866J21196b26704A41195R6856
17765B38051c91879a44551B17041p9152d6021G38d0893k22786b2070A35185m0540
17754I4645f6764I51b22942q0234a41311M6882B09033J12750g4179A5251a96918
17742C80956b84518A05177L36754A43633K32034I6759C4016a32880O4269I5656
$$ plain form
17731 -88008 -26297 -260637 -203882 24782 104455 215866 289428 202996 -409540 -159065 -321193
17720 -321193 -11372 237724 272187 126083 50799 -59498 -53752 100825 -44195 75309 189091
17709 189091 -203501 -51327 -218232 174406 191889 121749 -140621 -21844 37490 327749
17699 327749 393596 -71910 -111183 -183884 40207 -314270 237739 -127667 -146135 73318 -75703
17687 43756 280046 102152 151237 11971 44603 132170 -15449 84745 337795 -37186 -348038
17676 -348038 -69375 7636 274507 -155076 209045 -13902 -37784 -188635 -178383 -68054 135023
17664 542 -110588 -147961 -161377 28082 -6895 113502 56839 -52830 -160734 -174615 -127773 171444
17651 233288 -269168 -157504 336764 190322 -296277 -369340 -190673 26888 -389582 -38124
$$ packed form
17731h8008b6297k34340N6755B4782P9673J11411P3562q6432d09540a59065j62128
17720c21193a1372B37724L4463A26083E0799e9498N746A00825d4195G5309J13782
17709A89091b03501e1327j66905A74406J7483p0140a40621b1844C7490K90259
17699C27749O5847g1910l9273p2701D0207c14270B37739a27667j8468G3318g5703
17687D3756K36290A02152M9085A1971L2632Q7567a5449H4745K53050c7186l10852
17676c48038f9375G636K66871a55076B09045a3902k3882j50851J0252f8054A35023
17664E42a10588l7373j3416B8082f895A13502n6663e2830j07904j3881M6842A71444
17651B33288b69168J11664C36764j46442b96277p3063J78667B6888c89582c8124
$$ plain form
17640 -42206 -33937 -18027 108216 19077 393013 214257 -83026 -99505 213349 64348 -176050
17628 -66119 94514 109423 -25502 117384 47352 -33901 -168620 -13017 23229 -16549 -67124
17617 -67124 -29656 -300643 -154229 26857 5535 -11128 29648 254422 -199686 206705 -129565
17605 123864 -110854 108672 162712 -182159 39107 120693 -120798 -254157 -104929 -10476
17594 14109 223270 -21258 -191671 -4518 311918 243618 -97802 284773 246778 -9630 2976
17582 -46174 24748 55317 -2666 -27230 152598 116702 124982 157140 220061 -362223 138694
17570 202570 84707 93578 278365 50084 34476 393356 -134122 220892 182099 282899 -17549
17558 23491 -79743 -162632 83554 166852 111471 -92224 -114112 290739 -195255 272377 63301
$$ packed form
17640d2206Q269J5910A08216A9077L73936j78756h3026j6479B13349F4348a76050
17628f6119I4514J4909b5502A17384D7352c3901j34719a3017B3229a6549n0575
17617f7124b9656k70987J46414B6857E535a1128B9648K24774a99686B06705a29565
17605A23864a10854A08672N4040a82159C9107Q1586a20798j33359a04929a0476
17594A4109K09161b1258j70413d518C11918o8300i7802B84773l7995i630B976
17582d6174B4748L0569b666k4564A52598l5896Q280L2158O2921c62223A38694
17570B02570H4707Q871J84787E0084j5608L58880a34122B20892l8793J00800a7549
17558B3491g9743q2889H3554Q3298n5381i2224k1888B90739a95255B72377F3301
$$ plain form
17546 -182650 -145773 -78123 71821 -39694 -12371 -137326 -8152 -62655 -44113 123228 -82466
17534 -39414 -57560 65716 29620 376227 120583 -67549 312939 286138 291665 130264 172446
17523 172446 85782 290026 65885 85649 -247405 248754 98487 198497 129240 117042 404105
17512 404105 115370 -120430 -57077 232932 -28256 -40134 66292 -296948 146679 210049
17502 210049 193694 -57009 93001 119885 215371 380378 124795 -26020 234330 -47368 -76907
17491 -76907 199341 293662 1695 -12969 23316 -153990 48091 -234490 -57006 108864 17650
17479 -168713 121534 627755 52779 -322095 189443 -94810 263342 173606 68706 359713
17469 359713 96612 -131442 299798 -274279 174222 87859 150762 118399 -183298 208899
$$ packed form
17546a82650L6877O7650G1821c9694a2371j24955h152n4503J8542A23228h2466
17534c9414j8146F5716B9620L46607A20583f7549C12939k6801N527A30264M2182
17523A72446H5782K04244F5885J9764b47405B48754I8487J00010o9257j2198K87063
17512D04105A15370a20430e7077B32932b8256j1878F6292b96948A46679O3370
17502B10049j6355e7009I3001K6884R5486J65007A24795b6020B34330d7368k9539
17491g6907A99341R4321A695a2969B3316a53990D8091b34490e7006A08864A7650
17479a68713A21534N06221E2779c22095A89443i4810B63342q9736F8706K91007
17469C59713I6612a31442B99798b74279A74222q6363O2903l2363a83298B08899
$$ plain form
17458 100178 -29996 265578 -144117 232957 -6339 119186 -1735 472850 -124611 -135823 222452
17446 201534 81733 258597 -22123 117372 540495 49861 146792 202473 77351 -57897 60681
17434 219892 455351 23322 -20515 454864 252988 15478 164368 288413 46161 314487
17424 314487 240124 430849 312264 358020 294504 341169 287332 249772 339636 332226 210025
17413 210025 40421 271713 57652 564480 29976 243440 185982 396788 381386 21218 143634
17402 143634 274724 319637 374061 68201 109787 148575 112167 141147 533753 236196 266519
17391 266519 172428 201611 647155 282074 -207342 316724 10436 186679 239380 3210 -37031
17379 216406 229035 190560 17843 299187 430804 -285878 256273 216318 195485 482666
$$ packed form
17458A00178b9996B65578a44117B32957f339A19186a735D72850a24611j1212B22452
17446B01534H1733J76864b2123A17372M23123D9861R6931N5681G7351e7897F0681
17434B19892K35459B3322b0515D54864k01876A5478J48890J24045D6161K68326
17424C14487p4363J90725j18585M5756o3516M6665n3837l7560Q9864p410j22201
17413B10025D0421K31292E7652N06828B9976K13464n7458K10806j5402B1218J22416
17402A43634J31090M4913N4424F8201M1586L8788l6408K8980L92606B36196L0323
17391B66519r4091K9183M45544B82074b07342C16724A0436J76243N2701C210c7031
17379B16406J2629l8475A7843K81344J31617b85878B56273l9955k0833K87181
$$ plain form
17369 482666 58334 63906 -62156 292184 88760 200271 47216 84722 -11290 -65473 141900
17357 67301 186710 165926 -192261 359211 271027 82180 126422 98519 27945 168167 -14735
17345 6594 302204 57464 123751 279192 70227 -92260 209176 99160 1338 62337 -90143
17333 232509 253213 378545 319892 220995 176572 165446 171308 346977 -146860 -124767 145767
17321 110289 146812 -161673 -21003 65668 248118 173258 122995 334312 293295 61518 219395
17310 219395 -91927 177516 63081 108329 64265 -126086 304402 355253 165783 381133
17300 381133 -35250 -2888 -189 33748 291283 114588 197301 -59757 49822 55299 172276 -43344
17287 -5460 190869 -62081 350570 494900 140828 -26841 151457 -84863 261861 449847
$$ packed form
17369D82666E8334N572f2156B92184H8760J11511D7216L7506a1290n4183A41900
17357F7301J19409k0784a92261C59211q8184H2180M4242k7903B7945J40222a4735
17345F594K95610E7464O6287J55441G0227i2260B09176I9160A338O0999i0143
17333B32509K0704J25332n8653r8897m4423j1126N862J75669a46860K2093A45767
17321A10289L6523a61673b1003F5668J82450p4860n0263K11317m1017F1518J57877
17310B19395i1927A77516F3081M5248m4064a26086C04402N0851A65783K15350
17300C81133c5250b888a89C3748K57535A14588Q2713e9757D9822N477J16977d3344
17287e460A90869f2081C50570J44330A40828b6841A51457h4863B61861J87986
$$ plain form
17277 449847 -244817 109110 351951 183511 102232 -178234 -54721 78362 199851 70147
17266 405928 192687 -17885 101625 60165 339117 211156 27860 285127 6322 95535 268589
17255 268589 10893 92673 333267 141557 146717 364042 -355271 306541 435318 181707
17244 34519 433135 64824 308100 -5221 259977 347084 69947 -43951 21443 437533 -76935
17232 -171951 144476 105799 -111201 37856 -140214 216836 136154 110555 103559 -22929 217410
17220 3688 142455 241960 113874 283650 69328 89051 -21458 -67884 -85893 348434 237887
17209 237887 -39830 257473 199441 162085 321943 391623 -283581 360645 37169 489154
17199 489154 284708 294465 147538 -114723 137494 392328 156149 256690 344129 388638
$$ packed form
17277D49847b44817A09110K42841j68440q1279a78234e4721G8362J21489G0147
17266D05928A92687a7885A01625m1460K78952j27961B7860K57267F322Q9213J73054
17255B68589A0893Q1780K40594A41557N160K17325c55271C06541J28777A81707
17244C4519L98616F4824K43276e221B59977Q7107F9947d3951B1443M16090g6935
17232a71951A44476l8677a11201C7856a40214B16836q0682k5599o996b2929B17410
17220C688J38767R9505A13874J69776F9328J9723b1458m6426j8009C48434j10547
17209B37887c9830B57473n8032l7356J59858O9680b83581C60645C7169M51985
17199D89154k04446R757j46927a14723A37494K54834A56149J00541Q7439M4509
$$ plain form
17189 388638 -142729 134046 61083 269073 150247 22984 226975 267712 142025 345188
17179 345188 296422 -109119 651402 310160 270597 154007 345909 237623 30526 360893
17169 360893 256922 677292 479749 558867 228098 508065 132092 337339 408691 273471
17159 273471 185978 225170 298923 406553 183078 -19011 377648 146247 366133 448914
17149 448914 71556 373150 466040 485304 228025 154202 472093 85124 274409 211702 229961
17138 229961 238600 428309 118608 75548 309809 102745 297610 139602 476561 616386
17128 616386 261860 265913 89492 329466 324881 214570 65309 432059 56724 244096 463496
17117 463496 393043 466365 141869 399443 251303 612073 314307 464774 615555 505150
$$ packed form
17189C88638a42729A34046F1083K07990j18826B2984K03991M0737j25687K03163
17179C45188m8766a09119F51402C10160l9563j16590J91902j08286C0526L30367
17169C60893j03971M20370j97543P9118B28098K79967A32092K05247P1352j35220
17159B73471q7493L9192P3753J07630A83078a9011C77648A46247K19886Q2781
17149D48914G1556L01594R2890J9264B28025p3823L17891H5124J89285o2707J8259
17138B29961Q639J89709A18608m3060K34261A02745J94865A39602L36959J39825
17128F16386B61860M053H9492K39974m585j10311F5309L66750E6724J87372K19400
17117D63496p0453P3322A41869K57574j48140L60770k97766J50467J50781j10405
$$ plain form
17107 505150 300325 268882 83176 225893 173167 484704 491073 611065 -133363 324509
17096 667633 300741 220549 475538 628369 748341 587272 670109 140864 234416 991793
17086 991793 139518 284097 587951 266407 587481 322057 755234 681528 431477 482027
17076 482027 18078 362932 166460 198349 135518 472374 400655 323373 382816 81626 581841
17065 581841 718777 338293 390765 467729 358585 395996 771524 546675 58596 521031
17055 521031 627231 545138 415147 88164 660883 534710 573362 568448 339806 682987
17045 682987 195792 561009 416860 475599 627901 336708 699484 500270 553674 567427
17035 567427 416751 515844 600669 529738 636715 356223 29066 337828 372157 291945 732956
$$ packed form
17107E05150k04825l1443H3176J42717n2726L11537O369J19992a33363C24509
17096F67633C00741q0192K54989J52831J19972j61069Q2837A40864R3552P57377
17086I91793A39518J44579L03854B66407L21074k65424M33177p3706k50051N0550
17076D82027A8078L44854A66460L1889o2831L36856p1719p7282N9443H1626N00215
17065E81841J36936C38293N2472P6964j09144L7411L75528k24849E8596M62435
17055E21031J06200q2093j29991H8164N72719j26173L8652m914k28642L43181
17045F82987A95792L65217j44149N8739J52302k91193L62776j99214N3404J3753
17035E67427j50676R9093Q4825p0931J06977k80492B9066L08762L4329q0212M41011
$$ plain form
17024 732956 545529 503572 231024 529136 647880 514860 625626 678842 427820 546761
17014 546761 260364 636951 464184 316195 888048 589280 398566 305703 633647 622930
17004 622930 573499 319442 752925 620398 609740 429547 578940 506059 1007003 769228
16994 769228 680387 1041653 874624 744314 361259 552561 978895 910844 406263 654273
16984 654273 1324376 477128 501774 804863 735433 789515 728704 624761 597965 1057191
16974 1057191 1054547 608890 689026 658992 1092829 1005568 610527 845620 922533 668973
16964 668973 499569 1258928 725374 1008121 935941 1000675 779593 1045325 1025330 893646
16954 893646 697877 1185104 998750 710532 1372460 1326573 856619 999424 902136 921443
$$ packed form
17024G32956j87427m1957B31024K98112J18744j33020J10766N3216k51022J18941
17014E46761B60364L76587j72767j47989N71853k98768j90714r2863L27944j0717
17004F22930m9431k54057M33483j32527j0658j80193J49393p2881N00944k37775
16994G69228q8841L61266j67029j30310C61259J91302M26334o8051D06263K48010
16984F54273O70103D77128K4646L03089o9430N4082o0811j03943k6796M59226
16974A057191k644m45657Q0136l0034M33837q7261l95041K35093P6913k53560
16964F68973j69404P59359n33554K82747p2180O4734k21082K65732j9995j31684
16954H93646j95769M87227j86354k88218O61928m5887m69954J42805r7288J9307
$$ plain form
16944 921443 1126564 1112582 1004578 1010874 1097591 1092342 899967 940292 817911 1234849 1143419
16933 1143419 1251424 1093615 823342 1265196 1323724 1205494 1382067 1187033 1079600 1181072
16923 1181072 936525 1228916 1286895 1064027 1083658 1486808 1456414 1114162 1251038 1375926
16913 1375926 1595004 1661252 1156851 1351365 1387456 1505057 1205482 1761333 1519484 1887144
16903 1887144 1333641 1361983 1788466 1294834 1458209 1427869 1908464 1452666 929473 1681387
16893 1681387 1544349 1568053 1649323 1804987 2007930 1948490 1508802 1987848 1974892 2013474
16883 2013474 1804211 1950577 2150576 1765862 2025936 2089007 2038830 2003313 2256054 1632452
16873 1632452 2162896 2279711 2597362 2072905 1684289 2516419 2456708 2355706 2297944 2191971
$$ packed form
16944I21443K05121j3982j08004O296Q6717n249j92375M0325j22381M16938r1430
16933A143419J08005j57809k70273M41854N8528j18230J76573j95034j07433J01472
16923A181072k44547K92391N7979k22868J9631M03150l0394l42252J36876J24888
16913A375926K19078O6248n04401J94514L6091J17601k99575N55851k41849L67660
16903A887144n53503K8342M26483m93632J63375l0340M80595m55798n23193P51914
16893A681387j37038K3704Q1270J55664K02943n9440m39688M79046j2956L8582
16883B013474k09263J46366J99999l84714K60074O3071n0177l5517K52741o23602
16873A632452N30444J16815L17651n24457l88616Q32130n9711j01002n7762j05973
$$ plain form
16863 2191971 2342088 2408894 2345910 2298909 2748537 2650312 2669000 3032145 2917543 2816421
16853 2816421 2690332 2392631 2777924 2815148 3093569 2852425 3218838 3105507 3332546 3265889
16843 3265889 3364019 3392104 3146895 3315369 3578140 3323146 3447061 3588942 3674160 3718778
16833 3718778 3729869 3827958 3736585 4037103 3774436 4232333 4067794 4366391 4221040 3999248
16823 3999248 4143502 4354889 4718170 4925233 4868482 4732777 4982755 5261924 5240588 5148177
16813 5148177 5390249 5576937 5489915 5771282 5821672 5841166 5875115 6387427 6451123 6346927
16803 6346927 6781077 6997793 7100579 6916215 7338352 7450549 7559223 7932346 7951775 8520191
16793 8520191 8329135 8880604 8957937 8904829 9566011 9886886 9491788 9687642 10288067 10418613
$$ packed form
16863B191971J50117O6806o2984m7001M49628r8225J8688L63145j14602j01122
16853B816421j26089k97701L85293L7224K78421k41144L66413j13331K27039o6657
16843C265889R8130K8085k45209J68474K62771k54994J23915J41881Q5218M4618
16833C718778J1091R8089r1373L00518k62667M57897j64539K98597j45351k21792
16823C999248J44254K11387L63281K07063n6751j35705K49978K79169k1336r2411
16813E148177K42072J86688q7022K81367N0390J9494L3949N12312O3696j04196
16803F346927M34150K16716J02786j84364M22137J12197J08674L73123J9429N68416
16793H520191j91056N51469P7333n3108O61182L20875l95098J95854O00425J30546
$$ plain form
16783 10418613 11052147 11218179 11568113 12033130 12203938 12628538 12643059 13210274 13566466
16774 13566466 14118814 14813389 14997763 15494226 16172802 16504259 17404481 17915490 18674189
16765 18674189 19081593 19990801 20657025 21619254 22267363 23096322 24229025 25196285 26023397
16756 26023397 27743785 28575323 29844508 31177726 32427396 34019781 35443658 37392551
16748 37392551 39042375 41380340 43344968 45801285 47878777 51048385 53965640 56561336
16740 56561336 59911054 63601038 67321681 71671940 75951689 80373378 85795844 90894084
16732 90894084 97078783 103076468 109671502 116428259 123783792 131149488 139050922 146787740
16724 146787740 154588643 162430883 169979089 176818496 183269581 188853390 193188949 196169770
$$ packed form
16783A0418613O33534J66032L49934M65017J70808M24600J4521N67215L56192
16774A3566466N52348O94575J84374M96463O78576L31457R00222N11009P58699
16765A8674189M07404R09208O66224R62229O48109Q28959J132703R67260Q27112
16756B6023397J720388Q31538J269185J333218J249670J592385J423877J948893
16748C7392551J649824K337965J964628K456317K077492L169608K917255K595696
16740E6561336L349718L689984L720643M350259M279749M421689N422466N098240
16732I0894084O184699N997685O595034O756757P355533P365696P901434P736818
16724A46787740P800903P842240P548206O839407O451085N583809M335559K980821
$$ plain form
16716 196169770 197822555 198332289 197189197 194789632 191068165 185882098 180022214 173049594
16708 173049594 165794872 157473663 149867367 141889521 133799156 125684570 118591010 111363667
16700 111363667 105034754 97760777 91921446 86609536 81158316 76368507 71646180 67430688
16692 67430688 63700393 59940783 56537862 53537079 50501935 47762511 45317781 42836895
16684 42836895 40764543 38744420 36804077 35039245 33444027 31604896 30491663 29002567
16676 29002567 27862214 26546426 25363703 24228849 23590072 22074820 21312797 20571682
16668 20571682 19609719 19005959 18345307 17777472 17078800 16232619 15709717 15648121 14691644
16659 14691644 14327310 13873667 13285444 12790883 12633570 12180474 11864265 11544417 11046163
$$ packed form
16716A96169770J652785N09734j143092k399565l721467n186067n859884o972620
16708A73049594p254722q321209p606296p977846q090365q114586p093560p227343
16700A11363667o328913p273977n839331n311910n451220m789809m722327m215492
16692F7430688l730295l759610l402921l000783l035144k739424k444730k480886
16684D2836895k072352k020123j940343j764832j595218j839131j113233j489096
16676B9002567j140353j315788j182723j134854o38777j515252p62023p41115
16668B0571682r61963o03760o60652n67835o98672q46181n22902o1596r56477
16659A4691644l64334m53643n88223m94561j57313m53096l16209l19848m98254
$$ plain form
16650 11046163 10910230 10377870 9873683 9434856 9270359 9274764 9153704 8925882 8557001 8354416
16640 8354416 8199041 7777749 7441212 7008705 7302487 7015872 7204295 6554617 6684778
16631 6684778 6270043 6181241 6118761 5940457 5895569 6054813 5470799 5602071 5491737 4917604
16621 4917604 5210169 5260394 5074906 4925529 4954610 4644019 4491279 4579669 3970494 4285882
16611 4285882 4305505 4171131 3790988 3899373 3844299 3698118 3799651 3718094 3727545 3491439
16601 3491439 3550466 3391457 3519020 3264284 3138974 3153963 3020111 2685631 3153451 3153095
16591 3153095 2598532 2828753 2985514 2582148 2633797 2580205 2651940 2660451 2633239 2569195 2831993
16580 2831993 2183740 2255351 1910794 2014818 2282172 2291721 2291357 2124034 2087481 2072221 2197621
$$ packed form
16650A1046163j35933n32360n04187m38827j64497M405j21060k27822l68881k02585
16640H354416j55375m21292l36537m32507K93782k86615J88423o49678J30161
16631F684778m14735q8802o2480j78304m4888J59244n84014J31272j10334n74133
16621D917604K92565N0225j85488j49377K9081l10591j52740Q8390o09175L15388
16611D285882J9623j34374l80143J08385n5074j46181J01533q1557R451k36106
16601C491439N9027j59009J27563k54736j25310J4989j33852l34480M67820l56
16591C153095n54563K30221J56761m03366N1649n3592P1735Q511k7212o4044K62798
16580B831993o48253P1611l44557J04024K67354R549l64j67323l6553j5260J25400
$$ plain form
16569 2197621 2007005 2008385 1632308 1919095 2081008 1888303 2002818 1844796 1911545 1437867
16559 1437867 1797538 2027459 1984229 1914473 1535887 1529082 1582163 1945162 1701175 1420418
16549 1420418 1511896 1324226 1576467 1630767 1581450 1458137 1404206 1475638 1215649 1334175
16539 1334175 1341864 1379504 1442406 1187694 1390268 1276331 887999 1310186 1194458 1169707
16529 1169707 1201651 1009050 1294134 1371081 990685 1214126 1192111 1454627 1240440 1036763
16519 1036763 1116976 841668 892674 845274 1054865 1132490 1238283 1012269 967150 902579
16509 902579 904022 1046340 1162941 753074 888122 915078 641630 811977 1051286 980108
16499 980108 884423 1337338 735861 715488 665281 1000109 1000901 834538 747261 878361 821472
$$ packed form
16569B197621j90616J380l76077K86787J61913j92705J14515j58022O6749m73678
16559A437867L59671K29921m3230o9756l78586o805N3081L62999k43987k80757
16549A420418R1478j87670K52241N4300m9317j23313n3931P1432k59989J18526
16539A334175P689L7640O2902k54712K02574j13937l88332M22187j15728k4751
16529A169707L1944j92601K85084P6947l80396K23441k2015K62516k14187k03677
16519A036763Q0213k75308N1006m7400K09591P7625J05793k26014m5119o4571
16509I02579J443J42318J16601m09867J35048K6956k73448J70347K39309p1178
16499I80108r5685M52915o01477k0373n0207L34828P92j66363q7277J31100n6889
$$ plain form
16488 821472 868750 755486 603012 1014103 958511 779325 829214 512986 810496 510284
16478 510284 885391 523020 796499 693879 722300 589510 719790 595855 785516 537911
16468 537911 352405 798285 403798 810368 666125 416377 339994 429265 1155467 488440
16457 505758 549643 643033 634115 612333 529746 49132 784530 696556 791374 129477 612764
16446 612764 484175 738783 613993 542928 418111 846838 531958 339315 564280 425649
16436 425649 245235 597208 836029 395588 795647 247269 507751 206732 409865 685542
16426 685542 482993 594162 506023 181400 451928 569714 408693 763021 411583 413303
16416 413303 507016 432830 476075 241978 517990 292151 227604 298151 176158 556828
$$ packed form
16488H21472M7278j13264j52474M11091n5592j79186M9889l16228K97510l00212
16478E10284L75107l62371K73479j02620K8421j32790J30280j23935J89661k47605
16468E37911j85506M45880l94487M06570j44243k49748p6383Q9271P26202D88440
16457E05758M3885R3390q918k1782q2587D9132P35398q7974R4818A29477M83287
16446F12764j28589K54608j24790p1065j24817M28727l14880j92643K24965j38631
16436D25649j80414L51973K38821C95588M00059B47269K60482B06732K03133K75677
16426F85542k02549J11169q8139A81400K70528J17786j61021L54328l51438J720
16416D13303R3713p4186M3245k34097K76012k25839o4547P0547j21993L80670
$$ plain form
16406 556828 651651 12941 440996 227083 135762 533135 232684 288680 66674 -98821 314555
16394 245940 222261 371851 379214 270881 547173 98971 91976 236635 497359 180702 -36982
16382 301167 436231 731068 122937 107682 185657 118152 173123 383205 230128 46686
16371 13277 73483 303805 192762 275724 656294 264409 398889 443393 668714 99251
16360 -38584 197011 480444 -39235 431370 290110 -165838 447556 125469 146780 166695
16350 166695 453174 128144 339649 259607 102380 472662 -91514 227063 240849 92544
16339 -52048 260941 259905 146594 216481 122602 517212 256285 218509 -35083 -73945 250136
16327 134770 75814 -277845 257706 317537 60937 263809 35048 -61569 -148546 132958 417333
$$ packed form
16406E56828R4823A2941M28055k13913r1321L97373B32684N5996F6674i8821C14555
16394B45940k3679J49590P363j08333K76292I8971o995J44659K60724A80702c6982
16382C01167J35064K94837A22937j5255P7975o7505N4971K10082j53077D6686
16371A3277O0206K30322j11043Q2962L80570B64409J34480M4504K25321I9251
16360c8584A97011K83433c9235D31370j41260a65838D47556A25469K1311J9915
16350A66695K86479A28144K11505q0042A02380L70282i1514B27063J3786I2544
16339e2048B60941j036j13311O9887r3879L94610B56285l7776c5083l8862B50136
16327A34770n8956b77845B57706N9831F0937K02872C5048f1569q6977A32958K84375
$$ plain form
16316 417333 248014 -389214 131796 231387 145466 393906 81149 83202 283543 25798 -30837
16304 238435 123464 208577 249599 145559 219009 -42443 324353 379547 -26835 133380 544573
16293 544573 333958 241958 299533 263019 34759 60271 219188 -52507 241387 161968 128408
16282 128408 199842 405891 195067 137544 264428 321867 98682 108160 35904 304201 535874
16271 535874 66180 707 32579 266717 256230 404817 407971 42373 3899 271572 370515 341098
16259 341098 26427 331773 346104 103119 89503 193297 418452 131046 -4133 399461
16248 245171 222340 173185 238110 235220 32125 158328 -65182 190685 -89867 -41320 313439
16236 215648 -79997 -76920 -142677 433662 -22989 33461 20436 -27 374608 -234721 -41956 -167687
$$ packed form
16316D17333j69319c89214A31796R9591q5921K48440H1149K053K00341B5798c0837
16304B38435j14971Q5113M1022j04040P3450d2443C24353N5194b6835A33380M11193
16293E44573k10615r2000N7575l6514C4759K5512J58917e2507B41387p9419l3560
16282A28408P1434K06049A95067n7523J26884N7439I8682R478C5904K68297K31673
16271E35874F6180G07L1872K34138j0487J48587L154D2373C899K67673R8943k9417
16259C41098B6427L05346J4331A03119j3616J03794K25155A31046d133C99461
16248B45171k2831m9155O4925k890C2125J26203f5182A90685h9867d1320C13439
16236B15648g9997L077o5757D33662b2989C3461j3025b7C74608b34721d1956j25731
$$ plain form
16224 -167687 202040 181286 354348 -76697 311104 -356840 367537 -57018 242595 303311
16214 303311 -35923 292604 361776 82553 195182 29048 -26043 78511 141106 18128 303137
16203 303137 -221394 -54298 71089 -80912 -159991 135060 360349 -156003 40349 290850
16193 290850 68223 -97683 -178657 6964 -70804 36531 95239 -169390 -81366 -25143 154437
16181 -85791 50626 -133113 -31191 -107401 -130487 -72011 158754 18825 383988 -361868 168653
16169 20755 291056 288879 -44186 -14124 58100 -118589 -173406 -235523 115549 -117479 100271
16157 -155200 -254211 -42557 7169 187567 449413 348524 20835 -164247 212895 -160307
16146 -280733 35073 -237709 -136612 51890 50945 -163869 25320 64420 200868 172408 3735
$$ packed form
16224a67687B02040k0754J73062g6697C11104c56840C67537e7018B42595O0716
16214C03311c5923B92604O9172H2553J12629B9048b6043G8511O2595A8128K85009
16203C03137b21394e4298G1089h0912p9079A35060K25289a56003D0349K50501
16193B90850F8223i7683q0974F964g0804C6531N8708a69390h1366b5143A54437
16181h5791E0626a33113c1191p6210k3086N8476A58754A8825L65163c61868A68653
16169B0755K70301k177d4186a4124E8100a18589n4817o2117A15549a17479A00271
16157a55200r9011d2557G169J80398K61846j00889B0835a64247B12895a60307
16146b80733C5073b37709J01097E1890r45a63869B5320L9100J36448k8460C735
$$ plain form
16134 -165477 16732 21578 -2239 120423 -268945 271795 -176161 91599 -19994 124567 -6657
16122 -27183 -43493 14382 -51285 321379 376759 120177 -47626 152144 146301 -186537 -60811
16110 -217247 61079 58946 -108178 -84438 127210 47232 314796 406076 180297 -94603 98054
16098 405253 198159 -17998 11181 172243 162812 -4430 14413 -38303 319197 -167726 -248581
16087 -248581 13989 -38964 124090 -4925 538434 108181 29519 -134637 63669 -60173 -34958
16076 -34958 288696 -50215 128213 -142 -83714 36222 94458 -53291 -240246 48581 -153913
16064 59488 -178143 -20202 -69968 280674 -260155 41966 110795 -230797 -75599 16528 -166447
16052 170143 -116701 -67563 68040 79384 -125857 221960 298948 235293 -220412 -279566 17870
$$ packed form
16134a65477A6732M846b239A20423b68945B71795a76161I1599a9994A24567f657
16122b7183j6310A4382e1285C21379N5380A20177d7626A52144n843a86537f0811
16110b17247F1079k133a08178K3740A27210D7232K67564R1280A80297i4603I8054
16098D05253A98159a7998A1181J61062r431d430A4413c8303C19197a67726q0855
16087b48581A3989c8964A24090d925E38434A08181B9519a34637F3669f0173K5215
16076c4958B88696e0215A28213a42q3572C6222N8236e3291j86955D8581a53913
16064E9488a78143b0202m9766B80674b60155D1966O8829b30797g5599A6528a66447
16052A70143a16701M9138F8040J1344a25857B21960P6988o3655b20412n9154A7870
$$ plain form
16040 -180674 245771 -82533 -14611 39330 -37456 -6159 344197 88758 38643 237233 -303856
16028 -583768 167262 -36894 175796 -83658 -44799 -58443 -135700 -12805 -271843 -375363 -270878
16017 -270878 -341168 -94237 -154831 125472 375209 -58997 96670 216628 -121066 -99471 123154
16005 38091 -330904 125634 186061 -23537 341641 12452 -25337 134261 -186367 -242001 -186699
15994 -186699 -76777 -39229 117206 -13650 -190077 -147744 342867 17072 -187476 1578 64992
15983 64992 13470 289226 155690 342657 -52775 95154 176617 -83520 -95084 -148233 -20341
15971 75489 151839 -17944 -159608 -2401 -160615 81253 216249 -236517 -123529 -27034 140759
15959 -547994 94528 -144072 105640 -177063 -117921 -267826 4431 70979 -65683 -59113 207716
$$ packed form
16040a80674B45771h2533a4611C9330c7456f159C44197H8758C8643J98590c03856
16028e83768A67262c6894A75796h3658L8859j3644p7257a2805k59038j03520J04485
16017b70878p0290i4237o0594A25472K49737e8997I6670J19958a21066K1595A23154
16005C8091c30904A25634O0427b3537C41641A2452b5337A34261a86367n5634N5302
15994a86699g6777L7548A17206a3650j76427M2333C42867A7072a87476A578O3414
15983F4992A3470K75756j33536J86967e2775I5154Q1463h3520j1564n3149b0341
15971G5489P6350a7944j41664b401j58214H1253J34996b36517J12988b7034A40759
15959e47994I4528a44072A05640a77063N9142j49905D431O6548f5683O570B07716
$$ plain form
15947 -20177 -56839 -271542 197423 9780 169170 -114949 -86340 -30544 -291939 -61614 -51770
15936 -51770 191576 191368 -30748 -180211 174199 -87809 -58076 -202181 -89251 139249 -51110
15924 -50061 -43148 112481 78136 64616 -100831 -150699 -325271 -167242 325993 -120980 -147217
15913 -147217 102962 -86603 340727 -533981 -29255 54378 21463 -251506 72392 305948
15903 305948 -117889 -180555 231442 53647 29183 -211771 228163 8687 25049 -138366 -235897
15892 -235897 -210457 101475 -124114 128889 -30356 62611 -236458 -131320 185300 -160287
15881 339757 -54940 296943 -85302 -317755 -238619 118142 -207428 197445 138906 -249097
15870 889 -343199 -150824 -261785 -12870 -136958 47254 -55592 -180162 227579 -145605 173391
$$ packed form
15947b0177l6662k14703A97423I780J59390a14949K8609c0544k61395f1614R844
15936e1770A91576k08c0748j49463A74199h7809K9733j44105h9251A39249e1110
15924e0061O913A12481l4345j3520a00831m9868j74572J58029C25993a20980k6237
15913a47217A02962h6603C40727e33981b9255E4378B1463b51506G2392K33556
15903C05948a17889o2666B31442E3647k4464b11771B28163H687J6362a38366r7531
15892b35897K5440A01475a24114A28889c0356F2611b36458J05138A85300a60287
15881C39757e4940B96943h5302k32453P9136A18142b07428A97445n8539b49097
15870H89c43199a50824j10961a2870j24088D7254e5592j24570B27579a45605A73391
$$ plain form
15858 -193847 -16732 -151319 -75424 28098 -286121 -175815 -7465 164858 44911 -106269 -139088
15847 -139088 -94161 37166 -153598 -234509 -71902 40459 -91895 -311995 219063 -447548 136915
15835 -196371 -117571 -89464 38445 109436 -117321 63387 -118173 63082 -153681 -124856 -104091
15824 -104091 -100733 -343202 45446 -268228 -219340 -114508 -230648 -228438 302032 58339 -301958
15812 63738 -326645 -104084 -177569 -311724 -263151 -83287 75689 -242275 135297 -145057
15801 40365 -178505 136546 332295 -1456 -84673 46156 -431928 299045 107367 -143258
15790 -89797 153450 99352 -264960 -52988 36523 165748 -101870 -129510 91517 -133099 -449393
15779 -449393 222020 -47116 -202171 -6090 -104565 -34083 -120502 58316 -29243 179387 69302
$$ packed form
15858a93847a6732j34587g5424B8098b86121J10306g465A64858D4911a06269l2819
15847a39088M4927C7166a53598q0911g1902D0459i1895k20100B19063d47548A36915
15835a96371P8800K8107C8445P0991a17321F3387a18173F3082a53681K8825K0765
15824a04091L358k42469D5446b68228M8888J04832j16140K210C02032E8339c01958
15812F3738c26645a04084p3485j34155M8573h3287G5689b42275A35297a45057
15801D0365a78505A36546J95749a456q3217D6156d31928B99045A07367a43258
15790h9797A53450n4098b64960e2988C6523J29225a01870k7640I1517a33099l16294
15779d49393B22020d7116j55055f090r8475c4083q6419E8316b9243A79387F9302
$$ plain form
15767 136855 53996 105183 90505 -41258 1685 -27731 8104 -16678 74784 -151130 -42267 -150821
15755 -150821 -158660 -2109 16057 38045 156543 907 -132386 306681 258282 237288 202175 -197245
15742 -420189 -580971 -89690 -362971 236441 87197 4528 74488 -270031 9090 -136171 -65284
15730 179036 32446 2389 190406 -98452 -40546 50837 -179661 100044 153109 164393 -289015
15718 -221666 -124545 173952 -25484 7750 -158680 -152800 183432 -181063 128786 -217739 -57417
15706 -228014 -136112 -29662 -215816 148383 575462 -109691 -48797 115495 -290192 -94138
15695 11256 -7083 57371 -141577 118404 136100 126619 -34626 -159954 -220278 -309767 -12313
15683 65342 -306713 -196775 -127905 -119989 -165772 401150 -160709 361541 -262575 -200688 105391
$$ packed form
15767A36855E3996N1187j4678d1258A685b7731H104a6678G4784a51130d2267j08554
15755a50821p839b109A6057K1988J18498I07a32386C06681m8399k0994l5113a97245
15742d20189j60782h9690k73281B36441H7197D528O9960b70031I090a36171f5284
15730A79036C2446B389J88017i8452d0546E0837a79661A00044N3065J1284b89015
15718b21666R7121A73952b5484G750a58680N880A83432a81063A28786b17739e7417
15706b28014R1902b9662j86154A48383M27079a09691d8797A15495b90192i4138
15695A1256g083E7371a41577A18404J7696r481c4626j25328o0324q9489a2313
15683F5342c06713J09938O8870P916m5783D01150a60709C61541b62575O1887A05391
$$ plain form
15671 -27375 -430368 16447 -160053 -181704 -167846 166238 -163086 -141830 -107242 241931 273028
15660 273028 -55786 -86936 -172619 -143878 -320917 38002 -405224 -12590 41654 103102 -120661
15648 197109 58060 -54673 37758 20048 347283 76152 -196454 -185401 -42546 -10324 -49017
15637 -49017 184845 -250653 -24730 -224071 4918 -28855 6994 -78148 -61401 -9511 -155033
15626 -155033 -24674 10379 -182140 53526 -28068 33834 134851 -185084 -4006 276642 320568
15615 320568 -119048 -47595 137231 -33451 108604 -220421 -101158 -142623 79526 -79815
15604 -47415 14792 98280 242992 69149 -87265 -93719 -215063 8689 120495 355526 66392
15592 321376 -180467 -129231 -219700 -223007 58938 101756 136362 222346 -16590 109445 -254737
$$ packed form
15671b7375m02993A6447a60053k1651J3858A66238a63086K1256L4588B41931L1097
15660B73028e5786l1150q5683K8741j77039C8002d05224a2590D1654O1448a20661
15648A97109E8060e4673C7758j7710L27235G6152a96454J1053d2546a0324l8693
15637d9017A84845b50653b4730j99341D918b8855F994g8148J6747i511j45522
15626a55033b4674A0379a82140E3526b8068C3834J01017a85084d006B76642M3926
15615C20568a19048d7595A37231c3451A08604b20421a01158m1465G9526g9815
15604d7415A4792Q3488J44712F9149h7265o454j21344H689J11806K35031F6392
15592C21376a80467N1236r0469l307E8938M2818L4606Q5984a6590A09445b54737
$$ plain form
15580 65296 -13099 538826 81795 -110043 -208834 -5768 -288241 -335535 133773 132912 152270
15569 152270 -103201 36875 37906 135407 -109418 -159236 177537 -46558 77092 -133530 333670
15557 187897 -146432 -279534 54881 -46713 -268175 147237 10302 233084 160467 -23282
15546 89094 127914 -309908 245190 13668 73170 145299 -40973 143018 52410 171553 -27040
15534 -150157 362690 -194635 30987 65324 198382 98587 342247 -336441 -138780 54007
15523 -510837 11639 228593 137872 -108930 -319309 319941 18018 -294447 47267 -579135
15512 317881 86979 59936 -231293 -24547 -33672 -49243 -22345 -42962 -197453 -88897 -38425
15500 -171456 34253 -10389 35561 -130391 21930 24732 -43160 51352 174037 -87676 -122713
$$ packed form
15580F5296a3099E38826H1795a10043r8791e768k82473m7294A33773q61J9358
15569A52270a03201C6875J031R7501a09418m9818A77537d6558G7092a33530C33670
15557A87897a46432j33102E4881d6713k21462A47237A0302K22782p2617b3282
15546H9094L8820c09908B45190A3668N9502P2129d0973A43018E2410J19143b7040
15534a50157C62690a94635C0987L4337J33058I8587K43660c36441a38780E4007
15523e10837A1639K16954r0721a08930k10379C19941A8018b94447D7267e79135
15512C17881H6979k7043b31293b4547r125j5571b2345k0617j54491h8897c8425
15500a71456C4253a0389C5561a30391B1930K802d3160E1352J22685h7676l5037
$$ plain form
15489 -122713 -105000 -92244 -272222 20931 65869 283748 96957 273748 71905 77290 -228957
15477 219693 -186731 13698 401891 -104962 154731 -158209 -87700 135015 82675 121831
15467 121831 -16260 6257 143890 -92788 152295 143177 211821 -262959 42356 103371 230350
15456 230350 -142677 -225900 20431 141943 -105057 87225 -112829 -219262 -113674 158127
15445 53318 -186152 -190679 70621 188545 -119231 -193162 117506 -117490 240520 -244773
15434 54480 -41667 -65845 192734 -140229 -367031 -129707 -5425 -163248 438258 19772 27067
15423 27067 -26706 -311193 113805 317971 -33528 -241112 150312 -168239 -402080 -6840
15412 -627 192574 66434 -67977 54374 -141223 -296207 -121552 -228032 -31976 -124478 -30198
$$ packed form
15489a22713J7713J2756j79978B0931M4938K17879I6957J76791G1905N385b28957
15477B19693a86731A3698L88193a04962A54731a58209P0509A35015n2340L9156
15467A21831a6260F257J37633i2788A52295r118O8644b62959D2356O1015J26979
15456B30350a42677q3223B0431J21512a05057H7225a12829j06433J05588A58127
15445E3318a86152m527G0621J17924a19231p3931A17506a17490B40520b44773
15434E4480d1667k4178A92734a40229k26802a29707e425j57823D38258A9772P295
15423B7067b6706k84487A13805K04166c3528k07584A50312a68239k33841f840
15412f27A92574F6434f7977E4374a41223j54984a21552j06480c1976r2502c0198
$$ plain form
15400 -39357 -245603 178166 279800 239279 147339 -215147 80758 60941 11928 -96841 -25435
15388 89238 -265813 204750 -120311 98422 265078 -255475 95215 -26158 167619 6994 240859
15377 240859 -227907 -136912 -1547 -20895 170696 12925 -290852 -513738 394926 -36322 -140497
15366 -140497 132377 5136 112601 100364 -91155 -138819 23560 40009 5967 -40384 171518
15354 -445040 313991 107578 -325931 11828 -61976 81763 114635 202540 -48387 -192280 280491
15342 150709 -123503 384234 88157 -121372 -88665 -56740 -279480 -140961 19421 -250498
15331 -193349 26716 230150 91765 -81162 20698 45476 -112468 160326 328722 235923 -84933
15319 -207805 20642 -459115 -86830 -167823 82593 -248564 -169968 173397 159123 -212719 -251871
$$ packed form
15400c9357k06246A78166J01634m0521r1940b15147H0758j9817A1928i6841b5435
15388H9238b65813B04750a20311I8422J66656b55475I5215b6158A67619F994K33865
15377B40859b27907R0995a547j9348A70696A2925b90852k22886C94926c6322j04175
15366a40497A32377E136J07465j2237i1155m7664B3560J6449E967d0384A71518
15354d45040C13991A07578c25931A1828f1976H1763L2872Q7905d8387j43893B80491
15342A50709a23503C84234H8157a21372L2707L1925k22740J38519A9421b50498
15331a93349B6716K03434I1765h1162B0698K4778a12468A60326J68396r2799h4933
15319b07805B0642d59115h6830q0993H2593b48564P8596A73397j4274b12719l9152
$$ plain form
15308 -251871 87847 209033 70326 -199807 87874 -125593 95180 -293332 -139908 -169678
15298 -169678 -212194 144932 142413 308288 -29225 121189 81233 -618 151415 -135591 -50418
15286 -15809 -20445 -47989 -107215 -77143 198904 -5480 97804 470201 -176986 -206045 -477543
15275 -477543 80026 319490 236341 -97574 164941 -42046 218323 -309189 115525 130834
15265 130834 348171 -200970 -94220 33860 -76946 -279581 178665 36599 -64951 235324
15254 17077 64446 -101574 97189 -125010 326563 643357 979006 1544457 1248752 1413233
15244 1413233 1243242 542702 337923 -30065 -219288 249870 -92598 -59223 -251028 15996
15233 -312772 -143083 185038 61473 26586 113348 257430 386612 -211418 62266 342952
$$ packed form
15308b51871H7847J21186G0326a99807H7874a25593I5180b93332a39908k9770
15298a69678m2516A44932k519J65875b9225A21189l9956f18A51415a35591e0418
15286a5809m636k7544n9226L0072A98904e480I7804L72397a76986k9059k71498
15275d77543H0026K39464q3149i7574A64941d2046B18323c09189A15525J5309
15265A30834K17337b00970i4220C3860g6946k02635A78665C6599f4951B35324
15254A7077M7369a01574I7189a25010C26563L16794L35649N65451k95705J64481
15244A413233j69991E42702k04779c0065j89223B49870i2598L3375j91805A5996
15233c12772a43083A85038F1473B6586Q6762J44082J29182b11418F2266K80686
$$ plain form
15223 342952 256429 53761 240914 -9376 24995 94056 391914 -134443 -168661 58713 -53532
15211 105440 -190799 -104380 236203 -61305 253535 204708 72445 53821 163876 -46437 -59402
15200 -59402 58091 74735 29073 -100130 220437 -242264 31583 236726 259661 -62312 91293
15188 56115 -168704 62381 202266 -255316 497558 84444 206302 417108 385786 158366
15177 -146406 -25767 49760 -126930 3820 57726 174683 48076 -165068 1325 459366 -149592
15165 75007 -686 421154 -593815 36278 275845 76094 204284 309593 -2425 225179 46772
15153 -28095 90136 409903 237533 163731 115126 -172784 -293278 -257150 -51571 366402 -268831
15141 -1267 -133373 154635 187197 304584 139606 -8006 262604 266516 175416 133336 -133013
$$ packed form
15223C42952q6523E3761J87153i376B4995O9061K97858a34443l4218E8713e3532
15211A05440a90799Q6419B36203f1305B53535m8827G2445j8624J10055d6437j2965
15200e9402E8091J6644B9073a00130B20437b42264C1583K05143K2935f2312I1293
15188E6115a68704F2381J39885b55316D97558H4444J21858K10806l1322A58366
15177a46406b5767D9760a26930C820N3906J16957D8076a65068A325M58041a49592
15165G5007f86D21154e93815C6278K39567G6094J28190J05309b425B25179D6772
15153b8095I0136L19767j72370p3802m8605a72784j20494L6128e1571C66402b68831
15141a267j32106A54635L2562J17387A39606h006B62604L912r1100m2080a33013
$$ plain form
15129 188733 231690 -79294 -29349 347899 172839 109449 87014 28527 154847 165659 -34454
15117 44108 315592 -8589 -60222 106149 293961 239489 61328 165080 224112 -169009 -54363
15105 -90604 3924 121699 -18794 205445 182258 82170 188877 289522 84273 273877 125497
15093 -248570 269847 334061 370244 -30465 296954 217517 93692 69600 610628 -12646 -92244
15082 -92244 156660 107132 251701 -90377 169602 29634 -88623 331529 -12383 4342 108790
15071 108790 -83068 76459 4232 275590 289362 123577 398697 227794 121905 246228
15061 246228 422840 -132287 172089 475188 -86836 149778 225906 130745 -65900 158794
15050 92979 -55070 76114 131603 623449 -20781 198587 249110 322930 210563 -23879 181061
$$ packed form
15129A88733M2957g9294b9349C47899A72839o3390k2435B8527J26320J0812c4454
15117D4108K71484h589n1633A06149J87812n4472F1328J03752N9032a69009e4363
15105i0604C924J17775a8794B05445k3187H2170J06707J00645H4273J89604A25497
15093b48570B69847O4214L6183c0465B96954p9437I3692k4092N41028a2646p9598
15082i2244A56660m9528J44569i0377A69602B9634h8623C31529a2383D342J04448
15071A08790h3068G6459D232K71358J3772A23577K75120j70903j05889J24323
15061B46228J76612a32287A72089L03099h6836A49778P6128r5161f5900A58794
15050I2979e5070G6114N5489M91846b0781A98587N0523P3820j12367b3879A81061
$$ plain form
15038 488720 118134 320092 87279 393451 208602 -73853 -120609 -8617 -23963 151593 -123812
15026 222552 -7627 259517 -67254 207636 284029 108398 253771 166492 183001 301927 356739
15015 356739 180116 18107 22493 338902 -95664 7482 -37800 277529 -16508 239345 -191178
15003 270320 274127 282446 262724 151861 -112657 -21631 -1491 1757 395011 280218 126630
14991 9165 70354 169321 138916 194843 134758 213173 216911 210966 141822 231031 -27915 -20108
14979 -20108 205111 266677 156570 399902 141486 232109 182587 254609 425745 233276
14969 233276 89042 292349 -111703 507895 308226 134382 341921 139775 211314 62170
14958 173281 -21636 56593 47758 187499 249729 20732 171884 274748 268064 410652 488919
$$ packed form
15038D88720A18134K01958H7279L06172j84849g3853m6756h617j5346A51593a23812
15026B22552g627B59517f7254B07636P6393A08398J45373q7279J6509J18926N4812
15015C56739j76623A8107M386L16409i5664G482c7800B77529a6508B39345a91178
15003B70320L807Q319j9722j10863a12657b1631a491A757L93254j14793A26630
14991I165O1189R8967l0405N5927o0085P8415L738n945o9144Q9209b7915P807
14979b0108B05111O1566j10107K43332A41486R0623m9522P2022J71136j92469
14969B33276H9042K03307a11703E07895j99669A34382K07539A39775P1539F2170
14958A73281b1636E6593q835J39741O2230B0732J51152J02864o684J42588P8267
$$ plain form
14947 488919 528117 86774 -215681 -110196 54112 335014 350184 378025 392436 179229 282405
14936 282405 209741 177431 286262 136292 407873 320319 240213 269486 48605 53851 371297
14925 371297 475033 289325 51122 177818 285022 24266 255330 164879 224169 258147
14915 258147 223224 403101 498695 268962 220359 292104 164416 43369 290521 182651
14905 182651 84451 161348 329687 186217 594207 174414 560240 507922 275572 712275
14895 712275 210275 132368 437039 161055 286488 333170 269316 291111 192389 14020 250542
14884 250542 466135 -28941 621887 17726 199187 144294 467718 396082 91129 352750
14874 352750 311048 257899 466010 404951 403057 327784 71058 578883 465356 214863 180418
$$ packed form
14947D88919L9198H6774b15681J05485E4112K80902J5170K7841J4411A79229J03176
14936B82405p2664l2310J08831A36292K71581q7554q0106K9273D8605N246L17446
14925C71297J03736j85708E1122J26696J07204B4266K31064r0451N9290L3978
14915B58147l4923J79877R5594k29733m8603P1745j27688D3369K47152j07870
14905A82651H4451P6897J68339j43470M07990A74414L85826n2318k32350M36703
14895G12275B10275p7907L04671A61055J25433M6682o3854K1795r8722A4020K36522
14884B50542K15593b8941F21887A7726J81461n4893L23424p1636I1129K61621
14874C52750m1702n3149K08111o1059j894p5273G1058N07825j13527B14863l4445
$$ plain form
14863 180418 146426 101670 217057 168395 22506 499172 541584 394418 23170 418575 464862
14852 464862 140012 50113 112676 431727 273627 182665 536553 353550 628533 385184
14842 385184 199236 295380 425803 131394 349794 162348 242042 381906 471829 279758
14832 279758 335929 477352 600253 284208 294001 415225 251300 617432 386205 483112
14822 483112 263967 245364 590614 573576 334813 385648 515894 524201 360466 448529 525309
14811 525309 61110 465574 440098 561308 223118 537601 504289 567007 354494 569919
14801 569919 436736 691474 464273 430910 401540 597621 517770 797174 737177 467054
14791 467054 412617 442930 558331 596609 816740 652603 566116 402133 351047 291408 581186
$$ packed form
14863A80418l3992m4756J15387m8662B2506M76666M2412j47166B3170L95405M6287
14852D64862A40012E0113O2563L19051j58100r0962L53888j83003K74983k43349
14842C85184j85948R6144J30423A31394K18400A62348P9694J39864Q9923j92071
14832B79758N6171J41423J22901B84208R793J21224j63925L66132k31227R6907
14822D83112k19145j8603L45250j7038k38763N0835J30246Q307j63735Q8063P6780
14811E25309F1110M04464k5476J21210B23118L14483l3312O2718k12513K15425
14801E69919j33183K54738k27201l3363k9370J96081p9851K79404n9997k70123
14791D67054n4437L0313J15401L8278K20131j64137q6487j63983n1086n9639K89778
$$ plain form
14780 581186 349143 655157 578728 543054 662100 363412 779597 493231 525182 320741
14770 320741 393689 563865 711259 375506 487348 522449 305874 544499 714525 400306
14760 400306 686415 908150 861258 480661 784321 425688 982096 689275 762581 440376
14750 440376 330708 509702 411862 557868 444962 660399 492294 587394 395316 297429
14740 297429 734293 503988 532555 478166 577039 566837 573961 620720 762473 533849 824870
14729 824870 886811 832097 868423 799740 605360 887697 599607 683473 639092 353226 720005
14718 720005 799188 613571 632163 743455 690304 608642 585502 799603 651909 814404
14708 814404 751723 861741 799629 762094 742607 731042 801667 1135034 732290 732981 955248
$$ packed form
14780E81186k32043L06014p6429l5674J19046k98688M16185k86366L1951k04441
14770C20741P2948J70176J47394l35753J11842L5101k16575K38625J70026l14219
14760D00306K86109K21735m6892l80597L03660l58633N56408k92821P3306l22205
14750D40376j09668J78994r7840J46006j12906K15437j68105R5100j92078r7887
14740B97429M36864k30305K8567n4389R8873j0202P124M6759J41753k28624K91021
14729H24870O1941n4714L6326o8683j94380K82337k88090Q3866m4381k85866L66779
14718G20005P9183j85617J8592J11292n3151q1662k3140K14101j47694J62495
14708H14404o2681J10018o2112l7535j9487j1565P0625L33367m02744O91K22267
$$ plain form
14697 955248 651213 707986 919613 864862 595401 804207 759833 821752 842276 776590 1019119
14686 1019119 928291 995880 545808 623220 824739 897633 1012540 1026693 763052 660712
14676 660712 1098803 716797 685798 777622 938264 1214280 634487 1198891 1007730 1369271
14666 1369271 906452 945301 1439756 938055 1057667 1100251 1153706 1078359 982809 613641
14656 613641 1082530 1287719 1035229 1218686 1033487 850308 941741 976774 963272 796083
14646 796083 1391426 1111882 1110760 943135 751778 984483 1053858 721743 1294079 1064795
14636 1064795 1076323 1313295 1269346 1171693 1001411 1346205 1302708 1220000 1139685 1462447
14626 1462447 1030554 1227520 1261147 1308988 1137272 1380210 1525942 1322627 1123436 1342623
$$ packed form
14697I55248l04035N6773K11627n4751k69461K08806m4374O1919K0524o5686K42529
14686A019119r0828O7589m50072P7412K01519P2894J14907J4153k63641j02340
14676F60712M38091l82006l0999R1824J60642K76016n79793N64404j91161L61541
14666A369271m62819L8849M94455n01701J19612M2584N3455p5347r5550l69168
14656F13641M68889K05189k52490J83457j85199j83179R1433L5033j3502j67189
14646G96083N95343k79544j122j67625j91357K32705O9375l32115N72336k29284
14636A064795J1528K36972m3949r7653j70282L44794m3497q2708q0315L22762
14626A462447m31893J96966L3627M7841j71716K42938J45732k03315j99191K19187
$$ plain form
14616 1342623 936959 1339258 1314497 1329878 1483585 1052315 1476285 1369710 1073144 1290133
14606 1290133 1424350 1450782 1378930 1489531 1421116 1691756 1712415 1537166 1438029 1457881
14596 1457881 1219302 1415781 1727343 1312779 1640559 1297775 1684014 1594978 1647439 1892349
14586 1892349 1587421 1420999 1809905 1588519 1701496 1857460 1719906 1698265 1587655 1846443
14576 1846443 1832784 2090201 1993676 1973427 1926264 1802698 2204171 2026107 1765111 2282060
14566 2282060 1893286 2391289 2455440 2332730 2475871 2663200 2607088 2499073 2566918 2606123
14556 2606123 3006270 2940021 2987015 3348890 3758715 4347770 5296403 7144236 10552266
14547 10552266 17794140 33840625 49419220 25999995 11766522 5223165 2663643
$$ packed form
14616A342623m05664M02299k4761J5381J53707m31270M23970j06575k96566K16989
14606A290133J34217K6432p1852J10601o8415K70640K0659j75249r9137J9852
14596A457881k38579J96479L11562m14564L27780l42784L86239q9036N2461K44910
14586A892349l04928j66422L88906k21386J12977J55964j37554k1641j10610K58788
14576A846443j3659K57417r6525k0249m7163j23566M01473j78064k60996N16949
14566B282060l88774M98003O4151j22710J43141J87329n6112j08015O7845L9205
14556B606123M00147o6249M6994L61875M09825N89055R48633J847833L408030
14547A0552266P241874J6046485J5578595k3419225A1766522E223165k559522
$$ plain form
14540 2663643 2093054 2103512 1906269 1922947 1835785 1967995 1993514 1915634 2039113 1875926
14530 1875926 2315436 1766527 2181412 2324699 1993340 1887552 1948470 2355034 2263450 2154583
14520 2154583 2179714 2322720 2281254 2207500 2107695 2479260 2417293 2751179 2734209 2883332
14510 2883332 2599551 2578740 2594799 2540146 2809126 2784541 2726487 2752685 2786948 2944741 3229180
14499 3229180 2667717 3268196 3075316 3020229 3491806 3159149 3237873 2942921 3476861 3477635
14489 3477635 3043722 3504606 3308895 3147829 3239122 3447261 3312323 3527684 3502899 3617269
14479 3617269 3819424 3501270 3753299 3678306 3986319 3995071 3782002 3934217 3745281 3875850
14469 3875850 4043223 4134941 4170028 4228898 4548428 4223800 4486050 4509879 4235359 4272834
$$ packed form
14540B663643n70589J0458j97243J6678q7162J32210K5519p7880J23479j63187
14530A875926M39510n48909M14885J43287l31359j05788O0918M06564r1584j08867
14520B154583K5131J43006m1466p3754r9805L71565o1967L33886j6970J49123
14510B883332k83781k0811J6059n4653K68980k4585n8054K6198L4263J57793K84439
14499C229180n61463O00479j92880n5087M71577l32657P8724k94952N33940P74
14489C477635m33913M60884j95711j61066R1293K08139j34938K15361k4785J14370
14479C617269K02155l18154K52029p4993L08013Q752k13069J52215j88936J30569
14469C875850J67373R1718L5087N8870L19530l24628K62250K3829k74520L7475
$$ plain form
14459 4272834 4806269 4742029 4773256 4894697 4822321 4957930 5023703 4618855 4892145 4707558
14449 4707558 4946938 5010579 5297849 5303335 5362109 5384037 5554012 5555551 5232319 5960461 5565785
14438 5565785 5621604 5819127 6063675 6115850 6220087 6048974 6366580 6622730 6286098 6390882
14428 6390882 6421091 6648302 6938926 6850713 6947846 6911461 7342158 7330726 7613051 7330716
14418 7330716 7491660 7352531 7764224 8209464 8163677 8324640 8360259 8649533 8192403 8322009
14408 8322009 8840619 8698894 9423712 9103755 9410498 9495069 9277661 9942472 9894299 9962953
14398 9962953 10138334 10879499 10746736 10775024 10766558 11027236 11314412 11441574 12021322 11824827
14388 11824827 11582502 12388933 12396259 12491266 13212742 13066412 13431686 13725202 13980364 14146398
$$ packed form
14459D272834N33435o4240L1227J21441p2376J35609O5773m04848K73290j84587
14449D707558K39380O3641K87270N486N8774K1928J69975J539l23232P28142l94676
14438E565785N5819J97523K44548N2175J04237j71113L17606K56150l36632J04784
14428F390882L0209K27211K90624q8213R7133l6385M30697j1432K82325k82335
14418G330716J60944j39129M11693M45240m5787J60963L5619K89274m57130J29606
14408H322009N18610j41725P24818l19957L06743Q4571k17408O64811m8173O8654
14398I962953J75381P41165j32763K8288q466K60678K87176J27162N79748j96495
14388A1824827k42325Q06431P326R5007P21476j46330L65274K93516K55162J66034
$$ plain form
14378 14146398 14481554 14121984 14721955 15363840 15607720 15838373 16225406 16712509 16632502
14369 16632502 17183306 17601836 17605017 18183286 18629432 18868020 19161457 19847724 20175437 20671462
14359 20671462 21168089 21655981 21746326 22664426 23176177 23490940 23927939 24697021 25145756
14350 25145756 26156225 26809032 27074187 27842968 28554682 29396071 30278263 31163495 31852755
14341 31852755 32642803 33438596 34726740 35284182 36454669 37488699 38421647 39670096 40593727
14332 40593727 42279072 43422389 44542001 46037043 47600728 49229021 50654699 52462548
14324 52462548 53975570 55757947 57618496 59804458 62068560 64298054 66677000 69402765
14316 69402765 71874322 74443507 77244081 80489153 83906361 87184169 90735792 94639404
$$ packed form
14378A4146398L35156l59570N99971O41885K43880K30653L87033M87103q0007
14369A6632502N50804M18530L181N78269M46146K38588K93437O86267L27713M96025
14359B0671462M96627M87892R0345R18100N11751L14763M36999P69082M48735
14350B5145756J010469O52807K65155P68781P11714Q41389Q82192Q85232O89260
14341C1852755P90048P95793J288144N57442J170487J034030R32948J248449R23631
14332D0593727J685345J143317J119612J495042J563685J628293J425678J807849
14324E2462548J513022J782377J860549K185962K264102K229494K378946K725765
14316F9402765K471557K569185K800574L245072L417208L277808L551623L903612
$$ plain form
14308 94639404 99091769 103136887 107771675 112834245 118035770 123398958 129401925 135761951
14300 135761951 142093487 149282325 157087114 164770896 173354021 182426772 192036668 201727452
14292 201727452 212707519 224164466 235998160 248922446 261948889 275899501 290403420
14285 290403420 305310503 320827751 336632048 352684192 368853471 384626972 400288672
14278 400288672 415035496 429003199 441684143 452749071 461061463 464706926 466417354
14271 466417354 467136226 466667292 467584134 464465899 460483396 454592176 444203389 432437960
14263 432437960 418414197 403302142 387445070 370889289 354580337 338014555 321650761
14256 321650761 305779584 290381245 276619079 262569239 248997818 235957935 224267489
$$ packed form
14308I4639404M452365M045118M634788N062570N201525N363188O002967O360026
14300A35761951O331536P188838P804789P683782Q583125R072751R609896R690784
14292B01727452J0980067J1456947J1833694J2924286J3026443J3950612J4503919
14285B90403420J4907083J5517248J5804297J6052144J6169279J5773501J5661700
14278D00288672J4746824J3967703J2680944J1064928Q312392L645463J710428
14271D66417354P18872m68934R16842l118235l982503n891220j0388787j1765429
14263D32437960j4023763j5112055j5857072j6555781j6308952j6565782j6363794
14256C21650761j5871177j5398339j3762166j4049840j3571421j3039883j1690446
$$ plain form
14249 224267489 212792544 201929988 191448691 182232137 172878679 165162810 157281790
14242 157281790 149329750 142478222 135971820 129002391 123780750 118517659 113436918 108424922
14234 108424922 103399065 99229007 95125021 91422140 87701538 84130912 81060080 77866875
14226 77866875 74816864 71993352 69348220 66722166 64294907 61942063 60244387 58281402
14218 58281402 56036097 54203107 52252164 50625497 49572072 48098621 46235600 44767582
14210 44767582 43366862 42224666 41089694 40217390 39276950 37901281 36437333 35469661
14202 35469661 34654368 33553452 33297976 32160458 31334165 30410314 29755234 28802167 28310703
14193 28310703 27427960 26811605 26136945 25596315 24767392 24414317 23779265 23049113 22686434
$$ packed form
14249B24267489j1474945j0862556j0481297r216554r353458p715869p881020
14242A57281790p952040o851528o506402o969429n221641n263091n080741n011996
14234A08424922n025857m170058m103986l702881l720602l570626l070832l193205
14226G7866875l050011k823512k645132k626054k427259k352844j697676j962985
14218E8281402k245305j832990j950943j626667j053425j473451j863021j468018
14210D4767582j400720j142196j134972q72304r40440j375669j463948r67672
14202C5469661q15293j100916k55476j137518q26293r23851o55080r53067m91464
14193B8310703q82743o16355o74660n40630q28923l53075o35052p30152l62679
$$ plain form
14184 22686434 22280559 21996769 21202936 20615091 20546252 19902052 19454251 18973873 18656041
14175 18656041 18212727 17800252 17629793 17173476 16927661 16643444 16143234 16259327 15884187
14166 15884187 15165991 14857241 15106404 14518922 14466951 14279556 13935320 13404269 12960045
14157 12960045 13221647 13004690 12584487 12566700 12225514 12162644 11962122 11243723 11500637 11247443
14147 11247443 10903884 10705588 10732893 10612603 10776052 10323800 9889826 9748770 9930037
14138 9930037 9760484 9555475 9718768 8850717 8973515 8979012 8756264 9077168 8488693 8208461
14128 8208461 8029918 8111342 8174007 8286997 7894685 7947796 7481180 7598869 7402314 7520120
14118 7520120 7400717 7116446 6834412 6998581 6780943 6582069 6405916 6600940 6378585
$$ packed form
14184B2686434m05875k83790p93833n87845o8839o44200m47801m80378l17832
14175A8656041m43314m12475j70459m56317k45815k84217n00210J16093l75140
14166A5884187p18196l08750K49163n87482n1971j87395l44236n31051m44224
14157A2960045K61602k16957m20203j7787l41186o2870k00522p18399K56914k53194
14147A1247443l43559j98296K7305j20290J63449m52252m33974j41056J81267
14138I930037j69553k05009J63293q68051J22798N497k22748L20904n88475k80232
14128H208461j78543Q1424O2665J12990l92312N3111m66616J17689j96555J17806
14118G520120j19403k84271k82034J64169k17638j98874j76153J95024k22355
$$ plain form
14109 6378585 6243105 6233277 6299477 6185308 6215559 6113879 5785067 6013879 5977279 6014835
14099 6014835 5583131 5433824 5674694 5377826 5711783 5479530 5773994 5270817 5199564 4856700
14089 4856700 5060340 5216172 4659504 5264520 4883750 4794602 4723072 4891996 4741747 5052549
14079 5052549 4851398 4500310 4837540 4009822 4024119 4273598 4457091 4217357 4178067 4606432
14069 4606432 4229517 4209685 4141253 4030017 3845503 3800319 3732770 4100712 3823810 4092861
14059 4092861 3889321 3968459 3438550 3743605 3855599 3614857 3423211 3541387 3506024 3225173
14049 3225173 3515702 3572796 3379347 3206877 3459584 3308050 3227239 3118279 2863548 3353151
14039 3353151 2980374 3135691 2991895 3136773 3078387 3040021 3192645 3041296 2698579 2933344
$$ packed form
14109F378585j35480r828O6200j14169L0251j01680l28812K28812l6600L7556
14099F014835m31704j49307K40870k96868L33957k32253K94464n03177p1253l42864
14089D856700K03640J55832n56668O05016l80770q9148p1530J68924j50249L10802
14079E052549k01151l51088L37230q27718J4297K49479J83493k39734l9290M28365
14069D606432l76915j9832o8432j11236j84514m5184o7549L67942k76902K69051
14059D092861k03540P9138n29909L05055J11994k40742j91646J18176l5363k80851
14049C225173K90529N7094j93449j72470K52707j51534q0811j08960k54731M89603
14039C353151l72777J55317j43796J44878n8386l8366J52624j51349l42717K34765
$$ plain form
14029 2933344 2998857 2561437 2868469 2651173 2779522 2778009 2653596 2785119 2697846 2550212
14019 2550212 2707748 2543038 2377118 2480739 2363086 2686091 2430873 2244028 2283463 2591216
14009 2591216 2286192 2349243 2146983 2187310 1943358 2411189 2524873 2332129 2365525 2234971
13999 2234971 2081204 2079192 2054494 1973224 1783703 2165543 1845319 2037871 2402572 2327573
13989 2327573 4209732 6156507 11741070 26702353 47659547 30460227 15004737 7991771
13981 7991771 5637771 4534921 3988939 3386547 3078989 3077278 2750431 2609694 2541693 2336191
13971 2336191 2384482 2633895 2489044 2166229 2289609 2435783 2137308 2062671 1991258 1954243
13961 1954243 1871689 2219952 2046160 1939738 2157023 1746489 1997378 1921812 2034054 2125235
$$ packed form
14029B933344O5513m37420L07032k17296J28349j513j24413J31523q7273j47634
14019B550212J57536j64710j65920J03621j17653L23005k55218j86845L9435L07753
14009B591216l05024O3051k02260M0327k43952M67831J13684j92744L3396j30554
13999B234971j53767k012k4698q1270j89521L81840l20224J92552L64701p4999
13989B327573J882159J946775N584563J4961283K0957194j7199320A5004737p012966
13981G991771k354000j102850n45982o02392l07558j711l26847j40737o8001k05502
13971B336191M8291K49413j44851l22815J23380J46174k98475p4637p1413l7015
13961A954243q2554L48263j73792j06422K17285m10534K50889p5566J12242R1181
$$ plain form
13951 2125235 1801928 1844994 2085881 1897766 1647273 1712437 2154127 1737368 1755385 1828942
13941 1828942 1712583 1771954 1864594 1637992 1516723 1823186 1783757 1791208 1440863 1379143
13931 1379143 1560513 1723431 1789142 1555241 1582103 1512735 1430752 1666880 1471473 1705350
13921 1705350 1496353 1183274 1882651 1503009 1640172 1607906 1681358 1151156 1496132 1390326
13911 1390326 1432094 1035974 1582701 1407629 1470831 1493849 1200167 1299452 1393632 1219587
13901 1219587 1168287 1279526 1466587 1436053 1259293 1487148 1506550 1285359 1319596 1567621
13891 1567621 963488 1381076 1138849 1201467 1576878 795102 984948 1198655 1298205 1459280
13881 1459280 1015283 1091428 1102325 1078382 988677 1019753 1066632 1415526 1197138 900080
$$ packed form
13951B125235l23307M3066K40887j88115k50493O5164M41690m16759J8017P3557
13941A828942j16359N9371R2640k26602j21269L06463l9429P451l50345o1720
13931A379143J81370J62918O5711k33901K6862o9368q1983K36128j95407K33877
13921A705350k08997l13079O99377l79642J37163l2266P3452n30202L44976j05806
13911A390326M1768l96120N46727j75072O3202K3018k93682R9285R4180j74045
13901A219587n1300J11239J87061l0534j76760K27855J9402k21191L4237K48025
13891A567621o04133M17588k42227O2618L75411p81776J89846K13707R9550J61075
13881A459280m43997P6145J0897k3943q9705L1076M6879L48894k18388k97058
$$ plain form
13871 900080 931045 1322956 678705 1211523 1176513 1180352 1177112 1321848 1483830 1265361 1218370
13860 1218370 1141375 1076133 1140174 1175600 909333 829084 1032465 876652 1063734 1386822
13850 1386822 1208496 1190164 754717 1135462 987601 1032540 859513 1156245 1322891 1086735
13840 1086735 756280 1089593 630064 972914 908744 975792 462255 899498 742281 737469
13830 737469 664911 1027361 876364 1116454 756006 916600 611500 910343 738685 948182
13820 948182 1069132 888101 957114 1100180 1030629 651501 622767 1055430 1044316 800031
13810 800031 897414 864139 581020 1075811 807660 688472 1148437 1094836 736680 322525
13799 907094 680927 694710 805098 760884 614166 553393 771908 662048 877743 837710
$$ packed form
13871I00080L0965L91911o44251N32818l5010L839l240J44736J61982k18469m6991
13860A218370p6995o5242O4041L5426k66267q0249K03381j55813J87082L23088
13850A386822j78326j8332m35447L80745j47861M4939j73027K96732J66646k36156
13840A086735l30455L33313m59529L42850o4170O7048D62255M37243j57217m812
13830G37469p2558L62450j50997K40090l60448J60594l05100K98843j71658K09497
13820I48182J20950j81031O9013J43066o9551l79128k8734M32663j1114k44285
13810H00031R7383l3275k83119M94791k68151j19188M59965n3601l58156C22525
13799I07094k26167J3783J10388m4214j46718o0773K18515j09860K15695m0033
$$ plain form
13789 837710 852325 675258 589049 918172 512047 474176 493910 392849 714724 834398
13779 834398 666662 492641 397671 753728 879502 809851 931402 578025 619993 707404
13769 707404 541597 482745 687450 480110 734277 693638 405016 665133 829069 607253
13759 607253 377462 581640 871754 632642 546522 457124 689088 1007846 901334 550600
13749 550600 703710 626667 564263 558779 960130 748491 586187 591131 706955 743973 513958
13738 513958 543516 389753 553903 698368 564229 556250 748312 593957 863772 746006
13728 746006 279720 609683 648364 871749 154844 578309 482409 609411 711962 888643
13718 888643 606619 773647 515319 681829 501527 833828 560377 522959 670690 819729
$$ packed form
13789H37710J4615j77067q6209L29123m06125l7871J9734j01061L21875J19674
13779H34398j67736j74021r4970L56057J25774o9651J21551l53377M1968Q7411
13769G07404j65807n8852K04705k07340K54167m0639k88622K60117J63936k21816
13759F07253k29791K04178K90114k39112q6120q9398K31964L18758j06512l50734
13749E50600J53110p7043o2404n484M01351k11639j62304M944J15824L7018k30015
13738E13958K9558j53763J64150J44465j34139p979J92062j54355K69815j17766
13728G46006B79720L29963L8681K23385A54844M23465r5900J27002J02551J76681
13718H88643k82024J67028k58328J66510j80302L32301k73451l7418J47731J49039
$$ plain form
13708 819729 348904 249695 685595 320064 610644 920338 257734 741292 351852 274392
13698 274392 517632 458934 296979 326875 592794 714940 526832 406419 474037 468682
13688 468682 439512 248722 337148 568376 332218 669397 646777 590367 760752 478886
13678 478886 358271 533106 153667 662598 418678 350466 104319 314171 245354 457010
13668 457010 289351 670901 491350 475716 355813 409228 342748 644140 476972 575489
13658 575489 328173 465051 351504 408849 269368 270836 164667 284132 655658 454886
13648 454886 354582 652369 119708 211251 795607 662934 325377 429365 600649 513577
13638 513577 373998 377248 399946 250850 362385 386754 249516 172426 582150 164124
$$ packed form
13708H19729C48904r9209M35900C20064K90580L09694B57734M83558C51852p7460
13698B74392K43240n8698j61955K9896K65919J22146j88108j20413O7618n355
13688D68682k9170j90790Q8426K31228k36158L37179k2620n6410J70385k81866
13678D78886j20615J74835A53667N08931k43920o8212A04319K09852o8817K11656
13668D57010j67659L81550j79551j5634j19903N3415o6480L01392j67168R8517
13658E75489k47316J36878j13547N7345j39481J468j06169J19465L71526k00772
13648D54886j00304K97787A19708R1543N84356j32673C25377J03988J71284q7072
13638E13577j39579L250K2698j49096J11535K4369j37238p7090M09724A64124
$$ plain form
13627 495659 672874 33557 449354 388502 457776 788221 25950 474173 335696 372177
13617 372177 363689 641925 311752 556367 331474 400887 463769 159307 474881 103410
13606 405167 321898 314483 409128 214755 377335 332039 239029 374019 502742 486218 513801
13595 513801 300858 168431 332858 439831 483813 174684 219720 406161 338848 415607
13585 415607 239485 420975 322266 276885 303013 80064 630711 43470 428101 539826
13575 539826 190113 259923 405114 348401 25361 539805 263396 467891 500278 425467
13565 425467 299910 248832 374992 302701 118934 329612 193743 407488 350385 70448
13554 537934 320508 339924 307910 538182 331981 109471 389994 373296 493663 447009
$$ packed form
13627D95659J77215C3557M15797o0852O9274L30445B5950M48223j38477L6481
13617C72177q488K78236C11752K44615k24893O9413O2882A59307L15574A03410
13606D05167q3269p415R4645j94373J62580m5296r3010J34990J28723j6524K7583
13595E13801k12943j32427J64427J06973M3982A74684M5036J86441o7313P6759
13585D15607j76122J81490r8709m5381K6128H0064N50647D3470L84631J11725
13575E39826A90113O9810J45191n6713B5361N14444B63396K04495L2387p4811
13565D25467j25557n1078J26160p2291A18934K10678j35869K13745n7103G0448
13554E37934k17426J9416l2014K30272k06201A09471K80523j6698J20367m6654
$$ plain form
13544 447009 55953 322536 151518 347932 558903 359610 725196 293708 454215 71550
13533 -7175 178414 408680 517376 56263 59579 196383 564532 404723 82700 227483 346880
13522 346880 353703 44597 429227 207533 570668 298999 117900 110955 397404 345199 493470
13511 493470 165206 166502 165102 369532 -5441 77011 92402 52325 371879 332399 78921
13499 469894 560554 413182 330986 835049 -101015 335142 251442 352059 173922 132423
13489 132423 391709 381507 626779 -69346 405266 144415 351583 313097 466605 243648
13479 243648 -112680 -150326 177313 -70809 -34379 485162 -90791 222642 -21102 -116337 -109813
13468 -109813 317677 202865 438788 336678 219161 44288 509089 97878 550517 142107
$$ packed form
13544D47009E5953K66583A51518J96414K10971j99293L65586B93708J60507G1550
13533g175A78414K30266J08696E6263L316J36804L68149j59809H2700J44783J19397
13522C46880O823D4597L84630B07533L63135k71669A17900o945K86449n2205J48271
13511D93470A65206J296j400K04430e441G7011J5391m0077L19554l9480G8921
13499D69894R0660j47372q2196N04063a01015C35142q3700J00617A73922m1499
13489A32423K59286j0202K45272f9346D05266A44415K07168l8486J53508k22957
13479B43648a12680l7646A77313g0809c4379D85162i0791B22642b1102r5235O524
13468a09813C17677j14812K35923j02110j17517D4288M64801I7878M52639A42107
$$ plain form
13457 262583 251794 262178 156844 174097 641769 102786 340519 145709 246464 421003
13447 421003 404317 297922 470242 -250041 109653 134213 167706 571941 464465 126580
13436 53365 -216191 -19563 207158 301088 424016 113837 23972 80138 283298 207420 191666
13425 191666 129313 -60630 -9704 213159 -5753 51222 -10767 421914 72907 211613 280731
13414 280731 285420 -58247 405980 168653 88247 -205354 315580 148983 389242 356728
13404 356728 94776 226156 110023 389591 292114 298703 458865 553628 -120059 332501
13393 482943 237947 390466 124559 -223885 147407 45393 826574 52481 6152 -1524 169420
13381 382892 665754 -168842 448957 410120 -7026 76843 329490 256747 370465 -47178 407426
$$ packed form
13457B62583j0789J0384j05334J7253M67672A02786K37733A45709J00755J74539
13447D21003j6686j06395J72320b50041A09653K4560L3493M04235j07476A26580
13436E3365b16191a9563B07158R3930J22928A13837B3972N6166K03160p5878j5754
13425A91666o2353f0630i704B13159e753E1222a0767D21914G2907J38706O9118
13414B80731M689e8247D05980A68653q0406b05354C15580A48983K40259l2514
13404C56728I4776J31380A10023K79568r7477O589J60162R4763a20059C32501
13393D82943B37947J52519A24559b23885A47407D5393P81181E2481F152a524A69420
13381C82892K82862a68842D48957l8837g026G6843K52647p2743J13718d7178D07426
$$ plain form
13369 291060 208549 341820 152389 -18026 114746 309036 174800 198037 331113 292812
13359 292812 51194 621150 209847 306280 109227 461490 146974 265191 266885 364410
13349 364410 340298 -122386 55097 101083 326745 410555 398863 102548 645412 76452 229988
13338 229988 301677 257059 12616 225016 47289 -91108 273114 198321 -59822 -113730 71504
13326 -129812 254320 239380 181339 424239 302520 69977 399349 225752 109251 185899
13316 185899 -138439 506505 -64850 -81360 211233 36615 70293 -35020 154727 -69538 196913
13304 276987 206317 40003 104039 -104642 358830 203236 92596 169558 244247 49664 103898
13293 103898 99522 422301 3463 299760 315635 210127 26696 8864 114794 332460 264546
$$ packed form
13369B91060q2511J33271A52389a8026A14746J94290j34236K3237J33076l8301
13359B92812E1194N69956B09847R6433A09227L52263A46974J18217J694R7525
13349C64410k4112a22386E5097M5986K25662Q3810j1692A02548N42864G6452J53536
13338B29988P1689m4618A2616K12400D7289i1108B73114p4793e9822n3908G1504
13326a29812B54320j4940n8041K42900j21719F9977L29372j73597A09251P6648
13316A85899a38439E06505f4850j6510B11233C6615L3678c5020A54727f9538A96913
13304B76987p0670D0003O4036a04642C58830j55594I2596P6962P4689D9664N4234
13293A03898m376L22779C463K96297J5875j05508B6696H864J05930K17666o7914
$$ plain form
13282 264546 -162990 57469 29773 208548 488127 148368 433321 300575 483464 80984
13271 -27224 -104333 180657 67211 -327464 -122726 366634 131530 196863 102933 320009
13261 320009 177039 -131097 161328 90362 128131 314869 255779 -154600 191837 167205
13251 167205 146891 331834 455415 -2699 -21334 124653 124301 -68178 124182 233378 -228603
13239 145164 139027 91852 37795 120895 157847 87504 336593 30875 99326 402573 205499
13228 205499 -250340 85977 3076 272389 27725 20163 -445286 309987 338333 -190201 304930
13216 189771 263129 402816 305839 118419 -245742 194802 -4805 -113607 355642 41305
13205 223762 -106828 -64201 -152179 111906 379023 361874 -83499 69959 281691 -53466 356845
$$ packed form
13282B64546a62990E7469k7696J78775K79579A48368K84953j32746J82889H0984
13271b7224p7109A80657F7211c27464a22726C66634A31530O5333r3930K17076
13261C20009j42970a31097A61328p0966L7769J86738n9090a54600A91837k4632
13251A67205k0314J84943J23581b699j8635A24653l52f8178A24182J09196b28603
13239A45164o137m7175C7795Q3100L6952p0343K49089C0875O8451L03247j97074
13228B05499b50340H5977C076K69313B7725p562d45286C09987K8346a90201C04930
13216A89771P3358J39687r6977A18419b45742A94802d805j08802C55642D1305
13205B23762a06828M2627q7978A11906K67117j7149h3499F9959K11732e3466C56845
$$ plain form
13193 415461 54189 -11701 102365 94648 65731 267942 -318911 33308 67024 48840 477578
13182 477578 123120 400270 171353 228901 -175055 29128 340077 17632 197637 30078
13171 106010 -23255 208791 -22304 142700 190209 103053 225360 124513 239438 194705
13161 194705 432975 183667 85956 -110496 258833 94366 1766 -115342 100715 2627 277143
13150 277143 16548 21523 490078 146683 -70264 219243 -145992 54301 9870 -54 43550 36935
13138 36935 -2329 112127 346894 57940 78827 16774 -232412 -71569 188101 72356 220678
13127 220678 -46956 61641 107367 98796 5232 -75800 -119464 259117 316658 294794 15901 -50577
13114 312236 159416 96856 -55968 -21969 159078 -218791 -171224 204153 382347 53847
$$ packed form
13193D15461E4189a1701A02365p717k8917K02211c18911C3308L3716j8184M28738
13182D77578A23120K77150A71353N7548a75055B9128L10949A7632J80005C0078
13171A06010b3255B08791b2304A42700M7509q7156J22307j00847J14925m4733
13161A94705K38270A83667H5956a10496B58833I4366A766a15342A00715B627K74516
13150B77143A6548M975M68555A46683g0264B19243a45992E4301I870e4D3550o615
13138C6935b329A12127K34767E7940K0887A6774b32412g1569A88101G2356J48322
13127B20678d6956F1641M5726q571E232g5800m3664B59117N7541k1864A5901e0577
13114C12236j52820o2560e5968b1969A59078b18791M7567B04153J78194E3847
$$ plain form
13103 227676 267561 52086 213794 191030 369932 258944 115983 -247669 44446 17372
13092 -111654 152527 382796 366097 156444 16382 145339 149089 30938 139128 19146 248485
13081 248485 331962 374152 -32 73439 -98519 193630 105256 131782 98156 -37276 149791 99673
13069 99673 -109573 100150 -11001 -113982 193818 7294 -32226 354167 93059 -38000 204733
13057 65847 1520 141120 339583 349263 195488 52901 -386301 -162676 173712 -16572 121722
13045 303464 -33146 50386 153667 -264324 244648 82420 -206295 92575 339573 -131301
13034 119650 257880 177974 58288 113428 253125 -31762 -25158 245292 -171970 84629 378355
13023 378355 -39537 288480 -102322 173084 9159 256280 157566 324242 241809 -200872
$$ packed form
13103B27676L9885E2086J61708k2764J78902j10988A15983b47669D4446A7372
13092a11654A52527K30269j6699A56444A6382J28957L750C0938J08190A9146K29339
13081B48485Q3477M2190c2G3439i8519A93630q8374K6526l3626c7276A49791n0118
13069I9673a09573A00150a1001j02981A93818G294c2226C54167I3059c8000B04733
13057F5847A520J39600J98463R680j53775E2901c86301a62676A73712a6572A21722
13045C03464c3146E0386J03281b64324B44648H2420b06295I2575K46998a31301
13034A19650J38230p9906E8288N5140J39697c1762O604B45292a71970H4629K93726
13023C78355c9537B88480a02322A73084I159K47121r8714J66676q2433b00872
$$ plain form
13012 532247 21079 468705 45914 177549 215480 -13301 -7856 43901 -105499 184516 -196595
13000 261572 -69033 272104 280467 -190121 224938 -339433 103386 -199735 -67448 101174
12989 287383 117610 -309004 120825 -170237 142800 120382 -82873 -129080 -235810 77256
12978 73034 45324 10710 258398 373104 93064 -62779 388161 -43988 -10374 238392 -31953
12966 160488 12627 -183445 76517 -39434 -393411 3454 -18232 103215 -131187 346255 -194000
12954 255486 -275755 -121320 39184 -217284 -411004 175923 -53614 -251109 -197656 -233708
12944 -233708 18729 3750 -74761 111404 154653 209098 286129 -146064 -70965 -189518 262913
12932 121265 103549 -369711 188577 40799 81065 4864 -149331 15695 427648 399166 -76260
$$ packed form
13012E32247B1079M47626D5914J31635L7931a3301N445D3901a05499A84516a96595
13000B61572f9033B72104Q363a90121B24938c39433A03386a99735f7448A01174
12989B87383A17610c09004A20825a70237A42800k2418h2873m6207j06730G7256
12978G3034k7710A0710K47688J14706I3064f2779C88161d3988a0374B38392c1953
12966A60488A2627a83445G6517c9434l53977C454a8232A03215a31187C46255a94000
12954B55486b75755a21320C9184b17284j93720A75923e3614j97495N3453l6052
12944b33708A8729C750g4761A11404M3249N4445P7031a46064g0965j18553B62913
12932A21265j7716c69711A88577D0799M0266D864a49331A5695M11953k8482g6260
$$ plain form
12920 76126 148278 246978 164383 -27712 -8837 267370 -82872 -26122 217726 108052 265608
12909 265608 -81690 280276 12286 735 318104 -293900 428433 -157657 154409 -18500 102269
12897 -288840 -69606 122695 429386 -79412 454362 -119897 105056 380017 46342 255209
12887 255209 109370 101251 11181 430069 -437979 130488 117442 29188 -32361 73457 -192774
12875 98293 4462 314256 -297777 38931 -150828 -85955 42088 -107817 136861 3657 -21957
12863 -52768 44566 8806 67453 311872 122777 77959 -123677 127018 -31460 -60970 -50823
12852 -50823 -156774 -88608 175399 -33964 -191682 232232 141496 208665 -100463 33510 -267877
12840 71609 37449 192066 412491 -258828 224049 -215243 -30205 244429 -190914 80877
$$ packed form
12920G6126P2152R8700q2595b7712h837B67370h2872b6122B17726A08052J57556
12909B65608h1690B80276A2286G35L17369b93900D28433a57657A54409a8500A02269
12897b88840f9606A22695L06691g9412D54362a19897A05056K74961D6342K08867
12887B55209A09370q119A1181M18888d37979A30488j3046B9188c2361G3457a92774
12875I8293D462L09794b97777C8931a50828O4873D2088a07817A36861C657b1957
12863e2768D4566H806N8647K44419A22777m4818a23677A27018c1460k9510J0147
12852e0823j05951O8166A75399c3964j57718B32232r0736O7169a00463C3510b67877
12840G1609l4160J54617K20425b58828B24049b15243c0205B44429a90914H0877
$$ plain form
12829 -250387 116115 -404608 297177 178839 110504 150113 -190276 77010 152129 106015
12819 106015 -39064 119774 295655 -143990 37491 -102205 13511 186180 48203 -129625
12808 78461 -25152 135016 255651 198767 79438 -100450 -90453 180376 238430 151070 -104394
12796 35351 -441208 180068 13139 87365 170100 152436 135693 34476 -98981 102584 -216758
12784 112362 120279 202638 -7791 -226311 -54539 191353 150708 -270803 42611 92738 16890
12772 -38010 -123919 -278679 -30865 -231286 -260603 121574 328645 121169 132361 397990
12762 397990 -99733 124762 109389 -171871 -210367 106363 28946 84524 15656 62895 -121775
12750 -74917 110288 181928 45075 -119686 234302 278528 96775 19098 -190733 188606 15145
$$ packed form
12829b50387A16115d04608B97177j18338o8335L9609a90276G7010P5119m6114
12819A06015c9064A19774J75881a43990C7491a02205A3511J72669D8203a29625
12808G8461b5152A35016J20635n6884G9438a00450R997A80376N8054q7360a04394
12796C5351d41208A80068A3139P4226Q2735j7664j6743C4476i8981A02584b16758
12784A12362P917Q2359g791k18520e4539A91353m0645b70803D2611N0127A6890
12772c8010q5909j54760c0865k00421k9317A21574K07071A21169J1192K65629
12762C97990i9733A24762j5373a71871l8496A06363B8946N5578A5656M7239a21775
12750g4917A10288P1640D5075a19686B34302M4226I6775A9098a90733A88606A5145
$$ plain form
12738 126930 127172 -93012 150671 -220393 156204 79457 -175267 -128225 283836 23982 -96158
12726 -68096 -50221 35544 -116095 43077 180309 43336 58695 324707 327660 16318 20492
12715 20492 231157 -869 -6455 123412 159139 -121107 190058 70792 322019 281547 288320
12704 288320 375928 109802 -175107 164940 180284 127827 188301 168907 -68516 -202009 40190
12692 60486 -234166 -230824 -251778 112274 -307214 -15218 203468 -87216 -57571 -176948 104434
12680 -59089 105763 320314 155004 55136 386504 -468384 7741 53084 100231 293441 -73893
12668 -242851 -95362 6748 -186750 206390 279030 -285117 -85639 245205 -9320 15496 131629
12657 131629 177070 -22764 -145798 29378 6865 316469 20394 24812 113094 -60449 -54165 -99524
$$ packed form
12738A26930K42i3012A50671b20393A56204p6747a75267M7042B83836B3982i6158
12726f8096J7875C5544a16095D3077J37232D3336J5359K66012K953A6318M174
12715B0492K10665h69n586A23412L5727a21107A90058G0792K51227m0472O773
12704B88320Q7608A09802a75107A64940J5344n2457O0474j9394f8516j33493D0190
12692F0486b34166L342k0954A12274c07214a5218B03468h7216K9645j19377A04434
12680e9089A05763K14551A55004E5136L31368d68384G741M5343M7147J93210g3893
12668b42851i5362F748a86750B06390P2640b85117h5639B45205i320A5496J16133
12657A31629M5441b2764j23034B9378F865L09604B0394M418Q8282f0449O284m5359
$$ plain form
12645 -99524 171638 51717 116264 -215381 -90604 -116939 -179891 232670 71611 -84061 171151
12633 -172350 159577 63445 -116724 82757 37471 237382 104101 543881 34224 -18910
12622 127460 252618 315431 288356 27229 320422 -56239 93368 72941 -130968 62642 279830
12611 279830 -44367 231101 -3947 -72919 -196371 -273485 -353287 -296798 229894 -115246 362885
12599 61942 131598 397846 345921 228146 346809 229328 -146231 -186462 100633 -225371
12588 121383 -188520 64247 -22774 362020 -88299 -185720 180806 118407 -57475 245188 166059
12577 166059 96550 128064 -54511 144996 19577 197854 654461 52556 205214 -172396
12566 -9094 182197 -16099 17882 -142024 -280549 85353 37982 41823 129306 104989 319058
$$ packed form
12645i9524A71638E1717O4547b15381i0604k6335o2952B32670G1611h4061A71151
12633a72350A59577F3445a16724H2757C7471J99911A04101M39780C4224a8910
12622A27460J25158O2813k7075B7229K93193e6239I3368k0427a30968F2642K17188
12611B79830d4367B31101c947o8972j23452p7114p9802N6489B29894a15246C62885
12599F1942O9656K66248n1925j17775J18663j17481a46231m0231A00633b25371
12588A21383a88520F4247b2774C62020h8299r7421A80806o2399e7475B45188p9129
12577A66059o9509L1514e4511A44996A9577J78277M56607E2556J52658a72396
12566i094A82197a6099A7882a42024j38525H5353C7982L841Q7483k4317K14069
$$ plain form
12555 319058 61136 184998 93432 -386693 -25730 59042 -260688 183263 245026 -109357
12544 -101719 48831 160973 78033 403541 43058 51247 114941 -178726 -194623 58753 117614
12533 117614 -241694 -242559 231456 -926 3444 103137 221961 -154449 289712 111070 -461 -95859
12521 -95859 -3150 68780 343577 113303 337360 -171149 -27613 -349138 -110277 107332
12510 77880 114200 97262 -81115 -387636 -267738 50867 187196 -85742 -175575 112739 -342219
12498 104811 81517 22451 13757 102711 -63470 -98848 78012 84208 39502 64404 -95149 143660
12485 -118020 -445423 -102251 38544 53000 -47938 -66717 -246675 23029 72766 164422 4887
12473 274650 -72378 61776 128295 299653 -57568 169368 -102693 15190 -137308 23353 198167
$$ packed form
12555C19058F1136J23862r1566c86693b5730E9042b60688A83263O1763a09357
12544a01719D8831J12142G8033L25508D3058Q189O3694a78726j5897E8753N8861
12533A17614b41694q65B31456i26C444R9693J18824a54449B89712A11070d61r5398
12521i5859c150F8780K74797A13303K24057a71149b7613l21525a10277A07332
12510G7880L6320j6938h1115l06521J19898E0867J36329h5742q9833A12739c42219
12498A04811k3294B2451q694Q8954f3470l5378G8012O196C9502K4902i5149A43660
12485a18020l27403a02251C8544J4456d7938j8779j79958B3029M9737R1656D887
12473B74650g2378F1776O6519J71358e7568A69368a02693A5190a37308B3353J74814
$$ plain form
12462 198167 54801 105911 20606 -43642 391677 70483 174988 -399336 197539 -17445 -218405
12451 -218405 -71234 229605 -78582 2281 -149685 551520 121584 -252892 -140859 26317
12440 -75885 306103 124561 -238057 -192779 -224548 -17258 -376270 -200925 28779 -207319
12429 145538 47214 -174973 -47738 14379 -89606 -162238 115669 150725 111880 -83254 -89347
12418 -89347 24405 -302843 -70233 400285 -269360 -268436 59587 -25146 218993 -112788 -261645
12407 -261645 10056 -40608 93058 -197681 298407 224922 110962 -178444 -243293 -418328
12397 -418328 -189085 -190532 -189754 -125951 103977 181216 -149837 -78978 18972 -284879 -636333
12386 -636333 269095 -44565 -241633 -151298 -355562 -175208 -44992 -176979 -128168 382247
$$ packed form
12462A98167E4801N1110B0606d3642C91677G0483J04505c99336A97539a7445k00960
12451b18405g1234B29605g8582B281a49685E51520A21584b52892J12033B6317
12440g5885C06103A24561b38057M5278l1769a7258l59012J75345B8779b07319
12429A45538D7214a74973d7738A4379h9606p2632A15669L5056l8845h3254o093
12418h9347B4405c02843g0233D00285b69360R24E9587b5146B18993a12788j48857
12407b61645A0056d0608I3058a97681B98407p3485A10962a78444o4849j75035
12397d18328a89085j447P78O3803A03977P7239a49837P0859A8972b84879l51454
12386f36333B69095d4565j97068R0335k04264a75208d4992j31987M8811C82247
$$ plain form
12375 97783 34730 -133900 116110 220288 -179420 -33174 -15057 201581 118939 -263116
12364 435679 142496 -25162 -40409 181560 -201373 -257623 -285825 376749 89596 163800 148357
12353 148357 274400 -247107 63958 287111 -77463 142371 -326662 183923 -3345 14891
12342 115542 -99389 -56897 4230 -136454 -270149 -86349 -151548 -173834 241784 137321 -25689
12330 -35198 -43747 17987 291206 -11286 -61263 32389 179345 -412718 38764 126830 -289947
12318 75092 -180509 58950 107446 124967 -133527 35808 115529 -83687 -154112 -36266 -280783
12307 -280783 -6313 131150 191867 38521 -108892 266083 156763 -135906 66897 -139682
12296 58674 254554 175444 -47231 -206814 204763 -73048 -148082 57955 -77534 239251 -185363
$$ packed form
12375I7783C4730a33900A16110J04178a79420c3174a5057B01581q2642b63116
12364D35679A42496b5162j5247A81560b01373n6250k8202C76749H9596P4204j5443
12353A48357J26043b47107F3958K23153g7463A42371c26662A83923c345A4891
12342A15542i9389M2492D230a36454j33695h6349o5199k2286B41784j04463b5689
12330c5198q549A7987K73219a1286m9977C2389J46956d12718C8764Q8066b89947
12318G5092a80509E8950M8496J7521a33527C5808P9721h3687p0425c6266k44517
12307b80783f313A31150O0717C8521a08892B66083j09320a35906F6897a39682
12296E8674J95880p9110d7231j59583B04763g3048p5034E7955g7534B39251a85363
$$ plain form
12284 -43105 299441 39750 -46148 87212 -31718 21940 167505 -119858 -15887 123281 191790
12273 191790 282408 185541 2289 52996 -73173 76099 -132118 226473 343550 -132763 -8055
12261 73844 59960 367109 55458 -102580 288717 181281 238924 239341 102287 150592 18507
12249 238340 -211165 -326692 -95416 85605 -21225 -80997 18514 550744 211950 -231753
12238 214827 -93096 139907 272953 -120179 -317401 -41273 -205068 174341 400052 -109133
12227 313283 105323 108397 53178 165456 203229 108937 -114110 134619 166933 326917 380607
12216 380607 361868 7287 172106 8091 8246 264832 -184902 219956 116050 315763 68506
12204 164919 -166588 -54735 329979 -16893 822 169881 65410 140187 355164 -16941 71951
$$ packed form
12284d3105B99441C9750d6148H7212c1718B1940J45565a19858a5887A23281O8509
12273A91790R0618r6867B289N0707g3173G6099a32118B26473J17077a32763h055
12261G3844j3884L07149E5458a02580B88717j07436N7643M17A02287M8305A8507
12249B38340b11165j15527i5416H5605b1225n9772A8514N32230B11950b31753
12238B14827i3096A39907J33046a20179j97222d1273j63795A74341K25711a09133
12227C13283A05323L074E3178J12278L7773r4292a14110A34619L2314J59984N3690
12216C80607j8739G287J64819H091J55K56586a84902B19956j03906J99713F8506
12204A64919a66588e4735C29979a6893H22J69059F5410P4777K14977a6941G1951
$$ plain form
12192 -114947 206299 102821 2957 214076 75138 19389 -83766 249190 -119164 121591
12181 315149 118874 249134 -245149 157930 -32162 60894 -247000 364718 -64104 340723
12170 -34639 313251 43126 369293 252011 243708 120412 116739 165558 144483 -106106 64622
12158 137242 25585 -220926 320568 116410 132539 -955 34489 -84709 -134338 94366 251986
12147 251986 75632 -92836 -27346 67089 114491 267724 198524 50623 -49894 160284 222649
12136 222649 68076 33096 -7696 -88087 172381 305284 -447896 -122480 -168364 209952 -93052
12124 228057 -248420 294982 128587 -193747 40739 16309 49841 -158951 36445 -77755
12113 300670 26614 32959 258515 289124 165282 60654 272490 263668 11084 71514 -158541
$$ packed form
12192a14947B06299A02821B957K11119G5138A9389h3766B49190a19164A21591
12181C15149A18874J30260b45149A57930c2162F0894b47000C64718f4104C40723
12170c4639C13251D3126L26167j17282q303A20412l673M8819k1075a06106F4622
12158A37242B5585b20926C20568A16410J6129i55C4489h4709m9629I4366J57620
12147B51986G5632i2836b7346F7089M7402J53233o9200E0623d9894A60284O2365
12136B22649F8076C3096g696q0391A72381J32903d47896a22480m5884B09952i3052
12124B28057b48420B94982A28587a93747D0739A6309L3532a58951C6445g7755
12113C00670B6614O345K25556L0609j23842F0654K11836q822A1084O0430a58541
$$ plain form
12101 -253729 -56487 -14727 -148782 -269805 35299 14719 -109797 -95009 -136700 -22395 -131565
12090 -131565 -210308 80712 -157217 5734 -61696 31543 -89049 -171471 -257022 -470376 -23033
12078 108885 -197869 417570 32778 216296 19485 217261 299514 1114192 2147020 709546
12067 389393 76429 327907 86826 173575 205864 -194708 26995 -108449 13909 297029 52819
12055 -19285 -26877 226574 315036 -83076 -41196 335074 118423 -46669 236656 24997 -212654
12043 266247 -32134 215997 128895 -215572 162306 -130690 227168 -257632 14211 -264208
12032 10024 -99156 1967 -63101 41726 10485 70496 201351 -118655 -5447 140930 45222
12020 29748 -33214 75958 333085 250215 113038 79608 82762 -95899 -193878 -75946 87854
$$ packed form
12101b53729e6487a4727j34055j21023C5299A4719a09797J4788m1691b2395j09170
12090a31565p8743H0712a57217E734f1696C1543h9049q2422q5551k13354b3033
12078A08885a97869D17570C2778J83518A9485J97776Q2253Q14678J032828G09546
12067C89393G6429K51478H6826Q6749L2289a94708B6995a08449A3909K83120E2819
12055a9285p592B26574Q8462h3076d1196C35074A18423d6669B36656B4997b12654
12043B66247c2134B15997q7102b15572A62306a30690B27168b57632A4211b64208
12032A0024i9156A967f3101D1726A0485O0011J30855a18655e447A40930D5222
12020B9748c3214G5958K57127q2870A13038l3430L154i5899r7979g5946H7854
$$ plain form
12008 -150416 70794 44109 60598 -40538 35701 -81610 -142802 -265411 113677 -103613 -25404
11996 -185978 -45814 400315 236132 171159 -258355 -253808 -368652 -174431 115567 195899
11986 195899 -125163 61620 61681 342704 244885 178283 -26230 24150 -96751 -22879 -38192 -2828
11973 -152620 -133135 -49161 128904 64050 48129 -147547 -69575 -82740 -74651 106281 -23855
11961 -130730 146984 56932 -268765 -137287 257744 -38797 219966 101873 -152386 37445
11950 166346 -66316 -120758 370239 -109910 -222832 -100061 -104870 399444 -83693 146223
11939 -277260 271066 -109236 -69433 -85163 100556 -137440 21533 12167 -252901 -237534 -88324
11927 -34385 -128744 -325107 -15091 -72841 153866 -192186 -75985 -276787 119651 -118166
$$ packed form
12008a50416G0794k6685J6489d0538C5701h1610o1192j22609A13677a03613b5404
11996a85978d5814D00315j64183o4973b58355M547j14844a74431A15567Q0332
11986A95899a25163F1620O1K81023r7819o6602b6230B4150i6751b2879j5313b828
11973a52620J9485d9161A28904F4050j5921a47547f9575j3165Q089A06281b3855
11961a30730A46984E6932b68765J31478B57744c8797B19966A01873a52386C7445
11950A66346f6316n4442C70239a09910j12922a00061m809C99444h3693A46223
11939b77260B71066a09236L9803j5730A00556a37440B1533r366b52901J5367h8324
11927c4385r4359j96363a5091n7750A53866a92186g5985k00802A19651a18166
$$ plain form
11916 -71815 82483 209604 61250 356 119810 -318282 -61534 -241917 357 -22358 49261 -135098
11903 57217 -56786 144037 -189074 61963 -81745 251882 38486 -124393 13350 -166489 71290
11891 -335227 -98664 -218 51848 -135693 306936 -219489 76425 50609 240780 -80691 73309
11879 31438 -30502 44948 -66005 -167788 145501 191401 -223595 -138164 -81944 -23850 -240192
11868 -240192 -346854 -153305 -292462 172481 -191852 -106514 67514 146347 -139949 272546
11857 40721 -341853 25471 -183395 -178400 -191547 227890 13625 -237532 -88437 -103292 -176798
11846 -176798 111360 392014 11657 -90874 15672 6471 71337 -78280 193909 -17868 174590
11834 16685 -32922 -8580 49486 18241 -166671 9096 43913 203416 -589 -90883 -24738 33910
$$ packed form
11916g1815H2483J27121F1250C56J19454c18282f1534j80383C57b2358D9261a35098
11903E7217e6786A44037a89074F1963h1745B51882C8486a24393A3350a66489G1290
11891c35227i8664b18E1848a35693C06936b19489G6425k5816J90171h0691G3309
11879C1438c0502D4948f6005j01783A45501M5900b23595Q5431N6220b3850k16342
11868b40192j06662a53305j39157A72481a91852Q5338F7514P8833a39949B72546
11857D0721c41853B5471a83395M995j3147B27890A3625b37532h8437j4855p3506
11846a76798A11360K80654A1657i0874A5672F471O4866g8280A93909a7868A74590
11834A6685c2922h580D9486A8241a66671I096L4817J59503e89r0294b4738C3910
$$ plain form
11821 -155940 -306185 16118 14740 409800 18477 -277709 201108 -151496 -98837 165765
11810 -57055 329371 133170 58834 243859 73653 -84969 114474 97606 308856 -260674
11799 -103458 -334340 304351 259714 -197097 233199 17372 -198920 -95842 -32244 202426
11788 153258 -34692 -106768 -133004 -358977 64958 70083 274375 -147587 11299 -46852 -49676
11777 -49676 19598 28768 -38871 111354 -145300 -5833 -29729 142993 132994 58426 -136420
11765 -51263 56239 208177 -88791 -303784 202188 -3406 -73207 -378613 -159941 -358249 51563
11753 134313 -122145 -8645 114473 207348 -10236 41480 -136345 124574 -63043 49627 -484203
11741 -217962 -214246 -2708 69641 -202543 33233 -279954 195928 29093 -196604 -7863 259777
$$ packed form
11821a55940j50245A6118j378L95060A8477b77709B01108a51496N2659A65765
11810e7055C29371A33170E8834J85025G3653h4969A14474j6868K11250b60674
11799a03458k30882C04351m4637a97097B33199A7372a98920i5842c2244B02426
11788A53258c4692p2076k6236k25973F4958N125K04292a47587A1299d6852k824
11777d9676A9598R170c8871A11354a45300e833k3896A42993r999E8426a36420
11765e1263E6239J51938h8791k14993B02188c406o9801l05406a59941j98308E1563
11753A34313a22145h645A14473R2875a0236D1480a36345A24574f3043D9627d84203
11741b17962L716b708F9641b02543C3233b79954A95928B9093a96604g863B59777
$$ plain form
11729 72716 42069 159175 -163508 78304 305056 -221197 85276 132148 120123 -75365 -184526
11718 -184526 -12599 182967 -276399 -1082 225721 -171403 81465 21032 -180379 230024
11707 -227787 303143 98281 100785 -24914 -104665 -25399 107608 181078 -122049 196132 -180287
11695 37754 -269208 352108 240595 -83230 131978 55633 49952 264563 -218144 329045
11684 -115664 -148807 44752 71958 171948 124060 -32448 141122 56533 77259 9010 -178993
11672 307099 235845 -186316 161234 94679 18963 -245404 -61274 43463 62269 -89775 154740
11660 -103079 -136364 22804 -35502 -200078 134042 -71523 136485 -14786 173589 45944 266719
11649 266719 70968 7067 26411 85124 182237 -44874 -102315 -201799 96932 131865 -159236
$$ packed form
11729G2716l0647J17106a63508G8304K26752b21197H5276M6872j2025g5365j09161
11718a84526a2599A82967b76399a082B25721a71403H1465B1032a80379B30024
11707b27787C03143I8281K504b4914p9751b5399A07608P3470a22049A96132a80287
11695C7754b69208C52108j11513h3230A31978E5633n681K14611b18144C29045
11684a15664l3143D4752K7206R9990m7888c2448A41122E6533K0726I010a78993
11672C07099p1254a86316A61234o6555A8963b45404f1274D3463J8806h9775A54740
11660a03079l3285B2804c5502j64576A34042g1523A36485a4786A73589D5944K20775
11649B66719G0968G067J9344N8713R7113d4874n7441r9484I6932L4933a59236
$$ plain form
11637 9501 -304223 -82387 -96703 243550 50742 -75317 344946 -33984 -202534 -11008 -118311
11626 -118311 425957 -118359 188088 472492 -139383 132611 -71297 32574 -208868 -309114
11616 -309114 -29893 84520 38285 -33354 3865 -135184 -16019 -93805 40982 17692 141411
11605 141411 247168 -71269 -186230 168084 -288300 151084 108911 73941 -100513 -21690
11594 71030 -94232 88101 -100066 40905 187979 16611 367174 135884 196663 331525 359071
11583 359071 101840 106654 -176842 -24345 -36339 -15435 304781 248902 20154 -149359 73890
11571 171936 -181437 194963 112659 27621 385287 330616 -192038 -32261 -68574 -277558
11561 -277558 7462 -94572 -27985 250527 94976 423052 35180 -212707 125287 80806 409902
$$ packed form
11637I501c04223h2387j4316B43550E0742g5317C44946c3984j68550a1008j07303
11626a18311D25957a18359A88088K84404a39383A32611g1297C2574b08868j00246
11616c09114b9893H4520C8285c3354C865a35184a6019p7786D0982A7692J23719
11605A41411J05757g1269j14961A68084b88300A51084m2173l4970a00513b1690
11594G1030i4232H8101a00066D0905J47074A6611L50563A35884O0779J34862K7546
11583C59071A01840M814a76842b4345j1994a5435C04781n5879B0154a49359G3890
11571A71936a81437A94963q2304B7621L57666n4671a92038c2261l6313k08984
11561b77558G462i4572b7985B50527I4976L28076C5180b12707A25287m4481L29096
$$ plain form
11550 409902 -238498 27201 -92208 -135095 -51236 202751 99834 -83006 385867 296804 -33413
11538 180221 48350 191175 19540 246151 21564 401981 157440 -180787 48008 -64622
11527 107151 -85474 46257 172022 440258 189949 -131212 197848 204759 56165 295659
11517 295659 -119794 384407 106880 272843 278217 223783 3662 75298 -71007 124823 46197
11505 -115594 60960 -96957 163178 -24138 9600 99294 -450530 -114612 145237 -89416 14330
11493 -63545 -32848 262302 -1039 273383 125381 48979 212034 444541 82834 230791 288897
11482 288897 288689 141829 391438 336811 -190286 502982 16444 -118254 -171666 -41153 -124159
11471 -124159 161337 -45501 123566 -27631 162921 51536 -63759 176243 56599 -301999
$$ packed form
11550D09902b38498B7201i2208m2887e1236B02751I9834h3006C85867q9063c3413
11538A80221D8350J42825A9540K26611B1564L80417A57440a80787D8008f4622
11527A07151h5474D6257J25765K68236A89949a31212A97848O911E6165K39494
11517B95659a19794C84407A06880J65963N374n4434C662P1636g1007A24823D6197
11505a15594F0960i6957A63178b4138I600Q9694d50530a14612A45237h9416A4330
11493f3545L0697B62302a039B73383A25381D8979J63055K32507H2834J47957N8106
11482B88897k08A41829K49609n4627a90286E02982A6444a18254n3412d1153q3006
11471a24159A61337d5501A23566b7631A62921E1536f3759A76243E6599c01999
$$ plain form
11460 19371 19689 261342 32370 -78120 71240 -214925 41440 125961 -102585 -165271 170371
11448 100815 -94910 351252 -229475 210901 -302822 -92803 238689 292371 183108 -7536
11437 93675 296304 -178442 -8195 165052 71409 -29459 116589 -409893 512930 -143563
11426 271528 -98256 4851 -232992 21716 -76333 7091 68530 -286623 102770 276613 91818
11414 -40217 240731 174131 147144 -69854 222132 269239 -128904 -74029 -19345 146149 130689
11403 130689 -14606 48934 8303 358863 182910 240097 326086 -240735 -503586 131639 -277920
11391 -246578 -104678 -173077 195085 79651 -373390 -3778 41553 -375431 88041 115116 -80130
11379 30804 -39653 155135 -64736 -378387 -42933 129626 -668419 -370669 294652 -158518
$$ packed form
11460A9371L18K41653C2370g8120G1240b14925D1440Q4521a02585o2686A70371
11448A00815i4910C51252b29475B10901c02822i2803B38689N3682j09263g536
11437I3675K02629a78442h195A65052G1409b9459A16589d09893E12930a43563
11426B71528i8256D851b32992B1716g6333G091O1439b86623A02770J73843I1818
11414d0217B40731o6600k6987f9854B22132M7107a28904N4875a9345A46149j5460
11403A30689a4606D8934H303L50560j75953N7187Q5989b40735k62851A31639b77920
11391b46578a04678o8399A95085G9651c73390c778D1553c75431H8041K7075h0130
11379C0804c9653A55135f4736l13651d2933A29626f68419K97750B94652a58518
$$ plain form
11368 -7908 -121827 -60316 -470029 -769 -124606 -37257 -101488 -83874 -127663 -14823 71031 -32905
11355 100193 -161066 -12130 33932 -60882 -3316 68766 -177301 35674 262990 137024 -208072
11343 63761 -50788 133900 94977 -301262 -162083 29568 -80518 72025 3755 207214 71640
11331 59366 527847 -121618 159040 34126 125482 36006 4579 -157566 -258720 -307619 -23070
11319 -131463 -118751 -149342 11655 190949 128123 267559 -132769 -107854 19674 -83155 21586
11307 104317 -149959 142553 54612 -55435 -48348 -197319 -227484 30949 -28918 -131092 -310563
11296 -310563 173050 -167271 135995 57619 -117423 -51258 16947 62567 -304376 155854
11285 31210 -7670 -237259 48740 -255195 20173 425463 -285321 -273645 288149 -104759 -245195
$$ packed form
11368g908j13919f0316m09713g69j23837c7257o4231J7614m3789a4823G1031c2905
11355A00193a61066a2130C3932f0882c316F8766a77301C5674K27316j25966b08072
11343F3761e0788A33900l8923c01262J39179B9568h0518G2025C755K03459G1640
11331E9366M68481a21618A59040C4126R1356C6006D579a57566j01154m8899b3070
11319a31463J2712l0591A1655J79294o2826J39436a32769K4915A9674h3155B1586
11307A04317a49959A42553E4612e5435P087j48971l0165C0949b8918j02174j79471
11296c10563A73050a67271A35995E7619a17423e1258A6947M5620c04376A55854
11285C1210g670k29589D8740b55195B0173M05290b85321J1676B88149a04759j40436
$$ plain form
11274 -245195 95988 -440670 9040 -129861 -40071 -273264 -221605 89558 -82500 -306970 -158103
11263 -158103 -138433 -315378 174435 235659 27494 116339 165097 229337 87103 5896 83234
11252 83234 197016 35139 99433 -59720 -63477 -269787 -95503 -352760 -438638 190461 -210147
11240 -148837 -119099 -301864 4952 125308 49413 82584 219714 6221 -832 58002 -139730
11228 102457 -97913 -120003 -135365 -80441 290555 -127271 -154273 116028 -100039 -80241 -385969
11217 -385969 149610 -20590 195117 -101538 146982 -32103 -314476 -417903 -106099 81471
11206 50384 67086 181306 -301897 310831 -403949 62479 93875 58415 -17914 -39376 -64095
11195 -64095 -97902 382583 166645 323930 -3097 -16826 -67213 312777 -56608 146755 62298
$$ packed form
11274b45195I5988d40670I040a29861d0071k33193N1659H9558h2500k24470J48867
11263a58103J9670j76945A74435O1224B7494Q8845M8758O4240H7103E896P7338
11252H3234J13782C5139O4294e9720l757k06310i5503k57257q5878A90461b10147
11240a48837K9738j82765D952J20356D9413L3171J37130F221h32E8002a39730
11228A02457i7913k2090j5362N4924B90555a27271k7002A16028a00039J9798l05728
11217c85969A49610b0590A95117a01538A46982c2103k82373j03427a06099H1471
11206E0384J6702J14220c01897C10831d03949F2479L1396l5460a7914k1462k4719
11195f4095l3807C82583A66645J57285c097j3729n0387C12777e6608A46755F2298
$$ plain form
11183 -209053 -161735 175871 -110984 6914 -69097 -6719 -123970 132418 -202800 354748 56254
11171 -258815 -138732 58894 28967 -229818 -158725 -161793 -36769 127222 8791 -25286 -126371
11160 -126371 -15365 163290 -40797 -11300 -178452 17460 85949 -134148 -36501 97862 183053
11149 183053 22796 -338182 -141314 -164998 313656 364415 -41639 -100245 -132520 -398880 36709
11137 -15684 -199120 -201169 297402 -52309 140693 152487 93556 925 -74134 -40042 49855 72943
11125 72943 196875 -99964 122360 118522 114032 60598 141186 470737 -209762 260409 47070
11113 7221 270670 198792 -82476 -114578 174200 320249 -14873 37334 -66417 234173 161731
11102 161731 205432 41665 348248 -168852 345337 60316 193950 245920 29117 250639
$$ packed form
11183b09053M7318A75871a10984F914f9097f719j17251A32418b02800C54748E6254
11171b58815J20083E8894B8967b29818P1093l068c6769A27222H791b5286j01085
11160a26371a5365A63290d0797a1300j67152A7460O8489a34148c6501I7862Q5191
11149A83053B2796c38182a41314k3684C13656N0759d1639n8606l2275k66360C6709
11137a5684j83436k049B97402e2309A40693J1794n8931I25g4134L4092D9855K3088
11125G2943J23932i9964A22360l838m490n3434Q0588L29551b09762B60409D7070
11113G221K63449p1878h2476l2102A74200J46049a4873C7334f6417B34173p2442
11102A61731M3701D1665L06583a68852C45337F0316J33634N1970B9117K21522
$$ plain form
11092 250639 92124 188267 298093 126515 -12255 331431 102477 109935 437996 316938
11082 316938 169621 -103426 152498 281051 -177765 365789 547696 218030 282777 31958
11071 426777 302908 287475 415975 70702 415250 309696 189036 589838 323033 266565
11061 266565 322686 426379 769831 658933 618017 577336 658163 642387 783059 851310 586955
11050 586955 571089 432266 785933 464042 289331 571225 361323 655704 640371 655464
11040 655464 414445 468905 1049138 666524 568267 466944 496109 741143 703582 870178
11030 870178 767557 707231 579925 632912 253718 582630 480212 92876 677859 284857
11019 758305 729914 624098 552159 464894 324790 587657 731515 561642 533193 543414
$$ packed form
11092B50639I2124R6143J09826A26515a2255C31431A02477P458L28061j21058
11082C16938j47317a03426A52498J28553a77765C65789J81907B18030O4747C1958
11071D26777j23869j5433J28500G0702L44548j05554j20660M00802k66805n6468
11061B66565N6121J03693L43452j10898m0916m0681Q0827j5776J40672O8251k64355
11050E86955j5866j38823L53667l21891j74711K81894k09902K94381j5333J5093
11040F55464k41019N4460N80233l82614r8257j01323K9165K45034l7561J66596
11030H70178j02621o0326j27306N2987B53718L28912j02418I2876N84983B84857
11019G58305k8391j05816p1939q7265j40104K62867J43858j69873k8449J0221
$$ plain form
11009 543414 520635 530145 556379 644738 601301 443685 384186 500069 642201 715439 562982
10998 562982 887630 772049 644492 450154 488512 586459 847148 514827 841341 452254
10988 452254 902803 775644 977662 1081487 812026 880092 1009366 1143454 1153737 1360617
10978 1360617 1264070 1362724 1948785 1691056 2566093 2760787 2682479 2605357 2822476 2659051
10968 2659051 2641798 2564783 1938269 1813727 1685489 1517827 1859723 1202675 1426901 1610805
10958 1610805 1230258 1655247 1382675 2046456 1224604 1322664 962682 1116803 525088 658920
10948 658920 565544 744510 487573 402949 188336 291585 293816 240524 19687 205888 -10691
10936 204530 -28727 126130 480375 77852 366200 174913 -325871 -115394 101164 -104604
$$ packed form
11009E43414k2779R510K6234Q8359m3437j57616n9499J15883J42132P3238j52457
10998E62982L24648j15581j27557j94338L8358R7947K60689l32321L26514l89087
10988D52254M50549j27159K02018J03825k69461O8066J29274J34088J0283K06880
10978A360617r6547R8654N86061k57729Q75037J94694p8308p7122K17119j63425
10968B659051j7253p7015o26514j24542j28238j67662L41896o57048K24226J83904
10958A610805l80547M24989k72572O63781q21852R8060l59982J54121E25088J33832
10948F58920r3376J78966k56937q4624A88336J03249K231n3292A9687J86201a0691
10936B04530b8727A26130L54245G7852K88348A74913c25871a15394A01164a04604
$$ plain form
10925 -137621 -134204 40110 4044 -237357 -77826 48269 223240 -93320 29778 -168510 92983
10913 75737 -81305 2344 -76590 158096 -54001 -417524 79245 -223849 134612 8408 239040
10902 239040 -26523 -28878 45861 -173153 26284 -274701 181436 132787 -116247 146501 -42894
10890 214321 132856 -323550 -204523 -287911 -244127 -123364 -49111 -171790 -298279 -241765
10880 -241765 6183 58154 -83446 127954 123999 -142181 -211343 89379 111501 -93791 116557
10868 229093 -33689 149331 239513 112359 44 79122 83697 -203513 311692 -158800 -87985
10857 -87985 -225936 -233677 10864 209349 -171339 -84899 -201592 -69511 369363 7558 206345
10846 206345 11353 220610 141371 -25162 106791 -173103 -87525 -81069 50280 266905 -80117
$$ packed form
10925a37621L417D0110D044b37357g7826D8269J74971i3320B9778a68510I2983
10913G5737h1305B344g6590A58096e4001l63523G9245b23849A34612H408K30632
10902B39040b6523k355D5861a73153B6284b74701A81436m8649a16247A46501d2894
10890B14321q1465c23550J19027q3388M3784J20763d9111j22679j26489N6514
10880b41765F183N1971h3446A27954l955a42181o9162H9379K2122i3791A16557
10868B29093c3689A49331R0182A12359D4P9078M575b03513C11692a58800P0815
10857h7985j37951p741A0864J98485a71339h4899j16693f9511C69363G558J98787
10846B06345A1353K09257p9239b5162A06791a73103Q5578O456E0280K16625h0117
$$ plain form
10834 -178875 -179610 186653 153259 -143149 31154 -542331 -36871 -51931 -161911 35841 124050
10823 124050 183838 -22390 199110 -260713 118772 -78893 -161229 -156689 -316131 184490 -468309
10811 -267683 11381 -283088 -153187 -132649 -153199 -147286 -35357 239503 -99042 -155174 225154
10799 125203 -121770 343164 -324077 128046 4888 -53679 208055 -42693 -111129 -281466
10789 -281466 -168897 225430 -174446 34905 51124 -10395 -175420 -111801 -293190 -237519
10779 -237519 124464 79519 487514 -45072 -303 -157468 -65813 259122 -53247 191623 121592
10768 121592 -51932 231631 339288 93209 -182376 8137 -153341 -70329 -267718 -27774 348105
10756 -203380 -99240 -252159 320229 -251563 19565 -2625 -293424 -67443 -83456 105930 107437
$$ packed form
10834a78875p35A86653l3394a43149C1154e42331c6871j5060j09980C5841Q8209
10823A24050N9788b2390A99110b60713A18772g8893q2336M540j59442A84490d68309
10811b67683A1381b83088J29901K0538k0550N913c5357B39503i9042n6132B25154
10799A25203a21770C43164c24077A28046D888e3679B08055d2693o8436j70337
10789b81466J12569B25430a74446C4905J6219a0395j65025O3619j81389N5671
10779b37519A24464m4945M07995d5072c03j57165f5813B59122e3247A91623p0031
10768A21592e1932B31631J07657I3209a82376H137a53341g0329j97389b7774C48105
10756b03380i9240j52919C20229b51563A9565b625k90799f7443j6013A05930J507
$$ plain form
10745 107437 221008 -272736 -274765 224441 162874 106719 203374 88127 -153976 -146479 -282560
10734 -282560 -239638 29870 40308 -57172 -47985 158534 314273 341184 121551 -46496 150907
10722 90737 -81209 -382532 109584 -136869 -285901 98652 -31729 -309217 22430 -42261 23069
10710 -274781 232590 -64703 305507 150981 -3422 -83599 158941 276786 152267 -356300
10699 31953 -114483 -262330 -576501 -94569 -149709 -2681 -98452 48351 -144272 272370 156410
10688 156410 -252377 -18607 201295 -209625 -287691 -340861 79933 -87007 -240008 137418
10677 38492 61175 -107941 -53963 -76691 -275133 67293 64025 -191207 -333161 27840 -7072
10665 -138305 -230411 -113262 108060 -227004 -174473 -151847 53139 -403661 -170409 -46680
$$ packed form
10745A07437J13571b72736k029B24441o1567n6155R6655H8127a53976P497j36081
10734b82560M2922B9870J0438e7172R187A58534J55739K6911A21551d6496A50907
10722I0737h1209l01323A09584a36869j49032I8652c1729k77488B2430d2261B3069
10710b74781B32590f4703C05507A50981c422q0177A58941J17845j24519c56300
10699C1953a14483j47847l14171i4569n5140b681r5771D8351a44272B72370j15960
10688A56410b52377a8607B01295b09625p8066n3170G9933h7007j53001A37418
10677C8492K2683a07941e3963k2728j98442F7293l268a91207j41954B7840g072
10665a38305r2106a13262A08060b27004N2531K2626E3139d03661a70409d6680
$$ plain form
10654 -9793 170001 179159 -209924 -128804 -264727 24890 -204461 -134991 60182 -94918 67424
10642 153812 -98028 13618 255267 21515 -167995 135269 -8380 -13849 -104490 43431 -121670
10630 101675 -269837 -149371 -263836 -97747 -92569 290160 214362 -40749 43308 337366 -283691
10618 -349323 -208505 -257065 194262 -149343 600669 69405 230815 -48677 -57067 -172110
10608 -172110 -180798 -16680 -212964 91012 -106336 164461 -108481 -105364 122875 60833 -192852
10596 -129823 44635 -156140 -41377 -60368 -15798 -69609 -289642 177307 88578 -345795 -63929
10584 15359 -140628 -116357 -195447 -93736 -202579 -133638 -198419 -59811 -103387 -136675 -406632
10573 -406632 197185 -149752 47842 341302 -83064 -222673 93694 72717 -123177 -190445
$$ packed form
10654i793A70001R158b09924Q1120j35923B4890b04461O9470F0182i4918F7424
10642A53812i8028A3618K41649B1515a67995A35269h380n469r0641D3431a21670
10630A01675b69837J20466j14465i7747N178B90160p5798d0749D3308K94058b83691
10618c49323J40818m8560A94262a49343F00669F9405J61410d8677q390j15043
10608a72110q688a6680j96284I1012a06336A64461a08481L117A22875F0833a92852
10596a29823D4635a56140d1377j8991a5798n3811k20033A77307H8578c45795f3929
10584A5359a40628K4271p9090i3736j08843O8941o4781e9811m3576l3288k69957
10573d06632A97185a49752D7842K93460h3064j39609I3694k0977a23177o7268
$$ plain form
10563 -190445 -144771 137293 -101754 -124133 -26512 -290920 32345 167919 5288 49137 -180230
10551 -193477 -92188 27286 205194 -51306 222798 72655 13782 -200316 -232408 -248732 181830
10539 40538 -161766 -144144 -173326 -209427 20889 -31701 -80997 -333085 -169331 -210155 57046
10527 60264 218175 -239471 4666 295140 -70759 250696 -60119 92730 229843 -75758 164791
10515 -533 -344843 76947 -20923 59340 -69349 160525 127188 -3852 46986 -226021 89389 61934
10503 61934 -22544 -125931 32753 140284 -373018 257673 60890 194046 -167524 382116
10492 389777 56904 35418 -232813 571877 -155855 -165848 -242159 -81953 319801 61344 -4331
10480 -86012 1308 371707 450934 103464 -120098 155517 -313216 50130 -318089 269722
$$ packed form
10563a90445M5674A37293a01754k2379b6512k64408C2345J35574E288M3849a80230
10551a93477i2188B7286J77908e1306B22798G2655A3782b00316l2092j6324A81830
10539D0538a61766J7622k9182l6101B0889c1701m9296k52088J63754m0824E7046
10527F0264J57911b39471D666K90474g0759B50696f0119I2730J37113g5758A64791
10515e33l44310G6947b0923E9340f9349A60525l3337c852D6986b26021H9389k7455
10503F1934b2544j03387C2753J07531c73018B57673F0890J33156a67524C82116
10492C89777E6904k1486b32813E71877a55855r993p6311h1953C19801F1344d331
10480h6012A308L70399P9227A03464a20098A55517c13216E0130c18089B69722
$$ plain form
10469 -307284 189878 97978 186817 -213057 -170203 -274886 11809 160355 -227800 56363
10458 -53345 -165533 97987 -111327 139917 -10393 129641 66036 352534 -23868 49134 -158374
10446 131686 263886 -222681 -47069 285941 26925 277120 -49047 -169599 132575 47065
10435 131411 -5638 100801 -548486 11401 171156 -22916 -114067 101094 -172744 -185486 -140830
10424 -140830 -259695 228064 30567 -222883 60771 -4097 -140379 29028 -297916 -110012
10413 -27619 11850 -91239 133969 97353 -178712 -169699 20959 265894 99646 -113803 214675
10401 143511 122149 127546 -105334 96899 -63456 -147188 200569 -132920 23019 -19665 -216713
10390 -216713 -7554 341949 147294 75704 -2486 -161636 -72704 185208 181265 -11451 155406
$$ packed form
10469c07284A89878r1900Q8839b13057M2854j04683A1809J48546b27800E6363
10458e3345j12188I7987a11327A39917a0393A29641o3605K86498b3868D9134a58374
10446A31686J32200b22681d7069B85941B6925K50195d9047j20552A32575D7065
10435A31411e638A00801e48486A1401J59755b2916r1151A01094a72744j2742M4656
10424a40830j18865B28064C0567b22883F0771d097j36282B9028b97916a10012
10413b7619A1850i1239A33969l6616a78712R013B0959K44935I9646a13803B14675
10401A43511k1362N397a05334I6899f3456q3732B00569a32920B3019a9665j97048
10390b16713g554C41949A47294p1590b486j59150g2704A85208l943a1451A55406
$$ plain form
10378 205586 194299 429630 -33281 82906 331902 255295 315993 437092 270477 378956
10368 378956 224473 324018 429365 279710 294167 394671 376677 363568 105906 282252
10358 282252 457815 -21045 214268 -57587 -114353 63142 59334 562030 589897 421668 457527
10347 457527 236262 547205 343744 496091 596645 35426 184875 186575 288560 416251
10337 416251 -170934 46114 50379 451119 253990 264944 61174 292687 -133305 -36095 97396
10325 -21354 93690 161943 334477 264819 224442 -149162 403288 -69911 -21057 -104599 194088
10313 37319 222853 13993 49797 86636 -292435 -175663 -108746 -32212 -46745 217767 257106
10302 257106 -86840 301660 -52093 -59626 22040 300517 -208091 -113303 -357488 -332227 -130339
$$ packed form
10378B05586j1287K35331c3281H2906K48996p6607O0698J21099j66615J08479
10368C78956j54483R9545J05347j49655J4457J00504j7994j3109A05906J76346
10358B82252J75563b1045B14268e7587n6766F3142l808N02696K7867j68229L5859
10347D57527k21265L10943k03461J52347J00554C5426J49449J700J01985J27691
10337D16251a70934D6114M265M00740j97129J0954F1174K31513a33305c6095I7396
10325b1354I3690O8253J72534o9658m0377a49162D03288f9911b1057q3542A94088
10313C7319J85534A3993L5804L6839b92435J16772O6917c2212j4533B17767L9339
10302B57106h6840C01660e2093p533B2040K78477b08091R4788k44185K5261a30339
$$ plain form
10290 -79616 65930 -151850 122003 -49100 -102724 32921 88789 -69034 93842 -214248 159901
10278 -55214 -61295 -135362 -229823 224980 -36212 275913 -401497 89281 163118 -79351 -17140
10266 -166253 -107104 -27081 98761 -162189 22025 601234 273515 181424 411364 132111
10255 174228 252815 190845 425962 -233376 216941 188950 -212507 232458 44475 52921 -213859
10243 -116399 94253 -29901 107875 -50754 -179662 -10936 -223408 80741 -190114 -212887 -107266
10232 -107266 -154741 14812 -226611 -207725 -128391 141488 -284484 134015 21970 -6668 101883
10220 -39874 78698 -133792 170294 -141304 169800 -297239 -476073 -210148 -45661 4235
10209 60230 -133107 -215254 -58865 -328355 -201203 48571 -426521 54260 67416 -23300 -290243
$$ packed form
10290g9616F5930a51850A22003d9100n3624C2921N5868f9034I3842b14248A59901
10278e5214o081p4067r4461B24980c6212B75913d01497H9281P3837g9351a7140
10266a66253N9149b7081I8761a62189B2025N79209B73515r2091K29940A32111
10255A74228P8587o1970K35117b33376B16941k7991b12507B32458D4475Q446b13859
10243a16399I4253b9901A07875e0754j28908a0936k12472H0741a90114k2773J05621
10232a07266m7475A4812b26611J8886P9334A41488b84484A34015B1970f668A01883
10220c9874G8698a33792A70294a41304A69800b97239j78834b10148d5661D235
10209F0230a33107q2147e8865k69490J27152D8571d26521E4260J3156b3300k66943
$$ plain form
10198 -290243 -94230 259777 -33548 1051 -208908 -246526 -386282 -224366 -376880 -127104
10187 -282625 -19951 -151136 78823 -379846 334786 174706 -38679 139748 -120681 46934
10176 163900 -169002 -103567 -55928 -99814 -65926 -231864 82417 -92162 -304993 -21550 156130
10164 -317915 -49488 -132851 -70403 123931 161622 46702 -241984 64327 150724 -109186 -77613
10153 -77613 -18427 394827 273395 -83115 -146789 -77834 -433154 -117850 18629 -176364 235497
10141 -138457 -90751 -44441 -65493 225983 -128209 -195551 292098 80128 -88483 -167618 -78954
10129 -6290 143320 -120412 -92651 76243 -42737 183240 -37918 -325560 111676 -208340 144751
10117 -45783 118888 -29510 -197458 145604 65327 -8851 -331819 22915 -119373 -345275 -268758
$$ packed form
10198b90243i4230B59777c3548A051b08908l7618j39756J61916j52514a27104
10187b82625a9951j31185G8823c79846C34786j60080c8679A39748a20681D6934
10176A63900a69002O5435M7639m3886L3888j65938H2417i2162k12831b1550A56130
10164c17915d9488q3363O2448A23931L7691D6702b41984F4327Q6397a09186L1573
10153g7613a8427C94827j21432h3115o3674O8955l55320a17850A8629a76364B35497
10141a38457M7706d4441k1052B25983a28209o7342B92098H0128h8483p9135g8954
10129f290A43320a20412K7761G6243d2737A83240c7918k87642A11676b08340A44751
10117d5783A18888b9510j67948A45604F5327h851l22968B2915a19373k25902P6517
$$ plain form
10106 -268758 -68585 68674 -114526 -68611 77820 -295885 -207804 639436 -196810 167210
10095 -67268 80916 46328 -178422 -3332 -76730 -123431 227066 1807 -304993 80869 -16836
10083 -45276 200512 -148454 74641 241796 306909 -25013 -10212 -243199 -151115 -152959 1622
10071 -53149 -72677 -511486 -100642 -103232 -14191 -15657 -402984 92642 482460 206449 209201
10060 209201 -184802 -3288 -206320 233178 -116248 -40603 168580 94980 -363309 -10277
10049 -46578 90153 -3316 71962 -444628 -18491 -233876 -159087 151676 323796 135491 -121574
10037 393359 -329444 -195685 -141068 114945 -89286 135295 -133555 35629 -21630 17752
10026 93541 377408 -170208 35121 142941 -171557 273607 171358 -183445 -237534 -175297
$$ packed form
10106b68758f8585F8674a14526M5915G7820b95885Q8081F39436a96810A67210
10095f7268H0916l4588a78422c332p3398m6701B27066A807c04993H0869a6836
10083d5276B00512a48454G4641J67155O5113b5013a0212k32987R2084j844A622
10071e3149j9528m38809a00642k590a4191j466l87327I2642L89818B06449K752
10060B09201a84802c288k03032B33178a16248d0603A68580p3600c63309a0277
10049d6578I0153c316G1962d44628a8491k15385P4789A51676J72120A35491a21574
10037C93359c29444J33759N4617A14945h9286A35295a33555C5629b1630A7752
10026I3541K83867a70208C5121J07820a71557B73607j02249a83445n4089O2237
$$ plain form
10016 -175297 -16462 69956 155297 -183597 26881 -11664 -3378 45415 68979 -20645 116695
10004 -121695 154623 -314729 141145 62352 -252010 -267496 134089 176705 88603 -29182
9993 22228 -186578 119619 -64723 1999 -226708 -144373 -74090 -55244 -29479 -382747 75511
9981 80331 -178051 -346762 -100515 31330 -68025 -197451 -1799 -360377 181956 222568 -197097
9969 154182 61141 80801 -207749 -237894 67911 -64210 -186267 -31030 -16728 -130113 -245830
9958 -245830 98632 -69010 -338544 -36061 -3980 -55462 -222306 -193763 70121 -295199 -119629
9946 -181574 -213635 -211933 -135465 -332609 180843 -178038 19349 150628 -176838 -240495 -152604
9935 -152604 -178097 161746 -5016 -267493 -27969 92496 -226268 93892 -160485 -151034 -201216
$$ packed form
10016a75297a6462F9956Q5341a83597B6881a1664c378D5415K3564b0645A16695
10004a21695A54623c14729A41145F2352b52010j5486A34089M2616q8102b9182
9993B2228a86578A19619f4723A999b26708Q2335P0283J8846K5765l53268G5511
9981H0331a78051j68711a00515C1330f8025j29426a799l58578A81956M0612a97097
9969A54182F1141J9660b07749l0145F7911f4210j22057c1030J4302j13385j15717
9958b45830I8632f9010k69534c6061c980n1482j66844K8543G0121b95199a19629
9946a81574l2061J702P6468j97144A80843a78038A9349J31279a76838o3657Q7891
9935a52604k5493A61746e016k62477b7969I2496b26268I3892a60485R451n0182
$$ plain form
9924 -201216 -181004 137438 -281917 174692 -255599 8266 -52222 -143425 -212573 11371 -53239
9912 -32190 61439 -247345 65411 70112 -250375 53401 -327069 5461 185956 -333565 -405951
9901 -405951 -222403 771 -162779 4418 34217 103954 233769 -100643 -172302 -184577 33136
9889 -243136 -125169 4247 -2795 126062 -149013 -345283 -370367 200833 -55943 61958 -140140
9877 -20367 -262652 -306663 -130946 -110090 -42300 -77288 -6556 -196509 -121113 2217 307143
9866 307143 -453215 37692 -292545 -127954 -170156 -241659 235462 3963 360090 39669 -16923
9854 -31251 88828 114748 178691 -308445 64197 14738 -324811 18516 -164030 66213 -149876
9842 55399 402501 301087 -128533 -71129 146197 -139065 -48069 -241336 -212103 68925 378084
$$ packed form
9924b01216K0212A37438b81917A74692b55599H266e2222r1203o9148A1371e3239
9912c2190F1439b47345F5411M701b50375E3401c27069E461J80495c33565p2386
9901d05951J83548G71a62779D418K9799O9737J29815a00643p1659j2275C3136
9889b43136J17967D247b795A26062a49013j96270k5084B00833e5943F1958a40140
9877b0367k42285m4011a30946K0856d2300l4988f556j89953P5396B217L04926
9866C07143d53215C7692b92545a27954m2202p1503B35462C963L56127C9669a6923
9854c1251H8828K5920O3943c08445F4197A4738c24811A8516a64030F6213a49876
9842E5399L47102j01414a28533N7404A46197a39065d8069j93267K9233F8925L09159
$$ plain form
9831 378084 77244 53045 -229979 -211747 -2628 -364369 -45413 -396137 -108786 -93316 -2854
9819 91042 62680 -206304 -260608 -292963 -356022 44284 57792 -262670 -241 -201991 -189931 -200696
9807 -200696 7786 -82746 27216 53399 149027 -98385 -123332 80060 -120891 36623 -13192 -206408
9795 -206408 -252055 106624 68724 -173987 -123641 -52049 -246522 90842 -433310 -43692 13214
9783 -56214 -140858 -125745 45114 -143790 139805 151 38022 -93391 288710 -17363 -396267
9772 -396267 -292593 183656 -133277 -37463 121779 -172826 -122365 46016 13881 32898 34464
9761 34464 -32346 -104097 158347 -407210 78396 -189150 66206 175860 26103 227576 -75032
9749 68667 37832 -21999 -330546 77491 -255149 -270422 -162790 111758 -13707 -225732 -111902
$$ packed form
9831C78084G7244k4199b29979J8232b628l61741d5413l50724a08786J5470b854
9819I1042k8362b06304n4304l2355o3059D4284J3508b62670b41k01750J2060j0765
9807b00696G786h2746B7216K6183R5628i8385k4947H0060a20891C6623a3192j93216
9795b06408m5647A06624l7900a73987N0346e2049j94473I0842d33310d3692A3214
9783e6214q4644J5113D5114a43790A39805A51L7871i3391B88710a7363l78904
9772c96267J03674A83656a33277c7463A21779a72826N0461D6016A3881J9017J566
9761C4464c2346p1751A58347d07210G8396a89150F6206J09654B6103K01473g5032
9749F8667l0835b1999l08547G7491b55149j5273J07632A11758a3707k12025a11902
$$ plain form
9737 -98169 65079 -27301 37669 -41075 81102 -100701 -245121 -319902 -42121 -159331 -52296
9725 26650 -115932 86296 -77622 -279638 -175817 28629 -372033 -285336 306905 -223996 -7140
9713 48729 -34796 96043 162773 234326 -56433 -323356 140709 -14287 87810 -190258 -158937
9702 -158937 91551 61114 24796 156215 -64318 -44108 -181213 183519 21820 78863 67511
9691 67511 39974 -206593 -34120 -17004 76549 -211496 -6917 -240804 -125444 -264711 -83116
9679 154539 279262 -2184 -162573 196922 -141050 189938 -21659 -356168 40817 57614 -50951
9667 -234217 -308246 -97043 134060 -54314 287605 -108788 -102294 -75475 129468 130868 -78100
9655 174715 103447 188880 289414 -127896 -96799 -202075 123422 -271827 222253 -22028
$$ packed form
9737i8169F5079b7301C7669d1075H1102a00701j44420p4781d2121j17210e2296
9725B6650a15932H6296g7622k02016J03821B8629c72033Q6697C06905b23996g140
9713D8729c4796I6043O6730P1553e6433k66923A40709a4287H7810a90258L1321
9702a58937I1551l0437B4796J31419f4318K0210j37105A83519B1820N7043j1352
9691F7511k7537b06593c4120a7004G6549b11496f917k33887J15360j39267h3116
9679A54539J24723b184j60389A96922a41050A89938b1659l34509D0817J6797e0951
9667b34217p4029i7043A34060e4314B87605a08788O494K6819A29468J400g8100
9655A74715p1268Q5433J00534a27896L1097j05276A23422b71827B22253b2028
$$ plain form
9644 -272604 -271690 -50431 -164700 -370168 54900 -204790 79304 24342 -286090 7053 -169 -39973
9632 -39973 -95287 -331571 105319 -56581 26052 -303651 57684 -151782 168770 161287 -268951
9620 105992 -15941 -202652 -22309 116930 -180943 -96781 -342470 -255534 -392421 67879 -282973
9608 -198866 -87060 -199777 -361127 59246 -251770 -147162 -247914 -181982 -57702 -136364 142515
9596 -114219 -217757 -28564 -253000 111347 -316908 -97956 75685 -172202 -48855 -122381 81607
9584 188805 -387411 -169544 -269067 -126547 45678 -276718 -128956 256810 -399848 -149515
9573 -173922 -113213 -53903 169994 -96291 -16984 -164428 207450 -100706 -19493 -102555 -56228
9562 -56228 30483 31982 -214290 -53090 115595 -120763 7392 -374556 -327536 65154 -105975
$$ packed form
9644b72604R14e0431j14269k05468E4900b04790G9304B4342b86090G053a69l9804
9632c9973n5314k36284A05319e6581B6052c03651E7684a51782A68770p483b68951
9620A05992a5941j86711b2309A16930a80943Q4162k45689Q6936j36887F7879b82973
9608a98866h7060j12717j61350E9246b51770J04608j00752O5932e7702p8662A42515
9596a14219j03538b8564k24436A11347c16908i7956G5685a72202d8855p3526H1607
9584A88805c87411a69544r9523a26547D5678b76718a28956B56810c99848a49515
9573a73922O0709e3903A69994i6291a6984j47444B07450a00706a9493q3062M6327
9562e6228C0483J499b14290e3090A15595a20763G392c74556M7020F5154a05975
$$ plain form
9550 27593 -194158 313340 -166170 -116016 41076 -65221 -336487 361751 74136 -73201 420403
9538 -334727 27373 -90820 -16545 -8000 -253817 -65262 97553 -445527 -17999 66457 -35141
9526 -443684 -452757 -279072 -13558 160840 96389 -122485 -245240 -69848 -244005 2748 -60270
9514 -127735 -46829 78773 -358575 79936 136986 -342092 54946 428090 -114136 58188 -40839
9502 94425 -44160 -169375 192665 -255300 -88300 -25072 18883 271243 -229859 264139 -8969
9490 36537 -223367 -54295 -22744 83943 152253 138722 154248 -58988 -225587 93434 24484
9478 -354024 -86580 -31962 -101474 28706 -20691 -15347 176051 246708 -126238 -43239 130884
9466 -53752 -266683 -430331 -170169 40244 -125770 -63221 -189171 -165788 147347 18999 -116872
$$ packed form
9550B7593a94158C13340a66170N0154D1076f5221k71266C61751G4136g3201D20403
9538c34727B7373i0820a6545h000k45817f5262I7553d45527a7999F6457c5141
9526d43684r073J73685a3558A60840o4451a22485j22755f9848j74157B748f0270
9514a27735d6829G8773c58575G9936N7050c42092E4946L73144a14136E8188d0839
9502I4425d4160j25215A92665b55300h8300b5072A8883K52360b29859B64139h969
9490C6537b23367e4295b2744H3943O8310j3531J5526e8988j66599I3434B4484
9478c54024h6580c1962o9512B8706b0691N344A76051P0657a26238d3239A30884
9466e3752k12931j63648a70169D0244a25770O2549j25950K3383A47347A8999a16872
$$ plain form
9454 -74764 -47862 190862 -122490 -81372 -275733 80250 8436 262091 -315656 130198 -30662
9442 -183742 -514843 -98120 117515 -26277 43113 -135068 -221993 -122109 -50807 -65132 -53022
9431 -53022 -338923 -152889 226028 187905 -150496 -234953 34766 241848 -215115 3388 -132589
9419 119360 -28764 215625 13372 -258641 93725 128045 -111628 -67003 131473 -240894 33320
9407 -428244 -168593 -57977 -288088 -67193 -200966 -372035 -154770 19370 -51999 -296555
9397 -296555 125140 29756 -160276 31145 389825 -6630 -307249 -115459 -174844 -86043 -235905
9386 -235905 -69644 53975 67711 33716 -67433 -61995 77120 -278068 10957 -233697 -52772
9374 -54451 105701 207254 120490 180251 -21742 123710 -207817 -195486 36253 3656 -418 238159
$$ packed form
9454g4764K6902A90862a22490M1118j94361H0250H436K53655c15656A30198c0662
9442a83742l31101i8120A17515b6277D3113a35068q6925R9884e0807j4325J2110
9431e3022k85901a52889B26028l8123a50496q4457C4766K07082b15115C388a32589
9419A19360b8764B15625A3372b58641I3725L4320a11628M4625A31473b40894C3320
9407d28244a68593e7977k30111f7193j33773j71069a54770A9370e1999k44556
9397b96555A25140B9756a60276C1145L58680f630l00619a15459n9385h6043j49862
9386b35905f9644E3975J3736C3716f7433N438G7120b78068A0957b33697e2772
9374e4451A05701J01553q6764N9761b1742A23710b07817J2331C6253C656d18B38159
$$ plain form
9361 -156627 59063 -242420 -335763 66972 47939 -246974 -353017 174867 -31450 -51762 -118084
9350 -118084 -295467 -42810 76872 -111662 -62304 19423 937 110945 159310 128484 165780
9339 165780 -137951 28675 -48689 -201056 289883 50255 -411915 373615 -7245 -210314 -277793
9328 -277793 191215 -401990 -46000 149383 -85041 -408144 -6574 -268374 -30738 -95855 76565
9316 16690 -225853 171635 -66017 -248503 -132590 104225 -93143 20928 -239018 -186176 115161
9304 -197446 -48319 -373586 -148460 -31352 3192 -136699 16952 -137193 -122148 -67480 102766
9292 -240105 -191680 -29180 -76651 -124241 -358882 -182898 168853 71218 -249193 -66577 212198
9280 -138798 -49200 -6133 -153202 -159434 -50608 -26688 256811 -23368 302789 27281 174355
$$ packed form
9361a56627E9063b42420r3343F6972j9033b46974j06043A74867c1450k0312o6322
9350a18084j77383d2810G6872a11662M9358A9423I37J10008M8365l0826L7296
9339A65780a37951B8675d8689j52367B89883E0255d11915C73615g245k03069o7479
9328b77793A91215d01990d6000A49383h5041l23103f574k61800c0738o5117G6565
9316A6690b25853A71635f6017j82486J15913A04225i3143B0928b39018N2842A15161
9304a97446d8319l25267a48460c1352C192a36699A6952a37193J5045N4668A02766
9292b40105M8425b9180m7471m7590k34641J75984A68853G1218b49193f6577B12198
9280a38798d9200f133j47069o232e0608K3920B56811b3368C02789B7281J47074
$$ plain form
9269 174355 -225109 -150704 67734 -277905 79344 -159711 -71285 -271553 80762 -900 -112827
9258 -112827 -65531 -195176 110191 -42350 -106623 69956 129770 38979 -116287 62278 -67147
9246 -38404 -428639 -317355 7537 377557 -26679 -235330 -133463 -110428 -161560 215545 13477
9234 -61252 -383167 101048 -20793 -148213 -96532 -111099 -246485 -190612 61868 -28661 8553
9222 161595 -274984 -60183 78701 74284 19379 -169716 179169 -20571 201696 -64200 125938
9210 182145 95224 185743 -29793 84345 -183171 -198608 -68427 356402 -56591 -75899 -115748
9199 -115748 -344035 19914 -82934 26829 122647 -127827 91971 203989 91645 -108371 227542
9187 4138 241213 55366 -64442 -47795 -87992 -41994 -120088 -215700 -31656 114119 -215881
$$ packed form
9269A74355b25109P4405F7734b77905G9344a59711g1285k00268H0762i00j11927
9258a12827M7296j29645A10191d2350o4273F9956N9814C8979a16287F2278f7147
9246c8404l90235J11284G537L70020b6679k08651J01867K3035n1132B15545A3477
9234f1252l21915A01048b0793j27420N1681j4567j35386N5873F1868b8661H553
9222A61595b74984f0183G8701m417A9379a69716A79169b0571B01696f4200A25938
9210A82145q6921R0519b9793H4345a83171j5437f8427C56402e6591j9308l9849
9199a15748k28287A9914h2934B6829R5818a27827I1971J12018I1645a08371B27542
9187D138K37075E5366f4442J6647m0197d1994p8094r5612c1656A14119b15881
$$ plain form
9175 127598 -294403 68912 217068 -126169 -283793 -17941 262456 -410449 -245228 64331
9164 -63330 -216625 -194388 -109812 111588 -122246 -325759 184561 56151 -79825 309664 18118
9152 197937 -272795 -40931 -166865 -51856 105278 112469 103191 260673 -81181 -284745 57445
9140 -241396 -69314 -169413 -245059 187068 80330 -48824 -132460 -216989 136468 144883 -205996
9128 113461 -316271 92568 -357970 -48468 146374 -268031 -182886 114965 -204459 111532
9117 -66600 119886 -63169 -73181 -179268 249895 -97389 -168793 -193690 -114492 -62642 188985
9105 85258 162298 -40864 -507056 -150269 -67707 -416320 -185238 -115625 -171341 41122 -444248
9093 -93314 50003 12335 33326 -153328 187600 -189368 285593 -46576 161340 -65169 -244816
$$ packed form
9175A27598b94403F8912J48156a26169j57624a7941B62456d10449J65221F4331
9164f3330j53295K2237Q4576A11588a22246k03513A84561E6151g9825C09664A8118
9152A97937b72795d0931j25934e1856A05278P191r278J57482h1181k03564E7445
9140b41396f9314j00099p5646A87068H0330d8824q3636q4529A36468Q415b05996
9128A13461c16271I2568c57970d8468A46374b68031Q5145A14965b04459A11532
9117f6600A19886f3169j0012j06087B49895i7389p1404k4897P9198N1850A88985
9105H5258P7040d0864m66192a50269f7707l48613a85238O9613n5716D1122d44248
9093i3314E0003A2335K0991a53328A87600a89368B85593d6576A61340f5169j79647
$$ plain form
9082 -244816 46981 -218636 25493 -240794 -33064 -1371 -38759 -144851 -28333 -196787 -124573
9071 -124573 65786 28095 -100512 -333216 -111706 -108594 200852 22878 10224 4572 -90925
9059 -191115 241111 -162657 -47155 -21972 19126 -152794 -383533 -93046 -87084 -10989 217134
9047 -185758 195166 -191556 73700 -118432 -40710 -16768 72074 -319253 -286753 -438112 -108975
9035 -1800 -9754 -111392 -78322 -195154 -475998 130581 -258094 -138405 -114805 -100623 132233
9023 -141976 295021 -241042 -331374 -55152 38453 -249196 -152940 164640 -60182 -34389 401188
9011 -228447 -234970 -107428 -353314 45158 13905 -110004 -190634 -135299 -296613 204696 -32276
8999 -38429 -96902 168060 -196379 135891 -178803 -275765 -136608 71458 -292140 -204719 -73742
$$ packed form
9082b44816D6981b18636B5493b40794c3064a371l7388j06092b8333j68454P2214
9071a24573F5786B8095a00512k32704a11706L112B00852B2878A0224D572i0925
9059a91115B41111a62657d7155b1972A9126a52794k30739i3046N962a0989B17134
9047a85758A95166a91556G3700a18432d0710a6768G2074c19253L2500j51359a08975
9035a800p954j01638L3070j16832k80844A30581b58094J19689K3600J4182A32233
9023a41976B95021b41042r0332e5152C8453b49196R6256A64640f0182K5793D01188
9011b28447o523a07428k45886D5158A3905a10004q0630N5335j61314B04696c2276
8999c8429n8473A68060a96379A35891a78803r6962a36608G1458b92140Q7421g3742
$$ plain form
8987 92051 -169436 -208399 66586 94988 94198 -45302 -37484 -64490 -160700 -134411 -2318 -88946
8975 -88946 -64171 -94753 312417 -229789 -339246 -347853 2838 -176322 -161157 -18692 -178608
8964 -178608 -111362 -9414 245629 -192557 172892 -3034 -304396 3949 -53585 251609 62707
8952 -278770 -125301 -381937 230578 192161 -108788 -158917 -58306 48597 -62443 109567 -109283
8940 99655 220003 25514 37109 -142489 -94500 515803 494200 138935 98801 -5244 -30361
8929 -30361 -187967 -234165 175583 155523 441062 981018 4040616 10749134 22266413 5958588
8918 1468808 691951 512113 341252 92952 -253197 -207459 -111625 108057 18621 130139
8908 130139 403564 67701 -295042 -152879 141182 -174297 94341 64483 115227 -44879 -59670
$$ packed form
8987I2051a69436l8963F6586K8402p90d5302P818k7006r6210K6289b318q6628
8975h8946K4775l0582C12417b29789j09457q607B838a76322J5165a8692j59916
8964a78608O7246i414B45629a92557A72892c034l01362C949e3585B51609F2707
8952b78770a25301k56636B30578l8417a08788n0129e8306D8597f2443A09567a09283
8940I9655J20348B5514J1595a42489M7989E15803k1603A38935m0134e244k5117
8929c0361j57606m6198A75583k0060K85539N39956L059598O708518J1517279E958588
8918A468808F91951j79838j70861I2952b53197M5738R5834A08057A8621J11518
8908A30139K73425F7701b95042J42163A41182a74297I4341k9858N0744d4879j4791
$$ plain form
8897 -59670 367090 -183259 135184 -12833 117717 430892 152597 -183686 -99355 71916
8886 87293 -598715 -333801 -202666 -7307 -43694 -54532 -6847 136382 -53987 35906 -320479
8874 164833 187493 92904 -148191 -229750 117436 -189401 -261671 269566 -6772 -251491 -251246
8863 -251246 -191393 -43420 -945 72391 -63852 -162720 44689 -44727 -18783 20669 -151315 -186185
$$ packed form
8897e9670C67090a83259A35184a2833A17717L13175A52597a83686Q4331G1916
8886H7293e98715K64914J31135g307l6387j0838f847A36382e3987C5906c20479
8874A64833K2660I2904a48191q1559A17436a89401p2270B69566f772k44719K45
8863b51246N9853d3420i45G2391f3852r8868D4689d4727a8783B0669a51315l4870
$$ [...]
##END NTUPLES=NMR SPECTRUM
##END=
