
##TITLE=UV1222_M6_1234-1212_10_7231161_mgfaJ3Nj4P
##JCAMPDX= 6.0         $$ Bruker NMR JCAMP-DX V2.0
##DATA TYPE= NMR SPECTRUM
##DATA CLASS= NTUPLES
##ORIGIN= BRUKER
##OWNER= Administrator
$$ 1.72 TOPSPIN		Version 2.1
$$ 2013-01-24 01:47:38.205 -0500  Administrator@X
$$ Compression mode = diff/dup
##.OBSERVE FREQUENCY= 400.02188249412
##.OBSERVE NUCLEUS= ^1H
##.ACQUISITION MODE= SIMULTANEOUS (DQD)
##.ACQUISITION SCHEME= undefined
##.AVERAGES= 8
##.DIGITISER RES= 22
##SPECTROMETER/DATA SYSTEM= spect
##.PULSE SEQUENCE= zg30
##.SOLVENT NAME= COFFEE_meoh
##.SHIFT REFERENCE= INTERNAL, COFFEE_meoh, 1, 14.98509
##AUDIT TRAIL= $$ (NUMBER, WHEN, WHO, WHERE, PROCESS, VERSION, WHAT)
$$ ##TITLE= Audit trail, TOPSPIN		Version 2.1
$$ ##JCAMPDX= 5.01
$$ ##ORIGIN= Bruker BioSpin GmbH
$$ ##OWNER= Administrator
$$ $$ E:\/data/COFFEE/nmr/UV1222_M6_1234-1212_10_7231161_mgfaJ3Nj4P/30/pdata/1/auditp.txt
$$ ##AUDIT TRAIL=  $$ (NUMBER, WHEN, WHO, WHERE, PROCESS, VERSION, WHAT)
(   1,<2013-01-24 01:47:30.080 -0500>,<Administrator>,<X>,<go>,<TOPSPIN 2.1>,
      <created by zg
	started at 2013-01-24 01:46:23.627 -0500,
	POWCHK enabled, PULCHK disabled,
       configuration hash MD5:
       86 BA 57 50 F2 9D 5C 9B 26 00 A9 28 5F 66 2E 89
       data hash MD5: 64K
       B0 C4 21 0D 27 03 9F 78 7A 41 4D 56 9D 5D 0A 96>)
(   2,<2013-01-24 01:47:33.080 -0500>,<Administrator>,<X>,<proc1d>,<TOPSPIN 2.1>,
      <Start of raw data processing
       efp LB = 0 FT_mod = 6 PKNL = 1 PHC0 = 0 PHC1 = 0 SI = 32K 
       data hash MD5: 32K
       9D EB DC 18 7A 05 54 07 BB 85 25 6B 07 68 C0 A1>)
(   3,<2013-01-24 01:47:33.580 -0500>,<Administrator>,<X>,<proc1d>,<TOPSPIN 2.1>,
      <pk PHC0 = 97.8717 PHC1 = 0 
       data hash MD5: 32K
       93 B7 9A FD A3 22 A7 87 99 E7 08 93 E2 97 6F 45>)
(   4,<2013-01-24 01:47:33.799 -0500>,<Administrator>,<X>,<proc1d>,<TOPSPIN 2.1>,
      <abs ABSG = 1 
       data hash MD5: 32K
       27 A5 32 BB 61 28 79 A3 29 BE F0 CF C9 FE D8 F7>)
(   5,<2013-01-24 01:47:33.955 -0500>,<Administrator>,<X>,<proc1d>,<TOPSPIN 2.1>,
      <abs ABSG = 2 
       data hash MD5: 32K
       F7 36 14 22 9C 7D B5 9B 0B 63 60 B9 1D 2D 88 50>)
(   6,<2013-01-24 01:47:34.096 -0500>,<Administrator>,<X>,<proc1d>,<TOPSPIN 2.1>,
      <abs ABSG = 3 
       data hash MD5: 32K
       03 CC 67 78 D9 01 34 65 18 90 FD F6 84 88 49 FF>)
(   7,<2013-01-24 01:47:34.252 -0500>,<Administrator>,<X>,<proc1d>,<TOPSPIN 2.1>,
      <abs ABSG = 4 
       data hash MD5: 32K
       78 B3 1F 0B 3E 72 D0 44 FA 99 1D 2E 93 05 12 87>)
(   8,<2013-01-24 01:47:34.408 -0500>,<Administrator>,<X>,<proc1d>,<TOPSPIN 2.1>,
      <abs ABSG = 5 
       data hash MD5: 32K
       67 35 E6 2E 81 9A F5 E1 B6 60 B3 5B 0D 67 FE 1B>)
$$ ##END=
$$ 
$$ $$ hash MD5
$$ $$ 12 1E BD BC 30 57 89 37 70 C4 E1 FA 2A 50 1A A0
##$RELAX= 
##$RELAX= 
##$RELAX= 
##$RELAX= 
##$RELAX= 
##$RELAX= 
##$RELAX= 
$$ Bruker specific parameters
$$ --------------------------
##$DU= <E:\>
##$EXPNO= 30
$$ [...]
##$TP= (0..7)
150 150 150 150 150 150 150 150
##$TP07= 0
##$TPNAME0= <>
##$TPNAME1= <>
##$TPNAME2= <>
##$TPNAME3= <>
##$TPNAME4= <>
##$TPNAME5= <>
##$TPNAME6= <>
##$TPNAME7= <>
##$TPOAL= (0..7)
0.5 0.5 0.5 0.5 0.5 0.5 0.5 0.5
##$TPOFFS= (0..7)
0 0 0 0 0 0 0 0
##$TUNHIN= 0
##$TUNHOUT= 0
##$TUNXOUT= 0
##$USERA1= <user>
##$USERA2= <user>
##$USERA3= <user>
##$USERA4= <user>
##$USERA5= <user>
##$V9= 5
##$VALIST= <valist>
##$VCLIST= <CCCCCCCCCCCCCCC>
##$VD= 0
##$VDLIST= <DDDDDDDDDDDDDDD>
##$VPLIST= <PPPPPPPPPPPPPPP>
##$VTLIST= <TTTTTTTTTTTTTTT>
##$WBST= 1024
##$WBSW= 4
##$XGAIN= (0..3)
0 0 0 0
##$XL= 0
##$YL= 0
##$YMAX_a= 674989
##$YMIN_a= -574729
##$ZGOPTNS= <>
##$ZL1= 120
##$ZL2= 120
##$ZL3= 120
##$ZL4= 120
##$ABSF1= 14.98509
##$ABSF2= -5.573092
##$ABSG= 5
##$ABSL= 3
##$ALPHA= 0
##$AQORDER= 0
##$ASSFAC= 0
##$ASSFACI= 0
##$ASSFACX= 0
##$ASSWID= 0
##$AUNMP= <proc_prof1d_extract_pilot.lims>
##$AXLEFT= 0
##$AXNAME= <>
##$AXNUC= <1H>
##$AXRIGHT= 0
##$AXTYPE= 0
##$AXUNIT= <>
##$AZFE= 0.1
##$AZFW= 0.1
##$BCFW= 0
##$BC_mod= 0
##$BYTORDP= 0
##$COROFFS= 0
##$CY= 15
##$DATMOD= 1
##$DC= 0
##$DFILT= <>
##$DTYPP= 0
##$F1P= 0
##$F2P= 0
##$FCOR= 0.5
##$FTSIZE= 32768
##$FT_mod= 6
##$GAMMA= 0
##$GB= 0
##$INTBC= 1
##$INTSCL= 1
##$ISEN= 128
##$LB= 0
##$LEV0= 0
##$LPBIN= 0
##$MAXI= 10000
##$MC2= 0
##$MEAN= 0
##$ME_mod= 0
##$MI= 0
##$NCOEF= 0
##$NC_proc= -8
##$NLEV= 6
##$NOISF1= 0
##$NOISF2= 0
##$NSP= 0
##$NTH_PI= 0
##$NZP= 0
##$OFFSET= 14.98509
##$PC= 1
##$PHC0= 97.8717
##$PHC1= 0
##$PH_mod= 1
##$PKNL= yes
##$PPARMOD= 0
##$PPDIAG= 0
##$PPIPTYP= 0
##$PPMPNUM= 2147483647
##$PPRESOL= 1
##$PSCAL= 4
##$PSIGN= 0
##$PYNMP= <proc.py>
##$REVERSE= no
##$SF= 400.02
##$SI= 32768
##$SIGF1= 0
##$SIGF2= 0
##$SINO= 400
##$SIOLD= 32768
##$SPECTYP= <>
##$SREGLST= <1H.CDCl3>
##$SSB= 0
##$STSI= 32768
##$STSR= 0
##$SW_p= 8223.68421052631
##$SYMM= 0
##$S_DEV= 0
##$TDeff= 65536
##$TDoff= 0
##$TI= <>
##$TILT= no
##$TM1= 0
##$TM2= 0
##$TOPLEV= 0
##$USERP1= <user>
##$USERP2= <user>
##$USERP3= <user>
##$USERP4= <user>
##$USERP5= <user>
##$WDW= 1
##$XDIM= 32768
##$YMAX_p= 477583001
##$YMIN_p= -704337
##$CURPLOT= <Network HP LaserJet P1505>
##$CURPRIN= <$Network HP LaserJet P1505>
##$DFORMAT= <normdp>
##$LAYOUT= <+/1D_H.xwp>
##$LFORMAT= <normlp>
##$PFORMAT= <normpl>
##$SURQMSG= 1
$$ End of Bruker specific parameters
$$ ---------------------------------
##NTUPLES= NMR SPECTRUM
##VAR_NAME=  FREQUENCY,     SPECTRUM/REAL,   SPECTRUM/IMAG
##SYMBOL=    X,             R,               I
##VAR_TYPE=  INDEPENDENT,   DEPENDENT,       DEPENDENT
##VAR_FORM=  AFFN,          ASDF,            ASDF
##VAR_DIM=   32768,         32768,           32768
##UNITS=     HZ,            ARBITRARY UNITS, ARBITRARY UNITS
##FACTOR=    0.250966925370066, 1,           1
##FIRST=     8223.43324360094, -10318,       -76640
##LAST=      0,             -65038,          -220232
##MIN=       0,             -704337,         0
##MAX=       8223.43324360094, 477583001,    0
$$ Real data points
##PAGE= N=1
##DATA TABLE= (X++(R..R)), XYDATA
$$ [...]
19544i7569F1983Q721a18082A34389a65665L0922l5838A70413i9453A127Q097
19533I224d2013l0714l3364D7132J8620h0667j12426n8085c7388l95596B27886
19521b5338m4070C5046i7066G4452a4442j00354a27F7426c28541A86713b9390
19509b30567A87578d4117B25a64977g4747j84641e9244a909j1840I8487b14778
19497a43973A7195L52615F1214L20334G3753a26085K175a8302j20302j86071A33645
19485e5219k14758r5561a55824I2942r849O2350b60741e8777q7933O7115L7094
19474d2501l49876a64814f3901C10918g0716j60768m2028D6183a86820A50319
19463A48496Q4015o2979a1582j64059j8221j8974i0762p8909M1354B9889P2876
$$ y = [-97569, 61983, 70704, -118082, 134389, -165665, -134743, -170581, 170413, -99453, 1127, 9224, -42013, -72727, -106091, 47132, 65752, -80667, -193093, -251178, -37388, -432984, 227886, -25338, -69408, 35046, -97066, 74452, -14442, -114796, -127, 67426, -328541, 186713, -29390, -230567, 187578, -44117, 225, -164977, -74747, -259388, -59244, -1909, -13749, 98487, -214778, -143973, 17195, 369810, 61214, 381548, 73753, -126085, -123910, -18302, -138604, -324675, 133645, -55219, -269977, -365538, -155824, 92942, 83093, 145443, -260741, -58777, -146710, -79595, -42501, -392377, -164814, -63901, 310918, -70716, -231484, -273512, 46183, -186820, 150319, 148496, 232511, 169532, -11582, -175641, -193862, -212836, -90762, -169671, -128317, 29889, 102765]
19452A02765c6092k54705L2996N1270j47487a47981n786j06265A48941J8531c24010
19440H5438k4420b7411l8006l75216A21941f45774a63748j31203e690A1713c8789
19428a62967K0410a1972j20169C16069a80099o9340e2115p6246j92003A4515a63564
19416b00769P5912I2760k7776A0584c26831A53621a69414A4163J10118E4644b1488
19404F9217M920b24620J4982j77573J63319R3071i365E4167c2761l32413G2232
19392b02392B02529a06606j89846h5409A03605a6509B99955g321l19472f8701
19381A99970a7776j82935a0168o5705B05576E8537a94438p2840D9509f9680A82729
19369a3444B54534a72813o9723a07866D4994L1095l5783f7119j55706B72201H3724
$$ y = [102765, -36092, -290797, -257801, -206531, -354018, -147981, -153767, -260032, 148941, 167472, -324010, 85438, 61018, -27411, -65417, -440633, 121941, -645774, -163748, -294951, -5690, 11713, -38789, -162967, -142557, -11972, -132141, 316069, -180099, -249439, -52115, -128361, -320364, 14515, -163564, -200769, -124857, 92760, 64984, 10584, -326831, 153621, -169414, 14163, 124281, 54644, -21488, 69217, 74137, -224620, -209638, -387211, -223892, -130821, -9365, 54167, -32761, -365174, 72232, -202392, 202529, -106606, -296452, -85409, 103605, -16509, 299955, -7321, -326793, -68701, 199970, -17776, -200711, -10168, -75873, 205576, 58537, -194438, -267278, 49509, -69680, 182729, -13444, 254534, -172813, -242536, -107866, 44994, 76089, 40306, -67119, -222825, 272201, 83724]
19357a3618j67818P1989D4276c62597G0784a53609A46173m9477e8706k74078f1123
19345F0896k1992J83478c64235J77316G8084a05921A59356a21616M5053k14329
19335b90892J42213M3602j95724a19954G483b19091J4180B83441A27997b78971
19324D95215A4757b85162B21371c18605E7634a11868L9951l9547k8916j601A1526
19312A22032g5736G366Q6248a64030C7113b11569A40581m7757b58482K1954J03332
19301a33196k18229a19998o6873B14957B2221c25601P4274A03710j943D9384b83128
19289a15541B25185a77056c346k05955a3535r5156b0097p8403q7554A45756a60961
19277C32331a6360C12255i3950B10863c9997D6569c57940I150K27618b25708B02939
$$ y = [-13618, -181436, -109447, 44276, -362597, 70784, -153609, 146173, 96696, -58706, -332784, -61123, 60896, 38904, 222382, -364235, -186919, 78084, -105921, 159356, -121616, -76563, -290892, -148679, -105077, -300801, -119954, 7483, -219091, -204911, 283441, 127997, -278971, 495215, 14757, -285162, 221371, -318605, 57634, -111868, -71917, -111464, -140380, -141981, 11526, 122032, -75736, 7366, 93614, -164030, 37113, -211569, 140581, 92824, -258482, -236528, -133196, -351425, -119998, -186871, 214957, 22221, -325601, -251327, 103710, 101767, 49384, -283128, -115541, 225185, -177056, -3346, -209301, -13535, -108691, -20097, -98500, -186054, 145756, -160961, 332331, -16360, 312255, -93950, 210863, -39997, 46569, -357940, 9150, 236768, -225708, 202939]
19265c3272j08663G173J6269a84322c8422A50819M8302H9927J63934f8462m8375
19254a16837L4718p2096E4670K69881b9935A65389a02359j81176p7475C17626
19243F0855b33496G5032b7782j2742p4021p8834q8479d5527C5141b23643K2848
19232b00795P1034O719A18222a03526n0472k3279B47040f5826k2035J9591k22336
19221b90606b3691C7074J1657a73978d998k08051g5306q4045A11887M8752d12458
19209C8419a45368j06240j33304J03485f5514B22017h6065k8271K2180k74307
19199c66463l0766J70333a09805H2992a82457j21949A75971b74222A92307Q840
19189B01147F9299h5406B891g3318l37630k2787B16057b01393A73311a22842j87544
$$ y = [-33272, -141935, 7173, 23442, -184322, -38422, 150819, 199121, 89927, 253861, -68462, -116837, -82119, -154215, 54670, 324551, -29935, 165389, -102359, -283535, -361010, 317626, 60855, -233496, 75032, -27782, -40524, -114545, -193379, -281858, -45527, 35141, -223643, -200795, -129761, -123042, 118222, -103526, -153998, -177277, 247040, -65826, -87861, -68270, -290606, -23691, 37074, 48731, -173978, -4998, -213049, -75306, -159351, 111887, 160639, -412458, 38419, -145368, -251608, -384912, -281427, -65514, 222017, -86065, -114336, -92156, -366463, -397229, -226896, -109805, 82992, -182457, -304406, 175971, -274222, 192307, 201147, 69299, -85406, 2891, -73318, -410948, -433735, 216057, -201393, 173311, -122842, -310386]
19178c10386J38725L5435j18763I4793a15051c026G8594c2639a6233j53781C615
19166A7127a11033M2313l3149A91475a02132j31237e7989A73546R8677d1711A36686
19154A67141J0602b40699h7168F7795R0143a26752a7631j82104O1498A66899e88
19142H8318b76269g8067B98382b3593D0500a02585L3203d434C9050l463b06494
19130G0786j3373j7041J61176a20192k59339A20580b07324B66543g5066J9774
19120e5292J0216C36519c45574F9414c63969B5405K29461H9298c33395J32006
19110b01389R7706m7348G9169b30380a4008l47522D30194a38707f0445G446b03359
19098a08987j37120A09096K7626L7273c49856J38384h9484a7820n3454j08082
$$ y = [-310386, -171661, -136226, -254989, 94793, -115051, -3026, 78594, -32639, -16233, -170014, 3615, 17127, -111033, -68720, -101869, 191475, -102132, -233369, -57989, 173546, 272223, -41711, 136686, 167141, 177743, -240699, -87168, 67795, 157938, -126752, -17631, -199735, -138237, 166899, -588, 88318, -276269, -78067, 298382, -23593, 40500, -102585, -69382, -4434, 39050, 35587, -206494, 70786, 57413, 40372, 201548, -120192, -379531, 120580, -207324, 266543, -75066, -55292, -45076, 336519, -345574, 69414, -363969, 25405, 254866, 89298, -333395, -201389, -103683, -151031, 79169, -230380, -14008, -361530, 430194, -138707, -60445, 7446, -203359, -108987, -246107, 109096, 136722, 173995, -349856, -211472, -89484, -17820, -71274, -179356]
19088a79356A34795h136k48618C5039Q7364a61390A05172a21775j54055A41673
19077A37880b79656A90308g9375J2174j28429D0142d42641C669J89509j8383b04099
19065a4957b705D27067j87895b86566A00710k1663J11653b70753P0893B94966
19054a26858K385l832A31873h479r4760D4198a8533E9969M0395r101a80092d5034
19041c41351b857j04883p0773D6800c25273L2608G4946c2162o2334B85130g0011
19029B84535A08527k8251a45807L6244A80058b26455R7542E5568N8041j7371c82497
19017E169e323C05921j25010i2664l447K4124L5507k70633C45479a39943H3645
19005b66846a29569o4029k33435a47573A50619J51820b0435r1826E1435h7545
$$ y = [-179356, 134795, -8136, -256754, 35039, 122403, -161390, 105172, -121775, -275830, 141673, 137880, -279656, 190308, -79375, -67201, -195630, 40142, -442641, 3669, 193178, 174795, -204099, -14957, -2705, 427067, 239172, -286566, 100710, 79047, 190700, -270753, -199860, 294966, -126858, -124473, -128305, 131873, -8479, -103239, 44198, -18533, 59969, 100364, 91263, -180092, -45034, -341351, -2857, -107740, -178513, 46800, -325273, -292665, 74946, -32162, -94496, 285130, -70011, 284535, 108527, 80276, -145807, -109563, 180058, -226455, -128913, 55568, 113609, 96238, -382497, 5169, -5323, 305921, 180911, -92664, -96111, -71987, -36480, -307113, 345479, -139943, 83645, -266846, -129569, -193598, -427033, -147573, 150619, 302439, -20435, -112261, 51435, -87545]
18994f6277j84853g0665j34588A66401b7927h150A35576c75769R9502g0566D720
18982a00036B2793K13206a36218l2215A70900f6205A00074g9869J9633B3937a02137
18970E1110i7513h303G4312e8757m611G79i1220j64878B6389J17285b66259f6191
18957C3568b4005q092C2757c70090Q9837f1582B34792d3684G3179B0710N4792
18946G5502K6255J5004a4744A28452b7802q1988F2780b15281n3293A81973c72456
18934f9648j04347f9120a6660B66544a80296o7969H8279g6240B48869d5499B8070
18922c13098d2157r248j73508e1618A66924d37054J91694G4627J15116r365d09264
18910c34813i6354p7886M9208K9737j06709d7713A58842a61251A96295f9192B49323
$$ y = [-66277, -251130, -70665, -205253, 166401, -27927, -8150, 135576, -375769, -276267, -70566, 4720, -100036, 22793, 235999, -136218, -168433, 170900, -66205, 100074, -79869, -60236, 23937, -102137, 51110, -97513, -8303, 74312, -58757, -63368, 779, -91220, -256098, 26389, 143674, -266259, -66191, 33568, -24005, -32097, 32757, -370090, -280253, -61582, 234792, -43684, 73179, 20710, 75502, 101757, 116761, -14744, 128452, -27802, -109790, 62780, -215281, -268574, 181973, -372456, -69648, -173995, -69120, -16660, 266544, -180296, -248265, 88279, -76240, 248869, -45499, 28070, -313098, -42157, -51405, -224913, -51618, 166924, -437054, -245360, 74627, 189743, 180378, -409264, -334813, -96354, -174240, -125032, -95295, -202004, -47713, 158842, -161251, 196295, -69192, 249323]
18898b68138J0940h8646m1429k72156I1739d5206H975b67231a9869p9067A44955
18886E3264b18091j13344A02213e2059G6175b90534J34686A8914e7223l7443L1889
18875f2777k54217j52513D81161H7947B2006J753J12476K08912a18934j22005
18865b40939A21886i6436J6964A84988a34492A64315o9855B9355b3147c289q1331
18854h4620a4417D2843a24649e0758a4629E09176b44548d9203m8766a7933B16288
18842c00929P8890L2795A685Q7408M7055l4652P6289a43559k01842J34457e6344
18830F1130a34938A55290D2643O5571D1386A0694K99150h0343j03028C3380a71330
18818B14029J72177C9955I361N5426J63052b47956P1922L2264c7266E96915a59835
$$ y = [-268138, -257198, -88646, -130075, -402231, 91739, -45206, 8975, -267231, -19869, -98936, 144955, 53264, -218091, -331435, 102213, -52059, 76175, -290534, -155848, 18914, -57223, -94666, -62777, -316994, -469507, 481161, 87947, 22006, 23759, 136235, 345147, -118934, -240939, 121886, -96436, -79472, 184988, -134492, 164315, 94460, 29355, -23147, -3289, -84620, -14417, 42843, -124649, -50758, -14629, 509176, -244548, -49203, -97969, -17933, 216288, -300929, -222039, -189244, 1685, 89093, 136148, 101496, 177785, -143559, -345401, -210944, -56344, 61130, -134938, 155290, 42643, 108214, 41386, 10694, 309844, -80343, -183371, 33380, -171330, 214029, 386206, 39955, 9361, 64787, 227839, -247956, -176034, -143770, -37266, 596915, -159835]
18806e5366A43121B436O2734K8646R743a065E7695a30543A44893c96520a92713
18794A3674J37983c51644J74265r36A12619a59481c3419I0803a32657B31360b35011
18782B68580a9538A78443H3159K56825i0537E1166b33873J16555F2190K46076
18772C08266b88493A41644a49275D4863e720A72637J47369A15565a41555b829
18761e0350a7228l06903F3311L9499i2303l24424D821b28165j98817m274a49598
18749c30592J04703n7213B46423l1087c931j70119a3380H9975K0328J11217A7460
18737G362a81293k68319a26656A47185J36707D538a49393h610k44672D7202b05713
18725e8459C7179h2466c4688j96906e8253l46667I1190d39945g2017k46154J06277
$$ y = [-55366, 143121, 2436, 65170, 93816, 103559, -1065, 57695, -130543, 144893, -396520, -192713, 13674, 151657, -351644, -177379, -178315, 112619, -159481, -33419, 90803, -132657, 231360, -235011, 268580, -19538, 178443, 83159, 339984, -90537, 51166, -233873, -117318, 62190, 308266, -288493, 141644, -149275, 44863, -5720, 172637, 320006, 115565, -141555, -2829, -50350, -17228, -324131, 63311, 102810, -92303, -416727, 4821, -228165, -426982, -431256, -149598, -330592, -225889, -283102, 246423, 215336, -3931, -174050, -13380, 89975, 110303, 221520, 17460, 7362, -181293, -449612, -126656, 147185, 283892, 4538, -149393, -8610, -253282, 47202, -205713, -58459, 37179, -82466, -34688, -231594, -58253, -404920, 91190, -439945, -72017, -318171, -211894]
18714b11894j92600a2559G8940B2611g1889j09930j96133C94834C4826a14991
18703d0735B43501c27436G5685a65246b3073B22328a08458f087B7467J38234e9149
18691a24420N3767j83976i5867D4562c51447J69614l1125d9190k11159Q4690j97394
18680c73053g9563b9271B38438G9566b54770C60781b14320k7198B31440A5243
18669H6082g6664l02448A29265a98168A21475P3692C0356b35576j33389B24326
18658c6704r3941l2654f1775n6004G8365c51577A14861c39098A4736J14296c60904
18646i5606D05632A04363A6342a00994D74207j32800a99416e0919l07494M5082
18636c13331d9642n3922A7385L5690g9592D0094J62764f76H3136b70530O2880
$$ y = [-211894, -404494, -12559, 78940, 22611, -71889, -181819, -377952, 394834, 34826, -114991, -40735, 243501, -327436, 75685, -165246, -23073, 222328, -108458, -6087, 27467, 165701, -59149, -124420, -70653, -254629, -95867, 44562, -351447, -181833, -212958, -49190, -260349, -175659, -373053, -79563, -29271, 238438, 79566, -254770, 360781, -214320, -241518, 231440, 15243, 86082, -76664, -379112, 129265, -198168, 121475, 195167, 30356, -235576, -368965, 224326, -36704, -130645, -163299, -61775, -117779, 78365, -351577, 114861, -339098, 14736, 129032, -360904, -95606, 405632, 104363, 16342, -100994, 474207, 341407, -199416, -50919, -358413, -313331, -49642, -103564, 17385, 53075, -79592, 40094, 202858, -676, 83136, -270530, -207650]
18625b07650A21936a93859C97674a86408H8080J05925b2630n9161H5659b51440
18614B53218e3031r801O323H3576e6011k17018I6671c50952h1771B2939J64885
18603A87824a45450D1181d75411b36255n8327A26210A3227L37762G0191g2513
18592a1678j98609Q1402a7991k58123n1352A26104G430L01633a54571k22035P9914
18581b96692J04203F8385b69906A95509a88230g655l81365b613j14777A27120
18570A36253a05131c7427j19028D549J87694J29628A40209L2573a27568j42845
18560b70413f7483j40887A0354c3282j53248A13281d2110G9622d3544F5491e7839
18548a38131j1198E475M01992A14106Q692a66551A98575J80150H3724a77395j88609
$$ y = [-207650, 121936, -193859, 397674, -186408, 88080, 194005, -22630, -81791, 85659, -251440, 253218, -53031, -62832, -56509, 83576, -56011, -273029, 96671, -350952, -81771, 22939, 187824, -145450, 41181, -475411, -236255, -294582, 126210, 13227, 350989, 70191, -72513, -11678, -210287, -128885, -17991, -276114, -327466, 126104, 7430, 309063, -154571, -376606, -296692, -192489, 68385, -269906, 195509, -188230, -7655, -389020, -2613, -117390, 127120, 136253, -105131, -37427, -156455, 4549, 192243, 321871, 140209, 172782, -127568, -270413, -67483, -208370, 10354, -33282, -186530, 113281, -42110, 79622, -43544, 65491, -57839, -138131, -149329, 5475, 407467, 114106, 122798, -166551, 198575, 378725, 83724, -177395, -366004]
18537c66004B92801A44714a23123o3041I9109b62100J10490j26191l2759R068
18527c01492j23082A4664P1163a84071F7848a69263G5194j8317a44990m4588F4092
18515c33889A59940I700J01623a04889F5479O3494b6853j23898j07125d2652A02688
18503F0668c94450a70547A71226b80444J10988c0263q73l2545m68032A09166d74195
18491a54904A24013b43508d1424k52803J15400j623A10496a98221A03136c92984
18480A09306b89760E9791h5574k32212J08113I3277K1685b99949R2445b205F8499
18468c1458k15700C10229E6620f4879C45910b01709I0392b65036E5299P5718c47881
18456a3492l5995r8246A5447a74974a5977A96024a76471l9010q870G1858K1084
$$ y = [-366004, 292801, 144714, -123123, -186164, 99109, -262100, -151610, -277801, -310560, -301492, -424574, 14664, 85827, -184071, 67848, -169263, 75194, 56877, -144990, -189578, 64092, -333889, 159940, 9700, 111323, -104889, 65479, 128973, -26853, -150751, -257876, -42652, 102688, 60668, -394450, -170547, 171226, -280444, -169456, -30263, -31136, -63681, -531713, 109166, -474195, -154904, 124013, -243508, -41424, -294227, -178827, -180450, 110496, -198221, 103136, -392984, 109306, -289760, 59791, -85574, -317786, -209673, 93277, 114962, -299949, -207504, -2205, 68499, -31458, -247158, 310229, 56620, -64879, 345910, -201709, 90392, -265036, 55299, 131017, -347881, -13492, -49487, -147733, 15447, -174974, -15977, 196024, -176471, -215481, -224351, 71858, 92942]
18445I2942c05647B12688g3874o0162A4726a44791d2400H7250a52648j76489J33027
18434a96110j50213B67315a19489e556I1473a26358B06526E1643a43728I088a86826
18422b63379n7128d0770o3266K0534K2062j13394K5836j16148h0136a5962E6494
18410a24658H0309C8203a98082A36779d1047g216l7927k6881B07659r2229C2962
18398b63846a09093o1523F9970a10181k5980j0270A16615K8123h8257G2022N3455
18387A25477j8338r868L7202B431J42989o4945b87949A80747h9417k113M2963
18376d8567A83816L3930b15625H0015J74365d64887F5259c3426I9173l2528e7799
18364h569k12268a7987C88867A72237M884G5944g0837B47936E5599a12225B22845
$$ y = [92942, -305647, 212688, -73874, -134036, 14726, -144791, -42400, 87250, -152648, -329137, -196110, -346323, 267315, -119489, -5556, 91473, -126358, 206526, 51643, -143728, 9088, -186826, -263379, -320507, -40770, -104036, -83502, -61440, -174834, -148998, -265146, -80136, -15962, 56494, -124658, 80309, 38203, -198082, 136779, -41047, -7216, -45143, -72024, 207659, 115430, 32962, -263846, -109093, -170616, 69970, -110181, -136161, -146431, 116615, 144738, -88257, 72022, 125477, 107139, 97271, 134473, 2431, 145420, 80475, -287949, 180747, -89417, -91530, -48567, 183816, 217746, -215625, 80015, 254380, -464887, 65259, -33426, 99173, 66645, -57799, -8569, -220837, -17987, 388867, 172237, 177121, 75944, -70837, 247936, 55599, -112225, 222845]
18352C5742g0510m3797k99705a9012l34910D6696J40680h5971D1021c83088a66592
18340C8033J10399b44303a13478d6438j40577A96387q4615c41443a01166B1813
18329A19796E1396K74382A49738l3259a72950c3623k56007b0635j91110n4831
18319b66576Q203J12805H3572d1333b022j77347a2551B57540f627k66650B6805
18307a45970O7957j67803P7500j3081C72919e3906k58896a19776M7337A323N4124
18296E5447j0506A9461a2661l04691h5010a8592C23427E6756i215m09142g6417
18284D1532J24046E8437f7414H3585b09538N2071A2955c19956K6763c0774C5163
18272c72181P8082a38677j31625A29534a68393H107d8966J4471q8338F7466J20180
$$ y = [35742, -70510, -114307, -414012, -19012, -353922, 46696, 187376, -85971, 41021, -383088, -166592, 38033, 148432, -244303, -113478, -46438, -187015, 196387, 111772, -341443, -101166, 21813, 119796, 51396, 325778, 149738, 116479, -172950, -33623, -289630, -20635, -211745, -266576, -258373, -145568, 83572, -41333, -2022, -179369, -12551, 257540, -6627, -273277, 26805, -145970, -78013, -245816, -168316, -181397, 372919, -53906, -312802, -119776, -72439, 1323, 55447, 44941, 19461, -12661, -317352, -85010, -18592, 323427, 56756, -9215, -418357, -76417, 41532, 165578, 58437, -67414, 83585, -209538, -157467, 12955, -319956, -293193, -30774, 35163, -372181, -294099, -138677, -270302, 129534, -168393, 8107, -48966, -34495, -122833, 67466, 187646]
18261A87646b38277j5313h1154j29901Q6659j24890B9622M5254J46426C5640b81147
18249a72597E2513b61949k26447b25184f3898A8406J64814b41035m7765b8921
18238f1155A16103a350k17440B36725H6211b70464c8211C28357b36330B500i1119
18226H2999Q9462D0890J15054M52598I7942f3028m5375C09422h1541A70850E2388
18214H4597a53600g3922A705b5184k31095A12609a44115C7159L8142l5120c63044
18202a28046k1893I58J64027a37496i548D6256Q6946J27611d9961o2461k23887
18191c36309B1864K30262E3833N8498J46158a75566O6061B3389a18484k03520
18181c22004G6613i020j00571A61852D3236c03344A0416a73942r7906a7353j30766
$$ y = [187646, -238277, -253590, -81154, -211055, -124396, -249286, 29622, 74876, 221302, 35640, -281147, -172597, 52513, -261949, -488396, -225184, -63898, 18406, 183220, -241035, -288800, -28921, -61155, 116103, -1350, -218790, 236725, 86211, -270464, -38211, 328357, -236330, 2500, -91119, 82999, 172461, 40890, 155944, 608542, 97942, -63028, -108403, 309422, -81541, 170850, 52388, 84597, -153600, -73922, 1705, -25184, -256279, 112609, -144115, 37159, 75301, 40181, -363044, -128046, -149939, 958, 164985, -137496, -9548, 46256, 133202, 260813, -49961, -112422, -336309, 21864, 252126, 53833, 112331, 258489, -175566, -109505, 23389, -118484, -322004, 76613, -9020, -109591, 161852, 43236, -303344, 10416, -173942, -271848, -17353, -148119]
18170a48119O4325j44805L1590A29236o3020f1331f331l5172A257R9767b88740
18158i7378K8624A46357n0922C4108L6419a01528A0028d5804l2325n6651a684
18146B05345F5072f6289J4549A57263K12639B7877a53099j05733A05022R4438
18136A99460I9610b62334A45694a69718G8820h7777L0369a347H8805F36a74709
18124E5364B1260a46341A24627d53330a34205i331C37286D0062R1195K0795J08978
18113B61030a29960G7328B9957M9016c6128N944p9100L8352j96925A43071J68470
18102C11541r1995k2546K11415c00326B06304D8212c4386C07756a93040j35915
18092c28955j05336e5184A83922g3229k22521B76372h3985j7034H1284c75246
$$ y = [-148119, -83794, -228599, -197009, 129236, 66216, -61331, -6331, -41503, 1257, 101024, -288740, -97378, -68754, 146357, 95435, 34108, 70527, -101528, 10028, -45804, -78129, -134780, -1684, 205345, 65072, -66289, -51740, 157263, 369902, 27877, -153099, -258832, 105022, 199460, 99610, -262334, 145694, -169718, 78820, -87777, -57408, -1347, 88805, 636, -174709, 55364, 21260, -146341, 124627, -453330, -134205, -9331, 337286, 40062, 131257, 152052, 261030, -129960, 77328, 29957, 78973, -36128, -30184, -109284, -70932, -267857, 143071, 311541, 219546, 197000, 408415, -300326, 206304, 48212, -34386, 307756, -193040, -328955, -434291, -55184, 183922, -73229, -295750, 276372, -83985, -101019, 81284, -375246]
18081C50024b28440a13206J7442B64155b21049B90909A17489a67393j57176b8807
18070C3171b41030P8332A5069O3324b3578j93954h2455k3524Q776r8492A85681
18058F1984B2955c2167j13451E7268J3316c32417c9692H1006g3102O452A25013
18046a36825j46602e9873M314B07977h3558n9671L9644F2220A946L0480a8430
18034b2261o1940c8265J1124k62580B0471G255c09411c0963l4594j10972j04154
18023b80683E5291L9544a03268B94687f4381K9566O126k3754F6269i1799Q968
18012h2831A25173B2261b57444F0289L30297j61836G0435J8038J50678c73303
18001c28035A6939a14175b3211C22524i2776K1709A10860R8115c88515a34958
$$ y = [350024, -228440, -113206, -95764, 264155, -221049, 290909, 117489, -167393, -324569, -28807, 33171, -241030, -162698, 15069, 78393, -23578, -217532, -82455, -105979, -97203, -195695, 185681, 61984, 22955, -32167, -145618, 57268, 70584, -332417, -39692, 81006, -73102, -66650, 125013, -136825, -283427, -59873, -55559, 207977, -83558, -143229, -103585, 62220, 1946, 32426, -18430, -22261, -84201, -38265, -27141, -289721, 20471, 7255, -309411, -30963, -65557, -176529, -280683, 55291, 94835, -103268, 294687, -64381, -34815, -28689, -52443, 66269, -91799, -82831, 125173, 22261, -257444, 60289, 390586, 228750, 70435, 88473, 239151, -373303, -328035, 16939, -114175, -23211, 322524, -92776, -71067, 110860, 208975, -388515, -134958]
17990c9881B33713A0649N2361b38676b1261C17251C4203L19933A00554j0435a89017
17978f6908r7246C35982A22546e3860j23105p5733C11988Q6222E1097f8382p1731
17967a40113A55374b11882M9053C0924P5400i7999E9877a27985A06602Q0013d2113
17955e0925A67373l7658a71704p3299a17282k85542d7664n9210B74082i6644p8996
17944a75640j05518k9777e6993F4509R519a786B83065a76170j32647E25476A54665
17932c27878A8021K7277b41626c209A02443K538i1554A51377E3217M6706P443
17921A07366i6607k7369B20601h7820m637o7332j40703Q3314c8352G095Q7169
17910I4264a98301I3458A8377R5595e2921H7877K8574b9259D480J16993D1145
$$ y = [-39881, 233713, 10649, 63010, -238676, -21261, 317251, 34203, 354136, 100554, 90119, -189017, -66908, -164154, 335982, 122546, -53860, -176965, -252698, 311988, 398210, 51097, -68382, -140113, 155374, -211882, -162829, 30924, 106324, -97999, 59877, -127985, 106602, 186615, -42113, -50925, 167373, 129715, -171704, -245003, -117282, -402824, -47664, -106874, 274082, -96644, -175640, -281158, -310935, -56993, 64509, 74028, -1786, 283065, -176170, -308817, 525476, 154665, -327878, 18021, 45298, -241626, -3209, 102443, 104981, -91554, 151377, 53217, 99923, 107366, -96607, -123976, 220601, -87820, -92457, -159789, -300492, -217178, -38352, 7095, 94264, -198301, 93458, 18377, 113972, -52921, 87877, 116451, -29259, 4480, 121473, 41145]
17898B15033a99663N4484q1511C1869J5624b2547a0434B31196D4833K36530c27045
17886c3661k9328c0401E7310b22041B34708A9067J13079C4183a09315A03394k6724
17875G6670l7848a3079B15939b12588B40750b16620B44293n3013o2783N7328D9876
17863b41709a12333l6776J5077E8991K2050c35393B35517G9697b88809B75771
17852b58711l0486O4314Q0146A00628f6072l7977D4494J26975o8396a88031B71936
17840c5369C7631b00490c9101n4919h780C38258a8593A58695a75334A31399a68773
17828C5285J4103L11199a06467k8581F4742A7135a68001f3084K3025B8350J6751
17817D5101a66712g1994j57884C35617a42135A6461c3047C44402a07190j6742
$$ y = [215033, -199663, -145179, -226690, 31869, 47493, -22547, -10434, 231196, 44833, 281363, -327045, -33661, -62989, -30401, 57310, -222041, 234708, 19067, 132146, 34183, -109315, 103394, 76670, 38822, -13079, 215939, -212588, 240750, -216620, 244293, 191280, 128497, 185825, 49876, -241709, -112333, -149109, -134032, 58991, 81041, -335393, 235517, 79697, -288809, 275771, -258711, -289197, -224883, -144737, 100628, -66072, -104049, 44494, 171469, 103073, -188031, 271936, -35369, 37631, -200490, -39101, -94020, -8780, 338258, -18593, 158695, -175334, 131399, -168773, 35285, 49388, 360587, -106467, -135048, 64742, 17135, -168001, -63084, -40059, 28350, 45101, -166712, -71994, -229878, 335617, -142135, 16461, -33047, 344402, -107190, -123932]
17807a23932a7955G5619J10008h5890c1221G9142J29809a0329I6502B4403J07552
17796A31955m9225J95037a82927l6447B582Q955c01326e8624J7366C49915F7150
17784A25549b36202q6560J47539A96346g0428j38517l0774E4500J8488k3333L3944
17773H3599C7453K6622a34246L7848f348k30274O9372j16636B7826J92345g5181
17761D15046a1615l08547A43429c72213i2606j07868E0138h140E1595c27755G9800
17749h8830A29496R9264k8517M8974M0909b33966C04568a33861B48797A00219
17738B05011b49208A20602a4598n3850H1318f8394A49576G2501c23169A00566
17727i8584l77278H9040M4943e6483I3475M8677i0796a2335C00909c6722p1802
$$ y = [-123932, -17955, 75619, 185627, -85890, -31221, 79142, 208951, -10329, 96502, 24403, 131955, 82730, 277767, -182927, -219374, 2582, 11537, -301326, -58624, -41258, 349915, 67150, 125549, -236202, -322762, -175223, 196346, -70428, -208945, -239719, 54500, 72988, 49655, 83599, 37453, 64075, -134246, -96398, -6348, -236622, -167250, -283886, 27826, 220171, -75181, 415046, -11615, -320162, 143429, -372213, -92606, -200474, 50138, -8140, 51595, -327755, 79800, -88830, 129496, 228760, 200243, 249217, 290126, -233966, 304568, -133861, 248797, 100219, 205011, -249208, 120602, -14598, -68448, 81318, -68394, 149576, 72501, -323169, 100566, -98584, -475862, 89040, 133983, -56483, 93475, 142152, -90796, -12335, 300909, -36722, -108524]
17716a08524O553k78F6885L7869K0418K19418a3777A88562R0344a13704C197L19956
17704C23153b38597A5995L2778L4752c7701j03096c455D8101a33708G1864C2874
17692b03239D9908B2289L4315K09107j03202R2389a32285j25146C5993K02841
17682B38834N6309b40843C42007b14261B32861e9169C5004a06046D0871N2959
17672I3830J55286o8817o7421n5050A035a08959C73008H0319b13770c2654p5773
17661a08427k1216C35798A25923b25589k5969g8366D8073c596B1902J69358J21343
17650C12603q4112l8231l5111a5185m5226C63276A71825G1540a59288O1690D7869
17638B19733q7222g509B9270c0140B76756a85378B54637F0126I157b3992A70003
$$ y = [-108524, -101971, -102249, 66885, 104754, 125172, 344590, -13777, 188562, 278906, -113704, 3197, 323153, -238597, 15995, 48773, 83525, -37701, -140797, -3455, 48101, -133708, 71864, 32874, -203239, 49908, 22289, 56604, 265711, 162509, 254898, -132285, -257431, 35993, 238834, 295143, -240843, 342007, -214261, 232861, -59169, 35004, -106046, 40871, 93830, 249116, 180299, 112878, 57828, 1035, -108959, 373008, 80319, -213770, -32654, -108427, -129643, 335798, 125923, -225589, -251558, -78366, 48073, -3596, 21902, 191260, 312603, 228491, 190260, 155149, -15185, -60411, 363276, 171825, 71540, -159288, -97598, 47869, 219733, 132511, -7509, 29270, -30140, 276756, -185378, 254637, 60126, 9157, -23992, 170003]
17626a72306B9683P1275J6470n4195O3665k184K32728b27461A98205a87178G8132
17614e6321p1863a9324H4752A1404K45068a20899A35022e994A7835O7725d54766
17602c10818A37979n677L6302K02590I9819P8490E4875a64388H8259J18000R0573
17591B96832B952a00590A99276a49603B91336D8574P5215g0161G230J78848c20894
17579e8382B29895o507l4884Q4040I7159h8850C03483A14093a9103B1444b99197
17567A67066J22979a13073B49957a1259B67163h062k8465j86001i4519n5431c3550
17555B42083a34491n0389B19938j08520M0205R6371a3147B3768K94313a22821
17544B07746N3543A09506a72618B27495a58672A03569e0990B65569Q609A30252
$$ y = [-172306, 29683, 100958, 117428, 63233, 126898, 124714, 357442, -227461, 198205, -187178, 78132, -56321, -128184, -19324, 84752, 11404, 256472, -120899, 135022, -5994, 17835, 85560, -454766, -310818, 137979, 132302, 168604, 371194, 99819, 178309, 54875, -164388, 88259, 206259, 296832, 2952, -100590, 199276, -149603, 291336, 48574, 123789, -70161, 7230, 186078, -320894, -58382, 229895, 223388, 188504, 272544, 97159, -88850, 303483, 114093, -19103, 21444, -299197, 167066, 290045, -113073, 249957, -11259, 267163, -8062, -36527, -222528, -94519, -149950, -33550, 242083, -134491, -184880, 219938, 111418, 151623, 247994, -13147, 23768, 318081, -122821, 207746, 261289, 109506, -172618, 227495, -158672, 103569, -50990, 265569, 274178, 130252]
17533h5722F6484R0255L766a88157B66687q0502q6615R3545L3862a89311h3559
17521a34712k8009A83116i719F1426R6254Q023a13408A25543a52998B62944I8294
17509D59487A22518m5218J6088b6557k25462F7679c4380Q040j36070I4948e3094
17497a54590B62670d1658j42126D2781K83466I1291j5007Q6245a4066G258J8284
17486B5542K60955d6705r9077L5585l4677C08908b00995D74444h1561B63726g133
17474I6132k941K82506j08909R2350F6086k8133K75516L0396G8565d7037I9288
17462B90813c42262F8655a37731C77773E1622M7789J92263a775A33127N1807d3396
17450A03559K64319F2185J59068K18644A9564c1638E51544k00891A19869M56790
$$ y = [-85722, 66484, 156739, 160505, -188157, 266687, 186185, 99570, 193115, 226977, -189311, -83559, -134712, -162721, 183116, -9719, 61426, 157680, 165703, -113408, 125543, -152998, 262944, 98294, 459487, 122518, 77300, 93388, -26557, -252019, 67679, -34380, -26340, -162410, 94948, -53094, -154590, 262670, -41658, -183784, 42781, 326247, 91291, 76284, 162529, -14066, 7258, 25542, 286497, -46705, -145782, -110197, -144874, 308908, -200995, 474444, -81561, 263726, -7133, 96132, 93191, 375697, 266788, 359138, 66086, 37953, 313469, 343865, 78565, -47037, 99288, 290813, -342262, 68655, -137731, 377773, 51622, 99411, 291674, -1775, 133127, 184934, -43396, 103559, 367878, 62185, 221253, 439897, 19564, -31638, 551544, 350653, 119869, 576659]
17440E76659B83710A09291a35187F7462L9967K08504A50099K63971j62780K35505
17430D86795n5388H9891J07818m6225L6289K3342C5507L59794I2406K32650j24874
17419B00182R9127K04702j68493j31585L8918D1485e8361C15073K7381c6338a2389
17407B91802j05398J46498D792N6952J31297P6039J3494O9883F9812k7855m232
17396C7725J80247M9984J51659b11689A67890B9163J70838E2833R0865K16908
17386C60606j43777r6721N8495G9635C8685a3636l3239r9960C43846a15604C0473
17374A54269n5973a52493B81248q3178l2604J79527j49730K45138k12364c02421
17363B66077J64267a02379F1858L93814k26117H6506J13600E5026K17147n4421
$$ y = [576659, 283710, 109291, -135187, 67462, 107429, 315933, 150099, 414070, 251290, 486795, 431407, 89891, 197709, 151484, 187773, 211115, 35507, 395301, 92406, 325056, 200182, 299309, 504011, 335518, 203933, 242851, 41485, -58361, 315073, 342454, -36338, -12389, 291802, 186404, 332902, 4792, 61744, 193041, 269080, 282574, 352457, 69812, 41957, 37725, 217972, 267956, 419615, -211689, 167890, 29163, 200001, 52833, 143698, 360606, 216829, 120108, 178603, 79635, 38685, -13636, -46875, -146835, 343846, -115604, 30473, 154269, 98296, -152493, 281248, 198070, 165466, 344993, 195263, 440401, 228037, -302421, 266077, 430344, -102379, 61858, 455672, 229555, 86506, 200106, 55026, 272173, 217752]
17353B17752R5316A7614g280A41916n5218J18890K63455j96296i0820C12382J1791
17342C24173J75018j93180J5349a10185A62838e455C70529b4061j0773F7298k9563
17331C7735J66396J8375f1127B2361K5090k2779L22166a2183r9740B16102k3936
17320A92166i5142A59721K76151j00561A49786J010j2145D7267K75729J9663I6754
17308G8068J41743F620J14486n3118d2880B48547N1016A25171O9663F7329Q3354
17297A50683K33782A75285i6364C90315A33060e3546F8183b39672A05775J60876
17287B66651N903C7164K01184a08034B61542N9648b9773B82522j02422K66496
17277D46596A7257K66023a79732D87301k13674L40845g2283k0662C21593I5743
$$ y = [217752, 313068, 17614, -7280, 141916, 86698, 205588, 469043, 272747, -90820, 312382, 324173, 499191, 306011, 321360, -110185, 162838, -5455, 370529, -24061, -34834, 67298, 37735, 204131, 222506, -61127, 22361, 47451, 24672, 346838, -12183, -111923, 216102, 192166, -95142, 159721, 435872, 335311, 149786, 150796, 138651, 47267, 322996, 342659, 96754, 78068, 219811, 6620, 121106, 67988, -42880, 248547, 299563, 125171, 194834, 67329, 150683, 384465, 175285, -96364, 390315, 133060, -53546, 68183, -239672, 105775, 266651, 272554, 37164, 238348, -108034, 261542, 321190, -29773, 282522, 180100, 446596, 17257, 283280, -179732, 487301, 273627, 614472, -72283, -92945, 321593, 95743]
17266C92830c5122A12675K16652j57511j9507a56356F1328M2844c0306A18455
17255e1037A91032J1916P5567l4675K1919j24709o1401L29314j32421P6184j17051
17244B35675J04857E1368J90710I4469J18443J71196j88401D9469Q1073a9150
17233A89979C4939L5629J67250J8559J6584K53609A58952N7901M8063l6303J48182
17222C76795A28032J82021r3128M6147j3654n7827K4497K37912g0124D19382A05109
17210B38914L3714j08007J72889A3851N42124A62795P7495J39735O0479a51088
17199C20914k7311p3727K73505r3717L327A88863L9561d4177D96878k21730j33493
17188A41655J54852A4316M28443b3183I0448K63234j2073d3867p6160C27392j56538
$$ y = [392830, -35122, 112675, 329327, 171816, 152309, -156356, 61328, 104172, -30306, 118455, -51037, 191032, 202948, 278515, 243840, 265759, 141050, 79649, 408963, 276542, 352726, 235675, 340532, 51368, 242078, 94469, 212912, 384108, 195707, 49469, 130542, -19150, 189979, 34939, 70568, 237818, 256377, 272961, 526570, 158952, 216853, 264916, 228613, 376795, 128032, 310053, 216925, 263072, 249418, 191591, 216088, 454000, -70124, 419382, 105109, 238914, 272628, 164621, 337510, 13851, 555975, 162795, 240290, 380025, 440504, -151088, 320914, 293603, 219876, 493381, 399664, 402991, 188863, 228424, -44177, 496878, 275148, 141655, 296507, 14316, 442759, -23183, 90448, 353682, 341609, -43867, -120027, 327392, 170854]
17177A70854c9530A25209J63471N818K0404j48465K68914A94234F7318O977Q4907
17166A59202J35609J92024B40828L1540L89591B14351m7749F9472L51620A08592
17155A11663M27394k04044j66906L25478m4352B17918k0178R9528K81093n4958
17145E23403k20104K07057B45677J49519Q3826A78307J46642E2919K55079K2254
17135C30252Q1905L07885l50572j11290O9717J60143m8515J00737B23011o808
17125B16203n2933N90445A85947J39691L10724B30104H9361L55771r4649q7790
17115B62693R2303p6526P2077o3267J37452J76297o4307j33631P2001q504j72305
17104B94283K419j02546K69931A15355N93221Q4817k65115A53092J7876L75771
$$ y = [170854, -39530, 125209, 288680, 294498, 314902, 166437, 435351, 194234, 67318, 74295, 159202, 294811, 486835, 240828, 272368, 661959, 214351, 166602, 69472, 421092, 108592, 111663, 539057, 335013, 168107, 493585, 449233, 217918, 197740, 297268, 578361, 523403, 303299, 510356, 245677, 395196, 479022, 178307, 324949, 52919, 307998, 330252, 412157, 720042, 369470, 258180, 327897, 488040, 439525, 540262, 223011, 216203, 163270, 753715, 185947, 325638, 636362, 230104, 89361, 445132, 350483, 262693, 354996, 278470, 350547, 287280, 424732, 601029, 536722, 403091, 475092, 466588, 294283, 296702, 194156, 464087, 115355, 708576, 793393, 528278, 153092, 170968, 546739]
17094E46739j95661A02943K77748j56379N62848k15406B65055q6308O7773J81773
17084D28293J51714K9886d0300C57035P8157j49228L0760M3177L55560l15974
17074C99487o7651K7783J72877B18239J94334O6465H3502K55505J48363J65664
17064F53034N515k21918j89513p5821K12695L08911m1794j83940o9625l1594O9518
17053D35468j14076J26840j6187J27295J68063C28320k551J79970K08673N2969
17043G67381k72268K07248J18079m05030K48122J43377J19909l38023L1585j87788
17033D32592K6373K37474j99436L50458k68013r6912j09928M37211k39363Q5777
17023F56233k80115L49507R3306k74969k69043M11335J65394C88424M28360l16539
$$ y = [546739, 351078, 102943, 380691, 224312, 787160, 571754, 265055, 178747, 246520, 428293, 580007, 609893, -40300, 357035, 435192, 285964, 316724, 359901, 715461, 399487, 331836, 359619, 532496, 218239, 412573, 479038, 83502, 339007, 487370, 653034, 658549, 436631, 247118, 171297, 383992, 692903, 651109, 467169, 397544, 365950, 435468, 321392, 448232, 432045, 559340, 727403, 328320, 325769, 505739, 714412, 767381, 495113, 702361, 820440, 415410, 663532, 806909, 926818, 588795, 620380, 432592, 458965, 696439, 497003, 847461, 579448, 482536, 372608, 809819, 570456, 656233, 376118, 725625, 818931, 543962, 274919, 686254, 851648, 388424, 816784, 500245]
17013E00245L5084R0727K1890K59860j923l40203M1513R2917B34465L44070L57548
17002I36083k09257K11412k25498k80143K22002N9154k55593K33378J90180P6320
16992I58038o2986l44690j03368M69147L07993l51371k57793O5644K50154K1774
16982I52542j52255J19825k16499j03026J96729J38524j130k4355r1446R2895
16972I11804q7580p3112M7999K74709j40115q4413K37543m63384J03025P7192
16962H03668K35460J05455m30608L78022m5975K4574L7562m2921K79277k75288
16952A069226j1992J23617L4012J58218m48717J37829K67277M9476k35342K69664
16942A413268l95468J12486k38082M87599j43547L29585k37371M027J0278N7062
$$ y = [500245, 535329, 626056, 647946, 907806, 905883, 565680, 607193, 700110, 234465, 578535, 936083, 726826, 938238, 712740, 432597, 654599, 713753, 458160, 691538, 881718, 958038, 895052, 550362, 446994, 916141, 1224134, 872763, 614970, 680614, 930768, 952542, 800287, 920112, 703613, 600587, 797316, 935840, 934710, 910355, 818909, 911804, 824224, 751112, 799111, 1073820, 933705, 849292, 1086835, 623451, 726476, 803668, 1039128, 1144583, 713975, 1091997, 1046022, 1070596, 1108158, 1065237, 1344514, 1069226, 1057234, 1180851, 1214863, 1373081, 924364, 1062193, 1329470, 1378946, 1143604, 1413268, 1017800, 1130286, 892204, 1379803, 1236256, 1565841, 1328470, 1332497, 1342775, 1399837]
16932A399837J51233l58384J00533J35291K63232l72725J51693j51805J78383
16923A497288J56800k43593j57167O1659K28117L33988k98747l21190M98144m17457
16913A337842O5207J24089L69096k29432l8230k07809J05937K97189l17287K10144
16903A716746N0447j57122P9169K63388j17421j25781J43538O4141m8845k63143
16893A605117N71748K8479L1763k23519Q3485P1521j50597R5174J08304l29320
16883A892155r0994N03790m17993M67327j61829K47430k53446J47195M1470k11312
16873B163793J96361K90800R9160l79895J49665L46404J27257l88916j02748L40697
16863B842578n2809L91844l51459K62429m68922P01856l16943N5187J78063Q1947
$$ y = [1399837, 1551070, 1192686, 1293219, 1428510, 1691742, 1319017, 1470710, 1318905, 1497288, 1654088, 1410495, 1253328, 1314987, 1543104, 1877092, 1578345, 1257155, 1755299, 1337842, 1403049, 1527138, 1896234, 1666802, 1628572, 1420763, 1526700, 1823889, 1506602, 1716746, 1767193, 1610071, 1689240, 1952628, 1835207, 1709426, 1852964, 1917105, 1868260, 1605117, 2176865, 2205344, 2237107, 2013588, 2097073, 2168594, 2017997, 2113171, 2221475, 1892155, 1801161, 2304951, 1886958, 2354285, 2192456, 2439886, 2186440, 2333635, 2375105, 2163793, 2360154, 2650954, 2750114, 2370219, 2519884, 2866288, 2993545, 2604629, 2501881, 2842578, 2789769, 3181613, 2830154, 3092583, 2623661, 3325517, 3008574, 3063761, 3241824, 3323771]
16853C323771k29632J63195M1423j44571L71638o0413p268j3867q2048J65888
16843C528116J86680k9817J97662p8988R2264l13952O00362Q2153J5717k17600
16833D062597K19200K67547k7833K06965j9878n1095k5210J46822K56870k61642
16823D774343K47941K36777j33293P84632L9101m27189M00764j27588L45907N098
16813F146493R2427K17319J73761o0359L08258L92302j8066J30494m5462M71782
16803G808949K4110K23119p26J26251M05148J30240M23566L5161M31082k85875
16793I321025L13849L99650J63931K22399N66045K57054K79552K69556N29187
16784A2322248R6607M54473J13228K01877M31195L04433O64579N70637K91398
$$ y = [3323771, 3094139, 3257334, 3298757, 3154186, 3525824, 3465411, 3458143, 3444276, 3362228, 3528116, 3714796, 3684979, 3882641, 3803653, 3895917, 3581965, 4182327, 4264480, 4280197, 4062597, 4281797, 4549344, 4521511, 4728476, 4708598, 4657503, 4632293, 4779115, 5035985, 4774343, 5022284, 5259061, 5125768, 5910400, 5949501, 5522312, 5923076, 5795488, 6141395, 6146493, 6238920, 6456239, 6630000, 6569641, 6877899, 7270201, 7252135, 7382629, 7337167, 7808949, 7833059, 8056178, 8055452, 8181703, 8586851, 8717091, 9140657, 9175818, 9606900, 9321025, 9634874, 10034524, 10198455, 10420854, 10986899, 11243953, 11523505, 11793061, 12322248, 12418855, 12873328, 12986556, 13188433, 13619628, 13924061, 14588640, 15159277, 15450675]
16775A5450675N68991J078081P0718K17469J121162L84271N45717M65693O72401
16766B0575178J302698M37832R65810Q96758Q56024J087010Q47028J355123J051772
16757B9375233J409216J363038J206251J380064J490888J713660J843621K042213
16749D1824184J913771K384894K001515K270336K821309L140685K877328L330900
16741F2564922L006668L890649L657844M776964M151993M922632N202205N319797
16733I7493674N782130O305939O448748O524052P215377P100424P582190P566297
16725A52018831P360976O983762P279101O763636N934893M879301M428613K524045
16717A98173158J884232R8331p75541k384886l313788m769879n487813o357911
$$ y = [15450675, 16019666, 17097747, 17168465, 17385934, 18507096, 18891367, 19437084, 19902777, 20575178, 21877876, 22315708, 23281518, 24178276, 25034300, 26121310, 26968338, 28323461, 29375233, 30784449, 32147487, 33353738, 34733802, 36224690, 37938350, 39781971, 41824184, 43737955, 46122849, 48124364, 50394700, 53216009, 56356694, 59234022, 62564922, 65571590, 69462239, 73120083, 77897047, 82049040, 86971672, 92173877, 97493674, 103275804, 109581743, 116030491, 122554543, 129769920, 136870344, 144452534, 152018831, 159379807, 166363569, 173642670, 180406306, 186341199, 191220500, 195649113, 198173158, 200057390, 200155721, 199380180, 196995294, 193681506, 188911627, 183423814, 177065903]
16709A77065903o975050p353231p746990p330697q216619p447684p230666p237643
16701A17527323o351092o988056n927600n908962n171261n391748m457277m008693
16693G3322634m595762l803522l314776l561916l077329k865975k658390k988070
16685D6456894j718553k192838k027786k146463j921850j293338j746069j271623
16677C2138374j563985j298229j271924j043489j228430r86979j166643o76730
16669B2901965r69206p72128r56440m78670o59301q72470n51957p08199n99126
16660A6334468m54930n13358n44701l98232p92593k19375k02098o22082m12249
16651A2174850m64820K66801o65146o29240l18478N9602l63998o62915J67661
$$ y = [177065903, 170090853, 162737622, 154990632, 147659935, 139443316, 131995632, 124764966, 117527323, 111176231, 104188175, 98260575, 92351613, 87180352, 81788604, 77331327, 73322634, 68726872, 64923350, 61608574, 58046658, 54969329, 52103354, 49444964, 46456894, 44738341, 42545503, 40517717, 38371254, 36449404, 35156066, 33409997, 32138374, 30574389, 29276160, 28004236, 26960747, 25732317, 24745338, 23578695, 22901965, 21932759, 21160631, 20204191, 19725521, 19066220, 18193750, 17641793, 16933594, 16334468, 15879538, 15366180, 14821479, 14423247, 13630654, 13411279, 13209181, 12587099, 12174850, 11710030, 11976831, 11311685, 10682445, 10363967, 10423569, 10059571, 9396656, 9564317]
16642I564317n77231J8391m78785J04083k76722j06972k16407j57420j61005n17110
16632G195139o868K1842k23267k82781k43800k45672k02182j33608J78353J396
16622F058552l30740r2752k78353L074l90942L39109o249l80637n82852M76926
16612D815136k74504J04271m51893J75843k6413l01246M77921l78960m0656p0994
16602D028505k35228j94473M0228j59354N05q015J5306L0203Q0668l12785J22675
16591C408235o945p40865J12971L92808r9697k91400m0285K60427n18311M37086
16581B914024n44327J86772l10216K31927j05631J53399L35908l76278k20600
16572B264978K69061j13670k57723j05212K50178k24420J99869n2631l1078q7904
$$ y = [9564317, 8987086, 9005477, 8526692, 8630775, 8354053, 8247081, 8030674, 7873254, 7712249, 7195139, 7188271, 7210113, 6986846, 6704065, 6460265, 6214593, 6012411, 5878803, 6057156, 6058552, 5727812, 5635060, 5356707, 5359781, 4968839, 5307948, 5301699, 4921062, 4338210, 4815136, 4540632, 4644903, 4193010, 4368853, 4342440, 4041194, 4519115, 4140155, 4099499, 4028505, 3793277, 3598804, 3639032, 3479678, 3480183, 3472168, 3487474, 3517677, 3598345, 3285560, 3408235, 3401290, 2660425, 2773396, 3166204, 3066507, 2775107, 2734822, 2995249, 2476938, 2914024, 2369697, 2556469, 2246253, 2478180, 2372549, 2525948, 2861856, 2485578, 2264978, 2534039, 2420369, 2162646, 2057434, 2307612, 2083192, 2283061, 2230430, 2199352, 2111448]
16562B111448j80548J02567l58160K73920R0449j97140j8084l05700K55741k43946
16552A530547O7642K59487j98826K95481k68838l229j41136O9210j14820M17121
16542A912639k02087k5303m63635M5155k23268J83411L31975k11079K32611j56632
16532A423787m39896M89214J21558j50845k97316J42131k31357M27114j60584
16523A323806j97621L91149j07005Q9726p2483j63864j98238L16897l05377J84540
16513A261530o8753K7767r7581k83888K25530j08042N04124k34676k61300j17240
16503H47471O3209J92199j41840L17660n81983K31159M91671n00064j4399k05304
16493F99779Q7875L3314j45248Q9492p3351L36084k58294r7024M20184j51306
$$ y = [2111448, 1930900, 2033467, 1675307, 1949227, 2039676, 1842536, 1824452, 1518752, 1774493, 1530547, 1598189, 1857676, 1658850, 1954331, 1685493, 1682264, 1541128, 1610338, 1495518, 1912639, 1710552, 1685249, 1221614, 1266769, 1043501, 1226912, 1558887, 1347808, 1580419, 1423787, 983891, 1473105, 1594663, 1443818, 1146502, 1288633, 1057276, 1484390, 1323806, 1126185, 1517334, 1410329, 1500055, 1427572, 1263708, 1065470, 1382367, 1076990, 1261530, 1192777, 1220544, 1122963, 839075, 1064605, 956563, 1460687, 1226011, 964711, 847471, 910680, 1102879, 961039, 1278699, 696716, 927875, 1419546, 919482, 905083, 699779, 787654, 820968, 675720, 765212, 691861, 1027945, 769651, 672627, 1092811, 941505]
16483I41505p0354K19804j22560m6689J233p6908l32209J02212J990J73094C06904
16471E14314P1149M07911k99054O0272K3699O6986k5629Q6030l56891J92980p9464
16460F62303J16636j24067J34324l55968L83229l09359M81200k32660k54834R5516
16450E96320J79818J4392k32241o843L70739k19783k19282q220J3660j68108J29118
16439D49570J65879B92502L99056n5780j04793K54524C62472J3190L45548C09273
16428D60747M81916C80096L8267l3929J79591j63147K65056B78591M02850j59093
16418E22348j7910q2477n34O7906j06888A8219M96152B40911g318C26751N6800
16407C83551J24779Q7050B00306l1329J61949j6480L99989j44139m7140N1831
$$ y = [941505, 871151, 1090955, 968395, 921706, 922939, 846031, 513822, 616034, 618024, 791118, 306904, 514314, 585463, 993374, 694320, 754592, 778291, 845277, 819648, 905678, 548787, 741767, 662303, 778939, 654872, 789196, 433228, 816457, 507098, 988298, 755638, 500804, 596320, 776138, 790530, 558289, 551446, 922185, 702402, 483120, 474900, 488560, 320452, 449570, 615449, 292502, 691558, 635778, 530985, 785509, 362472, 375662, 721210, 309273, 460747, 942663, 380096, 418363, 384434, 564025, 400878, 665934, 278591, 681441, 522348, 504438, 421961, 421427, 489333, 382445, 18219, 514371, 240911, -7318, 326751, 383551, 508330, 595380, 200306, 168977, 330926, 314446, 714435, 570296, 523156, 574987]
16397E74987J383O683j49391J1577k5716K20007j87195o0019n7078j16511k4987
16386A93740J59304A47068Q7326K18911J4773A02371J87808E4165k6530K7841
16376E5476L52009b60428C73222L5053A92706q4269J04317P2595A14090J11998
16366B26088n2359K18669E5300J96381p701L45779B00482J52498j3181m1696l3133
16355B64970I2659J07171I9420O4260Q6962j01363F6156J50933a42797G8534h1294
16343D50445B5881J90526p4887J47569I0473L09860p3933a60015A83984K56814
16333D40798j23338C4822L37559A47905L5170F5586n369J89386j02463P0027R3898
16322C11065r9289K00012R3467j31293G4526L55088k02502N2369K55295B59260
$$ y = [574987, 576370, 583053, 433662, 445239, 419523, 639530, 452335, 392316, 335238, 218727, 193740, 353044, 147068, 234394, 453305, 468078, 102371, 290179, 54165, 27635, 55476, 407485, -260428, 373222, 408275, 192706, 108437, 212754, 285349, 114090, 226088, 173729, 392398, 55300, 251681, 243980, 589759, 200482, 352980, 339799, 298103, 264970, 92659, 199830, 99420, 163680, 250642, 149279, 66156, 217089, -142797, 78534, -81294, 450445, 25881, 216407, 141520, 289089, 90473, 400333, 326400, -160015, 183984, 440798, 317460, 34822, 372381, 147905, 183075, 65586, 60217, 249603, 147140, 217167, 311065, 211776, 411788, 505255, 373962, 74526, 429614, 227112, 279481, 534776, 259260]
16311B30389n0347L9074j00367Q0645J04841M5715j14289J00346n8430L8458C9260
16299B8358K47885M9633j51980d4735j45790A07911N6370d2594A78153M0142J58659
16288C76954Q0744A67684J24111j0196b88087F54412A7267a4721A57212K2285
16278A79497L1824J05546A36014L19350A87019r2514a05797A21708K18928c3706
16267B87917p1119e5649B752Q6411J61817C208b4154A21215J6325i2264m9139
16256a41403d616A92676J47616a72510D7604K15992B2150a46252b244B31936M0461
16245B72397J24078g5318C94089a90774A45451C9517a88315B48774c2356a566
16234a09045B24832H2058k9745J715c1589k42348A14175J42444J14088f8733K0429
$$ y = [230389, 180042, 219116, 118749, 199394, 304235, 349950, 235661, 336007, 277577, 316035, 39260, 28358, 276243, 325876, 173896, -44735, -190525, 107911, 164281, -42594, 178153, 218295, 376954, 457698, 167684, 291795, 281599, -288087, 654412, 17267, -14721, 157212, 179497, 211321, 316867, 136014, 455364, 187019, 94505, -105797, 121708, 340636, -33706, 287917, 216798, -55649, 2752, 89163, 250980, 3208, -24154, 121215, 137540, -92264, -141403, -4616, 192676, 340292, -172510, 47604, 263596, 22150, -146252, -2244, 231936, 272397, 396475, -75318, 394089, -190774, 145451, 39517, -188315, 248774, -32356, -1566, -109045, 224832, 82058, 52313, 54028, -31589, -273937, 114175, 256619, 370707, -68733, -48304]
16223d8304F8705K35789A26663M11336C8749J16754E934L89816A83489D8554f4567
16211B94181A4494K38842c1918A01390N4236b79493B68808e639E4512K10381q9743
16200A75150O3382e1059H55a0696F0966f5710j24801A25241n434h6070E3688J85340
16188B39028m3766q5305J28360q8489c8745B31273G7766b6245l99455A03811j1745
16177I2066J79293o437A09546a46644L3508c6726J7196C20187G6161b00959C78270
16165B0739h6219n1471k54850I888i1669k01538C30315j17374j01073M0278b42893
16153c72341C49043H4914g6659A88329a01909B30381r2681a23598B35821l3644
16143B02177H716i1491A7243a15380B17694I5753Q4649D9539J50250A981K64936
$$ y = [-48304, 68705, 304494, 126663, 537999, 38749, 155503, 5934, 395750, 183489, 48554, -64567, 294181, 14494, 253336, -31918, 101390, 155626, -279493, 268808, -5639, 54512, 264893, 175150, 238532, -51059, 855, -10696, 60966, -65710, -190511, 125241, 119807, -86070, 53688, 239028, 195262, 109957, 238317, 149828, -38745, 231273, 77766, -26245, -425700, 103811, 92066, 271359, 264922, 109546, -146644, -113136, -36726, -19530, 320187, 76161, -200959, 378270, 20739, -86219, -137690, -392540, 9888, -91669, -293207, 330315, 212941, 111868, 152146, -242893, -372341, 349043, 84914, -76659, 188329, -101909, 230381, 137700, -123598, 235821, 202177, 8716, -91491, 17243, -115380, 217694, 95753, 180402, 49539, 199789, 1981, 266917]
16132B66917P5398I3792L97866G3616R5153b10652e1441i984B90544a9530k71941
16121b91471E36246b20499A39009a64849A29641a13372q9210B97755h0033j4577
16111i4610n8871B9720n92j0301L35678a43739f2719A73868L5908F9832I923J86613
16099A96536J5679b752A34151f4472A3107P3236a29873m4391B57532b19906A48602
16087b79856A87461p9651b46968A90004B2631b10711C01378k2854q796j5898p1606
16076A82224G6878a12941A07114L0205J34896D6620A2805a7101j21845D0387L00649
16065C41036f1361k29274e8633A40598a29504k99535F0195c18531A2022J63035
16055A75057A3838b14228l3632N5642O6005b9629k82233a03502M4992j44079B15112
$$ y = [266917, 342315, 93792, 491658, 73616, 168769, -210652, -51441, -9984, 290544, -19530, -291471, 536246, -220499, 139009, -164849, 129641, -113372, -202582, 297755, -80033, -94610, -153481, 29720, 29128, 18827, 354505, -143739, -62719, 173868, 209776, 69832, 9923, 196536, 212215, -2752, 134151, -64472, 13107, 86343, -129873, -174264, 257532, -219906, 148602, -279856, 187461, 107810, -246968, 190004, 22631, -210711, 301378, 278524, 269728, 253830, 182224, 76878, -112941, 107114, 137319, 272215, 46620, 12805, -17101, -138946, 40387, 341036, -61361, -290635, -58633, 140598, -129504, -429039, 60195, -318531, 12022, 175057, 13838, -214228, -247860, -192218, -126213, -29629, -311862, -103502, -58510, -202589, 215112]
16043I3329d3049j33925e2845J8786C0137f6238j39882J00305q6D9184F655a60266
16030A93376D8400i4667j06811j1543A17847d01226A87835F5051J09346q5719
16020H8678b85591C5989f6213B19729F8665a84741G3686J38607b70639A69080
16009A12899c7884F283a43245C7558M4493L0475b044B4381R2231a61976A18174
15997A50757a3181o2829B04095g0179A60191i1841G5142b72157b565I283i5910
15985C84270b529B27444p9410B2650K86854J83983g6567B48392d054o89A89336
15973h5937p8171I2549O2309D2278N7387M6473a31049A24694Q4550a1749C28a54080
15960A80817G8995C7325b26223B8692K76622h3409B50915A07894a24333j89016
$$ y = [93329, -43049, -176974, -52845, -34059, 30137, -66238, -206120, -105815, -105901, 49184, 6655, -160266, 193376, 48400, -94667, -201478, -213021, 117847, -401226, 187835, 65051, 174397, 88678, -285591, 35989, -66213, 219729, 68665, -184741, 73686, 212293, -270639, 169080, 112899, -37884, 6283, -143245, 37558, 82051, 112526, -2044, 24381, 116612, -161976, 118174, 150757, -13181, -76010, 204095, -70179, 160191, -91841, 75142, -272157, -2565, 9283, -95910, 384270, -2529, 227444, 148034, 22650, 309504, 493487, -76567, 248392, -4054, -4743, 189336, -85937, -164108, 92549, 154858, 42278, 99665, 146138, -131049, 124694, 209244, -11749, 328, -154080, 180817, 78995, 37325, -226223, 28692, 305314, -83409, 250915, 107894, -124333, -313349]
15950c13349a21540M0098B02613d07484c5165I6691m3137a15300A12377g5832
15939A88548h8314J6051B6088c96364a23476A39583a91038I9184J93693I900a40714
15927A95667c5856m4729L2039A40348k1394b87701e7926j88926N2491B88053B1557
15915c8523k6807J3877H9154L7500d952m86157a39963k1469g7260B90079g987
15903a2737D4191J80942G2179d7886j76973f4257k91851C8233J15302A9901K03612
15892B23513F7909J05924H1067l5474a04093L6757a0211o2973k21923c3646d1
15880H0615K9108b17419D1593d03513N7503a13635D820b36554E0647a81201a0303
15868a40328e9108b3450o810B2360b96490H8510M7838L3952b40301G0604g7425
$$ y = [-313349, -121540, -81442, 202613, -407484, -35165, 96691, 53554, -115300, 112377, -75832, 188548, -88314, -72263, 26088, -396364, -123476, 139583, -191038, 99184, 292877, 9900, -140714, 195667, -35856, -80585, -48546, 140348, 118954, -287701, -57926, -246852, -194361, 288053, 21557, -38523, -65330, -51453, 89154, 126654, -4952, -491109, -139963, -161432, -77260, 290079, -7987, -12737, 44191, 225133, 72179, -47886, -224859, -64257, -356108, 38233, 153535, 19901, 223513, 67909, 173833, 81067, 45593, -104093, -67336, -10211, -73184, -295107, -33646, -41, 80615, 109723, -217419, 41593, -403513, -346010, -113635, 4820, -236554, 50647, -181201, -10303, -140328, -59108, -23450, -30260, 22360, -296490, 88510, 136348, 170300, -240301, 70604, -77425]
15856D7823c45693a14131l0924B61326F9593a40411o0692h9258A52173O396a59292
15844A51054L1184J10454o1380b9804j46589B42753c9120A32423a93813M5043
15834a48770F918e9912r0597m2536P9417B2798K02982b33003H157a87923e3703
15822a4730A8955J19278b09166c8011F44Q9104J49658d38179J70265i5315C7741
15810A65402J49792a98921A9307a30669i083j72750K1585O4102A24378K44185
15800C68563i2899G5362K51568A45241F7735d484k73287h5617k27666C07843a49249
15788b39274G4542g3980F4769B1862J77485F3981g2912m222k79199a36819j3216
15777a50035e7624B96916a56652m7840N4527A17536f9132o5458D20251j38073
$$ y = [47823, -345693, -114131, -145055, 261326, 69593, -140411, -201103, -89258, 152173, 158569, -159292, 151054, 182238, 292692, 231312, -29804, -176393, 242753, -39120, 132423, -193813, -148770, 6918, -59912, -150509, -193045, -113628, 22798, 225780, -233003, 8157, -187923, -53703, -14730, 18955, 138233, -209166, -38011, 644, 89748, 239406, -438179, -267914, -95315, 37741, 165402, 315194, -198921, 19307, -130669, -9083, -181833, -160248, -96146, 124378, 368563, -92899, 75362, 326930, 145241, 67735, -4484, -277771, -85617, -313283, 307843, -149249, -239274, 74542, -73980, 64769, 21862, 199347, 63981, -72912, -77134, -356333, -136819, -150035, -57624, 296916, -156652, -204492, -149965, 117536, -69132, -134590, 420251, 282178]
15767B82178a86780a4906B9604h0610j26061r0539a31523j39286L3701h207A67208
15755C43902a19555B93908J289o1144b81065G2595l3742K8112J78044p6730G7845
15743B6199o328K6661c08940a41661k7596A60830b81179a03703D8439K200h8171
15731c0158a978j73991A20068N5599a55155j25351a15144k17548R1725e8099j89179
15720b47278a3869n7414A73825e8226A46066c7219p2882j80094J01371B96977
15709B1194L9363b441E6673a23736c5583j88698k39653f3646l4931D00622a53430
15697A65861f7174H0853M2814J5459o1002a0721m8181j12774j36376A31122b07975
15685B67600b73991J34915G6406a42286D7347M4734i9503j02501A67147b76942
$$ y = [282178, -186780, -14906, 29604, -80610, -206671, -297210, -131523, -270809, -237108, -8207, 167208, 343902, -119555, 293908, 295197, 234053, -281065, 72595, 38853, 66965, 245009, 168279, 77845, 26199, 19871, 46532, -308940, -141661, -169257, 160830, -281179, -103703, 48439, 50639, -88171, -30158, -1978, -175969, 120068, 175667, -155155, -280506, -115144, -332692, -240967, -58099, -247278, -13869, -71283, 173825, -58226, 146066, -37219, -110101, -290195, -188824, 296977, 21194, 60557, -2441, 56673, -123736, -35583, -224281, -463934, -63646, -98577, 400622, -153430, 165861, -67174, 80853, 123667, 139126, 78124, -10721, -58902, -171676, -308052, 131122, -207975, 267600, -273991, -139076, 76406, -142286, 47347, 92081, -99503, -202004, 167147, -276942]
15674a13379A14096b8733A62447B1301R5881b56842c3842A72396g5386C5708j3731
15663B1977d41521H1683K25044a21063C77675A05404g9022I4929o896N9302a2295
15651a91411D0081d5989m3078B8324a54993H8289P1677c6051j9486o479A14668
15639i6357r0280j77575G9905A4800J72232J67302b99026b3814q2968o6345A77443
15627A93690I5420M332a83826A80838a54628H2015h1629q4277k36517A02957a97740
15615b3502j56396b2572k0352B3871J33568L800a94221A92408b8098B68517a11478
15603a5778o2325m7019C8216Q9743J15345Q2028F8804a3246k3732j35501G3754
15591A2137J76476A4387c691A23268b3643q9037j02160H8071P2325a83834E8689
$$ y = [-113379, 114096, -28733, 162447, 21301, 117182, -256842, -33842, 172396, -75386, 35708, 21977, -441521, 81683, 306727, -121063, 377675, 105404, -79022, 94929, 88033, 147335, -12295, -191411, 40081, -45989, -89067, 28324, -154993, 88289, 159966, -36051, -55537, -62016, 114668, -96357, -186637, -364212, 79905, 14800, 187032, 354334, -299026, -23814, -106782, -173127, 177443, 193690, 95420, 99752, -183826, 180838, -154628, 82015, -81629, -165906, -402423, 102957, -197740, -23502, -179898, -22572, -42924, 23871, 157439, 161239, -194221, 192408, -28098, 268517, -111478, -15778, -78103, -125122, 38216, 127959, 243304, 325332, 68804, -13246, -36978, -172479, 73754, 12137, 188613, 14387, -3691, 123268, -23643, -112680, -214840, 88071, 160396, -183834, 58689]
15579b5570j04236j8028F6683a94475A06908l3151c4304B21928a65060j09779
15569b74839N758J24089A38495E8331a98675B59185a08587A92358c2988j2352
15559d5340A98432b13158D4968K65370a7008j45870A63357D5172K40053a90460
15548a13669M1370C10004e2929A02811M6704F7942J92239d25742a82455B91480
15537c14174A81712a22972B75157b10659h1150j27988F6256a06244C1650N3646
15527H5296A3331a76943b6718l0440I0970b85291J34697O5257D9987M8043n754
15516I2276R3715q6210B5476L29791b7776n9943g504j59787L7495j5919e4330
15504B03271d25527A6475P4846b93704g6176A26224C1312h4983J4105C39722a8389
$$ y = [-25570, -129806, -147834, 66683, -194475, 106908, 73757, -34304, 221928, -165060, -274839, -269081, -144992, 138495, 58331, -198675, 259185, -108587, 192358, -32988, -45340, 198432, -213158, 44968, 310338, -17008, -162878, 163357, 45172, 285225, -190460, -113669, -72299, 310004, -52929, 102811, 149515, 67942, 260181, -425742, -182455, 291480, -314174, 181712, -122972, 275157, -210659, -81150, -209138, 66256, -106244, 31650, 85296, 13331, -176943, -26718, -57158, 90970, -285291, -150594, -85337, 49987, 98030, 92276, 185991, 99781, 25476, 355267, -27776, -87719, -7504, -167291, -129796, -145715, -54330, 203271, -425527, 16475, 91321, -293704, -76176, 126224, 31312, -84983, -70878, 339722, -18389]
15492a26725A99548i2621A90143m6675b98326c8251j58844P5089A96419C8711
15481A76679e9705l39751J90818I2671e7211r6738B23745e0602B17135a77739
15470B06233o2147e0224H6057a74893g1947B13355m5517d86769A81610L460a6569
15458e6538B0823d73763b23752C07924j6163A18976K02953b4289A94176a55325
15447E9906b51920A64433M6490g6210L7074C1147a08172C2615d01454A61900h8271
15435e8900D2553e27403c8871B8816e134A27444a24387H5242A7822O8023a17432
15423B43494A01190b3161G3873L447a10699F2761B4229c35688a48767C10572A7999
15411c4838A0875Q2866e6909j45084I693M17665A75237F3098K7213J5522a7568
$$ y = [-126725, 199548, -92621, 190143, 143468, -298326, -38251, -197095, -122006, 196419, 38711, 176679, -59705, -399456, -208638, 92671, -57211, -153949, 223745, -50602, 217135, -177739, 206233, 144086, -50224, 86057, -174893, -71947, 213355, 167838, -486769, 181610, 185070, -16569, -56538, 20823, -473763, -223752, 307924, 291761, 118976, 321929, -24289, 194176, -155325, 59906, -251920, 164433, 210923, -76210, -39136, 31147, -108172, 32615, -401454, 161900, -88271, -58900, 42553, -527403, -38871, 28816, -5134, 127444, -124387, 85242, 17822, 85845, -117432, 243494, 101190, -23161, 73873, 77320, -110699, 62761, 24229, -335688, -148767, 310572, 17999, -34838, 10875, 93741, -56909, -201993, 9693, 427358, 175237, 63098, 90311, 105833, -17568]
15399A97629D435O6567a01291A64644p6705f073p4783C9516a97331o860F6782
15387A3859f9200C2584K56410c51266C32874A11871a63941F6192O8242a05841
15376H3521q060h9847k5470J3095A46736a86341A37427J63201b89441A46104d23049
15364f9925c0594q4063j2174D3185J7810O3228i2523F1094a42460E0078J58082
15353B08160C034J08897J08565a01822A90813J5722a67556A1125M40775A91740
15342a14488A87312g8454I3369i7582o7452C8200A0716J90975b14983c4400A75764
15330A80486I849b19629C09468f9497D25280i5821C31208F8079i6096o6961a4271
15318D7128L8419C7593b99371g5340B97940e5394j18728j23112A03535l4700L7893
$$ y = [197629, 4435, 71002, -101291, 164644, 87939, -6073, -80856, 39516, -197331, -204191, 66782, 13859, -69200, 32584, 288994, -351266, 332874, 111871, -163941, 66192, 134434, -105841, 83521, 75461, -89847, -115317, -102222, 146736, -186341, 137427, 300628, -289441, 146104, -423049, -69925, -30594, -114657, -126831, 43185, 60995, 124223, -92523, 61094, -142460, 50078, 208160, 3034, 111931, 220496, -101822, 190813, 206535, -167556, 11125, 451900, 191740, -114488, 187312, -78454, 93369, -97582, -165034, 38200, 10716, 201691, -214983, -34400, 175764, 180486, 9849, -219629, 309468, -69497, 425280, -95821, 331208, 68079, -96096, -163057, -14271, 47128, 85547, 37593, -299371, -75340, 297940, -55394, -174122, -297234, 103535, 68835, 106728]
15307A06728K384l3667L6286g1762A5162J62847a0547j96861B23912k9591b35900
15295C2269K0531K1691J91344a0100G2261e8741K1687j51065B44658c6927A69617
15283H1982K78587h0408j09310K8478A69652a72637j8139F7121J1058C19J17776
15272A18095n6151J29065M5390h2389j38207o3350i3857B67865h9434L0307C63906
15260A9442h0897k4035A46889J0678I250J80586K06051A11567l6157a0326C07752
15248G60760K61270R76708o54874J19090n07244C29447A04926D7501M6341P5366
15238A69208c2967B65159A3550g3629L1786p7890H2565K25536B563L85115f1805
15226D52619A89021K2845D6381P6052C051K6501K9369a31187K6022C7853K89957
$$ y = [106728, 109112, 75445, 111731, -71762, 15162, 178009, -10547, -207408, 223912, 194321, -235900, 32269, 52800, 74491, 265835, -10100, 72261, -58741, -37054, -188119, 244658, -36927, 169617, 81982, 360569, -80408, -189718, -161240, 169652, -172637, -190776, 67121, 78179, 319, 118095, 61944, 191009, 236399, -82389, -220596, -283946, -93857, 267865, -89434, -59127, 363906, 19442, -80897, -104932, 146889, 157567, 9250, 189836, 395887, 111567, 75410, -10326, 307752, 760760, 1022030, 1998738, 1343864, 1462954, 955710, 329447, 104926, 47501, 93842, 169208, -32967, 265159, 13550, -73629, -41843, -119733, 82565, 308101, 2563, 387678, -61805, 452619, 189021, 211866, 46381, 122433, 3051, 29552, 58921, -131187, -105165, 37853, 327810]
15215C27810d01889f0721B07648b93019H5008P3624p3655K02536A13213c05228
15204g8299D64699j39804a20562B70815o6614q3963R314K22077A55605a46421
15193I836c5912j32057k49263F7699N1594d6685b3085A53327J59068b31119D5017
15181A04400C1583R0251J78354A22378b27619A23124C3911K67954c3053C57583
15170F30K34428i2548B37281N0321f6309A92546k5673N998J122a19849Q767A96176
15157C0774J92996F9394J54198a9855A36761C8792h1103r1197C66907b08048c4676
15145a97299B0142M0967L34728Q0940A05931A9268a39414n7950H5019K34352A56449
15133H1353K79757j16671O8879h3514d0027A82385L3989J28867i6337F473f5629
$$ y = [327810, -401889, -60721, 207648, -293019, 85008, 158632, 84977, 287513, 113213, -305228, -78299, 464699, 324895, -120562, 270815, 204201, 120238, 129552, 351629, 155605, -146421, 9836, -35912, -167969, -417232, 67699, 119293, -46685, -23085, 153327, 312395, -231119, 45017, 104400, 31583, 121834, 300188, 122378, -227619, 123124, 33911, 301865, -33053, 357583, 630, 235058, -92548, 237281, 287602, -66309, 192546, 166873, 172871, 173993, -119849, -111082, 196176, 30774, 223770, 69394, 223592, -19855, 136761, 38792, -81103, -172300, 366907, -208048, -34676, -197299, 20142, 61109, 395837, 476777, 105931, 19268, -139414, -197364, 85019, 319371, 156449, 81353, 361110, 244439, 313318, -83514, -40027, 182385, 216374, 345241, -96337, 6473, -65629]
15121B74463b4914B06767M7693J0582q2355c59834A46445J3292p2863b13630E7728
15109B02239a1176B53575j02656J6842m8368P1262H2213L39187E9636B8339c2475
15097D73364b43904B37267B0538K28805a85771D0416a11435I6635L60473B25082
15086f4675A72903m6896L14446j84529F7315J77765n2341m7604J63053E1306d2202
15074A919c7718D91798l7666A16412R692m9402k3537K05849m5316P404H2972a74953
15061E4661K08680a26891A13542L94318a2939D2934L13141b15398E4095K0381
15051G4476P7038a16795C40354J12803j91596a2274C70065K4854j78322o6895
15041A49702M133p5904P6718j6891a55364a9249m942D60282A00889c283D68235
$$ y = [274463, -24914, 206767, 254460, 265042, 182687, -359834, 146445, 159737, 86874, -213630, 57728, 202239, -11176, 253575, 150919, 167761, 119393, 190655, 82213, 421400, 59636, 28339, -32475, 473364, -243904, 237267, 20538, 249343, -185771, 40416, -111435, 96635, 457108, 225082, -64675, 172903, 126007, 440453, 255924, 67315, 245080, 192739, 145135, 308188, 51306, -42202, 1919, -37718, 491798, 454132, 116412, 126104, 76702, 53165, 259014, 213698, 221102, 82972, -174953, 54661, 263341, -126891, 113542, 507860, -12939, 42934, 356075, -215398, 54095, 74476, 151514, -116795, 340354, 453157, 261561, -12274, 370065, 394919, 216597, 149702, 153835, 77931, 154649, 137758, -155364, -19249, -24191, 460282, 100889, -3283, 468235]
15029e5848A2466J80198P9209A05372L0162Q4736F4444a01186C25525K27886k40385
15018C13026j17146K61924A25459J54057F2729K81376q2116j24016M91831B42995
15007H3895J59282E6768L88962A35079a75181B04344J89108A66065J26413R1536
14997C84014g2388p067F8466P8289K4686Q7920R3021c2274B54793j19510J7637
14986A52920J43994C7421a57942D72671A73783K2159l0400J94959P4106H4384
14975C78424j00642J04794A69930l6006o6197L92886A67967J01267J89890j55267
14965C03857a05986B42583P2619A27107E3189J21389K38758k04002m832Q5376
14955B89878N3296P4160J9723O1676r1546A27579K21646A52487J16796j14392
$$ y = [-55848, 12466, 192664, 271873, 105372, 135534, 220270, 64444, -101186, 325525, 553411, 313026, 195880, 457804, 125459, 279516, 62729, 344105, 261989, 137973, 629804, 242995, 83895, 243177, 56768, 445730, 135079, -175181, 204344, 393452, 166065, 292478, 384014, -72388, -79455, 68466, 146755, 171441, 259361, 352382, -32274, 254793, 135283, 152920, 296914, 37421, -157942, 472671, 173783, 195942, 165542, 360501, 434607, 84384, 378424, 277782, 382576, 169930, 133924, 67727, 460613, 167967, 269234, 459124, 303857, -105986, 242583, 315202, 127107, 53189, 174578, 413336, 209334, 204502, 289878, 343174, 417334, 437057, 498733, 407187, 127579, 349225, 152487, 269283, 154891]
14945A54891A8674K98652J25844K12576C20340j9295j02508N4722J0942J86260
14935D50461B09568a39732B26451Q7348J93818A07565A9667O735L59219N7511
14925D43132k4650j25497M20947f269D11615p0551k9037K50104A85890M68644
14915F54534B92709J70178B12426j1189J66051P3898R5654A31905L37533k261
14905D67177j15167H6570K15258J38143K89372k74847j63685G8635L47073k2579
14895D03129K0785j7116f038B76169N9100p0762J21883R3811A6196K17643K10563
14884D44402j54436J78590J96140A83736K2788K54556j73535o7130J50647A79863
14873E21883b60764D09311J21555k55610J90791L4620A35682J17991J18998R3265
$$ y = [154891, 18674, 317326, 443170, 655746, 320340, 301045, 198537, 253259, 264201, 450461, 209568, -139732, 226451, 313799, 507617, 107565, 19667, 26402, 385621, 443132, 418482, 292985, 713932, -6269, 411615, 341064, 312027, 562131, 185890, 654534, 292709, 462887, 212426, 201237, 367288, 441186, 536840, 131905, 469438, 467177, 352010, 86570, 301828, 439971, 729343, 454496, 290811, 78635, 425708, 403129, 423914, 406798, -6038, 276169, 335269, 264507, 386390, 480201, 16196, 233839, 444402, 289966, 468556, 664696, 183736, 206524, 461080, 287545, 220415, 371062, 179863, 521883, -260764, 409311, 530866, 275256, 466047, 500667, 135682, 253673, 372671, 465936]
14863D65936A89279K92633K10192j29863j96039J4049q9879j4335L10132p3754
14853E12415A46243K79509N61J16076L6140A91096K77814k31806L28667j67212
14843C98559K92904j45557J67102j6146k56275B04555J78643K80502j05729B45096
14832B53313L52406k80943J54212j61620k2850J66625J47447k37770N533K22968
14822E99321j41315j66600J99410k5863Q9729A92971N27219J21291B85025j3420
14812B71605j5603N34261q4892j07742J18450j60878J22149j33294q5163q8032
14802C70861k02K24743q9747R2674L8576j31538j00201K68472j47597K9231o4467
14791D90805j08457J45972o3648l3245L72961k13030k5506j15222J98133k66413
$$ y = [465936, 189279, 481912, 692104, 562241, 366202, 380251, 290372, 276037, 586169, 512415, 146243, 425752, 426313, 542389, 578529, 191096, 468910, 237104, 565771, 398559, 691463, 545906, 713008, 696862, 440587, 204555, 383198, 663700, 557971, 245096, 253313, 605719, 324776, 478988, 317368, 294518, 461143, 608590, 370820, 376353, 599321, 458006, 291406, 490816, 464953, 554682, 192971, 720190, 841481, 285025, 271605, 256002, 790263, 705371, 597629, 716079, 555201, 677350, 544056, 458893, 370861, 370659, 595402, 505655, 598329, 636905, 505367, 405166, 673638, 526041, 555272, 490805, 382348, 528320, 464672, 431427, 804388, 591358, 565852, 450630, 648763, 382350]
14781C82350J51885K71405I0374K13134L20064B24153M07798J77498C69320L66956
14771G36276k0174n3435j83087K44490k9850M39720E65878L4214J83424J20679
14761I04195q2588k0335O5190j92770j32983K67322k04876K31729k13738p0838
14751E50308M68522k93701n7634J09874j54228J46603j49160K71654l58276M49089
14741I83051k27570m2053J88374l69400J68795J92663k97295J20614R4415k6551
14731G85043m0001J75995k83770k9554K2797j03290K18655K07556J6457l4546
14721I35342k23073N6259N9396j45533L09082k53752l0546J70575K3588l13827
14711E87511M14770k95820K36626k37928K57591p9147J63934L6064k99772Q3257
$$ y = [382350, 534235, 805640, 90374, 303508, 623572, 224153, 631951, 809449, 369320, 736276, 716102, 662667, 479580, 724070, 694220, 1133940, 565878, 600092, 783516, 904195, 821607, 801272, 866462, 673692, 540709, 808031, 603155, 834884, 621146, 550308, 1018830, 725129, 667495, 777369, 623141, 769744, 620584, 892238, 533962, 983051, 755481, 713428, 901802, 532402, 701197, 893860, 596565, 717179, 811594, 785043, 745042, 921037, 637267, 607713, 630510, 527220, 745875, 953431, 969888, 935342, 712269, 768528, 827924, 682391, 991473, 737721, 707175, 877750, 901338, 587511, 1002281, 706461, 943087, 705159, 962750, 883603, 1047537, 1083601, 783829, 867086]
14701H67086O6939j22677P66212k81876m19112K06481m7475m34677N23924m58394
14691F66431Q8807L99900n34727J47103m042r5936L56057j22046j94992M55476
14681A162031m1704j84747J29896M4110k97416j83670K23728o1430R0721M71722
14671A353241m22418k69567O05078M3937J8831P061k02003k08468K14021n22352
14661F17361N77876J3106m2370m111o5903J25424j47586P3738K27587j06202J10974
14650A379894k69723K43902n07473L81496L32194l34436J17199j73563l68414
14641H01076J89625R6285L3165M84586n59434L31279k4918j70462J54851O8884
14631A404937r2405J39563k67861M98803k30981P5896K37046l53740J4774L50643
$$ y = [867086, 934025, 811348, 1577560, 1295684, 876572, 1083053, 1035578, 600901, 1124825, 666431, 755238, 1155138, 620411, 767514, 763472, 667536, 1023593, 901547, 706555, 1162031, 1120327, 935580, 1065476, 1109586, 812170, 628500, 852228, 790798, 881519, 1353241, 930823, 661256, 1266334, 1310271, 1329102, 1336163, 1134160, 925692, 1139713, 617361, 1195237, 1208343, 1165973, 1161862, 1095959, 1221383, 1073797, 1147535, 1375122, 1268920, 1379894, 1110171, 1354073, 846600, 1228096, 1560290, 1225854, 1343053, 1169490, 801076, 990701, 1086986, 1120151, 1604737, 1045303, 1376582, 1351664, 1181202, 1336053, 1404937, 1312532, 1452095, 1184234, 1683037, 1452056, 1527952, 1764998, 1411258, 1426032, 1776675]
14621A776675j08963m42835K43411k261M10660k50834L1145k33516M849J76962
14611A605293Q2027k68159K67391K0839K94313n28323Q6639K36892j29928J35802
14601A802786m442p7774L11060q5325m35793L37323j02742K2803J85315k23266
14591A729945j05634J78623O2848K20069l19992K52308l31265L73441j98868R811
14581A871286R6532K19233o3510q7984m6153R1399K20070j53887o110K07609J04437
14570B452922k43317J57018J80890K93523m15373Q0676M439K07597j47533J17014
14560B687856J32147L04011P6177J17335L25928k13014K83562J26516P00509M86257
14550E027284J111527J428108L450307R890722J9173298J1538854B2612162I569952
$$ y = [1776675, 1667712, 1224877, 1468288, 1466027, 1876687, 1625853, 1656998, 1423482, 1428331, 1605293, 1687320, 1419161, 1686552, 1707391, 2001704, 1473381, 1560020, 1796912, 1666984, 1802786, 1798344, 1720570, 2031630, 1946305, 1510512, 1847835, 1745093, 1767896, 1953211, 1729945, 1624311, 1802934, 1865782, 2085851, 1765859, 2018167, 1686902, 2060343, 1861475, 1871286, 1967818, 2187051, 2123541, 2035557, 1989404, 2080803, 2300873, 2146986, 2140876, 2348485, 2452922, 2209605, 2366623, 2547513, 2841036, 2425663, 2506339, 2510778, 2718375, 2570842, 2687856, 2820003, 3124014, 3200191, 3317526, 3643454, 3430440, 3714002, 3840518, 4541027, 5027284, 6138811, 7566919, 11017226, 20907948, 40081246, 51620100, 22612162, 9569952]
14541D632587j911492l95254k15989j34394K78456N1007J38868l35427J99294
14532B307656j50717L34464l68520J15827j44588K85960L85153k55674K69505
14523B779066l67364R5157P01687n16783L8245Q6423m13615M66432J26540l90759
14513B605029L30393O3077J37707j81679N3890J84439R9839J68184k17761j38117
14503C105001J29534j04442P8475N8866L83795l99872j05172L12651j18168O3489
14493C404157j03703J28573J99816n4153L52193k40471O7313j5141J79122j69484
14483C748222L67141R1354j22659J47824m31800L17486q6166J13939K6183J92507
14473D364031j37173J64420J91320M67624m53613j46522K15129J22733m6981k07242
$$ y = [4632587, 2721095, 2325841, 2109852, 1975458, 2253914, 2304921, 2443789, 2108362, 2307656, 2156939, 2491403, 2122883, 2238710, 2094122, 2380082, 2765235, 2509561, 2779066, 2411702, 2506859, 3208546, 2691763, 2730008, 2816431, 2402816, 2869248, 2995788, 2605029, 2935422, 2998499, 3136206, 2954527, 3008417, 3192856, 3292695, 3460879, 3243118, 3105001, 3234535, 3130093, 3208568, 3267434, 3651229, 3251357, 3146185, 3458836, 3340668, 3404157, 3300454, 3429027, 3628843, 3574690, 3926883, 3686412, 3753725, 3738584, 3917706, 3748222, 4115363, 4206717, 4084058, 4231882, 3800082, 4117568, 4031402, 4145341, 4171524, 4364031, 4226858, 4391278, 4582598, 5050222, 4596609, 4450087, 4665216, 4787949, 4740968, 4533726]
14463D533726N20742M3939p0179K66129n59320M09683J3837J22673K29764k73157
14453E237837j00099M71834J27852k33633J3559K94443N9204N4338L47323j35792
14443F136866O8340L7539o0555L90884j28614j78411L34035J6774K88083j02717
14433F802224K46847J44659m01280L80967M64936l84679J23152J56704J76367
14424G709897L61452m22854P29616l24910L87464j09544J83447P5443M15254J94311
14414I199576l63534L96273K02251r5414R7200K58254K70649m04558L26847O03971
14404A0491515l39372M63104M6006K12427K35120K83522O0347J92547L4539P59539
14394A2439294k19516o9296N29992J08675j13040K48339L30291J79981P06284
$$ y = [4533726, 5054468, 5098407, 5028228, 5294357, 4735037, 5144720, 5158557, 5281230, 5510994, 5237837, 5137738, 5609572, 5737424, 5503791, 5517350, 5811793, 5870997, 5925335, 6272658, 6136866, 6205206, 6242745, 6182190, 6573074, 6444460, 6266049, 6600084, 6616858, 6904941, 6802224, 7049071, 7193730, 6792450, 7173417, 7638353, 7253674, 7376826, 7533530, 7709897, 8071349, 7648495, 8378111, 8053201, 8440665, 8331121, 8514568, 8590011, 9005265, 9199576, 8836042, 9232315, 9434566, 9339152, 9436352, 9694606, 9965255, 9560697, 9887544, 10491515, 10152143, 10615247, 10661253, 10873680, 11108800, 11392322, 11452669, 11645216, 11679755, 12439294, 12219778, 12150482, 12680474, 12789149, 12676109, 12924448, 13254739, 13434720, 14141004]
14385A4141004P7896N33213j61687L63354J63386J74243N93996N22410j05971
14376A6301844P41386k2183M57908N40565K43864K76785L990M72722P23467K92338
14366B0032686K15297R6931Q13822O28787O66868J48812O19198L41672M10564
14357B3974637O81573O84101N84033O06343N13169P60023N61388P77836O92054
14348B9835157N72922R32431Q48849O92177J027510Q24921P07143J559130O33126
14339C7633366J034046O48970J267054J407427R03202J250055J359369J494235
14331D6997724J385689J485059J466173J661447J754580J500274K042594J958474
14323F0252014K211104J846836K576208K321977K625375K476868K901498K870383
$$ y = [14141004, 14218900, 14752113, 14590426, 14953780, 15117166, 15291409, 15885405, 16407815, 16301844, 17043230, 17021047, 17478955, 18019520, 18263384, 18540169, 18544159, 19016881, 19740348, 20032686, 20247983, 20344914, 21158736, 21787523, 22454391, 22603203, 23222401, 23564073, 23974637, 24656210, 25340311, 25924344, 26530687, 27043856, 27803879, 28365267, 29143103, 29835157, 30408079, 31340510, 32189359, 32881536, 33909046, 34733967, 35441110, 37000240, 37633366, 38667412, 39316382, 40583436, 41990863, 42894065, 44144120, 45503489, 46997724, 48383413, 49868472, 51334645, 52996092, 54750672, 56250946, 58293540, 60252014, 62463118, 64309954, 66886162, 69208139, 71833514, 74310382, 77211880, 80082263]
14315H0082263K599365L508804L714594L012002L722521M053178M078450M905159
14307A09676336M349875N120232N415744N145138O193198O233189O541342O959118
14299A55634172P632530P690180Q035191Q800117R303321R664344J0090003J1201956
14291B28051814J0906145J2091273J2377558J2639808J3782710J3758834J4389020
14284C17997162J4684981J4788662J4991852J4970916J4682691J4673251J3814139
14277D20603654J2809753J2194435J1142430R057232P447568M327929m16506j841036
14269D75325459N44945j511814n633952p857705r175771j1327789j2366478j3797627
14261D14199268j5038636j5573074j5647288j5749429j5820764j5513752j5065762
$$ y = [80082263, 82681628, 86190432, 89905026, 92917028, 96639549, 100692727, 104771177, 109676336, 114026211, 119146443, 124562187, 129707325, 135900523, 142133712, 148675054, 155634172, 163266702, 170956882, 178992073, 187792190, 197095511, 206759855, 216849858, 228051814, 238957959, 251049232, 263426790, 276066598, 289849308, 303608142, 317997162, 332682143, 347470805, 362462657, 377433573, 392116264, 406789515, 420603654, 433413407, 445607842, 456750272, 465807504, 473255072, 477583001, 477166495, 475325459, 475870404, 474358590, 468724638, 460866933, 451691162, 440363373, 427996895, 414199268, 399160632, 383587558, 367940270, 352190841, 336370077, 320856325, 305790563]
14254C05790563j3457982j4206962j3727911j2859209j2394568j2086969j0838514
14247B16218448j0412699j0251523r423220q068401q592868p917926p633966o898015
14239A47019830o732258n895896n611345n881095n409263m740708m549229m403235
14231A03796801l542575m114531l812648l728559l690199k601790l180873l115037
14223G6010589k643941k675748k256287k239069k225574k331135k038151k228823
14215E7371861j491986j472662j278524j921016j626934j791566j529600j148211
14207D5111362k41730j518176j817714j133807r32950j208842r79973n05066q97470
14198C5875634j444213j101699o27168q36563n87016q03448n65286r25413r73225
$$ y = [305790563, 292332581, 278125619, 264397708, 251538499, 239143931, 227056962, 216218448, 205805749, 195554226, 186131006, 178062605, 169469737, 161551811, 153917845, 147019830, 140287572, 134391676, 128780331, 122899236, 117489973, 112749265, 108200036, 103796801, 100254226, 96139695, 92327047, 88598488, 84908289, 82306499, 79125626, 76010589, 73366648, 70690900, 68434613, 66195544, 63969970, 61638835, 59600684, 57371861, 55879875, 54407213, 53128689, 51207673, 49580739, 47789173, 46259573, 45111362, 44869632, 43351456, 41533742, 40399935, 39466985, 38258143, 37278170, 36773104, 35875634, 34431421, 33329722, 32702554, 31865991, 31278975, 30475527, 29910241, 28984828, 28011603]
14189B8011603k18139r49136n39621l34342o66779q99632m71491o97286k24803
14180B3010374l87959m61736l68362m43180n89660n26802l77089k32172m68471
14171A9154943l75472n07420P5427n49044l52452m73860k65004j77054m66989
14162A6063075Q714m01767j31047k91407j35353p67908l14114o5717n6472k7619
14152A3880385n82740J11753l42333l74635j96477k71586k03533j47704n4482
14143A1818648j33884k82244m47274K19720q0069m06135M5249j70829J41166q20441
14133I883907j74669J82022k55203k03787J9706n2983l90563j17713l59775L87002
14123H917944l86986K64514o91418L96344l41605k72692j58612M4008L25349m93618
$$ y = [28011603, 27793464, 26844328, 26304707, 25970365, 25303586, 24403954, 23932463, 23235177, 23010374, 22622415, 22160679, 21792317, 21349137, 20759477, 20232675, 19855586, 19623414, 19154943, 18779471, 18272051, 18347478, 17798434, 17445982, 16972122, 16707118, 16530064, 16063075, 16071789, 15670022, 15538975, 15247568, 15112215, 14344307, 14030193, 13964476, 13908004, 13880385, 13297645, 13409398, 13067065, 12692430, 12495953, 12224367, 12020834, 11873130, 11818648, 11684764, 11402520, 10955246, 11174966, 11094897, 10688762, 10734011, 10563182, 10704348, 9883907, 9709238, 9891260, 9636057, 9432270, 9451976, 9398993, 9008430, 8890717, 8530942, 8917944, 8530958, 8795472, 8104054, 8500398, 8158793, 7886101, 7727489, 7771497, 8096846, 7603228]
14113G603228J08474k79988j36129j27182J2852l65475N02942o11359j05428r0455
14103F511480K23492l70584L0404J09176Q8533k31672M2014m13984M13433n33817
14093E868475j50344M49210m90771J92367k26530j7526k80996k20854K73593j82598
14083E214026O0794j10984k37835K17770O2405k03253j17176j90351J41675j68599
14073D668472Q1514J77143j77458k32131K06520L6323n29299k8755N76197q7452
14063D691074j12127k81095L16073l92470J95354m1500k69700k7982K1223j9159
14053D079691k08502l13436N17K98217J29298n87315L79561j09390n710j20249
14043C542682K3817j27842L35255l93567j4675J05684l58466K25299k5489j55445
$$ y = [7603228, 7711702, 7431714, 7295585, 7168403, 7181255, 6815780, 7318722, 6707363, 6601935, 6511480, 6734972, 6364388, 6394792, 6503968, 6592501, 6360829, 6402843, 5988859, 6402292, 5868475, 5718131, 6167341, 5676570, 5868937, 5642407, 5624881, 5343885, 5123031, 5396624, 5214026, 5274820, 5163836, 4926001, 5143771, 5206176, 5002923, 4885747, 4695396, 4837071, 4668472, 4749986, 4927129, 4749671, 4517540, 4724060, 4760383, 4231084, 4202329, 4778526, 4691074, 4578947, 4297852, 4613925, 4221455, 4416809, 4375309, 4105609, 4077627, 4098850, 4079691, 3871189, 3557753, 3558270, 3856487, 3985785, 3398470, 3778031, 3668641, 3662931, 3542682, 3566499, 3438657, 3773912, 3380345, 3365670, 3471354, 3112888, 3338187, 3312698, 3157253]
14033C157253J92126j54622o0259K6001L25393l15664k38909K86381m00340J41115
14023B958475K17325l82755K41132Q1390L4678j67786k20556O8902k98169L2138
14013B564774k79292J00879O29785m67982p9432J50676r630p5325K95198p10276
14003B119375M05107j21132o4524l07290L37327j48050o5366M4798n77908L25109
13993A947446L14789N8600N4262O16721P52257J954400P868317J8763235K0734146
13984E3064173k5467161A3366487n381570k305397o51947o75432m04303o12639
13976C335199K18890l88215k47359n5444K29654l87041L1941j12555j30259R1451
13966B586262o4668j04349J20736k52619K3053k41062K60384l58829N35366o08142
$$ y = [3157253, 3349379, 3194757, 3134498, 3160499, 3485892, 3170228, 2931319, 3217700, 2817360, 2958475, 3175800, 2793045, 3034177, 3115567, 3150245, 2982459, 2761903, 2830805, 2532636, 2564774, 2285482, 2386361, 3016146, 2548164, 2468732, 2619408, 2609778, 2534453, 2829651, 2119375, 2524482, 2403350, 2338826, 2031536, 2368863, 2220813, 2155447, 2200245, 1622337, 1947446, 2262235, 2320835, 2375097, 2991818, 3744075, 5698475, 13566792, 32330027, 53064173, 27597012, 13366487, 7984917, 5679520, 5027573, 4352141, 3947838, 3335199, 3554089, 3165874, 2918515, 2863071, 3092725, 2705684, 2737625, 2625070, 2494811, 2586262, 2521594, 2417245, 2537981, 2285362, 2308415, 2067353, 2327737, 1968908, 2504274, 1896132]
13956A896132J88082N1491m44266M26219Q2885Q6883j76468k94230k46340O05848
13946B176236k10510r8482Q5736j22245J5636K66359n72609L82434o6607k20886
13936A635062J46871k42277L44806J060N9291m59814N20982l45010L57591k54513
13926A764049j44715j68257J46410J34879k21926Q8949O3798K72000k64735n8616
13916A611836l82470L92951L9430N8442j51567k76443L62105j58119k37971L77859
13906A636053K7966j9477j37767p7581j52921J96740L51591l10129j4399L6241
13896A536317k42607q0278L81218n17799J10590K70510j30128j03513M56820n45925
13886A135205j48148L72785m01294L31908N8685L26742j76044j48018j597R1530
$$ y = [1896132, 2084214, 2135705, 1691439, 2117658, 2200543, 2287426, 2110958, 1816728, 1570388, 2176236, 1965726, 1867244, 1952980, 1830735, 1846371, 2112730, 1540121, 1922555, 1855948, 1635062, 1781933, 1539656, 1884462, 1885522, 1944813, 1484999, 2005981, 1660971, 2018562, 1764049, 1619334, 1451077, 1597487, 1732366, 1510440, 1599389, 1663187, 1935187, 1670452, 1611836, 1229366, 1622317, 1661747, 1720189, 1568622, 1292179, 1654284, 1496165, 1258194, 1636053, 1664019, 1644542, 1506775, 1429194, 1276273, 1473013, 1824604, 1514475, 1500076, 1536317, 1293710, 1213432, 1594650, 1076851, 1187441, 1457951, 1327823, 1224310, 1681130, 1135205, 987057, 1359842, 958548, 1290456, 1349141, 1675883, 1499839, 1351821, 1350224, 1441754]
13876A441754l08738K99849j43782j07334K11593k63908J43487k87820J47659
13867A132760k04835J19903l9291R6494P3652j47377J49224k97537L62176r7911
13857A147258k33821n4943M2210J21073P1141K3175l65296L03099K3357j14511
13847I62742L25073l92606N22760m09172J64563m2530j20198L4330L35141k91539
13837A088564l43733M93291j72292l72209O07102n7648r0325k6431j4431l05403
13827H06485p182M25329n01543K57639J2211j01228K30085j13258J93907k07167
13817I95278j54290j32964K87557k65357K43004j84323l09388O17316k61957O04952
13807A439828n27951l03869J43254K1058j08356K4614L79228m0212r9638m18425
$$ y = [1441754, 1133016, 1432865, 1289083, 1181749, 1393342, 1129434, 1272921, 985101, 1132760, 927925, 1047828, 1008537, 1105031, 1178683, 1031306, 1180530, 882993, 1245169, 1147258, 913437, 858494, 900704, 1021777, 1092918, 1116093, 750797, 1053896, 1077253, 962742, 1287815, 895209, 1417969, 1008797, 1173360, 1130830, 1010632, 1044962, 1380103, 1088564, 744831, 1238122, 1065830, 693621, 1300723, 1243075, 1152750, 1126319, 1111888, 806485, 799303, 1224632, 723089, 980728, 992939, 891711, 1121796, 1008538, 1202445, 995278, 840988, 708024, 995581, 730224, 973228, 788905, 479517, 1096833, 834876, 1439828, 911877, 608008, 751262, 772320, 663964, 688578, 1067806, 1027594, 927956, 509531]
13797E09531K86221Q6778K61249l43253J0333k28939K60213O3259o4557j80977
13787F59858l0273R2145m6174j7156j1448L02746l54354K30630J06139l31680
13777F00433L0067J68484n6045r614j24371R1149R0393o3616k34438J92902L10252
13766I95596j45530k68931j4447L91680r0685j16413C70139L98440C33637P00182
13756A033819E15489L44612k62832J19357K1258l35636J09547M52835A54309L40176
13746D94485J60010n0341j92788j42795O52550k47961C33262K04840K56070k14913
13736E79259j92334J5210M75492m04327J9218J31193j39396k07289K52308l6836
13726D92498r8237P0771N65752l25786l25678K55492j85807K31755l0249B28669
$$ y = [509531, 795752, 882530, 1143779, 800526, 810859, 581920, 842133, 905392, 840835, 659858, 629585, 721730, 675556, 658400, 646952, 949698, 595344, 825974, 932113, 600433, 630500, 798984, 742939, 733325, 608954, 700103, 790496, 726880, 492442, 685344, 995596, 850066, 581135, 566688, 958368, 867683, 751270, 370139, 768579, 333637, 1033819, 515489, 860101, 597269, 716626, 737884, 402248, 511795, 964630, 154309, 494485, 654495, 604154, 411366, 268571, 921121, 673160, 333262, 538102, 794172, 579259, 386925, 402135, 877627, 473300, 492518, 623711, 484315, 277026, 529334, 492498, 394261, 465032, 1030784, 704998, 379320, 634812, 449005, 680760, 650511, 228669]
13715F54682C08743J84118J68097k52433L96179o7755j35362k53069N03746j16511
13705G35753k75140L34481j8393j79574o6493o7919L4574q7843J69990P204j43854
13694D42786J15437o2813K75036k63034q0955Q176K86112P6801J6396k52515R1160
13683F52587q030A73812L48782o0478J7948m288K87027k10657J86522J6146k83587
13672D71227N1227m9515k2455P5031j40962J83870k18371k1351R1088M04364C83321
13660B58191o3089K921K42093J45290A82969Q1259L49797K5639J30818j48932
13650F21550P3219J33137l83102o0622q0830O1585K835J34293j91832J14304j7602
13639D06935q2626L44223B47343o4068K03179j87093M56583r0761K3920m7919
$$ y = [654682, 308743, 492861, 660958, 408525, 804704, 736949, 601587, 348518, 852264, 735753, 460613, 795094, 776701, 597127, 530634, 462715, 497289, 409446, 579436, 586640, 442786, 558223, 495410, 770446, 507412, 426457, 434633, 720745, 797546, 813942, 561427, 652587, 644557, 173812, 522594, 462116, 480064, 475776, 762803, 552146, 738668, 754814, 471227, 522454, 472939, 450484, 525515, 384553, 568423, 350052, 328701, 419789, 824153, 383321, 258191, 195102, 198023, 440116, 585406, 182969, 264228, 614025, 639664, 770482, 621550, 694769, 827906, 444804, 384182, 303352, 364937, 367772, 502065, 310233, 424537, 406935, 324309, 668532, 247343, 183275, 386454, 199361, 655944, 565183, 589103, 541184]
13629E41184k0509J36310n0863k69851J89031j90708K7326J16595o9562N4764
13619D63717D7340J96901P9120J6597j7013M99168l58131J00036H4779L33576
13609D18355m1544R0864j65116A22574J16290K67748A60758L96631B22782I2595
13598C32793P640J92738j49428K40297l09033J31178K99604k68691A45288M67370
13588F12658B50320j1820K11636p7831j47377Q3790A596N32249A85579L68529
13578E54108q3944B16620L94194k36307k2943K15507a9446C68857D305a6855C33198
13566C04759o3488R0973o8403m52q1453l2410M43258k87132L3565j851J08343
13555D45709A29337a71843D52746A87522J66005L7927J1492j33330K14407n4828
$$ y = [541184, 520675, 656985, 606122, 336271, 525302, 334594, 361920, 478515, 408953, 463717, 47340, 244241, 323361, 339958, 322945, 822113, 463982, 564018, 84779, 418355, 376811, 467675, 302559, 122574, 238864, 506612, 160758, 557389, 222782, 92595, 332793, 340433, 533171, 383743, 624040, 315007, 446185, 745789, 477098, 145288, 612658, 250320, 238500, 450136, 372305, 224928, 308718, 1596, 533845, 185579, 554108, 470164, 216620, 610814, 374507, 351564, 567071, -19446, 368857, 4305, -16855, 333198, 304759, 241271, 332244, 263841, 263389, 181936, 149526, 592784, 305652, 339217, 337366, 445709, 129337, -171843, 452746, 187522, 353527, 391454, 402946, 269616, 484023, 429195]
13545D29195N32394C40962A58008n2752J39470L4003L11313k25728A03910N5480
13535A59390J49581j0340L22797B62118j06180J40648c249B28849l1831N06150
13525G03168k50519j48737G4447M7051M5118K30124j09722K68714k33295J61097
13515D83534K3009A42961J57360A40181M9216Q3896Q5560j01422J76544p5054
13505C58921m903D586K83409q8971r1477M01450A28812K56549j52546J9562K43503
13494D95880B36579M8368a29192e347B22824P0207K8551D366L72290K68859j41166
13483E04349p2290j70987p7288J4874K62152K14097A36497J60580k5286K81260
13473E53051j87391q218N4774j28885C1358g2993A76630R2902J25641m7903j6994
$$ y = [429195, 961589, 340962, 158008, 105256, 244726, 278729, 590042, 364314, 103910, 159390, 308971, 298631, 621428, 262118, 155938, 296586, -3249, 228849, 197018, 703168, 452649, 303912, 74447, 121498, 166616, 396740, 287018, 555732, 322437, 483534, 506543, 142961, 300321, 140181, 189397, 273293, 358853, 257431, 433975, 358921, 354018, 4586, 287995, 199024, 107547, 508997, 128812, 385361, 232815, 252377, 495880, 236579, 284947, -129192, -5347, 222824, 293031, 321582, 4366, 376656, 645515, 504349, 432059, 261072, 183784, 198658, 460810, 674907, 136497, 297077, 271791, 553051, 365660, 357442, 412216, 283331, 31358, -72993, 176630, 269532, 395173, 347270, 330276]
13462C30276A21590J00586J06750R522n8630J04988H2254K77119o537L0312l9954
13451C43194l5297N5747K27977f4005A70567p7486L30723J91199B3152J44614
13441A67766D0098J3741J72335e7578J3669C5594b08265C6316M58214A44420a9452
13429B88866J1768F8526J88588o9816i8466q0267A35180L91919B11714B0091a6861
13417A54869K28768G957O1677J07014B0857L28563A56176J51392J4210a63299
13406G7451J50566R8132I8422J60068D4365M7610L10198I7580B8117M6905J12347
13395A87369m557n8086a38030c5767B10898Q8561b15866B05294J36454a65568
13384b7193D94386A95937r5523m187M5254m4701b5903Q279B14836J52732A78833
$$ y = [330276, 121590, 222176, 328926, 338448, 279818, 384806, 82254, 359373, 352836, 383148, 343194, 307897, 363644, 591621, -64005, 170567, 93081, 423804, 615003, 23152, 167766, 40098, 53839, 226174, -57578, -43909, 35594, -208265, 36316, 494530, 144420, -19452, 288866, 300634, 68526, 257114, 187298, -98466, -178733, 135180, 527099, 211714, 20091, -16861, 154869, 383637, 7957, 69634, 176648, 20857, 349420, 156176, 307568, 321778, -163299, 77451, 228017, 326149, 98422, 258490, 44365, 91975, 402173, 97580, 28117, 75022, 187369, 182812, 124726, -138030, -35767, 210898, 299459, -215866, 205294, 341748, -165568, -27193, 494386, 195937, 100414, 96227, 141481, 96780, -25903, -17624, 214836, 367568, 178833]
13372E1884J47207K33011J8891j44701A10190K1403a01542C06184j29953J13347
13362B89578p6355K73873k14768J35961Q9604j04699b971I4457K00381J48123
13352D42961j06878d0151A71131k3139J45910j03888O7828M4089j46872M19762
13342E74821D6605K63231N5967K8633H2623J04912B1774K80900D4863K01892l8572
13331B08183O0184J44477e2954A51442F4639L23257A49909N512K57782A10375
13320h6362A73021d1755B10451k7101o7681J86894A6864J27525h0907F9739J14700
13309A84439P5617j4561K32639B0484M3355J95364g1778A01221L90004H1732L90556
13298D72288p7890a79258C87233r6134o6603p801a62766B16659a17189B09104
$$ y = [51884, 199091, 432102, 450993, 306292, 110190, 131593, -101542, 306184, 176231, 289578, 213223, 487096, 272328, 408289, 497893, 393194, -2971, 94457, 294838, 442961, 336083, -40151, 171131, 147992, 293902, 190014, 257842, 301931, 155059, 574821, 46605, 309836, 365803, 394436, 82623, 187535, 21774, 302674, 44863, 246755, 208183, 268367, 412844, -52954, 151442, 64639, 387896, 149909, 155421, 413203, 110375, -86362, 173021, -41755, 210451, 183350, 115669, 302563, 16864, 144389, -80907, 69739, 184439, 260056, 245495, 478134, 20484, 63839, 259203, -71778, 101221, 491225, 81732, 472288, 394398, -179258, 387233, 291099, 224496, 216695, -162766, 216659, -117189, 209104]
13287B67144G8428K62078A18167h0889A83718J00115d3412A391L07756r3953b794
13275C01137c1120B98711J41640A27040J53653j30984l4481J87572b508k53690
13265b56198C93212b56739h0171A71547b34643B07980J76026A65519J43972b3245
13254D61136h6802B71153H804a0374C80752a13006B38845R1839h4195D67660F9573
13242A58597a58657B09529n8234a59325A14712P0561J73824j45375j6065K8455
13232B26112C9843J60341j8052J30324K06791A22089G953k913a18751F9217J51130
13221B20347p4688l5218h0771C0866Q2401J14191b9958C74645R3647B23424b24768
13209a44453B63413i7059B23891m1171o0128P0028L14001k45056F3443c01260
$$ y = [267144, 78428, 340506, 118167, -80889, 183718, 283833, -43412, 1391, 309147, 215194, -2794, 301137, -31120, 298711, 440351, 127040, 280693, 149709, 115228, 302800, -2508, -256198, 393212, -256739, -80171, 171547, -234643, 207980, 384006, 165519, 309491, -23245, 461136, -86802, 271153, 8804, -10374, 380752, -113006, 238845, 330684, -84195, 467660, 69573, 158597, -158657, 209529, 151295, -159325, 114712, 185273, 359097, 213722, 197657, 226112, 39843, 200184, 182132, 312456, 519247, 122089, 7953, 5040, -118751, 69217, 220347, 145659, 110441, -80771, 30866, 113267, 227458, -29958, 374645, 468292, 223424, -224768, -144453, 263413, -97059, 223891, 182720, 122592, 192620, 506621, 261565, 63443, -301260]
13198A35829E5916L40270a04236d4177F4926d3350A37000K4821A7626M8137J09095
13187A74858L2511o3183e9655j02427P2971A06030h4699L2534A41328M8535o5053
13176A24810j2346A556J74618l6072p126P9273d0430C11366a11076A54110K95490
13165D49600j44349a96230L9185D26496I2325c37469h0949A74567G5658J20566
13155A96224c65213A98434q9318d1936j37718A28593k6183Q2564r080k6035E1662
13143i7462B77115E7701L5489c77192B83336J661j35218c7865B5460a50732A36716
13131b22992C47870a35654B89158H2156j1178e2642A79695J38971A13687J66250
13121B79937I4252i9234A48389N5743o9030a9628B02297C7602J4746A2079Q7636
$$ y = [135829, 55916, 396186, -104236, -44177, 64926, -43350, 137000, 161821, 17626, 65763, 174858, 207369, 144186, -59655, -162082, -89111, 106030, -84699, -52165, 141328, 189863, 124810, 112464, 1556, 176174, 140102, 132976, 212249, -40430, 311366, -111076, 154110, 449600, 305251, -196230, -157045, 426496, 92325, -337469, -80949, 174567, 75658, 196224, -365213, 198434, 109116, -41936, -179654, 128593, 102410, 184974, 175894, 149859, 51662, -97462, 277115, 57701, 93190, -377192, 283336, 284997, 149779, -37865, 25460, -150732, 136716, -222992, 347870, -135654, 289158, 82156, 70978, -52642, 179695, 318666, 113687, 279937, 94252, -99234, 148389, 204132, 135102, -19628, 202297, 37602, 52348, 12079, 99715]
13110I9715b05977F9713N686J39554Q596a6083k66113J30274A31919a18542k40509
13099c59051A53710a42632F9702h171l9202H3125L4982K82706j77272A9500b56970
13087e4894A05384B7992J93640b1228C322J22708J29007H9589K04736k8615b41792
13075A00399k3115j7265i3696c9041k85560B35645I1857l6938L74749H3537J53424
13064B36961n6387a1470j74424J6678C09282j23663R9221P5621a5037I4673b19709
13052A99121M4321a36300D12619a19309C47929b89339C67311G8886a951A20944
13041b3619B59565D0463a12233E06212A15361a1620j50009B38118p0999K19493
13031C86612D4960J47493A2882K12510K7896j06813C2537P3462Q1570c4006D41937
$$ y = [99715, -205977, 69713, 75399, 214953, 223549, -16083, -282196, -151922, 131919, -118542, -359051, 153710, -142632, 69702, -8171, -47373, 83125, 118107, 400813, 223541, 19500, -256970, -54894, 105384, 27992, 221632, -21228, 3322, 126030, 255037, 89589, 294325, 265710, -241792, 100399, 77284, 60019, -93696, -39041, -324601, 235645, 91857, 54919, 429668, 83537, 236961, 180574, -11470, -185894, -169216, 309282, 185619, 284840, 360461, -15037, 94673, -219709, 199121, 243442, -136300, 412619, -119309, 347929, -289339, 367311, 78886, -1951, 120944, -23619, 259565, 40463, -112233, 506212, 115361, -11620, -161629, 238118, 167119, 386612, 44960, 192453, 12882, 225392, 253288, 146475, 32537, 105999, 187569, -34006, 441937]
13019A19467N6588a3986F0083L52343A56536m9144e5439B79693p1547G1717k2493
13008D9224J58781K7189P6196j08406i0330A50808K14920b1245A59977n3585O3461
12997A69853K73h3262G2461f86A56808G4593R5565Q5385A27437a58132B7501f6550
12984I9622K913a4947B63593q9219p5575a03865k57397A87119a34376B48929a68411
12972a27772L0879C79270j03260a42121B97912E0221a72946d7224l5915F7007
12961A22955J71289a99186J7971F147K6571c8778D723Q3861J18471a25492j06730
12950b32222L693A21502m6340c1223B86496j4340c57521i6779A84317K54162G416
12938c9849j4349J9000A82171b3074C1984k21K77508d0326G127f7125l0388j29578
$$ y = [119467, 176055, -13986, 60083, 412426, 156536, 107392, -55439, 279693, 208146, 71717, 49224, 208005, 235194, 311390, 202984, -90330, 150808, 365728, -21245, 159977, 106392, 169853, 170126, -83262, 72461, -686, 156808, 74593, 170158, 255543, 127437, -158132, 27501, -66550, 99622, 102535, -14947, 263593, 174374, 98799, -103865, -361262, 187119, -134376, 248929, -168411, -127772, -96893, 379270, 276010, -142121, 297912, 50221, -172946, -47224, -83139, 67007, 122955, 294244, -199186, -181215, 6147, 32718, -38778, 4723, 88584, 207055, -125492, -232222, -228529, 121502, 75162, -31223, 286496, 272156, -357521, -96779, 184317, 438479, 7416, -39849, -54198, -35198, 182171, -23074, 31984, 31763, 309271, -40326, 7127, -67125, -97513, -227091]
12926b27091C85537c9173A17291J5257C5080b543A34936g7590k57989a40720G0798
12914b88180B7329a03415j27294b0236G2124K7957c82520B69160A13585l0754
12904H2831R6526g9569k4097D68785a7659A30937J0014n1114J45835j16473J4980
12893A34179J03976a35523j0101C4576a74654k21947D00193A17702K8717J3023
12883A59442E0732K61512b33703f6087A2007K18386k9232a96498E86238k86088
12873C00150a8317l39794f0244J2491K1762B66616a75837A73648q4397d19658
12862a85223c2141B68944b47689I0758k7525f0766D00286f8593I6056b41151E6973
12850A2140N18858G7223b74865f885B6591J2480L3220K80486B5825K87526b2672
$$ y = [-227091, 385537, -39173, 117291, 132548, 35080, -2543, 134936, -77590, -335579, -140720, 70798, -288180, 27329, -103415, -230709, -20236, 72124, 100081, -382520, 269160, 113585, 82831, 179357, -79569, -103666, 468785, -17659, 130937, 140951, 89837, 235672, 119199, 134179, 238155, -135523, -145624, 34576, -174654, -396601, 400193, 117702, 146419, 159442, 50732, 312244, -233703, -66087, 12007, 230393, 201161, -196498, 586238, 300150, -18317, -358111, -60244, -47753, -25991, 266616, -175837, 173648, 89251, -419658, -185223, -32141, 268944, -247689, 90758, 63233, -60766, 400286, -68593, 96056, -241151, 56973, 12140, 530998, 77223, -274865, -6885, 26591, 39071, 72291, 352777, 25825, 313351, -22672]
12838b60106D22697b29513A44251b27488h9007B09585a8108A07164a11714j0284
12828a21998j82262A75794f2339o4150B85896d7396A68148E9455b50134f5083
12817D6069J565J57908B6278i4398A54739B7648d5959B07802m7439C9163a36267
12805a03969M0620k90959A39165i1965J1400C99672j92432J23022C2185P1775
12795A03960J7130J7395I695d03325g5478k14247a0793l48626e5137N094C2764
12783B83189e964l6294A49685A2074c21956A45344g8008r9449a5280j74092B21008
12771a30447B02478K78158D9545d6122j03383f906p4165B80918c0952j27846C24298
12759F7479J02231a61003N3138E2059h6980B13L94441a42611B2805M9745l3681
$$ y = [-260106, 422697, -229513, 144251, -227488, -89007, 209585, -18108, 107164, -111714, -121998, -304260, 175794, -62339, -126489, 285896, -47396, 168148, 59455, -250134, -65083, 46069, 47634, 205542, 26278, -94398, 154739, 27648, -45959, 207802, 160363, 39163, -136267, -103969, -63349, -354308, 139165, -91965, -80565, 399672, 207240, 330262, 32185, 103960, 121090, 138485, 9695, -403325, -75478, -289725, -10793, -359419, -55137, -50043, 32764, 283189, -5964, -42258, 149685, 12074, -321956, 145344, -78008, -177457, -15280, -189372, 221008, -130447, 202478, 480636, 49545, -46122, -149505, -6906, -81071, 280918, -30952, -158798, 324298, 67479, 169710, -161003, -107865, 52059, -86980, 213, 394654, -142611, 22805, 72550, 38869]
12748C8869J21678c69201B75889g6037m8224A88294O7981F6904K41973r7198K27706
12737D39385I4267Q6694q2502J14203i4995d2714B48054h7218A95143b2238k72967
12726b95205H1607c30782E4270a41937C65131a30102K4190o051B03074c41160
12715F3812K5789N1693k9008a62233d0758r4254C19700j19218E5232K12357N7529
12704C25118A40229K1346P7387J24180f1191C62603A60397m2803n4100c897A01004
12692B30031F1369M8822f763A26944M126a13688A7798a21677D9556N0379c90656
12680D49185j97318A18845a4181B50931j04742b8341B6411f2967A42150K25874
12670C68024a05164G3078h1614k697B40757I7310b1226D1061J89193a10925C5840
$$ y = [38869, 160547, -369201, 275889, -76037, -124261, 188294, 256275, 66904, 308877, 211679, 439385, 94267, 180961, 98459, 212662, -94995, -42714, 248054, -87218, 195143, -22238, -295205, 81607, -330782, 54270, -141937, 365131, -130102, -105912, -111963, 203074, -341160, 63812, 89601, 141294, 112286, -162233, -40758, -135012, 319700, 200482, 55232, 267589, 325118, 140229, 161575, 238962, 363142, -61191, 362603, 160397, 117594, 63494, -3897, 101004, 230031, 61369, 110191, -6763, 126944, 131070, -113688, 17798, -121677, 49556, 99935, -390656, 449185, 251867, 118845, -14181, 250931, 146189, -28341, 26411, -62967, 142150, 368024, -105164, 73078, -81614, -84311, 240757, 97310, -21226, 41061, 230254, -110925, 35840]
12658c7119A25245d3506B35444k1137j03920L0155J92269m0721a9344k1556C68567
12646b7532k14040A81346a24377H8822K7187k2034K00086M9701C2862a87025c0612
12634C62848A15766J47827A02368f5E5544M37645B34415M3710c1468l3425A76336
12622A42647K13788A61731b03308D6839a35261j19575G4073L4897J1166k1922
12612I8214M6684J26750o8239j00540B9999O3378K03088E2825Q2207a2964j21640
12601a34604o4677B8719J77963K89329b43346j9983h7815B61318j12578L7811
12591A86551C2550M4181L22704b13513G394J20460d99822G6473b58807A58876
12580g1940A73352a48700k73327I7823J3700n5613a41340F5043L1491O1404a1670
$$ y = [-37119, 125245, -43506, 235444, 214307, 110387, 140542, 332811, 292090, -19344, -40900, 368567, -27532, -241572, 181346, -124377, 88822, 116009, 93975, 294061, 343762, 32862, -187025, -30612, 362848, 115766, 263593, 102368, -65, 55544, 493189, 234415, 278125, -31468, -64893, 176336, 142647, 356435, 161731, -203308, 46839, -135261, -254836, 74073, 108970, 120136, 98214, 144898, 271648, 203409, 102869, 29999, 93377, 296465, 52825, 135032, -12964, -134604, -199281, 28719, 206682, 496011, -243346, -263329, -87815, 261318, 148740, 186551, 32550, 76731, 399435, -213513, 7394, 127854, -499822, 76473, -258807, 158876, -71940, 173352, -148700, -422027, 97823, 111523, 55910, -141340, 65043, 96534, 157938, -11670]
12568g4293b1967j31801A08772b81765A62139C9865N9439R7479M2386A14778n1771
12557F3007O0992h4016A9182K84020n1517i8949A23596b08785b0250A92423A7195
12545A8871a8953j59292D56921E1993k5512a20261k62666D95550F4570a78581
12534d6808k24928J08512M4508m75507I1820a29342B06497F2737a2157C91147
12523F53370k71190I7796J74788a62471A23487a95967N2914M4101q9837q2554
12513b71343e9166K1206A770J19001f8663K8693C2457J76480f2833A13593i2570
12501B2685i749k113A76911R3087n0898a32497A43294b00531E7928p467a97799
12489b6446j79536B65509a02237A29385a79165A685P5835a04243A64835a01292
$$ y = [-74293, -21967, -153768, 108772, -281765, 162139, 39865, 99304, 196783, 239169, 114778, 63007, 123999, -84016, 19182, 303202, 251685, -98949, 123596, -208785, -20250, 192423, 17195, 18871, -18953, -178245, 456921, 51993, 26481, -120261, -382927, 495550, 64570, -178581, -46808, -271736, -163224, -118716, -594223, 91820, -129342, 206497, 62737, -12157, 391147, 653370, 382180, 97796, 272584, -162471, 123487, -195967, -143053, -98952, -188789, -271343, -59166, -37960, 1770, 120771, -68663, -39970, 32457, 208937, -62833, 113593, -92570, 22685, -9749, -11862, 176911, 269998, 219100, -132497, 143294, -200531, 57928, 50461, -197799, -26446, -205982, 265509, -102237, 129385, -179165, 1685, 77520, -104243, 164835, -101292]
12478c92999d1465A29875b38465B44246c533j88220A94445c13797I2966b07383
12467B20627a3089o1002G1940e9574j11739D06046a15518B2796a9764D4905O8002
12456A12907a15918B367K23252c20489A68632c0237B14277a23222K0810l2475
12446a34887N8655K8991B38735E1672b1348A01521g8989A96906b37060G8383b78648
12434B1350a42187k0547C42289J1778B2178j0336b05205A35825g8045p0355I893
12422A3803L3813h2081A2611J95608K3048m5639e9948A42200c54148i3129B29899
12410c6504r1145A28600J05081e5174j36664h8479A95057C4263O0951a01604B15379
12398b24859L7521C30255b33527j26619a04776j3490N087A44870b2712A22083
$$ y = [-392999, -41465, 129875, -238465, 244246, -3533, -191753, 194445, -313797, 92966, -207383, 220627, -13089, -74091, 71940, -59574, -171313, 406046, -115518, 22796, -19764, 44905, 112907, -115918, 2367, 225619, -320489, 168632, -30237, 214277, -123222, -102412, -134887, -76232, -47241, 238735, 51672, -21348, 101521, -78989, 196906, -237060, 78383, -278648, 21350, -142187, -162734, 342289, 354067, 22178, 11842, -205205, 135825, -78045, -148400, 9893, 13803, 47616, -82081, 12611, 208219, 231267, 185628, -59948, 142200, -354148, -93129, 229899, -36504, -127649, 128600, 233681, -55174, -191838, -88479, 195057, 34263, 95214, -101604, 215379, -224859, -187338, 330255, -233527, -360146, -104776, -118266, -113179, 144870, -22712, 122083]
12387e5899J2837C79614d4932n38696a9869j10662A24309j8398R4912d3101Q686
12376c4415I1171P1513j6314c82571r619C40816A19459a34141J5140l89658A00097
12364A22544a48651O7358j5349E1160b92591D18675c36747F8112j6073K1047J74182
12353B47268A08400a08413k47162c5483k69930B9324J67471q7482O8961a13711
12342D1679N6330a53129J2444A78812D9373N2243J26434b75581A61090a10630
12331A01757l7798a40988l9043G4988g8405j23788B27523A00439D5173i8591a068
12319a2443G2201a78069A06712J35477I439e5024l08910i7621C46802a73841B1231
12307b8025A08459J12649k4433b29972A851J47464a58542C0659N645L02047H4249
$$ y = [-55899, -43062, 379614, -44932, -583628, -19869, -130531, 124309, 105911, 200823, -43101, -34415, 91171, 162684, 146370, -382571, -392190, 340816, 119459, -134141, -119001, -508659, 100097, 122544, -148651, -81293, -96642, 51160, -292591, 418675, -336747, 68112, 52039, 73086, 247268, 108400, -108413, -355575, -35483, -305413, 29324, 196795, 109313, 178274, -113711, 41679, 98009, -153129, -140685, 178812, 49373, 101616, 228050, -275581, 161090, -110630, 101757, 63959, -140988, -180031, 74988, -78405, -202193, 227523, 100439, 45173, -98591, -1068, -12443, 72201, -178069, 106712, 242189, 9439, -55024, -363934, -97621, 346802, -173841, 21231, -28025, 108459, 221108, 196675, -229972, 1851, 149315, -158542, 30659, 36304, 338351, 84249]
12295D24610j94168p1924b6809G2148b42747C47142B1797K01327B414d7625A71365
12283I9100a06640c5142B03887a18061d7584B50316j13452C9481A5876J64358
12273A80234j850C8232h2926K0301j17297h8060G249f4674K6552E6839b5559j34312
12261a59871B88553B8288b05258M4486I6632h1731n9386K9438r5680B1355R3381
12250A14736k3439J88478K5975a6682D72211d4144j73767A95724m5862K45992
12240C95854a22602G8519L8376m4222a20161B51562c504A19561L3655J28886n9685
12229B22417K56207A74449R0131a45226C30247A61749a73496B63589A11173K14670
12219C25843p7925j10445j5393J82089b78881D5858b23764C02079J40291J15333
$$ y = [424610, 230442, 158518, -26809, 72148, -242747, 347142, 21797, 223124, 2414, -47625, 171365, 99100, -106640, -35142, 203887, -118061, -47584, 250316, 136864, 39481, 15876, 180234, 178384, 38232, -82926, -62625, -179922, -88060, 7249, -64674, -38122, 56839, -25559, -159871, 288553, 28288, -205258, -160772, 96632, -81731, -141117, -111679, -207359, 21355, 114736, 91297, 279775, 305750, -16682, 472211, -44144, -217911, 195724, 149862, 395854, -122602, 78519, 116895, 72673, -120161, 251562, -3504, 119561, 153216, 282102, 222417, 478624, 174449, 264580, -145226, 330247, 161749, -173496, 263589, 111173, 325843, 247918, 137473, 122080, 304169, -278881, 45858, -223764, 302079, 442370, 557703]
12209E57703k46284j27918a40515C73402I4276K89137P4432g0059J0452A11216
12198F8317e2457A18451J59906q3178O6963r6548J43836b34577D49850c1275o483
12187c7758D00268j25537a63270A96868a47450H7287d6169C38620G5895K94734
12177C70629g2252B59882E5772N2630J93793j15137M358M6831a16229B24608E7706
12165e7812F687g5202C29231J540G8334a41060q4808B14430B2133f5797k38785
12154c04582B37360a461D02890L8322b83104A32255a42048j94616E7093K0607
12144G7700a52627A18724c5616o2804I5945a56727j1899m1842e5888j03802K58
12133a59432f2843p874B88799A01445M785a6216k6712j37498E6805K31645f4373
$$ y = [557703, 311419, 183501, -140515, 373402, 94276, 383413, 457845, -70059, -59607, 111216, 68317, -52457, 118451, 278357, 195179, 262142, 165594, 309430, -234577, 449850, -31275, -37758, 400268, 274731, -163270, 196868, -147450, 87287, -46169, 338620, 75895, 370629, -72252, 259882, 55772, 108402, 302195, 187058, 191416, 238247, -116229, 224608, 57706, -57812, 6687, -75202, 329231, 330771, 78334, -141060, -225868, 214430, 22133, -65797, -304582, 237360, -1461, 402890, 441212, -283104, 132255, -142048, -336664, 57093, 77700, -152627, 118724, -35616, -98420, 95945, -156727, -168626, -210468, -55888, -159690, -159432, -62843, -70717, 288799, 101445, 106230, -16216, -42928, -180426, 56805, 288450, -64373]
12121A81468b9017n5036J153C5260i6256m8853F2738j7347a51744o9582D32901
12109a41683M5325A29184b25775a06624B84013b18641g3141j20326A82019O4230
12099B46249b25476D20606a36312K070I7362C4908a12836j07275F1145K09441
12089B70586j23304b64059L7182A15061G833L2305a57243B75056r9728c3041J0227
12078b2814o2722H9651Q7321K7916c2694A75739N08779R34661n1084B51136j394
12067B49742q1605L3006I2849b49773B63735A1647a36269p208A26604i8977j15829
12056b14806Q7724r6061E0022k4093Q616K12253j15190b9536j1472r5878f7792
12044a37234q5591B21769c8795m2755A65471d4169n3492q963D25509c61756A81558
$$ y = [181468, -29017, -84053, -82900, 35260, -96256, -145109, 62738, 45391, -151744, -221326, 432901, -141683, -96358, 129184, -225775, -106624, 284013, -218641, -73141, -193467, 182019, 246249, -225476, 420606, -136312, -134242, 97362, 34908, -112836, -220111, 61145, 270586, 147282, -264059, -226877, 115061, 7833, 40138, -157243, 275056, 175328, -33041, -22814, -85536, 89651, 176972, 204888, -32694, 175739, 684518, 1619179, 1568095, 251136, 249742, 168137, 201143, 92849, -249773, 263735, 11647, -136269, -143477, 126604, -98977, -214806, -127082, -223143, 50022, 25929, 34545, 246798, 131608, -29536, -41008, -136886, -67792, -137234, -222825, 221769, -38795, -81550, 165471, -44169, -97661, -106624, 425509, -361756, 181558]
12032B82052b5796k17633J08809m2146B52125O0882a23353E0371J23406r917F7428
12020A77496a7815A69231c18684Q5669a06812M0498k35492A3984J01275J8548
12010A33807J19760a50586B15903e6038j80134f3224G8487c9936H4288M058R0088
11999A78434E4446A8998a32514a8388J359m087A60075i3203B90115k9740a65742
11987h3928O969A74734h8853o5446n5364B62636B0697Q0444g8577q8794E1559
11975B05244a36891B61547i8397m2876e4518n8891C1325h3962A03969a38047L0670
11964a07377j54312i7055k7474A06015b33968a15692A6125h0186k47162M5922
11954b81426a06775A29792a91137L5127B43386A17438j404a3711B14411L996I1918
$$ y = [282052, -25796, -243429, -134620, -176766, 252125, 313007, -123353, 50371, 173777, 163860, 67428, 177496, -17815, 169231, -318684, -233015, -106812, -66314, -301806, 13984, 115259, 133807, 253567, -150586, 215903, -56038, -236172, -63224, 78487, -39936, 84288, 88346, 178434, 54446, 18998, -132514, -18388, -17029, -21116, 160075, -93203, 290115, 260375, -165742, -83928, -76959, 174734, -88853, -154299, -209663, 262636, 20697, 101141, -78577, -167371, 51559, 205244, -136891, 261547, -98397, -141273, -54518, -113409, 31325, -83962, 103969, -138047, -107377, -261689, -97055, -124529, 106015, -233968, -115692, 16125, -80186, -327348, -281426, -106775, 129792, -191137, -156010, 243386, 117438, 116034, -13711, 214411, 218407, 91918]
11942D6040A7145J78081M6345K3146A9189f4842B15902n7976a65238R336d375
11930A12929a03693j745l63605A63768j0734i0802p4682P1236A87821k9908a05977
11918g3654B06847D5248a12725a0272l2471A48205a62297A11844f1569j03507
11908a65076e7064K879C2530a39363m7349A40565b05396A76207G44a7678A23869
11896a78464A36319i5177A1580J57766a48503G5125b502k47203J12911A00315
11885b02142e3400p5075m9116g0526B08571E6330A3540J3037a51079o2010C32661
11873B79622F2269c5511k0673k19154d3790o5605c4308A5511f5916D7556j2689
11862C4867a12292C64505A39762A0121J04176D6223J5006D703J00838a06385j77589
$$ y = [46040, 17145, 195226, 241571, 264717, 19189, -64842, 215902, 157926, -165238, -155902, -4375, 112929, -103693, -105438, -469043, 163768, 153034, -90802, -165484, -94248, 187821, 157913, -105977, -73654, 206847, 45248, -112725, -10272, -42743, 148205, -162297, 111844, -61569, -165076, -57064, -54185, 32530, -139363, -186712, 140565, -205396, 176207, 744, -17678, 123869, -178464, 136319, -95177, 11580, 169346, -148503, 75125, -2502, -249705, -136794, 100315, -202142, -53400, -128475, -177591, -70526, 208571, 56330, 13540, 26577, -151079, -213089, 332661, 279622, 62269, -35511, -56184, -275338, -43790, -109395, -34308, 15511, -65916, 47556, 34867, -112292, 364505, 139762, 10121, 114297, 46223, 61229, 4703, 105541, -106385, -283974]
11851b83974d764A2834f9004l15611A86586a01815A3774a48420C74715a58738
11840b5871A74168g1164m280m2645A04340a00020A90959i8568k27871C3558M7217
11829H0775a09744j02889Q0754N9550A86942d9680j9768j06686c2633B9986a22736
11817h1841D49597D2033L60838b41322q258C493i1547F25093A1292b80391D1120
11805A74972b00186D7452J99172d3050C7518a73A64982K09403j82720i7500D4716
11793B20015o4960b51413c2005C2984K371L3345a09140H2118N2164d3763p0311
11782a14074p1963A7000J24813F2734B6789c98312A44306B0240c7874E724f2882
11770B26219c1631E119J59317i4624A1346L57525i1031H3622a25625r729M4109
$$ y = [-283974, -4764, 12834, -69004, -384615, 186586, -101815, 13774, -148420, 374715, -158738, -25871, 174168, -71164, -75444, -118089, 104340, -100020, 190959, -98568, -326439, 33558, 80775, -109744, -212633, -131879, -72329, 186942, -49680, -69448, -176134, -32633, 29986, -122736, -81841, 449597, 42033, 402871, -241322, -249580, 3493, -91547, 625093, 11292, -280391, 41120, 174972, -200186, 47452, 246624, -43050, 37518, -173, 164982, 374385, 191665, -97500, 44716, 220015, 155055, -251413, -32005, 32984, 35355, 68700, -109140, 82118, 134282, -43763, -114074, -186037, 17000, 141813, 62734, 26789, -398312, 144306, 20240, -37874, 5724, -62882, 226219, -31631, 5119, 164436, -94624, 11346, 368871, -91031, 83622, -125625, -135354, -91245]
11759i1245b5397j93946g0750C24942c84961h3056n2513B93864a94459j65866
11749c60325A37268a20084D3468a65644d6169o0845F8740h1747D8258b57379P4616
11738a82763A24348D5874a03167B01077e4433a6945k00742J05336A35457O1561
11728A97018k4379a24195A4342c5283j80382A02912a23746A01087K43550a84641
11717B39806C8762J01797a00307C63311A10581L5755k9709K08374a94546A76773
11706c09190C62238F7395B0870a00583c0846C13266b25645J1364B15171i8453
11695b92543A89194a0657B05206b13638B28386b12811c7107B11207B7383c63755
11684E2153b0559B19459f266j60293c0118o412C82675j32324k9520D8083K95732
$$ y = [-91245, -25397, -219343, -70750, 324942, -384961, -83056, -135569, 293864, -194459, -360325, 137268, -120084, 43468, -165644, -46169, -107014, 68740, -81747, 48258, -257379, -182763, 124348, 45874, -103167, 201077, -54433, -16945, -217687, -112351, 135457, 197018, 172639, -124195, 14342, -35283, -215665, 102912, -123746, 101087, 344637, -184641, 239806, 38762, 140559, -100307, 363311, 110581, 146336, 116627, 325001, -194546, 176773, -309190, 362238, 67395, 20870, -100583, -30846, 313266, -225645, -214281, 215171, -98453, -292543, 189194, -10657, 205206, -213638, 228386, -212811, -37107, 211207, 27383, -363755, 52153, -20559, 219459, -6266, -166559, -30118, -36530, 382675, 250351, 220831, 48083, 343815]
11673C43815c58430A73958H2967f7487C1802a23520F5236N3328c1602E18782a75018
11661C52513E2358a40593H6368c51622e5680O890G4744b80821G0473k4005a58473
11649G1824a51293c025F2951c4756A97532A6772L8100b63577h1288A29917A0868
11637c78364a27870N1757j81798F1363K59772j20000f9331A50496c4855B20061
11626f9381D0647a74522B878a60184B65155f3655C92928A7618b85239g5852m4202
11615a20054I3126a51716A5653J99948h0710K2471j41026B43653K2933a91697
11604D1518j4094O3444a55810f1522B56369b14376B49143a94483A94168G6270
11593A25767J10509a15447D5930J49018r4759a4178I1897g6020k19363A81588
$$ y = [343815, -358430, 173958, 82967, -67487, 31802, -123520, 65236, 118564, -31602, 518782, -175018, 352513, 52358, -140593, 86368, -351622, -55680, -48790, 74744, -280821, 70473, 46468, -158473, 71824, -151293, -3025, 62951, -34756, 197532, 16772, 54872, -263577, -81288, 129917, 10868, -378364, -127870, -76113, -257911, 61363, 321135, 201135, -69331, 150496, -34855, 220061, -69381, 40647, -174522, 2878, -160184, 265155, -63655, 392928, 17618, -285239, -75852, -120054, 93126, -151716, 15653, 215601, -80710, -58239, -199265, 243653, 266586, -191697, 41518, 27424, 90868, -155810, -61522, 256369, -214376, 249143, -194483, 194168, 76270, 125767, 236276, -115447, 45930, 194948, 100189, -14178, 91897, -76020, -295383, 181588]
11582A65755B5150Q7355b94177A75773J00358a63274b3983A36900L1716K269R6003
11571B66888a58910n6682c7268r0412C49199a17714A44309a25586B70946a22273
11560a11068d2608C01308F8539f9640C33659D0015J35633c3411A24146b88786
11549g9403C7531a9717j43572C52957d0101A72128r462C6316J09881e7196B77357
11537A91720K09849h3508n7222O2519A61301J35219n7733D1645b5668B40726M5281
11526B86007A39192a2676n2756I9767a55267A80122K18064j11730a23466G4017
11515A05657P3638J8302r6681e8783A39654C1583K00165r2576a87014A00808m6267
11504E4541L16243p6101r2664c9478A89926j6201j0045n9748N9748a3775A42791
$$ y = [165755, 25150, 112505, -294177, 175773, 276131, -163274, -23983, 136900, 168616, 170885, 266888, -158910, -215592, -37268, -127680, 349199, -117714, 144309, -125586, 270946, -122273, -111068, -42608, 301308, 68539, -69640, 333659, 40015, 175648, -33411, 124146, -288786, -79403, 37531, -19717, -163289, 352957, -40101, 172128, 162666, 36316, 146197, -57196, 277357, 191720, 401569, -83508, -140730, -78211, 161301, 296520, 238787, 41645, -25668, 240726, 286007, 139192, -12676, -65432, 99767, -155267, 180122, 398186, 286456, -123466, 74017, 105657, 179295, 197597, 100916, -58783, 139654, 31583, 231748, 139172, -187014, 100808, 54541, 370784, 294683, 202019, -39478, 189926, 173725, 163680, 103932, 163680, -13775, 142791]
11492B930b56637C16820L1178A00147J74302C2878J68285o7131J34512l3835m4174
11481A90535J4589F8943b4485A50526l5244M172C4862O0666g641A77713L13817
11470D91530A03M06368j38037A8351L45895b3466m1452m0438A83517o6299L4293
11459A51511J86165Q6922A77998C3937K09581e3850A4080D876L28413a57886h730
11447C59889D1135J3263b8065k1518A37272m0361P0412q1802e8532E271N4331
11436E9602O0295e8904m7606r2990C108J39387R3381B233M16592a53295A4107
11424c58470O1222D75021B20449j01365b55349B0408d4270q7804m0048c2212k64996
11413b97208C82516A09181a11479m6742B2456c07050A44776a04756F0313c07793
$$ y = [2930, -256637, 316820, 347998, 100147, 274449, 32878, 201163, 134032, 268544, 234709, 190535, 205124, 68943, -24485, 150526, 115282, 119454, 34862, 95528, -7641, 177713, 491530, 103, 406471, 268434, 18351, 364246, -23466, -64918, -105356, 183517, 117218, 151511, 337676, 424598, 177998, 33937, 243518, -53850, 14080, 4876, 333289, -157886, -8730, 359889, 41135, 54398, -28065, -49583, 137272, 96911, 167323, 85521, -58532, 5271, 59602, 119897, -58904, -106510, -199500, 3108, 142495, 235876, 2233, 418825, -153295, 14107, -358470, -297248, 475021, 220449, 119084, -255349, 20408, -44270, -132074, -172122, -32212, -297208, 382516, 109181, -111479, -158221, 22456, -307050, 144776, -104756, 60313, -307793]
11402B07243r6408b26456I1787a09360I6857c7739A16625g5110A28347d0040j73234
11391b13274E0898M2288a38744A88c6238B1426J2484K3444J33895a39669B2720
11379a20884K7665j62234A84215e225C0467J40986O1530K31457k26168b00600
11368a51689b4212j3615A44919C1466b25125a08098A40786J23452g4269p1060
11358a45329A32255a4571j84173E4720K3608a40432a4809j25019j39599m3784
11348c23211B89675I2770h7442A68785b1011o657B1969J37990a32324k08510A6039
11336c6345m7415j09123G633f9096B81142a42118p02E2794k2784K6246a78177
11324c13933C41256j11950J79814j45771b28607C3786A618a19168I0493M3709
$$ y = [207243, 110835, -226456, 91787, -109360, 96857, -37739, 116625, -75110, 128347, -40040, -213274, 50898, 93186, -138744, 188, -36238, 21426, 33910, 57354, 191249, -139669, 22720, -120884, -93219, -255453, 184215, -5225, 30467, 171453, 232983, 464440, 238272, -200600, -151689, -24212, -37827, 144919, 31466, -225125, -108098, 140786, 264238, -74269, -145329, 132255, -14571, -198744, 54720, 78328, -140432, -14809, -139828, -279427, -323211, 289675, 92770, -87442, 168785, -21011, -27668, 21969, 159959, -132324, -340834, 16039, -36345, -83760, -192883, 7633, -69096, 281142, -142118, -142820, 52794, 30010, 56256, -178177, -313933, 341256, 229306, 409120, 263349, -228607, 33786, 1618, -119168, 90493, 134202]
11314A34202L17644A03997d761A1253M0158K51460e7527A45085b53978J6594l8138
11303b75522J25229A57928D9231a34644O7023n017k23110a15120A93314A6595
11292E10050e3837A89185h1539A36584C1588c91624J52389B0845J92859j8276
11282A95428c2387q083j82378b3073I4728B4718P5224e4376B05439d5529O34A82908
11269a34215r3906B23058h84A8584g8756j38157b1490n8956k63015B996J00151
11258A03147a68688j17338C56412H8786h6014k5926k11536M1019M0201H2641q591
11247G4050b40380C37608i0389A04621J67826F4897J46834r8094a35520B04118
11236a82826D68h5716C25357a35518j03567A46677g5007K7427C55744F1865L9302
$$ y = [134202, 451846, 103997, -4761, 11253, 51411, 302871, -57527, 145085, -253978, -237384, -275522, -150293, 157928, 49231, -134644, -67621, -72638, -295748, -115120, 193314, 16595, 510050, -53837, 189185, -81539, 136584, 31588, -391624, -239235, 20845, 213704, 195428, -32387, -40470, -222848, -23073, 94728, 24718, 99942, -54376, 205439, -45529, -44895, 182908, -134215, -228121, 223058, -884, 18584, -78756, -216913, -21490, -80446, -343461, 2996, 103147, -168688, -286026, 356412, 88786, -86014, -111940, -323476, -282457, -242256, 82641, 74050, -240380, 337608, -90389, 104621, 272447, 64897, 211731, 113637, -135520, 204118, -182826, 468, -85716, 325357, -135518, -239085, 146677, -75007, -47580, 355744, 61865, 101167]
11225A01167j4342b62505A05959J79473i1714B33654h0673l4931D6889M7321M279
11214I8489a20149A59518a5028o8586F9801b05409j52539a26982A04163B1024
11203A40207b92941a13704Q66b0929q3502k81025a42094A1201c00539A61857C5937
11191a95105A19744l2573d81683c3589p5697H3368h4192B3168R923a37305j40404
11180b77709B50424a74558B27169c04152a08236B10994d0041l7264K9778N291
11170d2236J2747k11040B5059J56381e5495l04966J68082j75135f9549J7457r0713
11159a42805E0587J27161a46720G944g8711I7782c6726a184A93454a44883d2780
11147A4962L05537b70480B28418a29817K5825C9056a57700o8854A16387a14616
$$ y = [101167, 86825, -262505, 105959, 285432, -91714, 233654, -80673, -115604, 46889, 94210, 98489, -120149, 159518, -15028, -83614, 69801, -205409, -357948, -126982, 104163, 21024, 140207, -292941, -113704, -112838, -20929, -104431, -385456, -142094, 11201, -300539, 161857, 35937, -195105, 119744, 87171, -481683, -33589, -109286, 83368, -84192, 23168, 33091, -137305, -277709, 250424, -174558, 227169, -304152, -108236, 210994, -40041, -77305, -47527, -42236, -29489, -240529, 25059, 181440, -55495, -360461, -192379, -367514, -69549, -52092, -142805, 50587, 177748, -146720, 7944, -78711, 97782, -36726, -1184, 193454, -144883, -42780, 14962, 320499, -270480, 228418, -129817, -103992, 39056, -157700, -226554, 116387, -114616]
11136a2580j94271R9093c0647k14097K0378a01809A2333L62446A28391B6045K11767
11125B37812K00487j49461a46070A57669b80234A25650k8147D8669b80057B20173
11114B51235B8390a42993d760n1647A45126o9030P3923f9171B18842C7631b64998
11102C60997A11240J79592k9028I1659f082n7571I21532A84624N2412f4398C9739
11090b82850D7447L29212l7392G5881K22532j2404i5187C51465a03873A3764J30139
11079A43903R0482L79681r5070k09956j30654C9266a01120D31852j70237j14619
11069A46996K9177J40004J45779j64550J66562m5684A63221K10219M46922k77764
11059E42598J72331j57807L7406J48430k3956k39280K59979k86538M36886j62889
$$ y = [-12580, -206851, -107758, -30647, -244744, -224366, -101809, 12333, 374779, 128391, 26045, 237812, 438299, 288838, -146070, 157669, -280234, 125650, 97503, 48669, -280057, 220173, 251235, 28390, -142993, -4760, -56407, 145126, 76096, 150019, -69171, 218842, 37631, -264998, 360997, 111240, 290832, 261804, 91659, -6082, -63653, 921532, 184624, 237036, -64398, 39739, -282850, 47447, 376659, 339267, 75881, 298413, 286009, -95187, 351465, -103873, 13764, 143903, 234385, 614066, 518996, 309040, 178386, 39266, -101120, 431852, 261615, 146996, 176173, 316177, 461956, 297406, 463968, 418284, 163221, 373440, 820362, 542598, 714929, 557122, 594528, 742958, 719002, 479722, 739701, 453163, 890049, 727160]
11049G27160L1965J62103j30186k23168K31922l57318L94833j88982J5509K24116
11039H87954q2739K29797l62316p9829K16030l80882I2285L12089N75007j15589
11029H63792J25382j22123m12201K17154Q4201J82686j23738O3688K6153D19442
11018D14731J2038J9279J80226J02010r8160j283j05241L40159C77130K02399
11008E79529j5032k68148N00654C71729K90417R2104k12817R1850j58826R6643
10998E71100j51058N3694K7665j89455K07575M79127k58149p7110m4847K35881
10988H54423K80829j53101k60859K44290Q5470p2774j6036M94880o27371M02704
10978A232455L50825J44461l86954M73228L38021O62585j19377P2420K94942j9129
$$ y = [727160, 759125, 921228, 791042, 567874, 799796, 442478, 837311, 648329, 663838, 887954, 805215, 1035012, 672696, 592867, 808897, 428015, 92285, 404374, 979381, 863792, 989174, 867051, 454850, 672004, 756205, 938891, 815153, 878841, 904994, 419442, 414731, 426769, 446048, 626274, 728284, 630124, 628841, 523600, 863759, 377130, 579529, 564497, 296349, 797003, 371729, 662146, 754250, 541433, 633283, 474457, 571100, 420042, 473736, 501401, 311946, 519521, 998648, 740499, 663389, 618542, 854423, 1135252, 982151, 721292, 965582, 1051052, 978278, 962242, 1457122, 829751, 1232455, 1583280, 1727741, 1340787, 1814015, 2152036, 2814621, 2695244, 2767664, 3062606, 3043477]
10968C043477n38809j00648k65655k31309k26307k05716J10627J33596j35648
10959A583608M4759k7518l0012K94942n40863K63768l37131n12049j93843J20058
10949F65719k9649A68602J56252L375J4375A14417K16820K1507A20085f5637B88206
10937I2869J13711L5793H9119a30759k59920a05873F5010M30648i5227B42914
10926A07288Q9174c1888j87k86321G0584f8981F8062J96802j10868b22366R5351
10915a27015B12178a7232k47341B80349a93193A92214K17142j70811n6375a2560
10904A96739h301A30415d03564e7094i700D0554a82617G8282c97104A69264K04966
10893C74230b56239C6513L03994c5306j5843B40651D3536a8012B9167O1037f3248
$$ y = [3043477, 2504668, 2404020, 2138365, 1907056, 1680749, 1475033, 1585660, 1719256, 1583608, 1628367, 1600849, 1570837, 1865779, 1324916, 1588684, 1251553, 739504, 545661, 665719, 636070, 168602, 324854, 328229, 342604, 114417, 331237, 352744, 120085, -65637, 288206, 92869, 206580, 242373, 89119, -130759, -390679, -105873, 65010, 495658, -95227, 242914, 107288, 196462, -31888, -32075, -318396, 70584, -68981, 68062, 264864, 153996, -222366, -127015, 212178, -17232, -264573, 280349, -193193, 192214, 409356, 238545, 182170, -12560, 196739, -8301, 130415, -403564, -57094, -9700, 40554, -182617, 78282, -397104, 169264, 374230, -256239, 36513, 340507, -35306, -51149, 240651, 43536, -18012, 29167, 90204, -63248]
10881a60631p2417G1301R0453c4597o800j81554h2988A81824c5845o934a6801
10869b481I7432a37299H9125a4816H9101b7486G3379A4625g8476E1310k2400a09112
10856C89680c96110E1085a56142g4379B62693j20984A7756a51956k34284h46m27738
10845d28584C04257D1885M102b72957J27975B32824f4753j26108l792K4408k867
10834a73112C0385b65379a10935d3962j82739f3074I1575b30089d4277H2540M767
10823H7307C3778H012r00a41109D37736B1441J75589c6765j06078A7491J44961
10812A62452b31984A4382a85584k49679I3284b08747i7904k61849M5430i5378
10801C56941b28034h2172j1380m1981e4398a3377j26708n4589O0182l7530E4942
$$ y = [-160631, -233048, 71301, 161754, -34597, -41397, -222951, -82988, 181824, -35845, -42779, -16801, -2481, 97432, -137299, 89125, -14816, 89101, -27486, 73379, 14625, -78476, 51310, 28910, -109112, 389680, -396110, 51085, -156142, -74379, 262693, 141709, 17756, -151956, -386240, -846, -428584, 304257, 41885, 45987, -272957, -144982, 232824, -64753, -190861, -194653, -170245, -173112, 30385, -265379, -110935, -43962, -226701, -63074, 91575, -230089, -44277, 82540, 87307, 33778, 8012, 7112, -141109, 437736, 21441, 197030, -36765, -142843, 17491, 162452, -231984, 14382, -185584, -435263, 93284, -208747, -97904, -359753, -314323, -95378, 356941, -228034, -82172, -93552, -135533, -54398, -13377, -140085, -194674, -134492, -172022, 54942]
10789a7264j30828p8474B95885j17205b13423C213b92356A52140l3768c92206
10778A66591J020m7485b7973A26959a96502j67425a5173j90868C81913a40454
10767b02720K7814a744G5082A2024b9524G1820c4660J3760E6443b26350B19783
10755c49735e3071k20867J32898A43234A1464d6718A53455b49735L7568C45235
10744d1585j15169O5541B268a40562A67008E2971a29980A1312O8507a0027C844
10732H7444a48715I8089C5057a95859I0977B3181f9852J4486j80292A19457a99979
10720i9683a4353B30811d0920m35925a89082D4167J15622c04168f0074j89430
10710b49504A69181b29630C32543j57401c08543A62344a24364k8619Q899E9285
$$ y = [-17264, -148092, -226566, 295885, 178680, -213423, 3213, -292356, 152140, 118372, -392206, 166591, 167611, 120126, -27973, 126959, -196502, -363927, -15173, -206041, 381913, -140454, -202720, -174906, -1744, 75082, 12024, -29524, 71820, -34660, -20900, 56443, -226350, 219783, -349735, -53071, -273938, -141040, 143234, 11464, -46718, 153455, -249735, -212167, 345235, -41585, -156754, -91213, 2268, -140562, 167008, 52971, -129980, 11312, 79819, -10027, 3844, 87444, -148715, 98089, 35057, -195859, 90977, 23181, -69852, -55366, -235658, 119457, -199979, -99683, -14353, 230811, -40920, -476845, -189082, 44167, 159789, -304168, -60074, -249504, 169181, -229630, 332543, 175142, -308543, 162344, -124364, -152983, -144084, 59285]
10699c45990f150A34734c64464a37050B22276b00482m1275J00126b4480B9105
10688B86159b19969a07277A50168c73280J20350A5084L06534b87008A57656a0679
10677A6446c7643j69626J0488p9693E5407P123a65706G7849E696b09301J01656
10666a07645A9552P1530O4996b38543J08521A69895b55623F3647J45430C6056
10655d06178a72793B63798a75284A64649L6019E5120b56131i379D6196a49012
10644i3532r3966c2109G624b53554C1109b50471P98f6439p054B9118P7002b90682
10631a46179A17747J31218F3731a28890j79766F3954b75410B57863j21769b43501
10620I9152L0359F4663J7441B9712R4001a86459F1661a30853B00756B8574K41204
$$ y = [-345990, -6150, 134734, -364464, -137050, 222276, -200482, -241757, -141631, -24480, 29105, 286159, -219969, -107277, 150168, -373280, -252930, 15084, 321618, -287008, 157656, -10679, 16446, -37643, -207269, -196781, -276474, 55407, 62530, -165706, 77849, 5696, -209301, -107645, 19552, 91082, 156078, -238543, -130022, 169895, -255623, 63647, 209077, 36056, -406178, -172793, 263798, -175284, 164649, 200668, 55120, -256131, -9379, 46196, -149012, -93532, -187498, -32109, 7624, -253554, 31109, -250471, -249673, -66439, -73493, 29118, 106120, -290682, -146179, 117747, 248965, 63731, -128890, -308656, 63954, -275410, 257863, 136094, -243501, 99152, 129511, 64663, 82104, 29712, 123713, -186459, 61661, -130853, 200756, 28574, 269778]
10609B69778n9778a97458B86321c6457A19772b00635A17245O7866a46414k2981
10599a69395E1327a41586m291j89586i1454a1170a67l75456a06931J3668p1036
10588a64299f2487A38447d3788M327A30d3909B22845a9321h180B49252J33388
10577C82640i9942d8814r2547q825N0672j19159A02178a85070P4846j12422b2892
10565d3491A14333C5327f6440j598B37250E2994b05414h6510A75000b50636g5655
10553a56942r5141b2286l96744B75091B3881P0514j3685R0493G1833C2787D286
10541a09485j41942f4282r9242l3555a7377j21291G2226b52452A04307c9400r4710
10530a34110k67734a27912A42419a04353k01167J40766A17479a5176j69660A2504
$$ y = [269778, 210000, -197458, 286321, -36457, 119772, -200635, 117245, 185111, -146414, -169395, 51327, -141586, -145877, -335463, -91454, -11170, -167, -375623, -106931, -93263, -164299, -62487, 138447, -43788, -39461, 130, -43909, 222845, -19321, -8180, 249252, 382640, -99942, -48814, -141361, -150186, -99514, -218673, 102178, -185070, -110224, -222646, -22892, -43491, 114333, 35327, -66440, -68038, 237250, 52994, -205414, -86510, 175000, -250636, -75655, -156942, -252083, -22286, -419030, 275091, 23881, 94395, 80710, 171203, 71833, 32787, 4286, -109485, -251427, -64282, -163524, -197079, -17377, -138668, 72226, -252452, 104307, -39400, -134110, -401844, -127912, 142419, -104353, -305520, -164754, 117479, -15176, -184836, 12504]
10519A48284a90057A33676d0700E9523O0269n070c18361A95638e5300B746h9557
10507c46511F2143d19892f500k20722J05568N2500A99388b5112l12335g7320K8058
10496d9262j51400O6170A72321c28307G0753k7115a48213n1807K2966P7774a9658
10484D02872A37519j3837Q1410K08413A07851M68668k17302j18881k1098L9814
10474B59052j2801j08533a08730L3099L4571G7376b116j84335b398m628j51904
10463a58930j11358B73791c75509A24789a22934j37733F9955O971J28397c71195
10452b25506A64365g5749r122B14533b02303c2057r093A5807J6060a83753G7032
10440A24899a96830D2441J90206j6122a49290j7927A21471C4094J56499a30881
$$ y = [148284, -190057, 133676, -40700, 59523, 119792, 114722, -318361, 195638, -55300, 2746, -89557, -346511, 62143, -419892, -6500, -227222, -121654, -69154, 199388, -25112, -337447, -77320, -49262, -200662, -134492, 172321, -328307, 70753, 43638, -148213, -200020, -177054, -99280, -19658, 402872, 137519, 123682, 205092, 413505, 107851, 576519, 359217, 240336, 219238, 259052, 246251, 137718, -108730, -75631, -41060, 77376, -2116, -186451, -2398, -7026, -158930, -270288, 273791, -375509, 124789, -122934, -260667, 69955, 76926, 205323, -371195, -225506, 164365, -75749, -84871, 214533, -202303, -32057, -41150, 15807, 31867, -183753, 77032, 124899, -196830, 42441, 232647, 216525, -149290, -167217, 121471, 34094, 190593, -130881]
10429A3885J9227J7154i7712H5798b76402P8713R0176j26586B40036l3877c15445
10417A42629J19198g5922D45768b59002F6702h654a65q5839G4527a45287C16236
10405I5038b88708A23683l2825k9980Q6265A3637a71977Q0621D0058c3233A80467
10393E345K69412a96176A88750j576P0135e412A25597R0803A402Q5346M6969A1504
10380B85739A11472M03460A55711F463M20948H9994J77563l7512K74668H4650
10369b7154B4031L05801M87582l68948L44703G5832J13691K26302A25095j9678
10359A05417K15178A01701L68800E103L25897d2154B30675A5260P53471j85766
10349E82965q1740j98584L8095K67715j41389Q9J36476J30836A77087a58286C87398
$$ y = [13885, 33112, 50266, -97712, 85798, -276402, -197689, -107513, -234099, 240036, 206159, -315445, 142629, 261827, -75922, 445768, -259002, 66702, -8654, -165, -86004, 74527, -145287, 316236, 95038, -288708, 123683, 90858, 60878, 147143, 13637, -171977, -91356, 40058, -33233, 180467, 5345, 274757, -196176, 188750, 187174, 257309, -5412, 125597, 216400, 1402, 86748, 133717, 11504, 285739, 111472, 514932, 155711, 6463, 427411, 89994, 267557, 230045, 504713, 84650, -27154, 24031, 329832, 817414, 448466, 793169, 75832, 189523, 415825, 125095, 105417, 320595, 101701, 470501, 5103, 331000, -42154, 230675, 15260, 768731, 582965, 501225, 302641, 340736, 608451, 467062, 467151, 603627, 734463, 177087, -158286, 387398]
10337C33666C3651O4862a31375A38035L4222m3808f1928B06818a54360B75045
10326c78483B66365a10100A56645L38525F5066L51919A28476J94806R896E1016
10315b516A96203m3730E0234j1748p172a62469j7970D8460b05435l4005i7595
10303E0626b90688i2122F5340K12418a48119B52540b53357A01937R7227K33189
10293D32353j98549b8194j49692o4413D64857B8587a4946B04014l7005F7231a09617
10281d39013K07803b830l19357b472A93495a35109e8605r9480d4037A11474f0674
10269d18599B3823K00623b05446i2793l08690a41375F2623B1010J19841L52604
10259D93455Q3628k45618J57802A17479M50074f40194G3513K8047A517M8917K0710
$$ y = [333666, 33651, 98513, -131375, 138035, 172257, 128449, -61928, 206818, -154360, 275045, -378483, 266365, -110100, 156645, 495170, 65066, 416985, 128476, 323282, 333178, 51016, -2516, 196203, 152473, 50234, 38486, 31314, -162469, -180439, 48460, -205435, -239440, -97595, 50626, -290688, -92122, 65340, 277758, -148119, 252540, -253357, 101937, 199164, 432353, 233804, -28194, -177886, -242299, 464857, 28587, -14946, 204014, 167009, 67231, -109617, -439013, -231210, -2830, -322187, -2472, 193495, -135109, -58605, -158085, -44037, 111474, -60674, -418599, 23823, 224446, -205446, -92793, -401483, -141375, 62623, 21010, 140851, 493455, 577083, 331465, 489267, 117479, 567553, -640194, 73513, 101560, 1517, 50434, 71144]
10248G1144g4878k9694A16350b05213J9391g9115j06755e6917C59791h8823p2740
10237a61563C36935j36851o7921J94723j62090f4247A22135c611G3187b66516
10226a12005j28311C918d6990j04947C8242K7486a17685G0179J98137c29488a43341
10214b54712b0191C35487a158D3259e0782A00211a5879j21294m4141e8855j08517
10203a67372B4730f1758j29673N5420H6280l9230b80862i9035d1596R968q1582
10192a13210e0389o9425P045j82779J27298n1925E891a25968B7968J02008j8713
10181A11263a78450d5241n00658b08001B37037b1411B82515C496d75652J76861
10171b98791c9849G7544a58600l012A19115f6988l56957a09723B02858c49397
$$ y = [71144, -74878, -104572, 116350, -205213, -185822, -79115, -185870, -56917, 359791, -88823, -161563, 336935, 200084, 132163, 326886, 164796, -64247, 122135, -3611, 73187, -266516, -112005, -240316, 3918, -46990, -151937, 38242, 65728, -117685, 70179, 268316, -329488, -143341, -254712, -20191, 335487, -1158, 43259, -50782, 100211, -15879, -137173, -181314, -58855, -167372, 24730, -61758, -191431, -136011, 86280, 47050, -280862, -99035, -41596, -31628, -113210, -50389, -119814, -112769, -295548, -168250, -220175, 5891, -125968, 27968, 129976, 111263, -178450, -45241, -545899, -208001, 237037, -21411, 282515, 3496, -475652, -298791, -39849, 77544, -158600, -161612, 119115, -66988, -423945, -109723, 202858, -349397]
10160a76225O3203G8207L8151R6126c39038d8603A14319a28008J2321G6652J71196
10149B47848j15710d9332k40015c6587a3561j60833k7623e5494F3826J0796J1573
10138H6195P7726C9554c1450f276j45389f6855j19477O4976L2656H181N2131b88139
10125b09957B310K10568F2367d21557J13477J43161l5180r2036J06053o2840A50457
10113B25178H3374i0831b782q7139I2125f71406e3565e294B49343A4916J4185
10102B9101a14121m4079j23715i056k80581G9159f26748g5238j21259b9087a2232
10090A37612J2910b79816B21776c42594R9006g7899D9245a21869j02380f8726
10079b4133q3227G2188a12875F6703a88102M9788m7155j43424A11031N4899a16017
$$ y = [-176225, -113022, 78207, 116358, 212484, -339038, -48603, 114319, -128008, -115687, 76652, 247848, 132138, -49332, -289347, -36587, -13561, -174394, -202017, -55494, 63826, 74622, 86195, 163921, 39554, -31450, -6276, -151665, -66855, -186332, -121356, -88700, 8181, 60312, -288139, -209957, 2310, 212878, 62367, -421557, -308080, -164919, -200099, -292135, -186082, -248922, 150457, 225178, 83374, -90831, -2782, -89921, 92125, -671406, -53565, -5294, 249343, 14916, 29101, -114121, -158200, -281915, -9056, -289637, 79159, -626748, -75238, -196497, -29087, -12232, 137612, 150522, -279816, 221776, -342594, -243588, -77899, 49245, -121869, -224249, -68726, -24133, -107360, 72188, -112875, 66703, -188102, -138314, -185469, -328893, 111031, 165930, -116017]
10067g2124d234j7280A54827n3298b37247G9110a67673k46707a18992j42839h8822
10055d7770j66403D93839a44614A39326a04000A17688g8079A93922c45608B57093
10044a71215r2775g8804C02585b33207f4319b0639B44076c02104P5889B01643
10033c4715B2445M23749a44924m9009c8208m37297a91185n2676J2007B18874b55834
10021f247k47708A03005L6038f6580j40483K1625G7932b391B0959a8770j16059
10010a34829M2494l17380E6234Q4553J23970j31393c37776D2354n197P9120l1174
9999H5103a54780d1832C6593a1678j03156q1725C1189b25405j0877h5316o2738
9988a48054j51383B74943a1830j9453A03116f0657C05785b46652A13754c00207
$$ y = [-72124, -4234, -21514, 154827, 101529, -237247, 79110, -167673, -414380, -118992, -261831, -88822, -47770, -214173, 493839, -144614, 139326, -104000, 117688, -78079, 193922, -345608, 257093, -171215, -263990, -78804, 302585, -233207, -64319, -20639, 244076, -302104, -226215, 201643, -34715, 22445, 446194, -144924, -193933, -38208, -475505, -191185, -243861, -231854, 218874, -255834, -6247, -253955, 103005, 139043, -66580, -207063, -185438, 77932, -2391, 20959, -18770, -134829, -92335, -409715, 56234, 140787, 264757, 133364, -337776, 42354, 37157, 116277, 85103, -154780, -41832, 36593, -11678, -114834, -196559, 31189, -225405, -236282, -85316, -148054, -299437, 274943, -11830, -31283, 103116, -60657, 305785, -246652, 113754, -300207]
9977c84352J56279a04702p7560J7897j64013h2333p4940K3948A35385b43050A31653
9965e38201a9419A5786J03202K29855H4142J95249C3531f4301q986C8808a27159
9953c19836J55862C60908c90641A65475G3712a41967G1630J6151J54729j19742
9943A22768j9401i5202j56191I804b35143b3822A82559c41264a06682H6237a06959
9931A01852j7999a06810L2507m9664B03077A5396a79076k87477a8488l39976D6389
9919i0461C44480F5361L53327c5839j99666F2542d36010i6097n3286J1747B47770
9907C7101R1697a48074f546r6037l4934e5924k85080J50595E420J09809a9064
9895A29370f0169B08616B1924L30923D5290c2963m34504a52153b4196A67946e43707
$$ y = [-384352, -228073, -104702, -182262, -164365, -328378, -82333, -157273, -133325, 135385, -243050, 131653, -538201, -19419, 15786, 118988, 348843, 84142, 279391, 33531, -64301, -73287, 38808, -127159, -319836, -163974, 360908, -390641, 165475, 73712, -141967, 71630, 87781, 242510, 122768, 103367, -95202, -251393, 9804, -235143, -23822, 182559, -341264, -106682, 86237, -106959, 101852, 83853, -106810, -74303, -123967, 203077, 15396, -179076, -466553, -18488, -358464, 46389, -90461, 344480, 65361, 418688, -35839, -235505, 62542, -436010, -96097, -149383, -137636, 247770, 37101, 128798, -148074, -6546, -102583, -137517, -55924, -341004, -190409, 5420, 115229, -19064, 129370, -60169, 208616, 21924, 352847, 45290, -32963, -467467, -152153, -24196, 167946, -543707]
9883a6627n3823C0732g136j8286C6897J3054b49118P8811k34434a80683f9839
9871a65221d4203j16730G3539a00321n5209a2608G6679a62128l6822j45063E728
9859b33765p7183j3887H20J55571n2185g8226c2589n6050j15161j46126a38765
9847B36374L0203d37067a7315l37585a24342j6581l2410J5690B33032r4562c10109
9835c24216f455A17775D4227a72926a8206A60306A6173b32223a5298j20883j79971
9824c16152J57903G3053b62019M0271i396k40399J01770k0330I0625a44483E491
9812d13855G558f3570b6576k36942H7797c27715h6500d1191j99286n5950G1225
9800b0287p7270A02003c54535J07135G2060b88342i1804d0901j49704C65936a9167
$$ y = [-16627, -70450, 30732, -7136, -25422, 36897, 49951, -249118, -170307, -404741, -180683, -69839, -165221, -44203, -160933, 73539, -100321, -155530, -12608, 76679, -162128, -198950, -344013, 5728, -233765, -310948, -324835, 820, 156391, 104206, -78226, -32589, -88639, -203800, -349926, -138765, 236374, 266577, -437067, -17315, -354900, -124342, -140923, -173333, -157643, 233032, 138470, -310109, -324216, -6455, 117775, 44227, -172926, -18206, 160306, 16173, -232223, -15298, -136181, -316152, -158249, 73053, -262019, -221748, -9396, -249795, -148025, -168355, 90625, -144483, 5491, -413855, 7558, -63570, -26576, -263518, 87797, -327715, -86500, -41191, -240477, -296427, 71225, -20287, -97557, 102003, -354535, -247400, 72060, -288342, -91804, -40901, -190605, 365936, -19167]
9788c21417J28745j50080a21815M3354l15557C75004e7594G277a65322I2543b31740
9776E0030a6792j36705o3692J00921r3856c80j264j4507j15098f4596l20716F7116
9763H3257c67677a38475B59059Q0467f1155k2073k44598C3587a25489A41182K0539
9752A61721D9300a41260j53241Q1003B11328p9974J9121a09187m4895j11030E3105
9740c99706a05410J748K7496C76562g9612A22247b65629A64519a10077B03775
9729c6811k36143G5808i1035l7288p3442j21605b0203j25722e8755b7808H600
9717G1663a55130A89142b37561A93356G5850a42383A74490D1474c7588C30629
9706A17411b00403k30362O4509C4494c68187B0752K59286A20941n7441b43483
$$ y = [-321417, -192672, -342752, -121815, -78461, -394018, 375004, -57594, 7277, -165322, 92543, -231740, 50030, -16792, -153497, -217189, -116268, -210124, -380, -1644, -16151, -131249, -64596, -385312, 67116, 83257, -367677, -138475, 259059, 339526, -61155, -83228, -327826, 33587, -125489, 141182, 161721, 49300, -141260, -294501, -213498, 211328, 131354, 150475, -109187, -154082, -265112, 53105, -399706, -105410, -103662, -76166, 376562, -79612, 122247, -265629, 164519, -110077, 203775, -36811, -272954, 75808, -91035, -128323, -201765, -323370, -20203, -145925, -58755, -27808, 8600, 71663, -155130, 189142, -237561, 193356, 75850, -142383, 174490, 41474, -37588, 330629, 117411, -200403, -430765, -366256, 34494, -368187, 20752, 280038, 120941, 63500, -243483]
9695A26734b18627d6992j69919a8752K457E465a28368A3213J05197a00822A08669
9683A66577a74106B69284A0039K24822J11373I8070c10096C30609e5399k7521
9673h2920l8842M6575h099k09614B7949P1315i4856C6148e7969B63793a51580
9661c19393A7069b25899L8478Q2135A46861R0975a84822a5077l39259d7982j7838
9650f5820k90782E3458J6154d6837B84961a98489M7138k4479a51j22719L5954
9639h6916n5239k75495C6927a32061e8815A08855D4187c9123B72730a20634k24801
9628c45435J21409R5237A93095b04229g1209j85564A37637a85626o0442P122A43319
9616a18646A84984L7870E0026i326l3758o0295M6751F671b4249F1571M5165f0187
$$ y = [126734, -218627, -46992, -216911, -18752, -16295, 5465, -128368, 13213, 118410, -100822, 108669, 166577, -174106, 269284, 10039, 234861, 346234, 98070, -310096, 330609, -55399, -82920, -121762, -75187, -8099, -217713, 27949, 99264, -94856, 36148, -57969, 263793, -151580, -319393, 17069, -225899, -187421, -105286, 146861, 237836, -184822, -15077, -354336, -47982, -65820, -356602, 53458, 69612, -46837, 284961, -198489, -151351, -175830, -151, -122870, -86916, -142155, -417650, 36927, -132061, -58815, 108855, 44187, -39123, 272730, -120634, -345435, -224026, -128789, 193095, -204229, -71209, -256773, 137637, -185626, -246068, -238946, 143319, -118646, 184984, 222854, 50026, -9326, -43084, -103379, -56628, 6671, -24249, 61571, 106736, -60187]
9603E7928a13629p2158j9769a3283A34987b18742f7782A8523c52463A46305g2134
9591b70886H0591a30254E8475J47290f4624c2300B24343i7494J6649A30297a94474
9579a35780j7453A09385c28051J08675b9669h027j02857D0216L19008e3348A28877
9567c31835A58903c0913j59678h4203r3658L6185B3895d0406k86199a38445B46244
9555c4313k71749J24833f9957r3559R401a4190p631M473G9737A2244i3139j64039
9543b57178F4020L7614B9025L3533m577f8291j56172P1561j44896A30390j2239
9532A18151b84461R1299p5633d2090D079d31964a16272p5129j22353L3H9902b82086
9519a99436F2529f4705m7096A73398a37961A20909a05654k54880L4881J1398J42333
$$ y = [57928, -113629, -185787, -205556, -13283, 134987, -218742, -67782, 18523, -352463, 146305, -72134, -270886, 80591, -130254, 58475, 205765, -64624, -32300, 224343, -97494, -80845, 130297, -194474, -135780, -153233, 109385, -328051, -219376, -29669, -8027, -110884, 40216, 359224, -53348, 128877, -331835, 158903, -30913, -190591, -84203, -177861, -141676, 23895, -40406, -326605, -138445, 246244, -34313, -306062, -181229, -69957, -163516, -154115, -14190, -21821, -17348, 79737, 12244, -93139, -257178, 64020, 101634, 29025, 62558, 57981, -68291, -224463, -152902, -297798, 130390, 118151, -284461, -193162, -268795, -42090, 4079, -431964, -116272, -191401, -313754, -313721, 89902, -282086, -199436, 62529, -64705, -111801, 173398, -137961, 120909, -105654, -360534, -325653, -314255, -171922]
9508a71922j57013A4860f408H6799d43279i0859j17443i0978m346m1547H979b33628
9495B49312b93731a01296A60334d0446I6002a38196C2654a52989P0349A32199
9484B7092a9390j00662a5590k63155E8546d3412j32093k1873p6322L6366b7778
9472b69632m9313D61106G7932J66099a75891K5175k27938i7410k46r5079A5627
9460C96551A60139j103a76182B57012g3532C22197c49158i7726j32382a02941
9449d6980a7562k90118B1666e9034k92748L6913D83777B13061a13651j1178j23281
9438b48110j38058C5528c08501a6592j01354D386N6897B3826c00582J26702B196
9426E5873B7693a39142A32367P7767f4701l84428F7095c811k11969a8386k09741
$$ y = [-171922, -328935, 14860, -6408, 86799, -443279, -90859, -208302, -90978, -95324, -136871, 8979, -233628, 249312, -293731, -101296, 160334, -40446, 96002, -138196, 32654, -152989, -82640, 132199, 27092, -19390, -120052, -15590, -278745, 58546, -43412, -175505, -197378, -273700, -237334, -27778, -269632, -318945, 461106, 77932, 244031, -175891, -150716, -378654, -97410, -97656, -192735, 15627, 396551, 160139, 159036, -176182, 257012, -73532, 322197, -349158, -97726, -230108, -102941, -46980, -17562, -307680, 21666, -59034, -351782, -314869, 483777, 213061, -113651, -124829, -248110, -386168, 35528, -308501, -16592, -117946, 4386, 61283, 23826, -300582, -173880, 2196, 55873, 27693, -139142, 132367, 210134, -64701, -449129, 67095, -3811, -215780, -18386, -228127]
9415b28127P615h4672B65057A0130b21000o0752a01404j88748F4189b27191R7706
9404a29485A43126A3064a56014C9773a97989M1670b8821D4349f1475k04445Q5143
9393a80777C565a5110A38953c06805C677f9047m2095P747Q074D01097a74040k10727
9381c84767a53035H4732a16536m1721j65499c398j87010B9194K72187d6263A55933
9369b04884k2009O354a01773K2366o6944q402B98809a9415B57343A24207a15450
9357a60125e5046J8607l88839a59827j83120E4950e5558n9115q782F1049i4818
9345A06373c03166A35165K6177c50365C16783A15507a75227k13938Q6376J40975
9335a61814d6607C7761c1311A37723b16724O3683d2418a3874j33093c4780D7971
$$ y = [-228127, -220512, -84672, 265057, 10130, -221000, -281752, -101404, -290152, 64189, -227191, -129485, 143126, 13064, -156014, 39773, -197989, -156319, -28821, 44349, -61475, -265920, -180777, 3565, -15110, 138953, -306805, 3677, -69047, -111142, -103395, -95321, 401097, -174040, -384767, -153035, 84732, -116536, -158257, -323756, -3398, -190408, 29194, 301381, -46263, 155933, -204884, -226893, -220539, -101773, -79407, -146351, -154753, 298809, -19415, 257343, 124207, -115450, -160125, -55046, -36439, -425278, -159827, -342947, 54950, -55558, -114673, -123455, 61049, -94818, 106373, -303166, 135165, 161342, -350365, 316783, 115507, -175227, -389165, -302789, -161814, -46607, 37761, -31311, 137723, -216724, -153041, -42418, -13874, -146967, -34780, 47971]
9323A47829b18886F728J75779F1991d3175k79175l4425B7819b10665e1579n5485
9312a07064k4159o7977K3647f0843B37677E6288a05472j9562j51653F1132e1447
9300F6856J33055E8707R330O4297b1999A58953b18878j06222C62125h5365I9419
9288b14893C2242K0328a99515l40l30187a84154B7301K59366a65633f6109k2040
9277h8149o904C1950b59727h8683M2924n8292p2468a7228I9927b38977l3898B83041
9264A14189b32184M4225o2415R956A35378a86732F1829c50090e3850j00646L827
9253a50669M2600B78693H7159A1699a24861D768J1996a00835C1088d8275j59967
9242b08242A35029N6273Q0876a11904C1595h3150B72937a70672A50744b74307
$$ y = [147829, -218886, 6728, 182507, 61991, -43175, -322350, -356775, 27819, -210665, -51579, -107064, -131223, -199200, -175553, -60843, 237677, 56288, -105472, -125034, -276687, 61132, -51447, 66856, 199911, 58707, 68037, 132334, -21999, 158953, -218878, -325100, 362125, -85365, 99419, -214893, 32242, 52570, -199515, -199855, -530042, -184154, 27301, 286667, -165633, -66109, -88149, -95053, 31950, -259727, -88683, -45759, -104051, -176519, -17228, 99927, -238977, -272875, 283041, 114189, -232184, -187959, -250374, -240418, 135378, -186732, 61829, -350090, -53850, -154496, -150669, -108069, 278693, 87159, 11699, -124861, 4768, 16764, -100835, 31088, -48275, -208242, 135029, 191302, 272178, -111904, 31595, -83150, 272937, -170672, 150744, -274307]
9231b04527b5146D7939b39464A6507a04068k15968M4822a16466K7371A90815a48871
9219a1057l50264J04845a2343B60887b38982d1520j72231l130i9222j2177D4796
9207c16237I859h2082F7438d15457K1131B87800A04700f0362o5849O80q4967A58200
9194d9580C17499R2190a17190j40899B9587b24461A88778b3133l0963B7013M3021
9183G0034J23653f5332m5815L4417r2543a9285r7626j79059i0022A36145a73972
9171A65783c81404a00859k16781a52233L8351o4124A63974c9024F3028b0265B56746
9159a10965M9521A30787i1462k64193J49456a7022r1832j25605B3992K43537L3689
9148C01218a58933e3954j50816R0886Q059n7886c458B676e6563k84206A20660
$$ y = [-204527, -25146, 47939, -239464, 16507, -104068, -320036, -275214, -116466, -89095, 190815, -148871, -11057, -361321, -256476, -12343, 260887, -238982, -41520, -213751, -216881, -99222, -111399, 44796, -316237, 9859, -82082, 67438, -415457, -394326, 287800, 104700, -60362, -126211, -125531, -210498, 158200, -49580, 317499, 409689, -117190, -258089, 29587, -224461, 188778, -23133, -54096, 27013, 70034, 193687, -65332, -111147, -76730, -169273, -19285, -116911, -295970, -90022, 136145, -173972, 165783, -381404, -100859, -317640, -152233, -113882, -178006, 163974, -39024, 63028, -20265, 256746, -110965, -61444, 130787, -91462, -355655, -206199, -17022, -108854, -234459, 23992, 267529, 301218, -158933, -53954, -204770, -113884, -105825, -163711, -3458, 2676, -56563, -340769, 120660]
9136a01672n1241d8193D1234P5396c04390k0310a11932a6178B19877i7273r8051
9125a95324a6868b954q4661C06106a16833l07840a78583M2345B46299g0279q3769
9114a54048D6915a8611A53770b63519J00825j40954e03A72647a9471A23930K3233
9103A47163F4151b47674f996j98062A31696B007i4094n0229B3349G187c71288
9091A00171b20386H751R126b0867A86959c5706p9087j44684N6834k454E7472R8044
9079A55516a33862N5867m9093A58011L5710a6731o8686A54630i3697a3920A20260
9067a46304M3769k23891F0195f8581q7097a7319D5158c9150l9031j05441B74c13312
9054a21660L2172j92402j20741a07612a5637A1868a40907J5421b6575A00837f5557
$$ y = [-101672, -152913, -48193, 41234, 116630, -304390, -324700, -111932, -16178, 219877, -97273, -195324, -16868, -2954, -87615, 306106, -116833, -424673, -178583, -136238, 246299, -70279, -154048, 46915, -18611, 153770, -263519, -162694, -303648, -503, 172647, -19471, 123930, 147163, 64151, -247674, -6996, -205058, 131696, 2007, -94094, -144323, 23349, 7187, -371288, 100171, -220386, 8751, 17877, -20867, 186959, -35706, -114793, -259477, -202643, -205097, 57472, 155516, -133862, -77995, -127088, 158011, 193721, -16731, -85417, 154630, -93697, -13920, 120260, -146304, -102535, -326426, 60195, -68581, -155678, -17319, 45158, -39150, -78181, -183622, 274, -313312, -121660, -89488, -281890, -402631, -107612, -15637, 11868, -140907, -125486, -26575, 100837, -65557]
9042B30156c69385c3173C8464b20140o3322K9296G0038b94420B75279b16118L836
9031b12282L5515P9404C03565e9431D8604J05739D0963r43L45418i7511n0897
9020a48408A44958p1416b62772B82080d20132H0719a2384k56356J34367l5815
9010a70188j08704g3651k02553m5833c3776p863l8313F6599a26659j82892k6676
8999c36227a20532C8220J26269b31817A91484h7162E2766a01586m7465j46113
8989b95164d419A31739e8449J409j3343j70955a19132j47600b4368j72798j53357
8978c50523J28320m7585E4302L7243b25870P8632m032a7713C35121a6306q5366
8967a01672A61936b51023B46589C6171J00152a15126j17455j38549i012A12428
$$ y = [230156, -369385, -33173, 38464, -220140, -283462, -254166, 70038, -294420, 275279, -216118, -212282, -176767, -97363, 303565, -59431, 48604, 154343, 40963, 40020, 385438, -97511, -148408, 144958, 73542, -262772, 282080, -420132, 80719, -12384, -268740, -134373, -170188, -278892, -73651, -276204, -322037, -33776, -41639, -79952, 66599, -126659, -309551, -336227, -120532, 38220, 164489, -231817, 191484, -87162, 52766, -101586, -149051, -295164, -4419, 131739, -58449, -57040, -70383, -241338, -119132, -266732, -24368, -197166, -350523, -222203, -269788, 54302, 91545, -225870, -147238, -151270, -17713, 335121, -16306, -101672, 161936, -251023, 246589, 36171, 136323, -115126, -232581, -371130, -9012, 112428]
8956E6883Q5975d50731G0340d4407D9261j9646J50353a13217j99079B68359A27324
8944a78435n9537C55777a35407r4470d5361D40502E2568f1815A58474N17070A77195
8932a63659m7086Q9737j24619B52355K56025d9680G52699k61818P53086L317097
8922D561064R358106K977034C436687A097680j13436D19996R9430k53492n3058
8913B12876F3905a16482d676j9419B80393O34187A7530J60428B640Q6675M2466
8902A31781P4781p4178b5558j59044A62893C6622j4839J04093D5426f5549n4233
$$ y = [56883, 142858, -450731, 70340, -44407, 49261, 29615, 179968, -113217, -312296, 268359, 127324, -178435, -237972, 355777, -135407, -229877, -45361, 440502, 52568, -61815, 158474, 675544, 177195, -163659, -210745, -121008, -245627, 252355, 508380, -49680, 752699, 490881, 1243967, 4561064, 13919170, 16896204, 3436687, 1097680, 984244, 419996, 519426, 265934, 212876, 63905, -116482, -4676, -24095, 280393, 914580, 17530, 177958, 2640, 89315, 131781, 206562, 132384, -25558, -184602, 162893, 36622, 21783, 125876, 45426, -65549, -119782]
$$ [...]
##END NTUPLES=NMR SPECTRUM
##END=
