
##TITLE=UV1223_M6_1234-1212_20_7231249_iH2Jjf6jFW
##JCAMPDX= 6.0         $$ Bruker NMR JCAMP-DX V2.0
##DATA TYPE= NMR SPECTRUM
##DATA CLASS= NTUPLES
##ORIGIN= BRUKER
##OWNER= Administrator
$$ 1.72 TOPSPIN		Version 2.1
$$ 2013-01-24 01:10:53.746 -0500  Administrator@X
$$ Compression mode = diff/dup
##.OBSERVE FREQUENCY= 400.02188249412
##.OBSERVE NUCLEUS= ^1H
##.ACQUISITION MODE= SIMULTANEOUS (DQD)
##.ACQUISITION SCHEME= undefined
##.AVERAGES= 8
##.DIGITISER RES= 22
##SPECTROMETER/DATA SYSTEM= spect
##.PULSE SEQUENCE= zg30
##.SOLVENT NAME= COFFEE_meoh
##.SHIFT REFERENCE= INTERNAL, COFFEE_meoh, 1, 14.98509
##AUDIT TRAIL= $$ (NUMBER, WHEN, WHO, WHERE, PROCESS, VERSION, WHAT)
$$ ##TITLE= Audit trail, TOPSPIN		Version 2.1
$$ ##JCAMPDX= 5.01
$$ ##ORIGIN= Bruker BioSpin GmbH
$$ ##OWNER= Administrator
$$ $$ E:\/data/COFFEE/nmr/UV1223_M6_1234-1212_20_7231249_iH2Jjf6jFW/30/pdata/1/auditp.txt
$$ ##AUDIT TRAIL=  $$ (NUMBER, WHEN, WHO, WHERE, PROCESS, VERSION, WHAT)
(   1,<2013-01-24 01:10:45.342 -0500>,<Administrator>,<X>,<go>,<TOPSPIN 2.1>,
      <created by zg
	started at 2013-01-24 01:09:39.327 -0500,
	POWCHK enabled, PULCHK disabled,
       configuration hash MD5:
       86 BA 57 50 F2 9D 5C 9B 26 00 A9 28 5F 66 2E 89
       data hash MD5: 64K
       04 F8 26 6F 7E 1E 22 B1 6B 1F E3 ED C4 23 7A 44>)
(   2,<2013-01-24 01:10:48.421 -0500>,<Administrator>,<X>,<proc1d>,<TOPSPIN 2.1>,
      <Start of raw data processing
       efp LB = 0 FT_mod = 6 PKNL = 1 PHC0 = 0 PHC1 = 0 SI = 32K 
       data hash MD5: 32K
       D1 35 21 67 D3 8D 97 C0 A9 2D 38 BC 31 22 1C F4>)
(   3,<2013-01-24 01:10:48.874 -0500>,<Administrator>,<X>,<proc1d>,<TOPSPIN 2.1>,
      <pk PHC0 = 100.2338 PHC1 = 0 
       data hash MD5: 32K
       F9 3B EF 1C BD DE 3B 0A 9C 1B F2 4D AE 70 76 1C>)
(   4,<2013-01-24 01:10:49.092 -0500>,<Administrator>,<X>,<proc1d>,<TOPSPIN 2.1>,
      <abs ABSG = 1 
       data hash MD5: 32K
       30 3A E1 04 76 88 FD 8A F3 06 9E 0A CA 2B 4D CE>)
(   5,<2013-01-24 01:10:49.249 -0500>,<Administrator>,<X>,<proc1d>,<TOPSPIN 2.1>,
      <abs ABSG = 2 
       data hash MD5: 32K
       B6 79 E6 4C 4F F4 61 D4 58 C0 9A 31 D6 E4 F7 B0>)
(   6,<2013-01-24 01:10:49.389 -0500>,<Administrator>,<X>,<proc1d>,<TOPSPIN 2.1>,
      <abs ABSG = 3 
       data hash MD5: 32K
       25 AA 8F 69 CD 6B CF 64 6A 74 28 5E 21 23 F9 9A>)
(   7,<2013-01-24 01:10:49.546 -0500>,<Administrator>,<X>,<proc1d>,<TOPSPIN 2.1>,
      <abs ABSG = 4 
       data hash MD5: 32K
       68 47 99 2F A6 AC 40 6F 48 82 A5 C4 5A 29 84 73>)
(   8,<2013-01-24 01:10:49.686 -0500>,<Administrator>,<X>,<proc1d>,<TOPSPIN 2.1>,
      <abs ABSG = 5 
       data hash MD5: 32K
       66 87 E3 CC D2 F5 D9 E8 2E E0 14 15 8D 5E 96 A6>)
$$ ##END=
$$ 
$$ $$ hash MD5
$$ $$ 05 0B 9C 1B DD DA F0 BD 97 C6 34 2B 97 B9 65 49
##$RELAX= 
##$RELAX= 
##$RELAX= 
##$RELAX= 
##$RELAX= 
##$RELAX= 
##$RELAX= 
$$ Bruker specific parameters
$$ --------------------------
##$DU= <E:\>
##$EXPNO= 30
$$ [...]
150 150 150 150 150 150 150 150
##$TP07= 0
##$TPNAME0= <>
##$TPNAME1= <>
##$TPNAME2= <>
##$TPNAME3= <>
##$TPNAME4= <>
##$TPNAME5= <>
##$TPNAME6= <>
##$TPNAME7= <>
##$TPOAL= (0..7)
0.5 0.5 0.5 0.5 0.5 0.5 0.5 0.5
##$TPOFFS= (0..7)
0 0 0 0 0 0 0 0
##$TUNHIN= 0
##$TUNHOUT= 0
##$TUNXOUT= 0
##$USERA1= <user>
##$USERA2= <user>
##$USERA3= <user>
##$USERA4= <user>
##$USERA5= <user>
##$V9= 5
##$VALIST= <valist>
##$VCLIST= <CCCCCCCCCCCCCCC>
##$VD= 0
##$VDLIST= <DDDDDDDDDDDDDDD>
##$VPLIST= <PPPPPPPPPPPPPPP>
##$VTLIST= <TTTTTTTTTTTTTTT>
##$WBST= 1024
##$WBSW= 4
##$XGAIN= (0..3)
0 0 0 0
##$XL= 0
##$YL= 0
##$YMAX_a= 678573
##$YMIN_a= -578666
##$ZGOPTNS= <>
##$ZL1= 120
##$ZL2= 120
##$ZL3= 120
##$ZL4= 120
##$ABSF1= 14.98509
##$ABSF2= -5.573092
##$ABSG= 5
##$ABSL= 3
##$ALPHA= 0
##$AQORDER= 0
##$ASSFAC= 0
##$ASSFACI= 0
##$ASSFACX= 0
##$ASSWID= 0
##$AUNMP= <proc_prof1d_extract_pilot.lims>
##$AXLEFT= 0
##$AXNAME= <>
##$AXNUC= <1H>
##$AXRIGHT= 0
##$AXTYPE= 0
##$AXUNIT= <>
##$AZFE= 0.1
##$AZFW= 0.1
##$BCFW= 0
##$BC_mod= 0
##$BYTORDP= 0
##$COROFFS= 0
##$CY= 15
##$DATMOD= 1
##$DC= 0
##$DFILT= <>
##$DTYPP= 0
##$F1P= 0
##$F2P= 0
##$FCOR= 0.5
##$FTSIZE= 32768
##$FT_mod= 6
##$GAMMA= 0
##$GB= 0
##$INTBC= 1
##$INTSCL= 1
##$ISEN= 128
##$LB= 0
##$LEV0= 0
##$LPBIN= 0
##$MAXI= 10000
##$MC2= 0
##$MEAN= 0
##$ME_mod= 0
##$MI= 0
##$NCOEF= 0
##$NC_proc= -8
##$NLEV= 6
##$NOISF1= 0
##$NOISF2= 0
##$NSP= 0
##$NTH_PI= 0
##$NZP= 0
##$OFFSET= 14.98509
##$PC= 1
##$PHC0= 100.2338
##$PHC1= 0
##$PH_mod= 1
##$PKNL= yes
##$PPARMOD= 0
##$PPDIAG= 0
##$PPIPTYP= 0
##$PPMPNUM= 2147483647
##$PPRESOL= 1
##$PSCAL= 4
##$PSIGN= 0
##$PYNMP= <proc.py>
##$REVERSE= no
##$SF= 400.02
##$SI= 32768
##$SIGF1= 0
##$SIGF2= 0
##$SINO= 400
##$SIOLD= 32768
##$SPECTYP= <>
##$SREGLST= <1H.CDCl3>
##$SSB= 0
##$STSI= 32768
##$STSR= 0
##$SW_p= 8223.68421052631
##$SYMM= 0
##$S_DEV= 0
##$TDeff= 65536
##$TDoff= 0
##$TI= <>
##$TILT= no
##$TM1= 0
##$TM2= 0
##$TOPLEV= 0
##$USERP1= <user>
##$USERP2= <user>
##$USERP3= <user>
##$USERP4= <user>
##$USERP5= <user>
##$WDW= 1
##$XDIM= 32768
##$YMAX_p= 476544242
##$YMIN_p= -805912
##$CURPLOT= <Network HP LaserJet P1505>
##$CURPRIN= <$Network HP LaserJet P1505>
##$DFORMAT= <normdp>
##$LAYOUT= <+/1D_H.xwp>
##$LFORMAT= <normlp>
##$PFORMAT= <normpl>
##$SURQMSG= 1
$$ End of Bruker specific parameters
$$ ---------------------------------
##NTUPLES= NMR SPECTRUM
##VAR_NAME=  FREQUENCY,     SPECTRUM/REAL,   SPECTRUM/IMAG
##SYMBOL=    X,             R,               I
##VAR_TYPE=  INDEPENDENT,   DEPENDENT,       DEPENDENT
##VAR_FORM=  AFFN,          ASDF,            ASDF
##VAR_DIM=   32768,         32768,           32768
##UNITS=     HZ,            ARBITRARY UNITS, ARBITRARY UNITS
##FACTOR=    0.250966925370066, 1,           1
##FIRST=     8223.43324360094, -74751,       -234243
##LAST=      0,             102861,          -32814
##MIN=       0,             -805912,         0
##MAX=       8223.43324360094, 476544242,    0
$$ Real data points
##PAGE= N=1
##DATA TABLE= (X++(R..R)), XYDATA
$$ [...]
19507c14908J44610L5068K894j2838K1786c9135G1754l2198b30884E861i6867
$$ -314908 -170298 -135230 -132336 -145174 -123388 -39135 71754 39556 -230884 5861 -96867
19495d12604B6368c3824l94770h6538B2881K36172q5267k4702D4376a27507e8630
$$ -412604 26368 -33824 -428594 -86538 22881 259053 173786 149084 44376 -127507 -58630
19483A79448c590H533J0654K37748a86707r0377a19219l95713I5175a02430j36131
$$ 179448 -3590 8533 19187 256935 -186707 -277084 -119219 -514932 95175 -102430 -238561
19472b38561j40778a39011j14472p6916M2369F2953c7243r8957r4752d2346O944
$$ -238561 -379339 -139011 -253483 -330399 -288030 62953 -37243 -136200 -230952 -42346 -35402
19461c5402B85660f5633A8642a35078j00467J2704A92681a85998k9328B4687R8040
$$ -35402 285660 -65633 18642 -135078 -235545 -222841 192681 -185998 -215326 24687 122727
19450A22727a52723n4575r4224A00103a2781A84378g6112p3671l3188f1381A79904
$$ 122727 -152723 -207298 -301522 100103 -12781 184378 -76112 -149783 -182971 -61381 179904
19438B19416b41027a15311q3035A55297j7242q151C5934J1848J45727o8616F2429
$$ 219416 -241027 -115311 -198346 155297 138055 129904 35934 47782 193509 124893 62429
19426b74062J4582D1498a86870A94797b3631I0617a63996A25936g3599k92795
$$ -274062 -259480 41498 -186870 194797 -23631 90617 -163996 125936 -73599 -366394
19416c66394a09757D3668J68009b5753j12771j14547g410A3074b33973g8436H1074
$$ -366394 -109757 43668 211677 -25753 -138524 -253071 -7410 13074 -233973 -78436 81074
19404d41534J41066Q2377N196O4598A78182O6093b2684E007a8952B09562c66935
$$ -441534 -300468 -218091 -212895 -148297 178182 244275 -22684 5007 -18952 209562 -366935
19392d7877k48050j9833J0755a8797l5350j14144N5627C7877J40929c3011k43817
$$ -47877 -295927 -315760 -305005 -18797 -54147 -168291 -112664 37877 178806 -33011 -276828
19381b76828j08180n0a33305e3743B1723c13092J49621g0554A73603a21905l5248
$$ -276828 -385008 -385058 -133305 -53743 21723 -313092 -163471 -70554 173603 -121905 -157153
19370a57153k6742A78524a73195m6889J02543C4289a27926B3151i1452M507B93594
$$ -157153 -183895 178524 -173195 -220084 -117541 34289 -127926 23151 -91452 -86945 293594
19358A08578A3266d9650p6413j22535f7416Q247p3507B26690h0940j74134J21893
$$ 108578 13266 -49650 -126063 -248598 -67416 -59169 -132676 226690 -80940 -255074 -133181
19347a33181J7704D2665a34195n932a4559p0591K1550j13548k3895R1957b7271
$$ -133181 -115477 42665 -134195 -140127 -14559 -85150 -63600 -177148 -201043 -109086 -27271
19335B92647h2062d908l5261j2337n1621K1107j58332e0210a1213n469B05913
$$ 292647 -82062 -4908 -40169 -52506 -104127 -83020 -241352 -50210 -11213 -16682 205913
19323a05070K1939B62724b68064A71312f6781J8649p2532q7151O3580L8122n5106
$$ -105070 -83131 262724 -268064 171312 -66781 -48132 -120664 -207815 -144235 -106113 -161219
19312a61219e5264p4749k63996a06588c3320H4902j2118b26022I8102b02604D2011
$$ -161219 -55264 -130013 -394009 -106588 -33320 84902 72784 -226022 98102 -202604 42011
19300i5173p0501A49296J04869d6869j91971G1937b90255C24187d8418A8023a56709
$$ -95173 -165674 149296 254165 -46869 -238840 71937 -290255 324187 -48418 18023 -156709
19288A55606N3730J91889o404a91631l779j15844D7777a53660C88686b06364h6692
$$ 155606 209336 401225 394821 -191631 -195410 -311254 47777 -153660 388686 -206364 -86692
19276A0086K95998a95807D8346k3737J16459c02625J08672B2814h1490m1381j41726
$$ 10086 306084 -195807 48346 24609 141068 -302625 -193953 22814 -81490 -122871 -264597
19265b64597b2357h98C82521G1352g3065B6951c11348a39297l41973J48191N8784
$$ -264597 -22357 -898 382521 71352 -73065 26951 -311348 -139297 -481270 -333079 -274295
19254b74295R4043k0714B69724i7002A78077R8060i3413r1395k1879G5114a95141
$$ -274295 -180252 -200966 269724 -97002 178077 276137 -93413 -184808 -206687 75114 -195141
19242B00641b44833M8227A79452n2443a42661j50425J29660L5818A09278c4229
$$ 200641 -244833 -196606 179452 127009 -142661 -293086 -163426 -127608 109278 -34229
19231b63308B30605d5690A56061M10994a93881l52061A64881p0027L4453D5629
$$ -263308 230605 -45690 156061 567055 -193881 -545942 164881 94854 129307 45629
19220a66263k8653j01559L0182a20377k02498J23253L1930M7556q9199M0457G5699
$$ -166263 -194916 -296475 -266293 -120377 -322875 -199622 -167692 -120136 -209335 -168878 75699
19208b74937i281B27610l0551d4569B98646A713b7583A1528Q3447b292I7056M8445
$$ -274937 -9281 227610 197059 -44569 298646 1713 -27583 11528 94975 -2292 97056 145501
19196A45501B3362a97823j49837J13959A04548b23381A90181g1180o1953F4413
$$ 145501 23362 -197823 -347660 -233701 104548 -223381 190181 -71180 -133133 64413
19185c70500J69217N3652k05987J25507p3194a15598j3903a7983A13239f3728
$$ -370500 -201283 -147631 -353618 -228111 -301305 -115598 -129501 -17983 113239 -63728
19174b67525J04044j3146C25739a21050N6300Q190p7830B35967a40894D6060i3887
$$ -267525 -163481 -176627 325739 -121050 -64750 -56560 -134390 235967 -140894 46060 -93887
19162h8764j01774k24376a75432Q6327l62316B80240a5655m2426K6816l24325
$$ -88764 -190538 -414914 -175432 -89105 -451421 280240 -15655 -58081 -31265 -355590
19152c55590J9608b296j24074d8773j14748A08789C8196Q254b09971H4059j6449
$$ -355590 -335982 -2296 -126370 -48773 -163521 108789 38196 46450 -209971 84059 67610
19141F7610a66735P8802C4870a40974n214O3194l02964K9008f6964k08142K7915
$$ 67610 -166735 -87933 34870 -140974 -146188 -82994 -385958 -356950 -66964 -275106 -247191
19130b47191C9982b8258j83523A94353n9801d8518m687F6746k5568f942j73688
$$ -247191 39982 -28258 -211781 194353 134552 -48518 -53205 66746 41178 -6942 -180630
19119a80630b7477E7667J8917c50298k24826J11476C08805o350B6413e8715j21289
$$ -180630 -27477 57667 76584 -350298 -575124 -463648 308805 302455 26413 -58715 -180004
19108a80004o8035F799c0603I8345J10769n9693J66796K33519a32349f2359j48777
$$ -180004 -248039 6799 -30603 98345 209114 149421 316217 549736 -132349 -62359 -211136
19097b11136r9578P1822L5590M5086C6314b78952F1848c03098A11266a44275p4345
$$ -211136 -310714 -238892 -203302 -158216 36314 -278952 61848 -303098 111266 -144275 -218620
19086b18620J4533A86892a24157B29278c77949a4501P108G5525q442j2919Q1578
$$ -218620 -204087 186892 -124157 229278 -377949 -14501 -7393 75525 67083 54164 135742
19075A35742b70895a32935b0707A61283l9472j6589l2491b71339a03327E5254
$$ 135742 -270895 -132935 -20707 161283 121811 105222 72731 -271339 -103327 55254
19064c65505H0397f8011j15446Q1959m9267C50278b62061a0886l5917k09431q136
$$ -365505 80397 -68011 -183457 -101498 -150765 350278 -262061 -10886 -46803 -256234 -264370
19053b64370a19422C79890a81836j19875J28298P1379j7089A54933n6064D1395
$$ -264370 -119422 379890 -181836 -301711 -173413 -102034 -119123 154933 98869 41395
19042B8483K02498D6854c1865A07736b45000C2337a41446B01901o1661J53469
$$ 28483 230981 46854 -31865 107736 -245000 32337 -141446 201901 140240 293709
19032B93709a11692j05665f1355j21415B13199J11722c6924B00105a95422A55764
$$ 293709 -111692 -217357 -61355 -182770 213199 324921 -36924 200105 -195422 155764
19021i4374b3547l06178a00092A32524J32258C8411H007K33040c00632a37092
$$ -94374 -23547 -329725 -100092 132524 264782 38411 8007 241047 -300632 -137092
19010e158B00850r3l4204q0230b44281R5330G4858B4945l998c14011E9295L0763
$$ -5158 200850 200757 166553 86323 -244281 -148951 74858 24945 20947 -314011 59295 90058
18998I0058a6756p9632H8950i1126I9878N9442a74230j361D0238a69805j9311
$$ 90058 -16756 -96388 88950 -91126 99878 159320 -174230 -175591 40238 -169805 -189116
18987a89116b3161o9281p9478C9939K69428A39415a45946K4933C0962c5141A82916
$$ -189116 -23161 -92442 -171920 39939 309367 139415 -145946 -121013 30962 -35141 182916
18975A66183a16594l01100f1208j64968J2455C11327a05678H9015e26222C1874
$$ 166183 -116594 -417694 -61208 -226176 -213721 311327 -105678 89015 -526222 31874
18964F5244c13220j82303a54940j02120B16558a18709c1336D974M218c2171j85961
$$ 65244 -313220 -495523 -154940 -257060 216558 -118709 -31336 4974 9192 -32171 -218132
18953b18132F4893c4892F5929c30846j567P027H8490B9966f5558a2223I7475m3514
$$ -218132 64893 -34892 65929 -330846 -332413 -325386 88490 29966 -65558 -12223 97475 53961
18941E3961m90N7869J8972E4490b81863b0028F0911b19516G9737b9178j40452
$$ 53961 53471 111340 130312 54490 -281863 -20028 60911 -219516 79737 -29178 -169630
18930a69630m4194i0865A60754J66774d272j955k21713A06448l0839f8091J2608
$$ -169630 -213824 -90865 160754 327528 -4272 -6227 -227940 106448 75609 -68091 -55483
18919e5483k95300O9615M4242a07805a9498j05629B05965d12933K04440H6581
$$ -55483 -350783 -281168 -236926 -107805 -19498 -125127 205965 -412933 -208493 86581
18908F2602H108L90800A8415b8502p9392b0032G2376h7874m54278c1338O383m79414
$$ 62602 8108 398908 18415 -28502 -107894 -20032 72376 -87874 -542152 -31338 -24955 -504369
18896e04369i0147G8715j1317i1159k07601a15996m23210B64944a45894k6798
$$ -504369 -90147 78715 67398 -91159 -298760 -115996 -539206 264944 -145894 -172692
18886a72692f5269A26774A1385J09184F223b36480e9863B71837F8349A1716a68692
$$ -172692 -65269 126774 11385 120569 6223 -236480 -59863 271837 68349 11716 -168692
18874C44635a42968C55870a22633j36347P4494Q5487r7324g5470A74656J2230
$$ 344635 -142968 355870 -122633 -258980 -184486 -98999 -196323 -75470 174656 186886
18864A86886d0304F9494j9201A9739K28313h5859A89008h7945F3465K2985a30472
$$ 186886 -40304 69494 50293 19739 248052 -85859 189008 -87945 63465 86450 -130472
18852f3890k7811B7916M6748B4177J78883c9618C8567e4746k3240q7285N0723
$$ -63890 -91701 27916 74664 24177 203060 -39618 38567 -54746 -77986 -165271 -114548
18841a14548j03280A9463k153K68434b14413g4175A56460a28439k14562A40653
$$ -114548 -217828 19463 17310 285744 -214413 -74175 156460 -128439 -343001 140653
18830C5957c02688A39568m7618j7827J39619a95410e2k54500e523A25851b27376
$$ 35957 -302688 139568 91950 74123 213742 -195410 -52 -254552 -5523 125851 -227376
18818B17183J93046b08900N3232e231k29200A23372J06444K43947g9243B99491
$$ 217183 410229 -208900 -155668 -5231 -234431 123372 229816 473763 -79243 299491
18807B87312b15485A50663K828g3369B5965a06297k13800F1339e8359j97465A08159
$$ 287312 -215485 150663 153491 -73369 25965 -106297 -320097 61339 -58359 -255824 108159
18795E2379a97416k29647N7863a45843j11702C00567A35615d39577a93783h7722
$$ 52379 -197416 -427063 -369200 -145843 -257545 300567 135615 -439577 -193783 -87722
18784b47744n5161J45203A43910d68790Q7886A99815K972J28100B8821d18640
$$ -247744 -302905 -157702 143910 -468790 -380904 199815 202787 330887 28821 -418640
18773E7459J0297a1652o0185k55739B74471h0030k51449a00045M0913q829I2482
$$ 57459 67756 -11652 -71837 -327576 274471 -80030 -331479 -100045 -59132 -67961 92482
18761a19873D29974f9811D7883a94840A21228m6419g4617o5550A24099c01352
$$ -119873 429974 -69811 47883 -194840 121228 74809 -74617 -140167 124099 -301352
18750D7505L8436g6926A8343c03248B78423a58843p0039j4815J01522k2276N7741
$$ 47505 85941 -76926 18343 -303248 278423 -158843 -228882 -243697 -142175 -164451 -106710
18739a06710k30836q3020B4431Q9997b4075o8128M5954l5767C7407f6702l37748
$$ -106710 -337546 -420566 24431 114428 -24075 -92203 -46249 -82016 37407 -66702 -404450
18728d04450H5708a28442j01684b4332j56491g623A5236J73176a2210r9955d1241
$$ -404450 85708 -128442 -230126 -24332 -180823 -7623 15236 188412 -12210 -112165 -41241
18716a62584g4341A34093d50599e2896j39647j12049B00237c87729A73798F0993
$$ -162584 -74341 134093 -450599 -52896 -192543 -304592 200237 -387729 173798 60993
18705a44042Q103A13235i0989j59743a21235A39192b6038B2219b9412j7115k02859
$$ -144042 -135939 113235 -90989 -250732 -121235 139192 -26038 22219 -29412 -46527 -249386
18694b49386a12274K5012k8773B05487J30563B4282a17361A10030J85943e3231
$$ -249386 -112274 -87262 -116035 205487 336050 24282 -117361 110030 295973 -53231
18683A4248a19329L4785k7692A856b2644A15502c37539A19273p886k292f4683
$$ 14248 -119329 -84544 -112236 1856 -22644 115502 -337539 119273 111387 109095 -64683
18671b56840a2433k06915n9468I1664o664B1911b08237g2948j72942A44546b9200
$$ -256840 -12433 -219348 -278816 91664 85000 21911 -208237 -72948 -245890 144546 -29200
18659f3845E0082e934B9998L7885c88676A86182r1138B144R1816c64807J80965
$$ -63845 50082 -5934 29998 67883 -388676 186182 95044 2144 93960 -364807 -183842
18648a83842O3981B5811J97175b1847j96369A25332a30763N3696j44534A28045
$$ -183842 -119861 25811 222986 -21847 -218216 125332 -130763 -77067 -221601 128045
18637A35331f3774K3670m3447b0243j26444o0657B14007K3609K9854j591h9270
$$ 135331 -63774 -40104 -83551 -20243 -146687 -207344 214007 237616 267470 265879 -89270
18625g5584j91868L9092a05564o9027i197C23644b85184P5744C32597c0205j19744
$$ -75584 -267452 -228360 -105564 -174591 -9197 323644 -285184 -209440 332597 -30205 -149949
18614a49949j93754B23359a51806n3678c9744J6184p9531A5106a37382f7200m5404
$$ -149949 -343703 223359 -151806 -205484 -39744 -23560 -103091 15106 -137382 -67200 -112604
18603a12604j86947A65380c32997A68824b60158A06170J6958a28685I6854b16871
$$ -112604 -299551 165380 -332997 168824 -260158 106170 123128 -128685 96854 -216871
18592A46094D790Q0083d4820k3765k7615j9751B8009a39874k8537j11677J20327
$$ 146094 4790 84873 -44820 -68585 -96200 -115951 28009 -139874 -168411 -280088 -159761
18581a59761J7542A95852A9807M22554b35482B63999c4785g051F5835O2512e37970
$$ -159761 -142219 195852 19807 442361 -235482 263999 -34785 -7051 65835 128347 -537970
18569a21758j63407B3047a1185j23308B13360n3178A2127a49564A3855O8280L0194
$$ -121758 -285165 23047 -11185 -134493 213360 160182 12127 -149564 13855 82135 112329
18558A12329b2912B02911a93996l7236h7893m3383j50650J20177g7969l4880F7396
$$ 112329 -22912 202911 -193996 -231232 -87893 -131276 -281926 -161749 -77969 -112849 67396
18546b03068A90492a54840k36994C19729A8751J74565a96658l6749e4337r5956
$$ -203068 190492 -154840 -391834 319729 18751 193316 -196658 -233407 -54337 -150293
18536a50293A48289n3944a50908f2530E4629a25879G2766b3965o9039a7837j28629
$$ -150293 148289 94345 -150908 -62530 54629 -125879 72766 -23965 -93004 -17837 -146466
18525a46466k30909a37873l57894a40410b5468A60077a32976A32731b69509k83197
$$ -146466 -377375 -137873 -495767 -140410 -25468 160077 -132976 132731 -269509 -552706
18515e52706A19106a113A93255a07392b2793o30864d2575B55093a54640g3947
$$ -552706 119106 -1113 193255 -107392 -22793 -653657 -42575 255093 -154640 -73947
18504A48052D3969a38756D3388a20496c7861n7959l6361C02518j28535b470B53917
$$ 148052 43969 -138756 43388 -120496 -37861 -95820 -132181 302518 173983 -2470 253917
18492E7082a95494b8554A40944d4745j37475B05572c0338A53184A4877K82437
$$ 57082 -195494 -28554 140944 -44745 -182220 205572 -30338 153184 14877 297314
18482B97314c00358J1007a1841p7850C45804a13076K3410A28442a270k21031C48106
$$ 297314 -300358 -289351 -11841 -89691 345804 -113076 -89666 128442 -1270 -222301 348106
18470a17176j29028H8605g9187j00866j80161a00102l444A2789J22409C1481a38835
$$ -117176 -246204 88605 -79187 -180053 -360214 -100102 -103546 12789 135198 31481 -138835
18458A9851J88762e1118k17045f9319A94051C0514M0844a4516A96421J8735b4833
$$ 19851 208613 -51118 -268163 -69319 194051 30514 71358 -14516 196421 215156 -24833
18446H7134a95499L8119B33659i1179F8045P1212b07505G5345d8237k60101j88182
$$ 87134 -195499 -157380 233659 -91179 68045 139257 -207505 75345 -48237 -308338 -496520
18435d96520b42634B24292A8433b119D1098b63779J2659A2796e72j59247L9473
$$ -496520 -242634 224292 18433 -2119 41098 -263779 -251120 12796 -572 -159819 -120346
18424a20346A81029A326M0682a20781A72710a99827M5434c4019j38673H9968b80522
$$ -120346 181029 1326 42008 -120781 172710 -199827 -154393 -34019 -172692 89968 -280522
18412b55358f8179D5085k177a62202A4905O4458J24028H8020k5061N50505b55339
$$ -255358 -68179 45085 42908 -162202 14905 79363 203391 88020 62959 613464 -255339
18400I3080a61994f1798F6004j0232a84422f5516k31396J33837j8243A59752a54
$$ 93080 -161994 -61798 66004 55772 -184422 -65516 -296912 -163075 -181318 159752 -154
18388a0033l81304C11353a9726j52207j36595i2548l27260A37380A1366K87226
$$ -10033 -391337 311353 -19726 -171933 -308528 -92548 -419808 137380 11366 298592
18378B98592H9405b49439A48197i4973A31475a33959j72278d3834j81485A66653
$$ 298592 89405 -249439 148197 -94973 131475 -133959 -306237 -43834 -225319 166653
18367H5495a96347n441p5022A43297D2359Q0903e527k58079A41359D7023f6416
$$ 85495 -196347 -201788 -276810 143297 42359 123262 -5527 -263606 141359 47023 -66416
18355D09M2117a31799C16254f1840A45604B8067J07558H179b53579F3600J7756
$$ 409 42526 -131799 316254 -61840 145604 28067 135625 8179 -253579 63600 81356
18344H1356O8817k2681h0324I4189O7742a511B77500a43666b5216A80404a70129
$$ 81356 150173 127492 -80324 94189 161931 -1511 277500 -143666 -25216 180404 -170129
18332D4212g028j32238K7242J5299B09377r4189k479c50062p9323g1993B51894
$$ 44212 -7028 -139266 -112024 -96725 209377 115188 112709 -350062 -429385 -71993 251894
18320C53595j19038q3864c90800a02150k6235A09752b34859L6387F8503d1154
$$ 353595 234557 150693 -390800 -102150 -128385 109752 -234859 -198472 68503 -41154
18309c89747C050i3015k88802b211j71385E7784Q3456a75795D8136i559o0876
$$ -389747 3050 -93015 -381817 -2211 -173596 57784 141240 -175795 48136 -9559 -70435
18298g0435n6728j32639I6518E584P3636J42629b44946a09836D378J09321J26493
$$ -70435 -127163 -259802 96518 5584 79220 221849 -244946 -109836 4378 113699 240192
18287B40192A1515a70810A37523R3694C5105b27584A14054J74897q1991a52682
$$ 240192 11515 -170810 137523 231217 35105 -227584 114054 288951 206960 -152682
18276a39737O2560j57723j1562a20743A09322h4427A39993J46199a43437d9917
$$ -139737 -77177 -234900 -246462 -120743 109322 -84427 139993 286192 -143437 -49917
18265b47186a340j85679b6032J1770A34698A4668a74769M9493H4755J06217a83466
$$ -247186 -1340 -187019 -26032 -14262 134698 14668 -174769 -125276 84755 190972 -183466
18253a68798I243a28323Q424L2347K1956a3335A6339a29028e908m0782F6220a73105
$$ -168798 9243 -128323 -119899 -87552 -65596 -13335 16339 -129028 -5908 -46690 66220 -173105
18240i2523D42K23614h9187A91140C2611a05293n5101c055j61570l0459M2538
$$ -92523 442 224056 -89187 191140 32611 -105293 -160394 -3055 -164625 -195084 -152546
18229a52546A55512a3368A02160a52739m488J1924A41405c7254G7275i5211o0455
$$ -152546 155512 -13368 102160 -152739 -157227 -145303 141405 -37254 77275 -95211 -155666
18218a55666j4814J8865b1996o47E9229a95266i518B4186c8668h780o44m4676
$$ -155666 -170480 -151615 -21996 -22643 59229 -195266 -9518 24186 -38668 -8780 -9424 -54100
18206e4100l32214a06086j57003J28920M8766B3343d287k2757m03911A51400h230
$$ -54100 -386314 -106086 -263089 -134169 -85403 23343 -4287 -27044 -430955 151400 -8230
18194E7495a91696g4709L988j3420j43359O1990A31052b29118l0812I8884n911
$$ 57495 -191696 -74709 -70721 -84141 -227500 -165510 131052 -229118 -259930 98884 92973
18183I2973c07138O7242P3796D0370K69360A35138L044B8399J36184f0685D6547
$$ 92973 -307138 -239896 -166100 40370 309730 135138 138182 28399 164583 -60685 46547
18171e867j39287A84960K90272b1347m12081J02878a6742j42813c8020q9066B93775
$$ -5867 -145154 184960 475232 -21347 -433428 -330550 -16742 -159555 -38020 -127086 293775
18159a65278B91303a07061d4704A03158a65939c443j33696a3336j21016c9704
$$ -165278 291303 -107061 -44704 103158 -165939 -3443 -137139 -13336 -134352 -39704
18148I1301l861d25042f1077E01166B09293b01051j52953h0089q7266L6614k6201
$$ 91301 87440 -425042 -61077 501166 209293 -201051 -354004 -80089 -167355 -130741 -156942
18137a56942c9147n29515A99302p9303d29146a5133j36603G1012a64345e4694
$$ -156942 -39147 -568662 199302 119999 -429146 -15133 -151736 71012 -164345 -54694
18126G0553e20146g7243p9195C1916c41427e8696n1151H1894g7684I6778L20d8240
$$ 70553 -520146 -77243 -156438 31916 -341427 -58696 -109847 81894 -77684 96778 97098 -48240
18113F9451f5790L1572j13378L3672I4707h5718j83669B5910J96855c38759J65926
$$ 69451 -65790 -34218 -147596 -113924 94707 -85718 -269387 25910 222765 -338759 -172833
18102a72833Q3794G2635h9396E3618d9435A26801k1137J76049b12815A32309b78257
$$ -172833 -89039 72635 -89396 53618 -49435 126801 105664 281713 -212815 132309 -278257
18090d34832a4321o3781A80581a05028j24178A38355b79766D9589M0437P5819
$$ -434832 -14321 -78102 180581 -105028 -229206 138355 -279766 49589 90026 165845
18080A65845p4247Q8763n8222k9685i2123G3101a07939A03161J00644o285e5458
$$ 165845 91598 180361 122139 92454 -92123 73101 -107939 103161 203805 197520 -55458
18068b1386C06255K6224j43991G7558a9114A13267b43169D5417L16339b65485
$$ -21386 306255 332479 188488 77558 -19114 113267 -243169 45417 361756 -265485
18057B12802d6605C37693b77581C3525g4341D3071e3065A02983a20124D6382g2334
$$ 212802 -46605 337693 -277581 33525 -74341 43071 -53065 102983 -120124 46382 -72334
18045b018l42169a10060E7886h864B29423j00495N5321c2719n6422E0732a42627
$$ -2018 -344187 -110060 57886 -8864 229423 128928 184249 -32719 -89141 50732 -142627
18033A20309b83948a7554j00282d6872P257j22591m8881A03720M0862D6531b15124
$$ 120309 -283948 -17554 -117836 -46872 -39615 -162206 -211087 103720 144582 46531 -215124
18021A77208l9261Q2098f0123F363a80336A27767a66981A64325a51964E0571g8728
$$ 177208 137947 220045 -60123 6363 -180336 127767 -166981 164325 -151964 50571 -78728
18009e56906a02447k65493D49104k21686c1038A20932C2841a18983q1713m3679
$$ -556906 -102447 -367940 449104 227418 -31038 120932 32841 -118983 -200696 -244375
17999b44375C04929H7533A00J74543D7573R736J52757a04927D1120b24578G3918
$$ -244375 304929 87533 100 174643 47573 57309 210066 -104927 41120 -224578 73918
17987C0989b96035A7194a36020A60810a51766A38905b03733j8104I5779B8374
$$ 30989 -296035 17194 -136020 160810 -151766 138905 -203733 -221837 95779 28374
17976d36110H4918a83455L2444A76899a85717C8559a2579o1397j32898A52341
$$ -436110 84918 -183455 -151011 176899 -185717 38559 -12579 -73976 -206874 152341
17965d1156m23280a02374D1964b23028D6330p789L4148a59644C61901h226m28864
$$ -41156 -464436 -102374 41964 -223028 46330 38541 72689 -159644 361901 -8226 -437090
17954d37090C40123B8499f5567k49472i2723J7242k57505h3980j51941B0857J56628
$$ -437090 340123 28499 -65567 -315039 -92723 -75481 -332986 -83980 -235921 20857 177485
17943A77485a82597l7476d3390a5688B70863h7402A66836d9212E3460i9191K7084
$$ 177485 -182597 -220073 -43390 -15688 270863 -87402 166836 -49212 53460 -99191 -72107
17932g2107A99054a05679k06877B50220E8569N899R0829m3691a62734F8906g2368
$$ -72107 199054 -105679 -312556 250220 58569 64468 155297 111606 -162734 68906 -72368
17920c36705c2082B66624o2711K2226b97321g2166C7211L4356N244f2474f784
$$ -336705 -32082 266624 203913 226139 -297321 -72166 37211 71567 76811 -62474 -6784
17908d4789o2192D22692a21204M5080B35099A793M3291a81017d8356E4407a43094
$$ -44789 -106981 422692 -121204 -76124 235099 1793 45084 -181017 -48356 54407 -143094
17896a9857E6503J18172b63544A51562b73364B59377C9368a58770o8195k271i6614
$$ -19857 56503 174675 -263544 151562 -273364 259377 39368 -158770 -226965 -229236 -96614
17884a18611A75674a74080C3925K12223b54758b1433B26247a25239B08093l9099
$$ -118611 175674 -174080 33925 246148 -254758 -21433 226247 -125239 208093 168994
17874A68994M6521c6903m5577b3878B4293c06463o4716a00362l70895a81787A7999
$$ 168994 215515 -36903 -82480 -23878 24293 -306463 -371179 -100362 -471257 -181787 17999
17862B64509b97809C4431c5560A281N8095k2300a95210f6959B52239a06305d2197
$$ 264509 -297809 34431 -35560 1281 59376 37076 -195210 -66959 252239 -106305 -42197
17850A13162R6051b42439G7025q486a65250j51941R9642m9127b0362B42212b37394
$$ 113162 209213 -242439 77025 68539 -165250 -317191 -217549 -266676 -20362 242212 -237394
17838a719B47978C2343d061I4403m5774J9436K6790l1698a09715k3110j34788
$$ -1719 247978 32343 -4061 94403 48629 68065 94855 63157 -109715 -132825 -267613
17827b67613n5412j97564K36986A46860c17089Q3520f9990m1869j07224f640j27836
$$ -267613 -323025 -520589 -283603 146860 -317089 -233569 -69990 -111859 -219083 -6640 -134476
17816a34476K255H4256K44002b95506D2607J41724e707k64977H0981K2171a6404
$$ -134476 -132221 84256 328258 -295506 42607 184331 -5707 -270684 80981 103152 -16404
17804a96015B07437o1308B3459e5047g010A19206n4597K14068i6058j4752G345
$$ -196015 207437 146129 23459 -55047 -7010 119206 64609 278677 -96058 -110810 7345
17792c7997k07831A10215a06354A89218e3416B19791g9327B48316a66748M1217
$$ -37997 -245828 110215 -106354 189218 -53416 219791 -79327 248316 -166748 -125531
17782a25531d8171B40982j12576m5440b33179b3812B95603c62554A27920j3731
$$ -125531 -48171 240982 128406 82966 -233179 -23812 295603 -362554 127920 114189
17772A14189d1916K92F1364a72710I0335i3941D4740c17524I1249a21941l902
$$ 114189 -41916 -41624 61364 -172710 90335 -93941 44740 -317524 91249 -121941 -125843
17761a25843A86937i1178j81374A7868a57188f8900B32005C4177A5456L94066
$$ -125843 186937 -91178 -272552 17868 -157188 -68900 232005 34177 15456 409522
17751D09522a72941h3893k03207G3116a21875J2487I1871N2212d440j62102g8375
$$ 409522 -172941 -83893 -287100 73116 -121875 -109388 91871 144083 -4440 -166542 -78375
17739A27237a1591A10291f0557I0044J2647b0096F9325J73692A06219K04819A4330
$$ 127237 -11591 110291 -60557 90044 102691 -20096 69325 243017 106219 311038 14330
17727c48433B59924p3003b5399A06016a27618N5544I4458b82373a4979k48935
$$ -348433 259924 186921 -25399 106016 -127618 -72074 94458 -282373 -14979 -263914
17717b63914o7387g3560E7343B3150J97666e2643D6595b53193B08952a70426F1154
$$ -263914 -331301 -73560 57343 23150 220816 -52643 46595 -253193 208952 -170426 61154
17705a65976g9l3937A05042P2186a5374j49127H6447J33697c4210C81634b9492
$$ -165976 -79 -34016 105042 177228 -15374 -164501 86447 220144 -34210 381634 -29492
17693E8159g433A37185J6411a5503C1727b807A73108a81028A25980Q1109p7968
$$ 58159 -7433 137185 153596 -15503 31727 -2807 173108 -181028 125980 207089 129121
17682A29121c95097a64480d0583B45675A5632d70767i6821J5854A76921o8641
$$ 129121 -395097 -164480 -40583 245675 15632 -470767 -96821 -80967 176921 108280
17672A08280J5805N1630a54154g1955B13662b47050A63055j7483d9002A83916
$$ 108280 124085 175715 -154154 -71955 213662 -247050 163055 145572 -49002 183916
17661H6845k2152j9828a83563a399j05680o4898A3469L03811A18444C9000A134
$$ 86845 64693 44865 -183563 -1399 -107079 -171977 13469 317280 118444 39000 1134
17649A19619O9749j4642d40125g8876A32875j3593N6035R7058a21348M2175m1900
$$ 119619 189368 174726 -440125 -78876 132875 119282 175317 272375 -121348 -79173 -121073
17638a21073K0788c1632n0489K990k4888A81076g8746C9033p299a70118C50653
$$ -121073 -100285 -31632 -82121 -79131 -104019 181076 -78746 39033 31734 -170118 350653
17626e5968E4089i1653A6905b32806L3039A33677N4107J04641p1385I3636J10341
$$ -55968 54089 -91653 16905 -232806 -199767 133677 187784 292425 221040 93636 203977
17615B03977d7455C48735b00239F5242e4629J3846j45408N2205E0689j2124a34038
$$ 203977 -47455 348735 -200239 65242 -54629 -40783 -186191 -133986 50689 38565 -134038
17603g3149o2561C09730a62492j27222i3277C2746J3128k1207K39206P0330A06446
$$ -73149 -135710 309730 -162492 -289714 -93277 32746 45874 24667 263873 334203 106446
17591d8398B08239r6787j3193J73848a35376A69063a80293A00879b60162A72726
$$ -48398 208239 111452 98259 272107 -135376 169063 -180293 100879 -260162 172726
17580b17954f7043A48081a85313P6474A69018R25R3511I2860l8146O2023M5384
$$ -217954 -67043 148081 -185313 -108839 169018 169943 263454 92860 54714 116737 162121
17569A62121a98763B17598J81589j92845G264K65842p0013R4626A19818J03493
$$ 162121 -198763 217598 399187 206342 7264 273106 203093 297719 119818 223311
17559B23311M8656H4837i9432k16674K0091a32783j23914e2686A47803e99777
$$ 223311 271967 84837 -99432 -316106 -296015 -132783 -256697 -52686 147803 -599777
17548G9698K2258a41031f6871G8284J08592J77986b12787E4615K13656c58977
$$ 79698 101956 -141031 -66871 78284 186876 364862 -212787 54615 268271 -358977
17537b85318L9186A60607F2821a22667A38407K25157b97298G8098B6321J41582
$$ -285318 -246132 160607 62821 -122667 138407 363564 -297298 78098 26321 167903
17527A67903a28858M7903A24224N4918e3490B59203I736K69800p4985B6016K3681
$$ 167903 -128858 -80955 124224 179142 -53490 259203 9736 279536 204551 26016 49697
17516D9697a4605A95254e8017H8577e438I831K15801c6355A35620K32343a05792
$$ 49697 -14605 195254 -58017 88577 -5438 9831 225632 -36355 135620 367963 -105792
17504D0756J53874J15727d3770A3765J79353q0444J2551b28180B57246C5004J84891
$$ 40756 194630 310357 -43770 13765 193118 112674 125225 -228180 257246 35004 219895
17493B19895H8782n76R617l4187i903C2658J78685b509E3484j0186M05101c22519
$$ 219895 88782 88206 97823 63636 -9903 32658 211343 -2509 53484 43298 448399 -322519
17480a62959C06704F2611I694N9799e2896A65557N4351l1640O8315L8366j29378
$$ -162959 306704 62611 9694 69493 -52896 165557 219908 188268 256583 294949 165571
17469A65571K49502B1888d3450j48426L4209D0397i570J514B65518D2853c3429
$$ 165571 415073 21888 -43450 -191876 -157667 40397 -9570 -8056 265518 42853 -33429
17457B08553I0848O3910P7821J72400j08151J14054j48053d9814G2134K08753
$$ 208553 90848 154758 232579 404979 296828 410882 262829 -49814 72134 280887
17447B80887J44351n9411K73112C11396l2403A22657b8007A76848K0273O675L86531
$$ 280887 425238 365827 638939 311396 278993 122657 -28007 176848 197121 203796 590327
17436E90327A63195i2707A22069K0922J37330J36544A98359G1387J79648M18825
$$ 590327 163195 -92707 122069 142991 280321 416865 198359 71387 251035 669860
17426F69860l24228n7073j8561J35150f5267A9763L10971m1119P1202m2050j13402
$$ 669860 345632 288559 269998 405148 -65267 19763 330734 289615 360817 318767 205365
17415B05365G1268L62927j69173A22513R8768A4730K14164Q892o3820R1865J16064
$$ 205365 71268 434195 265022 122513 221281 14730 228894 237786 173966 265831 381895
17404C81895c78515C01041A14635a44437B10210M6288a58602A1224J99651A79
$$ 381895 -378515 301041 114635 -144437 210210 256498 -158602 11224 210875 179
17393g3695B37070B5147M38031k26860b33253E5722J02138K8812m8519J66466
$$ -73695 237070 25147 463178 236318 -233253 55722 157860 186672 138153 304619
17383C04619I9171O7026C6945J20946a01605A68764b47717B8717c4201A35986
$$ 304619 99171 166197 36945 157891 -101605 168764 -247717 28717 -34201 135986
17372B69178k147j19218b08824C19053F308K21677C6534J98699E1537N7172L04772
$$ 269178 267031 147813 -208824 319053 6308 227985 36534 235233 51537 108709 413481
17361D13481o5648m9864A3799J48990K0579K64021C5947K44107b08822B43696
$$ 413481 347833 297969 13799 162789 183368 447389 35947 280054 -208822 243696
17350B71329a57957H8767C7571L13784h3464H5604d4718H8614K79161j77189a14074
$$ 271329 -157957 88767 37571 351355 -83464 85604 -44718 88614 367775 190586 -114074
17338C19453b3958I4248N4196F7096N15863B05637H7294J71905f3724A79836K26528
$$ 319453 -23958 94248 148444 67096 582959 205637 87294 259199 -63724 179836 406364
17327D06364A20829a72479B69907D448J91567c40656A12384B5819K44066g7890
$$ 406364 120829 -172479 269907 4448 196015 -340656 112384 25819 269885 -77890
17316E06098A73176c76896D91915H1404L15483A41565c2051E51094G4909p014
$$ 506098 173176 -376896 491915 81404 396887 141565 -32051 551094 74909 67895
17306F7895J70511P26F1973K46533I8746K27493i0036k8443C50107m3151d7027
$$ 67895 238406 239132 61973 308506 98746 326239 -90036 -118479 350107 306956 -47027
17294B78243A11101J61138b9779C13126A47330a053B95061E8956J16779P0311
$$ 278243 111101 272239 -29779 313126 147330 -1053 295061 58956 175735 246046
17284B46046a13374H3550J178J59229i5421C95518q960A10867L96689a98333A28840
$$ 246046 -113374 83550 84728 243957 -95421 395518 386558 110867 507556 -198333 128840
17272B79077J6830A12263M4896b072o885A97495f1316D13703J45446F7710I081
$$ 279077 295907 112263 157159 -2072 -8957 197495 -61316 413703 559149 67710 9081
17260F3985i2989c7393F3258J08578J75701q1999a4771B51654A14967K55606j26366
$$ 63985 -92989 -37393 63258 171836 347537 265538 -14771 251654 114967 370573 244207
17249B44207q3770j4445J54451J00949A31370N2089m0998K41155A90642L4998
$$ 244207 160437 145992 300443 401392 131370 183459 142461 383616 190642 225640
17239B25640m2450F2354a9642B01733j7804J49489J8561C0041K92383r4160M6206
$$ 225640 183190 62354 -19642 201733 183929 333418 351979 30041 322424 228264 274470
17228B74470a03016A12701J44678l3436J073C7956A7303L52967a98976C8492L38825
$$ 274470 -103016 112701 257379 223943 225016 37956 17303 370270 -198976 38492 377317
17217C77317Q0660k07505j01635K9494O2930M6004r4017M9269h6195A06069J87174
$$ 377317 457977 250472 148837 178331 241261 287265 193248 242517 -86195 106069 293243
17206B93243n3019a4336B0512K79893j48913L82283B22956L7423n8905n7665m607
$$ 293243 240224 -14336 20512 300405 151492 533775 222956 260379 201474 143809 139202
17195A39202K82411A17326B9197R0099L53690A75801i5541A87691b3707B21679
$$ 139202 421613 117326 29197 119296 472986 175801 -95541 187691 -23707 221679
17184D25750G8632N78748B68428j19587C7525J17463M45827J45254C18492r430
$$ 425750 78632 657380 268428 148841 37525 154988 600815 746069 318492 309062
17174C09062J83522A67010J65712j25793M86112k83921A73215N6268J84152o4560
$$ 309062 492584 167010 332722 206929 693041 409120 173215 229483 413635 349075
17164C49075l0006q249K46387k3805B52394j15568j5856L82640p4279l4937A55782
$$ 349075 319069 310820 557207 533402 252394 136826 120970 503610 429331 394394 155782
17152B93574a61431B47296J74732P1787j10947j27935N6817A11391L63738j73704
$$ 293574 -161431 247296 422028 493815 382868 254933 311750 111391 475129 301425
17142C01425L46569A54953Q2921R2721m4291j04078K97754k35418q8326L00289
$$ 301425 647994 154953 237874 330595 286304 182226 479980 244562 156236 456525
17132D56525j61303K64771k6335j58471K35249E4633L45503R5168a02776B56322
$$ 456525 295222 559993 533658 375187 610436 54633 400136 495304 -102776 256322
17121B86795p603K69140R794N2023q6728p8575J7204J63093E683M55226o8984
$$ 286795 279192 548332 558126 610149 523421 444846 462050 625143 5683 460909 391925
17110C91925j19975j7942J33291M8707A35386L5492K32796q5938K1279k4337M6515
$$ 391925 271950 254008 387299 436006 135386 170878 403674 317736 339015 314678 361193
17099C61193j0007Q6873L1069B13634Q3284K48670A78845D7611K48541O0790P7496
$$ 361193 351186 438059 469128 213634 296918 545588 178845 47611 296152 356942 434438
17088D34438N4533A80421P7923l8859l0963G6119J64597K81134K39897l18204
$$ 434438 488971 180421 258344 219485 188522 76119 240716 521850 761747 443543
17078D43543j72530J40870J77382B86761L31394j97663L20079j32132q2356o1953
$$ 443543 271013 411883 589265 286761 618155 420492 740571 608439 526083 464130
17068D64130J95057r7004L03974k0909A84344K22574k4530j42512M23760j97179
$$ 464130 659187 562183 866157 845248 184344 406918 382388 239876 663636 466457
17058D66457J3559N1524J44640J55198k73176j53590J70754J06426B35928K89597
$$ 466457 480016 531540 676180 831378 558202 404612 575366 681792 235928 525525
17048E25525k12024J00856M02157l22237j4866M584N2825K50578C16372K90867
$$ 525525 313501 414357 816514 494277 479411 483995 536820 787398 316372 607239
17038F07239B35528J67845j3557L87791p5813k94161l6854N0009J62545k3666
$$ 607239 235528 403373 389816 777607 701794 407633 370779 420788 583333 559667
17028E59667M4668r717J58268R5715j87766j32752J68529C16583L1063K61017
$$ 559667 604335 594618 752886 848601 660835 528083 696612 316583 347646 608663
17018F08663L33770k12386r3974l790J12460k75366L2102M19815l07477M30840
$$ 608663 942433 730047 636073 632283 744743 469377 501479 921294 613817 1044657
17008A044657k42602j17901o8259J67498K01037j98675M5622k65496R5397K72519
$$ 1044657 802055 684154 615895 783393 984430 785755 831377 565881 661278 933797
16998I33797J18341m45846m101J50425k59707K96082k93654J31888n979P7040
$$ 933797 1052138 606292 602191 752616 492909 788991 495337 627225 621246 698286
16988F98286J54930j34120p6620K11369j1048J70551J39916m35435N15314m19789
$$ 698286 853216 719096 642476 853845 842797 1013348 1153264 717829 1233143 813354
16978H13354J52253l66882j8654L66482j75927J06071M05647m52530M6071K62259
$$ 813354 965607 598725 580071 946553 770626 876697 1282344 829814 875885 1138144
16968A138144j18022k52319k6232N65095Q8662l33868O7998j77399j27014J01712
$$ 1138144 1020122 767803 741571 1306666 1395328 1061460 1129458 952059 825045 926757
16958I26757n9470q960J50391o6722J34425j44499J28200j47875J88889J1923
$$ 926757 867287 858327 1008718 941996 1076421 931922 1060122 912247 1101136 1113059
16948A113059j82027J29578J48792N5165j4519k54113j93157M76874j4699J25313
$$ 1113059 931032 1060610 1209402 1264567 1250048 995935 802778 1279652 1264953 1390266
16938A390266k77811k69893N07574n31512N52476J72053j73733l54832K06252
$$ 1390266 1112455 842562 1350136 818624 1371100 1543153 1369420 1014588 1220840
16929A220840M21191q3864k2660j17091J51644k07666k98952M47551j93556J62935
$$ 1220840 1642031 1558167 1535507 1418416 1570060 1362394 1063442 1510993 1317437 1480372
16919A480372l83121L72541J6792K09853l31244J11394J63031m16535O02918m20929
$$ 1480372 1097251 1469792 1486584 1696437 1365193 1476587 1639618 1223083 1826001 1405072
16909A405072p0735J88638j33511L82176m14832M27451p8583K57400l27114L59066
$$ 1405072 1334337 1522975 1389464 1771640 1356808 1784259 1705676 1963076 1635962 1995028
16899A995028m02174K3109J83551N1466k42157K17717J32277k4232O0798J7803
$$ 1995028 1592854 1615963 1799514 1850980 1608823 1826540 1958817 1934585 1995383 2013186
16889B013186P6157k08896N89299l85469k85146K33347j30719M32416j62830J24958
$$ 2013186 2089343 1880447 2469746 2084277 1799131 2032478 1901759 2334175 2171345 2296303
16879B296303l2947j65722M82323n63936M80720m20577L37555N4774L75706k1604
$$ 2296303 2263356 2097634 2579957 2016021 2496741 2076164 2413719 2468493 2844199 2822595
16869B822595k48528K89474j20398k89551K48763j37851M66562m55458L43813
$$ 2822595 2574067 2863541 2743143 2453592 2702355 2564504 3031066 2575608 2919421
16860B919421l571L97242k42044q4520K49825k58591l77377M08771J55215N65555
$$ 2919421 2915850 3313092 3071048 2986528 3236353 2977762 2600385 3009156 3164371 3729926
16850C729926k88641j78622P2841R3914r851L44258k294l93735L86097j59297
$$ 3729926 3441285 3262663 3335504 3429418 3419567 3763825 3761531 3367796 3753893 3594596
16840C594596O9402J72272K77875l6906M21190K0220m4735m742Q9229J39284l0078
$$ 3594596 3663998 3836270 4114145 4077239 4498429 4518649 4473914 4469172 4558401 4697685 4667607
16829D667607J30334M0085q5158Q9254K21335j7413P2255J08628j55441K64367
$$ 4667607 4797941 4838026 4752868 4842122 5063457 5046044 5118299 5226927 5071486 5335853
16819E335853L64423m65776N43742J14407K92610n2752K74410L3269J40214J97981
$$ 5335853 5700276 5234500 5778242 5892649 6185259 6132507 6406917 6440186 6580400 6778381
16809F778381J44479J22212k7383J25199M34593Q7641k1431N8089M26865J62667
$$ 6778381 6922860 7045072 7017689 7142888 7577481 7665122 7643691 7701780 8128645 8291312
16799H291312L08912L38446j87018K74901J97505K69313L01553J82488N49049
$$ 8291312 8600224 8938670 8751652 9026553 9224058 9493371 9794924 9977412 10526461
16790A0526461L8232j44633P43344K33474N1993Q51813P9436J10475N85616K47756
$$ 10526461 10564693 10420060 11163404 11396878 11448871 12300684 12380120 12490595 13076211 13323967
16780A3323967N68979o1168P94094K94043O87025j90574J010299O92416K87019
$$ 13323967 13892946 13831778 14625872 14919915 15606940 15416366 16426665 17119081 17406100
16771A7406100P91054N24497P35553P77151M20137P31867Q36039P93637R72532
$$ 17406100 18197154 18721651 19457204 20234355 20654492 21386359 22222398 23016035 23988567
16762B3988567Q61344R78027J121468J491696O29957Q41716J432318J349264J622694
$$ 23988567 24849911 25827938 26949406 28441102 29071059 29912775 31345093 32694357 34317051
16753C4317051J522832J294055J735701J874901J762858K369210K381352K281733
$$ 34317051 35839883 37133938 38869639 40744540 42507398 44876608 47257960 49539693
16745D9539693K592806K548584K809757L281258L217853L682795L722288L698743
$$ 49539693 52132499 54681083 57490840 60772098 63989951 67672746 71395034 75093777
16737G5093777N003496M138770N084276M842316N789616O106479O474126O147262
$$ 75093777 80097273 84236043 89320319 94162635 99952251 106058730 112532856 118680118
16729A18680118O898090P297987P240954P808897P389354P518551P124566O888806
$$ 118680118 125578208 132876195 140117149 147926046 155315400 162833951 169958517 176847323
16721A76847323O335054N310979M452727L580360K359436R24692k24853j208183
$$ 176847323 183182377 188493356 192946083 196526443 198885879 199810571 199585718 198377535
16713A98377535l000203m146901m946128o191566o562908p290666p300988p398524
$$ 198377535 195377332 191230431 186284303 180092737 173529829 166239163 158938175 151539651
16705A51539651q146236p018659p771806p215290o989077o400558o570939o002260
$$ 151539651 143393415 136374756 128602950 121387660 114398583 107998025 101427086 95424826
16697I5424826n572268n092310m675618m740302m293012l817104l736465l933088
$$ 95424826 89852558 84760248 80084630 75344328 71051316 67234212 63497747 59564659
16689E9564659k942989l121081k594037k824820k528383j851895k464063j943783
$$ 59564659 56621670 53500589 50906552 48081732 45553349 43701454 41237391 39293608
16681C9293608j599922j930087j307879j852535j600971j138923j112516j435198
$$ 39293608 37693686 35763599 34455720 32603185 31002214 29863291 28750775 27315577
16673B7315577j287290q57528j104405r12435n04716j602908k02632q26946r08718
$$ 27315577 26028287 25170759 24066354 23153919 22649203 21046295 20843663 20016717 19107999
16664A9107999m68267p93323p81170m69858m28550n84375o79128l79290m23421
$$ 19107999 18639732 17846409 17065239 16595381 16166831 15582456 14903328 14524038 14100617
16655A4100617n41628j96376l50105l19116l62130p02832l80452k43307j82965
$$ 14100617 13558989 13362613 13012508 12693392 12331262 11628430 11247978 11004671 10821706
16646A0821706m61021n69747K65774m26730P22m80732J85131m64326l92308l65202
$$ 10821706 10360685 9790938 10056712 9629982 9630704 9149972 9335103 8870777 8478469 8113267
16636H113267l13802J01453l15702j20726l57195K75764o00540j58973J40950
$$ 8113267 7799465 7900918 7585216 7464490 7107295 7383059 6782519 6623546 6764496
16627F764496o56067L23648k00954k75033k86120K60996k86703j76814l62920
$$ 6764496 6108429 6432077 6231123 5956090 5669970 5930966 5644263 5467449 5104529
16618E104529O4688J82757l74039J91879o19679K20642k0579k12827j63087K42142
$$ 5104529 5169217 5351974 4977935 5169814 4550135 4770777 4750198 4537371 4374284 4616426
16608D616426j78447K9357l50847j06549k26546L9505M4514J33528l36810Q9294
$$ 4616426 4437979 4467336 4116489 4009940 3783394 3822899 3867413 4000941 3664131 3753425
16598C753425k72868J71088l52850M38976l3093m18178J81601K21772q09881L38609
$$ 3753425 3480557 3651645 3298795 3737771 3704678 3286500 3468101 3689873 2879992 3218601
16588C218601q1629J27010j97052j34883J08707j69883k15399L03014l84879L39180
$$ 3218601 3136972 3263982 3066930 2932047 3040754 2870871 2655472 2958486 2573607 2912787
16578B912787l40705k70022N36239m90736J25064j74794M765J7103J0592m0353
$$ 2912787 2572082 2302060 2838299 2347563 2472627 2297833 2302598 2319701 2330293 2289940
16568B289940K41088n41426J29277R0083k96407N15213l62150j66200Q6499L9630
$$ 2289940 2531028 1989602 2118879 2208962 1912555 2427768 2065618 1899418 1985917 2025547
16558B025547j92486k33193L31303L2659q5581k62159j27499K93793m89624K94793
$$ 2025547 1833061 1599868 1931171 1963830 1878249 1616090 1488591 1782384 1292760 1587553
16548A587553K2821K62134k2548l38132l9892J7693p6820n8115K49677Q1833K34621
$$ 1587553 1610374 1872508 1849960 1511828 1471936 1489629 1412809 1354694 1604371 1686204 1920825
16537A920825m10781l20103L59026j12106q8289l965k32399J2469M28115J51821
$$ 1920825 1510044 1189941 1548967 1436861 1348572 1344607 1112208 1124677 1552792 1704613
16527A704613m99788j48262K69660J09327l51158K28823p6157j65444K11515k19109
$$ 1704613 1204825 1056563 1326223 1435550 1084392 1313215 1237058 1071614 1283129 1064020
16517A064020m7115m9622J17929L3558J40343k75828J11522P8797k34087K55733
$$ 1064020 1016905 967283 1085212 1118770 1259113 983285 1094807 1173604 939517 1195250
16507A195250M3111j44930K10364K34548j31361m05652K23647l49442j61974L37340
$$ 1195250 1238361 1093431 1303795 1538343 1406982 1001330 1224977 875535 713561 1050901
16497A050901N4140J0121R3110q4333J63750k24806N8251j29269J86727k37637
$$ 1050901 1105041 1115162 1208272 1123939 1287689 1062883 1121134 991865 1178592 940955
16487I40955J70238l77000l1980J24124J13842j15995R0246K79623m61125J80123
$$ 940955 1111193 734193 702213 826337 940179 824184 914430 1194053 732928 913051
16477I13051M8434j42149j41076J66085r0993N1331P3934k22632K87804D40207
$$ 913051 961485 819336 678260 844345 753352 804683 878617 655985 943789 440207
16466H22222C19544M98460O5041o1966k71654L26155j79138O1935J22510r4331
$$ 822222 319544 818004 883045 821079 549425 875580 696442 758377 880887 786556
16456G86556k96337k3290J29741j28306K29772j9344L0972k17466K33069R3882
$$ 786556 490219 466929 596670 468364 698136 678792 709764 492298 725367 819249
16446H19249o4423q7879J6137j364J35898j65893j49577L44429C81865K91949
$$ 819249 754826 666947 683084 681720 817618 651725 502148 846577 381865 673814
16436F73814j18930J09080Q6599C38082L183K25416j22032j01982J78327L7540
$$ 673814 554884 663964 750563 338082 341265 566681 444649 342667 520994 558534
16426E58534J07189B15455L86607j28015J92554k04477m6560j30888L9578q7521
$$ 558534 665723 215455 602062 474047 666601 462124 415564 284676 324254 236733
16416B36733P0869N2651L59108j02243j50680J83342k60414K10147o3053p1471
$$ 236733 307602 360253 719361 617118 466438 649780 389366 599513 536460 464989
16406D64989J26832B45338J08479A68157n0760L62175j92683K39730m0517r3554
$$ 464989 591821 245338 353817 168157 117397 479572 286889 526619 486102 392548
16396C92548j56645K30047A58499L77083p3603P3691B47091L05992c672D71430
$$ 392548 235903 465950 158499 535582 461979 535670 247091 553083 -3672 471430
16385f194A46395e2284A75620B7628L66043A19080K14001r9420K461P7653K53178
$$ -6194 146395 -52284 175620 27628 393671 119080 333081 233661 236122 313775 566953
16374E66953B69524p2182J80793J2534n5999j18530L24963A70616M877N7726A02122
$$ 566953 269524 197342 378135 390669 334670 216140 541103 170616 175493 233219 102122
16362A00874O67986A7949J67314L70668A92238m9726K91327j00758K7588A37619
$$ 100874 768860 17949 185263 555931 192238 142512 433839 333081 360669 137619
16351B43890l9485Q2429D8876L61940q6410F9790K30511E2728L3435J16588J20864
$$ 243890 204405 286834 48876 410816 324406 69790 300301 52728 86163 202751 323615
16340C23615j29408Q3887n7926A5218J37944J12370K65912B8736O6464K10520
$$ 323615 194207 278094 220168 15218 153162 265532 531444 28736 95200 305720
16330C05720j20535M05027k87160h1459k6388E94535h6937B27933A1052K17251
$$ 305720 185185 590212 303052 -81459 -107847 594535 -86937 227933 11052 228303
16320B28303A08931J41009j22686J38780M655J47761E0764R8156J97265q9939
$$ 228303 108931 249940 127254 266034 270689 418450 50764 148920 346185 256246
16310B56246j12909J30383K8481A04558K72694k5015j66478K32554j93819g8520
$$ 256246 143337 273720 302201 104558 377252 352237 185759 418313 224494 -78520
16299B24490R9459F3502K47398P4657j28209q6230k554K29455n4909o456K26203
$$ 224490 323949 63502 310900 385557 257348 171118 168564 398019 343110 336654 562857
16288E62857h4048A80309O8727a41468A65249i4260n6972G63K82348L1035a1760
$$ 562857 -84048 180309 249036 -141468 165249 -94260 -151232 763 283111 314146 -11760
16276A42626Q9962b22461A83142a13385K5347m6171K2419A20665K28904j50649
$$ 142626 232588 -222461 183142 -113385 -88038 -134209 -111790 120665 349569 198920
16266A98920l8888p4549L8557j8111Q9336f1467D8983J95377l8479d7254I8471
$$ 198920 160032 85483 124040 105929 195265 -61467 48983 244360 205881 -47254 98471
16254A13979a79430a655B62904b27383B46854G4763K93368A63277E8754J89132
$$ 113979 -179430 -1655 262904 -227383 246854 74763 368131 163277 58754 247886
16244B47886J28519o6279r6620J17802J35705A57162J9334q5386K40903q2154
$$ 247886 376405 310126 213506 331308 467013 157162 176496 91110 332013 249859
16234B49859j21287a13310H415J09015L66770a3405A37535o5765K46566A14794
$$ 249859 128572 -113310 8415 117430 484200 -13405 137535 71770 318336 114794
16223C29387a16684j74889G8831a65671A52744j3087J25638c3435C9930g5409
$$ 329387 -116684 -291573 78831 -165671 152744 139657 265295 -33435 39930 -75409
16212A78718n9295M9972c1722B3281J79994a26173j52728E3191N1220d0025j91638
$$ 178718 119423 169395 -31722 23281 203275 -126173 -278901 53191 104411 -40025 -231663
16201b31663F3073L93445a77606f5379p8655A8160O4001J17857D3825J1855b28626
$$ -231663 63073 456518 -177606 -65379 -144034 18160 82161 200018 43825 55680 -228626
16189a55761J038j28511J33071B89464n9237l562D4698b1451D9320c7071C12946
$$ -155761 -154723 -283234 -150163 289464 230227 226665 44698 -21451 49320 -37071 312946
16177C3864N5930C8074K26048A3002K32751R8525l0597f8558j83251g8046K9349
$$ 33864 89794 38074 264122 13002 245753 344278 313681 -68558 -251809 -78046 -48697
16166d8697B00054e586m3268C9039k165c72078a49504B70141a37522L5829G9942
$$ -48697 200054 -5586 -48854 39039 36874 -372078 -149504 270141 -137522 -101693 79942
16154B76108E9815f3894e661j81116i0359M248k64292f8049A32708a15639j2040
$$ 276108 59815 -63894 -5661 -186777 -90359 -86111 -350403 -68049 132708 -115639 -127679
16143a27679D03596d8893K337h709B32799A11031n0990j7689c45049h9522C82850
$$ -127679 403596 -48893 -46556 -8709 232799 111031 60041 42352 -345049 -89522 382850
16131h563m5993q7429A16253a59346A80859D4124K17798j29847h479r2694h596
$$ -8563 -54556 -141985 116253 -159346 180859 44124 261922 132075 -8479 -101173 -8596
16119b77361A02905L8569B2874L67859j48899c24876A9875J19637a56087b3068
$$ -277361 102905 141474 22874 390733 241834 -324876 19875 139512 -156087 -23068
16108C5779P7006b65632a15040A56500b93418D7397J97338E5350c33094G4722
$$ 35779 112785 -265632 -115040 156500 -293418 47397 244735 55350 -333094 74722
16097A69899a25096a5867C95111d1121G9894J44666J34828a05724j44067J14786
$$ 169899 -125096 -15867 395111 -41121 79894 224560 359388 -105724 -249791 -135005
16087a35005F6796k9380j4705J00605M5017J95553e426F0980Q8919a57670J7922
$$ -135005 66796 37416 22711 123316 168333 363886 -5426 60980 149899 -157670 -139748
16076a39748j2461J0974b6081A89708A1751e0953k58246a33000D6969Q8541c31019
$$ -139748 -152209 -141235 -26081 189708 11751 -50953 -309199 -133000 46969 135510 -331019
16064b8792H859K18463B7537b69150g4600j53584H2014b4164B42576b02175d0119
$$ -28792 8859 227322 27537 -269150 -74600 -228184 82014 -24164 242576 -202175 -40119
16052g7639C52853f6135q8358L3689H3649d4970r7160o538C55698j73218C1322
$$ -77639 352853 -66135 -154493 -120804 83649 -44970 -142130 -148668 355698 182480 31322
16040a74651c9674m9289n7965j0685q0476a13314A80476a30842E7927k1924h4083
$$ -174651 -39674 -88963 -146928 -157613 -238089 -113314 180476 -130842 57927 36003 -84083
16028E3711b44088b1197m73775g4519J7410k56379J28557A6620a7887l37382C8467
$$ 53711 -244088 -21197 -494972 -74519 -57109 -313488 -184931 16620 -17887 -355269 38467
16016c51447J32781f9622R201A92042L0382a40155c5434j8120k70226C37879b79775
$$ -351447 -218666 -69622 -60421 192042 222424 -140155 -35434 -53554 -323780 337879 -279775
16004a13703A08706M0249c20187D8600A0871a09885C9287L8061J45613f6022n240
$$ -113703 108706 148955 -320187 48600 10871 -109885 39287 77348 222961 -66022 -71262
15993g1262c0922C14856M521b6699C29581a28726c3531j11927C01615B3899K79705
$$ -71262 -30922 314856 319377 -26699 329581 -128726 -33531 -145458 301615 23899 303604
15982C03604O9821E6868M19189B04488g2202B45180c16075B3341A430a28568L8474
$$ 303604 373425 56868 476057 204488 -72202 245180 -316075 23341 1430 -128568 -90094
15971i0094k14612J2851d9766k32340J32294C74804A7849J85612K2474C8091O2581
$$ -90094 -304706 -291855 -49766 -282106 -149812 374804 17849 203461 225935 38091 100672
15960A00672a09684e1981J6283k75473C32502f385F4581a23843e8572B7934a3580
$$ 100672 -109684 -51981 -35698 -311171 332502 -6385 64581 -123843 -58572 27934 -13580
15948b3925j06629j52044A5114a1329B1787K2458m769a70564g8693C1121c53112
$$ -23925 -130554 -282598 15114 -11329 21787 44245 39476 -170564 -78693 31121 -353112
15936H3249K70869b23086A53454A4544b11711A91143a15977j4963A574e3074A43432
$$ 83249 354118 -223086 153454 14544 -211711 191143 -115977 -130940 1574 -53074 143432
15924a05243b8147j9204j06004k114a9257A42948K3993q056A830J92028c37508
$$ -105243 -28147 -47351 -153355 -155469 -19257 142948 166941 158885 1830 193858 -337508
15912c36716B52032A17897b0008j02305G7300b06417M0514A34537a10825H5762
$$ -336716 252032 117897 -20008 -122313 77300 -206417 -165903 134537 -110825 85762
15901a66851B1674a11479k4102r8258H0751K95548j07348B7252P7786e6653C9792
$$ -166851 21674 -111479 -135581 -233839 80751 376299 268951 27252 105038 -56653 39792
15889a3026q1188P260j97544A51497a36453n7574k75456a88856j03731J36882
$$ -13026 -94214 -86954 -284498 151497 -136453 -194027 -469483 -188856 -292587 -155705
15879a55705H696K6993C641J45182k4453e1982l13755a55519A36089a21758A87881
$$ -155705 8696 35689 3641 148823 124370 -51982 -365737 -155519 136089 -121758 187881
15867F6338c3928A77672n6592a90677p4307A7699a03537A36156b19793K9780N9402
$$ 66338 -33928 177672 121080 -190677 -264984 17699 -103537 136156 -219793 -190013 -130611
15856a30611A45983a7526A3642c8964o988G3124i7142E527O2262b48612i4975
$$ -130611 145983 -17526 13642 -38964 -45952 73124 -97142 5527 67789 -248612 -94975
15844a14583j37826H4464b41911d8775o743B42803P9731a30897F7867g8618A22654
$$ -114583 -252409 84464 -241911 -48775 -55518 242803 322534 -130897 67867 -78618 122654
15832a90439A2773a43303D46896I0522e1637j17846A27647a90698f6849n8359
$$ -190439 12773 -143303 446896 90522 -51637 -169483 127647 -190698 -66849 -125208
15822a25208c7397A48045b27489D569a31120C1199L5311b9844C40418j43460G8186
$$ -125208 -37397 148045 -227489 4569 -131120 31199 66510 -29844 340418 196958 78186
15810A29874E1745i8409H4727j663b02783A21546n7572g9545m8788A00264A5488
$$ 129874 51745 -98409 84727 83064 -202783 121546 63974 -79545 -128333 100264 15488
15798A56235J0296c47869D2454f08512A65602b72697I6715a879A37252f3992j35667
$$ 156235 166531 -347869 42454 -608512 165602 -272697 96715 -1879 137252 -63992 -199659
15787a99659b5178D7682f0164b6304n4451A28576n5776a48325N9138A58934d52252
$$ -199659 -25178 47682 -60164 -26304 -80755 128576 72800 -148325 -89187 158934 -452252
15775C1983b66567A32757M477c59673B9102M3175b82390O1994g9533j86215J2548
$$ 31983 -266567 132757 137234 -359673 29102 72277 -282390 -220396 -79533 -265748 -253200
15764b53200L7314j225K4069e7158r8704A67107D9630i4168A14796K37682j10898
$$ -253200 -215886 -217111 -193042 -57158 -155862 167107 49630 -94168 114796 352478 241580
15753B41580J39275B4188f3359A99973B7340b76323J37202B09106J41563F1099
$$ 241580 380855 24188 -63359 199973 27340 -276323 -139121 209106 350669 61099
15742A82478a61863j6454j74320h6090A20824C1527a85147k457L8868J37r8163
$$ 182478 -161863 -178317 -352637 -86090 120824 31527 -185147 -187604 -148736 -148599 -246762
15731b46762H9213R6569A4446Q0933b45241h5936B94326E8345a8539B68144a08018
$$ -246762 89213 185782 14446 95379 -245241 -85936 294326 58345 -18539 268144 -108018
15719b8175G9100O9357F0652a09543B81042a29827j11527C7861N6184K00554b6015
$$ -28175 79100 148457 60652 -109543 281042 -129827 -241354 37861 94045 294599 -26015
15707i807l6067B03497A7056g1686J0089B64133a72619C19843a56532M8955p943
$$ -9807 -45874 203497 17056 -71686 -61597 264133 -172619 319843 -156532 -107577 -115520
15696a15520A14260O2917O83h8635C4017R3730C3051J59887N2814a58073a4011
$$ -115520 114260 177177 177860 -88635 34017 127747 33051 192938 245752 -158073 -14011
15684a75648A3469i0498C3358A5553J2101p621O747L30874b69966L0506C770J95723
$$ -175648 13469 -90498 33358 15553 27654 20033 26780 357654 -269966 -239460 3770 199493
15672A99493a00368a6199k6218l54486J88227J2733f2274c381A79479d2330A37537
$$ 199493 -100368 -16199 -42417 -396903 -208676 -195943 -62274 -3381 179479 -42330 137537
15660b9080l25196A07695e6265l07031G7166a75668k16867A14513f6171A0444
$$ -29080 -354276 107695 -56265 -363296 77166 -175668 -392535 114513 -66171 10444
15649b0499A5347c59510Q0459J38531L729C49684I7801k8572b65001A07299a25479
$$ -20499 15347 -359510 -279051 -140520 -136791 349684 97801 69229 -265001 107299 -125479
15637B3105b0268m9682q5018C2303b43650A52639b33747e9460B41874n4279m4832
$$ 23105 -20268 -69950 -154968 32303 -243650 152639 -233747 -59460 241874 187595 142763
15626A42763i1471a3319B12314f7352J5336m7781A30838h0739n9621A42125O886
$$ 142763 -91471 -13319 212314 -67352 -52016 -99797 130838 -80739 -140360 142125 149011
15615A49011b22468c8034k33296D03799B00013b04603p7506a8125B21998K40228
$$ 149011 -222468 -38034 -271330 403799 200013 -204603 -282109 -18125 221998 462226
15605D62226c65102A18596b95635H8356I160h9748J4626j76046e9718G932e4236
$$ 462226 -365102 118596 -295635 88356 9160 -89748 -75122 -251168 -59718 7932 -54236
15593c1247a014j28277c1195C8996a32165I2454h616j9460F1314b65781a01901
$$ -31247 -1014 -129291 -31195 38996 -132165 92454 -8616 -28076 61314 -265781 -101901
15581a26521o5607C13160a20308A86516i6218C5340A6805J95992b18099B51488
$$ -126521 -192128 313160 -120308 186516 -96218 35340 16805 212797 -218099 251488
15570b15588b9651o5213B76390F9796a08719b2160m6013K4976P004q2934B36813
$$ -215588 -29651 -94864 276390 69796 -108719 -22160 -68173 -43197 -36193 -119127 236813
15558e8511b5291C37162c64410e9518r5899p6306I4922L5112B7944J78709a74770
$$ -58511 -25291 337162 -364410 -59518 -155417 -231723 94922 130034 27944 206653 -174770
15546a4268B65500F9474d2974q1071k8480I9382k0672M038l1328a30586C28700
$$ -14268 265500 69474 -42974 -124045 -152525 99382 78710 82748 51420 -130586 328700
15534A66441g7880k8105A04801c06555A12592g0519e607A97388d00337A35361
$$ 166441 -77880 -105985 104801 -306555 112592 -70519 -5607 197388 -400337 135361
15523c48577A6018a6953l20851A43049F7694b31755B43844a25178F7016L9601
$$ -348577 16018 -16953 -337804 143049 67694 -231755 243844 -125178 67016 106617
15513A06617N4431e9914J4164I33Q5563J94631a49114k17953A38185b94934A28571
$$ 106617 161048 -59914 -45750 933 86496 281127 -149114 -367067 138185 -294934 128571
15501B69341b93603J11869f3215j35490C157c62312i1132r7541G3605J56509b72104
$$ 269341 -293603 -181734 -63215 -198705 3157 -362312 -91132 -188673 73605 230114 -272104
15489B76463b26755A50446A0166g0870k7318K306L4660j5161A45693J98634j57098
$$ 276463 -226755 150446 10166 -70870 -98188 -95882 -61222 -76383 145693 344327 187229
15478A87229a44294f8125A27799a19286d8820D3431b91982A54048C1318P8464
$$ 187229 -144294 -68125 127799 -119286 -48820 43431 -291982 154048 31318 109782
15468A09782b27291C40301g9198c5091A1771K10844D4370J2778j2316a1687A8053
$$ 109782 -227291 340301 -79198 -35091 11771 222615 44370 57148 44832 -11687 18053
15456g5795A51536g1688j96812I5594a68614A06480c9747n1912l0781j00229B07600
$$ -75795 151536 -71688 -268500 95594 -168614 106480 -39747 -91659 -122440 -222669 207600
15444B10717h7222j07231H1687D344b11804h3033A47181d0175A02931c7736B5012
$$ 210717 -87222 -194453 81687 4344 -211804 -83033 147181 -40175 102931 -37736 25012
15432a93965B46035O6404c00965F847g3150j98878C45380j53608c01871d3453
$$ -193965 246035 312439 -300965 6847 -73150 -272028 345380 191772 -301871 -43453
15421e806A03781K46520B1561J22078a91321B00400b01875A221L99388j95230
$$ -5806 103781 350301 21561 143639 -191321 200400 -201875 1221 400609 205379
15411B05379c1216B19329b80761B07109F2460a45576d9934j52190B3632K7988
$$ 205379 -31216 219329 -280761 207109 62460 -145576 -49934 -202124 23632 51620
15401E1620L6182J21346a61108A06816b46967A22667a74370C632Q5603c09319
$$ 51620 87802 209148 -161108 106816 -246967 122667 -174370 3632 89235 -309319
15390A36222K9140c9258K149A03459K3380J53047f9509k83183C93332B0006K08560
$$ 136222 165362 -39258 -37109 103459 126839 279886 -69509 -352692 393332 20006 228566
15379B28566d7647C43070A43068a79371d6500A19256J52073H1830k9477a82939
$$ 228566 -47647 343070 143068 -179371 -46500 119256 271329 81830 52353 -182939
15368A8868R8854b42264A11312a25401e1354L392l8585A98032g9862B94939a98542
$$ 18868 117722 -242264 111312 -125401 -51354 -47962 -86547 198032 -79862 294939 -198542
15356E7976B3445J14656a84694b7577B58348a77350g9223o0547N931C8141a49259
$$ 57976 23445 138101 -184694 -27577 258348 -177350 -79223 -139770 -133839 38141 -149259
15344a44896c5955H9368a41889n6976A88029F2644K21003a40537A85823K4064
$$ -144896 -35955 89368 -141889 -198865 188029 62644 283647 -140537 185823 209887
15334B09887b98752C0589N6099a71206a7100m2449B32237L3406a01374A53491
$$ 209887 -298752 30589 86688 -171206 -17100 -59549 232237 265643 -101374 153491
15323A4628h8416r1593G6010B4367O8397b6067D6038O2028Q7481e1776C7764J22958
$$ 14628 -88416 -180009 76010 24367 92764 -26067 46038 108066 195547 -51776 37764 160722
15311A60722J08604a0156A2128K61664p3695C657K76541o9461C3329b21802h0528
$$ 160722 269326 -10156 12128 273792 200097 3657 280198 210737 33329 -221802 -80528
15299a20483a4403B56311b566A3694K5555J45691b19943k9395B15548Q9203q0092
$$ -120483 -14403 256311 -2566 13694 39249 184940 -219943 -249338 215548 304751 224659
15288B24659N5921j18272a10518F1666A0137c4742C2081d40497A32627J16306
$$ 224659 280580 162308 -110518 61666 10137 -34742 32081 -440497 132627 248933
15278B48933b1041l6941j80717e8754j59308i6182A84683h7810L185k3727j08072
$$ 248933 -21041 -57982 -238699 -58754 -218062 -96182 184683 -87810 -84625 -108352 -216424
15267b16424A74725j1333P2371I3428d5211A0562M20908A39332O3846B8407b1280
$$ -216424 174725 163392 235763 93428 -45211 10562 431470 139332 203178 28407 -21280
15255A42595b2782B13522b16013C92350c6003B48392L72264L36044R39196l40664
$$ 142595 -22782 213522 -216013 392350 -36003 248392 620656 956700 1895896 1555232
15245A555232P766L17432A50385O647j6994K47417r1615l2291j09771o0665K19995
$$ 1555232 1562998 1880430 150385 157032 140038 387455 295840 263549 153778 93113 313108
15234C13108r5710b00842i7041J4281D66257H1072A5246K22441J28077b44759
$$ 313108 217398 -200842 -97041 -82760 466257 81072 15246 237687 365764 -244759
15223C3367b24388C5772J01110B5386b25060B88786F155N5142K83992j35122a63138
$$ 33367 -224388 35772 136882 25386 -225060 288786 6155 61297 345289 210167 -163138
15211e5828k8773A10224j1048Q386K23611a13497G3780b02984A15166a02116A30790
$$ -55828 -84601 110224 99176 107562 331173 -113497 73780 -202984 115166 -102116 130790
15199d78239A84467j5271K69929a14698M594n5154k319A39495a0199D3870a79614
$$ -478239 184467 169196 439125 -114698 -110104 -165258 -167577 139495 -10199 43870 -179614
15187E9755K05866C1010h1445k50732C78418j983F1614M6875l8888k4012J68506
$$ 59755 265621 31010 -81445 -332177 378418 376435 61614 108489 69601 45589 214095
15176B14095D588a96400j10785A72245K3814J03329b08954O8152B98546a55832
$$ 214095 4588 -196400 -307185 172245 196059 299388 -208954 -140802 298546 -155832
15165C7773L5121L00211j46215J34893A16515J77852P7993j71001k6013H4275
$$ 37773 72894 373105 226890 361783 116515 294367 372360 201359 175346 84275
15154C12895b7580C14213a9873C8745K461d24978B2067J8553c1891j8520m0607
$$ 312895 -27580 314213 -19873 38745 41206 -424978 22067 40620 -31891 -50411 -91018
15143i1018A73519a66724A23920a5430B62930E0912b99640B03026c1650B74564
$$ -91018 173519 -166724 123920 -15430 262930 50912 -299640 203026 -31650 274564
15132C09936b8711B36164K31573a54071b7074k17028B69316m1432A01705a10740
$$ 309936 -28711 236164 467737 -154071 -27074 -244102 269316 227884 101705 -110740
15121C67967b54123B29755D5684b2485l6277H5395J82296j24829a60976C1809
$$ 367967 -254123 229755 45684 -22485 -58762 85395 267691 142862 -160976 31809
15110a89016k7973B83155B5833K77414J11005a33164A68826O7160a33294C0321
$$ -189016 -216989 283155 25833 303247 414252 -133164 168826 235986 -133294 30321
15099A31739a9961D25376A98711k4054a1820C983J60242R3252H4073L2139j0622
$$ 131739 -19961 425376 198711 174657 -11820 3983 164225 257477 84073 116212 105590
15088A05590c7793o7950A16320i0362H9478J07215G4478K70936j53991K89301
$$ 105590 -37793 -105743 116320 -90362 89478 196693 74478 345414 191423 480724
15078D80724K6342A76821N8102H9908a40158C64901j27729a4652j14469B99915
$$ 480724 507066 176821 234923 89908 -140158 364901 237172 -14652 -129121 299915
15067B85390H6608k3414b95587A9249N7740Q2937C4837e3427B48247j09087K38299
$$ 285390 86608 63194 -295587 19249 76989 159926 34837 -53427 248247 139160 377459
15056C77459A52151J77636A10027K55369i0667H6622K42694Q3384j66633f9043
$$ 377459 152151 329787 110027 365396 -90667 86622 329316 412700 246067 -69043
15045B62135p5775K63035a32404I9012C6087M57343j75379j33478J07062k1805
$$ 262135 186360 449395 -132404 99012 36087 493430 318051 184573 291635 269830
15035B69830J04329j69523q9471K04801B8970O5122J00629J74794g1852A38438
$$ 269830 374159 204636 115165 319966 28970 94092 194721 369515 -71852 138438
15024b6184B54181M871L9469k6238F9163K33372J32176J28489A60128m6966e4674
$$ -26184 254181 259052 298521 272283 69163 302535 434711 563200 160128 113162 -54674
15012G0915L60848A21103l1222K48958j45970n213E9079J31022J20512B1873Q7072
$$ 70915 431763 121103 89881 338839 192869 187656 59079 190101 310613 21873 108945
15001A08945d532D63014i1840E39612B13386r6173Q8393L9848M7933J13365C5831
$$ 108945 -4532 463014 -91840 539612 213386 117213 205606 245454 293387 406752 35831
14989C20725p3989j18353j0172J72357K6618J35614B12248L83638A80977n0162
$$ 320725 246736 128383 118211 290568 317186 452800 212248 595886 180977 130815
14979A30815J75949K3084k6425R3946J32096j53392B6068J98158F7353L21786
$$ 130815 306764 329848 303423 397369 529465 376073 26068 224226 67353 389139
14969C89139d8202B62472L4190o042N7523r1792J51348k00329K0197J02933P63
$$ 389139 -48202 262472 296662 290620 348143 256351 407699 207370 227567 330500 331263
14958C31263A60854J81597G2485K59169A30374K18002j67891K02933p1375p8033
$$ 331263 160854 342451 72485 331654 130374 348376 180485 383418 312043 234010
14948B34010K01816J34428A54337K14606d6958C88685A68107K43473l1158A17806
$$ 234010 435826 570254 154337 368943 -46958 388685 168107 411580 380422 117806
14937E10845A07017k720L64068C9048J01950j5787J11610M09785k87771E1833
$$ 510845 107017 104297 468365 39048 140998 125211 236821 646606 358835 51833
14926C66045i1695C30992j29981L4480k616L48747A64873K49272R2119c8826A74105
$$ 366045 -91695 330992 201011 235491 232875 581622 164873 414145 506264 -38826 174105
14914D66085q798J32187k31407Q5736J44228H4654J42305B7559O80588A41675
$$ 466085 457287 589474 358067 443803 588031 84654 226959 27559 708147 141675
14903A68259Q3699H8045K4997N20132A83370J01560J99817A81391K19159o2211
$$ 168259 251958 88045 113042 633174 183370 284930 484747 181391 400550 338339
14893C38339a3571I0385M61425k09221K0755r9370G8366J94871K07479k13576
$$ 338339 -13571 90385 551810 342589 363344 263974 78366 273237 480716 267140
14883B67140L91477r2803A37163O4558J5849J00413K5305Q0802H2782J46815L79289
$$ 267140 658617 565814 137163 201721 217570 317983 343288 424090 82782 229597 608886
14872F08886k32999J99384k5311j76319J07546j33665L0882l3914J06749E7808
$$ 608886 375887 575271 549960 373641 481187 347522 378404 344490 451239 57808
14861D24063L91162R012l87191r8873K3574Q5124B17209J32300j14743K39453
$$ 424063 815225 824237 437046 338173 361747 446871 217209 349509 234766 474219
14851D74219q2030r8980K19616J34j35517N5577R7014j17506A67657K67135j12956
$$ 474219 392189 293209 512825 512959 377442 433019 530033 412527 167657 434792 321836
14840C21836j8222o0437L47634h8670B35255K65809k7483k08998L12155j24875
$$ 321836 303614 243177 590811 -88670 235255 501064 473581 264583 576738 451863
14830D51863k25553M492K19003B01407K31050l377J77983K34503l27319j35565
$$ 451863 226310 230802 449805 201407 432457 429080 607063 841566 514247 378682
14820C78682j4923K28244j49365k4949j47153K06578j00779m6169N33743l23453
$$ 378682 363759 592003 442638 417689 270536 477114 376335 330166 863909 540456
14810E40456j78629R3495N5822j69775K83711k39771m2751J01720K64491q2243
$$ 540456 361827 455322 511144 341369 625080 385309 342558 444278 708769 626526
14800F26526K46499l01162o9056P5918j38943p4028J40666J90314K31118j51514
$$ 626526 873025 571863 502807 578725 439782 365754 506420 696734 927852 776338
14790G76338j08609J20183p0909n252Q64B61946M91030K62500m74109K724K02355
$$ 776338 667729 787912 717003 711751 712615 261946 752976 1015476 541367 544091 746446
14779G46446r9471k69818L5806J10360J57537K74652m67494l3788J89244k61541
$$ 746446 646975 377157 412963 523323 680860 955512 488018 454230 643474 381933
14769C81933L57915l7351l02368M67372D14971L19106J01158j38469l46164K06313
$$ 381933 739848 702497 400129 867501 414971 734077 835235 696766 350602 556915
14759E56915L53545k01667J68903j06090B11474M42993j70119J10559K18202l57260
$$ 556915 910460 708793 877696 771606 211474 654467 484348 594907 813109 455849
14749D55849K82891j82306j81837J77681J42256l1079n7342J89026j6146M8099
$$ 455849 738740 556434 374597 552278 694534 663455 606113 795139 778993 827092
14739H27092j47995R6876q3597L66012o0804m83550J94200j17955K09168J28118
$$ 827092 679097 775973 692376 1058388 997584 514034 708234 590279 799447 927565
14729I27565m16036M30202k40710m8467L11962k34694K04476m0745l37045J69652
$$ 927565 511529 941731 701021 652554 964516 729822 934298 893553 556508 726160
14719G26160K15351J89074l50970K4459M17576m17509J25051j46739n7754k03579
$$ 726160 941511 1130585 779615 804074 1221650 804141 929192 782453 724699 521120
14709E21120M55565J20310m07939J07891K28078p0727j81760j65337L24640p0190
$$ 521120 976685 1096995 689056 796947 1025025 954298 772538 607201 931841 861651
14699H61651L21890l82870l8405o5172N9330M64359p6003l04812L63569k62587
$$ 861651 1183541 800671 762266 697094 756424 1220783 1144780 839968 1203537 940950
14689I40950q7828j5254M29360k07131k75545K57902K44585k36903k31673K83533
$$ 940950 853122 837868 1267228 1060097 784552 1042454 1287039 1050136 818463 1101996
14679A101996o2396j04745K48817n5286j36052N7764Q599J01824J87182j92687
$$ 1101996 1039600 934855 1183672 1128386 992334 1050098 1058697 1160521 1347703 1155016
14669A155016M0990m6172l53652j40921M21727J51107r4035J92493m70189M07675
$$ 1155016 1196006 1149834 796182 655261 1076988 1228095 1134060 1326553 856364 1264039
14659A264039k32829J13844p6562p5416K07839j30697R9271k26737K09493O0309
$$ 1264039 1031210 1145054 1068492 993076 1200915 1070218 1169489 942752 1152245 1212554
14649A212554R07j37693Q087J7099K51271r5800M1958k8049O2700j681m48417
$$ 1212554 1213461 1075768 1083855 1100954 1352225 1256425 1298383 1270334 1333034 1331353 882936
14638H82936O30027m04869L57285k99736J63830j41869J81579n5367k3879k72992
$$ 882936 1512963 1108094 1465379 1165643 1329473 1187604 1369183 1313816 1289937 1016945
14628A016945J03680N62548j70024J19341m82074J83258K20375o7638j52485K14784
$$ 1016945 1120625 1683173 1513149 1632490 1150416 1333674 1554049 1486411 1333926 1548710
14618A548710j76368l2788L22986j45896j0396K47875n51482N70061k08018k24100
$$ 1548710 1372342 1339554 1662540 1516644 1506248 1754123 1202641 1772702 1564684 1340584
14608A340584J31557K58685O995M2433J15056r6930j35824o7795P9181K95097
$$ 1340584 1472141 1730826 1737821 1780254 1895310 1798380 1662556 1594761 1673942 1969039
14598A969039p0019k9686k25584J39404l12773N18577j15386k70465j37294K72475
$$ 1969039 1899020 1869334 1643750 1783154 1470381 1988958 1873572 1603107 1465813 1738288
14588A738288J17529K90817j30592k76917J15977J68677J2476k65104M87496K4511
$$ 1738288 1855817 2146634 2016042 1739125 1855102 2023779 2036255 1771151 2258647 2283158
14578B283158l72996O7334J49950j56673J67870J6163q2917M10106k85480q7325
$$ 2283158 1910162 1977496 2127446 1970773 2138643 2154806 2071889 2481995 2196515 2109190
14568B109190J35837r625J9286J59256j64082O35420n36453L44444J46621q4166
$$ 2109190 2245027 2235402 2254688 2413944 2249862 2885282 2348829 2693273 2839894 2755728
14558B755728l1286M42732Q8825M99083K29990k76905O39215N98557Q35292J648296
$$ 2755728 2724442 3167174 3255999 3755082 3985072 3708167 4347382 4945939 5781231 7429527
14548G429527L199492R459342K0032545J1086091B1010647q975528E848855k256025
$$ 7429527 10629019 20088361 40120906 51206997 21010647 12035119 5848855 3592830
14540C592830r18230j03676k9187m64639K21082j73886K14036k92962L06199l04628
$$ 3592830 2674600 2570924 2541737 2077098 2298180 2124294 2338330 2045368 2351567 2046939
14530B046939L60370l85808j03587M30320R3301L1566l83029N31323p9597K11700
$$ 2046939 2407309 2021501 1917914 2348234 2441535 2473101 2090072 2621395 2541798 2753498
14520B753498j55118m45224K26983J97635j9412L67321l51507L41159j43018R1505
$$ 2753498 2598380 2153156 2380139 2577774 2558362 2925683 2574176 2915335 2772317 2863822
14510B863822J58375m15804L58216M8190J24879k64381J18251K81501j65900J72877
$$ 2863822 3022197 2606393 2964609 3012799 3137678 2873297 2991548 3273049 3107149 3280026
14500C280026j93511K86933m51186L37545J45498L55345m52605p440L23966K77209
$$ 3280026 3086515 3373448 2922262 3259807 3405305 3760650 3308045 3300605 3624571 3901780
14490C901780M8179j97192R5867o4124k70958J33568k1657K75619k7808J25586
$$ 3901780 3949959 3752767 3848634 3784510 3513552 3647120 3625463 3901082 3873274 3998860
14480C998860j907m32515N35840L8618L15969j99063N4959R1908J298J54280j76471
$$ 3998860 3996953 3564438 4100278 4138896 4454865 4255802 4310761 4402669 4403967 4558247 4381776
14469D381776J01857K09842m48842R44712o44318N13086j48506K80229k23298
$$ 4381776 4483633 4693475 4244633 5189345 4545027 5058113 4909607 5189836 4966538
14460D966538k1693n8153L02754J59941R6232j15086J59083p0376J4916J71819
$$ 4966538 4944845 4886692 5189446 5349387 5445619 5330533 5489616 5419240 5434156 5605975
14450E605975M00664n67388O8690J14446M32683o642N4305K74756J44175m56591
$$ 5605975 6006639 5439251 5507941 5622387 6055070 6048428 6102733 6377489 6521664 6065073
14440F065073M00835K93062k07050m34549N45219o0146j5192O83911n34592J22645
$$ 6065073 6465908 6758970 6551920 6117371 6662590 6602444 6587252 7271163 6736571 6859216
14430F859216K08505J73467K63637m0866L06928n1556M55119o05293N56289k75067
$$ 6859216 7067721 7241188 7504825 7463959 7770887 7719331 8174450 7569157 8125446 7850379
14420G850379J34142N67552Q1627M2122L39831J38359j38633M96632m06661M06323
$$ 7850379 7984521 8552073 8633700 8675822 9015653 9154012 9015379 9512011 9105350 9511673
14410I511673O5798Q159K7703M88370J18962K71514j66181J61108M58472L11379
$$ 9511673 9577471 9585630 9613333 10101703 10220665 10492179 10325998 10487106 10945578 11256957
14400A1256957k47910L44068J25321J0580O02098J14403K7248J52614O36526j94444
$$ 11256957 11009047 11353115 11478436 11489016 12091114 12205517 12232765 12385379 13021905 12827461
14390A2827461O57610k13377N37903n4910K48926K59323M07870J1954L45168J90325
$$ 12827461 13485071 13271694 13809597 13754687 14003613 14262936 14670806 14682760 15027928 15218253
14380A5218253O51343J05356J06094M77553L75243Q4849N60706J69862J73746
$$ 15218253 15869596 15974952 16081046 16558599 16933842 17018691 17579397 17749259 17923005
14371A7923005P25194L45279K49423N38990K39644O95065K56269M92312N38351
$$ 17923005 18648199 18993478 19242901 19781891 20021535 20716600 20972869 21465181 22003532
14362B2003532O6320L09935J133566K15736N97890L78413M86312R76784K47635
$$ 22003532 22069852 22379787 23513353 23729089 24326979 24705392 25191704 26168488 26416123
14353B6416123K79346J089785R14242Q07985J35909J006982N96805Q46976P42416
$$ 26416123 26695469 27785254 28699496 29507481 29643390 30650372 31247177 32094153 32836569
14344C2836569J220026O91609P82764J086853R31684J186828R05746R19879J168866
$$ 32836569 34056595 34748204 35530968 36617821 37549505 38736333 39642079 40561958 41730824
14335D1730824J189747J309449J320067J532487J205091J420176J383115K081659
$$ 41730824 42920571 44230020 45550087 47082574 48287665 49707841 51090956 53172615
14327E3172615J308247J707576J892222K032758J975021J841713K625464K378695
$$ 53172615 54480862 56188438 58080660 60113418 62088439 63930152 66555616 68934311
14319F8934311K062417K891810K902511K579365K825760L671910K765240L587383
$$ 68934311 70996728 73888538 76791049 79370414 82196174 85868084 88633324 92220707
14311I2220707L883438M008180M055366M265066M683506M452420N531285N086179
$$ 92220707 96104145 100112325 104167691 108432757 113116263 117568683 123099968 128186147
14303A28186147N560690O227751O076533O649618P238639P485505Q218146Q518093
$$ 128186147 133746837 139974588 146051121 152700739 159939378 167424883 175643029 184161122
14295A84161122R239835R073599J0256349J0433178J0905847J1705707J1784987
$$ 184161122 193400957 202474556 212730905 223164083 234069930 245775637 257560624
14288B57560624J3119003J3319775J3742631J4096311J4600218J4835506J5120057
$$ 257560624 270679627 283999402 297742033 311838344 326438562 341274068 356394125
14281C56394125J4917345J5174314J4460146J4404848J3434449J2432618J1462512
$$ 356394125 371311470 386485784 400945930 415350778 428785227 441217845 452680357
14274D52680357R814075P606939N100254O94447k04511Q52681l533055m074497
$$ 452680357 462494432 470101371 475201625 475896072 475691561 476544242 473011187 468936690
14266D68936690p326204q460252r957183j1504349j2724017j3893085j4945905
$$ 468936690 461610486 453150234 443193051 431688702 418964685 405071600 390125695
14259C90125695j5540075j5806227j6142598j5476425j5605139j4336889j3524074
$$ 390125695 374585620 358779393 342636795 327160370 311555231 297218342 283694268
14252B83694268j3587195j3385216j2852390j2206155j1083929j0596682j0541543
$$ 283694268 270107073 256721857 243869467 231663312 220579383 209982701 199441158
14245A99441158r419316q790169q544997q074655p637691p183371o888550o000915
$$ 199441158 190021842 181231673 172686676 164612021 156974330 149790959 142902409 136901494
14237A36901494n834518n495109n806589n166168m833705m266743l650079m012889
$$ 136901494 131066976 125571867 119765278 114599110 109765405 105498662 101848583 97835694
14229I7835694m312320l608333l566458l502933k642372l147047k867392k394432
$$ 97835694 93523374 89915041 86348583 82845650 80203278 77056231 74188839 71794407
14221G1794407k558531k019749k520357k248663k230496j499423k046524j553692
$$ 71794407 69235876 67216127 64695770 62447107 60216611 58717188 56670664 55116972
14213E5116972j317663j937147j934704j497175j279484j054837j203614p50700
$$ 55116972 53799309 51862162 49927458 48430283 47150799 46095962 44892348 44141648
14205D4141648j528559j531944j245622j079467p04591o87675j846773k58351
$$ 44141648 42613089 41081145 39835523 38756056 38051465 37363790 35517017 35258666
14197C5258666j408940o41204j007714n73123j075626p08615l86766p59026p68603
$$ 35258666 33849726 33208522 32200808 31627685 30552059 29843444 29456678 28697652 27929049
14188B7929049n02677m78044j069503n10318o51774n63781n17959n14628m20230
$$ 27929049 27426372 26948328 25878825 25368507 24716733 24152952 23634993 23120365 22700135
14179B2700135k21923p57945l19901o94809k08124m41000j69122k01006r04904
$$ 22700135 22478212 21720267 21400366 20705557 20497433 20056433 19887311 19686305 18781401
14170A8781401p5625p36671N4430m52506k91916o53604L50832n12377l57874l54591
$$ 18781401 18705776 17969105 18023535 17571029 17279113 16625509 16976341 16463964 16106090 15751499
14160A5751499l24073l64420k01510n1685n00130n4749k53311o08859l74l23529
$$ 15751499 15427426 15063006 14861496 14809811 14309681 14254932 14001621 13392762 13392388 13068859
14150A3068859J45274m84341j02095l77642N25699n81358m10298j34258j75566
$$ 13068859 13214133 12729792 12627697 12250055 12775754 12194396 11784098 11649840 11474274
14141A1474274r1772j44754k40054j46931l55852J07002j82791k44345m65655
$$ 11474274 11382502 11237748 10997694 10850763 10494911 10601913 10419122 10174777 9709122
14132I709122L66395l33915k39935m2276O6957j65244j40893k74907j43760J73636
$$ 9709122 10075517 9741602 9501667 9459391 9526348 9361104 9220211 8945304 8801544 8975180
14122H975180j56163k16479O9256m20821r9383j61554l6338L1816n20625j41040
$$ 8975180 8819017 8602538 8671794 8250973 8151590 7990036 7953698 7985514 7464889 7323849
14112G323849M2004O6881p9453n1291M5096j98816k10204j31437k5201P8054o9978
$$ 7323849 7365853 7432734 7353281 7301990 7347086 7148270 6938066 6806629 6781428 6859482 6789504
14101F789504k37296K03165l26797k65577L89317l4349m32741p7334J98113q0920
$$ 6789504 6552208 6755373 6428576 6162999 6552316 6517967 6085226 6007892 6206005 6125085
14091F125085l02552l36173M57005j02274k20268m80552N31914k38801J29754
$$ 6125085 5822533 5486360 5943365 5841091 5620823 5140271 5672185 5433384 5563138
14082E563138k42366j82598j38123K80793r5529p5449j22244K8263o7121k88253
$$ 5563138 5320772 5138174 5000051 5280844 5185315 5109866 4987622 5015885 4948764 4660511
14072D660511K36541j10953J23405m95721m1417K65569j48909K31150n5631k71690
$$ 4660511 4897052 4786099 4909504 4413783 4372366 4637935 4489026 4720176 4664545 4392855
14062D392855k5337R0942o68197L12796L04095J48048j1054m01442n2024p0903
$$ 4392855 4367518 4458460 3790263 4103059 4407154 4555202 4544148 4142706 4090682 4019779
14052D019779R5444k35171j66941J94046J53552j95464r9716k5260j91899K94804
$$ 4019779 4115223 3880052 3713111 3907157 4060709 3865245 3765529 3740269 3548370 3843174
14042C843174J22760k37545k91807K8998J31262J2244k83575K83125n35965M39174
$$ 3843174 3965934 3728389 3436582 3465580 3596842 3609086 3325511 3608636 3072671 3511845
14032C511845j16642o6810J34932k37542L5183K14930m56932P3517Q8650m49127
$$ 3511845 3395203 3328393 3463325 3225783 3260966 3475896 3018964 3092481 3181131 2732004
14022B732004L98L45826J85462l20529J03513j73172J23470j18993k2549k4890
$$ 2732004 2732402 3078228 3263690 2943161 3046674 2873502 2996972 2877979 2855430 2830540
14012B830540n04682J43082K27827j85484J34459m16846M57278J29361k95685
$$ 2830540 2325858 2468940 2696767 2511283 2645742 2228896 2686174 2815535 2519850
14003B519850J54383k49247L32892j17318j52586q527J56851m69265N2190M64428
$$ 2519850 2674233 2424986 2757878 2640560 2487974 2479447 2636298 2167033 2219223 2683651
13993B683651r9473l58768p8504M28022Q51278K134520P045286J8989183K2960017
$$ 2683651 2584178 2225410 2146906 2574928 3426206 5560726 12606012 31595195 54555212
13984E4555212B6983295j3400173m967535j958902j360799m31425q89377m20109
$$ 54555212 26983295 13583122 8615587 6656685 5295886 4864461 3975084 3554975
13976C554975Q368j89172m87697k52772J70472J27627j17684j86741J7541K06458
$$ 3554975 3563343 3374171 2886474 2633702 2804174 2931801 2814117 2627376 2644917 2851375
13966B851375j18789m55975K18467n3078j33720N7652l34946M68233k69548L0660
$$ 2851375 2732586 2276611 2495078 2442000 2308280 2365932 2030986 2499219 2229671 2260331
13956B260331l1202k7571O4819n5462k92938J75898J71089j4791j22217J66929
$$ 2260331 2229129 2201558 2266377 2210915 1917977 2093875 2264964 2250173 2127956 2294885
13946B294885k46680K81695q30945M00397j05298L2916J71431n0022L11878n07679
$$ 2294885 2048205 2329900 1498955 1899352 1794054 1826970 1998401 1948379 2260257 1752578
13936A752578J39942q6387L9887j24392o3350K21690l33734K97704l9937j544
$$ 1752578 1892520 1806133 1846020 1721628 1658278 1879968 1546234 1843938 1804001 1802457
13926A802457j37181L74441m63138K5765r9387J74903L03040n43721Q7483l699
$$ 1802457 1665276 2039717 1576579 1602344 1502957 1677860 1980900 1437179 1524662 1520963
13916A520963L43574j68162M6865j12344l5365Q2334j71875m7592q6223L24194
$$ 1520963 1864537 1696375 1743240 1630896 1595531 1677865 1505990 1458398 1372175 1696369
13906A696369j83991M2970J75398Q3858j61259j81647j73752J68265N2985m23262
$$ 1696369 1512378 1555348 1730746 1814604 1653345 1471698 1297946 1466211 1519196 1095934
13896A095934M71211l48569J45244J68093p987m9965j49258L20907j65422r4997
$$ 1095934 1567145 1218576 1363820 1531913 1523926 1473961 1324703 1645610 1480188 1385191
13886A385191q4340P5000j34230m4478j67316M07273j68227J24988o3455K37428
$$ 1385191 1300851 1375851 1241621 1197143 1029827 1437100 1268873 1393861 1330406 1567834
13876A567834p3260n67738J82983K86990J52157l25212K09447j65448N0983Q6792
$$ 1567834 1494574 926836 1109819 1396809 1548966 1223754 1433201 1267753 1318736 1405528
13866A405528j00274Q1127m39226L16769R0538j56214N1005l8697R1033l94596
$$ 1405528 1305254 1386381 947155 1263924 1354462 1198248 1249253 1210556 1301589 906993
13856I06993P9595K7790j51235K57744K23707j21263q0105R2011j31272j10961
$$ 906993 986588 1014378 863143 1120887 1344594 1223331 1143226 1235237 1103965 993004
13846I93004k46877J38387M33250j43461q6672Q4612l8589n4765j6696J62053
$$ 993004 746127 884514 1317764 1174303 1087631 1172243 1133654 1078889 1062193 1224246
13836A224246K6274l02533n5039J00580k25739J67942l06967M43742j67886J56531
$$ 1224246 1250520 947987 892948 993528 767789 935731 628764 1072506 904620 1061151
13826A061151l81411K45864j69969l1908K34322K84416j75860l25536j01431K87476
$$ 1061151 679740 925604 755635 723727 958049 1242465 1066605 741069 639638 927114
13816I27114N1481J377n8457K18860j95652j15922O61448p18836K08870j44761
$$ 927114 978595 979972 921515 1140375 944723 828801 1490249 771413 980283 835522
13806H35522J75331j51146K60227n06027j868M24217o8515j08648k184j35312
$$ 835522 1010853 859707 1119934 613907 612039 1036256 967741 859093 856909 721597
13796G21597K92427j38999J92605k47175N0010n1083L6202j32201P2892P118N2753
$$ 721597 1014024 875025 1067630 820455 870465 819382 855584 723383 796275 803393 856146
13785H56146k19873K05717j08715K3648K0566J40054o0326j52320R2027L29489
$$ 856146 636273 841990 733275 756923 777489 917543 857217 704897 796924 1126413
13775A126413k60189k11117j04271m2830L64916k02572J26625L2261j62685K27963
$$ 1126413 866224 655107 550836 508006 872922 670350 796975 829236 666551 894514
13765H94514q9636J45534l42475l8832J77676o5794J16293j09889n0190q6794
$$ 894514 804878 950412 607937 569105 746781 680987 797280 687391 637201 550407
13755E50407p016L58039k51682j30462N35435k13685K22543k72278r5080k13181
$$ 550407 543391 901430 649748 519286 1054721 841036 1063579 791301 696221 483040
13745D83040J09616J11087q8042j98603j5157L65118q7134o6789p1465k0292J62843
$$ 483040 592656 703743 615701 417098 401941 767059 679925 613136 541671 521379 684222
13734F84222k5435j17566J57794k86590J62727l4941L21593k32331k36216J45714
$$ 684222 658787 541221 699015 412425 575152 540211 861804 629473 393257 538971
13724E38971J06428j29945m4984L02460k25717r8750R9579k10786L36903J53857
$$ 538971 645399 515454 470470 772930 547213 448463 548042 337256 674159 828016
13714H28016j53443j54926M10528B72737J91420Q6014k55542K07912A92314P52522
$$ 828016 674573 519647 930175 272737 464157 550171 294629 502541 192314 944836
13704I44836k98609j31460J22467J31477C76455J85457B21912J43526J0129M1736
$$ 944836 646227 514767 637234 768711 376455 561912 221912 365438 375567 417303
13694D17303L23284l60659L22213q9024N8299l31005K08825j35664m862K66319
$$ 417303 740587 379928 702141 613117 671416 340411 549236 413572 408710 675029
13684F75029j71363O7062K06707j45505r458J82778j89689K19551l69231J54015
$$ 675029 503666 570728 777435 631930 622472 805250 615561 835112 465881 619896
13674F19896j42760J13690r7929A98162K85956j09099K24988L59235l50296p1705
$$ 619896 477136 590826 492897 198162 484118 375019 600007 959242 608946 537241
13664E37241J26892J53854C63878j60838O32250j64624p8542J16508j47960L6698
$$ 537241 664133 817987 363878 203040 835290 670666 592124 708632 560672 597370
13654E97370M92k52052j66195q9267M07765R8402j73027N4020J37847A35147L09050
$$ 597370 597862 345810 179615 90348 498113 596515 423488 477508 615355 135147 444197
13643D44197p8994j21113K21335K11572B98351j38248L30893L38500A12049K01243
$$ 444197 365203 244090 465425 676997 298351 160103 490996 829496 112049 313292
13633C13292k278L01957j63698L8379j11412L93566C63021j63638J13733p5907
$$ 313292 311014 612971 449273 487652 376240 769806 363021 199383 313116 237209
13623B37209o2760L57490A31531J36107K59208j59550O8433n0643P0763P7676
$$ 237209 174449 531939 131531 267638 526846 367296 435729 385086 455849 533525
13613E33525A31247J22957M12572J02360B74699M61315k44446B14892K79192B1678
$$ 533525 131247 254204 666776 769136 274699 736014 491568 214892 494084 21678
13602c6895E70466N8272A22261K73294J40942k27208L6061J12618j5732n6238
$$ -36895 570466 628738 122261 395555 536497 309289 345350 457968 442236 385998
13592C85998J15869j10445J61463j02574m895j78148R4085j28052K45979R1406
$$ 385998 501867 391422 552885 450311 445416 267268 361353 233301 479280 570686
13582E70686j04784L9803k32537K17054j8934j52939P3554J39370j03127C9512
$$ 570686 465902 505705 273168 490222 471288 318349 391903 531273 428146 39512
13571F21518B74408A34637L82450k51534E6835J26529L25329A13643K5714O7488
$$ 621518 274408 134637 517087 265553 56835 183364 508693 113643 139357 206845
13561B06845J97594A08316M74446j51286A34794J16365N5352F4134K63491M7138
$$ 206845 404439 108316 582762 431476 134794 251159 306511 64134 327625 374763
13551C74763m5885L4766Q888j18340K9719J29916J0792j85457L77552A29535J53856
$$ 374763 328878 363644 372532 254192 283911 413827 424619 239162 616714 129535 283391
13540B83391l0930Q9095k7308L9852k7028J25895K6758j13104J86316k68132I6760
$$ 283391 252461 341556 314248 354100 327072 452967 479725 366621 552937 284805 96760
13528B88215J26656j89289Q1374o9581N0585K75625c017B70871J10006Q2982r7959
$$ 288215 414871 225582 306956 237375 287960 563585 -3017 270871 380877 463859 365900
13517C65900m4769a56647E30467B51505k4828J23739j22592p812L70214A62816
$$ 365900 321131 -156647 530467 251505 226677 350416 227824 220012 590226 162816
13506C96567A74051K61232B6119Q2551J42055j18566B4725L85261D4076J10812
$$ 396567 174051 435283 26119 108670 250725 132159 24725 409986 44076 154888
13496A54888J75873K63614k53393j54726K85863L70568C58073R2399o0700j12627
$$ 154888 330761 594375 340982 186256 472119 842687 358073 450472 389772 277145
13486B77145K62566o8014A52119K22093A27740D8788J90120L14551A35786K50758
$$ 277145 539711 471697 152119 374212 127740 48788 238908 553459 135786 386544
13476C86544o9534N3087j43893J63162G4152Q2594L18286A67944N0975M875J67451
$$ 386544 317010 370097 226204 389366 74152 156746 475032 167944 218919 223794 391245
13465C91245m1556b0749C31777j00682M01483g921C37684j5074M4331a0279C4936
$$ 391245 349689 -20749 331777 231095 632578 -7921 337684 322610 366941 -10279 34936
13453B47800L27803k14459Q0427k1547j77107j21055K75053A49366J06240K4388
$$ 247800 575603 361144 441571 420024 242917 121862 396915 149366 255606 279994
13443B79994j04565p2848Q7368Q1085p0499J09767j13026A5465N66079A86872
$$ 279994 175429 102581 189949 271034 200535 310302 197276 15465 581544 186872
13432B40362R2709A11269J96226f3725A71187B9960J77116d4056A25093E8879
$$ 240362 333071 111269 307495 -63725 171187 29960 207076 -44056 125093 58879
13421B87709J18274A32527p939a40325b9751A42272F5021J46699K50278j22232
$$ 287709 405983 132527 124588 -140325 -29751 142272 65021 211720 461998 339766
13411C39766J40400C2648K60693K47618A25001J31708M2160f7688a2884l3516
$$ 339766 480166 32648 293341 540959 125001 256709 298869 -67688 -12884 -46400
13401d6400D21334A2970b7062D29866N885k03780O7329j5702o5313c444B65610
$$ -46400 421334 12970 -27062 429866 435751 231971 299300 283598 218285 -3444 265610
13389A82044J1925J14354F8322K59118j30981G1398K00697j23589K43364C806
$$ 182044 193969 308323 68322 327440 196459 71398 272095 148506 391870 3806
13378A65652K79786A67915K39239o7823J78305m8626A44248O5915Q7218O9005
$$ 165652 445438 167915 407154 339331 517636 469010 144248 210163 297381 366386
13368C66386a6732B30481J84617j13115l2033K87125A67284M6145m3466J97556
$$ 366386 -16732 230481 415098 301983 269950 557075 167284 213429 169963 367519
13358C67519l9070f1805B72074j32137n7138K30567D0511a18664B71326K5637
$$ 367519 328449 -61805 272074 139937 82799 313366 40511 -118664 271326 296963
13348B96963J09603j13759A32425J2802j847J56042j0061C7521M94641c8354C7938
$$ 296963 406566 292807 132425 145227 143380 299422 289361 37521 532162 -38354 37938
13336B9208K40518J1234h904D24347A61977Q2236J54957j60687M5698A8864Q0849
$$ 29208 269726 280960 -8904 424347 161977 244213 399170 238483 284181 18864 99713
13325I9713K63128R8549A67325E1753I379K70998J11773p6784A12115b6660A84349
$$ 99713 362841 461390 167325 51753 9379 280377 392150 315366 112115 -26660 184349
13313B88083J05355j9890M1604j63601j10080J01128a73208E40J71010K03334
$$ 288083 393438 373548 415152 251551 141471 242599 -173208 540 171550 374884
13303C74884A63207d5905A40315O0757D1246a38191b4261B04316Q5137L8742F5939
$$ 374884 163207 -45905 140315 201072 41246 -138191 -24261 204316 289453 328195 65939
13291F7593i9694A20412O9167R5258A26275M09333H3772P0053a4353E024K90585
$$ 67593 -99694 120412 189579 284837 126275 535608 83772 153825 -14353 5024 295609
13280B95609G8865J92097A33362M127J36923E0576J39523R724O1819k9902J58854
$$ 295609 78865 270962 133362 137489 274412 50576 190099 199823 261642 231740 390594
13269C90594b8434A61959K19610j17075r2266J01830D5142B2438K79193c4547
$$ 390594 -28434 161959 381569 264494 172228 274058 45142 22438 301631 -34547
13258D24256A23674J32843A2038M29049A27311J48130r8977g7221j47688P3958
$$ 424256 123674 256517 12038 441087 127311 275441 176464 -77221 -224909 -150951
13248a50951A0682J13851L5469J34293H0625a78707P8180j9401I971a28544A0053
$$ -150951 10682 124533 160002 294295 80625 -178707 -100527 -119928 9971 -128544 10053
13236A1234P536d0581E10551j26682A07592J09724B0846J41602K28889j49801
$$ 11234 18770 -40581 510551 383869 107592 217316 20846 162448 391337 241536
13226B41536B6184g3576j25694J4361d4186D20549G6684J13879N967C5431K11749
$$ 241536 26184 -73576 -199270 -184909 -44186 420549 76684 190563 196530 35431 247180
13215B47180a13674B00074c29365A74835j450E567B77a50468a1918B36954O8948
$$ 247180 -113674 200074 -329365 174835 173385 5567 277 -150468 -11918 236954 305902
13204C05902M5815c6060A88874g0778A36022a96577A88298J2166r3898K57715
$$ 305902 351717 -36060 188874 -70778 136022 -196577 188298 200464 106566 364281
13194C64281J66457r8626E8467Q3738Q9092N0925E9561e6005C8165L06554i6883
$$ 364281 530738 432112 58467 142205 231297 282222 59561 -56005 38165 344719 -96883
13182H9421J75195A19574a32607M0582B79390H3746J59784n4022o2060o2890O621
$$ 89421 264616 119574 -132607 -92025 279390 83746 243530 189508 127448 64558 71179
13171G1179K67795E6620O09161A41206C4881M21952m9794j60366G1539A9850L3388
$$ 71179 338974 56620 665781 141206 34881 456833 407039 246673 71539 19850 53238
13160E3238J92058l3640r1249H321J57834N8315E4440J53524a23390I8203J97689
$$ 53238 245296 211656 120407 8321 166155 224470 54440 207964 -123390 98203 295892
13149B95892l8855j14273D3931A0475J75068n946K43099a0636j3714D5200h5120
$$ 295892 257037 142764 43931 10475 185543 179597 422696 -10636 -24350 45200 -85120
13137A02631K49863g3512C14304A9347c869A28802L1969a29847A53460g3029B11056
$$ 102631 352494 -73512 314304 19347 -3869 128802 160771 -129847 153460 -73029 211056
13125B005c9309j92842D31608p5128a27248O2749C33712a87026B48828C243a51230
$$ 2005 -39309 -232151 431608 356480 -127248 -64499 333712 -187026 248828 3243 -151230
13113B20b67302C8385L1381B1144a64793Q0558o9037D27440r5964H2382A9709
$$ 220 -267302 38385 69766 21144 -164793 -84235 -153272 427440 331476 82382 19709
13101E3644K33040j06755K5990a55686B30953b24338Q0207N9266A96472D1056
$$ 53644 286684 179929 205919 -155686 230953 -224338 -144131 -84865 196472 41056
13090G4732P5774c4856B35696m3717l4987k5265M517a07755j50431B02980K39492
$$ 74732 150506 -34856 235696 191979 156992 131727 136244 -107755 -258186 202980 442472
13079D42472c0150D51282A29092K76749j83712M6282l6312K21678j25034A11732
$$ 442472 -30150 451282 129092 405841 222129 268411 232099 453777 328743 111732
13068a38977a2419A50015J14345C5985K8451k1505M03794j16352A38760m4756
$$ -138977 -12419 150015 264360 35985 64436 42931 446725 330373 138760 94004
13058I4004k9714c0570A0472M6311K22564j4999I5017f6430N082b9544A22413
$$ 94004 64290 -30570 10472 56783 279347 264348 95017 -66430 -61348 -29544 122413
13046I7875g2320D35008A04570A4415L73784C2798H046M41554a86741B36328A8894
$$ 97875 -72320 435008 104570 14415 388199 32798 8046 449600 -186741 236328 18894
13034a82679A51198i012n2393k9591d1319G2904A9770h5498C40038f8634R850
$$ -182679 151198 -9012 -61405 -90996 -41319 72904 19770 -85498 340038 -68634 -58784
13023e8784k30243C6005M6481f655k57615C37650F8689P1976j4183K59251K0748
$$ -58784 -289027 36005 82486 -6655 -264270 337650 68689 140665 126482 385733 406481
13012D06481j93519R0860D1731J00448D4887L64104j93125j01619K18240J02282
$$ 406481 212962 303822 41731 142179 44887 408991 215866 114247 332487 434769
13002D34769P541H5738J57066A15085J94351L5255j48625K8041R6625H1681b34522
$$ 434769 442310 85738 242804 115085 309436 344691 196066 224107 320732 81681 -234522
12990H197c4613j82768B45093a69327o2347A87580n7873Q7248I6694a16492b1179
$$ 8197 -34613 -217381 245093 -169327 -231674 187580 129707 216955 96694 -116492 -21179
12978b02958B20086I2809D346J50097a24987A07161e7633G0057N152A0149J31424
$$ -202958 220086 92809 4346 154443 -124987 107161 -57633 70057 75209 10149 141573
12967A41573K02343A47732D6757J10202d8657C92378j93109b00369K664B34796
$$ 141573 343916 147732 46757 156959 -48657 392378 199269 -200369 -197705 234796
12956f0486q3242B01298k2622m4165g209A25024m0351N0043J4674a84448m8685
$$ -60486 -143728 201298 178676 134511 -7209 125024 84673 134716 149390 -184448 -233133
12945b33133j90565E0797M4466a45298m4189N3589B37113m2075q3005h6340I8511
$$ -233133 -423698 50797 95263 -145298 -189487 -135898 237113 195038 112033 -86340 98511
12933B99679F0108e4470J3525r5827j18367a11978C73034b13379A06703D4868
$$ 299679 60108 -54470 -40945 -136772 -255139 -111978 373034 -213379 106703 44868
12922b77880C95a7420B35151h3053B18479k9225a91030R5461A62601c81903A58452
$$ -277880 395 -17420 235151 -83053 218479 189254 -191030 -95569 162601 -381903 158452
12910A06803R31K04469E4108J62700b8250B51415D496K70978a29841B29593j1593
$$ 106803 107734 312203 54108 216808 -28250 251415 4496 275474 -129841 229593 218000
12899B18000k2901n1266N6585n0781a14292A58860g8971D88592D5914Q0524N3773
$$ 218000 195099 143833 200418 149637 -114292 158860 -78971 488592 45914 126438 180211
12888A80211a15556A84625d8178C12371g0632B03049d4736k51158b3333A72858
$$ 180211 -115556 184625 -48178 312371 -70632 203049 -44736 -295894 -23333 172858
12877e1741j60469C8425R4769L1049N2499A2135b21349J5152B05024P2829j30733
$$ -51741 -212210 38425 133194 164243 216742 12135 -221349 -206197 205024 277853 147120
12866A47120f8319E20917A27482b40981e6148D69608I4451J5350k82E3237b9682
$$ 147120 -68319 520917 127482 -240981 -56148 469608 94451 109801 109519 53237 -29682
12854c7188j10612B64981j31736K59957j51476D5101M6315J25284e3812A5483
$$ -37188 -147800 264981 133245 393202 241726 45101 91416 216700 -53812 15483
12843C66548d7581A24678j4853g376b790H8027d7649B74087e0010k15397A64291
$$ 366548 -47581 124678 109825 -7376 -2790 88027 -47649 274087 -50010 -265407 164291
12831h0176B01458I1558a62117A35378R750D2188b44882A12583L97419a80041
$$ -80176 201458 91558 -162117 135378 145128 42188 -244882 112583 510002 -180041
12820F1495a29175B22075M8139b4057r1078j77477B2440a42048j16326o7021B65332
$$ 61495 -129175 222075 270214 -24057 -115135 -292612 22440 -142048 -258374 -325395 265332
12808a35300H7937J90185d90455B16865a61859D4142a6926k3609A24531b8959
$$ -135300 87937 278122 -490455 216865 -161859 44142 -16926 -40535 124531 -28959
12797H1030R6562F8627A0140g5129p7850M6270M3869k02619b1588o3452A28695
$$ 81030 177592 68627 10140 -75129 -152979 -106709 -62840 -265459 -21588 -85040 128695
12785i9940n580D3725e2325j36133i3109D872g6484K3600q0496n2625k0264M0382
$$ -99940 -105520 43725 -52325 -188458 -93109 4872 -76484 -52884 -133380 -186005 -206269 -165887
12773a65887d5729p945B78593C5379d9610j9062o6634F4879b48947R2454P2959
$$ -165887 -45729 -53674 278593 35379 -49610 -68672 -135306 64879 -248947 -156493 -83534
12762h3534A61008b26956E7564B7687M6537C1975K46970F5916b839B25663a36950
$$ -83534 161008 -226956 57564 27687 74224 31975 278945 65916 -2839 225663 -136950
12750A16768b51993E9023c42413g3642k2592B11176a86252B36047q4108d735A4502
$$ 116768 -251993 59023 -342413 -73642 -96234 211176 -186252 236047 151939 -4735 14502
12738C64287a34863D65662B14427l852k7047B4332A1648a95888B6219Q7050l0895
$$ 364287 -134863 465662 214427 210575 183528 24332 11648 -195888 26219 113269 82374
12727H2374a87796I7218c78500B5478J75789r6932C1396e1655A95870p4677c7139
$$ 82374 -187796 97218 -378500 25478 201267 104335 31396 -51655 195870 121193 -37139
12715b55322J14284K0213B82470J5180j04893h2993A74460J87737A43383A148
$$ -255322 -141038 -120825 282470 297650 192757 -82993 174460 362197 143383 1148
12704B76457f1915A62464J37102j4833H9162K7861J99659B6572N5519K02136o4152
$$ 276457 -61915 162464 299566 284733 89162 117023 316682 26572 82091 284227 220075
12693B20075D1474N61450A84231H8788C9920a6764A74101q2650k4313a56505o4141
$$ 220075 41474 602924 184231 88788 39920 -16764 174101 91451 67138 -156505 -220646
12682b20646A67560k7200A7338J80309R7080D3481i9668F9936B2943L0814b1038
$$ -220646 167560 140360 17338 197647 294727 43481 -99668 69936 22943 53757 -21038
12670E3026g3761B23052d2839C10708A7488K74728j27519g1073E67b48964B14282
$$ 53026 -73761 223052 -42839 310708 17488 292216 164697 -71073 567 -248964 214282
12658a7100j1833k02422D9328f4010C30640F526J84194A6364J92715E6339a56602
$$ -17100 -28933 -231355 49328 -64010 330640 6526 190720 16364 209079 56339 -156602
12646h0942b0472F0242f5478B00612J12651D1391K87459J10577j0640F8509J26201
$$ -80942 -20472 60242 -65478 200612 313263 41391 328850 439427 428787 68509 194710
12635A94710q6766K20303a5995C54090J18187k3425B04930K97052B11546d1045
$$ 194710 107944 328247 -15995 354090 472277 448852 204930 501982 211546 -41045
12624B20042K44146B08059N2489j09889N1714P9753I0569K44253C6466J9685a69409
$$ 220042 464188 208059 260548 150659 202373 282126 90569 334822 36466 56151 -169409
12612A33922j537J06570B3801J36427E0199J86123g4208K9761A06179j1971C2098
$$ 133922 132385 238955 23801 160228 50199 236322 -74208 -44447 106179 94208 32098
12600d0579B76219R3292j76961b9963A0632J24466k4647Q9568i9890A29838a38730
$$ -40579 276219 369511 192550 -29963 10632 135098 110451 200019 -99890 129838 -138730
12588c0960j61209B78077j15805L624b72085A57510K5546b68066A05530P6796
$$ -30960 -192169 278077 162272 165896 -272085 157510 183056 -268066 105530 182326
12578A82326k2981B215N0065g9080r8164L6750C402J93416f1466D9812N4370a19848
$$ 182326 159345 2215 52280 -79080 -177244 -140494 3402 196818 -61466 49812 104182 -119848
12565A28929J93620a84067L7241j21664b8237A7338e519j25706n5694B27398a5287
$$ 128929 322549 -184067 -146826 -268490 -28237 17338 -5519 -131225 -186919 227398 -15287
12553C24001L841H7178K81442c96824B06116a11748j22047l8469B30741b75466
$$ 324001 327842 87178 368620 -396824 206116 -111748 -233795 -272264 230741 -275466
12542d6753l4440j47292E70421a43562G1900b36841M7952B20185G9857b59457
$$ -46753 -81193 -228485 570421 -143562 71900 -236841 -188889 220185 79857 -259457
12531I021d7503C81904A88810C5386R840j8692i0913A14307d8012k77736E997
$$ 9021 -47503 381904 188810 35386 45226 26534 -90913 114307 -48012 -325748 5997
12519E9659Q4217A865K73173c24471F9642b8589j28834A44919J16802a4115A83916
$$ 59659 143876 1865 275038 -324471 69642 -28589 -157423 144919 261721 -14115 183916
12507A71178J65213A39289J51047a8456C0417a19689B64073D3629J24075b63949
$$ 171178 336391 139289 290336 -18456 30417 -119689 264073 43629 167704 -263949
12496E80951a3166H23d10215A86249a28510k4619b199A6352K01600i0788r2803
$$ 580951 -13166 823 -410215 186249 -128510 -153129 -2199 16352 217952 -90788 -183591
12485a83591f4755A50388d8274a877B9165c0667l4747C26880A05363d0212B79748
$$ -183591 -64755 150388 -48274 -1877 29165 -30667 -65414 326880 105363 -40212 279748
12473h2040K2080J6669C23616o4117a4250A05846b18782H8215a38514A32985a28940
$$ -82040 -59960 -43291 323616 259499 -14250 105846 -218782 88215 -138514 132985 -128940
12461b2320A29751a11556C56466d7661J871J7046B23522e46517F4805a67911K0303
$$ -22320 129751 -111556 356466 -47661 -45790 -28744 223522 -546517 64805 -167911 -147608
12450a47608R250B10512h852j52213B4986L66315D9243a14917A29851a90770J6815
$$ -147608 -138358 210512 -8852 -161065 24986 391301 49243 -114917 129851 -190770 -173955
12439a73955B4554P0377O3011p4271K17878F1446b27318m8206c1918F9473J2638
$$ -173955 24554 94931 157942 83671 301549 61446 -227318 -275524 -31918 69473 82111
12428H2111l355J25157K13436f3099A95050E2729b69775G6232b8840B42984B0072
$$ 82111 78756 203913 417349 -63099 195050 52729 -269775 76232 -28840 242984 20072
12416b20362a9022B08222I1276a42721A74023e8106D596e44793E4368b44370B7329
$$ -220362 -19022 208222 91276 -142721 174023 -58106 4596 -544793 54368 -244370 27329
12404A92146J36567j35587c10954A76827C545i831C50224o7769a18454K6970k92724
$$ 192146 328713 193126 -310954 176827 3545 -9831 350224 282455 -118454 -91484 -384208
12393c84208i7676F0148j875J49427b67016a02530F7389a64780I9231g526A80805
$$ -384208 -97676 60148 58273 207700 -267016 -102530 67389 -164780 99231 -7526 180805
12381i9407O266L7194C07278d0306a9901j39111f8862b4314A39728a17338N7090
$$ -99407 -93141 -55947 307278 -40306 -19901 -159012 -68862 -24314 139728 -117338 -60248
12370f0248B9036a27888m916B22770c5015K543h707B8159b14523k22046b00195
$$ -60248 29036 -127888 -132804 222770 -35015 -32472 -8707 28159 -214523 -436569 -200195
12358b43657J2060J2690A08738c21402f0314C67903a71454j48285F7449R5458
$$ -243657 -231597 -218907 108738 -321402 -60314 367903 -171454 -319739 67449 162907
12348A62907a9668I0363O1273b09050O9491a3868l8253A88069b41019R3623F0351
$$ 162907 -19668 90363 151636 -209050 -139559 -13868 -52121 188069 -241019 -147396 60351
12336a71493p2555e4677A03985M6748A7549J24892b52388g0982k7839L5391B22879
$$ -171493 -244048 -54677 103985 150733 17549 142441 -252388 -70982 -98821 -63430 222879
12324A06385K1798C371J47516M0882p9633m7676c8630C8108n143J7014a37247
$$ 106385 128183 3371 150887 191769 112136 64460 -38630 38108 32965 49979 -137247
12312A51953R1459A9523b9500n6337Q659B58723a22090l565A43808J10102b60406
$$ 151953 243412 19523 -29500 -85837 -77178 258723 -122090 -125655 143808 253910 -260406
12300b23902h501k05435j29744G5671e7973k6064H6196b50357C86194F7964a04649
$$ -223902 -8501 -213936 -343680 75671 -57973 -84037 86196 -250357 386194 67964 -104649
12288E925M48973g1392A66317A5931a96069d3198C03677A36970e9894n4296D12613
$$ 5925 454898 -71392 166317 15931 -196069 -43198 303677 136970 -59894 -114190 412613
12276G5195l337J68967J42750o7927i4688b0409H9608M107K62794a92064I5990
$$ 75195 71858 240825 383575 315648 -94688 -20409 89608 93715 356509 -192064 95990
12264B78227J71604I1368L6385a63669a7240A66546d6732A88043e6163j3478B54037
$$ 278227 449831 91368 127753 -163669 -17240 166546 -46732 188043 -56163 -69641 254037
12252F1136K24331b02886G0579M12291A84510m3393l9036K5554N8976P543H6063
$$ 61136 285467 -202886 70579 482870 184510 141117 102081 127635 186611 194154 86063
12240A43643a87907A04096K8056K49867A28348K15592q9533G9702J06008a52126
$$ 143643 -187907 104096 132152 382019 128348 343940 254407 79702 185710 -152126
12229F8470K75694c65462a71078H0459N15863B68413j9189h8365C28336K7389
$$ 68470 344164 -365462 -171078 80459 596322 268413 249224 -88365 328336 355725
12219C55725A05835J15611b4027D4219K04576L35209B30624K4043L8638b88121
$$ 355725 105835 221446 -24027 44219 248795 584004 230624 254667 293305 -288121
12208C15279H2151K17104n4564Q3842p1688a11524K2136C63740J4060M1521N9658
$$ 315279 82151 299255 244691 328533 256845 -111524 -89388 363740 377800 419321 478979
12197D78979c5647E7989L12377M0224j93702r9331O3316a80563G5529K08465j27276
$$ 478979 -35647 57989 370366 410590 216888 117557 180873 -180563 75529 283994 156718
12186A56718c17485b5911A52915J81091l3564c4441E6621o170O5793l1399A9219
$$ 156718 -317485 -25911 152915 334006 300442 -34441 56621 50451 116244 84845 19219
12174F6448a17379C02197e4039D23045C2111J25445l0184J03227P1347B6711L74674
$$ 66448 -117379 302197 -54039 423045 32111 157556 127372 230599 301946 26711 401385
12163D01385g065F2942a11377c7734B7954b39472A26046D4696N065K06680b4011
$$ 401385 -7065 62942 -111377 -37734 27954 -239472 126046 44696 49761 256441 -24011
12151A26554P8871a19128j64561b0948j85992c4379j52931E1985J23153D0971
$$ 126554 205425 -119128 -283689 -20948 -206940 -34379 -187310 51985 175138 40971
12140b39959B66044j15948J9142L335b4666f41m8994I955O8649J1063L8832j9914
$$ -239959 266044 150096 169238 172573 -24666 -641 -49635 9955 78604 89667 128499 108585
12128A08585e6468k17749b9478C03930K65130G9207K17107p538a16502G6037e05
$$ 108585 -56468 -274217 -29478 303930 569060 79207 296314 288776 -116502 76037 -505
12116b43402c5350j37874g8530j34325b498B35181B5236h0179j19697K3333b2388
$$ -243402 -35350 -173224 -78530 -212855 -2498 235181 25236 -80179 -199876 -176543 -22388
12104B66463F1006a75002H9450b22894m0673A09606b72747O5225A17746B996J53781
$$ 266463 61006 -175002 89450 -222894 -263567 109606 -272747 -207522 117746 2996 156777
12093A56777a96908B37588g8161b4564H3925c1937C66041g6719B43448b937o8220
$$ 156777 -196908 237588 -78161 -24564 83925 -31937 366041 -76719 243448 -2937 -71157
12082g1157A48480C5565K8187a66633J1746C59527l5955b45492c0987A3895J6286
$$ -71157 148480 35565 63752 -166633 -154887 359527 323572 -245492 -30987 13895 30181
12071C0181O24259P18341K67510F34620B14536B3562a42679b0564l1853D8383
$$ 30181 654440 1372781 1640291 634620 214536 23562 -142679 -20564 -52417 48383
12060h8154A54285I279O0998R671a12355B6165c34418C9034J47587a2314G7476
$$ -88154 154285 9279 70277 79948 -112355 26165 -334418 39034 186621 -12314 77476
12048I6806C81h4566k53432J2027J49713B30528d945A93638c50007E2902N0086
$$ 96806 381 -84566 -337998 -325971 -176258 230528 -4945 193638 -350007 52902 102988
12037A02988a11890B12531c24669a25438d6849b3415E2437J58195D8384a9471
$$ 102988 -111890 212531 -324669 -125438 -46849 -23415 52437 210632 48384 -19471
12026a11288d7909D8769a53891A3403P262J62491F8540J03478G7697a19425M2226
$$ -111288 -47909 48769 -153891 13403 20665 183156 68540 172018 77697 -119425 -77199
12015g7199A00306J23142f1185b064j45863L5659J364a1718k45208A42729a08183
$$ -77199 100306 223448 -61185 -2064 -147927 -112268 -110904 -11718 -256926 142729 -108183
12003D1287d8086A60318D6743j7369R51a84229C8405A7799E583K6977b3616j47577
$$ 41287 -48086 160318 46743 29374 30325 -184229 38405 17799 5583 32560 -23616 -171193
11991a71193A54396G5609M1109J46931K4007a19562H6730B9650b25906c0921B04797
$$ -171193 154396 75609 116718 263649 287656 -119562 86730 29650 -225906 -30921 204797
11979F7591b4550A19038k1701R7090a18029C7999M4905l0381b2105E7301N5165
$$ 67591 -24550 119038 97337 194427 -118029 37999 82904 52523 -22105 57301 112466
11968A12466B773a57885l27314a94026B84300b324j123A23839m7662R488o558
$$ 112466 2773 -157885 -485199 -194026 284300 -2324 -3447 123839 76177 85665 79107
11957G9107c9539k84702A98970r6565b40780O8184C95303A53028J79843D0324
$$ 79107 -39539 -324241 198970 102405 -240780 -172596 395303 153028 332871 40324
11946f1974A26312C9746Q8337b13329c6760m7887p6180f828A52823a22946m4147
$$ -61974 126312 39746 128083 -213329 -36760 -84647 -160827 -6828 152823 -122946 -167093
11935a67093A64974B7292g7547F5951k9300b55867k1387C77431c0098B45150Q6951
$$ -167093 164974 27292 -77547 65951 36651 -255867 -277254 377431 -30098 245150 332101
11924C32101c57953a6619o9049p6399J6802B50650o8008b89323b7004D13904i4683
$$ 332101 -357953 -16619 -85668 -162067 -145265 250650 182642 -289323 -27004 413904 -94683
11912C46657f7099k02769B6918J51938a09336D8109c33921P2395B71861a4248
$$ 346657 -67099 -269868 26918 178856 -109336 48109 -333921 -261526 271861 -14248
11901I7691R6793J11369f0610j72865I910h9348B3961A0503a49700j1807j00939
$$ 97691 194484 305853 -60610 -233475 9910 -89348 23961 10503 -149700 -161507 -262446
11890b62446o1674a32325C40911D2534c36554O747B73323L9900j38593a58756
$$ -262446 -324120 -132325 340911 42534 -336554 -329807 273323 313223 174630 -158756
11879C0960a3344o9219B61d0698k84376J5132g484j20342M6224m3836N7383A41309
$$ 30960 -13344 -82563 261 -40698 -325074 -309942 -7484 -127826 -81602 -125438 -68055 141309
11866A10928a45748d4058D5781d01039d1707B2525J77000b04574B00854i9772
$$ 110928 -145748 -44058 45781 -401039 -41707 22525 199525 -204574 200854 -99772
11855a06023A7394J09603a81594F5256b72699A22959a68437J7027M5922K5753
$$ -106023 17394 126997 -181594 65256 -272699 122959 -168437 -151410 -105488 -79735
11845g9735m8461j54939m6190a03888j28834N8654F4616g3424C15563c86864f790
$$ -79735 -128196 -283135 -329325 -103888 -232722 -174068 64616 -73424 315563 -386864 -6790
11833a56522f5756j01630p5127f5646k95099a50667p5568i0482C4215K2110L5204
$$ -156522 -65756 -167386 -242513 -65646 -360745 -150667 -226235 -90482 34215 56325 91529
11822I1529c75337A09321a77999A86781C7743N4078a46325D0821J34815a90908
$$ 91529 -375337 109321 -177999 186781 37743 91821 -146325 40821 175636 -190908
11811A12706a77176r5933h8594D6753a57917B1249i6958A85457B968J59088n8605
$$ 112706 -177176 -273109 -88594 46753 -157917 21249 -96958 185457 2968 162056 103451
11800A03451K70798o0113C6861b90764d453p1701B25833n0992c60428J39900C0345
$$ 103451 374249 314136 36861 -290764 -4453 -76154 225833 174841 -360428 -220528 30345
11788b04526J9016D4296b1632D0609f2748B79636A20108c4761B69704g4994A63860
$$ -204526 -185510 44296 -21632 40609 -62748 279636 120108 -34761 269704 -74994 163860
11776b34670f7910A38415j2404b85228A4353J16792n9966p553j0254i3038I6256
$$ -234670 -67910 138415 126011 -285228 14353 131145 71179 63626 53372 -93038 96256
11764a48775C25352j55970a10992C3858c1649A64359f3060H9993C8214a77423
$$ -148775 325352 169382 -110992 33858 -31649 164359 -63060 89993 38214 -177423
11753a50296j35092i1552o837F7510N1824l4891h1029A41408a14694B69765A10781
$$ -150296 -285388 -91552 -98389 67510 119334 84443 -81029 141408 -114694 269765 110781
11741b60520a23747j39884A56078G0761N8936L7522e0452F7524a62559B83301
$$ -260520 -123747 -263631 156078 70761 129697 167219 -50452 67524 -162559 283301
11730d09772C9335J29093a3099j12825B8331b92712b9485B55484K164b7720k9774
$$ -409772 39335 168428 -13099 -125924 28331 -292712 -29485 255484 257648 -27720 -57494
11719e7494H0789b04236l1366b5929k09311d2199F2096a10241j85565A8850L442
$$ -57494 80789 -204236 -235602 -25929 -235240 -42199 62096 -110241 -295806 18850 22292
11708B2292J87956f7954A3449a61400A94587I6083J90381g8865A87388I0726a57853
$$ 22292 210248 -67954 13449 -161400 194587 96083 286464 -78865 187388 90726 -157853
11696B60889I5132h7957B22576a95824C21401I3189J31616b3799H3861a32286
$$ 260889 95132 -87957 222576 -195824 321401 93189 224805 -23799 83861 -132286
11685A18014l4804J7565a8216o470A00378h3597C26747A11717n2014a71779h0982
$$ 118014 83210 100775 -18216 -24686 100378 -83597 326747 111717 59703 -171779 -80982
11673c31786f8250n4107j03362B06678r0342a27264q2805e327B27566c07947J6077
$$ -331786 -68250 -122357 -225719 206678 116336 -127264 -210069 -5327 227566 -307947 -291870
11662b91870B5559Q4704B5529O079b68734B4275b09345C26606A8318a00359C4672
$$ -291870 25559 110263 25529 31608 -268734 24275 -209345 326606 18318 -100359 34672
11650a51049J7704k9853A46665B8442a33253c6890j57627B18306B0119c7437j7031
$$ -151049 -133345 -163198 146665 28442 -133253 -36890 -194517 218306 20119 -37437 -54468
11639e4468A26589g8515m3340l08404B20849j06466d8728G6004K59144n4633a34200
$$ -54468 126589 -78515 -121855 -430259 220849 114383 -48728 76004 335148 280515 -134200
11627a25994a629k28908b5514B84071J07634j56206A00389O8812b10302E692K71772
$$ -125994 -1629 -230537 -25514 284071 391705 235499 100389 169201 -210302 5692 277464
11616B77464d3240H1907d42931a55646d1479a0581A68512j1933F4226B3525J52062
$$ 277464 -43240 81907 -442931 -155646 -41479 -10581 168512 156579 64226 23525 175587
11605A75587f3818H9310h4467G8350d0334F2850k0069h6031p8234c7949l8442
$$ 175587 -63818 89310 -84467 78350 -40334 62850 42781 -86031 -164265 -37949 -76391
11594g6391o8274f9055G2170d92547D0173L7827L1473i8429J0250q6112j21275
$$ -76391 -144665 -69055 72170 -492547 40173 78000 109473 -98429 -88179 -174291 -295566
11583b95566e1398A2730a60243L7044C0185J5275Q013f5966j2088k2400E3515
$$ -295566 -51398 12730 -160243 -123199 30185 45460 53473 -65966 -78054 -100454 53515
11571I4673N4426L45568D1937C312L32306E9482g2237C4803J71534l3867B9235
$$ 94673 149099 494667 41937 3312 335618 59482 -72237 34803 206337 172470 29235
11559A10969l1925K09539a35975A68286J07124p630b74830l6743B5546a36224
$$ 110969 79044 288583 -135975 168286 275410 267780 -274830 -311573 25546 -136224
11548F409K6709d5883A27627K19896p3755b56521Q0095B73809R4913A7706a98056
$$ 6409 33118 -45883 127627 347523 273768 -256521 -176426 273809 368722 17706 -198056
11536H0563g9838A97320b15704D00104b4554k3529j05201B59778f4612B49591
$$ 80563 -79838 197320 -215704 400104 -24554 -48083 -153284 259778 -64612 249591
11525E29978i1369A34809J61085P2551e6124B23331E7660J85082A6211J10919
$$ 529978 -91369 134809 295894 368445 -56124 223331 57660 242742 16211 127130
11515A27130K5592l7131c526A53774l2550J65667G2791b44672B03691a20088B7797
$$ 127130 152722 115591 -3526 153774 121224 286891 72791 -244672 203691 -120088 27797
11503i1038I0471J49420R3406j22428a84456j11488A86239a64836d4077C85431
$$ -91038 90471 239891 333297 210869 -184456 -295944 186239 -164836 -44077 385431
11492f7253C26479q1668m71F6325M0315J77489j10461H5460b625C33772b74530
$$ -67253 326479 244811 244340 66325 106640 284129 173668 85460 -2625 333772 -274530
11480F8990M7958i1184E09678A07659O8960f495H5485M6144l1452J34J33733q770
$$ 68990 116948 -91184 509678 107659 176619 -6495 85485 131629 100177 100311 234044 225274
11468B25274d0641A18481K43287j29805j10435K83496E134J12817R9208c07246
$$ 225274 -40641 118481 361768 231963 121528 405024 5134 117951 217159 -307246
11457A30494n794h8861A39387c1107M491B13058R7322J25181f0452A15628c8016
$$ 130494 124700 -88861 139387 -31107 -26616 213058 310380 435561 -60452 115628 -38016
11445A50519b4169p2260p3310L9292j19027M9167o9380J11242E7315M209f4800
$$ 150519 -24169 -96429 -169739 -130447 -249474 -200307 -269687 -158445 57315 61524 -64800
11433A25652P1519q8882B7959J74839J10259A4523K02138n4908b96900g8079A18363
$$ 125652 197171 108289 27959 202798 313057 14523 216661 161753 -296900 -78079 118363
11421a02286A17453b14023d6329k20646F91b39640J10315A44689Q7202A7831J5805
$$ -102286 117453 -214023 -46329 -266975 691 -239640 -129325 144689 231891 17831 33636
11410C3636M16858b78746F3321K16648E6460K88093A25048a08189n5799B23299
$$ 33636 450494 -278746 63321 279969 56460 344553 125048 -108189 -163988 223299
11399A20091D5895J29886L095l440f7185B56681a41168C1588K17546N8152p6671
$$ 120091 45895 175781 178876 175436 -67185 256681 -141168 31588 249134 307286 230615
11388B30615A00205J29676a91667K2805A83140d2228A24679b27481a9562r312
$$ 230615 100205 229881 -191667 -168862 183140 -42228 124679 -227481 -19562 -28874
11378b8874B65831A12008M753J2584K09493J4104F6736B8141a09686A96a12549
$$ -28874 265831 112008 116761 129345 338838 352942 66736 28141 -109686 196 -112549
11366C53474b28779A40540a58535J9893e876F4426a4867B9528P0433J35220q125
$$ 353474 -228779 140540 -158535 -138642 -5876 64426 -14867 29528 99961 235181 227056
11355B27056m6419L0548J38767a37520F2454N6544a23911p3536L4114B7584N936
$$ 227056 180637 211185 349952 -137520 62454 118998 -123911 -197447 -163333 27584 33520
11344C3520K50383A13272d6018j91582i2505c720k82673A7758J86397a03004r8743
$$ 33520 283903 113272 -46018 -237600 -92505 -3720 -286393 17758 204155 -103004 -201747
11333b01747D0535i7252E2032i0412b7702j03029n4363m9272a1043A78224f9008
$$ -201747 40535 -97252 52032 -90412 -27702 -130731 -185094 -234366 -11043 178224 -69008
11321A64697N0530a9298f93l7352q6043E2589c8508A14615a40723K2182a1744
$$ 164697 215227 -19298 -693 -38045 -124088 52589 -38508 114615 -140723 -118541 -11744
11309c02024h1065j01454m9509K5409B1625L6257J15178B1491i3747j1277A39357
$$ -302024 -81065 -182519 -232028 -206619 21625 57882 173060 21491 -93747 -105024 139357
11297a1852j71092B17116A01125a99912A15961C0719a49998P1380A9512a10750
$$ -11852 -182944 217116 101125 -199912 115961 30719 -149998 -78618 19512 -110750
11286e1790B82070d3813A6136B587a6893m7154k9766A439J53467a35190e7918
$$ -51790 282070 -43813 16136 2587 -16893 -64047 -93813 1439 154906 -135190 -57918
11274c74685J70725a4902B7015J69957b61032a21923k0743B67904b50960N6655
$$ -374685 -203960 -14902 27015 196972 -261032 -121923 -142666 267904 -250960 -194305
11264a94305B502b29452A00811Q1419F7158b70866A21689c80751C98908b38040
$$ -194305 2502 -229452 100811 182230 67158 -270866 121689 -380751 398908 -238040
11253A81368a15232j28422e4535a6934r4808d0528C94953c4674m1148l02452B8967
$$ 181368 -115232 -243654 -54535 -16934 -111742 -40528 394953 -34674 -75822 -378274 28967
11241a14204J5485M4509k75236M4647C3319b16538l3784C24673d18533E3610a6528
$$ -114204 -98719 -54210 -329446 -284799 33319 -216538 -250322 324673 -418533 53610 -16528
11229a55910d8780a4972E5165L05928c56210i786C02851B6845a94203F2753j053
$$ -155910 -48780 -14972 55165 361093 -356210 -9786 302851 26845 -194203 62753 61700
11218F1700a06654j30654A08243d03993J24452j55538k9042E16520a47412A32503
$$ 61700 -106654 -237308 108243 -403993 -279541 -435079 -464121 516520 -147412 132503
11207f7865c2557k3593q6877O2191C81523D4227h8862a9765k1781F8109m118b31410
$$ -67865 -32557 -56150 -143027 -80836 381523 44227 -88862 -19765 -41546 68109 63991 -231410
11194g0471A36634b3950F271J61403a6233r0100q2193P159f381B5546b4091j53049
$$ -70471 136634 -23950 6271 167674 -16233 -106333 -188526 -181367 -6381 25546 -24091 -177140
11182a77140j30668J41660O7010f291k6254J2152m50879R3236B3417e3976j09970
$$ -177140 -307808 -166148 -99138 -6291 -32545 -20393 -471272 -378036 23417 -53976 -163946
11171a63946f2083B843g826D16706a9442E635L20525H9786j4754R3814L15502
$$ -163946 -62083 2843 -7826 416706 -19442 5635 326160 89786 75032 168846 484348
11160D84348H1714K00742a37403j04743b440j71745o3488H7984b55297k117C3645
$$ 484348 81714 282456 -137403 -242146 -2440 -174185 -237673 87984 -255297 -257414 33645
11148a888C48628i9558B55886b19330R4515k73949E0598a78759n1668A89949a42442
$$ -1888 348628 -99558 255886 -219330 -124815 -398764 50598 -178759 -230427 189949 -142442
11136f5480B7693R0688c52953j2923A22421j0006K66616j78948r0675l32K11622
$$ -65480 27693 118381 -352953 -365876 122421 112415 379031 200083 109408 109076 320698
11125C20698q5174k0289a83888I5395N11506k16757a13901A91577Q7605A7814
$$ 320698 235524 215235 -183888 95395 606901 390144 -113901 191577 279182 17814
11114f4142A43832M0715f9743j33688B10846d0302B56031A08572i3562l4010B01658
$$ -64142 143832 184547 -69743 -203431 210846 -40302 256031 108572 -93562 -127572 201658
11102a96862F0525j212O5220P9838k8649b47125B18266K2248r5382K06853A56889
$$ -196862 60525 59313 124533 204371 175722 -247125 218266 240514 145132 351985 156889
11090b60008B75338r6828a58405B27105c80727C74523A53784C825Q3267o466i8181
$$ -260008 275338 178510 -158405 227105 -380727 374523 153784 3825 87092 80626 -98181
11078E40132j94333r0293K43316A91672L89510k27015r5629N6498j09159A7467
$$ 540132 345799 255506 498822 191672 581182 354167 258538 315036 205877 17467
11067C70463A81408J98193k5651K60938k4548B0384Q81575B04786L31321J03873
$$ 370463 181408 379601 353950 614888 590340 20384 901959 204786 536107 639980
11057F39980j62426O4801M44920l65282Q506L320k487J23070q1789q5590L79733
$$ 639980 477554 542355 987275 621993 630499 633819 631332 754402 672613 587023 966756
11046I66756l99326J91119R3958j72296K54128k75351q9594K08478j55272K14906
$$ 966756 567430 758549 852507 680211 934339 658988 569394 777872 622600 837506
11036H37506j53352K1820j35862J89617q9592K3037P2132j72051K42028j74718
$$ 837506 684154 705974 570112 759729 670137 693174 765306 593255 835283 660565
11026F60565j99459M28214l29803n291j6405N5414O9192J45722j53742k80819
$$ 660565 461106 889320 559517 554226 537821 593235 662427 808149 654407 373588
11016C73588K20780j0880j45201K48410J02082j67460m1622J06490J52998r9560
$$ 373588 594368 583488 438287 686697 788779 621319 579697 686187 839185 739625
11006G39625l58105L67355k47106n6775p0888L36892J13511j60296o3577K37927
$$ 739625 381520 748875 501769 444994 374106 710998 824509 664213 600636 838563
10996H38563l09808M95859k14437o8776o7435r8938J87601k74917L65408j14903
$$ 838563 528755 1024614 810177 741401 673966 575028 762629 487712 853120 738217
10986G38217j33281K38339K43548k9686j5780L01223N9272O8180j71566L94391
$$ 738217 604936 843275 1086823 1057137 1041357 1342580 1401852 1470032 1298466 1692857
10976A692857M26690l90990N17588M04750Q4366K3638j14965J4348j83233K660
$$ 1692857 2119547 1728557 2246145 2650895 2735261 2758899 2643934 2658282 2475049 2477709
10966B477709k20850p91973K60420l76802L18208K31605m40302L8126L55749J26701
$$ 2477709 2256859 1464886 1725306 1348504 1666712 1898317 1458015 1496141 1851890 1978591
10956A978591l05214k16426p523j26399j54291j19904j93910k66096B63708j1400
$$ 1978591 1673377 1456951 1449428 1323029 1168738 1048834 854924 588828 263708 252308
10946B52308A01631K02495K54004j0646j38761f168l0218B1331L30873B6359a98067
$$ 252308 101631 304126 558130 547484 408723 -6168 -36386 21331 352204 26359 -198067
10934e497B09576l2633M1874H1671J88987q4875D6083N8021H231O39M21009e2026
$$ -5497 209576 176943 218817 81671 270658 185783 46083 104104 8231 8870 429879 -52026
10921b36399C5729e8911A14975f3116K5303G8616J42880J2124a32485N458a3253
$$ -236399 35729 -58911 114975 -63116 -37813 78616 221496 233620 -132485 -127027 -13253
10909h6639j01581P0852A01541j2541L4470g8845I8133a41230M7520o6609g3771
$$ -86639 -188220 -117368 101541 89000 123470 -78845 98133 -141230 -93710 -160319 -73771
10897d5714h481C2163K7780J45292m7321b23445R7245A69376M3204a51553K7455
$$ -45714 -8481 32163 59943 205235 157914 -223445 -126200 169376 212580 -151553 -124098
10886a24098n7536f1944B1779i9851a0514D6206b3128k83277P8331E8635J6450
$$ -124098 -181634 -61944 21779 -99851 -10514 46206 -23128 -306405 -228074 58635 75085
10875G5085J65046h3915j60119j15681G5763c20961C6017a70495k36310J39673
$$ 75085 240131 -83915 -244034 -359715 75763 -320961 36017 -170495 -406805 -267132
10865b67132B11644K5064e375j99879A55617A6828P1503b8574l2474a8338j08596
$$ -267132 211644 236708 -5375 -205254 155617 16828 88331 -28574 -61048 -18338 -126934
10854a26934A06146i8166A74976a83935B0370M64510I3689J18490Q8042g9362
$$ -126934 106146 -98166 174976 -183935 20370 484880 93689 212179 300221 -79362
10843B1378d835j46533H5936a87424Q0376l0234A69378a72280M3908I1566a57940
$$ 21378 -4835 -151368 85936 -187424 -107048 -137282 169378 -172280 -128372 91566 -157940
10831E3742a15394A15859J817L63318d1707A00676J21316c19135i5279B21307
$$ 53742 -115394 115859 117676 480994 -41707 100676 221992 -319135 -95279 221307
10820A7982a6335l7175E1681A6381M6825A494N3538a24959B59361g6266r0251
$$ 17982 -16335 -53510 51681 16381 63206 1494 55032 -124959 259361 -76266 -166517
10809a66517j02478i1398H0390a42799f3402h294o3838b0745C13882b3078m4944
$$ -166517 -268995 -91398 80390 -142799 -63402 -8294 -72132 -20745 313882 -23078 -68022
10798f8022B1365P616J6209b14326h9812D6677L75279b31558c2823E78114b37930
$$ -68022 21365 28981 45190 -214326 -89812 46677 421956 -231558 -32823 578114 -237930
10786i190G6281c4610l26145A01087M6728c6002m8804A77968h2420A89812C7453
$$ -9190 76281 -34610 -360755 101087 147815 -36002 -84806 177968 -82420 189812 37453
10774c1644j44973d949j07913C8939J59723a30037C6373h7372l9849j85614c9978
$$ -31644 -176617 -4949 -112862 38939 198662 -130037 36373 -87372 -127221 -312835 -39978
10762a57817N2441a8166C14980b89803B7836M9217c12699c8177A86602b35977
$$ -157817 -105376 -18166 314980 -289803 27836 77053 -312699 -38177 186602 -235977
10751B6195a31984e3129l38308N6949h497k18250E2906J80404a75624K5187K6631
$$ 26195 -131984 -53129 -391437 -334488 -8497 -226747 52906 233310 -175624 -150437 -123806
10740a23806p4030E0151J64937A5651e0742I1027O1311m4331Q9528a05528k16279
$$ -123806 -197836 50151 215088 15651 -50742 91027 152338 108007 197535 -105528 -321807
10729c21807J48799n1193B60068b04036A38337a3388B58630a68056A97739d8250
$$ -321807 -173008 -224201 260068 -204036 138337 -13388 258630 -168056 197739 -48250
10718a5961n6940L364A77545K33364A75474d1472E3986J5235a63596D582J27087
$$ -15961 -72901 -69537 177545 410909 175474 -41472 53986 69221 -163596 4582 131669
10707A31669b07208e945H8207D2451a1513C8302d10013A80434l715c5062A17475
$$ 131669 -207208 -5945 88207 42451 -11513 38302 -410013 180434 176719 -35062 117475
10695a22456A495a28880I8927a10910k6236m157N8485E9122J38202c74904a83438
$$ -122456 1495 -128880 98927 -110910 -137146 -141303 -82818 59122 197324 -374904 -183438
10683E9668a84753N1710B824K96576J43179b50048B23586p5148J81803a02092
$$ 59668 -184753 -133043 2824 299400 442579 -250048 223586 148438 330241 -102092
10672g7957f836j42785I0021a06082c7394C7064b30718i2080j54916M9895m9118
$$ -77957 -6836 -149621 90021 -106082 -37394 37064 -230718 -92080 -246996 -197101 -246219
10661b46219i5738k64054b7211q2574L5137F2900k7618K42515c3813G0848M4014
$$ -246219 -95738 -359792 -27211 -109785 -74648 62900 35282 277797 -33813 70848 114862
10650A14862c02703B2850e18498b46461R8825A94293g7180l28742f5767H9362
$$ 114862 -302703 22850 -518498 -246461 -147636 194293 -77180 -405922 -65767 89362
10639b4297I4270j4236d5823j29910A54062a73350I057L56092a33591A25443g2074
$$ -24297 94270 80034 -45823 -175733 154062 -173350 9057 365149 -133591 125443 -72074
10627a46280q259o1182j49723a20952m8603B28107h1009B02085c9094l93995a92409
$$ -146280 -154539 -215721 -365444 -120952 -169555 228107 -81009 202085 -39094 -433089 -192409
10615b97304C0095a04112B63374a07162A56110G2021M546a54764H7608c9732p9996
$$ -297304 30095 -104112 263374 -107162 156110 72021 76567 -154764 87608 -39732 -119728
10604a19728d9928j10214l00446b19800C19393j53267F8624a69686A28707a08064
$$ -119728 -49928 -160142 -460588 -219800 319393 166126 68624 -169686 128707 -108064
10593A06262N5034a82466a7294q2915a3005r9748b2564A34392a69327E0855b05776
$$ 106262 161296 -182466 -17294 -100209 -13005 -112753 -22564 134392 -169327 50855 -205776
10581E7357P1606M6557b51079i5038N045k06804N0450b7104B551h0030C4981J82534
$$ 57357 128963 175520 -251079 -95038 -89993 -296797 -246347 -27104 2551 -80030 34981 217515
10569B17515J26180h709j34927k3393C4203a63269I2392a98042o3104j2844a16083
$$ 217515 343695 -8709 -143636 -167029 34203 -163269 92392 -198042 -261146 -273990 -116083
10557A02679a74127F3694L5656a17094G6488a0203k20942e8598j35086A07230
$$ 102679 -174127 63694 99350 -117094 76488 -10203 -231145 -58598 -193684 107230
10546b490E2179a17675D04730A64783b33492A39940i4641J6894B9731a26133m3479
$$ -2490 52179 -117675 404730 164783 -233492 139940 -94641 -77747 29731 -126133 -169612
10535a69612J7608A6845b71107j14768P8219L1013J08880e1679o9003B00404M2126
$$ -169612 -152004 16845 -271107 -385875 -307656 -276643 -167763 -51679 -120682 200404 242530
10524B42530e77713b35286J4110A68017H561M1927R6719j4953g3656I3515a50468
$$ 242530 -577713 -235286 -221176 168017 8561 50488 147207 132254 -73656 93515 -150468
10512d5001B95737a87100B48710c90941J82354A09936a70777O8951B33709a00005
$$ -45001 295737 -187100 248710 -390941 -208587 109936 -170777 -101826 233709 -100005
10501F4369K18970q5852G0151c43792J12850O7451A5589a84821F4121f2282m2717
$$ 64369 283339 197487 70151 -343792 -230942 -163491 15589 -184821 64121 -62282 -104999
10490a04999l4105D3263J13036d7843E93356A50281P5345e6030D57133j00618
$$ -104999 -139104 43263 156299 -47843 593356 150281 225626 -56030 457133 356515
10480C56515j05895l0807g0442B16467c15363B24053a54373A17008E2755g8982
$$ 356515 250620 219813 -70442 216467 -315363 224053 -154373 117008 52755 -78982
10469B1305a02128M2796B20698b09812f6530a9266D08384F7745b8067A2809b62805
$$ 21305 -102128 -59332 220698 -209812 -66530 -19266 408384 67745 -28067 12809 -262805
10457A49938a38792j53900d2899A99250c52113B12236c12026D4023a6084A57725
$$ 149938 -138792 -292692 -42899 199250 -352113 212236 -312026 44023 -16084 157725
10446e8475I2000J7319d8615K3041l50089J55132l2504c4069o291A47403a48992
$$ -58475 92000 109319 -48615 -25574 -375663 -220531 -253035 -34069 -40360 147403 -148992
10434B73421f8830B29832D0646a42635G4296a00588B27661q6587i4731b6430p8540
$$ 273421 -68830 229832 40646 -142635 74296 -100588 227661 141074 -94731 -26430 -104970
10423a04970L268A00479Q9425M9461c75486a3579A20971l36C0708b28245B32838
$$ -104970 -101702 100479 189904 239365 -375486 -13579 120971 120635 30708 -228245 232838
10411f566A8336b042A10060c69186A81205b43762A32220g3163C1712Q2136a16101
$$ -6566 18336 -2042 110060 -369186 181205 -243762 132220 -73163 31712 113848 -116101
10399a38284C33617k6727A13901a76331F7928a11745a048j9068k3695C34745A07987
$$ -138284 333617 306890 113901 -176331 67928 -111745 -1048 -20116 -43811 334745 107987
10387g5412j90777g7477A68191R6800b27676I2213K35559F176N9125K15846J58861
$$ -75412 -266189 -77477 168191 264991 -227676 92213 327772 6176 65301 281147 440008
10376D40008h1708C32150e8688A07265K92516F0435K05873K07023O8081B64916
$$ 440008 -81708 332150 -58688 107265 399781 60435 266308 473331 541412 264916
10365E99623k89390A31874L82651C3081K00003P5269E8586a3686A35344i1281
$$ 599623 310233 131874 514525 33081 233084 308353 58586 -13686 135344 -91281
10354C25518l3092i2601C97998j31129Q2377q6740L68964k58048A30035K6528
$$ 325518 292426 -92601 397998 266869 349246 262506 631470 373422 130035 156563
10344A56563L56912m1653A89851O7717K89110B30834Q5725K2518R7440A38298
$$ 156563 513475 471822 189851 257568 546678 230834 316559 339077 436517 138298
10333F4608K90335P499j63065Q8701a61749D9312k2395J8053J17518E4597N02713
$$ 64608 354943 362442 199377 288078 -161749 49312 26917 44970 162488 54597 557310
10322E57310B51962G6575L47676F7748J17256J13352a25846o553B02173a37044
$$ 557310 251962 76575 424251 67748 185004 298356 -125846 -132399 202173 -137044
10311f2384K0121B67279D2928J93273g845n1812j25162L3018E9694a79974l1561
$$ -62384 -42263 267279 42928 236201 -7845 -59657 -184819 -151801 59694 -179974 -211535
10300b11535A14085K30226A51973A1624J43388J00313F5990b02412N7793E8191
$$ -211535 114085 344311 151973 11624 155012 255325 65990 -202412 -144619 58191
10289a88890A93674a55834j16551A17408j2986a38866d0117J1910j01119k12454
$$ -188890 193674 -155834 -272385 117408 104422 -138866 -40117 -28207 -129326 -341780
10279c41780N3601A19380i7876b6671A28422c76682a53262j8207A64237a64090
$$ -341780 -288179 119380 -97876 -26671 128422 -376682 -153262 -171469 164237 -164090
10268C8569M3382M0375b92165D6714a40621m8974C15610m4052J65682j21449O2757
$$ 38569 81951 122326 -292165 46714 -140621 -189595 315610 271558 437240 315791 378548
10257C78548j50141j05383K77834a49196A06313b9983A47049J83438B3188J41490
$$ 378548 228407 123024 400858 -149196 106313 -29983 147049 330487 23188 164678
10247A64678a43691k0906r2321I534a00811A6350a22308N3075F4308f7247E3819
$$ 164678 -143691 -164597 -256918 9534 -100811 16350 -122308 -69233 64308 -67247 53819
10235c64813L4498A28478Q9027o3048b22834i1555F9295d36806d7844q1903B0585
$$ -364813 -330315 128478 217505 154457 -222834 -91555 69295 -436806 -47844 -129747 20585
10223c03831q7111R1098A01362J7724c2465C9012b17981J01667E6216c5217k05334
$$ -303831 -390942 -299844 101362 119086 -32465 39012 -217981 -116314 56216 -35217 -240551
10212b40551R4148q032b9457l32689b4840j17375J7187F7547O853a72088A08685
$$ -240551 -146403 -154435 -29457 -362146 -24840 -142215 -125028 67547 74400 -172088 108685
10200g2776j01571c8341k87078C30839f1332k6440m982B22098c74182d8161b1767
$$ -72776 -174347 -38341 -325419 330839 -61332 -87772 -92754 222098 -374182 -48161 -21767
10188a10715B4534A380a68234J4145j60509N2216b5215l70012J04057b7131l7543
$$ -110715 24534 1380 -168234 -154089 -314598 -262382 -25215 -395227 -291170 -27131 -64674
10177f4674q0679A32885h816k96214P7118k33392a63483J8327c2624N265j96071
$$ -64674 -145353 132885 -8816 -305030 -227912 -461304 -163483 -145156 -32624 -27359 -223430
10166b23430A3009b32302p4653a51285l6168o8233a9591j66479j06871D8083a76122
$$ -223430 13009 -232302 -306955 -151285 -187453 -255686 -19591 -186070 -292941 48083 -176122
10154a96327a1876A4612a35981r5512l47101i6521j74172A16763j2567L9010a37647
$$ -196327 -11876 14612 -135981 -231493 -578594 -96521 -270693 116763 104196 143206 -137647
10142B40593b45192F0833a79352A11488K911i5120d2421j91483j48555i048j46721
$$ 240593 -245192 60833 -179352 111488 114399 -95120 -42421 -233904 -382459 -9048 -155769
10131a55769J868j48636a24917a1531A38247a92813l002H2038c93677P8100P5579
$$ -155769 -153901 -302537 -124917 -11531 138247 -192813 -195815 82038 -393677 -315577 -239998
10120b39998L3814O1476k00900C0498a84970K4885g7279L0937k60284B28534B2487
$$ -239998 -206184 -144708 -345608 30498 -184970 -160085 -77279 -46342 -306626 228534 22487
10108c42567a69628I7497j7981b18892B97247a68404A4628b65987E0041a86430
$$ -342567 -169628 97497 79516 -218892 297247 -168404 14628 -265987 50041 -186430
10097a17233C1279a77882n8197h7342k36134C33498a33241k4518O493A1219b08963
$$ -117233 31279 -177882 -236079 -87342 -323476 333498 -133241 -157759 -151266 11219 -208963
10085F5223c38111F6507c196m14826a06637B46244A06109J23837b86237K0330
$$ 65223 -338111 66507 -3196 -418022 -106637 246244 106109 229946 -286237 -265907
10075b65907A00898a86789a5217r7986j6514B72469h7961j11001k40498i5872
$$ -265907 100898 -186789 -15217 -113203 -129717 272469 -87961 -198962 -439460 -95872
10064a45522A59798K13579e6887r7686j46944A48633i0616A781J01325L593d6145
$$ -145522 159798 373377 -56887 -154573 -301517 148633 -90616 1781 103106 106699 -46145
10052c69520J69266A875J79791b59143J11856b4808n046l0415j48981e6714m1127
$$ -369520 -200254 1875 181666 -259143 -147287 -24808 -29854 -60269 -209250 -56714 -97841
10041i7841l30841a10154E632c13050G5411J10816a86396l3696h2332A48561c28067
$$ -97841 -428682 -110154 5632 -313050 75411 186227 -186396 -220092 -82332 148561 -328067
10029g0546p2167B1338J84560b0556r9854p867A55598c822E3749a36613B05630
$$ -70546 -142713 21338 205898 -20556 -120410 -128277 155598 -3822 53749 -136613 205630
10017b25295B1942c34969e6018B18906b6845C8946d3242I1905M820c26765i7741
$$ -225295 21942 -334969 -56018 218906 -26845 38946 -43242 91905 96725 -326765 -97741
10005a40014r628A82490a678j10899B76805J4677a71415B15428o2851p3241a36014
$$ -140014 -149642 182490 -1678 -112577 276805 291482 -171415 215428 152577 79336 -136014
9993B09234G5742d2193A88773a64987I6797J49126b81788B60011b31999o4309
$$ 209234 75742 -42193 188773 -164987 96797 245923 -281788 260011 -231999 -296308
9983b96308I1447b41382E2414a55331A61902c7927j70309c1664k3152D2842a8239
$$ -296308 91447 -241382 52414 -155331 161902 -37927 -208236 -31664 -54816 42842 -18239
9971d03638a67594E6991o963j0530a51546g2885k6707C08011c02147H7171a40547
$$ -403638 -167594 56991 50028 39498 -151546 -72885 -99592 308011 -302147 87171 -140547
9959C9484b35338g7309k64806D1213A5447g0058r8766J4328j54135A59977a13129
$$ 39484 -235338 -77309 -342115 41213 15447 -70058 -168824 -154496 -308631 159977 -113129
9947d6960B77618B8950b82956b4181o2624B47595b95375k3274C3039a01912j15837
$$ -46960 277618 28950 -282956 -24181 -86805 247595 -295375 -318649 33039 -101912 -217749
9936b17749h6474k16046H5846a07073l4573K9965k34853i7349a5600l99137G4015
$$ -217749 -86474 -302520 85846 -107073 -141646 -111681 -346534 -97349 -15600 -414737 74015
9924b12845K2561f8575k3751B64289c9669j46433A99860o8152F4432M1611J8794
$$ -212845 -190284 -68575 -92326 264289 -39669 -186102 199860 131708 64432 106043 124837
9913A24837N8099C0836J58895k8511e8746p4960j7038I5954B2356i1892b4572
$$ 124837 182936 30836 189731 161220 -58746 -133706 -150744 95954 22356 -91892 -24572
9901b01586r0801e2947o8739L9181L0762G0178b23513R7146A09854c43494F6227
$$ -201586 -292387 -52947 -121686 -82505 -51743 70178 -223513 -126367 109854 -343494 66227
9889a26353r9326N2326L8612F3536a01224A70694N895N6070f8346q9225k11869
$$ -126353 -225679 -173353 -134741 63536 -101224 170694 176589 232659 -68346 -157571 -369440
9878c69440B8286a11788L9394l7330C04123b52606A88803g5758j46571A92043
$$ -369440 28286 -111788 -72394 -109724 304123 -252606 188803 -75758 -222329 192043
9867b10920f6030B19648b58373d0061j46385g8229B05289c56127a11234k7068
$$ -210920 -66030 219648 -258373 -40061 -186446 -78229 205289 -356127 -111234 -138302
9857a38302j25539D48466b51465A55662b74383e8178A16947b57612e9354B72679
$$ -138302 -263841 448466 -251465 155662 -274383 -58178 116947 -257612 -59354 272679
9846e2689p6971e5641j08126E739i919k50500a3526j61812E4522j0956J61835
$$ -52689 -129660 -55641 -163767 5739 -9919 -260419 -13526 -175338 54522 43566 205401
9835B05401c0381C39905n5447E5498J80035d8627j251B6661J0581J63529a07721
$$ 205401 -30381 339905 284458 55498 235533 -48627 -49878 26661 37242 200771 -107721
9823h2481o9184g0290j94833l0809j60128B8300a69695g9136c421j14771A65624
$$ -82481 -151665 -70290 -265123 -295932 -456060 28300 -169695 -79136 -3421 -118192 165624
9811a80776N083e2602A92057f9933j47415A60862b96542a28440f3081B01884a19250
$$ -180776 -175693 -52602 192057 -69933 -217348 160862 -296542 -128440 -63081 201884 -119250
9799a89790g1083J3896A64157b52918E96971B57031A22170m5468L14229A41504
$$ -189790 -71083 -57187 164157 -252918 596971 257031 122170 76702 390931 141504
9788A4426c59324e8226j44641h9190C62580I6170c34216a37084D9037b437g33
$$ 14426 -359324 -58226 -202867 -89190 362580 96170 -334216 -137084 49037 -2437 -733
9776a43025A55459b8458A4685a8305r3253j84811D6869g1443M907j12645A4181
$$ -143025 155459 -28458 14685 -18305 -111558 -296369 46869 -71443 -66536 -179181 14181
9764f4629k71124J06899G3552q302a90595l4935L9376R2553l21046B02872a06077
$$ -64629 -335753 -228854 73552 65250 -190595 -225530 -186154 -93601 -414647 202872 -106077
9752c02129o4638O8047P0255b9458o5016j18124O2716n823B26860A6947c3977
$$ -302129 -366767 -298720 -228465 -29458 -94474 -212598 -149882 -155705 226860 16947 -33977
9740a80843D1646M8883a60713j15349K47P1036F7180b34970A56111a77114L3113
$$ -180843 41646 90529 -160713 -276062 -275815 -204779 67180 -234970 156111 -177114 -144001
9729a44001r3126a11393l45774O3448G3706Q8623a49857k89854E9045a50446O888
$$ -144001 -237127 -111393 -457167 -393719 73706 162329 -149857 -439711 59045 -150446 -143558
9718a43558j37418K598b3236D4111q166p136a07238d7557k88660P1916d9110a7607
$$ -143558 -280976 -278378 -23236 44111 35945 28809 -107238 -47557 -336217 -264301 -49110 -17607
9705A24567d8197B9741a75464Q2712I3230a68773J3371c8537j8221A65068a04417
$$ 124567 -48197 29741 -175464 -92752 93230 -168773 -155402 -38537 -56758 165068 -104417
9693B51202g7183C6946h7320j26469F4642L835N7564J23608I3704e4287o0590
$$ 251202 -77183 36946 -87320 -213789 64642 68477 126041 249649 93704 -54287 -114877
9682a14877I1163b26231j2109G3203A7467L0367a67526D2987d9296l9983F2423
$$ -114877 91163 -226231 -238340 73203 17467 47834 -167526 42987 -49296 -89279 62423
9670b3911f178B00965p0411m1286d41348C98552a12372a8674k91644B5042a60377
$$ -23911 -6178 200965 130554 89268 -441348 398552 -112372 -18674 -310318 25042 -160377
9658b89576A78239b59214J28662G180M437g3509B9955a46696d3032l3263j97385
$$ -289576 178239 -259214 -130552 7180 11617 -73509 29955 -146696 -43032 -76295 -273680
9647b73680O8884A45586b43104F8702J56659g0680j12976C954c66127J05152l534
$$ -273680 -204796 145586 -243104 68702 225361 -70680 -183656 3954 -366127 -260975 -264509
9636b64509B1871b72468F3352b13334B32311c36478m0093Q5134h591b571r3146
$$ -264509 21871 -272468 63352 -213334 232311 -336478 -376571 -291437 -8591 -2571 -95717
9625i5717B72510j10787o6482b51492J18948f2176q1204A3169K4380L6226l4750
$$ -95717 272510 161723 95241 -251492 -132544 -62176 -143380 13169 37549 73775 39025
9614C9025M5012c13019a29563B46986j00442B619a02439D1379a65415O2924l45312
$$ 39025 84037 -313019 -129563 246986 146544 2619 -102439 41379 -165415 -102491 -447803
9603d47803B63392b61212A63841c1311A5163b15159A18173a88874A8554b12431
$$ -447803 263392 -261212 163841 -31311 15163 -215159 118173 -188874 18554 -212431
9592a83593h1937j72714B26086A06704J056M2374a07848j05295j13284C1625L33787
$$ -183593 -81937 -254651 226086 106704 107760 150134 -107848 -213143 -326427 31625 365412
9581C65412c2739k45111A47915a66941d2306j80470A37197E382b99134A3951c01329
$$ 365412 -32739 -277850 147915 -166941 -42306 -222776 137197 5382 -299134 13951 -301329
9569b86197e210k8431l91666f8024I172a6811A11399m8084L23478a85960j7437
$$ -286197 -5210 -33641 -425307 -68024 9172 -16811 111399 63315 386793 -185960 -203397
9558b03397b2943A1926b00441i3032D134P2195K3276b61441a16693a7295q4118
$$ -203397 -22943 11926 -200441 -93032 4134 76329 99605 -261441 -116693 -17295 -101413
9547a01413m637C633d01871e4727A2324K12027g372n383G3200a06511j24014F969
$$ -101413 -106050 3633 -401871 -54727 12324 224351 -7372 -12755 73200 -106511 -230525 6969
9534B65635b46206a5471m6816B84273A14056N3739J399a80619j10916A34197E1998
$$ 265635 -246206 -15471 -62287 284273 114056 167795 169194 -180619 -291535 134197 51998
9522a43020d1652n18901c5942J5423A80360e4286j5347j02039O2996b5192l76477
$$ -143020 -41652 -560553 -35942 -20519 180360 -54286 -69633 -171672 -108676 -25192 -401669
9511d01669J5126H8111b03129B1323R1592J06785a67251r0673k2936a18728k29417
$$ -401669 -386543 88111 -203129 21323 112915 219700 -167251 -257924 -280860 -118728 -348145
9500c48145a18950L7655G2521M1190b08139d5669B8068J597d09780e1673D4934
$$ -348145 -118950 -81295 72521 113711 -208139 -45669 28068 29665 -409780 -51673 44934
9488A31270c307C7291K9601h3345q5700K1510m4612I9865b4186q5945r2960C70130
$$ 131270 -3307 37291 66892 -83345 -169045 -147535 -192147 99865 -24186 -110131 -203091 370130
9475a08277K9782B96052D6345a51692m9592g018E8989a45206N1702A23528b0614
$$ -108277 -78495 296052 46345 -151692 -201284 -7018 58989 -145206 -93504 123528 -20614
9463b08569o2154j56044B90965r31d604I606a4612l3052j46280N2378A46781B1844
$$ -208569 -270723 -426767 290965 290034 -4604 9606 -14612 -47664 -193944 -141566 146781 21844
9450a77497h091A15457a93919P9996e661j62893f889j42852R671l7050o1001K2988
$$ -177497 -8091 115457 -193919 -113923 -5661 -168554 -6889 -149741 -140070 -177120 -238121 -215133
9438b15133i6447A61597d04050J86861B01428a74759l08783A88386J6495e2096
$$ -215133 -96447 161597 -404050 -217189 201428 -174759 -483542 188386 204881 -52096
9427b1686B05766c4575B55952J2959c19532M1417b2362A94837b61481B99950e6481
$$ -21686 205766 -34575 255952 268911 -319532 -278115 -22362 194837 -261481 299950 -56481
9415a65198h2454J4917j10043K8445h797A28828b99776J45126a8164I0578k0245
$$ -165198 -82454 -67537 -177580 -149135 -8797 128828 -299776 -154650 -18164 90578 70333
9404G0333a86484B5198M1000a8123l58868a17995I6034N5415L1284a79271f9648
$$ 70333 -186484 25198 66198 -18123 -376991 -117995 96034 151449 182733 -179271 -69648
9392A58192j8629c03090J06916A04220h6335o1875A023e0035k448C7733a60661
$$ 158192 139563 -303090 -196174 104220 -86335 -148210 1023 -50035 -52483 37733 -160661
9380b62318m1462J06480j49220J65793k68147B87191c18091J43565N6582e4268
$$ -262318 -303780 -197300 -346520 -180727 -448874 287191 -318091 -174526 -117944 -54268
9369a21979b5364G2776B241a04524d7832m90445a96218O6235B82946A09017i765
$$ -121979 -25364 72776 2241 -104524 -47832 -538277 -196218 -129983 282946 109017 -9765
9357a68174C44274a3672D2102J44135N3949f1242I0553C3500c14087I3024B4835
$$ -168174 344274 -13672 42102 186237 240186 -61242 90553 33500 -314087 93024 24835
9345c2967k3294k46041G760O0983a20402A745d7429n5923C19102b09222G3376
$$ -32967 -56261 -302302 7760 68743 -120402 1745 -47429 -103352 319102 -209222 73376
9333a1854d677K174A23304D2181J65584b45476J13700l33181b09723O4788k8957
$$ -11854 -4677 -2503 123304 42181 207765 -245476 -131776 -464957 -209723 -144935 -173892
9322a73892D598c10019a0952j3207A21515d05442e5051o326j14705A1637d48219
$$ -173892 4598 -310019 -10952 -24159 121515 -405442 -55051 -61377 -176082 11637 -448219
9310D0906A4637a17269C12666a05343j04384B22177f9694I0834J43063a26269
$$ 40906 14637 -117269 312666 -105343 -209727 222177 -69694 90834 233897 -126269
9299b90501H9331e6317C8190a33519k68233i125A5386f9666j77736f799j04366
$$ -290501 89331 -56317 38190 -133519 -401752 -9125 15386 -69666 -247402 -6799 -111165
9288a11165B36231A6725J89205E3613O536h7081j22488d3631o2027A22997c55260
$$ -111165 236231 16725 205930 53613 60149 -87081 -209569 -43631 -105658 122997 -355260
9276A86373k8051b09507p2578a26663L0640j12472j93700B8934J43351i3617K7321
$$ 186373 158322 -209507 -282085 -126663 -96023 -208495 -402195 28934 172285 -93617 -66296
9265f6296I6121b57793R9559d1635k3403B45966b79822I4560A7664j494d26254
$$ -66296 96121 -257793 -158234 -41635 -65038 245966 -279822 94560 17664 16170 -426254
9253d7658m1080r5935B32485a29099C6882a5901A2344b82020i7073B76805A7928
$$ -47658 -88738 -184673 232485 -129099 36882 -15901 12344 -282020 -97073 276805 17928
9241a83641A23922B0721b51433J7864h930j63341D5764K86443b7917j4920j98768
$$ -183641 123922 20721 -251433 -233569 -8930 -172271 45764 332207 -27917 -42837 -241605
9230b41605P8929F4976a27600I1751b29484R5676d7690E336J78790O532d25566
$$ -241605 -162676 64976 -127600 91751 -229484 -133808 -47690 5336 184126 190658 -425566
9218c14412I879b19697C03857b64464k63478d0585r0207F0084a28788B27938g395
$$ -314412 9879 -219697 303857 -264464 -527942 -40585 -130792 60084 -128788 227938 -7395
9206a1200p444m33973g6834k96606A43833J71533c05913c5564A82124b97418M1344
$$ -11200 -18644 -452617 -76834 -373440 143833 315366 -305913 -35564 182124 -297418 -256074
9195b56074J10870D8721k008b81294E8766J32891n1275m3490a49598B71541P01
$$ -256074 -145204 48721 46713 -281294 58766 191657 140382 96892 -149598 271541 272242
9184B72242j34905Q934a20928q0319C07684b36901G1145J46148r8841E5747e02421
$$ 272242 137337 146271 -120928 -201247 307684 -236901 71145 217293 118452 55747 -502421
9172i9040j39899d388j75204l1568a962B1286R467a68094N1519k75479a78014
$$ -99040 -238939 -4388 -179592 -211160 -1962 21286 30753 -168094 -116575 -392054 -178014
9160H489J26143K4239b50463a05483A36347f2918k32865C10157A6680a97464g9109
$$ 8489 134632 158871 -250463 -105483 136347 -62918 -295783 310157 16680 -197464 -79109
9148c48792a17247A4494a18744o3763Q5458B60167b93306B33426c05849j3103
$$ -348792 -117247 14494 -118744 -182507 -97049 260167 -293306 233426 -305849 -318952
9138c18952J07501m1234J22417N6817D32863b96496g4065B07127c9879D38703
$$ -318952 -211451 -252685 -130268 -73451 432863 -296496 -74065 207127 -39879 438703
9127g347q7465m557A69352a83289c6698j00739j87865O4686c7188k17693J19350
$$ -7347 -94812 -99369 169352 -183289 -36698 -137437 -325302 -260616 -37188 -254881 -135531
9116a35531N4003A2626b47498I1497j3850f3566A11547G282a21533d3642C6072
$$ -135531 -81528 12626 -247498 91497 77647 -63566 111547 7282 -121533 -43642 36072
9104a31598c2771E7181f659j78595Q3007j08699N1841O4178B091J04574a53887
$$ -131598 -32771 57181 -6659 -185254 -102247 -210946 -159105 -94927 2091 106665 -153887
9092d8545j66767n5469B55176G2357a69893Q0929A50580N0895a9036B52351c36293
$$ -48545 -215312 -270781 255176 72357 -169893 -88964 150580 201475 -19036 252351 -336293
9080b69999B03142c44187g2991C7656a17607A27344a21816B26017Q1957a83726
$$ -269999 203142 -344187 -72991 37656 -117607 127344 -121816 226017 307974 -183726
9069F1814K36756a77092e6735k43554B0613O9595b57546a01596B2108R4284a64199
$$ 61814 298570 -177092 -56735 -300289 20613 90208 -257546 -101596 22108 116392 -164199
9057B32385n8332b25329m041J9350Q4401K0332k05967J53584g4120l9415A4633
$$ 232385 174053 -225329 -229370 -210020 -125619 -105287 -311254 -157670 -74120 -113535 14633
9045A62641p4054c5325r8645a0979H1299P8378b64476a06749A17732c34402A79960
$$ 162641 88587 -35325 -133970 -10979 81299 159677 -264476 -106749 117732 -334402 179960
9033b24024R7234k71365e8714B04465i0671j70792F0098a57812A16078L10250
$$ -224024 -126790 -398155 -58714 204465 -90671 -261463 60098 -157812 116078 426328
9023D26328a77435A75500a75374h1787I599a66353A08244e4001n234a5183k74414
$$ 426328 -177435 175500 -175374 -81787 9599 -166353 108244 -54001 -59235 -15183 -289597
9012b89597A60595G7717M0086j1818K41795g7768B48330G9457C026K788a77076
$$ -289597 160595 77717 117803 105985 347780 -77768 248330 79457 3026 5814 -177076
9000b87686P9729A9496J24589g5937H7274m0599J18685H031J62044a51398q0318
$$ -287686 -207957 19496 144085 -75937 87274 46675 165360 8031 170075 -151398 -231716
8989b31716h8025k45528e5720A43648a20983F6356L24212a43270j4963M6425B53618
$$ -231716 -88025 -333553 -55720 143648 -120983 66356 390568 -143270 -158233 -111808 253618
8977e2726a9423j71210O7656B08388r4178D475b3676H4381m790K4972a67480k13369
$$ -52726 -19423 -190633 -122977 208388 114210 4475 -23676 84381 79591 104563 -167480 -380849
8965c80849J02617c6846B3562a07448D0236a12651m8508C8514a20393G646b09536
$$ -380849 -278232 -36846 23562 -107448 40236 -112651 -161159 38514 -120393 7646 -209536
8953C89478G4989c1535F850b29390c706B67085k7170b03499o4388R6709k27387
$$ 389478 74989 -31535 6850 -229390 -3706 267085 239915 -203499 -267887 -171178 -398565
8942c98565A97872M3013j14748c28612h0261G112a12857C57907F8149K05782J538
$$ -398565 197872 240885 126137 -328612 -80261 7112 -112857 357907 68149 273931 275469
8931B75469m0978j17114j2112n2177J12191L16610L8038O31524K457615R244370
$$ 275469 234491 117377 105265 53088 165279 481889 519927 1151451 3609066 12853436
8921A2853436M417155D076429A713154p93215l06461p0655A67581L7689a73302
$$ 12853436 17270591 4076429 1713154 919939 613478 542823 167581 205270 -173302
8911B06448a13114F9983J93920K60322k07188f9944I3828m5197c81009J46843
$$ 206448 -113114 69983 263903 524225 317037 -69944 93828 48631 -381009 -234166
8901b34166D4705b23938k38707A34524E2767c342l7808h342j48446D2129N0176
$$ -234166 44705 -223938 -462645 134524 52767 -3342 -41150 -8342 -156788 42129 92305
8890I2305b76720E3572J34922b45412K0374d1432B7641b4365C78732c37514i2523
$$ 92305 -276720 53572 188494 -245412 -225038 -41432 27641 -24365 378732 -337514 -92523
8878a25341L7519k1641N1749A43828l9053m1991C984a14135K4559j5803C2945
$$ -125341 -87822 -109463 -57714 143828 104775 62784 3984 -114135 -89576 -105379 32945
8866B14290g6335k94267h2122B2568a51847F7920b93270A90863r2588d6537k08745
$$ 214290 -76335 -370602 -82122 22568 -151847 67920 -293270 190863 98275 -46537 -255282
$$ [...]
##END NTUPLES=NMR SPECTRUM
##END=
