
##TITLE=UV1223_M6_1234-1212_20_7231249_iH2Jjf6jFW
##JCAMPDX= 6.0         $$ Bruker NMR JCAMP-DX V2.0
##DATA TYPE= NMR SPECTRUM
##DATA CLASS= NTUPLES
##ORIGIN= BRUKER
##OWNER= Administrator
$$ 1.72 TOPSPIN		Version 2.1
$$ 2013-01-24 01:23:56.344 -0500  Administrator@X
$$ Compression mode = diff/dup
##.OBSERVE FREQUENCY= 400.02188249412
##.OBSERVE NUCLEUS= ^1H
##.ACQUISITION MODE= SIMULTANEOUS (DQD)
##.ACQUISITION SCHEME= undefined
##.AVERAGES= 64
##.DIGITISER RES= 22
##SPECTROMETER/DATA SYSTEM= spect
##.PULSE SEQUENCE= noesygpps1d.comp
##.SOLVENT NAME= COFFEE_meoh
##.SHIFT REFERENCE= INTERNAL, COFFEE_meoh, 1, 14.96089
##AUDIT TRAIL= $$ (NUMBER, WHEN, WHO, WHERE, PROCESS, VERSION, WHAT)
$$ ##TITLE= Audit trail, TOPSPIN		Version 2.1
$$ ##JCAMPDX= 5.01
$$ ##ORIGIN= Bruker BioSpin GmbH
$$ ##OWNER= Administrator
$$ $$ E:\/data/COFFEE/nmr/UV1223_M6_1234-1212_20_7231249_iH2Jjf6jFW/32/pdata/1/auditp.txt
$$ ##AUDIT TRAIL=  $$ (NUMBER, WHEN, WHO, WHERE, PROCESS, VERSION, WHAT)
(   1,<2013-01-24 01:23:50.469 -0500>,<Administrator>,<X>,<go>,<TOPSPIN 2.1>,
      <created by zg
	started at 2013-01-24 01:12:20.641 -0500,
	POWCHK enabled, PULCHK disabled,
       configuration hash MD5:
       86 BA 57 50 F2 9D 5C 9B 26 00 A9 28 5F 66 2E 89
       data hash MD5: 64K
       2B CD 30 02 33 3A 02 A3 44 32 B0 B9 39 E7 83 22>)
(   2,<2013-01-24 01:23:53.579 -0500>,<Administrator>,<X>,<proc1d>,<TOPSPIN 2.1>,
      <Start of raw data processing
       efp LB = 0.3 FT_mod = 6 PKNL = 1 PHC0 = 0 PHC1 = 0 SI = 128K 
       data hash MD5: 128K
       69 55 C3 1B 7D EC 24 9B 60 FE 24 D5 C4 44 D9 C0>)
(   3,<2013-01-24 01:23:54.610 -0500>,<Administrator>,<X>,<proc1d>,<TOPSPIN 2.1>,
      <pk PHC0 = -77.48108 PHC1 = 0 
       data hash MD5: 128K
       C1 15 2A AA D8 06 4C E3 F5 FE F0 7A AD 09 29 F0>)
(   4,<2013-01-24 01:23:55.282 -0500>,<Administrator>,<X>,<proc1d>,<TOPSPIN 2.1>,
      <abs ABSG = 1 
       data hash MD5: 128K
       66 3F BC 29 AA 80 AB 67 3E C3 11 31 B2 5F B8 CC>)
(   5,<2013-01-24 01:23:55.454 -0500>,<Administrator>,<X>,<proc1d>,<TOPSPIN 2.1>,
      <abs ABSG = 2 
       data hash MD5: 128K
       B6 37 60 D3 48 4A F8 85 C6 E9 1A C7 22 E4 83 52>)
(   6,<2013-01-24 01:23:55.625 -0500>,<Administrator>,<X>,<proc1d>,<TOPSPIN 2.1>,
      <abs ABSG = 3 
       data hash MD5: 128K
       DD 63 60 57 07 DD 2D 31 D3 01 09 FE F6 BB 3F 55>)
(   7,<2013-01-24 01:23:55.829 -0500>,<Administrator>,<X>,<proc1d>,<TOPSPIN 2.1>,
      <abs ABSG = 4 
       data hash MD5: 128K
       71 D4 3C A7 B9 09 E2 E1 E3 D8 35 20 43 E4 BD 2B>)
(   8,<2013-01-24 01:23:56.000 -0500>,<Administrator>,<X>,<proc1d>,<TOPSPIN 2.1>,
      <abs ABSG = 5 
       data hash MD5: 128K
       76 86 D5 F7 2E 9A 7B 39 52 9B AE 6A E2 F3 04 29>)
$$ ##END=
$$ 
$$ $$ hash MD5
$$ $$ F8 AF B6 9B 68 CE F1 52 71 FB 07 21 D0 D9 A3 5F
##$RELAX= 
##$RELAX= 
##$RELAX= 
##$RELAX= 
##$RELAX= 
##$RELAX= 
##$RELAX= 
##$RELAX= 
$$ Bruker specific parameters
$$ --------------------------
##$DU= <E:\>
##$EXPNO= 32
$$ [...]
##$TP07= 0
##$TPNAME0= <>
##$TPNAME1= <>
##$TPNAME2= <>
##$TPNAME3= <>
##$TPNAME4= <>
##$TPNAME5= <>
##$TPNAME6= <>
##$TPNAME7= <>
##$TPOAL= (0..7)
0.5 0.5 0.5 0.5 0.5 0.5 0.5 0.5
##$TPOFFS= (0..7)
0 0 0 0 0 0 0 0
##$TUNHIN= 0
##$TUNHOUT= 0
##$TUNXOUT= 0
##$USERA1= <user>
##$USERA2= <user>
##$USERA3= <user>
##$USERA4= <user>
##$USERA5= <user>
##$V9= 5
##$VALIST= <valist>
##$VCLIST= <CCCCCCCCCCCCCCC>
##$VD= 0
##$VDLIST= <DDDDDDDDDDDDDDD>
##$VPLIST= <PPPPPPPPPPPPPPP>
##$VTLIST= <TTTTTTTTTTTTTTT>
##$WBST= 1024
##$WBSW= 4
##$XGAIN= (0..3)
0 0 0 0
##$XL= 0
##$YL= 0
##$YMAX_a= 6412928
##$YMIN_a= -13677564
##$ZGOPTNS= <>
##$ZL1= 120
##$ZL2= 120
##$ZL3= 120
##$ZL4= 120
##$ABSF1= 14.96089
##$ABSF2= -5.597292
##$ABSG= 5
##$ABSL= 3
##$ALPHA= 0
##$AQORDER= 0
##$ASSFAC= 0
##$ASSFACI= 0
##$ASSFACX= 0
##$ASSWID= 0
##$AUNMP= <proc_prof1d_extract.lims>
##$AXLEFT= 0
##$AXNAME= <>
##$AXNUC= <1H>
##$AXRIGHT= 0
##$AXTYPE= 0
##$AXUNIT= <>
##$AZFE= 0.1
##$AZFW= 0.1
##$BCFW= 0
##$BC_mod= 0
##$BYTORDP= 0
##$COROFFS= 0
##$CY= 15
##$DATMOD= 1
##$DC= 0
##$DFILT= <>
##$DTYPP= 0
##$F1P= 0
##$F2P= 0
##$FCOR= 0.5
##$FTSIZE= 131072
##$FT_mod= 6
##$GAMMA= 0
##$GB= 0
##$INTBC= 1
##$INTSCL= 1
##$ISEN= 128
##$LB= 0.3
##$LEV0= 0
##$LPBIN= 0
##$MAXI= 10000
##$MC2= 0
##$MEAN= 0
##$ME_mod= 0
##$MI= 0
##$NCOEF= 0
##$NC_proc= -2
##$NLEV= 6
##$NOISF1= 0
##$NOISF2= 0
##$NSP= 0
##$NTH_PI= 0
##$NZP= 0
##$OFFSET= 14.96089
##$PC= 1
##$PHC0= -77.48108
##$PHC1= 0
##$PH_mod= 1
##$PKNL= yes
##$PPARMOD= 0
##$PPDIAG= 0
##$PPIPTYP= 0
##$PPMPNUM= 2147483647
##$PPRESOL= 1
##$PSCAL= 4
##$PSIGN= 0
##$PYNMP= <proc.py>
##$REVERSE= no
##$SF= 400.020009679379
##$SI= 131072
##$SIGF1= 0
##$SIGF2= 0
##$SINO= 400
##$SIOLD= 131072
##$SPECTYP= <>
##$SREGLST= <1H.CDCl3>
##$SSB= 0
##$STSI= 131072
##$STSR= 0
##$SW_p= 8223.68421052631
##$SYMM= 0
##$S_DEV= 0
##$TDeff= 65536
##$TDoff= 0
##$TI= <>
##$TILT= no
##$TM1= 0
##$TM2= 0
##$TOPLEV= 0
##$USERP1= <user>
##$USERP2= <user>
##$USERP3= <user>
##$USERP4= <user>
##$USERP5= <user>
##$WDW= 1
##$XDIM= 131072
##$YMAX_p= 457853678
##$YMIN_p= -11587
##$CURPLOT= <Network HP LaserJet P1505>
##$CURPRIN= <$Network HP LaserJet P1505>
##$DFORMAT= <normdp>
##$LAYOUT= <+/1D_H.xwp>
##$LFORMAT= <normlp>
##$PFORMAT= <normpl>
##$SURQMSG= 1
$$ End of Bruker specific parameters
$$ ---------------------------------
##NTUPLES= NMR SPECTRUM
##VAR_NAME=  FREQUENCY,     SPECTRUM/REAL,   SPECTRUM/IMAG
##SYMBOL=    X,             R,               I
##VAR_TYPE=  INDEPENDENT,   DEPENDENT,       DEPENDENT
##VAR_FORM=  AFFN,          ASDF,            ASDF
##VAR_DIM=   131072,        131072,          131072
##UNITS=     HZ,            ARBITRARY UNITS, ARBITRARY UNITS
##FACTOR=    0.0627417313425164, 1,          1
##FIRST=     8223.62146879497, 979,          -62733
##LAST=      0,             2006,            -62554
##MIN=       0,             -11587,          0
##MAX=       8223.62146879497, 457853678,    0
$$ Real data points
##PAGE= N=1
##DATA TABLE= (X++(R..R)), XYDATA
$$ [...]
61582C45112p18j242j952k095j547j166j482j739j185n53r85k062k353j570p04
61567C23759k18K81P13M47k49l39J47M4p76q19O55K210K233J140M76P18J175J368
61549C32965J388J229P85L35K88N11M76O5k37K9P62J423J597J424J446J913K446
61532C48845K633K635K777K829K302J334N58J21m89j532k512k759k141j171n97
61517C52833q12j400j521j036p59j157j449q24Q0j2j034j573q49L52Q73M33m87
61500C41658j273j485j131p36p23q30o40l21j99l2N39J106J027N11K57K76P3k33
61482C37844m5O12J157J527K074K542K310J589J290J622J878J667J237O62k13
61467C57753r16o61L02Q48O18M15O69P40J17p08j023o90P7R54J329P89p0k10M29
$$ plain form
61582 345112 344394 343152 341200 339105 337558 336392 334910 333171 331986 331433 330448 328386 326033 324463 323759
61567 323759 323541 323822 324535 324982 324733 324394 324541 324585 323809 322990 323645 325855 328088 329228 329704 330422 331597 332965
61549 332965 334353 335582 336367 336702 336990 337501 337977 338042 337805 337834 338596 340019 341616 343040 344486 346399 348845
61532 348845 351478 354113 356890 359719 362021 363355 363913 364034 363545 362013 359501 356742 354601 353430 352833
61517 352833 352021 350621 349100 348064 347305 346148 344699 343875 343955 343943 342909 341336 340487 340839 341712 342145 341658
61500 341658 340385 338900 337769 337033 336310 335480 334840 334519 334320 334288 334827 335933 336960 337471 337728 338004 338077 337844
61482 337844 337799 338411 339568 341095 343169 345711 348021 349610 350900 352522 354400 356067 357304 357966 357753
61467 357753 356837 356176 356478 357326 357944 358359 359028 359768 359885 359177 358154 357464 357541 358495 359824 360613 360543 360333 360762
61448C60762R55R94R83J036O90N5m7O32J391J869K499L412L995L958L792L795
61432C90771L663L418L524L750L057J238m30p68l1Q85J605K130K369K435K691
61417D20307L078L106K816K916L574L939L261J779J97j032j718j956k225k683
61403D35359k575j317K5k65k060l407l192k292j755j433j023q84j112j071n58
61388D12440j71j12J31M17j55j342j518j55J137J128Q56J555K335J633j26j136
61372D16917p73P2P22J268J716J824J667J486J192P25M82P31J169J652K563L873
61356D37286M658M414L979M273M943N285N645O772Q367R544J0192J0868J1552
61343E27778J1520J0320Q209N922M433M434N422N951N313M291L716L166J899J64
$$ plain form
61448 360762 361717 362711 363694 364730 365420 365475 365428 366060 367451 369320 371819 375231 379226 383184 386976 390771
61432 390771 394434 397852 401376 405126 408183 409421 408991 408223 408192 409077 410682 412812 415181 417616 420307
61417 420307 423385 426491 429307 432223 435797 439736 442997 444776 444973 443941 442223 440267 438042 435359
61403 435359 432784 431467 431492 431227 429167 425760 422568 420276 418521 417088 416065 415181 414069 412998 412440
61388 412440 412269 412157 412288 412705 412550 411208 409690 409535 410672 411800 412656 414211 416546 418179 418053 416917
61372 416917 416144 416216 416938 418206 419922 421746 423413 424899 426091 426816 427298 428029 429198 430850 433413 437286
61356 437286 441944 446358 450337 454610 459553 464838 470483 477255 485622 495166 505358 516226 527778
61343 527778 539298 549618 557827 563749 568182 572616 578038 583989 589302 593593 597309 600475 602374 602538
61329F02538j376k738m130n057n068m747m858m990m214k714j622j378j278o47
61315E57721M13J418K035K212K202K421L002L708M425N357O575P965R675J1913
61301F21042J4140J5292J5041J3972J2304R496N501J279k353n346p553q542q746
61288F75527r394j0662j1305j0808j0306j0400r899q005o140n846o224n356l235
61275E67947j390l48O92K085L330M175M779N060M961M952N205N003M024L352L958
61260F17785N063N503N848P461J0137J2444J3908J5010J5389J3999J1071Q174
61248G41792O155M445K524O46j064k914m785o049o557o775o824o356n343m220
61234G04675l259k534k237k306k101j276n20n35q16m38N04J354K215L572N033
$$ plain form
61329 602538 601162 598424 594294 589237 584169 579422 574564 569574 565360 562646 561024 559646 558368 557721
61315 557721 558134 559552 561587 563799 566001 568422 571424 575132 579557 584914 591489 599454 609129 621042
61301 621042 635182 650474 665515 679487 691791 701287 706788 708067 705714 700368 692815 684273 675527
61288 675527 666133 655471 644166 633358 623052 612652 602753 594748 588608 582762 576538 571182 567947
61275 567947 566557 566209 566901 568986 572316 576491 581270 586330 591291 596243 601448 606451 610475 613827 617785
61260 617785 622848 628351 634199 641660 651797 664241 678149 693159 708548 722547 733618 741792
61248 741792 747947 752392 754916 755562 754498 751584 746799 740750 734193 727418 720594 714238 708895 704675
61234 704675 701416 698882 696645 694339 692238 690962 690442 689907 689091 688653 689157 690511 692726 696298 701331
61219G01331N723N580N164M544L552K649K334K215J888K026L197M221L473J357
61205G49254k25o37q90j421j399m02R50K324M213O714R156J1221J3269J5356J7111
61190H24594J8660K0349K1556K1049J8766J5907J3155J0106O767M151K973K847
61178I80880L094L345L056J623o18k491l440m099n210o809q600j0349j1687j2378
61164I26317j2783j3423j4164j4625j5110j6155j7416j7996j7726j7132j6309
61153G53478j4933j3142j1392r585p364m979k776l47K612N035N516M198K233j86
61139G08368l517o981q846q744p925p111n810l950k376j328jJ906L682N043O628
61124F69038Q601J0224J1327J2872J5429J8241K0365K1768K2926K4218K5950K8051
$$ plain form
61219 701331 707054 712634 717798 722342 725894 728543 730877 733092 734980 737006 740203 744424 747897 749254
61205 749254 749029 748392 747502 746081 744682 744280 745230 747554 751767 758481 767637 778858 792127 807483 824594
61190 824594 843254 863603 885159 906208 924974 940881 954036 964142 970909 975060 978033 980880
61178 980880 983974 987319 990375 991998 991380 988889 985449 981350 976140 969331 960731 950382 938695 926317
61164 926317 913534 900111 885947 871322 856212 840057 822641 804645 786919 769787 753478
61153 753478 738545 725403 714011 704426 697062 692083 689307 688960 691572 696607 702123 706321 708554 708368
61139 708368 704851 697870 689024 680280 672355 665244 659434 655484 653108 651780 651779 653685 657367 662410 669038
61124 669038 677639 687863 699190 712062 727491 745732 766097 787865 810791 835009 860959 889010
61112H89010K9661K9977K9440K9122K9076K8516K7313K5989K4403K2032J9362
61101A183901J7436J6013J3828J0542O867K780k473q521j3881j8016k1686k5054
61089A161736k7309k8380k9227l0082l0211k9597k9055k8440k6769k4352k2734
61078H55580k2078k0807j8356j6056j4582j2840j0315q329p824p776o965n619
61066G04033m296k836j315l96J25J369L279M347M148M142N113N963O059O625Q513
61051G44873J0640J1907J2857J4222J5611J6846J8722K1317K3376K4481K5838
61040I40690K7914K9518L0305L1755L4257L5828L5349L4647L5547L7172L8102
61029A311084L8912M0513M2247M3667M6029M9874N3270N4511N4433N4154N3175
$$ plain form
61112 889010 918671 948648 978088 1007210 1036286 1064802 1092115 1118104 1142507 1164539 1183901
61101 1183901 1201337 1217350 1231178 1241720 1248587 1251367 1248894 1240373 1226492 1208476 1186790 1161736
61089 1161736 1134427 1106047 1076820 1046738 1016527 986930 957875 929435 902666 878314 855580
61078 855580 833502 812695 794339 778283 763701 750861 740546 732217 724393 716617 709652 704033
61066 704033 699737 696901 695586 695190 695315 696684 699963 704310 708458 712600 717713 723676 729735 736360 744873
61051 744873 755513 767420 780277 794499 810110 826956 845678 866995 890371 914852 940690
61040 940690 968604 998122 1028427 1060182 1094439 1130267 1165616 1200263 1235810 1272982 1311084
61029 1311084 1349996 1390509 1432756 1476423 1522452 1572326 1625596 1680107 1734540 1788694 1841869
61018A841869N1890N3116N8479O6012P3964Q3933R7036J10294J20601J29431J39869
61007B826494J52400J68132J92663K31158K82691L45384M23780N24215O47121
60998E794038P93156R73069J199755J474597J797477K180820K609982K962780
60990A9785674L006665K552101J648807O08448k01790n94540o00450l29043J28393
60981B6004265O39602R56333Q08954J23689q78059j826660k452851k704489k675428
60972A7995356k480855k202780j898144j606954j347023j119258r23123p60860
60964E656359o29932n22122m31806l58895l02911k59820k25617j98449j76222
60955B550585j56097j37442j21963j09869r8658q6503p4212o3099n3276m4992
$$ plain form
61018 1841869 1893759 1946875 2005354 2071366 2145330 2229263 2326299 2436593 2557194 2686625 2826494
61007 2826494 2978894 3147026 3339689 3570847 3853538 4198922 4622702 5146917 5794038
60998 5794038 6587194 7560263 8760018 10234615 12032092 14212912 16822894 19785674
60990 19785674 22792339 25344440 26993247 27601695 27399905 26805365 26204915 25875872 26004265
60981 26004265 26643867 27600200 28409154 28532843 27654784 25828124 23375273 20670784 17995356
60972 17995356 15514501 13311721 11413577 9806623 8459600 7340342 6417219 5656359
60964 5656359 5026427 4504305 4072499 3713604 3410693 3150873 2925256 2726807 2550585
60955 2550585 2394488 2257046 2135083 2025214 1926556 1840053 1765841 1702742 1649466 1604474
60945A604474l9534l7567l7972l9108m0057m0247l9182l7088l4796l2651l0445
60934A195827k8408k7068k6049k4294k1741j9512j8163j6886j4882j2492j0461
60923I75871q890p472o107m810l440j832M2K158M381O431Q206R977J1852J3420
60909I99787J4408J5303J6656J8185J9282J9982K0549K0529J9311J7387J5830
60898A197209J4624J2739R923P126M828K209j408n353q579j1035j3286j5419j7073
60885A176505j8154j8865j9395k0050k1246k2866k4003k4014k3378k2906k2464
60874I39164k1353j9610j8074j7097j6141j4884j3862j3582j3624j3209j2254
60863G65474j1259j0435r517q435p613p459p815q071p770p085o752p378q712r758
$$ plain form
60945 1604474 1564940 1527373 1489401 1450293 1410236 1369989 1330807 1293719 1258923 1226272 1195827
60934 1195827 1167419 1140351 1114302 1090008 1068267 1048755 1030592 1013706 998824 986332 975871
60923 975871 966981 959509 953402 948592 945152 943320 943362 945520 949901 956332 964538 974515 986367 999787
60909 999787 1014195 1029498 1046154 1064339 1083621 1103603 1124152 1144681 1163992 1181379 1197209
60898 1197209 1211833 1224572 1234495 1241621 1246449 1248658 1247250 1241897 1233318 1222283 1208997 1193578 1176505
60885 1176505 1158351 1139486 1120091 1100041 1078795 1055929 1031926 1007912 984534 961628 939164
60874 939164 917811 898201 880127 863030 846889 832005 818143 804561 790937 777728 765474
60863 765474 754215 743780 734263 725828 718215 710756 702941 694870 687100 680015 673263 665885 657173 647415
60849F47415r748q791p461o112m961m382m495m757m627m556n545p631r553j0221
60835E54575r785r034q295p509o810o405o103n489m450l195j976j041o36o34m71
60820D82742K81J369K164K313J931J436J382K049K917L022K113J029N27L33j10
60805E05498m97j23Q12J247O67k53n79j87L30M48J95l2m4k08j021k313l259l353
60787D97328k997k856l072l413l760m034m039l840l941m608n340n503n155m769
60773D40001m488m130l686l308l027k797k566k024p98P81J713J566J061R07Q41
60758D20046M61K25O77J408J771K018K625L093K733K148K531L746M545M615M934
60743D57576N941O729O383M955K794J20k416l861m199m455n171n661n272m496
$$ plain form
60849 647415 637667 628876 621415 615303 610342 605960 601465 596708 592081 587525 581980 574349 564796 554575
60835 554575 544790 535756 527461 519952 513142 506737 500634 495145 490695 487500 485524 484483 483847 483213 482742
60820 482742 483023 484392 486556 488869 490800 492236 493618 495667 498584 501606 503719 504748 505275 505608 505498
60805 505498 505001 504878 505690 506937 507604 507351 506772 506585 506915 507363 507558 507526 507482 507274 506253 503940 500681 497328
60787 497328 494331 491475 488403 484990 481230 477196 473157 469317 465376 460768 455428 449925 444770 440001
60773 440001 435513 431383 427697 424389 421362 418565 415999 413975 413177 413958 415671 417237 418298 419205 420046
60758 420046 420507 420732 421409 422817 424588 426606 429231 432324 435057 437205 439736 443482 448027 452642 457576
60743 457576 463517 470246 476629 481584 484378 484498 482082 478221 474022 469567 464396 458735 453463 448967
60729D48967m235m716n601o491o841o125m595l324l025l290l396l287l340l675
60715C87026m066m198l694k416r00n0j25n65r15j285j701j781j409j067r99p13
60699C61142J59J086J285P90L10L42P95J287J435J096O62Q02J691K738L301L373
60683C82294L338L369L463L742M344N163N882O269O321O206O100O011N794N522
60669D53818N510N787N724M724L024J368M7j129k077k399k168k009k230k438k238
60654D63314j765j334j046r09j025j334j568j510j086l06N68Q51O2j354k461l042
60638D46055l783n119o496o992o329n038l893l264k836k037q25K08P03R91J358
60623D02703J442R59M01K72J94k80n75K3Q72O84m65j204r01k63J72O88J231J027
$$ plain form
60729 448967 444732 440016 434415 427924 421083 414958 410363 407039 404014 400724 397328 394041 390701 387026
60715 387026 382960 378762 375068 372652 371752 371702 371577 371012 370097 368812 367111 365330 363921 362854 361855 361142
60699 361142 361301 362387 363672 364462 364772 365114 365909 367196 368631 369727 370389 371191 372882 375620 378921 382294
60683 382294 385632 389001 392464 396206 400550 405713 411595 417864 424185 430391 436491 442502 448296 453818
60669 453818 459328 465115 470839 475563 478587 479955 480002 478873 476796 474397 472229 470220 467990 465552 463314
60654 463314 461549 460215 459169 458260 457235 455901 454333 452823 451737 451431 451999 452850 452912 451558 449097 446055
60638 446055 442272 437153 430657 423665 417336 412298 408405 405141 402305 400268 399443 399651 400354 401345 402703
60623 402703 404145 405104 405505 405777 405971 405691 405116 405139 406011 406695 406230 405026 404125 403862 404034 404722 405953 406980
60605D06980k5p72k76J008K042K306J721L82j060j580r05J99J074J854K735L462
60589D19145L866M059L881K993J819J265J210N09r72j729p66Q49J588J557J768
60574D41042K288K402K116K254L282M928O775Q457R573J0240J1387J3763J6696
60561E35203J8594J8537J6926J4632J2001Q679M203j155o097r198j0190r917r090
60548E83128p792o185m804l764k533q18J053K998N485Q529J1329J3465J5600J8293
60534F33984K0908K2543K3191K3162K2043J9191J4823R763M524n87m929p868r474
60521G71274j0282j0609j0557j0193r363p835o077n129n185n065l819k020o71
60508F84469L53J688L031L549L441L809N211P376J0309J4566K0195K6280L1849
$$ plain form
60605 406980 406955 406183 405907 406915 408957 411263 412984 413366 412306 410726 409821 410020 411094 412948 415683 419145
60589 419145 423011 427070 430951 433944 435763 437028 438238 438747 437775 436046 435280 436129 437717 439274 441042
60574 441042 443330 445732 447848 450102 453384 458312 465087 473544 483117 493357 504744 518507 535203
60561 535203 553797 572334 589260 603892 615893 624572 628775 627620 621523 612325 602135 592218 583128
60548 583128 575336 569151 564347 560583 558050 557232 558285 561283 566768 575297 586626 600091 615691 633984
60534 633984 654892 677435 700626 723788 745831 765022 779845 789608 794132 793545 788616 780748 771274
60521 771274 760992 750383 739826 729633 720270 712435 706358 701229 696044 690979 687160 685140 684469
60508 684469 684822 686510 689541 693090 696531 700340 705551 712927 723236 737802 757997 784277 816126
60495H16126L6742M1473M6619N2332N8057O2655O5022O4541O1014N4666M6283
60484A405530L6665K5540J1851m366k1014l5582m7179n6219o2830o6609o7575
60473A118212o6256o2909n7576n0907m4186l8346l3486k9291k5581k2379j9777
60462F67518j7684j5651j3320j1112r905r759r649q855p842p251o828o167n657
60449E37838n779o000n461m325l445l084k885k838l160l423k821j370k5M43M2
60434D93707q44j684j789q60M01Q89L11p60j785k564k811k301j420q54p10n45
60418D76381j96P4K33N40R15R69P76Q88J409J700J318P10O09J047J444J408J140
60401D91365R79R02O27J93O7N35J260J782K196K801L305L131K443K021K092K148
$$ plain form
60495 816126 852868 894341 940960 993292 1051349 1114004 1179026 1243567 1304581 1359247 1405530
60484 1405530 1442195 1467735 1479586 1475220 1454206 1418624 1371445 1315226 1252396 1185787 1118212
60473 1118212 1051956 989047 931471 880564 836378 798032 764546 735255 709674 687295 667518
60462 667518 649834 634183 620863 609751 599846 590087 580438 571583 563741 556490 549662 543495 537838
60449 537838 532059 526059 520598 516273 512828 509744 506859 504021 500861 497438 494617 493247 493222 493665 493707
60434 493707 492863 491179 489390 488530 488931 489820 490131 489371 487586 485022 482211 479910 478490 477636 476926 476381
60418 476381 476185 476259 476492 477032 477947 478916 479692 480580 481989 483689 485007 485717 486326 487373 488817 490225 491365
60401 491365 492344 493246 493873 494066 494133 494668 495928 497710 499906 502707 506012 509143 511586 513607 515699 517847
60385E17847K082K443L258L652L193K640K706L021L042L054L388L511K934K284
60371E59055K418L029L273L229L656M514M906M315L094J819R49Q64J492K130K309
60356F01052K578L748N678P559R019J0278J1629J3513J6618K0928K5003K7096
60344G54699K6747K4603K1119J6348J0636M445k203r185j5385j9371k0878k0772
60332G70803j9758j8048j6069j4458j3282j2103j0775r495q190o681n327m748
60320F31869m875n046m886m569m202l590k530r18J165L264M802N975P674J0141
60306F34274J2559J4629J7489K2130K7979L4109M0563M6768M9762M6382L7002
60295I83646K5135J3236Q63j2830k6661l8189m5516m7788m5271l9665l3423k7996
$$ plain form
60385 517847 519929 522372 525630 529282 532475 535115 537821 540842 543884 546938 550326 553837 556771 559055
60371 559055 561473 564502 567775 571004 574660 579174 584080 588395 591489 593308 594257 595121 596613 598743 601052
60356 601052 603630 607378 613056 620615 629634 639912 651541 665054 681672 702600 727603 754699
60344 754699 781446 806049 827168 843516 854152 858597 856394 847209 831824 812453 791575 770803
60332 770803 751045 732997 716928 702470 689188 677085 666310 656815 648625 641944 636617 631869
60320 631869 626994 621948 617062 612493 608291 604701 602171 601253 602418 605682 610484 616459 624133 634274
60306 634274 646833 661462 678951 701081 729060 763169 803732 850500 900262 946644 983646
60295 983646 1008781 1022017 1022880 1010050 983389 945200 899684 851896 806625 766960 733537 705541
60283G05541k3284j8845j4809j1484r044p767p686p906p292o012n394n951o610
60270E73457o255n130m248m107m366m270l245j550l22l73j142j507j351j365j610
60255E32616j491j029r77j480j733j182j00J097K189K717K263J306Q38J013J124
60240E37171R04P64P21L41j44J07J066J617J279R19J313K030K349K349K439K525
60224E57750K287J736J125P06P61J357K002K145J986K176K857L627M282M788M830
60209E94415M339M130M999O381P113P170P342P495O778N427M680M725M521L860
60195F73375L800M503M499K860O21q99j730k394k729k601k569k850k746j918j323
60180F67899j824k856l363l263l069k805k270j698j378j087n80r3J80N00R69J129
$$ plain form
60283 705541 682257 663412 648603 637119 628075 620308 612622 604716 597424 591412 586018 580067 573457
60270 573457 567202 562072 557824 553717 549351 545081 541836 540286 539964 539591 538449 536942 535591 534226 532616
60255 532616 531125 530096 529119 527639 525906 524724 524624 525721 527910 530627 532890 534196 535034 536047 537171
60240 537171 538075 538839 539560 539901 539757 539864 540930 542547 543826 544745 546058 548088 550437 552786 555225 557750
60224 557750 560037 561773 562898 563604 564365 565722 567724 569869 571855 574031 576888 580515 584797 589585 594415
60209 594415 598754 602884 607883 614264 621377 628547 635889 643384 650162 655589 660269 664994 669515 673375
60195 673375 677175 681678 686177 689037 689658 688759 687029 684635 681906 679305 676736 673886 671140 669222 667899
60180 667899 666075 663219 659856 656593 653524 650719 648449 646751 645373 644286 643706 643613 643793 644293 645262 646391
60164F46391O34k78j291k336l176l447l365l482l615l013j838j174j279j139k55
60149F17337N18O09P84J681K587K750K749L365M100M023L386L191L764M733N963
60134F61540P489Q924R776J0021R787Q898P271N305L376J417n94k305l420l861
60120G23624l365j824j11N67M53J068K796M053L610K338J710J820J954J992K038
60105G42723J603L68j034j950k690l575m024l614l137l435m021m060l835l926
60091G05393l708k209N0J544J844J859K236K737L133L569L896L625K652J443M51
60076G28515k21p67j648l246n199o614p296q059r341j0390j0425r753q906p658
60062F38992n938m818n336o767p325o353m839l998m166m884n304m720l320k142
$$ plain form
60164 646391 647025 646747 645456 643120 639944 636497 633132 629650 626035 623022 621184 620010 618731 617592 617337
60149 617337 617855 618464 619248 620929 623516 626266 629015 632380 636480 640503 643889 647080 650844 655577 661540
60134 661540 669029 677953 687729 697750 707537 716435 723706 729011 732387 733804 733210 730905 727485 723624
60120 723624 720259 718435 718324 718891 719344 720412 723208 727261 730871 733209 734919 736739 738693 740685 742723
60105 742723 744326 744694 743660 741710 739020 735445 731421 727807 724670 721235 717214 713154 709319 705393
60091 705393 701685 699476 699526 701070 702914 704773 707009 709746 712879 716448 720344 723969 726621 728064 728515
60076 728515 728294 727527 725879 722633 717434 710820 703524 695465 686124 675734 665309 655556 646650 638992
60062 638992 633054 628236 622900 616133 608808 602455 597616 593618 589452 584568 579264 574544 571224 569082
60048E69082j778j628r01K78J383K421L608M740N604O361O903O589N322M120L727
60033F15831L566K911K186J985J701M54j308k552l451m956o945q242q483q560
60019E84137r041r272q420o648m904l952l738l526k728j662j058q92m38L82P68
60004E29008N22N60J359K057J899J401J131N51p84j967k070j728k000k461j943
59989E25535n47N82J034J313J653J902K230K755K885K128J039L06n13k087l821
59974E36394m573m305l698k799j463m97p76j646j799j313j198j296m48J410L001
59959E14994L652L927M222M251L969L648K988J507j21n77J59P92P25P02J180J525
59943E47543J256Q18O91O84N33K18m71j747l044l373k645j681q99K6J082J641
$$ plain form
60048 569082 567304 565676 564775 565053 566436 568857 572465 577205 582809 589170 596073 602662 607984 612104 615831
60033 615831 619397 622308 624494 626479 628180 628634 627326 624774 621323 616367 609422 601180 592697 584137
60019 584137 575096 565824 557404 550756 545852 541900 538162 534636 531908 530246 529188 528296 527858 528240 529008
60004 529008 529530 530090 531449 533506 535405 536806 537937 538488 537704 535737 533667 531939 529939 527478 525535
59989 525535 524988 525570 526604 527917 529570 531472 533702 536457 539342 541470 542509 542815 542302 540215 536394
59974 536394 531821 527516 523818 521019 519556 519059 518283 516637 514838 513525 512327 511031 510583 511993 514994
59959 514994 518646 522573 526795 531046 535015 538663 541651 543158 543037 542460 542619 543411 544136 544838 546018 547543
59943 547543 548799 549617 550308 550992 551525 551743 551272 549525 546481 543108 540463 538782 537883 537909 538991 540632
59927E40632J508J285J384J505J299Q94O04O99J394K447L002K626K183K815M417
59912E68694N960O960P481P139N468L070J158m3j135k003j831p37M6j08o25j009
59896E98485j510k158k255j341K69K121M013N559O250O169N918N758N535N359
59882F38172N490N663N386M845M612M622M371L922L719L611L085K189J202l37
59868F90552k978n959p798q172q000p794p291o589o213o030n393m456l965l791
59854F06123l029j662o33j99M31J661L134M858P225R787J1555J2708J4373J6266
59840F82598J6290J3136P907K642j432l615l329r58J986M313N872O434N132J724
59826G38700k579o304q940j0558j1210j1288j1566j2234j2549j1857j0295q304
$$ plain form
59927 540632 542140 543425 544809 546314 547613 548507 549111 549810 551204 553651 556653 559279 561462 564277 568694
59912 568694 574654 581614 589095 596234 601702 604772 605930 605887 604752 602749 600918 600181 600227 600119 599494 598485
59896 598485 596975 594817 592562 591221 591490 593611 597624 603183 609433 615602 621520 627278 632813 638172
59882 638172 643662 649325 654711 659556 664168 668790 673161 677083 680802 684413 687498 689687 690889 690552
59868 690552 687574 681615 673817 665645 657645 649851 642560 635971 629758 623728 618335 613879 609914 606123
59854 606123 603094 601432 600799 600600 601031 602692 605826 610684 617909 627696 639251 651959 666332 682598
59840 682598 698888 712024 719931 722573 721141 717526 714197 713239 715225 719538 725410 731844 736976 738700
59826 738700 736121 729817 720877 710319 699109 687821 676255 664021 651472 639615 629320 621016
59814F21016o193m382l244k602k102k039k854l981m382m075l907l926l439k605
59800E71285k320k428j813n56j51j054j832j435o84n46n70l8O66R42J060J342
59784E61868J313O18j44l88m57q14j180j238j307j629j812j608j393j384j258
59769E49187r77r96j188p86J67N35l3l25N09J489J364N00J08M09P89J087J711
59752E53550K743L892M928N663N843N570N367N409N238M526L599K875K459K426
59738F14088K819L141K713J673Q45M84Q5m21m09K40P17N06N6n1J96O20J051J036
59720F29389K75o48r15p77j063j596j472p23k82l08j70l1o56j637j665p85m00
59703F16536p96p45J19P05P52J441K941L671L004K456L064L720L409K935K980
$$ plain form
59814 621016 614823 610441 607197 604595 602493 600454 597600 593619 589237 585162 581255 577329 573890 571285
59800 571285 568965 566537 564724 564168 564017 562963 561131 559696 559012 558466 557896 557858 558524 559466 560526 561868
59784 561868 563181 563799 563655 563267 562810 561996 560816 559578 558271 556642 554830 553222 551829 550445 549187
59769 549187 548210 547214 546026 545240 545407 545942 545909 545584 546093 547582 548946 549446 549554 549963 550752 551839 553550
59752 553550 556293 560185 565113 570776 576619 582189 587556 592965 598203 602729 606328 609203 611662 614088
59738 614088 616907 620048 622761 624434 625279 625763 625848 625427 625018 625258 625975 626481 626537 626486 626682 627302 628353 629389
59720 629389 629664 629016 628101 627324 626261 624665 623193 622470 622188 621880 621710 621679 621023 619386 617721 616936 616536
59703 616536 615740 614995 615114 615819 616571 618012 620953 624624 627628 630084 633148 636868 640277 643212 646192
59688F46192K492O39j381k160k056j926j446l61K87k27r83j192j680l048m048
59673F29102l667l179m126n657o023n444n303n605n344m530l783k786j125J41
59659E72671k37j431j584m87N98J214J834K348K332K466L696N276N479M145K669
59644F00989J598N1k241m082m468l851l284l193l282l110k508j825j581j709j598
59629E65906j123p84o04j4O80R9k006l780l548j911m34M78J058Q02p19k589l592
59612E47919l778l711l083j447M98J745K388K974L325L224L235L591L296J729
59598E61905M8m89n28j317k483k810k340j976j800j454j342j803j904p79O70J076
59582E42674P08N82M29n53j771k074j755j869k214k003j752k433l324k880j328
$$ plain form
59688 646192 648684 649323 647942 645782 643726 641800 640354 639993 640280 640053 639070 637878 636198 633150 629102
59673 629102 625435 622256 618130 612473 606450 601006 595703 590098 584754 580224 576441 573655 572530 572671
59659 572671 572434 571003 569419 568932 569530 570744 572578 574926 577258 579724 583420 588696 594175 598320 600989
59644 600989 602587 602638 600397 596315 591847 587996 584712 581519 578237 575127 572619 570794 569213 567504 565906
59629 565906 564783 563999 563395 563381 564061 564160 562154 558374 554826 552915 552481 552959 554017 554819 554100 551511 547919
59612 547919 544141 540430 537347 535900 536398 538143 540531 543505 546830 550054 553289 556880 560176 561905
59598 561905 561953 561464 560936 559619 557136 554326 551986 550010 548210 546756 545414 543611 541707 540928 541598 542674
59582 542674 543382 543964 544393 543840 542069 539995 538240 536371 534157 532154 530402 527969 524645 521765 520437
59567E20437l41m45p08o87p50p19l1R12J250J191J443J609Q81j76l74R7K33K18
59549E24040R70K136K567K414K775L638M065M145M851O335Q026R951J2415J5114
59535F03442J8192K2695K7562K7852J9520N467o578j2141j2861j1629q878m619
59523F68024m98K133L867N422O170N595M432L251J563q13l074m824o655q671j0053
59508F65869j0591j1096j1760j1764j0925j0105r503q250o194m442l631l247l005
59495E61356l277l740l354k129j213q54q5J154J493M13p44p46R9J129K367L684
59479E55553M412M400M291M374M476M994O425P831P659O256N611O242O426N029
59465F33979L041J638P37J78M12J175J339R92J800M338O900Q024Q543R874J1757
$$ plain form
59567 520437 520096 519651 518943 518256 517506 516787 516756 517668 518918 520109 521552 523161 524042 523866 523492 523589 523822 524040
59549 524040 525010 527146 529713 532127 534902 538540 542605 546750 551601 557936 565962 575913 588328 603442
59535 603442 621634 644329 671891 699743 719263 724730 718152 706011 693150 681521 672643 668024
59523 668024 667526 669659 673526 678948 685118 690713 695145 698396 699959 699146 696072 691248 684593 675922 665869
59508 665869 655278 644182 632422 620658 609733 599628 590125 581875 575681 571239 567608 564361 561356
59495 561356 558079 554339 550985 548856 547643 546789 546704 547858 549351 549764 549020 548274 548373 549502 551869 555553
59479 555553 559965 564365 568656 573030 577506 582500 588925 596756 604415 610671 616282 622524 628950 633979
59465 633979 637020 638658 639395 639573 639985 641160 642499 643491 645291 649629 656529 664553 673096 682970 694727
59450F94727J2963J3095J2568J1681J0598R504Q190O182L506M53l237p800j2186
59437G60244j4782j5360j4875j3662j1502r154p782p018n629l899l152l106k182
59424F48141k77J359K950N860R380J1124J1173J2410J5943J9480K1350K2708K4568
59411H06169K6289K8318L2241L5806L2117J7533k548j9067k7990l0657k8639k2789
59399H46783j5367q363m31J0127J9539K0121Q796q885k4199l2409l3966l1468
59387G50278k7295k2958j8978j5275j1905r142p033n384m052k870j623m11M54
59374F23806J148K145L170L430L157L604M965N877N691N566O283O692N779M733
59360F86046N227O797P704P566P484Q119R142J0209J1247J2135J2960J4136J5595
$$ plain form
59450 694727 707690 720785 733353 745034 755632 765136 773326 779508 783014 783467 780230 772430 760244
59437 760244 745462 730102 715227 701565 690063 680909 673127 666109 660480 656581 653429 650323 648141
59424 648141 647864 649223 652173 658033 667413 678537 689710 702120 718063 737543 758893 781601 806169
59411 806169 832458 860776 893017 928823 960940 978473 975925 956858 928868 898211 869572 846783
59399 846783 831416 823053 822622 832749 852288 872409 881205 872320 848121 815712 781746 750278
59387 750278 722983 700025 681047 665772 653867 644725 637692 632308 628256 625386 623763 623352 623806
59374 623806 624954 627099 630269 633699 636856 640460 645425 651302 656993 662559 668842 675534 681313 686046
59360 686046 691273 698070 705774 713340 720824 728943 738085 748294 759541 771676 784636 798772 814367
59347H14367J6573J6818J7087J7753J8071J7583J6979J6715J5972J3948J1011
59336I92877P571L236j855o210q814j0572j2673j4831j6386j7764j9419k0477
59324H74683k0029j8683j7433j5998j3773j1410r881q916p779o728o237n726m518
59311G27572l233k761k669k033j082o00m33N9Q08J472K353L741N177O441Q289
59296G43101J1117J4105J6757J9715K2471K1805J4856L051q922j7519k2174k3685
59284G94678k2957k1080j8913j6375j3236j0147p817n746k989L35L411O007Q294
59271F93465J0093J1385J2833J4683J5908J5603J4364J3164J1740R335O156K849
59259H31578n87m204p342r637j1792j4119j5379j4506j2409j0706r591q384p100
$$ plain form
59347 814367 830940 847758 864845 882598 900669 918252 935231 951946 967918 981866 992877
59336 992877 1000448 1003684 1001829 995619 986805 976233 963560 948729 932343 914579 895160 874683
59324 874683 854654 835971 818538 802540 788767 777357 767476 758560 750781 744053 737816 732090 727572
59311 727572 724339 721578 718909 716876 715794 715194 714761 714820 715628 717100 719453 723194 728371 734812 743101
59296 743101 754218 768323 785080 804795 827266 849071 863927 866978 858056 840537 818363 794678
59284 794678 771721 750641 731728 715353 702117 691970 684153 678407 675418 675753 679164 685171 693465
59271 693465 703558 714943 727776 742459 758367 773970 788334 801498 813238 822573 828729 831578
59259 831578 830991 826787 819445 809808 798016 783897 768518 754012 741603 730897 721306 712922 705822
59246G05822o043m818l251k250k295k079k68K396M285N149N702O025O063O605
59232G21043P949Q603P194M753L296K958K378J060n64k545m956o749p020o785
59218G30615p555q735q453o413m094k441j241l98j22r7N8j16j061k089k383k351
59202F83124k631k715k063j483j737j910r77J17q2j046j309j015j253j744j377
59187F61899l84J79M13R44J186L61n41p5J156J598J530K322L645M057L827M490
59171F86607N907O509O229O645Q171R615J0611J2011J3676J4124J2790J0732Q884
59158H12511P309O085N151L510L46l280n686o957q268r562j0041j0253j1272j2390
59144G57203j2144j1101j0975j1442j0660q743p751q205q493p917p548p641p041
$$ plain form
59246 705822 699779 694961 691710 689460 687165 685086 684818 687214 691499 696648 702350 708375 714438 721043
59232 721043 728992 737595 744789 749542 752838 755796 758174 759234 758670 756125 751169 744420 737400 730615
59218 730615 723060 714325 705872 699459 695365 692924 691683 691285 691163 691066 691124 691008 689947 687858 685475 683124
59202 683124 680493 677778 675715 674232 672495 670585 669608 669725 669643 668597 667288 666273 665020 663276 661899
59187 661899 661515 661694 662107 663051 664237 664598 664057 663982 665138 666736 668266 670588 674233 678290 682117 686607
59171 686607 692514 699023 705252 711897 720068 729683 740294 752305 765981 780105 792895 803627 812511
59158 812511 819820 825905 831056 834566 834912 831632 825946 818989 810721 801159 791118 780865 769593 757203
59144 757203 745059 733958 722983 711541 700881 692138 684387 676182 667689 659772 652224 644583 637542
59131F37542n593m651m534l951k455j156m68N23J974K833K966L567M940O086O845
59116F44468Q234J0122J0953J0307R605R718R930R784R816R907Q964O837M705
59103G63350L225K199K065L450N093M769K579Q61L64o95l136n088m954l660k675
59088G67747j896p45M06J002J049L21j579l905n238n676o730q670j0041j0196
59074G15849j0160j0397r952q497p153o486n643m224l133k882k858k783l005l086
59060F35590k113p85q87k278k824j804q99j142j476j236j437k429k709j420J17
59045F12268O45O79Q45N12o12j405j117n57m80m14j8J22r5J92J146J794J834K153
59027F17492K978L547M040N646Q161R839J0294J1181J3188J4753J4702J3746J2423
$$ plain form
59131 637542 631949 627298 622764 618813 616358 615202 614734 615257 617231 620064 623030 626597 631537 637623 644468
59116 644468 652702 662824 673777 684084 693689 703407 713337 723121 732937 742844 751808 758645 763350
59103 763350 766575 768774 770839 774289 779382 784151 786730 787591 787955 787260 784124 779036 774082 770422 767747
59088 767747 765851 765106 765512 766514 767563 767884 766305 762400 757162 751486 744756 736086 726045 715849
59074 715849 705689 695292 685340 676843 669690 663204 657561 653337 650204 647322 644464 641681 638676 635590
59060 635590 633477 632692 631805 629527 626703 624899 624000 622858 621382 620146 618709 616280 613571 612151 612268
59045 612268 612913 613592 614437 614949 614337 612932 611815 611258 610778 610364 610346 610468 610373 610565 611711 613505 615339 617492
59027 617492 620470 624017 628057 633703 641864 651703 661997 673178 686366 701119 715821 729567 741990
59014G41990R976O390L152Q56j657m670o476o143n024m258l038p40J524K791L705
58999G38378M860N753O433P904R800J0058Q179O300N761N184L501K135K279K415
58985H18940O75k327m927o750p954q035p133o688p108o660m127p15K066M389O555
58970G70201P752P924Q706J0778J2474J2636J2594J3555J4378J3936J3342J3638
58958I11914J3455J1266P976N061J925k449p034j0299j2720j5473j8031j9167
58946H66424j9116j8771j7955j6302j4558j3315j1849r737q080p496o653m509
58934G18083k394k036k987l707l780l445k545j421j280k276k938k672k805l834
58920F79963m068k646j435j982k936k541j442q07K4J673K716J982R51J459K919
$$ plain form
59014 741990 751966 758356 761508 762364 760707 756037 749561 743418 738394 734136 731098 730358 731882 734673 738378
58999 738378 743238 748991 755424 763328 773128 783186 791365 797665 803426 808610 812111 814246 816525 818940
58985 818940 819615 817288 812361 805611 797657 789622 782489 775801 768693 762033 757906 757191 759257 763646 770201
58970 770201 777953 785877 794583 805361 817835 830471 843065 856620 870998 884934 898276 911914
58958 911914 925369 936635 944611 949672 951597 949148 942114 931815 919095 903622 885591 866424
58946 866424 847308 828537 810582 794280 779722 766407 754558 744821 736741 729245 722592 718083
58934 718083 715689 713653 710666 706959 703179 699734 697189 695768 694488 692212 689274 686602 683797 679963
58920 679963 675895 673249 671814 669832 666896 664355 662913 662106 662130 663803 666519 668501 669452 670911 673830
58905F73830M056N424P771R914J0683J1269J3099J5204J6060J6281J7003J7432
58893H18026J6477J5203J5156J5934J6717J8395K1735K5262K7381K8755L0181
58882A049222L0145K7131K2476J8177J3778Q156K436j797n432j0026j4826j8404
58870A121036k1459k4944k7252k6398k3462k0804j8480j5470j2709j1662j1415
58859I06981j0455r785j0997j2846j3157j2598j3139j4125j3597j2178j1888j2174
58847G60042j0899q436p126p317p378o986p076p232o453n755o720q280q161o786
58833F55437o325o696o053m558m089m607m286k947k084j819r57K88P00P22J709
58818F14435L132L520L442M370N470M845L284L183M417M805M105L938M161L073
$$ plain form
58905 673830 677886 683310 691081 700995 711678 722947 736046 751250 767310 783591 800594 818026
58893 818026 834503 849706 864862 880796 897513 915908 937643 962905 990286 1019041 1049222
58882 1049222 1079367 1106498 1128974 1147151 1160929 1169085 1171521 1169724 1164292 1154266 1139440 1121036
58870 1121036 1099577 1074633 1047381 1020983 997521 976717 958237 942767 930058 918396 906981
58859 906981 896526 886741 875744 862898 849741 837143 824004 809879 796282 784104 772216 760042
58847 760042 749143 740707 733581 726264 718886 711900 704824 697592 691139 685384 678664 670384 662223 655437
58833 655437 649112 642416 636363 631805 627716 623109 618823 615876 613792 611973 611016 611304 612004 612726 614435
58818 614435 617567 621087 624529 628899 634369 639214 642498 645681 650098 654903 659008 662946 667107 670180
58804F70180R64j72l32j337l054l385k100j306j902k747l353m356n326n158m516
58789F32100m855n434m380k218r49k49J777M431N020L520K826M092N471N806N986
58774F52944O206N339L434J712r4l177o487p539o526o102o996p296o315n530n297
58759F08276m225k348j418j546q53J040K405K702L211L972L520K033J507K306
58745F20582K770K605L344N149O458P042Q087R115Q417O706O507P678P471N571
58731G07502M907O632Q347Q391Q066Q324P971O629O038O832P195O119N085N279
58717H03317N907O472P851J0107J1766J2187J2192J1894J0472Q350O768N100J593
58704I13976l189o912r398j2533j6278j8618j9629k1532k4280k5161k3491k1650
$$ plain form
58804 670180 671144 670972 670640 669303 666249 662864 660764 659458 657556 654809 651456 647100 641774 636616 632100
58789 632100 627245 621811 617431 615213 614264 614015 615792 620223 625243 628763 631589 635681 641152 646958 652944
58774 652944 659150 664489 667923 669635 669541 666364 659877 652338 645812 639710 632714 625418 619103 613573 608276
58759 608276 604051 601703 600285 598739 597886 598926 601331 604033 607244 611216 614736 616769 618276 620582
58745 620582 623352 625957 629301 634450 640908 647950 656037 665152 673569 680275 686782 694460 701931 707502
58731 707502 712409 719041 727388 735779 743845 752169 760140 766769 772807 779639 786834 792953 798038 803317
58717 803317 809224 815696 823547 833654 845420 857607 869799 881693 892165 900515 907283 912383 913976
58704 913976 910787 903875 894477 881944 865666 847048 827419 805887 781607 756446 732955 711305
58692G11305k0722j9097j6296j4073j2795j0658p615o101o736p199o450o130o702
58679E70731o294m601l863m589m364k340q33r00m28J630L176L029L219N237P516
58664E66326Q642R741J1799J3653J4297J4162J2906R257M116M02j264l093n570
58651F55374o406n132m406n343n818m923m741o002o311m691l606m420m917l505
58637E85153j855j258k68J921L607M060M987O653O627M283K389K281J690n27j992
58622F17751j388r35j821j624J036L595M120M531O466Q150Q256Q676J0429J0866
58608F78108Q137M586K632J095j387l159k946k702l992n066m512m131n269o056
58594F55338n124m376n131n391l739k024j320N99M724Q044Q530Q666J0699J2636
$$ plain form
58692 711305 690583 671486 655190 641117 628322 617664 610049 603948 597212 590013 583563 577433 570731
58679 570731 564437 559836 555973 551384 547020 544680 543847 542947 542519 544149 547325 550354 553573 558810 566326
58664 566326 574968 584709 596508 610161 624458 638620 651526 660783 664899 665301 664037 660944 655374
58651 655374 648968 643836 639430 634087 628269 623346 618605 612603 606292 601601 597995 593575 588658 585153
58637 585153 583298 582040 581772 583693 587300 591360 596347 603000 609627 613910 616299 618580 620270 619743 617751
58622 617751 616363 615428 613607 611983 613019 616614 620734 625265 631731 639881 648137 656813 667242 678108
58608 678108 686245 690831 693463 694558 693171 690012 687066 684364 680372 675306 670794 666663 661394 655338
58594 655338 650214 645838 640707 635316 631577 629553 628233 628832 633556 641600 650130 658796 669495 682131
58580F82131J2446J1939J2784J2863J0443P963P745P885O308M977O105P949Q435
58567G99973R199J2056J5174J6776J8850K3145K7251K8766K9577L1699L2729K9865
58555A075060K4864K0539J5887R156K342j964m999q751j1703j1856j0775j0471
58543A087329r717p533o675r342j3013j4929j6876k0991k4695k4787k2965k2343
58531H93463k1910j9403j6170j4212j1842p398l646l332l767j219K603L898L353
58518H00418L805M472L116J156J057J299o95l348l822l339m378n448m094k191
58504G88008k785m399l894k245k181k804j983j198k667m472l927k827l942n364
58490G43320l977j399p47o95J374L560K942J774L858P624R182R421J1680J5059
$$ plain form
58580 682131 694577 706516 719300 732163 742606 750569 758314 766199 772507 777484 783589 791538 799973
58567 799973 809172 821228 836402 853178 872028 895173 922424 951190 980767 1012466 1045195 1075060
58555 1075060 1099924 1120463 1136350 1145506 1147848 1145884 1140885 1132134 1120431 1108575 1097800 1087329
58543 1087329 1077612 1070079 1063404 1054062 1041049 1026120 1009244 988253 963558 938771 915806 893463
58531 893463 871553 852150 835980 821768 809926 802528 798882 795550 791783 790564 793167 797065 800418
58518 800418 804223 808695 811811 812967 814024 815323 814628 811280 807458 804119 799741 794293 790199 788008
58504 788008 785223 780824 776930 774685 772504 769700 767717 766519 763852 759380 755453 752626 748684 743320
58490 743320 739343 737944 737197 736502 737876 741436 744378 746152 750010 757634 766816 776237 787917 802976
58476H02976J6512J6930J8716J9929J7305J2502R000N581n74p180j0061j0407
58464H91229j1956j3705j2370r395q328p806m390J74J943K429N693J0190J1384
58451H55092J0313J1505J4165J3456R153N184J981k998q448j0627j0443j1681
58439H76652j3384j1537p043m509m210k641J68J235J229L107N557N129L439M798
58425H57990Q233R543R478J2023J6008J6595J3780J1490R600M915j267m623n558
58412I58207p587r722q598o356p710j0930j0519p314o749q603p896m834m264o028
58398H51097n341k146q23j226P00M075M209J823J807L520J996k017l001r86r91
58383H52696k851j745J659J908n87j7L890N700M916O293R613R788P250P631J0890
$$ plain form
58476 802976 819488 836418 855134 875063 892368 904870 913870 919451 918877 911697 901636 891229
58464 891229 879273 865568 853198 843803 835475 827669 823279 823453 825396 827825 833518 843708 855092
58451 855092 865405 876910 891075 904531 913684 918868 920849 917851 909403 898776 888333 876652
58439 876652 863268 851731 844688 840179 835969 833328 833496 834731 835960 839067 844624 849753 853192 857990
58425 857990 866223 875766 885244 897267 913275 929870 943650 955140 964740 969655 968388 963765 958207
58412 958207 950620 940898 932300 925944 918234 907304 896785 889471 882722 874119 866223 861389 857125 851097
58398 851097 845756 843610 842787 841561 842261 846336 850545 852368 854175 857695 859691 857674 854673 853687 852696
58383 852696 849845 848100 849759 851667 851080 851063 854953 860653 865569 871862 881475 891263 898513 906144 917034
58368I17034J1368Q831Q671J1063J0891Q569R702J3731J4377J1721J2179J6014
58356A054151J6726J3517J2307J3535J1223N277K438L683K924m94m72L299M156
58343A142270J437J933O699R090P847R124J3642J4929J2421J3078J7693J8993
58331A269156J5710J5005J8405J9023J5361J4054J6098J4417Q070M818O447N755
58319A422319J111l49K849L610Q50K013P804R805O705P130J2725J4581J0631J0024
58305A511808J5535J8292J4999J3816J7800J9157J5438J4711J9118K0142J5745
58294A696561J5078K0475K2434J8275J7735K3867K6838K3254K2895K9277L2598
58283A949287K9202K8824L4908L7333L2550L1097L6947L9607L5082L4089M0714
$$ plain form
58368 917034 928402 937233 945904 956967 967858 976427 986129 999860 1014237 1025958 1038137 1054151
58356 1054151 1070877 1084394 1096701 1110236 1121459 1126736 1129174 1132857 1135781 1135287 1134815 1138114 1142270
58343 1142270 1143707 1145640 1152339 1161429 1169276 1178400 1192042 1206971 1219392 1232470 1250163 1269156
58331 1269156 1284866 1299871 1318276 1337299 1352660 1366714 1382812 1397229 1405299 1410117 1416564 1422319
58319 1422319 1423430 1423081 1425930 1429540 1430390 1432403 1440207 1450012 1456717 1463847 1476572 1491153 1501784 1511808
58305 1511808 1527343 1545635 1560634 1574450 1592250 1611407 1626845 1641556 1660674 1680816 1696561
58294 1696561 1711639 1732114 1754548 1772823 1790558 1814425 1841263 1864517 1887412 1916689 1949287
58283 1949287 1978489 2007313 2042221 2079554 2112104 2143201 2180148 2219755 2254837 2288926 2329640
58272B329640M3979L9683L9215M7210N2316M9834N1130O0442O5430O1412O1307
58261B901598P0394P5455P0756O9794P8685Q3405P6853P2773P8737Q1650P4761
58250C734861P2279Q1648Q8508Q5180Q6372J00015J10951J10738J14528J30466
58240D715546J42402J41711J45339J62727J76685J77485J83001K03539K20760
58231F269195K24015K32429K57203K78482K84642K96777L27945L57157L71466
58222H899311L93045M35554M76112N01066N34974N92151O46719O84832P36537
58213A3900301Q19484R04273R74673J065315J197575J339005J472073J637902
58205B3310601J862599K111416K370457K696991L129906L636332M213924M952511
$$ plain form
58272 2329640 2373619 2413302 2452517 2499727 2552043 2601877 2653007 2713449 2778879 2840291 2901598
58261 2901598 2971992 3047447 3118203 3187997 3266682 3350087 3426940 3499713 3578450 3660100 3734861
58250 3734861 3807140 3888788 3977296 4062476 4148848 4248863 4359814 4470552 4585080 4715546
58240 4715546 4857948 4999659 5144998 5307725 5484410 5661895 5844896 6048435 6269195
58231 6269195 6493210 6725639 6982842 7261324 7545966 7842743 8170688 8527845 8899311
58222 8899311 9292356 9727910 10204022 10705088 11240062 11832213 12478932 13163764 13900301
58213 13900301 14719785 15624058 16598731 17664046 18861621 20200626 21672699 23310601
58205 23310601 25173200 27284616 29655073 32352064 35481970 39118302 43332226 48284737
58197D8284737N922940P114769Q568307J0441539J2844081J5744604J9150159
58190A28071136K3198129K7946496L3307918L9266310M5516896N0204090M9479570
58183C96990545L9733599K1129534j416582k1318842l4405218m0210380m0418485
58176C20084171l7159568l2519858k8311482k5412167k3492860k1734117j9710393
58169A31743726j7498633j5272572j3123902j1152999r453858q011947o758333
58162E0471482n690655m836226m151469l562752l061280k667924k349644k054484
58154B2097048j788904j584315j423432j268294j125864j021666r40841q54428
58146A2089304p73094p19455o76644o16673n51717n07786m74406m27771l77906
$$ plain form
58197 48284737 54207677 61322446 69890753 80332292 93176373 108920977 128071136
58190 128071136 151269265 179215761 212523679 251789989 297306885 347510975 396990545
58183 396990545 436724144 457853678 456437096 435118254 400713036 360502656 320084171
58176 320084171 282924603 250404745 222093263 196681096 173188236 151454119 131743726
58169 131743726 114245093 98972521 85848619 74695620 65241762 57229815 50471482
58162 50471482 44780827 39944601 35793132 32230380 29169100 26501176 24151532 22097048
58154 22097048 20308144 18723829 17300397 16032103 14906239 13884573 12943732 12089304
58146 12089304 11316210 10596755 9920111 9303438 8751721 8243935 7769529 7341758 6963852
58137F963852l46875l24336k89058k52284k37143k35414k24859k09949k06980
58128D636954k07585j94386j75552j68418j65430j50147j30606j23914j23544
58119C197372j13620j00358r8318j00349r1567p8920p7413q0590p3565o2182o0969
58108B259521o4786o0049n1986n3540n8746n3894m4298m3945m8842m6061l9260
58097A694114m0298m4890m1093l3121l3023l7062l3588k6099k5842k9376k5781
58086A323941j8494j8261k1736j8514j2255j3736j9785j9741j6151j8664k3995
58075A122609k2294j7065j8720k4177k2744j6740j6598k0638j9049j3311j2693
58064I18580j5814j4047r119r347j2543j0300n192o275j1466j1600q060r342j3859
$$ plain form
58137 6963852 6616977 6292641 6003583 5751299 5514156 5278742 5053883 4843934 4636954
58128 4636954 4429369 4234983 4059431 3891013 3725583 3575436 3444830 3320916 3197372
58119 3197372 3083752 2983394 2885076 2784727 2693160 2614240 2536827 2456237 2382672 2320490 2259521
58108 2259521 2194735 2134686 2082700 2029160 1970414 1916520 1872222 1828277 1779435 1733374 1694114
58097 1694114 1653816 1608926 1567833 1534712 1501689 1464627 1431039 1404940 1379098 1349722 1323941
58086 1323941 1305447 1287186 1265450 1246936 1234681 1220945 1201160 1181419 1165268 1146604 1122609
58075 1122609 1100315 1083250 1064530 1040353 1017609 1000869 984271 963633 944584 931273 918580
58064 918580 902766 888719 879600 870253 857710 847410 842218 835943 824477 812877 804817 795475 781616
58051G81616j3199q936r334j2676j0606m973m690q645q133l782l854p848p799
58038F77141m033m135p829p969m877n066p463n480j062k089p447q937o487p215
58024E97052j0933j0785p078o521q776p480l441l308o259n506j893k483o584o765
58010E09240k976k201m703l982q0K82l217m142j878j955m056k349K219K665r46
57995D81921j509J846K826N35O41L552L568M71P8K608K243j131j588R49L10l686
57979D93634m587j784j737n441o479l245j553l248l417r59q45l802m417j694j067
57964D49359l806m640j978m48j321l70K836L384O92r0J885J554j905l243j317
57949D40592j185l999m708j996p23k186j682J832L330J523J522N029P259O294
$$ plain form
58051 781616 768417 759481 750147 737471 726865 721892 717202 708557 700424 696642 692788 684940 677141
58038 677141 673108 668973 661144 653175 648298 643232 635769 630289 629227 627138 619691 610754 604267 597052
58024 597052 586119 575334 568256 561735 552959 545479 542038 538730 532471 526965 525072 522589 516005 509240
58010 509240 506264 504063 499360 495378 495298 495580 492363 488221 486343 484388 480332 477983 480202 482867 481921
57995 481921 480412 482258 485084 485619 486260 489812 493380 493851 493929 496537 498780 497649 496061 497010 497320 493634
57979 493634 489047 487263 485526 480085 473606 470361 468808 465560 462143 461184 460339 456537 452120 450426 449359
57964 449359 445553 440913 438935 438487 437166 436796 439632 443016 443708 443618 445503 447057 445152 441909 440592
57949 440592 439407 435408 430700 428704 427981 425795 424113 425945 429275 430798 432320 437349 444608 450902
57935D50902O387R137J0525R475J0379J4200J5881J3460J1109J0511Q016L071
57923E73053N24J553J087k723n199m315m395p403r191p850p354r360r741o889
57909E01797n250o940p816n543l762m592m815l030k896n598o840m903m035o192
57895D29585p128m536k360l061l154n21J291J92k14K218L923K651J795L550M658
57880D28889L149K480M659N974L866J549J569J251j231k770j551r42k964m224
57866D39704k589j448l030l985k058q08k901m890l500j238r51o38J605L087J808
57851D18168P60K342L770K622J448K429K837N16j514o71K83j385l274k858k430
57836D23043m234n690m386k940m017n215l795j857j986k260m34J322O47k95R61
$$ plain form
57935 450902 457289 466426 476951 486426 496805 511005 526886 540346 551455 561966 569982 573053
57923 573053 573577 575130 576217 573494 568295 563980 559585 552182 542991 535141 527787 518427 508686 501797
57909 501797 496547 489607 481791 476248 472486 467894 463079 460049 457153 451555 444715 439812 435777 429585
57895 429585 422457 417921 415561 412500 409346 408825 410116 410308 410094 412312 416235 418886 420681 424231 428889
57880 428889 432038 434518 439177 445151 449017 450566 452135 453386 452155 449385 447834 446892 443928 439704
57866 439704 437115 435667 432637 428652 426594 425786 422885 417995 414495 413257 412306 411668 413273 416360 418168
57851 418168 418928 421270 425040 427662 429110 431539 434376 434892 433378 432707 432990 431605 428331 425473 423043
57836 423043 418809 413119 408733 405793 401776 396561 392766 390909 388923 386663 386229 387551 388198 387903 388864
57821C88864K408J675P43J981L467K846J894K855M039L372K420K776K449n6k170
57806D19563j891j739l960o047n327l783l970m298k791j356j856k042J26K159
57792C82788J555N11J586K791J639P2N46J131o59k800k323m56L14P52K087K523
57776C92057J010O06L413O100N248L255L788N289M309J893J101J285J04j548j656
57761D26254j420k740m081l400k277k736l076j379J29j085k951k522j263j684
57747C95769k103M6K788K927J846K599L977K843N9j242j051j268j442n40m27k807
57731D01974n206m821l651m801o562n502k810k071k983k845k044k630l440k107
57717C50501q9m03k095k114q79q54j479p34J21j408l868m030k520k250k878k081
$$ plain form
57821 388864 391272 392947 393690 395671 399138 401984 403878 406733 410772 414144 416564 419340 421789 421733 419563
57806 419563 417672 415933 411973 405926 400599 396816 392846 388548 385757 384401 382545 380503 380629 382788
57792 382788 384343 384854 386440 389231 390870 390942 391488 392619 391960 389160 386837 386381 386695 387447 389534 392057
57776 392057 393067 393673 397086 403186 408434 411689 415477 420766 425075 426968 428069 429354 429458 427910 426254
57761 426254 424834 422094 418013 414613 412336 409600 406524 405145 405274 404189 401238 398716 397453 395769
57747 395769 393666 393712 396500 399427 401273 403872 407849 410692 410751 409509 408458 407190 405748 405208 404781 401974
57731 401974 396768 391947 388296 383495 376933 371431 368621 366550 363567 360722 358678 356048 352608 350501
57717 350501 350412 350009 347914 345800 344921 344067 342588 341854 341975 340567 336699 332669 330149 327899 325021 322940
57701C22940o71j155k640k368r14p76j290j65J475Q70r20o70J124J322m7l95J76
57684C15896m30j349P9K958L927L055L488N867Q069R904J3074J7059K0026K3232
57670D24855K9556L8220M6031N3281O3025P4250Q0468P5584N7687K8318p114l8937
57658I25224n8707o5995o6293o3118n6414m7327l8990l2376k6071k0279j6693
57647D32961j4662j1868q578p013o815n543l288k392k886k548j235q31j222o07
57633C63473N57K28j026q16N70Q04O5N22J833J667K32k56j6j011k391j559P03
57616C63579J079n79j335o91r45k148j851p1M94m99n97N34N59q20j286m34k84
57599C54705j012p02M25J19j424j801j105j636k973k398l45j33j981k606j307
$$ plain form
57701 322940 322269 321114 318474 316106 315192 314416 313126 312961 314436 315306 314386 313716 314840 316162 316115 315720 315896
57684 315896 315466 314117 314196 317154 321081 324136 327624 333491 341560 351464 364538 381597 401623 424855
57670 424855 454411 492631 538662 591943 654968 729218 809686 885270 942957 971275 964161 925224
57658 925224 866517 800522 734229 671111 614697 567370 528380 496004 469933 449654 432961
57647 432961 418299 406431 397853 390840 384025 378482 375194 372802 369916 367368 366133 365302 364080 363473
57633 363473 364030 364258 363232 362416 362986 363790 363855 364377 366210 367877 368109 367853 367837 366826 364435 362876 363579
57616 363579 364658 364079 362744 362053 361108 358960 357109 357038 357532 357033 356436 356970 357529 356709 355423 354989 354705
57599 354705 353693 352991 353416 353535 352111 350310 349205 347569 344596 342198 341853 341720 339739 337133 335826
57584C35826r76k236k130J78J650P95j25K42K35p83r41J21K17j086j492m89l35
57567C28671j493j633m35n47k432l021j147L67j47n57P33K065K123K108K511J795
57551C28961O0o8K087L778L547L327M202M219K402R98J586K590K593K663L586
57536C66531M131L733L598L822K783N91m23K66N46j99j35R57Q63o28r19N21R72
57519C87010m39j059K86J253P65J114L211M490L811L831N977P523O443M902N000
57504D34118N186L852K639L047L405K159Q31Q45P48o86j771j045K1nj3Q71J204
57487D55406K80K0J365K099O68j078j247p57n77M42K627L807K964K210K793K750
57471D73772R03n83j86J56j031j797n96N65j4m05J201K939K779K259L273M374
$$ plain form
57584 335826 334850 332614 330484 330662 332312 333107 332982 333224 333459 332676 331735 331856 332073 330987 329495 329006 328671
57567 328671 327178 325545 325110 324563 322131 319110 317963 318330 318183 317626 318359 320424 322547 324655 327166 328961
57551 328961 329021 328953 331040 334818 338365 341692 345894 350113 352515 353513 355099 357689 360282 362945 366531
57536 366531 370662 374395 377993 381815 384598 385189 384766 385032 385578 385379 385244 386201 387064 386436 385517 386038 387010
57519 387010 386571 385512 385798 387051 387816 388930 392141 396631 400442 404273 410250 417773 424216 429118 434118
57504 434118 439304 443156 445795 448842 452247 454406 455237 456082 456830 456144 454373 453328 453349 453344 453331 454202 455406
57487 455406 455686 455706 457071 459170 459838 458760 457513 456756 456179 456621 459248 463055 466019 468229 471022 473772
57471 473772 474675 474092 473906 474062 473031 471234 470638 471203 471189 470784 471985 474924 477703 479962 483235 487609
57455D87609L776K978L801M759L882K473K559L250K965K716L771M579L410J717
57441E34245J600K326K352K398L391L870K636J520K360L653L350K533L082M100
57427E73416L901L297L698M228L768L540M625N314M045K564K965M094M056L758
57413F27269M594N236M222L268M360N941N678M663N087N961N118L503L461M528
57399F92889M691M260M706N313M661L900M864O423O352N353N634O852P053O377
57385G69328O382O882O799O838Q106R354Q818P426P032P098O243N498O467P885
57371H70156P556O296O371P396P384O628O866P662P194N741N060N215N234N685
57357I60444P429R038Q757P815Q394R656R312P910P830R046R604R426R953J0762
$$ plain form
57455 487609 491385 494363 498164 502923 506805 509278 511837 515087 518052 520768 524539 529118 532528 534245
57441 534245 535845 538171 540523 542921 546312 550182 552818 554338 556698 560351 563701 566234 569316 573416
57427 573416 577317 580614 584312 588540 592308 595848 600473 605787 609832 612396 615361 619455 623511 627269
57413 627269 631863 637099 641321 644589 648949 654890 660568 665231 670318 676279 681397 684900 688361 692889
57399 692889 697580 701840 706546 711859 716520 720420 725284 731707 738059 743412 749046 755898 762951 769328
57385 769328 775710 782592 789391 796229 804335 813689 822507 829933 836965 844063 850306 855804 862271 870156
57371 870156 877712 884008 890379 897775 905159 911787 918653 926315 933509 939250 944310 949525 954759 960444
57357 960444 967873 976911 985668 993483 1001877 1011533 1020845 1028755 1036585 1045631 1055235 1064661 1074614 1085376
57343A085376J0151Q592Q141Q918R368R439J0293J1439J1336J0331J0031J0373
57331A203788J0194R909J0639J1577J1151R989R770J0154R824R474J0607J2405
57319A329481J3005J2861J3604J4611J4085J2605J2217J2810J2787J2424J3154
57308A473644J4330J4179J3308J3770J5283J5727J4891J4492J4987J5502J6157
57297A636270J7412J7941J6442J4530J4652J6051J6319J5744J6420J8037J8493
57286A818311J7973J8411J9495J9206J7920J7969J9330J9723J8843J8740J9971
57275B025892K1087K1875K3495K5395K5727K4941K5369K7269K8613K8863K9448
57264B307974L0522L0680K9905K9572K9555K8634K7489K7890K9203K9231K8206
$$ plain form
57343 1085376 1095527 1104119 1112260 1121178 1130546 1139985 1150278 1161717 1173053 1183384 1193415 1203788
57331 1203788 1213982 1223891 1234530 1246107 1257258 1267247 1277017 1287171 1296995 1306469 1317076 1329481
57319 1329481 1342486 1355347 1368951 1383562 1397647 1410252 1422469 1435279 1448066 1460490 1473644
57308 1473644 1487974 1502153 1515461 1529231 1544514 1560241 1575132 1589624 1604611 1620113 1636270
57297 1636270 1653682 1671623 1688065 1702595 1717247 1733298 1749617 1765361 1781781 1799818 1818311
57286 1818311 1836284 1854695 1874190 1893396 1911316 1929285 1948615 1968338 1987181 2005921 2025892
57275 2025892 2046979 2068854 2092349 2117744 2143471 2168412 2193781 2221050 2249663 2278526 2307974
57264 2307974 2338496 2369176 2399081 2428653 2458208 2486842 2514331 2542221 2571424 2600655 2628861
57253B628861K8302K9459K9631K9031L0037L2731L4457L4230L3804L3962L3487
57242B977992L2340L2144L2981L3143L2556L2956L4304L4585L3572L3225L3884
57231C343682L3720L2571L2707L4828L6828L7378L7620L8461L9156L9369L9789
57220C746109M0228L9823L9287M0055M1281M0799L8964L8093L8194L6949L4060
57209D173842L1854L1226L0683K9732K9540K9949K9526K8930L0282L2899L3737
57198D512200L2531L2278L3927L4958L4241L3952L5338L6619L6673L6912L7961
57187D897590L8210L7185L6881L8180L9333L9381L9768M1155M1951M1372M0702
57176E331708M0315L8785L6130L4532L4468L3612L0927K8411K7455K6751K5226
$$ plain form
57253 2628861 2657163 2686622 2716253 2745284 2775321 2808052 2842509 2876739 2910543 2944505 2977992
57242 2977992 3010332 3042476 3075457 3108600 3141156 3174112 3208416 3243001 3276573 3309798 3343682
57231 3343682 3377402 3409973 3442680 3477508 3514336 3551714 3589334 3627795 3666951 3706320 3746109
57220 3746109 3786337 3826160 3865447 3905502 3946783 3987582 4026546 4064639 4102833 4139782 4173842
57209 4173842 4205696 4236922 4267605 4297337 4326877 4356826 4386352 4415282 4445564 4478463 4512200
57198 4512200 4544731 4577009 4610936 4645894 4680135 4714087 4749425 4786044 4822717 4859629 4897590
57187 4897590 4935800 4972985 5009866 5048046 5087379 5126760 5166528 5207683 5249634 5291006 5331708
57176 5331708 5372023 5410808 5446938 5481470 5515938 5549550 5580477 5608888 5636343 5663094 5688320
57165E688320K3720K2452K0177J7154J5511J5333J3881J0106O430M610L394J775
57153E842863R23J153N55j551l166l333l786n206n489l739k343k834l132j295
57139E809620J230K492L269N001P177Q972J0968J3215J4121J3017J1379R990P685
57126E918136M411K565L611O257R438J4048K0167K5961L1082L7877M7210N6361
57114F177124O3200O9348P7228Q7084R9016J14933J36170J61865J91479K26084
57104G403531K65737L09009L57078M15100M87682N76427O83744Q15395R76892
57095A2290595J170885J400105J668660J976813K316762K675231L036636L381643
57087B9917330L687241L932535M103041M188331M179369M068765L846354L489675
$$ plain form
57165 5688320 5712040 5734492 5754669 5771823 5787334 5802667 5816548 5826654 5833084 5837694 5841088 5842863
57153 5842863 5843786 5844939 5845494 5843943 5840777 5837444 5833658 5828452 5822963 5819224 5816881 5814047 5810915 5809620
57139 5809620 5810850 5813342 5816611 5821612 5828789 5837761 5848729 5861944 5876065 5889082 5900461 5910451 5918136
57126 5918136 5922547 5925112 5928723 5934980 5944418 5958466 5978633 6004594 6035676 6073553 6120763 6177124
57114 6177124 6240324 6309672 6386900 6473984 6573000 6687933 6824103 6985968 7177447 7403531
57104 7403531 7669268 7978277 8335355 8750455 9238137 9814564 10498308 11313703 12290595
57095 12290595 13461480 14861585 16530245 18507058 20823820 23499051 26535687 29917330
57087 29917330 33604571 37537106 41640147 45828478 50007847 54076612 57922966 61412641
57079F1412641K965781K253900J371175L76768o47262j620807k483102l199500
57071F0429594l756963m152472m385954m463506m402169m227147l965948l646735
57063B7428700l297644k942137k595545k268076j968388j701522j466615j260774
57055I927999j083406r34013q08752p02823o14132n41231m80161m26863l80622
57046C955996l41792l08281k77616k50202k27141k06946j87567j69509j53760
57037A833182j38990j24023j10614j00369r1368q1136p0408o0615n0399l8192
57027I67068k5506j3868j412J3964L1454N1035P5244J00709J11834R1910M1189
57016A443621k1552p5234j09602j24530j24501j15929j04542r2264p8652o5122
$$ plain form
57079 61412641 64378422 66632322 68003497 68380265 67733003 66112196 63629094 60429594
57071 60429594 56672631 52520159 48134205 43670699 39268530 35041383 31075435 27428700
57063 27428700 24131056 21188919 18593374 16325298 14356910 12655388 11188773 9927999
57055 9927999 8844593 7910580 7101828 6399005 5784873 5243642 4763481 4336618 3955996
57046 3955996 3614204 3305923 3028307 2778105 2550964 2344018 2156451 1986942 1833182
57037 1833182 1694192 1570169 1459555 1359186 1267818 1186682 1116274 1055659 1005260 967068
57027 967068 941562 927694 926282 940246 971700 1022735 1097979 1198688 1310522 1402432 1443621
57016 1443621 1422069 1346835 1237233 1112703 988202 872273 767731 675467 596815 531693
57006E31693n4561m7198m0702l4412k9825k6881k3572j9497j6449j5086j4116
56995B09394j2935j2215j1792j0699r216q288p234m585p76K552N366Q789J2613
56982A60974J5656J7565J7752J4000N380m646j1263j3688j4523j5025j4410j2813
56970A44959j1262r296n942k381m60O59L038O133P893Q802J1127J4852J8133K1122
56956B07377K5325K9163K8113J9981P213o122j6980k3409k5125k4257k3118k1451
56944A76710j8035j3793j0626q197m966j345J258L499P020J1302J4855J8480K4038
56931B00200L0871L6585L9986L9883L2965J7425k257j8600k8657l4406l6957l5319
56919B41719l0511k5823k2396j8668j4473j1638j0321q681o527n532n590m757
$$ plain form
57006 531693 477132 429934 389232 354820 324995 298114 274542 255045 238596 223510 209394
56995 209394 196459 184244 172452 161753 152537 144249 137015 132430 131654 134206 139572 148361 160974
56982 160974 176630 194195 211947 225947 231327 226681 215418 201730 187207 172182 157772 144959
56970 144959 133697 124401 118459 116078 115618 116277 119315 125448 133341 142143 153270 168122 186255 207377
56956 207377 232702 261865 289978 309959 317172 311050 294070 270661 245536 221279 198161 176710
56944 176710 158675 144882 134256 126059 121093 119748 121006 124505 131525 142827 157682 176162 200200
56931 200200 231071 267656 307642 347525 380490 397915 395658 377058 348401 313995 277038 241719
56919 241719 211208 185385 162989 144321 129848 118210 107889 99208 92681 87149 81559 76802
56907G6802k967k138k405j972p59m36p98J05K059K796K159K383L993N228N759
56892H9809P229R827J2004J3738J6501K0011K2715K5122K8414L0060K5510J4695
56880C15635K499p510j5346k0621k1483j8644j5608j3505r995m433L52K879N292
56867A99512R185J3312J7090K2326K9627L6930M3488N1593O2058P0912P2440O3276
56855F91749M3107J4952j4108l6199m8509n3591n3809m9082m0529l1649k4184
56844C98148j6504p616Q27P880J5067K3358L1928M1162N3192O8179Q3712R8617
56832G97950J12492J19796J09945P7373K8854k1676o2905q9566j00958j00183
56822H71122r2742q2649p0731n7546m5191l4861k5326j5591o474J795J0778K1165
$$ plain form
56907 76802 73835 71697 69292 67320 66561 66125 65327 65432 67491 70287 72446 74829 78822 84050 89809
56892 89809 97038 106865 118869 132607 149108 169119 191834 216956 245370 275430 300940 315635
56880 315635 318134 310624 295278 274657 253174 234530 218922 205417 195422 190989 191341 194220 199512
56867 199512 208697 222009 239099 261425 291052 327982 371470 423063 485121 556033 628473 691749
56855 691749 734856 749808 735700 699501 650992 597401 543592 494510 453981 422332 398148
56844 398148 381644 374028 374855 382735 397802 421160 453088 494250 547442 615621 699333 797950
56832 797950 910442 1030238 1140183 1217556 1246410 1224734 1161829 1072263 971305 871122
56822 871122 778380 695731 625000 567454 522263 487402 462076 446485 440011 441806 452584 473749
56810D73749L1624M1675N2949O6012P8138Q4859Q1413O3188K9502j1784m7664
56799I43661p0219q0748q3447p9787p0793n9838m9791m0604l1993k5250k0320
56788C30871j4612p022J96N684J1496J9168K6942L3309L9424M4939M5083L5448
56776E70926J7426l738k3614l9065m7523m9120m7366m5006m1323l5418k9230k4845
56764B02104k1509j7838j4477j2282j0367q158o803o609n850l980l005l712l856
56751H3658k244j056j741k192p97L35p56k229j868r84j536k329j612o26j138k002
56735F0883j514p45j190j574l33J101P95j42J87R01K95p17l64P01R64R41J629
56718F1818K045J178L65R78J825J529J146J738J854L91p17K98J725J476Q93J934
$$ plain form
56810 473749 505373 547048 599997 666009 744147 829006 910419 973607 1003109 991325 943661
56799 943661 873442 792694 709247 629460 558667 498829 449038 408434 376441 351191 330871
56788 330871 316259 309237 309433 315117 326613 345781 372723 406032 445456 490395 535478 570926
56776 570926 588352 584614 561000 521935 474412 425292 377926 332920 291597 256179 226949 202104
56764 202104 180595 162757 148280 135998 125631 117473 110670 104061 98211 94231 91226 87514 83658
56751 83658 81414 80358 78617 76425 75628 75963 75207 72978 71110 70126 68590 66261 64649 64023 62885 60883
56735 60883 59369 58624 57434 55860 55527 56628 57423 57281 57468 58369 58664 57947 57583 58284 59248 60189 61818
56718 61818 63863 65041 65406 66384 68209 69738 70884 72622 74476 74867 74150 74448 76173 77649 78542 80476
56702H0476L150K221K99q1N64J59q02m48O30M97m84n52J03J15j92L00R72P24L16
56683H7967P67J020n4j101n25N60M53n6L73O74m88j641q52P96J201Q25J097J321
56665I2337N23K93K195M329M098K523K126K394J321k53k0J469J786R02O32Q48
56649A17503Rj432j774j399k031l404l790l106k442j597M4J383J227P59J544K631
56633A04125K481K054K783L418K246O54Q76J901J353j88m94R9l45j528j773j448
56617A16214j904k328j277l8o54k036j783n26n48j426j056J80L29j41P15K316
56601A06037K421J150M50M47J3k43Q13J900J323M19J195K155P90j447j276P03
56585A16850J241K39L01J369R71o42o58J132K102J690J933L009K844J327O39J206
$$ plain form
56702 80476 83626 85847 86146 86065 86629 86788 85986 85538 86168 86665 86181 85629 85732 85847 85655 85955 86927 87651 87967
56683 87967 88734 89754 89700 88599 88074 88634 89087 89031 89404 90078 89590 87949 87097 87893 89094 89919 91016 92337
56665 92337 92860 93153 95348 99677 103775 106298 108424 110818 112139 111886 111866 113335 115121 116023 116655 117503
56649 117503 117512 116080 114306 112907 110876 107472 103682 100576 98134 96537 96581 97964 99191 99950 101494 104125
56633 104125 106606 108660 111443 114861 117107 117761 118637 120538 121891 121703 121209 121308 120963 119435 117662 116214
56617 116214 114310 111982 110705 110667 110013 107977 106194 105668 105120 103694 102638 102818 103147 103006 103721 106037
56601 106037 108458 109608 110058 110505 110518 110275 111088 112988 114311 114730 115925 118080 118870 117423 116147 116850
56585 116850 118091 118330 118631 120000 120971 120329 119671 120803 122905 124595 126528 129537 132381 133708 134347 135553
56569A35553J363J012J653K872K923K525L903O332P018O215O934R566J1336J1279
56555B10484J1182J1247R415N703K943K363K251J609J341J356L01j372j733j017
56541B56073j281k416k298j042j037k596l500l224l562m707m727l411k819l553
56527B15900m068m050m744n748n221l499k814l317l041j845j520k028j585m72
56513A71948p64k236k592j719j682k506k161p22k80q04l84O09J18j118m39J466
56497A56734J233j176k225r83k44j009j068Q3J49j096r65J017K088J478J649L088
56481A58753K974N39j181o22K3m95k26J695K973K267J267J016K36j160j101O47
56465A67605J569Q86P24J626J287q12j899o94O25O76Q70J751J616L21J49J460
$$ plain form
56569 135553 136916 137928 139581 142453 145376 147901 151804 158136 165154 171369 178303 187869 199205 210484
56555 210484 221666 232913 242328 248031 250974 253337 255588 257197 258538 259894 260195 258823 257090 256073
56541 256073 254792 252376 250078 249036 247999 245403 241903 238679 235117 230410 225683 222272 219453 215900
56527 215900 211832 207782 203038 197290 192069 188570 185756 182439 179398 177553 176033 174005 172420 171948
56513 171948 171184 168948 166356 164637 162955 160449 158288 157566 157286 156482 156098 156707 156825 155707 155268 156734
56497 156734 157967 156791 154566 153583 153339 152330 151262 151345 151494 150398 149433 150450 152538 154016 155665 158753
56481 158753 161727 162266 161085 160463 160486 159991 159765 161460 164433 166700 167967 168983 169219 168059 166958 167605
56465 167605 169174 170060 170784 172410 173697 172885 170986 170292 170917 171593 172463 174214 175830 176151 176300 177760
56449A77760J680K1j111p03o64j417o85J844L210K200J154J324J046j3L81K318
56433A88345K666N07j117o33l07j331j549j31M23q96j526k39O25q5j84J184J589
56416A87341K04k93J098J629J84m23J095J904N17l59Q21J460M2q76J27L68j501
56399A93338k345l13J368Jj952j628n05o47p14N89J364M35K08K150L646K836K162
56382A99993L621M914M004L073M111M827K915L10n88j002k363k923j410j15o75
56367B18692q02J161K607J363k68J29P77l18j253j40R47Oq61N27K176J759Q98
56350B27400J620K355J348L81J128J603P5j266l34J045R63J129K924L969K543
56335B46883J218K259L577L132K928M536N275L181J223K104L335K168P85J763
$$ plain form
56449 177760 179440 179461 178350 177647 176983 175566 174881 176725 179935 182135 183289 184613 185659 185646 186027 188345
56433 188345 191011 191518 190401 189768 189461 188130 186581 186450 186873 185977 184451 184212 184837 184752 184568 185752 187341
56416 187341 187545 187252 188350 189979 190163 189740 190835 192739 193256 192897 193718 195178 195220 194344 194471 194839 193338
56399 193338 190993 190680 192048 192049 190097 188469 187964 187317 186603 187192 188556 188991 189199 191349 194995 197831 199993
56382 199993 203614 208528 212532 215605 219716 224543 227458 227768 227180 226178 223815 220892 219482 219367 218692
56367 218692 217890 219051 221658 223021 222753 222882 223659 223341 222088 221948 222895 222901 222040 222567 224743 226502 227400
56350 227400 229020 231375 232723 233104 234232 235835 235910 234644 234310 235355 236318 237447 240371 244340 246883
56335 246883 248101 250360 253937 257069 259997 264533 269808 272989 274212 276316 279651 281819 282604 284367
56321B84367K860J360o23l36L60r76k186o19J501J072l42p2M27r37k043m35J715
56304B85093J583Q83K107L499K871K391M345O201N161L510M057M618K577O22J988
56289C31506M249L855K727M074N784M526K528L586N922N619L946M535O484O713
56275C96054O216P610R453R147Q417R879J1461J0342Q916J0600J3246J3162J2087
56262E26590J3618J6265J6780J6821J9487K2855K3886K5153L0401L6980M0280
56251G89116M2247M7824N6103O2824O8651P6942Q6031R1691R4969R9805J05193
56240A621396J07297J06873J06873J05186R7530Q5364P3173O0304M3202K3425
56230B430623N528j0800k8678m6405n9732o9517p9250q7397r0191q9678r0679
$$ plain form
56321 284367 287227 288587 287964 287628 287988 287012 284826 284207 285708 286780 286438 286366 286793 285856 283813 283378 285093
56304 285093 286676 287559 289666 293165 296036 298427 302772 308973 314134 317644 321701 326319 328896 329518 331506
56289 331506 335755 339610 342337 346411 352195 356721 359249 362835 368757 374376 378322 382857 389341 396054
56275 396054 402270 409880 419333 428480 436897 446776 458237 468579 477495 488095 501341 514503 526590
56262 526590 540208 556473 573253 590074 609561 632416 656302 681455 711856 748836 789116
56251 789116 831363 879187 935290 998114 1066765 1143707 1229738 1321429 1416398 1516203 1621396
56240 1621396 1728693 1835566 1942439 2047625 2145155 2230519 2303692 2363996 2407198 2430623
56230 2430623 2436151 2425351 2396673 2350268 2290536 2221019 2141769 2054372 1964181 1874503 1783824
56219A783824r2051q9209q3227p8945p6196p1266o5067o1380n9008n4154m8389
56208A004932m5744m4200l9085l2535l0250l0902k8467k3260k0795k1075j9097
56197F69522j4924j3307j3928j1858p317n421o502o058l941m291o610o186l145
56184E66034k082l081k111K62k44k650j972J195J648n44o10J290O56j829j215
56169E54747J899K362N79J594M778M799K322L113O850P637N422N956R374R933
56155F21365P411P557J0709J1179Q655R042J3082J5238J4807J6898K1553K3221
56143G80717K2267K5503L3910M1153M5781N3545O5980P7974Q8277J01003J14861
56132A450971J22120J20113J13240J02618Q5418O5512N2534M8347M5811M2032
$$ plain form
56219 1783824 1691773 1602564 1519337 1440392 1364196 1292930 1227863 1166483 1107475 1053321 1004932
56208 1004932 959188 914988 875903 843368 813118 782216 753749 730489 709694 688619 669522
56197 669522 654598 641291 627363 615505 608188 602767 596265 590207 586266 581975 575365 569179 566034
56184 566034 563952 560871 558760 559022 558778 556128 554156 555351 556999 556455 555845 557135 557791 555962 554747
56169 554747 556646 559008 559587 561181 565959 570758 573080 576193 583043 590680 596102 602058 611432 621365
56155 621365 628776 636333 647042 658221 666876 675918 689000 704238 719045 735943 757496 780717
56143 780717 802984 828487 862397 903550 949331 1002876 1068856 1146830 1235107 1336110 1450971
56132 1450971 1573091 1693204 1806444 1909062 1994480 2059992 2112526 2160873 2206684 2248716
56122B248716M0584L9556L0902J4248j133j0517j7773k3734k4011k0866k4006
56111B251966l6270n0809o4544q1195r8667j07627j06066j01944r8224q9023p3700
56100A343897o0542n2577m3670l2353k5417k3908j9944j1642o778p495o068k53
56088A053250K214q00j030M294P026L956K821O866Q703N506M941R744J1800P952
56074A127243O318J0387J2374R000Q185J3078J5312J1363R810J4840J8365J6030
56062A272305J5207J9535K1500J7976J6976K1436K2738J7827J5845K0165K1382
56051A482892J6046J4157J9684K2294J7406J5530K2048K6823K4007K2955K8933
56040A712775L2359K8144K6300L2104L5408L0994K9553L6618M1039L6645L4581
$$ plain form
56122 2248716 2289300 2328856 2359758 2374006 2372873 2362356 2344583 2320849 2296838 2275972 2251966
56111 2251966 2215696 2164887 2100343 2019148 1920481 1812854 1706788 1604844 1506620 1417597 1343897
56100 1343897 1283355 1230778 1187108 1154755 1129338 1105430 1085486 1073844 1067066 1059571 1053503 1053250
56088 1053250 1055464 1054664 1053634 1057928 1064954 1068910 1071731 1078597 1087300 1092806 1097747 1107491 1119291 1127243
56074 1127243 1133561 1143948 1156322 1165322 1173507 1186585 1201897 1213260 1223070 1237910 1256275 1272305
56062 1272305 1287512 1307047 1328547 1346523 1363499 1384935 1407673 1425500 1441345 1461510 1482892
56051 1482892 1498938 1513095 1532779 1555073 1572479 1588009 1610057 1636880 1660887 1683842 1712775
56040 1712775 1745134 1773278 1799578 1831682 1867090 1898084 1927637 1964255 2005294 2041939 2076520
56029B076520M1540M6768M3785M3451N1962N7658N3746N1963N9220O3411N7427
56018B647451N4091O1645O7891O4767O4533P4840Q2442P9092P8455Q9311R7735
56007C462253R4588R4184J06170J16063J14026J14979J28992J40466J38875J40590
55997D651186J57026J71636J72728J77485J97851K15326K16674K21079K43362
55988F424353K64854K70801K80753L10210L39053L51537L69264M09374M49836
55979I470035M73294N03527N59060O14504O49990O93212P67809Q48451R14646
55970A5494528R97492J121640J255954J377529J526125J734977J971258K211465
55962B7690968K507350K904931L374892L905917M584786N494048O625708Q001026
$$ plain form
56029 2076520 2118060 2164828 2208613 2252064 2304026 2361684 2415430 2467393 2526613 2590024 2647451
56018 2647451 2701542 2763187 2831078 2895845 2960378 3035218 3117660 3196752 3275207 3364518 3462253
56007 3462253 3556841 3651025 3757195 3873258 3987284 4102263 4231255 4371721 4510596 4651186
55997 4651186 4808212 4979848 5152576 5330061 5527912 5743238 5959912 6180991 6424353
55988 6424353 6689207 6960008 7240761 7550971 7890024 8241561 8610825 9020199 9470035
55979 9470035 9943329 10446856 11005916 11620420 12270410 12963622 13731431 14579882 15494528
55970 15494528 16492020 17613660 18869614 20247143 21773268 23508245 25479503 27690968
55962 27690968 30198318 33103249 36478141 40384058 44968844 50462892 57088600 65089626
55954F5089626R766054J2042243J4802656J8035922K1879927K6426010L1596732
55947A99639170L7383875M3668464M9012136M9824961M2057560K4797482K083912
55940D48467560j9422904l4726479m2641257m4655572m2819100l8786628l3834612
55933A91581008k8855014k4261278k0171503j6674553j3822848j1521409r618475
55926F6655928q054835o816090n820138m968527m247108l675847l213507k799372
55918B7060504k436880k153411j922619j700930j498421j343922j218427j087444
55910A3698450r63198q73839q04164p24036o44682n92472n55304n06461m55097
55901G579197m24192m03164l68821l30306l08990k95607k69443k39364k25224
$$ plain form
55954 65089626 74855680 86897923 101700579 119736501 141616428 168042438 199639170
55947 199639170 237023045 280691509 329703645 379528606 421586166 446383648 448467560
55940 448467560 429044656 394318177 351676920 307021348 264202248 225415620 191581008
55933 191581008 162725994 138464716 118293213 101618660 87795812 76274403 66655928
55926 66655928 58601093 51785003 45964865 40996338 36749230 33073383 29859876 27060504
55918 27060504 24623624 22470213 20547594 18846664 17348243 16004321 14785894 13698450
55910 13698450 12735252 11861413 11057249 10333213 9688531 9096059 8540755 8034294 7579197
55901 7579197 7155005 6751841 6383020 6052714 5743724 5448117 5178674 4939310 4714086
55892D714086k18298j99121j75835j67200j65304j51623j33069j26793j25382
55883C251461j11654r2702q5694q4156p1019n1866m3816m4013l9478l5717m5563
55872B545783o1170o6289o5703p4218q6997q8665q2120q1045q2865p5675o3613
55861A717423n9507o0074n3317m3018m1552m5532m2364l4354l3110l6388l3150
55850A235057k5785k5270k9719k8939k4823k6624l1387k9309k3292k3352k6860
55839I39697k3892j6991j6309j9951j8366j3424j4221j8410j6491j0567j0386
55828G60689j4455j3315q032p603j1201j0529o810q301j3570j3965j0225j0388
55816F32295j3785j2945q935r107j2102j0448n582n110p712n785n51M73j568N82
$$ plain form
55892 4714086 4495788 4296667 4120832 3953632 3788328 3636705 3503636 3376843 3251461
55883 3251461 3139807 3047105 2961411 2877255 2806236 2754370 2710554 2666541 2627063 2591346 2545783
55872 2545783 2484613 2418324 2352621 2278403 2191406 2102741 2020621 1939576 1856711 1781036 1717423
55861 1717423 1657916 1597842 1544525 1501507 1459955 1414423 1372059 1337705 1304595 1268207 1235057
55850 1235057 1209272 1184002 1154283 1125344 1100521 1073897 1042510 1013201 989909 966557 939697
55839 939697 915805 898814 882505 862554 844188 830764 816543 798133 781642 771075 760689
55828 760689 746234 732919 724887 717284 706083 695554 688744 680443 666873 652908 642683 632295
55816 632295 618510 605565 596630 587523 575421 564973 559391 554281 546569 540784 540233 540706 539138 539720
55802E39720N396N335K083L893R729J1120P972P541R344O185q85l627j991l889
55788E97926r996j2982j1700j2193j4472j2089n457k503n301q251r689j3223j7485
55775D62585j6715j1705q666p630l434K862N580O203J0760J6315J3438K219p221
55762D64591j0665j3341j6997j6721j2292j0108j1537j0956p223n726p300o461
55750C35264k552j534m576n789l456k823n496o545m435l749n647n522k400j028
55736B79712k458k109P78J205j863l272j312l87k079k556r91j512m733o131m771
55721B47521m855o861o195k458r27k792k964K06K131J173J532M536N924M445M384
55706B44800O792O898L152L67P85L78k984n712n900o687r181r747p292n692o286
$$ plain form
55802 539720 545116 550451 552534 556427 566156 577276 585248 592789 602133 608318 607433 603806 601815 597926
55788 597926 587930 574948 563248 551055 536583 524494 519037 516534 511233 502982 493293 480070 462585
55775 462585 445870 434165 425499 417869 414435 417297 422877 429080 439840 456155 469593 471812 464591
55762 464591 453926 440585 423588 406867 394575 384467 372930 361974 354751 349025 341725 335264
55750 335264 332712 331178 326602 320813 317357 314534 309038 302493 298058 294309 288662 283140 280740 279712
55736 279712 277254 275145 275923 277128 275265 271993 270681 270294 268215 265659 264668 263156 258423 252292 247521
55721 247521 242666 235805 229610 227152 226225 223433 220469 220675 222806 223979 225511 230047 235971 240416 244800
55706 244800 251592 258490 261642 262009 262794 263172 260188 254476 248576 241889 232708 222961 215669 209977 203691
55691B03691n467k398j281l212l640q50R23j93j73K850M784L438K532M284N294
55676B10582L550K387L615L656L77k806l314l458m663m138r55R78l48j551m15
55661B03497L47p85p51J795L180J425Q8J736L583L343L335N042N445K780K61L25
55645B34646N63j005k136j403j502l968n948n700n878p910q781o838n264o163
55631A72713o730m954l501m211m301j979l04j450k513j109J43j069k229j002K10
55616A37714r30k236j559j046k556l526j773J72j96p80O45J912P53o90j05M21
55600A26220j462l633l305j866j678j769o89l8j157j930o97L70n36j256J5R63
55584A07552l06j175P28K762J783l62m64M53j56j378j068j61l26k27J688L488
$$ plain form
55691 203691 198224 195826 194545 191333 187693 186843 187766 187573 187400 190250 195034 198472 201004 205288 210582
55676 210582 214132 216519 220134 223790 224167 221361 218047 214589 209926 205788 204833 205811 205463 203912 203497
55661 203497 203844 203059 202308 204103 207283 208708 208796 210532 214115 217458 220793 225835 231280 234060 234321 234646
55645 234646 235209 234204 232068 230665 229163 225195 219247 213547 207669 199759 190978 184140 178876 172713
55631 172713 165983 161029 157528 153317 149016 147037 146733 145283 142770 141661 141804 140735 138506 137504 137714
55616 137714 136784 134548 132989 131943 129387 125861 124088 124260 124064 123284 123929 125841 126594 125904 125799 126220
55600 126220 124758 121125 117820 115954 114276 112507 111818 111780 110623 108693 107996 108366 107830 106574 106589 107552
55584 107552 107246 106071 106799 109561 111344 110982 110518 110971 110815 109437 108369 108208 107882 107655 109343 112831
55568A12831K918J492J555K090J275L20R12J659P57n78q01j161k704l417j949
55553A15199p76j957l168j881Nj47q10N26K404K222J060J260J837P65p68o62m5
55536A15064q14j609l89J384J370O67J330K038O27j392j233K84M93m57q28j093
55520A15442k410l294j896L19J049J221K656L908K615Jj190j335k296l189k156
55505A09445n95j149k897k900j198j63j55J91N93j6m93P80K365J721n04j739j812
55488A01474k357l226l045k230k011j712k86Q83R7j283r94K37L66p6O27J722J409
55471H9595L56K62M80l75j206m59M33n23j877j179L72M2j378j095N21Q09k51m75
55453H4052J52j28q63k03J040M68j386j812o88l03q71l88J245J985J360Q11N30
$$ plain form
55568 112831 115749 117241 118796 120886 122161 122481 123393 125052 125809 125231 124430 123269 120565 117148 115199
55553 115199 114423 112466 109298 107417 107422 107275 106465 106991 109395 111617 112677 113937 115774 116539 115771 115109 115064
55536 115064 114250 112641 112252 113636 115006 115673 117003 119041 119668 118276 117043 117327 117820 117363 116535 115442
55520 115442 113032 109738 107842 108161 109210 110431 113087 116995 119610 119611 118421 117086 114790 111601 109445
55505 109445 108850 107701 104804 101904 100706 100543 100388 100579 101172 101156 100663 101443 103808 105529 105025 103286 101474
55488 101474 99117 95891 92846 90616 88605 86893 86607 87490 87587 86304 85310 85547 85913 85837 86464 88186 89595
55471 89595 89951 90213 90693 90318 89112 88653 89086 88563 86686 85507 85879 85921 84543 83448 83969 84778 84527 84052
55453 84052 84204 84076 83213 83010 84050 84518 83132 81320 80632 80329 79458 79070 80315 82300 83660 84471 85001
55436H5001m92j615j264QM75N44J643K719J772nK91K292K962J735Q10O79l73k270
55418I4912k795j586o24m80K37J519J612L99l23j70m47j104o98M73O01k51l16
55401I0959L64Kj334j637n93P4o2K70J010P12l55m50K55j00j376j484k06M26j22
55382H6353k23N52P81K68L84J027N56q44j060K02Q74K00k59J25J04o07o52J30
55364H7911K36n68p91j57p4p31p22N0J04o43o37J69R7q64p46P62J516N35o07p45
55344H4095n67m70J84J005O72m63n35O06J248J074J447K169J311j045k332j501
55328H6898l38m5K69Q48M31q85j139J09R15M73L12J010R66l26r76o4P41L19r1
55309H9427L36L28q31j715j351q47j019q57J66P95L84J92R70J630J587J947L076
$$ plain form
55436 85001 84509 82894 81630 81638 82113 82657 84300 87019 88791 88786 89077 91369 94331 96066 96876 97555 97182 94912
55418 94912 92117 90531 89907 89427 89664 91183 92795 93194 92871 92701 92254 91150 90452 90925 91526 91275 90959
55401 90959 91323 91325 89991 88354 87761 87835 87773 88043 89053 89765 89410 88960 89215 89115 87739 86255 86049 86475 86353
55382 86353 86130 86682 87463 87731 88115 89142 89698 88854 87794 87996 88870 89070 88811 88936 89040 88433 87781 87911
55364 87911 88147 87579 86788 86631 86557 85826 85104 85154 85258 84615 83978 84147 84244 83380 82634 83396 84912 85447 84840 84095
55344 84095 83528 83058 83242 84247 84919 84456 83921 84527 85775 86849 88296 90465 91776 90731 88399 86898
55328 86898 86560 86515 86784 87632 88063 87178 86039 86148 87063 87536 87848 88858 89824 89498 88522 88458 89199 89518 89427
55309 89427 89763 90091 89260 87545 86194 85347 84328 83471 83637 84432 84816 85008 85978 87608 89195 91142 94218
55292I4218L453K307J029N98Mj430k466k137j338r10k54R63J771J752J748J808
55276A01116P61j128j640r1J161J18k114l385l188k061l74J052J108K82L92J654
55260I3663K284J739J627K416K154n1k071j990q63m17l57K31Q74R35R61J249Q86
55243A03270l90j211q28m34r70j604j577j562j915j631l59N43K30l34l62m16o42
55226H9808j52Q03N64r07j353J08J424J140N81Q68P20o86j502k75J290J047k63
55209I3215q22p62r74q19M31J563J217K18jK17n1k98K04P29N10K81O55O52l56
55190I5809j068n50j14q83j464l94J036Q66k65n06K2K8k52K41J043R23J92l6L1
55171I4659m27r10m31M92P00M13N67R39P28J61j09l06o78m14Q75J828J165k15
$$ plain form
55292 94218 97671 99978 101007 101605 101609 100179 97713 95576 94238 93328 93074 94037 95808 97560 99308 101116
55276 101116 101877 100749 99109 99018 100179 100297 98183 94798 91610 89549 89175 90227 91335 91617 92009 93663
55260 93663 95947 97686 99313 101729 103883 103832 101761 99771 98908 98491 98134 98365 99239 100174 101135 102384 103270
55243 103270 102880 101669 100841 100407 99437 97833 96256 94694 92779 91148 90789 91332 91562 91228 90866 90450 89808
55226 89808 89656 90459 91023 90116 88763 88871 90295 91435 92016 92884 93604 92918 91416 91141 92431 93478 93215
55209 93215 92393 91631 90657 89838 90269 91832 93049 93267 93266 93483 93432 93134 93338 94067 94577 94858 95513 96165 95809
55190 95809 94741 94191 94077 93194 91730 91336 92372 93238 92973 92467 92489 92517 92265 92506 93549 94472 94664 94628 94659
55171 94659 94232 93322 92891 93383 94083 94496 95063 96002 96730 96891 96782 96476 95798 95384 96259 98087 99252 99037
55153I9037o74k47P9L19Q58J048K46o70o42k49n23r63n01N13J050J147J324J290
55135A02442P73N67J140J395M17p81r55o97j100j590j062kM06K84L58L57j34l93
55117A01425J75O46J65l39J70P83K13q90j160p40l71L32J581J862J26j791j466
55100A00721M66J497J043M84K40m11j159r07NJ96l75m81J24N94P37J013J154O42
55082A05583J55O89J682J756Q99J85r0l14k81K49M10n27j570j371m22p9k72j21
55064A06561J42j55l92K65J012O79J9L91J136O85n11o97J15L54k08l45J05Q4n25
55045A08715q44r06j454k036j522k83L34L75R30J742J544N26J36N19N17P7L04
55028A08674J088J093K01l50l35p79j593j365J60J489J690J349R69L48k26m1N28
$$ plain form
55153 99037 98363 98116 98195 98514 99372 100420 100666 99996 99354 99105 98582 97619 97118 97631 98681 99828 101152 102442
55135 102442 103215 103782 104922 106317 106734 105953 104998 104301 103201 101611 100549 100547 100953 101237 101595 101952 101818 101425
55117 101425 101600 102246 102411 102072 102242 103025 103238 102348 101188 100448 100077 100409 101990 103852 103978 102187 100721
55100 100721 101187 102684 103727 104211 104451 104040 102881 101974 101979 102175 101800 101319 101443 102037 102774 103787 104941 105583
55082 105583 105738 106427 108109 109865 110764 110949 110859 110545 110264 110513 110923 110396 108826 107455 107033 106954 106682 106561
55064 106561 106703 106548 106156 106421 107433 108112 108131 108522 109658 110343 109832 109135 109250 109604 109396 109051 109156 109240 108715
55045 108715 107871 106965 105511 103475 101953 101670 102004 102379 103309 105051 106595 107121 107257 107776 108293 108370 108674
55028 108674 109762 110855 111056 110706 110371 109592 107999 106634 106794 108283 109973 111322 112291 112639 112413 112372 112900
55011A12900L07p27j485j694j914j852o85Q94J248M27J38R24J544J429J448J847
54995A14749J655P30L06Q14J100M81j41m0J59j99p30r33r74j068j154j345j654
54978A11756j424j98J114J343R09R93J354R03l8j30N22N18k97o32j26K40K00N10
54960A17517J081J000N10P57J464J202J15r0Q13J103J98l65J94O38J81j89Q5p2
54942A26142j153j821j129j05J70J79N12N46j19n87k24J82l9k22K04N42K52J82
54924A23512J171K648L692M424N360O405P233P770P723O785N622N323N438M161
54910A97267R93k350m381n519o570p127o618n535m624l887l232k952k937k616
54896A39912k118k208k606j930M1J668J749R99M52l4p28j015m78K54O59J139J930
$$ plain form
55011 112900 113207 112480 110995 109301 107387 105535 104850 105744 106992 107419 107557 108481 110025 111454 112902 114749
54995 114749 116404 117134 117440 118254 119354 119835 119694 119654 119813 119614 118884 117951 116977 115909 114755 113410 111756
54978 111756 110332 110134 111248 112591 113500 114493 115847 116750 116712 116582 117104 117622 117325 116693 116567 116807 117007 117517
54960 117517 118598 119598 120108 120865 122329 123531 123646 123556 124369 125472 125670 125305 125499 126137 126318 126129 126214 126142
54942 126142 124989 123168 122039 121934 122104 122283 122795 123341 123222 122635 122411 122593 122554 122332 122536 123078 123330 123512
54924 123512 124683 127331 131023 135447 140807 147212 154445 162215 169938 176723 182345 187668 193106 197267
54910 197267 198260 195910 191529 186010 179440 172313 165695 160160 155536 151649 148417 145465 142528 139912
54896 139912 137794 135586 132980 131050 131091 132759 134508 135507 135959 135925 135197 134182 133704 133958 134617 135756 137686
54879A37686K503K776L574N075O153O118N787N955O094N412M012K193j10k477
54865A90751l925m410n085o303o888o111m869m030l201k204k072l316m561m379
54851A29397l290k620k417j893j069o52p12o63j20Q47J884K310J612K53p55j202
54835A20910j588j751r88L00O99p5p38n51k24k30r5J73j92q41k99J315J739j5
54817A17549j828j565q8N84L62M34Q40P57K56K4K5j29k06N3J25l64p66n11j61
54798A15391l09m26J56J057J597J756J598Q46r7q7Q80J206J52p48j7J488K118
54781A26561J864J665J511R08K73K74N88O67Q94J695K411K390K213K651L333L728
54765A53626M421N999P655Q269Q003P514O576M826K947J657L78j759m371o476
$$ plain form
54879 137686 140189 142965 146539 151614 157767 163885 169672 175627 181721 187133 191145 193338 193228 190751
54865 190751 186826 182416 177331 171028 164140 158029 153160 149130 145929 143725 141653 138337 133776 129397
54851 129397 126107 123487 121070 119177 118108 117456 116744 116081 115961 116808 118692 121002 122614 122867 122112 120910
54835 120910 119322 117571 116583 116883 117582 117507 116769 116218 115994 115764 115669 115842 115650 114809 114510 115825 117564 117549
54817 117549 115721 114156 114068 114652 115014 115448 116288 117045 117301 117325 117350 117221 117015 117068 117193 116829 116063 115552 115391
54798 115391 115082 114656 114812 115869 117466 119222 120820 121666 121569 121482 122362 123568 123720 122972 122955 124443 126561
54781 126561 128425 130090 131601 132509 132782 133056 133644 134311 135205 136900 139311 141701 143914 146565 149898 153626
54765 153626 158047 164046 171701 179970 187973 195487 202063 206889 209836 211493 211871 210112 205741 199265
54751A99265p812q425p923o406n054m603m269l343k503k307j848m88N48O1r40
54736A43953q67j63k28q15o47J80N69N48J005J750J843J475J678K493L129L576
54720A59479M438N568O411P158P996P824N524K005p47k297l687n294o482p053
54706A80843p234o636m937l241k927l454l164j970j348j726j918j292o17m64l85
54691A39530j23j25m99o55l95k82o65j215j566j590j202n68k61m09k54N59R97
54674A31277J04j299j714j133n87j93O56J633J731J022N51N05J10o78q82j06Q40
54657A31837J105O31j79q18q37l94k87p43r48m83k09p16j029k71N93L20m20k80
54639A26872L86L47j45K2N85M86J10O31J624J645Q56O85J143Q87j20m93l3j6o76
$$ plain form
54751 199265 191453 183028 175105 168699 163645 159042 154773 151430 148927 146620 144772 144284 144832 144893 143953
54736 143953 143086 142923 142695 141880 141233 141413 141982 142530 143535 145285 147128 148603 150281 152774 155903 159479
54720 159479 163917 169485 175896 183054 191050 198874 204398 206403 205656 203359 199672 194378 187896 180843
54706 180843 173609 166973 162036 158795 155868 152414 149250 147280 145932 144206 142288 140996 140379 139915 139530
54691 139530 139407 139282 138783 138128 137733 137451 136786 135571 134005 132415 131213 130645 130384 129975 129721 130280 131277
54674 131277 131381 130082 128368 127235 126648 126455 127111 128744 130475 131497 132048 132553 132663 131985 131103 130997 131837
54657 131837 132942 133573 133394 132576 131739 131345 131058 130315 129367 128884 128675 127959 126930 126659 127252 127572 127152 126872
54639 126872 127258 127605 127460 127482 128067 128553 128663 129294 130918 132563 133419 134104 135247 136134 136014 135521 135488 135472 134796
54620A34796q00j96j60r97j347o37j7j54j68M25P22K06k65j07M5j81j08M83O81
54601A32221Q0l70N3P40R73R17P75K59n02p20j83M98J068J739K001R60q32j625
54583A38052r89l80o61r20l98K59N18R99J945K308J419K21k15j17NL62R79R91
54565A44378n1j263j698j532j209o00K36O28M33M27Q25O95l72j330j306r00q56
54548A36505p47m6O78Q45J056J939K757K453J375P37Q63J138J219J272J312J123
54532A54479O97J85k63l64N4N18K71n64j037p66l92l37k35Q1Q8l69o35l67q0n6
54512A50908J46N68L93o40j492j383r87j202j618j208L6J107J196L63o07p04L41
54495A45217J502J523N79m2J29L92M09O08Q30K83p63q74J91Q32P2r56r78m33j30
$$ plain form
54620 134796 133996 133800 133640 132643 131296 130659 130642 130488 130320 130745 131467 131673 131408 131301 131346 131165 131057 131540 132221
54601 132221 132301 131931 131984 132724 133697 134614 135389 135648 135146 134426 134243 134741 135809 137548 139549 140509 139677 138052
54583 138052 137063 136683 136022 135102 134704 134963 135481 136480 138425 140733 142152 142373 142158 142041 142046 142408 143387 144378
54565 144378 144327 143064 141366 139834 138625 138025 138261 138889 139322 139749 140574 141269 140897 139567 138261 137361 136505
54548 136505 135758 135712 136390 137235 138291 140230 142987 145440 146815 147552 148415 149553 150772 152044 153356 154479
54532 154479 155176 155361 155098 154734 154788 155306 155577 155013 153976 153210 152818 152481 152246 152327 152415 152046 151411 151044 150964 150908
54512 150908 151054 151622 152015 151375 149883 148500 147513 146311 144693 143485 143521 144628 145824 146187 145580 144876 145217
54495 145217 146719 148242 148821 148779 148908 149300 149709 150317 151147 151430 150667 149793 149984 150816 150888 149932 148954 148521 148391
54476A48391L67J539K516K360J693J554J570P42o46j396j057p8J141K246K596
54461A63538K044J425J344J181L04o21o76k50k67n10r1Q55J264P23k04j007j628
54444A67424j959j853j531j325j182r52p64o60l47J94M49K29J12M58P28M02j38
54427A59285l22k69l09l21j96j69j28N02J560J849Q70k10k16M13O42N13O14P90
54409A64898N72J77l5l62r39r20K08J347J159R3m02j22k1k56P6J254K363K571
54391A71661J976J062J74l25k19J72L01M9l16n90o73m85k38k88m16J2Q38J020
54373A73715L19j00M69R08J7j471j927j154k23M04J127J928K228J943J588J393
54357A81164J242J197J274J037L32r2M07J233J464J327J603K082J897J069L96
$$ plain form
54476 148391 148758 150297 152813 155173 156866 158420 159990 160732 160086 158690 157633 157555 158696 160942 163538
54461 163538 165582 167007 168351 169532 169836 169215 168539 168289 168022 167512 167421 168276 169540 170263 170059 169052 167424
54444 167424 165465 163612 162081 160756 159574 158622 157858 157198 156851 157045 157494 157723 157835 158293 159021 159423 159285
54427 159285 158963 158694 158385 158064 157868 157699 157571 158073 159633 161482 162352 162142 161926 162339 162981 163494 164108 164898
54409 164898 165470 165647 165612 165250 164311 163391 163599 164946 166105 166198 165796 165674 165653 165397 165473 166727 169090 171661
54391 171661 173637 174699 174873 174548 174329 174501 174802 174851 174535 173945 173272 172787 172549 172261 171845 171857 172695 173715
54373 173715 174034 173934 174403 175311 175328 173857 171930 170776 170553 170957 172084 174012 176240 178183 179771 181164
54357 181164 182406 183603 184877 185914 186246 186154 186561 187794 189258 190585 192188 194270 196167 197236 197632
54342A97632Jp54j956k878l089k788k188j420j003j371k027k083j590j397j771
54327A71318k059j787j252q60n91k03M27J210J710J401L83m97o85n78p00p76l16
54310A66145M82J017J049N72m34j558j975j570j263j550j618p48L55O65L81K14
54294A60164J0o62j301j125l99J27M98J039J297Q05K56N68J288J302N97m7n21
54277A63896j088j225l78O06N07k42k70L49K76o57j116n37P4q5n02m46J57J130
54259A60449K153K403J360Rr8R20J427P64O9L08Q99R02L56k04o08r51j254j524
54241A67380j680j397o62j61l80p16l88K54L81J30J21J50l10p60l88K62P8o07
54223A61307n72K3o5p46o13M72J026N57L61J083J589J044K63Qk12o56l62J095
$$ plain form
54342 197632 197633 196879 194923 192045 188956 186168 183980 182560 181557 180186 178159 176076 174486 173089 171318
54327 171318 169259 167472 166220 165360 164769 164566 164993 166203 167913 169314 169697 169200 168515 167937 167237 166461 166145
54310 166145 166627 167644 168693 169265 168831 167273 165298 163728 162465 160915 159297 158549 158904 159569 159950 160164
54294 160164 160174 159512 158211 157086 156687 156814 157312 158351 159648 160453 160709 161277 162565 163867 164464 164417 163896
54277 163896 162808 161583 161205 161811 162318 162076 161806 162155 162431 161774 160658 160121 160195 160110 159608 159162 159319 160449
54259 160449 162602 165005 166365 166374 166276 167196 168623 169387 169456 169764 170663 171565 171921 171717 171109 170158 168904 167380
54241 167380 165700 164303 163641 163480 163100 162384 161996 162250 162631 162761 162882 163032 162722 161962 161574 161836 161914 161307
54223 161307 160735 160758 160693 159947 159334 159806 160832 161389 161750 162833 164422 165466 165729 165737 165525 164869 164507 165602
54205A65602K338J965N07n34o12j54M52Q84P22L4n19o91r13j189q88o1K36l57
54187A66822q11m16J8l86j117j268r51p28m81M7M38K93J01M82J165J487J385J112
54169A67192O05j99q86j100j060j065r92p55o04n44k00L75M80j62r09j201j263
54152A57712j325r89JJ084J531J248N29k63n49Q9J052J149J95p10p73l66O0O12
54134A60287J146J028L19j3K92K65n53j227j045o68o66l48P81J700J431P72R66
54117A64467J634J626J112J142J667J673J012N75P00Q38P45P96R55O51j42o39
54101A78812l31L34N89J71n48r39o11J22M80J57l59n55n11m05r1L90N02N3l37
54082A76923j06M38Q04J113J572J816J519J081R46Q76O34O74J338K045K226K443
$$ plain form
54205 165602 167940 169905 170412 169878 169266 169112 169564 170448 171170 171204 170685 169994 169081 167892 167004 166943 167179 166822
54187 166822 166011 165595 165613 165227 164110 162842 161891 161163 160682 160729 161167 161460 161561 162043 163208 164695 166080 167192
54169 167192 167797 167598 166712 165612 164552 163487 162495 161740 161136 160592 160392 160767 161247 161085 160176 158975 157712
54152 157712 156387 155398 155399 156483 158014 159262 159791 159528 158979 159068 160120 161269 161464 160754 159981 159615 159675 160287
54134 160287 161433 162461 162780 162767 163059 163324 162771 161544 160499 159831 159165 158817 159598 161298 162729 163501 164467
54117 164467 166101 167727 168839 169981 171648 173321 174333 174908 175608 176446 177191 177987 178942 179593 179451 178812
54101 178812 178481 178815 179404 179575 179027 178088 177477 177599 178079 178236 177877 177322 176811 176406 176315 176705 177207 177260 176923
54082 176923 176817 177255 178059 179172 180744 182560 184079 185160 186106 186982 187616 188290 189628 191673 193899 196342
54066A96342L465M812N397N258N482O496P649Q422Q941R082Q054N247R87l693
54052B71941p580r663r619q117o330n007m194l540k706j601n44Q1M42J081K017
54037B16661K641K841L403M788O236O812O718O725O762O046M361K467J258J069
54023B78788J619K175K021J185M29K11J29k18m58j03M46K68r61k725m212m762
54007B73832m181l058k362k386k553k513k649l154l450l107k526k140j723j152
53993B36878r88j475j863j624j435j945k450j990j031o54o87j12J007J550J208
53978B24389R57J516K491L258L732M012M018L696L009J725j83k067l115l308l269
53963B40861l367l499l489l214k567j861j715k013j633pJ681J896Q36rO6N84J171
$$ plain form
54066 196342 199807 204619 210016 215274 220756 227252 234901 243323 252264 261346 269400 274647 275634 271941
54052 271941 264361 254698 245079 236962 230632 225625 221431 217891 215185 213584 213040 213121 213563 214644 216661
54037 216661 219302 222143 225546 230334 236570 243382 250100 256825 263587 269633 273994 276461 277719 278788
54023 278788 280407 282582 284603 285788 286217 286428 286557 286339 285881 285778 286224 286492 285531 282806 278594 273832
54007 273832 269651 266593 264231 261845 259292 256779 254130 250976 247526 244419 241893 239753 238030 236878
53993 236878 235890 234415 232552 230928 229493 227548 225098 223108 222077 221423 220736 220624 221631 223181 224389
53978 224389 225346 226862 229353 232611 236343 240355 244373 248069 251078 252803 252620 250553 247438 244130 240861
53963 240861 237494 233995 230506 227292 224725 222864 221149 219136 217503 217496 219177 221073 221909 221900 221966 222550 223721
53946B23721J932K567K475J947K090L279M594N144N103N189N693O352O703O436
53932B83225N744N155M695L651J744M6k05P17J550J937K662M062N457O283O765
53917C33488P142P228P127P617R310J1937J4775J7409J9818K2008K3590K3490
53905E04939K0292J3506M476m391j1256j5549j7459j7472j6338j4775j3111j1431
53893D21431r872q550p507p009p437q492r152q893q330q112p933p404o929o816
53879C08995o345m936l488l214l716l661k949k655l042l227k844k532k668k880
53865B60838l002l288l552l301k815k883l335l072j844p36n66r22j167j280j368
53850B27707j216q08m73k93j35k70j029j901k003j482j277j438j073j29K69k76
$$ plain form
53946 223721 225653 228220 230695 232642 234732 238011 242605 247749 252852 258041 263734 270086 276789 283225
53932 283225 288969 294124 298819 302470 304214 304260 304055 304772 306322 308259 310921 314983 320440 326723 333488
53917 333488 340630 347858 354985 362602 371912 383849 398624 416033 435851 457859 481449 504939
53905 504939 525231 538737 543213 538822 527566 512017 494558 477086 460748 445973 432862 421431
53893 421431 411559 403009 395502 388493 381056 372564 363412 354519 346189 338077 330144 322740 315811 308995
53879 308995 302650 297714 294226 291012 287296 283635 280686 278031 274989 271762 268918 266386 263718 260838
53865 260838 257836 254548 250996 247695 244880 241997 238662 235590 233746 233010 232444 231522 230355 229075 227707
53850 227707 226491 225683 225210 224917 224782 224512 223483 221582 219579 218097 216820 215382 214309 214180 214449 214173
53834B14173o20P4J012J090N55L61O47P44K16p40j542j523m72Q83J494J228Q45
53817B18425P15M87J02J05O68J256J569J799J816J188L35M01J521K506K801L380
53801B39074M950O574P065O623O046N303M160L287L448M131M189L542L072L158
53787C04622L281K920K006O25r37k047k270j991j924k216k551k824l129l375l446
53772B86744l557l903m175l939l288k680k367k358k651l088l227k812k242k081
53758B44376k298k346j886j115m83l54q11j592k264k534k333j751j115r17j183
53743B21394j147j89J077J376M89m12l26M85J177J336J025N28L26P32J289J227
53727B30387O43M82J106J741J652J042M35k7k24J62R91J574J669J767K041J900
$$ plain form
53834 214173 213553 213627 214639 215729 216284 216645 217292 218036 218252 217512 215970 214447 213975 214858 216352 217580 218425
53817 218425 219140 219627 219729 219834 220502 221758 223327 225126 226942 228130 228465 228866 230387 232893 235694 239074
53801 239074 244024 250598 257663 264286 270332 275635 279795 283082 286530 290661 294850 298392 301464 304622
53787 304622 307903 310823 312829 313454 312517 310470 308200 306209 304285 302069 299518 296694 293565 290190 286744
53772 286744 283187 279284 275109 271170 267882 265202 262835 260477 257826 254738 251511 248699 246457 244376
53758 244376 242078 239732 237846 236731 236248 235894 235083 233491 231227 228693 226360 224609 223494 222577 221394
53743 221394 220247 220058 221135 222511 223000 222588 222262 222747 223924 225260 226285 226813 227139 227871 229160 230387
53727 230387 231030 231512 232618 234359 236011 237053 237488 237461 237237 237399 238390 239964 241633 243400 245441 247341
53711B47341J141N92R32J689K182K584L271L871L844L404K994K431J437N02L43
53696B78558R31J776K726L689M099L604K922K945L322K852J245m18j063p25j80
53681C06283q6o01j452k135k292j898j172m54k31p33j469j634j133o39n51n27
53665B89276l58m00q14j113r75p22n82k30L52N02m9n17l13r1o33j435j437n70
53647B79891M18J091J309O92o59j400k33K105L421K738J313Q11J426K173K305
53632B97401J945J681J811J997J698J015O86J028J500J640J833K490L126L053
53618C22904K597K692L482M166M133L622L273L557M459N323N288M306L376L247
53604C76425L478L353L106L373L954M069L647L363L566L915M003L696L060K490
$$ plain form
53711 247341 248482 249074 250006 251695 253877 256461 259732 263603 267447 270851 273845 276276 277713 278215 278558
53696 278558 279489 281265 283991 287680 291779 295383 298305 301250 304572 307424 308669 308251 307188 306463 306283
53681 306283 306197 305596 304144 302009 299717 297819 296647 296193 295962 295229 293760 292126 290993 290354 289803 289276
53665 289276 288918 288518 287704 286591 285616 284894 284312 284082 284434 284936 284887 284370 284057 283966 283333 281898 280461 279891
53647 279891 280309 281400 282709 283401 282742 281342 281109 283214 286635 289373 290686 291497 292923 295096 297401
53632 297401 299346 301027 302838 304835 306533 307548 308234 309262 310762 312402 314235 316725 319851 322904
53618 322904 325501 328193 331675 335841 339974 343596 346869 350426 354885 360208 365496 369802 373178 376425
53604 376425 379903 383256 386362 389735 393689 397758 401405 404768 408334 412249 416252 419948 423008 425498
53590D25498K553L061K823J127r81j966j917k280l645n022n405m951m374l967
53576D00554l633l302l029k969l250l623l546k944k390k073j341K9R11K97r73
53561C68718j247l87L45M15N44J107J544J543J534J710J776J897K613L542L453
53546C89107K155J083J327K217K587K456K574L107L680M235M975N831O536P017
53532D38887P232P044O635O670P597R098J0577J1786J2737J3371J3694J3864J3953
53519E73145J3891J3824J4110J4806J5607J6468J7730J9501K1354K2928K4288
53508G67652K5436K6063K6097K6019K6235K6534K6448K5855K4909K3754K2531
53497A047533K1449K0625K0109K0064K0486K0808K0345J9286J8649J9050K0038
$$ plain form
53590 425498 428051 431112 433935 435062 434081 432115 430198 427918 424273 419251 413846 408895 404521 400554
53576 400554 396921 393619 390590 387621 384371 380748 377202 374258 371868 369795 368454 368483 369394 369691 368718
53561 368718 367471 367084 367429 367844 368388 369495 371039 372582 374116 375826 377602 379499 382112 385654 389107
53546 389107 391262 392345 393672 395889 398476 400932 403506 406613 410293 414528 419503 425334 431870 438887
53532 438887 446119 453163 459798 466468 474065 483163 493740 505526 518263 531634 545328 559192 573145
53519 573145 587036 600860 614970 629776 645383 661851 679581 699082 720436 743364 767652
53508 767652 793088 819151 845248 871267 897502 924036 950484 976339 1001248 1025002 1047533
53497 1047533 1068982 1089607 1109716 1129780 1150266 1171074 1191419 1210705 1229354 1248404 1268442
53486A268442K0813K1004K0513J9337J7879J6929J6822J7049J7006J6681J6209
53475A468684J5323J3778J1859R946P902N362K375p58m005p442j0801j3604j5663
53462A482956j7004j7525j7164j6437j6229j6983j8324j9556k0332k0825k1469
53451A281108k2513k3697k4309k3852k2652k1618k1253k1080k0243j8643j7081
53440A044167j6157j5311j3414j0208o725m127k645j857j424j134o12M39J855
53427I72847L306M787O435Q022R186J0055J1138J2622J4217J5652J6947J8258
53415A103472J9783K1734K3977K5893K7041K7861K9197L1235L3428L5368L7200
53404A416189L9097M0943M2581M4042M5384M6695M8230N0223N2569N4946N7118
$$ plain form
53486 1268442 1289255 1310259 1330772 1350109 1367988 1384917 1401739 1418788 1435794 1452475 1468684
53475 1468684 1484007 1497785 1509644 1519590 1527492 1532854 1535229 1534471 1530466 1523024 1512223 1498619 1482956
53462 1482956 1465952 1448427 1431263 1414826 1398597 1381614 1363290 1343734 1323402 1302577 1281108
53451 1281108 1258595 1234898 1210589 1186737 1164085 1142467 1121214 1100134 1079891 1061248 1044167
53440 1044167 1028010 1012699 999285 989077 982352 978225 975580 973723 972299 971165 970553 970992 972847
53427 972847 976153 980940 987375 995397 1004583 1014638 1025776 1038398 1052615 1068267 1085214 1103472
53415 1103472 1123255 1144989 1168966 1194859 1221900 1249761 1278958 1310193 1343621 1378989 1416189
53404 1416189 1455286 1496229 1538810 1582852 1628236 1674931 1723161 1773384 1825953 1880899 1938017
53393A938017N8793N9562N9460N9266N9649O0166N9909N8797N7511N6187N4244
53382B581561N1501M8551M5729M2616L8940L5167L1668K7975K3475J8402J3542
53371B959127R206M962K26n232j1360j8133k5686l4082m2814n0678n6499n9935
53359B669102o1498o1964o2032o2178o2361o2036o0903n9359n7758n5676n2603
53348B010734m9100m6399m5063m4747m5092m5891m6449m5848m4036m1819l9657
53337A516633l7266l4551l1957k9689k7456k5124k2851k0363j7127j3580j1114
53326A245555j0416j0698j1047j1554j2462j3149j2833j1654j0268q890p491o393
53314A118700n880n507m495k689n34J594L525M969N756O240P067Q487J0188J1773
$$ plain form
53393 1938017 1996810 2056372 2115832 2175098 2234747 2294913 2354822 2413619 2471130 2527317 2581561
53382 2581561 2633062 2681613 2727342 2769958 2808898 2844065 2875733 2903708 2927183 2945585 2959127
53371 2959127 2968333 2973295 2973521 2968289 2956929 2938796 2913110 2879028 2836214 2785536 2729037 2669102
53359 2669102 2607604 2545640 2483608 2421430 2359069 2297033 2236130 2176771 2119013 2063337 2010734
53348 2010734 1961634 1915235 1870172 1825425 1780333 1734442 1687993 1642145 1598109 1556290 1516633
53337 1516633 1479367 1444816 1412859 1383170 1355714 1330590 1307739 1287376 1270249 1256669 1245555
53326 1245555 1235139 1224441 1213394 1201840 1189378 1176229 1163396 1151742 1141474 1132584 1125093 1118700
53314 1118700 1112820 1107313 1102818 1100129 1099595 1101189 1104714 1109683 1115439 1121679 1128746 1137233 1147421 1159194
53300A159194J3110J4357J5799J7654J9898K2345K4778K6887K8302K9049K9779
53289A401152L1013L2322L2808L2205L0901K9021K6358K3202K0342J8030J5758
53278A693112J3236J0760Q390N586K091j661n278q828j2196j4844j6689j8465
53266A655214k0722k3109k5074k6640k8026k9149k9983l0825l1776l2492l2871
53255A344547l3321l4019l4499l4354l3702l2693l1263k9713k8663k8094k7344
53244I96882k6422k6248k7026k7476k6558k4954k3892k3372k2614k1485k0414
53233G26421j9321j7785j5890j4042j2266j0479r062q327p856p169o617o769p376
53220E83462p848q380r600j1347j2764j3471j3751j3760j3339j2545j1577j0346
$$ plain form
53300 1159194 1172304 1186661 1202460 1220114 1240012 1262357 1287135 1314022 1342324 1371373 1401152
53289 1401152 1432165 1464487 1497295 1529500 1560401 1589422 1615780 1638982 1659324 1677354 1693112
53278 1693112 1706348 1717108 1725498 1731084 1733175 1731514 1726236 1717408 1705212 1690368 1673679 1655214
53266 1655214 1634492 1611383 1586309 1559669 1531643 1502494 1472511 1441686 1409910 1377418 1344547
53255 1344547 1311226 1277207 1242708 1208354 1174652 1141959 1110696 1080983 1052320 1024226 996882
53244 996882 970460 944212 917186 889710 863152 838198 814306 790934 768320 746835 726421
53233 726421 707100 689315 673425 659383 647117 636638 627576 619249 611393 604224 597607 590838 583462
53220 583462 575614 567234 557634 546287 533523 520052 506301 492541 479202 466657 455080 444734
53208D44734q767p314o553o236n674m905m730n491o528o927o456n650n269n640
53194C58594o329o641o468o267o105n440m215l264l072k922k050r55o78j254j839
53179C01095j904j539r16l22l57j233k223k556k460k535k563j956r69m51o27r86
53163B77498j164j067m84M53Q01r7j354j513o37j78q61j922k502k688k816k807
53147B58662k518k033j369n28J14J79k7J06N09O42N63Q23J387J621J408J278J437
53130B62254J534J532J725J879J339K01o51q69j006j280j063k7J178J878K212
53115B70836K574K909L051L035K733J841N57m26r04j444k313k980l020k789k747
53100B70913k788k724k728k824k614j979j479j477j561j276q85p69o79k32L39
$$ plain form
53208 444734 435967 428653 422100 415864 410190 405285 400555 395064 388536 381609 375153 369503 364234 358594
53194 358594 352265 345624 339156 332889 326784 321344 317129 313865 310793 307871 305821 304866 304188 302934 301095
53179 301095 299191 297652 296736 296414 296057 294824 292601 290045 287585 285050 282487 280531 279562 279111 278484 277498
53163 277498 276334 275267 274783 275236 276037 275940 274586 273073 272436 272258 271397 269475 266973 264285 261469 258662
53147 258662 256144 254111 252742 252214 252328 252507 252480 252586 253095 253737 254300 255123 256510 258131 259539 260817 262254
53130 262254 263788 265320 267045 268924 270263 270464 269813 268944 267938 266658 265595 265568 266746 268624 270836
53115 270836 273410 276319 279370 282405 285138 286979 287536 287110 286206 284762 282449 279469 276449 273660 270913
53100 270913 268125 265401 262673 259849 257235 255256 253777 252300 250739 249463 248578 247809 247130 246898 247237
53085B47237O10P15R90J187Q28J29j58J98N82M19o1k16J55N97O75O04R45J600
53067B57036J630M35j236k049j673r42n39l17p0j02n87j067j090r22j059j378
53051B46070j297o18J93N43L31rJ4M05O89N64L04K69L61L39L90P38R47L77p46
53032B49864j530j630j462j168l99O42R86K46p05j001r10r94r34j55Q70J044K68
53015B43032l14J12R86J232O25q7j97J56K78k02q77j015l85N54J221J491J606
52998B48216J675J453O91l32q94o38n4J55O4K76P44O45k52j003p80M2P52J423
52980B52183K218K416J416J93K81J524K269J806J114J044J235J192J086R45L30
52965B71252n61o14N37J681J723J171J038J151P38n8m81n86j087k010k580k495
$$ plain form
53085 247237 247847 248562 249552 250739 251567 251696 251538 251736 252318 252737 252676 252460 252615 253212 253887 254491 255436 257036
53067 257036 258666 259101 257865 255816 254143 253201 252662 252345 252275 252173 251586 250519 249429 248507 247448 246070
53051 246070 244773 244155 244348 244891 245222 245213 245227 245632 246321 246885 247189 247458 247819 248158 248548 249286 250233 250610 249864
53032 249864 248334 246704 245242 244074 243675 244317 245303 245549 244844 243843 242933 241939 241005 240850 241720 242764 243032
53015 243032 242718 242830 243816 245048 245673 245586 245389 245545 245823 245621 244744 243729 243344 243898 245119 246610 248216
52998 248216 249891 251344 252035 251703 250809 250171 250117 250272 250336 250612 251356 252001 251749 250746 249966 250008 250760 252183
52980 252183 254401 256817 258233 258426 258707 260231 262500 264306 265420 266464 267699 268891 269977 270922 271252
52965 271252 270691 270077 270614 272295 274018 275189 276227 277378 278116 278058 277577 276991 275904 273894 271314 268819
52949B68819k286k298k163j591j024j052j506j591q82Q3K91o47j979k553j940
52934B47681p11L48Q75R05O53M26M18M39J29n09j082j318j225q56l20L6J6j9L56
52915B46242P65M24n42j010k65J136K114K051R21q42k295k566j780r43o56o62
52899B42092o52p20p51k93N24Q54M24J23P09J658J994J634J152P99M95L83O80
52882B51105J153J286Q30j51j395k339k329j322l0Q83J284J170M51n35r87n45
52866B48529L35J215K205L275L799L380K489J800J447J324J444J533J001j58j168
52851B72450j687k339l454m200l809k888k599l125l791m093l842k947j848j435
52837B30393j718j388K45J772J489ln12P39K292K614J726N86o4L8N81O44m09j873
$$ plain form
52949 268819 266533 264235 262072 260481 259457 258405 256899 255308 254426 254509 254800 254153 252174 249621 247681
52934 247681 246970 247318 248193 249098 249751 250177 250595 251034 251163 250654 249572 248254 247029 246173 245853 245889 245905 245886 246242
52915 246242 247007 247431 246889 245879 245614 246750 248864 250915 251836 250994 248699 246133 244353 243410 242754 242092
52899 242092 241440 240720 239969 239676 240200 241054 241478 241601 242310 243968 245962 247596 248748 249547 250042 250425 251105
52882 251105 252258 253544 254374 254223 252828 250489 248160 246838 246808 247691 248975 250145 250596 250061 249074 248529
52866 248529 248864 250079 252284 255559 259358 262738 265227 267027 268474 269798 271242 272775 273776 273618 272450
52851 272450 270763 268424 264970 260770 256961 254073 251474 248349 244558 240465 236623 233676 231828 230393
52837 230393 228675 227287 227532 229304 230793 230790 230278 231017 233309 235923 237649 238235 238171 238209 238790 239434 239025 237152
52819B37152k313j341p4L36m7l51OQ41J469J419J023J130K003K920L163K828K148
52802B52312Q29j129k606k554j606j339k115k800k611k020j675j401p72N2N06
52787B31071K75m23r42o77K66J071J174Q86O84M13j99p00m95J42M37K57P3M8N0
52768B33411K68Q90J407J142L55r9n0j07n57j071j383j456j100k76M44N46M41
52751B32805P57J103O91j72m82k35l31p54m32Q71J976K064J781K001K590K964
52735B47197K879K160O77r45j501p54J31K25L1M22J226J675J517J012L24l67o49
52718B55260l60n2l51j177j924k184j976j543j139p94k73M69Q83M45m63r54p95
52701B43072n05l36q5J09k35r70j261p17J74R38J563J935J780J339J181J190P25
$$ plain form
52819 237152 234839 233498 233424 233760 233713 233362 233368 234209 235678 237097 238120 239250 241253 244173 247336 250164 252312
52802 252312 253141 252012 249406 246852 245246 243907 241792 238992 236381 234361 232686 231285 230513 230565 231071
52787 231071 231346 230923 229981 229304 229570 230641 231815 232701 233385 233798 233599 232899 232404 232546 232983 233240 233313 233361 233411
52768 233411 233679 234569 235976 237118 237473 237374 237324 237217 236660 235589 234206 232750 231650 231374 231818 232364 232805
52751 232805 233562 234665 235356 235184 234702 234467 234136 233382 232950 233821 235797 237861 239642 241643 244233 247197
52735 247197 250076 252236 252913 251968 250467 249713 249844 250069 250100 250522 251748 253423 254940 255952 256276 255909 255260
52718 255260 254900 254848 254497 253320 251396 249212 247236 245693 244554 243760 243487 243956 244839 245284 244821 243867 243072
52701 243072 242567 242231 242146 242255 242020 241050 239789 239072 239246 240184 241747 243682 245462 246801 247982 249172 249897
52684B49897m3j77M39P91M22J14L45M36n5m40k99m13j245j657n36J294K139J690
52666B52702R66N58K72M2l3k65q86j266o70M70J084R96R53J339J893K482L172
52649B63809L631L356K460J412K29j222k367k393j536r18j123j663j915j654q22
52634B59284L45R57L02q79r36N84K315K863K391J969K063K219J787M72j432l062
52618B71242l554k858j728q41l40k47o71j322j450o81L93Q52L74o56j648k082
52602B54783j646n19N93J002N90j72n62k6J372K662K663J294q3q8J050J782J141
52585B65836j38n87K60J464J900J416P00L10K37K53L10M21M41J86l57j083j860
52568B69709k376k125q14J104K584K807J823M78l41m21k62m44r55j235q64m9N97
$$ plain form
52684 249897 249854 249677 250116 250907 251329 251443 251788 252224 252169 251729 251430 251017 249772 248115 247579 248873 251012 252702
52666 252702 253668 254226 254498 254540 254507 254242 253356 252090 251420 251890 252974 253970 254923 256262 258155 260637 263809
52649 263809 267440 270796 273256 274668 274897 273675 271308 268915 267379 266461 265338 263675 261760 260106 259284
52634 259284 259629 260586 260888 260009 259073 259657 261972 264835 267226 269195 271258 273477 275264 275736 274304 271242
52618 271242 267688 264830 263102 262261 261921 261674 261003 259681 258231 257550 257943 258795 259169 258513 256865 254783
52602 254783 253137 252618 253211 254213 254803 254631 254069 254043 255415 258077 260740 262034 261951 261863 262913 264695 265836
52585 265836 265698 265111 265371 266835 268735 270151 270851 271161 271398 271651 271961 272382 272823 273009 272652 271569 269709
52568 269709 267333 265208 264394 265498 268082 270889 272712 273190 272849 272428 272166 271722 270767 269532 268668 268619 269216
52551B69216O20P1o17r91r25o67m86m42m95o94r67r70n22p5k21q02r82l83M65
52532B60133R50J116J248J231Q28L20K99R33J740K122J857J165N00K18K73L34
52516B75267K31Q4oq8p3L75J342K381K995L248L552L999M194L679K315L06j942
52499C01859l940n262n646n076l831k417j233l99M1K3k26o0Q32J761J708O63l57
52482B78440o01k75J39N64R86J173J082J058J220J173O78J43Q7N10J050J407J328
52465B90162P65K82P07J991L016L002K477K301K380K010R96k92j584k744l482
52450C01987l691l750l883l600k486j121m60n83q47r99j247j424j051k80J11k06
52434B76470o97q12o16m22l90n73q76r23m24K24L63M1n9K95N28K55j28j07K69
$$ plain form
52551 269216 269836 269907 269290 268299 267374 266707 266221 265779 265284 264590 263623 262653 262131 262056 261835 261033 260051 259668 260133
52532 260133 261083 262199 263447 264678 265506 265826 266125 267058 268798 270920 272777 273942 274442 274660 274933 275267
52516 275267 275498 275582 275576 275488 275415 275790 277132 279513 282508 285756 289308 293307 297501 301180 303495 303801 301859
52499 301859 297919 292657 287011 281935 278104 275687 274454 274055 274096 274119 273893 273833 274665 276426 278134 278797 278440
52482 278440 277839 277564 277703 278267 279253 280426 281508 282566 283786 284959 285637 285780 285867 286377 287427 288834 290162
52465 290162 290927 291209 291916 293907 296923 299925 302402 304703 307083 309093 310089 309797 308213 305469 301987
52450 301987 298296 294546 290663 287063 284577 283456 282996 282413 281566 280567 279320 277896 276845 276565 276676 276470
52434 276470 275773 274961 274345 273923 273533 272960 272084 271161 270737 270961 271324 271365 271306 271601 272129 272384 272256 272149 272418
52415B72418P62J438K291K887K900K750L145M143N140N787O421P549R217J1044
52401C37892J2572J3269J2435R508M696q47n664q857j0317j0431r743q758p697
52388C28058o452m957l509k453j714r94l30L1J71L97O70P60R41J737K911L581
52372C18848L548L639M280M770M510M040M006L942L043J553K50q37k097l013k535
52357C47947p82Q07J225Q90O00M18M0m11m56J24J083J894K099J757J476J722K189
52340C62622K265J945J806K175K824L481M126M811N580O527P545Q171Q152Q026
52326D30056Q602R936J1329J2289J2970J3724J4649J5547J5936J5297J3772J2431
52314E86538J2265J3085J3912J4264J4422J4675J5032J5523J6167J6640J6684
$$ plain form
52415 272418 273180 274618 276909 279796 282696 285446 288591 292734 297874 303661 310082 317631 326848 337892
52401 337892 350464 363733 376168 385676 390372 389525 383861 375004 364687 354256 344513 335755 328058
52388 328058 321606 316649 313140 310687 308973 307979 307649 307680 307851 308248 308918 309678 310619 312356 315267 318848
52372 318848 322396 326035 330315 335085 339595 343635 347641 351583 354626 356179 356429 355592 353495 350482 347947
52357 347947 347165 347972 349197 350087 350687 351105 351145 350734 350278 350402 351485 353379 355478 357235 358711 360433 362622
52340 362622 364887 366832 368638 370813 373637 377118 381244 386055 391635 398162 405707 413878 422030 430056
52326 430056 438658 448594 459923 472212 485182 498906 513555 529102 545038 560335 574107 586538
52314 586538 598803 611888 625800 640064 654486 669161 684193 699716 715883 732523 749207
52303G49207J6667J7069J7614J7606J7035J6464J5922J4828J3065J1199R480P457
52291I23613M846K000o74l076m978n972o117o021o087o225o357o543o541n969
52277H65899n020m205l377j901P9J533K065K528L726N355O722P694Q395Q758Q847
52262I07098Q991R185R061Q775R087J0156J1187J1761J2503J3794J4860J5017
52250A041475J4872J5157J5209J3803J0953P758M823K057l63j990l015m052n038
52237A111649n329m978m892n594o690p731q696r391r232q129o914o364o331o208
52223A015170n835n477n225m929m565m224l844l279k535j724p97L75J599K380
52209I77090K518K522L188M698O302P014O497N217L920L143L089L589M197M517
$$ plain form
52303 749207 765874 782943 800557 818163 835198 851662 867584 882412 895477 906676 916156 923613
52291 923613 928459 930459 929785 926709 921731 915759 909642 903621 897534 891309 884952 878409 871868 865899
52277 865899 860879 856674 853297 851396 851475 853008 855073 857601 861327 866682 873404 881098 889493 898251 907098
52262 907098 916089 925274 934335 943110 952197 962353 973540 985301 997804 1011598 1026458 1041475
52250 1041475 1056347 1071504 1086713 1100516 1111469 1119227 1124050 1126107 1125744 1123754 1120739 1116687 1111649
52237 1111649 1106320 1101342 1096450 1090856 1084166 1076435 1067739 1058348 1049116 1040987 1034073 1027709 1021378 1015170
52223 1015170 1009335 1003858 998633 993704 989139 984915 981071 977792 975257 973533 972736 973111 974710 977090
52209 977090 979608 982130 985318 990016 996318 1003332 1009829 1015046 1018966 1022109 1025198 1028787 1032984 1037501
52195A037501M543M571M898N698O950Q190Q588P719O151M824L964L069J799K67
52181A108732j474l462n322o506p193q169r512j0320j0045r288q710q012o705
52168A014014n166m063l281k320j314p20l37M52J658K824L941N209N990N194K883
52153A024964M69j055k036k878k957j691Q6R77R06J070K098L238L600L308K878
52138A032977K180P44j172k577k829k218j411p29r3P51K161M381P178R967J2511
52123A061821J5169J8124K0874K2796K3962K4809K5316K5112K4251K3291K2578
52112A308103K1919K1040J9850J8278J6325J4339J2813J1831J1055J0262R531
52101A475346Q994Q818R274J0265J0937J0402Q806O990N208K933o4l447p131j1353
$$ plain form
52195 1037501 1042044 1046615 1051513 1057211 1064161 1072351 1080939 1088658 1094809 1099633 1103597 1106666 1108465 1108732
52181 1108732 1107258 1103796 1098474 1091968 1084775 1076606 1067094 1056774 1046729 1037441 1028731 1020719 1014014
52168 1014014 1008848 1004785 1001504 999184 997870 997150 996813 997265 998923 1001747 1005688 1010897 1016887 1022081 1024964
52153 1024964 1025433 1024378 1022342 1019464 1016507 1014816 1014902 1015879 1016785 1017855 1019953 1023191 1026791 1030099 1032977
52138 1032977 1035157 1035901 1034729 1032152 1029323 1027105 1025694 1024965 1024872 1025623 1027784 1032165 1039343 1049310 1061821
52123 1061821 1076990 1095114 1115988 1138784 1162746 1187555 1212871 1237983 1262234 1285525 1308103
52112 1308103 1330022 1351062 1370912 1389190 1405515 1419854 1432667 1444498 1455553 1465815 1475346
52101 1475346 1484340 1493158 1502432 1512697 1523634 1534036 1542842 1549832 1555040 1557973 1557909 1554462 1547331 1535978
52087A535978j5532j8236j8820j8229j7598j6865j5490j3699j2104j0688r100
52076A369617p496o262n215l936k558j476m86J029L180N539P801R842J1300J1801
52062A392680J1601J1285J0979J0399R700R493R993J0608J0660J0057R167Q310
52050A514932P480O391M770K679M71j713m142o993r938j2409j4093j4909j4874
52037A457652j4258j3555j3065j2732j2549j2656j2870j2697j2079j1508j1141
52026A318542j0558r860j0045j1515j3103j3539j3202j3239j3596j3265j2136
52015A184484j1157j0716j0208r358q691q386p845o846o113o276p032p943r243
52002A074670j1358j4165j7147j9752k1327k1351k0150j8804j7881j6842j5044
$$ plain form
52087 1535978 1520446 1502210 1483390 1465161 1447563 1430698 1415208 1401509 1389405 1378717 1369617
52076 1369617 1362121 1355859 1350644 1346708 1344150 1342674 1342188 1343217 1346397 1351936 1359737 1369579 1380879 1392680
52062 1392680 1404281 1415566 1426545 1436944 1446644 1456137 1466130 1476738 1487398 1497455 1506622 1514932
52050 1514932 1522412 1528803 1533573 1536252 1536723 1535010 1530868 1523875 1513937 1501528 1487435 1472526 1457652
52037 1457652 1443394 1429839 1416774 1404042 1391493 1378837 1365967 1353270 1341191 1329683 1318542
52026 1318542 1307984 1298124 1288079 1276564 1263461 1249922 1236720 1223481 1209885 1196620 1184484
52015 1184484 1173327 1162611 1152403 1143045 1134354 1125968 1118123 1111277 1105164 1098888 1091856 1083913 1074670
52002 1074670 1063312 1049147 1032000 1012248 990921 969570 949420 930616 912735 895893 880849
51991H80849j2770j0800r492q882r160j0333j1689j2310j2100j1764j1787j1958
51979G47804j1948j1952j2474j3633j4926j5691j5701j5120j3928j1732q410m723
51967E97566j792M7J460L161N173P108Q670R627R680Q786P422O199N125L540Q41
51952F72613k752o269q803j0180j0690j0315q722o101l383j178J032M013P426
51939F16691J0194J2072J3889J5971J7218J6415J3903J1282R548Q150N880K328
51927G53541j815n663q996j2062j4756j6525j7168j7298j7553j7659j6808j4849
51915E92389j2556j0581q743o499l721p17K241N142Q134J1434J5334J9971K4936
51902F36764K9013L0521K8338K2787J5371P544l3p127j3484j9021k3868k7742
$$ plain form
51991 880849 868079 857279 847787 838905 829745 819412 807723 795413 783313 771549 759762 747804
51979 747804 735856 723904 711430 697797 682871 667180 651479 636359 622431 610699 602289 597566
51967 597566 595774 595821 597281 600442 605615 612723 621393 631020 640700 649486 656908 663107 668232 671772 672613
51952 672613 669861 663592 654789 644609 633919 623604 614882 608781 605398 604220 605252 609265 616691
51939 616691 626885 638957 652846 668817 686035 702450 716353 727635 737183 745333 751213 753541
51927 753541 751726 746063 737067 725005 710249 693724 676556 659258 641705 624046 607238 592389
51915 592389 579833 569252 560509 554010 550289 549572 551813 556955 565089 576523 591857 611828 636764
51902 636764 665777 696298 724636 747423 762794 770338 770305 763178 749694 730673 706805 679063
51890F79063k9735k9357k7330k4761k1908j8506j4894j1745q965n885k647k87
51878D83043Q29J781L732O564R292J1274J2479J3015J2893J2052J0298P455L762
51865E88469j52l740o723q830r819r935r740r336q200n994l172n92J083J591J221
51850E16131Q54J251K059K070O98j373l202m551n554o157o467o963p774q151p362
51835D65509n744m204l013j729j86J186K047K578L116L655L798L090J425o79k398
51820D68451l369l927m419m634m200l252k218j162J65J742L171M136M539M265
51806D59288L171J481j97j388k149k852l641m236m167l238j776l87M97P58L76
51791D41540o65k094l253l583l097k244j362m53N50J446J821J347J36j247k133
$$ plain form
51890 679063 649328 619971 592641 567880 545972 527466 512572 500827 491862 485977 483330 483043
51878 483043 483872 485653 489385 495949 505241 516515 528994 542009 554902 566954 577252 584707 588469
51865 588469 588317 584577 577854 569024 559205 549270 539530 530194 521994 516000 512828 512236 513319 514910 516131
51850 516131 516985 518236 520295 522365 523063 521690 518488 513937 508383 502226 495759 488796 481022 472871 465509
51835 465509 459765 455561 452548 450819 450633 451819 453866 456444 459560 463215 467013 470103 471528 470849 468451
51820 468451 465082 461155 456736 452102 447902 444650 442432 441270 441435 443177 446348 450484 455023 459288
51806 459288 462459 463940 463743 462355 460206 457354 453713 449477 445310 442072 440296 439909 440406 441164 441540
51791 441540 440875 438781 435528 431945 428848 426604 425242 424789 425339 426785 428606 429953 430089 428842 426709
51776D26709k206j633q39j80K62O95J437K563L837N081O499Q370J0527J2361J3285
51761D86768J3057J1678R254N965K094j939n517q059r503j0266j0569j0085q636
51748D64242o828n501m800m315l866l518l002j881k72J173K150K920L743M706
51734D44951O090Q133J0219J1058J0020P777N357L030M80k280m439m757k569J112
51720D94182L745L287J77l256n298o068o303o053m989l180j115N46J026J5j557
51705D65159k165j362%J427L452O062P636O608L506L47j548k277k377k114j507
51690D80847l23J753M268N687M654J400k559n845p828q384p857o988o210n169
51676D47446l491j563O0J527L144M367M261K839J072k32p79k68J501M007O273
$$ plain form
51776 426709 424503 422870 422031 421851 422113 422808 424245 426808 430645 435726 442225 450595 461122 473483 486768
51761 486768 499825 511503 520757 526722 528816 526877 521360 513301 503798 493532 482963 472878 464242
51748 464242 457414 451913 447113 442798 438932 435414 432412 430531 430259 431432 433582 436502 440245 444951
51734 444951 451041 459174 469393 480451 490471 498248 503605 506635 507115 504835 500396 495639 493070 494182
51720 494182 497927 501214 501391 498135 492837 486769 480466 474413 469424 466244 465129 465675 466701 466716 465159
51705 465159 462994 461632 461632 463059 466511 472573 480209 486817 490323 490670 489122 486845 484468 482354 480847
51690 480847 480524 482277 486545 492232 496886 498286 495727 489882 482054 473670 465813 458825 452615 447446
51676 447446 443955 442392 442452 443979 447123 451490 455751 458590 459662 459430 458651 458383 459884 463891 470164
51661D70164P841Q692Q358O066K067k043m702n566n140l900k056K65L062O361
51647D89469R810J2483J3260J1439P149J490l971q214j1192j3088j3658j2767
51635D82210j1146r799q830p643o169n031m472l998l316k789k640k420j714q10
51621D11433k11Q3L58N07J06r29k142k929l046k699k230j674p47O37J974K633
51605D01124K596K410K429K435K101J528J155J303J932K835M059N955Q601J1244
51591D51707J2835J3079J2371J0578O869J323m133p408q341q207p617o141l746
51578D63169j225R82L325O153R217J2432J6049J9523K1325K0819J9646K0249K3183
51565F34847K6580K8087K6916K4146K1734K1267K3337K7752L4044M1500M8837
$$ plain form
51661 470164 478005 486697 495055 501121 503188 501145 496443 490877 485737 481837 479781 480046 483108 489469
51647 489469 499279 511762 525022 536461 543610 545100 541129 532915 521723 508635 494977 482210
51635 482210 471064 461265 452435 444792 438623 433592 429120 425122 421806 419017 416377 413957 412243 411433
51621 411433 411222 411305 411663 412170 412276 411347 409205 406276 403230 400531 398301 396627 395880 396517 398491 401124
51605 401124 403720 406130 408559 410994 413095 414623 415778 417081 419013 421848 425907 431862 440463 451707
51591 451707 464542 477621 489992 500570 507439 508762 504629 497221 488880 480673 473056 466915 463169
51578 463169 461944 462926 466251 472404 481621 494053 510102 529625 550950 571769 591415 611664 634847
51565 634847 661427 689514 716430 740576 762310 783577 806914 834666 868710 910210 959047
51554I59047N4397N6794N5097M8591L7143K2181O536p375j9054k9352l8766m6729
51542A098510n2313n5065n5273n3736n1255m8077m3946l8780l3185k8069k3921
51531F14890k0631j7844j5353j3254j1831j1082j0398r019o961n073m017l552
51519D85875l084k578k471k937l571l771l210k070r24l07k02j92j35l05p25q16
51503D58577k30M39K98o27j448j642j612j872k326k579k568k455k219j750j211
51488D36775r15q72q09o60o96j081j622k136k731l485m107m269m038l652l073
51473D02629k228j545j604k230k579k324k070k322k645k442j991j997k413k446
51459C71793j683n71K84P80J169J610K007K015J318J75m59K36J985L814N293O890
$$ plain form
51554 959047 1013444 1070238 1125335 1173926 1211069 1233250 1239786 1232411 1213357 1184005 1145239 1098510
51542 1098510 1046197 991132 935859 882123 830868 782791 738845 700065 666880 638811 614890
51531 614890 594259 576415 561062 547808 535977 524895 514497 505478 498517 493444 489427 485875
51519 485875 482791 480213 477742 474805 471234 467463 464253 462183 461259 460952 460750 460558 460423 460118 459393 458577
51503 458577 458347 458786 459084 458457 457009 455367 453755 451883 449557 446978 444410 441955 439736 437986 436775
51488 436775 435860 434988 434179 433519 432823 431742 430120 427984 425253 421768 417661 413392 409354 405702 402629
51473 402629 400401 398856 397252 395022 392443 390119 388049 385727 383082 380640 378649 376652 374239 371793
51459 371793 370110 369539 369823 370603 371772 373382 375389 377404 378722 378897 378438 378674 380659 384473 389766 396656
51443C96656R007J1308J3391J5609J8487K1320K1977J8671J1966M651n70l025
51431E39448l657l305k323j648k855o434j0798j3773j4647j4051j2519j0169p455
51418D35814n178l687k773k300k219k090j387k74O63J395K361L434L880L573L369
51403D34581L976N047N716N467M350K923K091K380L262L770L813M144N038N916
51389D92474O471P196Q437R848J1270J3339J6564K0614K5123L0521L7336M5002
51377G24195N2178N8013O2773O7320P2130P6227P6868P1095N8341M1214K3340
51366A383694O781q270k2184l5102m6899n7084o4833o9552p1265p0233o6749o1565
51354H16739n5804m9935m3504l6451k9971k5246k1908j8721j5356j2548j0811
$$ plain form
51443 396656 405663 416971 430362 445971 464458 485778 507755 526426 538392 543043 542473 539448
51431 539448 535791 532486 530163 528515 525660 519226 508428 494655 480008 465957 453438 443269 435814
51418 435814 430636 426949 424176 421876 419657 417567 416180 415906 416569 417964 420325 423759 427639 431212 434581
51403 434581 438557 443604 449320 454787 459137 462060 464151 466531 469793 473563 477376 481520 486558 492474
51389 492474 498945 506141 514578 524426 535696 549035 565599 586213 611336 641857 679193 724195
51377 724195 776373 834386 897159 964479 1036609 1112836 1189704 1260799 1319140 1360354 1383694
51366 1383694 1390475 1382205 1360021 1324919 1278020 1220936 1156103 1086551 1015286 945053 878304 816739
51354 816739 760935 711000 667496 631045 601074 575828 553920 535199 519843 507295 496484
51343D96484r956r714r831r636q440o547n057m554m578m437l892l083k376k366
51329D12017l289m438m737m003l011k339j865j526j617k089k185j412l36R4l02
51314C78962q41q18r9R43J807K283K609L059L381L041K065J258J327K152L125
51299D04254L846M121L694K490R41l55j345k481l940n254n860n752n377n034m548
51284C79400l536j891J9J659K794L634M428N032N037M337L238K020O87n76j171
51269D05111p93j28j12n10r1J593L404M118L927L639L115J695j80j129q44o59
51253D22156j650l110l700l370l233l798m255l585j832n9P91P49N93Q34J186J165
51237C98882Q67O65M41k26j173j667j410q27l28J4m5q85k132k700k188j431j192
$$ plain form
51343 496484 486528 476814 466983 457347 448907 442360 437303 432749 428171 423734 419842 416759 414383 412017
51329 412017 408728 404290 399553 395550 392539 390200 388335 386809 385192 383103 380918 379506 379170 379264 378962
51314 378962 378121 377303 377204 378147 379954 382237 384846 387905 391286 394327 396392 397650 398977 401129 404254
51299 404254 408100 412221 415915 418405 419346 418991 417646 415165 411225 405971 400111 394359 388982 383948 379400
51284 379400 375864 373973 373992 375651 378445 382079 386507 391539 396576 400913 404151 406171 406858 406282 405111
51269 405111 404318 404190 404078 403568 403477 405070 408474 412592 416519 420158 423273 424968 424788 423659 422815 422156
51253 422156 420506 417396 413696 410326 407093 403295 399040 395455 393623 393564 394355 395104 395697 396531 397717 398882
51237 398882 399749 400414 400855 400629 399456 397789 396379 395552 395224 395238 395193 394308 392176 389476 387288 385857 384665
51220C84665j188r52p72q98o69N36K033K597K136J587J423J359J327J693K443
51205C97320L083L479L991M704N229N415N515N552N171M204K837J120r55k850
51191D43815l705l396k790k654k883l016k926k691k223j450o03j1K14J85J10J49
51175D16125J90j47r50j662j678j200r12r28p31j54L38N32Q72J662K486K858K901
51158D19602K946K862K263J146j01j090j590j608j531j879k544k665j687k31O42
51143D14535P49Q09J199J431J024L33J4O0q2n49q12n59l58r64k215l133l079k313
51125D06090j310j09J297K457K858K656K423K320J996J330P76Q16J432K221K824
51110D30077L040K796K261J849J940K533L194L440L254L178L681M440M535L499
$$ plain form
51220 384665 383477 382525 381753 380855 380186 380722 382755 385352 387488 389075 390498 391857 393184 394877 397320
51205 397320 400403 403882 407873 412577 417806 423221 428736 434288 439459 443663 446500 447620 446665 443815
51191 443815 440110 436714 433924 431270 428387 425371 422445 419754 417531 416081 415478 415467 415681 415866 415976 416125
51175 416125 416315 416168 415218 413556 411878 410678 409766 408838 408107 407953 408291 408823 409695 411357 413843 416701 419602
51158 419602 422548 425410 427673 428819 428718 427628 426038 424430 422899 421020 418476 415811 414124 413893 414535
51143 414535 415284 416093 417292 418723 419747 420080 420094 420154 420072 419523 418711 418152 417794 416830 414615 411482 408403 406090
51125 406090 404780 404671 405968 408425 411283 413939 416362 418682 420678 422008 422784 423600 425032 427253 430077
51110 430077 433117 435913 438174 440023 441963 444496 447690 451130 454384 457562 461243 465683 470218 473717
51096D73717J891N82j95q27j625k519l272l632l352k439j345o88p50j288j713
51081D52545j435l61Q18J211P88M09N72O93J41o65q09j23Q73J875K837L374L125
51064D65868K670L112M621O186P080P884R776J3153J7094J9724J9234J5304R776
51051F01482N468M146N914J0056J5346J9678K0875J8747J5602J3760J3035J1230
51039G55339O763J95o495j1397j3587j3233j1290r060p949r104j2608j6913j9805
51026F30856k0286j9084j7140j4422j0726o870m065k350p31J192K669L140L329
51013E45512M333O164P812Q609Q832Q975R138R395J0170J1560J2648J2322J0850
51000F66320R856J0396J1731J2403J1996J1229J0722J0445J0175R838R363Q641
$$ plain form
51096 473717 475608 476190 475995 475168 473543 471024 467752 464120 460768 458329 456984 456296 455546 454258 452545
51081 452545 451110 450749 451567 452778 453566 453975 454547 455240 455381 454716 453907 453784 454657 456532 459369 462743 465868
51064 465868 468538 471650 476271 482457 489537 497421 507197 520350 537444 557168 576402 591706 601482
51051 601482 606950 611096 617010 627066 642412 662090 682965 701712 717314 731074 744109 755339
51039 755339 762102 762297 755802 744405 730818 717585 706295 697235 689286 680182 667574 650661 630856
51026 630856 610570 591486 574346 559924 549198 542328 538263 535913 535182 536374 539043 542183 545512
51013 545512 549845 556009 563821 572430 581262 590237 599375 608770 618940 630500 643148 655470 666320
51000 666320 676176 686572 698303 710706 722702 733931 744653 755098 765273 775111 784474 793115
50988G93115P651O334M576K675J407J143J278J219J504L011N400P365Q323Q746
50974H53747Q839Q179P039O858Q683J2043J5990K0386K5406L0478L4750L8245
50962A070643M1721M5551M9390N2845N5832N8215N9583N9515N7944N5186N1692
50951A658117M7644M2878L7363L1633K6354K1566J6912J2558R258P465P070Q047
50939A926865J0374J2947J3506J0510M698j693o840j0139j1868j2876j4309j6844
50927A904331k0243k3927k7773l2008l6611m1157m5133m8186n0389n2313n4302
50916A472289n5620n5036n2466m9191m6089m2643l8307l3844l0283k7384k4314
50905A017112k1288j9284j8312j7320j5806j4446j3836j3552j2776j1272r412
$$ plain form
50988 793115 800766 807100 811676 814351 815758 816901 818179 819398 820902 823913 829313 836678 845001 853747
50974 853747 862586 870765 877804 884662 893345 905388 921378 941764 967170 997648 1032398 1070643
50962 1070643 1112364 1157915 1207305 1260150 1315982 1374197 1433780 1493295 1551239 1606425 1658117
50951 1658117 1705761 1748639 1786002 1817635 1843989 1865555 1882467 1895025 1904283 1911748 1918818 1926865
50939 1926865 1937239 1950186 1963692 1974202 1978900 1977207 1970367 1960228 1948360 1935484 1921175 1904331
50927 1904331 1884088 1860161 1832388 1800380 1763769 1722612 1677479 1629293 1578904 1526591 1472289
50916 1472289 1416669 1361633 1309167 1259976 1213887 1171244 1132937 1099093 1068810 1041426 1017112
50905 1017112 995824 976540 958228 940908 925102 910656 896820 883268 870492 859220 849808
50894H49808p747o647n988n200m002k894k502k584k308j365j86Q21J514J681J224
50879H13625P50J165K556M104N256O241P293Q080Q361Q552R241J0529J2103J3635
50865I11491J4896J5855J6861J8326K0125K1845K3667K6366L0133L4120L7620
50854A171305M1192M5982N2278N9294O6176P2713P9193Q6016R3398J01041J08181
50843A976769J14258J19454J24268J28719J32263J34275J34062J30514J22489
50834C117071J09915R4168P6978N9318M1535K4249Q492n002j6111k4759l0382
50823C455472l2250l0151k4535j6241o361L724J2529J8790K1545K0033J3862L325
50811C439742j0589k6546m3183n9370p4551q8813j02304j14478j24170j30388
$$ plain form
50894 849808 842061 835414 829426 824226 820224 817330 814828 812244 809936 808571 808385 809206 810720 812401 813625
50879 813625 814375 815540 818096 822200 827456 833697 840990 849070 857431 865983 875224 885753 897856 911491
50865 911491 926387 942242 959103 977429 997554 1019399 1043066 1069432 1099565 1133685 1171305
50854 1171305 1212497 1258479 1310757 1370051 1436227 1508940 1588133 1674149 1767547 1868588 1976769
50843 1976769 2091027 2210481 2334749 2463468 2595731 2730006 2864068 2994582 3117071
50834 3117071 3226986 3321154 3398132 3457450 3498985 3523234 3531726 3526724 3510613 3485854 3455472
50823 3455472 3423222 3393071 3368536 3352295 3345934 3349658 3362187 3380977 3402522 3422555 3436417 3439742
50811 3439742 3429153 3402607 3359424 3300054 3225503 3136690 3034386 2919908 2795738 2665350
50801B665350j32827j31651j27222j20146j11230j01202r0604p9984o9853o0383
50791A640248n1450m3039l5318k8332k1908j5933j0374n186o67K256K840J702
50779A434839L74m65j499l271n148o369p232q422r858j1096j2379j4285j6683
50766A338506j8924k0866k2790k4560k5713k6302k6717k6700k5520k3239k0880
50755A076295j9013j7003j4146j0857q119o172m331j960Q28L465N687P794J0221
50742A022689J2929J5531J8033K1014K4829K9071L3301L7808M3041M8565N3381
50731A360192N7172O0491O3698O6457O8379O9441O9630O8840O7366O5886O4647
50720B082199O3139O0717N6999N1385M3005L1635J8271M341r166k1431l1211l7318
$$ plain form
50801 2665350 2532523 2400872 2273650 2153504 2042274 1941072 1850468 1770484 1700631 1640248
50791 1640248 1588798 1545759 1510441 1482109 1460201 1444268 1433894 1428708 1428041 1430297 1433137 1434839
50779 1434839 1435213 1434748 1433249 1429978 1424830 1418461 1411229 1402807 1392949 1381853 1369474 1355189 1338506
50766 1338506 1319582 1298716 1275926 1251366 1225653 1199351 1172634 1145934 1120414 1097175 1076295
50755 1076295 1057282 1040279 1026133 1015276 1007157 1000985 996654 994694 995522 998987 1004674 1012468 1022689
50742 1022689 1035618 1051149 1069182 1090196 1115025 1144096 1177397 1215205 1258246 1306811 1360192
50731 1360192 1417364 1477855 1541553 1608010 1676389 1745830 1815460 1884300 1951666 2017552 2082199
50720 2082199 2145338 2206055 2263054 2314439 2357444 2389079 2407350 2411691 2402525 2381094 2349883 2312565
50708B312565l9496l8368l4570k8467k0646j2158m033L156R206J3898J6847J7589
50696B195523J5744J1103L660o322j8182l0891m3282n4238o2676o7688o9160o8076
50684A805515o5688o2345n7510n0973m3516l6075k8822k1401j3798o475J81O242
50672A425335J2084J8161K4675L1224L6788M0344M1598M0981L9100L6417L3303
50661A780010L0059K6812K3605K0595J8031J6108J5034J5136J6378J7706J7465
50650A996939J4977J1487R103Q862J0275J2620J5928K0439K5748L1052L5999M0870
50638B234299M5961N1086N5559N8466N9180N7851N5139N1404M6633M1392L6947
50627B793917L3845L1447K9834L0771L4328L4922K3934j807l5447o5301q3705
$$ plain form
50708 2312565 2273069 2234701 2200131 2171664 2151018 2138860 2134827 2137983 2147189 2161087 2177934 2195523
50696 2195523 2211267 2222370 2226030 2219708 2201526 2170635 2127353 2073115 2010439 1942751 1873591 1805515
50684 1805515 1739827 1677482 1619972 1568999 1525483 1489408 1460586 1439185 1425387 1418912 1419093 1425335
50672 1425335 1437419 1455580 1480255 1511479 1548267 1588611 1630209 1671190 1710290 1746707 1780010
50661 1780010 1810069 1836881 1860486 1881081 1899112 1915220 1930254 1945390 1961768 1979474 1996939
50650 1996939 2011916 2023403 2032506 2041368 2051643 2064263 2080191 2100630 2126378 2157430 2193429 2234299
50638 2234299 2280260 2331346 2386905 2445371 2504551 2562402 2617541 2668945 2715578 2756970 2793917
50627 2793917 2827762 2859209 2889043 2919814 2954142 2989064 3012998 3011191 2975744 2910443 2826738
50616B826738r0035q7211p8070o4990n0381l6109k3018j1446j734N888J1256J3963
50604B414851J3563R976L313o403j8692l2143m5166n6945o6956p4076p7387p7608
50592A986327p6500p4763p1741o7288o2520n8240n3823m8453m2560l7224l2866
50581A360349k9267k6315k4029k2139k0311j8595j7120j5611j3594j0929p886
50570A154553m814j920Q66L828O917R378J0436J0419J0567J1618J3311J5423J8363
50557A258945K2189K5958K8936L1831L5794M0492M4141M5522M5114M4027M2572
50546A665521M0352L7297L4045L1334K9495K8680K9329L1935L6377M1778M7223
50535B053366N2464N7749O3294O9189P5532Q2294Q9233R6335J04195J13398J23582
$$ plain form
50616 2826738 2736703 2649492 2571422 2506432 2456051 2419942 2396924 2385478 2383744 2389632 2400888 2414851
50604 2414851 2428414 2438390 2441703 2435300 2416608 2384465 2339299 2282354 2215398 2141322 2063935 1986327
50592 1986327 1909827 1835064 1763323 1696035 1633515 1575275 1521452 1472999 1430439 1393215 1360349
50581 1360349 1331082 1304767 1280738 1258599 1238288 1219693 1202573 1186962 1173368 1162439 1154553
50570 1154553 1149739 1147819 1148685 1152513 1159430 1168808 1179244 1189663 1200230 1211848 1225159 1240582 1258945
50557 1258945 1281134 1307092 1336028 1367859 1403653 1444145 1488286 1533808 1578922 1622949 1665521
50546 1665521 1705873 1743170 1777215 1808549 1838044 1866724 1896053 1927988 1964365 2006143 2053366
50535 2053366 2105830 2163579 2226873 2296062 2371594 2453888 2543121 2639456 2743651 2857049 2980631
50524B980631J33511J42058J48729J53388J55953J56298J53967J48082J37993
50515D310610J23992J06808Q6665O3494L7996J1568j4908m1424o7700r2428j13990
50504D410683j31359j43980j51391j53260j49422j39693j24228j04240q1741n8298
50494C173071l4500j0744J2192L3493N2325O7100P5420P5403O6686M9937K6141
50483C586524l069l4972o6361r4497j17398j33958j44246j49231j49806j46524
50473B546462j40354j32801j24749j15920j06098r6144q7049p8666p0278o2019
50463A532384n4809m9048m4146l9329l4314k9277k4570k0436j6704j3013r410
50452A197328o302l621p50K394M853N796N560M893L957K782K130K880M913P309
$$ plain form
50524 2980631 3114142 3256200 3404929 3558317 3714270 3870568 4024535 4172617 4310610
50515 4310610 4434602 4541410 4628075 4691569 4729565 4741133 4726225 4684801 4617101 4524673 4410683
50504 4410683 4279324 4135344 3983953 3830693 3681271 3541578 3417350 3313110 3231369 3173071
50494 3173071 3138571 3127827 3140019 3173512 3225837 3292937 3368357 3443760 3510446 3560383 3586524
50483 3586524 3583455 3548483 3482122 3387625 3270227 3136269 2992023 2842792 2692986 2546462
50473 2546462 2406108 2273307 2148558 2032638 1926540 1830396 1743347 1664681 1594403 1532384
50463 1532384 1477575 1428527 1384381 1345052 1310738 1281461 1256891 1236455 1219751 1206738 1197328
50452 1197328 1191026 1187405 1186655 1189049 1193902 1199698 1205258 1210151 1214108 1216890 1219020 1221900 1226813 1234122
50438A234122R300J0307R706P641N651N276O206O855O653O618P646R419J1304
50425A336704J3237J5277J7152J8782K0602K2806K4903K6555K8428L1541L5982
50414A591969M0846M5398M9876N4963O0690O6176P0547P3873P6841P9540Q1049
50403B291768Q0422P7701P3624O8802O3451N7483N0304M0907K8693J4094j985
50392B845264j8953l6324n3166o8413q1381r1389r7242r8017r4205q7315p8465
50381B040394o8015n6379m4253l1963j9453o981M790J5435K4670L1525L4534L2977
50369A957281K7319J8272O319p542k1553l4334m5674n5584o3191o7384o8304o7442
50357A578183o6185o4617o1874n7449n2155m7681m5078m3667m1834l8788l5070
$$ plain form
50438 1234122 1243422 1253729 1263435 1271076 1276727 1282003 1288209 1295064 1301717 1308335 1315981 1325400 1336704
50425 1336704 1349941 1365218 1382370 1401152 1421754 1444560 1469463 1496018 1524446 1555987 1591969
50414 1591969 1632815 1678213 1728089 1783052 1843742 1909918 1980465 2054338 2131179 2210719 2291768
50403 2291768 2372190 2449891 2523515 2592317 2655768 2713251 2763555 2804462 2833155 2847249 2845264
50392 2845264 2826311 2789987 2736821 2668408 2587027 2495638 2398396 2300379 2206174 2118859 2040394
50381 2040394 1972379 1916000 1871747 1839784 1820331 1813350 1818140 1833575 1858245 1889770 1924304 1957281
50369 1957281 1984600 2002872 2009191 2001649 1980096 1945762 1900088 1844504 1781313 1713929 1645625 1578183
50357 1578183 1511998 1447381 1385507 1328058 1275903 1228222 1183144 1139477 1097643 1058855 1023785
50346A023785l1343k7468k3158j8891j5432j2785j0226p325m397j909J46K197
50334H73194M654P544J0465J2947J4941J6833J8582J9047J6565J0480K021o272
50322A001001j2063j4363j3748j1669r368p160m739k094J14J284J674K075K800
50309I33744L447L724L979M565N120M966M087L270L247M019M950N298M793L938
50295I93147L683M476N842P040P841Q328Q435Q226Q235Q885J0099J2109J5782
50282A102128K0620K2980J8503O999o545j6497k0936k1119j8637j4530r958n858
50270A057150k329O63K630L519M387N780O297M363R20j403j577j010j098j561
50256A076731j540r00PQ59J205P69K01O34K235M085N692P564J0053J2750J5494
$$ plain form
50346 1023785 992442 964974 941816 922925 907493 894708 884482 877157 872760 870851 870997 873194
50334 873194 877848 885392 895857 908804 923745 940578 959160 978207 994772 1005252 1007273 1001001
50322 1001001 988938 974575 960827 949158 939790 932630 927891 925797 925911 927195 928869 930944 933744
50309 933744 937191 940915 944894 949459 954579 959545 963632 966902 970149 974168 979118 984416 989209 993147
50295 993147 996830 1001306 1007148 1014188 1022029 1030357 1038792 1047018 1055253 1064138 1074237 1086346 1102128
50282 1102128 1122748 1145728 1164231 1171230 1164685 1148188 1127252 1106133 1087496 1072966 1063008 1057150
50270 1057150 1054821 1055484 1058114 1061633 1066020 1071800 1078097 1082460 1083380 1081977 1080400 1079390 1078292 1076731
50256 1076731 1075191 1074291 1074298 1075157 1076362 1077131 1077332 1077966 1080201 1084286 1089978 1097542 1107595 1120345 1135839
50241A135839J9036K3896K9337L4010L7211L8989L9523L8901L7225L4630L1473
50230A500070K8484K6306K4785K3233K1327J9028J5690J0123J873q269j9211l0235
50218A613204m0436m8393n3016n4300n2877m9282m3997l7641l0727k3587j6853
50207A162095j1694r397j0840j6029k3473l0256l3758l3665l1590k8833k5447
50196I07113k1518j7964j5432j3450j1456r786q898q426p768p033o591o308n982
50183G66501o006o672p314p041n979m967m255l504k839k866l501l697k684r28
50169G04248N32J252J522J623J529J355J604K571L682M011L643L829N309P076
50155G43786P647P256P657R708J2232J3648J3705J3150J2421J1370R760P462M594
$$ plain form
50241 1135839 1154875 1178771 1208108 1242118 1279329 1318318 1357841 1396742 1433967 1468597 1500070
50230 1500070 1528554 1554860 1579645 1602878 1624205 1643233 1658923 1669046 1670919 1662650 1643439 1613204
50218 1613204 1572768 1524375 1471359 1417059 1364182 1314900 1270903 1233262 1202535 1178948 1162095
50207 1162095 1150401 1141004 1130164 1114135 1090662 1060406 1026648 992983 961393 932560 907113
50196 907113 885595 867631 852199 838749 827293 817507 808609 800183 792415 785382 778791 772483 766501
50183 766501 760495 753823 746509 739468 733489 728522 724267 720763 717924 715058 711557 707860 705176 704248
50169 704248 704780 706032 707554 709177 710706 712061 713665 716236 719918 723929 727572 731401 736710 743786
50155 743786 751433 758689 766346 776054 788286 801934 815639 828789 841210 852580 862340 869802 874396
50142H74396J844J39m05o68j238j536o75J362L963O776R798J3058J6715K1040
50128I44569K5778L0047L3487L6991M1645M7410N3455N9255O4471O8215O9471
50117A474794O8276O5672O2594N9505N7012N5932N6440N7657N8209N6719N1813
50106B124623M2420K8496J1258p450k5860m2555n6566o7420p5039p9560q1364
50095A770983q1111p9379p6342p1964o6363n9803n2454m4596l6955l0492k5784
50084A145740k2692k0645j9010j7349j5477j3389j1206r159p439n858l958j793
50072I97765k29J05j31J61P67M01j168k522k614k253k773m199n707p048q437r557
50056I52561r834r375q650p611o097m766m412m510l751k035p30o19p68Q0J865
$$ plain form
50142 874396 876240 876379 875974 875306 874068 872532 871857 873219 877182 883958 893756 906814 923529 944569
50128 944569 970347 1000394 1033881 1070872 1112517 1159927 1213382 1272637 1337108 1405323 1474794
50117 1474794 1543070 1608742 1671336 1730841 1787853 1843785 1900225 1957882 2016091 2072810 2124623
50106 2124623 2167043 2195539 2206797 2199347 2173487 2130932 2074366 2006946 1931907 1852347 1770983
50095 1770983 1689872 1610493 1534151 1462187 1395824 1336021 1283567 1238971 1202016 1171524 1145740
50084 1145740 1123048 1102403 1083393 1066044 1050567 1037178 1025972 1016813 1009374 1003516 999558 997765
50072 997765 997536 997641 997510 997671 998438 998839 997671 995149 992535 990282 987509 983310 977603 970555 962118 952561
50056 952561 942727 933352 924702 917091 910994 906228 901816 897306 893555 891520 890790 890171 889403 889483 891348
50041H91348L647M956O006P012P959Q899R950J1103J2289J3465J4475J4945J4666
50028A020720J3945J3344J3004J2442J1069Q853O409M402K976J875R11J33m24
50015A109659q42j249j884l131m943o252n611k634J687O240J0716J5140J9312
50002A136208K3273K7652L2797L8018M2301M5345M7278M7792M6371M3200L9214
49991A569449L5357L2243L0091K8307K5363J9771J0976j038j6261l3777n0805
49980A649676o4042p2135p6013p6800p4531o9212o2002n4620m8013m2113l6559
49969I73636l1244k6393k2451j9727j7992j6568j4864j2739j0438q389o891n724
49957G80216m242k157M1J833L523N719Q310J0583J2333J3969J5496J6093J5013
$$ plain form
50041 891348 894995 899951 905957 912969 920928 929827 939777 950880 963169 976634 991109 1006054 1020720
50028 1020720 1034665 1048009 1061013 1073455 1084524 1093377 1099786 1104188 1107164 1109039 1109950 1110083 1109659
50015 1109659 1108817 1107568 1105684 1102553 1097610 1091358 1085747 1083113 1084800 1091040 1101756 1116896 1136208
50002 1136208 1159481 1187133 1219930 1257948 1300249 1345594 1392872 1440664 1487035 1530235 1569449
49991 1569449 1604806 1637049 1667140 1695447 1720810 1740581 1751557 1750519 1734258 1700481 1649676
49980 1649676 1585634 1513499 1437486 1360686 1286155 1216943 1154941 1100321 1052308 1010195 973636
49969 973636 942392 915999 893548 873821 855829 839261 824397 811658 801220 792831 785940 780216
49957 780216 775974 773817 773858 775691 779214 784933 793243 803826 816159 830128 845624 861717 876730
49944H76730J2483R418O577M164K013rj735k994m178o081q938j2047j4804j7535
49930H43064k0596k3172k3904k2557k0157j7649j5265j3127j1364r561p116m354
49918F54242k375j510q08M71J844K567K843L321L935M079L650L287L682N089P321
49903F91638R835J1889J3137J4064J5590J8001K0363K1125J9490J6150J2472R092
49891H72846N769K585L39r28k839o977j2536j6903j8547j8294j7607j6932j6158
49878G53818j5683j5975j6627j6593j5264j2932j0366q214o604n175l691k528
$$ plain form
49944 876730 889213 898631 905208 909372 911385 911376 909641 906647 902469 896388 887450 875403 860599 843064
49930 843064 822468 799296 775392 752835 732678 715029 699764 686637 675273 665712 658596 654242
49918 654242 651867 650357 649549 650020 651864 654431 657274 660595 664530 668609 672259 675546 679228 684317 691638
49903 691638 701473 713362 726499 740563 756153 774154 794517 815642 835132 851282 863754 872846
49891 872846 878615 881200 881539 880611 877772 870795 858259 841356 822809 804515 786908 769976 753818
49878 753818 738135 722160 705533 688940 673676 660744 650378 642164 635560 630385 626694 624166
$$ [...]
##END NTUPLES=NMR SPECTRUM
##END=
