
##TITLE=UV1224_M6_1234-1212_30_7231337_LlRSUDQFCa
##JCAMPDX= 6.0         $$ Bruker NMR JCAMP-DX V2.0
##DATA TYPE= NMR SPECTRUM
##DATA CLASS= NTUPLES
##ORIGIN= BRUKER
##OWNER= Administrator
$$ 1.72 TOPSPIN		Version 2.1
$$ 2013-01-18 04:31:04.027 -0500  Administrator@X
$$ Compression mode = diff/dup
##.OBSERVE FREQUENCY= 400.02188249412
##.OBSERVE NUCLEUS= ^1H
##.ACQUISITION MODE= SIMULTANEOUS (DQD)
##.ACQUISITION SCHEME= undefined
##.AVERAGES= 64
##.DIGITISER RES= 22
##SPECTROMETER/DATA SYSTEM= spect
##.PULSE SEQUENCE= noesygpps1d.comp
##.SOLVENT NAME= COFFEE_meoh
##.SHIFT REFERENCE= INTERNAL, COFFEE_meoh, 1, 14.96146
##AUDIT TRAIL= $$ (NUMBER, WHEN, WHO, WHERE, PROCESS, VERSION, WHAT)
$$ ##TITLE= Audit trail, TOPSPIN		Version 2.1
$$ ##JCAMPDX= 5.01
$$ ##ORIGIN= Bruker BioSpin GmbH
$$ ##OWNER= Administrator
$$ $$ E:\/data/COFFEE/nmr/UV1224_M6_1234-1212_30_7231337_LlRSUDQFCa/22/pdata/1/auditp.txt
$$ ##AUDIT TRAIL=  $$ (NUMBER, WHEN, WHO, WHERE, PROCESS, VERSION, WHAT)
(   1,<2013-01-18 04:30:58.293 -0500>,<Administrator>,<X>,<go>,<TOPSPIN 2.1>,
      <created by zg
	started at 2013-01-18 04:19:28.605 -0500,
	POWCHK enabled, PULCHK disabled,
       configuration hash MD5:
       86 BA 57 50 F2 9D 5C 9B 26 00 A9 28 5F 66 2E 89
       data hash MD5: 64K
       4F 58 B8 E1 24 83 52 45 1A 17 6E E3 33 C5 4E 44>)
(   2,<2013-01-18 04:31:01.324 -0500>,<Administrator>,<X>,<proc1d>,<TOPSPIN 2.1>,
      <Start of raw data processing
       efp LB = 0.3 FT_mod = 6 PKNL = 1 PHC0 = 0 PHC1 = 0 SI = 128K 
       data hash MD5: 128K
       52 85 66 E5 CE 77 5E 48 A1 4A 77 68 4C E1 B3 23>)
(   3,<2013-01-18 04:31:02.324 -0500>,<Administrator>,<X>,<proc1d>,<TOPSPIN 2.1>,
      <pk PHC0 = -81.45813 PHC1 = 0 
       data hash MD5: 128K
       5E DF 65 A8 15 48 5B E4 7D 3E 7E A8 F0 F2 55 97>)
(   4,<2013-01-18 04:31:02.980 -0500>,<Administrator>,<X>,<proc1d>,<TOPSPIN 2.1>,
      <abs ABSG = 1 
       data hash MD5: 128K
       03 3E FA 76 3A 77 72 77 68 86 15 90 8D 3D 15 47>)
(   5,<2013-01-18 04:31:03.137 -0500>,<Administrator>,<X>,<proc1d>,<TOPSPIN 2.1>,
      <abs ABSG = 2 
       data hash MD5: 128K
       1D 3C 3E 9B 58 D3 C1 27 E7 5A 77 0D FE 51 D5 71>)
(   6,<2013-01-18 04:31:03.308 -0500>,<Administrator>,<X>,<proc1d>,<TOPSPIN 2.1>,
      <abs ABSG = 3 
       data hash MD5: 128K
       9D 29 72 7C 68 1E 72 52 16 48 D5 17 9D 23 6A 05>)
(   7,<2013-01-18 04:31:03.480 -0500>,<Administrator>,<X>,<proc1d>,<TOPSPIN 2.1>,
      <abs ABSG = 4 
       data hash MD5: 128K
       2A B9 66 C1 C8 07 09 44 C1 84 BC F5 A4 0A BF 21>)
(   8,<2013-01-18 04:31:03.652 -0500>,<Administrator>,<X>,<proc1d>,<TOPSPIN 2.1>,
      <abs ABSG = 5 
       data hash MD5: 128K
       A3 E3 30 01 34 83 0B 2F DC E1 89 C1 02 11 EA E1>)
$$ ##END=
$$ 
$$ $$ hash MD5
$$ $$ F6 85 71 4B 04 73 9F 3B 3F 4D DC 5F 1A 48 7F 52
##$RELAX= 
##$RELAX= 
##$RELAX= 
##$RELAX= 
##$RELAX= 
##$RELAX= 
##$RELAX= 
##$RELAX= 
$$ Bruker specific parameters
$$ --------------------------
##$DU= <E:\>
##$EXPNO= 22
$$ [...]
##$TP07= 0
##$TPNAME0= <>
##$TPNAME1= <>
##$TPNAME2= <>
##$TPNAME3= <>
##$TPNAME4= <>
##$TPNAME5= <>
##$TPNAME6= <>
##$TPNAME7= <>
##$TPOAL= (0..7)
0.5 0.5 0.5 0.5 0.5 0.5 0.5 0.5
##$TPOFFS= (0..7)
0 0 0 0 0 0 0 0
##$TUNHIN= 0
##$TUNHOUT= 0
##$TUNXOUT= 0
##$USERA1= <user>
##$USERA2= <user>
##$USERA3= <user>
##$USERA4= <user>
##$USERA5= <user>
##$V9= 5
##$VALIST= <valist>
##$VCLIST= <CCCCCCCCCCCCCCC>
##$VD= 0
##$VDLIST= <DDDDDDDDDDDDDDD>
##$VPLIST= <PPPPPPPPPPPPPPP>
##$VTLIST= <TTTTTTTTTTTTTTT>
##$WBST= 1024
##$WBSW= 4
##$XGAIN= (0..3)
0 0 0 0
##$XL= 0
##$YL= 0
##$YMAX_a= 6331666
##$YMIN_a= -14105335
##$ZGOPTNS= <>
##$ZL1= 120
##$ZL2= 120
##$ZL3= 120
##$ZL4= 120
##$ABSF1= 14.96146
##$ABSF2= -5.596722
##$ABSG= 5
##$ABSL= 3
##$ALPHA= 0
##$AQORDER= 0
##$ASSFAC= 0
##$ASSFACI= 0
##$ASSFACX= 0
##$ASSWID= 0
##$AUNMP= <proc_prof1d_extract.lims>
##$AXLEFT= 0
##$AXNAME= <>
##$AXNUC= <1H>
##$AXRIGHT= 0
##$AXTYPE= 0
##$AXUNIT= <>
##$AZFE= 0.1
##$AZFW= 0.1
##$BCFW= 0
##$BC_mod= 0
##$BYTORDP= 0
##$COROFFS= 0
##$CY= 15
##$DATMOD= 1
##$DC= 0
##$DFILT= <>
##$DTYPP= 0
##$F1P= 0
##$F2P= 0
##$FCOR= 0.5
##$FTSIZE= 131072
##$FT_mod= 6
##$GAMMA= 0
##$GB= 0
##$INTBC= 1
##$INTSCL= 1
##$ISEN= 128
##$LB= 0.3
##$LEV0= 0
##$LPBIN= 0
##$MAXI= 10000
##$MC2= 0
##$MEAN= 0
##$ME_mod= 0
##$MI= 0
##$NCOEF= 0
##$NC_proc= -2
##$NLEV= 6
##$NOISF1= 0
##$NOISF2= 0
##$NSP= 0
##$NTH_PI= 0
##$NZP= 0
##$OFFSET= 14.96146
##$PC= 1
##$PHC0= -81.45813
##$PHC1= 0
##$PH_mod= 1
##$PKNL= yes
##$PPARMOD= 0
##$PPDIAG= 0
##$PPIPTYP= 0
##$PPMPNUM= 2147483647
##$PPRESOL= 1
##$PSCAL= 4
##$PSIGN= 0
##$PYNMP= <proc.py>
##$REVERSE= no
##$SF= 400.020009454391
##$SI= 131072
##$SIGF1= 0
##$SIGF2= 0
##$SINO= 400
##$SIOLD= 131072
##$SPECTYP= <>
##$SREGLST= <1H.CDCl3>
##$SSB= 0
##$STSI= 131072
##$STSR= 0
##$SW_p= 8223.68421052631
##$SYMM= 0
##$S_DEV= 0
##$TDeff= 65536
##$TDoff= 0
##$TI= <>
##$TILT= no
##$TM1= 0
##$TM2= 0
##$TOPLEV= 0
##$USERP1= <user>
##$USERP2= <user>
##$USERP3= <user>
##$USERP4= <user>
##$USERP5= <user>
##$WDW= 1
##$XDIM= 131072
##$YMAX_p= 464739226
##$YMIN_p= -15826
##$CURPLOT= <Network HP LaserJet P1505>
##$CURPRIN= <$Network HP LaserJet P1505>
##$DFORMAT= <normdp>
##$LAYOUT= <+/1D_H.xwp>
##$LFORMAT= <normlp>
##$PFORMAT= <normpl>
##$SURQMSG= 1
$$ End of Bruker specific parameters
$$ ---------------------------------
##NTUPLES= NMR SPECTRUM
##VAR_NAME=  FREQUENCY,     SPECTRUM/REAL,   SPECTRUM/IMAG
##SYMBOL=    X,             R,               I
##VAR_TYPE=  INDEPENDENT,   DEPENDENT,       DEPENDENT
##VAR_FORM=  AFFN,          ASDF,            ASDF
##VAR_DIM=   131072,        131072,          131072
##UNITS=     HZ,            ARBITRARY UNITS, ARBITRARY UNITS
##FACTOR=    0.0627417313425164, 1,          1
##FIRST=     8223.62146879497, 3438,         -67745
##LAST=      0,             5491,            -67898
##MIN=       0,             -15826,          0
##MAX=       8223.62146879497, 464739226,    0
$$ Real data points
##PAGE= N=1
##DATA TABLE= (X++(R..R)), XYDATA
$$ [...]
63826I02238l9980l9969l9802l9038l7281l4944l2683l0486k7970k5253k2879
$$ 902238 862258 822289 782487 743449 706168 671224 638541 608055 580085 554832 531953
63815E31953k1085j9698j8540j7376j5778j3696j1816j0741j0028q797p041n586
$$ 531953 510868 491170 472630 455254 439476 425780 413964 403223 393195 384398 377357 371771
63803C71771m882m647m639m885n118m797l959l286l064k797k188j794k212l114
$$ 371771 366889 362242 357603 352718 347600 342803 338844 335558 332494 329697 327509 325715 323503 320389
63789C20389l749m057m591n420n795n104l791k888k757k745k220j516j399j806
$$ 320389 316640 312583 307992 302572 296777 291673 287882 284994 282237 279492 277272 275756 274357 272551
63775B72551j894j307p12p13r72r18p60j023j485j401o13K39N69L15l63j157j493
$$ 272551 270657 269350 268638 267925 266953 266035 265275 264252 262767 261366 260753 260992 261561 261876 261513 260356 258863
63758B58863j024k91k23q67j301r50l07l2m3Q2K91K38m0j81j21j93n00n83J29
$$ 258863 257839 257548 257325 256458 255157 254207 253900 253868 253825 253907 254198 254436 254396 254215 254094 253901 253401 252818 252947
63739B52947J549K810L034K241J344J219J958L136M402N446N706M766L113J918
$$ 252947 254496 257306 260340 262581 263925 265144 267102 270238 274640 280086 285792 290558 293671 295589
63725B95589J899K700L583M266M836N163M950M335M001M426N232N573N100M288
$$ 295589 297488 300188 303771 308037 312873 318036 322986 327321 331322 335748 340980 346553 351653 355941
63711C55941L669L131K224R18l69j389k209k827l137l302l577l676k978j560l56
$$ 355941 359610 362741 364965 365883 365514 364125 361916 359089 355952 352650 349073 345397 342419 340859 340503
63696C40503M9P3K39K90j04m61n5J010K044K729L111L039K467J993K215K668K301
$$ 340503 340552 340625 340864 341154 341050 340589 340534 341544 343588 346317 349428 352467 354934 356927 359142 361810 364111
63679C64111R80l43j008j285j489j397q56k71J4K71Q29J418J558J354J390J874
$$ 364111 365091 364748 363740 362455 360966 359569 358713 358442 358456 358727 359556 360974 362532 363886 365276 367150
63663C67150K248J836P98J42O16J669J978J021m00j382j997k700l407l844m259
$$ 367150 369398 371234 372032 372174 372790 374459 376437 377458 377058 375676 373679 370979 367572 363728 359469
63648C59469m915n267m599l271k309j973j656j170r68r97n47M89J234J257J385
$$ 359469 354554 349287 344688 341417 339108 337135 335479 334309 333341 332344 331797 332286 333520 334777 336162
63633C36162K412L719M065L238K259K107K908M223N556O567P069P127P048P286
$$ 336162 338574 342293 346358 349596 351855 353962 356870 361093 366649 373216 380285 387412 394460 401746
63619D01746Q099R229J0189J1051J2570J5027J7449J8732J9272K0521K2998K5732
$$ 401746 409845 419074 429263 440314 452884 467911 485360 504092 523364 543885 566883 592615
63607E92615K7798K9361L0839L2012L2567L2776L2928L2617L1221K8735K5621
$$ 592615 620413 649774 680613 712625 745192 777968 810896 843513 874734 903469 929090
63596I29090K2162J8340J4066R211L784j626o028r002j1011j2559j3583j4138
$$ 929090 951252 969592 983658 992869 996653 995027 988999 979997 968986 956427 942844 928706
63584I28706j5042j6997j9506k1356k2106k2380k2795k3202k3149k2557k1680
$$ 928706 913664 896667 877161 855805 833699 811319 788524 765322 742173 719616 697936
63573F97936k0629j9228j7265j4776j1982r084o273l918k416j568m42J661M206
$$ 697936 677307 658079 640814 626038 614056 604972 598699 594781 592365 590797 590355 592016 596222
63560E96222N875N964N009M073L901M674O057P455Q666J0234J2674J5570J8072
$$ 596222 602097 608061 613070 617143 621044 625718 631775 639230 647896 658130 670804 686374 704446
63547G04446K0195K2796K6338L0488L4917L9405M3050M4528M3683M1752L9441
$$ 704446 724641 747437 773775 804263 839180 878585 921635 966163 1009846 1051598 1091039
63536A091039L5713K9287K0541J1058J966o295j3066j7437j9182j9071j8273j7715
$$ 1091039 1126752 1156039 1176580 1187638 1189604 1183309 1170243 1152806 1133624 1114553 1096280 1078565
63524A078565j7776j8192j8566j9212k0969k3915k6942k9184l1132l3499l5593
$$ 1078565 1060789 1042597 1024031 1004819 983850 959935 932993 903809 872677 839178 803585
63513H03585l5911l4113l1392k8947k6928k4993k3082k1328j9665j7809j5545
$$ 803585 767674 733561 702169 673222 646294 621301 598219 576891 557226 539417 523872
63502E23872j2967j0597r067q441q078p411o564n993n786n702n540n144m319l148
$$ 523872 510905 500308 491241 482800 474722 467311 460747 454754 448968 443266 437726 432582 428263 425115
63488D25115k114j596j520j674j922j848q44R35K348K547K038J875K309K923L524
$$ 425115 423001 421405 419885 418211 416289 414441 413597 414532 416880 419427 421465 423340 425649 428572 432096
63473D32096M084M162L312J900Q31N49Q22J200J106o4k181m062m689m376m041
$$ 432096 436180 440342 443654 445554 446385 446934 447756 448956 450062 449998 447817 443755 439066 434690 430649
63458D30649l761l074k234j977k220k148j577j135j031p82k70P8L03J067K515
$$ 430649 426888 423814 421580 419603 417383 415235 413658 412523 411492 410710 410440 410518 410821 411888 414403
63443D14403L999N212O535Q007R030R583J0568J2357J4097J5239J6767J9936K4527
$$ 414403 418402 423614 430149 438156 447186 456769 467337 479694 493791 509030 525797 545733 570260
63430E70260K9224L3113L5908L7314L7224L6150L4434L1291K5759J8488J1704
$$ 570260 599484 632597 668505 705819 743043 779193 813627 844918 870677 889165 900869
63419I00869P236N392N738P966J1632J5853J9904K3774K7638L1133L3527L4396
$$ 900869 908105 913497 919235 927201 938833 954686 974590 998364 1026002 1057135 1090662 1125058
63407A125058L3748L1521K7446K1570J4736Q169K513k576p686j2621j6459j8695
$$ 1125058 1158806 1190327 1217773 1239343 1254079 1262248 1264761 1262185 1254499 1241878 1225419 1206724
63395A206724j9914k1058k2326k3328k4138k5539k7966l0751l2824l3944l4664
$$ 1206724 1186810 1165752 1143426 1120098 1095960 1070421 1042455 1011704 978880 944936 910272
63384I10272l5223l5062l3622l1211k8616k6175k3611k0696j7621j4648j1794
$$ 910272 875049 839987 806365 775154 746538 720363 696752 676056 658435 643787 631993
63373F31993r004o354l931j705L42K197L937N660P250Q574R949J1953J4573J7001
$$ 631993 622989 616635 612704 610999 611341 613538 617475 623135 630385 638959 648908 660861 675434 692435
63359F92435J8692K0199K2538K5905K9471L2327L4281L5796L7443L9200M0147
$$ 692435 711127 731326 753864 779769 809240 841567 875848 911644 949087 988287 1028434
63348A028434L9161L6202L2487K8962K5137K0091J4142Q563L808r35o238j1404
$$ 1028434 1067595 1103797 1136284 1165246 1190383 1210474 1224616 1233179 1236987 1236052 1229814 1218410
63336A218410j5343j7784j9214k0182k1146k2491k4207k5866k7230k8647l0485
$$ 1218410 1203067 1185283 1166069 1145887 1124741 1102250 1078043 1052177 1024947 996300 965815
63325I65815l2438l3745l3846l2577l0012k6460k2404j8114j3539q947n303l487
$$ 965815 933377 899632 865786 833209 803197 776737 754333 736219 722680 713733 708430 704943
63313G04943l216l396l659n004q549j3936j9328k2944k4287k4025k3056k1840
$$ 704943 701727 698331 694672 689668 681119 667183 647855 624911 600624 576599 553543 531703
63301E31703k0294j8082j5093j1830r188p640o742n744m542l670l418l485l571
$$ 531703 511409 493327 478234 466404 457216 449576 442834 437090 432548 428878 425460 421975 418404
63288D18404l715l856l658l170l102l889m876n100m568m056l826l412k662k106
$$ 418404 414689 410833 407175 404005 400903 397014 392138 387038 382470 378414 374588 371176 368514 366408
63274C66408j982j696p71J81J67p20j218m58Q80J309L33q93r36K50J388J552J161
$$ 366408 364426 362730 361959 362140 362307 361587 360369 359911 360791 362100 362433 361540 360604 360854 362242 363794 364955
63257C64955J116J572K060K366K563K465J806R87Q48J558K344K579K579K913L466
$$ 364955 366071 367643 369703 372069 374632 377097 378903 379890 380738 382296 384640 387219 389798 392711 396177
63242C96177L674L498L577M438N837P076P785Q242Q948J0053J1355J2699J4066
$$ 396177 399851 403349 406926 411364 417201 424277 432062 440304 449252 459305 470660 483359 497425
63229D97425J5252J5899J6057J6328J7100J7916J8106J7738J7500J7796J8397
$$ 497425 512677 528576 544633 560961 578061 595977 614083 631821 649321 667117 685514
63218F85514J8908J9065J8711J7951J7267J7058J7077J6822J6292J5808J5200
$$ 685514 704422 723487 742198 760149 777416 794474 811551 828373 844665 860473 875673
63207H75673J3860J1657R162O793M317J321k280o348j0586j4335j6855j8100j8807
$$ 875673 889533 901190 910352 917145 921462 922783 920503 914155 903569 889234 872379 854279 835472
63194H35472j9610k0368k0521j9712j7995j5739j3474j1370q913n573j765J463
$$ 835472 815862 795494 774973 755261 737266 721527 708053 696683 687770 682197 680432 681895
63182F81895L762N782P983R995J1511J3030J5068J7215J8661J9257J9466J9516
$$ 681895 685657 691439 699422 709417 720928 733958 749026 766241 784902 804159 823625 843141
63170H43141J9240J8590J7806J7097J6493J5979J5444J4577J3035J0657P508L885
$$ 843141 862381 880971 898777 915874 932367 948346 963790 978367 991402 1002059 1009567 1013452
63158A013452K93k956o240j0238j4879j9144k2174k4101k5533k6734k7724k8656
$$ 1013452 1013745 1010789 1004549 994311 979432 960288 938114 914013 888480 861746 834022 805366
63146H05366k9494k9620k8387k5904k2904k0008j7563j5871j4935j4149j2785
$$ 805366 775872 746252 717865 691961 669057 649049 631486 615615 600680 586531 573746
63135E73746j0877r116p874o741n176l199j348j45K68J66N4K91Q38J415J884K425
$$ 573746 562869 553753 545879 539138 533962 530763 529415 529270 529538 529704 529758 530049 530887 532302 534186 536611
63119E36611L280M374N279N667N780O165O821O987O144M867M103L887L559L053
$$ 536611 539891 544265 549544 555211 560991 567156 573977 580964 587108 591975 596078 599965 603524 606577
63105F06577K943L153K742J448L42K46M47j20j154j571j245r66r71p14j00K35
$$ 606577 609520 612673 615415 616863 617205 617451 617898 617778 616624 615053 613808 612842 611871 611157 611057 611292
63089F11292Q7J46Q82J798K194K043J737J490J424J697K125K100J384O03N32J117
$$ 611292 611379 611525 612407 614205 616399 618442 620179 621669 623093 624790 626915 629015 630399 631002 631534 632651
63073F32651J718K052K354K734K986L113L495M205M642M339L877M395O101P944
$$ 632651 634369 636421 638775 641509 644495 647608 651103 655308 659950 664289 668166 672561 678662 686606
63059F86606R047R912J1648J4288J6740J8354J9759K1836K4532K7202K9596L1885
$$ 686606 695653 705565 717213 731501 748241 766595 786354 808190 832722 859924 889520 921405
63047I21405L4095L6097L8017M0088M2082M3474M4167M4592M5041M5277M4999
$$ 921405 955500 991597 1029614 1069702 1111784 1155258 1199425 1244017 1289058 1334335 1379334
63036A379334M4376M3893M3840M4047M4038M3365M1913L9850L7323L4257L0627
$$ 1379334 1423710 1467603 1511443 1555490 1599528 1642893 1684806 1724656 1761979 1796236 1826863
63025A826863K6674K2603J8140J2691N956j817j0124j8494k6458l3580l9622m4565
$$ 1826863 1853537 1876140 1894280 1906971 1912927 1911110 1900986 1882492 1856034 1822454 1782832 1738267
63013A738267m8393n0988n2227n2123n0775m8355m5111m1195l6494l0833k4459
$$ 1738267 1689874 1638886 1586659 1534536 1483761 1435406 1390295 1349100 1312606 1281773 1257314
63002A257314j8104j2406p264k020L684R389J4345J8347K1844K5208K8275L0704
$$ 1257314 1239210 1226804 1219540 1217520 1221204 1230593 1244938 1263285 1285129 1310337 1338612 1369316
62990A369316L2413L3452L3747L3407L2973L2875L2790L2054L0625K8983K7049
$$ 1369316 1401729 1435181 1468928 1502335 1535308 1568183 1600973 1633027 1663652 1692635 1719684
62979A719684K3988J9356J3838Q393L058k901r958j7810k5690l2864l8941m3966
$$ 1719684 1743672 1763028 1776866 1785259 1788317 1785416 1775458 1757648 1731958 1699094 1660153 1616187
62967A616187m8139n1383n3414n4195n4012n3039n1295m9120m7076m5147m2669
$$ 1616187 1568048 1516665 1463251 1409056 1355044 1302005 1250710 1201590 1154514 1109367 1066698
62956A066698l9382l6007l3353l1392k9704k8226k6991k5643k3878k2051k0652
$$ 1066698 1027316 991309 957956 926564 896860 868634 841643 816000 792122 770071 749419
62945G49419j9536j8321j7157j6377j5695j4595j3349j2713j2651j2202j0773
$$ 749419 729883 711562 694405 678028 662333 647738 634389 621676 609025 596823 586050
62934E86050q828p184o279o207o787p331p030n813m413l417k794k462k586l001
$$ 586050 577222 570038 563759 557552 550765 543434 536404 530591 526178 522761 519967 517505 514919 511918
62920E11918l004k218j249r57j362j713j460q06l17l07o06p53n36l00o28j619
$$ 511918 508914 506696 505447 504490 503128 501415 499955 499149 498832 498525 497919 497166 496630 496330 495702 494083
62904D94083k715l280l173k706k209j701q72N21K093K879K335J184P74J543K590
$$ 494083 491368 488088 484915 482209 480000 478299 477427 477948 480041 482920 485255 486439 487213 488756 491346
62889D91346K842K141J023k2p00p79k71M14Q58J040J137J132Q73L53k60p69r10
$$ 491346 494188 496329 497352 497330 496630 495851 495580 495994 496852 497892 499029 500161 501034 501387 501127 500358 499448
62872D99448m58L60P74J68j168k319k769k764k686k515k114j743j836k345k690
$$ 499448 498990 499350 500124 500292 499124 496805 494036 491272 488586 486071 483957 482214 480378 478033 475343
62857D75343k447j801j198q05n93p23j405k327k669j923n13O19R06N63J87J84
$$ 475343 472896 471095 469897 469092 468499 467776 466371 464044 461375 459452 458939 459558 460464 461027 461214 461398
62841D61398M60O27N35N22Q92J281R56j79j374j955k037k029j975j775j555j317
$$ 461398 461858 462485 463020 463542 464434 465715 466671 466492 465118 463163 461126 459097 457122 455347 453792 452475
62825D52475n79R41K557L171K551J563J171J686K805L831L948K946J680J277J816
$$ 452475 451896 452837 455394 458565 461116 462679 463850 465536 468341 472172 476120 479066 480746 482023 483839
62810D83839K386K448K419K759L204L275L009K759K669K801L413M626N996O816
$$ 483839 486225 488673 491092 493851 497055 500330 503339 506098 508767 511568 514981 519607 525603 532419
62796E32419O884O671O768P297P898Q224Q421R086J0571J2537J4371J5946J7671
$$ 532419 539303 545974 552742 560039 567937 576161 584582 593668 604239 616776 631147 647093 664764
62783F64764J9843K2400K5282K8559L2056L5371L8484M1969M6201N0650N4392
$$ 664764 684607 707007 732289 760848 792904 828275 866759 908728 954929 1005579 1059971
62772A059971N7155N9456O1683O3426O3896O2836O0703N7955N4368M9299M2544
$$ 1059971 1117126 1176582 1238265 1301691 1365587 1428423 1489126 1547081 1601449 1650748 1693292
62761A693292L4502K5547J5694N197n094j4584k3730l3269m2753n0660n6066n9545
$$ 1693292 1727794 1753341 1769035 1774232 1769138 1754554 1730824 1697555 1654802 1604142 1548076 1488531
62749A488531o2096o3894o4483o3703o1866n9308n6278n3113n0066m6966m3399
$$ 1488531 1426435 1362541 1298058 1234355 1172489 1113181 1056903 1003790 953724 906758 863359
62738H63359l9291l5108l1450k8515k6006k3432k0582j7732j5356j3594j2091
$$ 863359 824068 788960 757510 728995 702989 679557 658975 641243 625887 612293 600202
62727F00202j0433q626p137o426o425o477n812m184k032m5J312J949K124K411
$$ 600202 589769 581143 574006 567580 561155 554678 548866 544682 542650 542605 543917 545866 547990 550401
62713E50401L332M837O383P677Q993J0515J1886J2789J3695J5394J8053K1192
$$ 550401 553733 558570 564953 572630 581623 592138 604024 616813 630508 645902 663955 685147
62701F85147K4345K7259K9716L1838L4306L7584M1144M4183M6920N0253N4172
$$ 685147 709492 736751 766467 798305 832611 870195 911339 955522 1002442 1052695 1106867
62690A106867N7582N9871O1620O3356O4529O4245O2197N8317N2268M4035L4451
$$ 1106867 1164449 1224320 1285940 1349296 1413825 1478070 1540267 1598584 1650852 1694887 1729338
62679A729338K4462J4196L391p704j8484k8716l8415m7221n4552o0254o4524o7275
$$ 1729338 1753800 1767996 1771387 1763683 1745199 1716483 1678068 1630847 1576295 1516041 1451517 1384242
62667A384242o8192o7372o5434o2908n9955n6656n3188m9549m5499m0986l6412
$$ 1384242 1316050 1248678 1183244 1120336 1060381 1003725 950537 900988 855489 814503 778091
62656G78091l2314k8888k6035k3647k1683j9893j7810j5277j2912j1587j1310
$$ 778091 745777 716889 690854 667207 645524 625631 607821 592544 579632 568045 556735
62645E56735j1079j0141q900q106p611o704n363m256l533k633j480q32j024j292
$$ 556735 545656 535515 526615 518509 510898 504194 498831 494575 491042 488409 486929 486097 485073 483781
62631D83781r36l48k32n08p71j168j902k383j914r98r27k027l215l440k812k006
$$ 483781 482845 482497 482265 481757 480986 479818 477916 475533 473619 472621 471694 469667 466452 463012 460200 458194
62615D58194j249l27Q14J866K445K390J946J693K068K917L700M155M527N086N757
$$ 458194 456945 456618 457432 459298 461743 464133 466079 467772 469840 472757 476457 480612 485139 490225 495982
62600D95982O339O922P870R355J1087J2562J3699J5024J7102J9766K2272K4132
$$ 495982 502321 509243 517113 526468 537555 550117 563816 578840 595942 615708 637980 662112
62588F62112K5501K6689K7788K8928L0330L1696L1967L0345K7300K4016K0911
$$ 662112 687613 714302 742090 771018 801348 833044 865011 895356 922656 946672 967583
62577I67583J7259J2304O272N4n700j0935j5824k0302k3993k6577k8163k9144
$$ 967583 984842 997146 1003418 1003472 997772 986837 971013 950711 926718 900141 871978 842834
62565H42834k9706k9699k9174k8596k8255k7696k6189k3674k0795j8113j5722
$$ 842834 813128 783429 754255 725659 697404 669708 643519 619845 599050 580937 565215
62554E65215j3646j2037j0814r543q035o731o123n957n436m226k856k014j786
$$ 565215 551569 539532 528718 519175 511140 504409 498286 492329 486893 482667 479811 477797 476011
62541D76011j777j756j756j690j258l95M99R46Q63N09J88R4K39M04M35O86J747
$$ 476011 474234 472478 470722 469032 467774 467379 467878 468824 469687 470196 470384 470478 470717 471121 471556 472242 473989
62524D73989L477M863N284N449O454Q274R950J1130J2541J4850J7782K0530K2512
$$ 473989 477466 482329 487613 493062 499516 507790 517740 528870 541411 556261 574043 594573 617085
62511F17085K3677K4547K6059K8746L2068L5021L7299L9157M0338M0172L8771
$$ 617085 640762 665309 691368 720114 752182 787203 824502 863659 903997 944169 982940
62500I82940L7049L5286L2699K8869K4449J9947J4885Q992L222j267m450o777
$$ 982940 1019989 1055275 1087974 1116843 1141292 1161239 1176124 1185116 1188338 1187071 1182621 1175844
62488A175844p984p673o446n231l795j124K883P144J0816J4043J7196K0199K2545
$$ 1175844 1167860 1160187 1153741 1148510 1144715 1143591 1146474 1153618 1164434 1178477 1195673 1215872 1238417
62475A238417K3357K1520J6604R724K786l224q671j4232k0280k7165l5001m2853
$$ 1238417 1261774 1283294 1299898 1309622 1312408 1309184 1300513 1286281 1266001 1238836 1203835 1160982
62463A160982m8970n2304n3293n2980n1973n0459m8499m5812m1862l6666l1175
$$ 1160982 1112012 1059708 1006415 953435 901462 851003 802504 756692 714830 678164 646989
62452F46989k6426k2650j9456j6560j3945j1577r471p802o639n633m316k682j171
$$ 646989 620563 597913 578457 561897 547952 536375 526904 519102 512463 506830 502514 499832 498661
62439D98661q8P17J522K292K744K774K618K524K432K160J747J343Q35j04j446
$$ 498661 498573 499290 500812 503104 505848 508622 511240 513764 516196 518356 520103 521446 522281 522177 520731
62424E20731k704l468l855m271m954n867o655o753n911m733m200m496m846m704
$$ 520731 518027 514559 510704 506433 501479 495612 488957 482204 476293 471560 467360 462864 458018 453314
62410D53314m435m367l970k706j159m24n78o82j40O06Q67N20k7k79P7R46J849
$$ 453314 448879 444512 440542 437836 436677 436253 435675 434993 434853 435459 436326 436846 436819 436540 436617 437563 439412
62393D39412K377K537K525K429K392K673L177L376L114L023L555M202M389M627
$$ 439412 441789 444326 446851 449280 451672 454345 457522 460898 464012 467035 470590 474792 479181 483808
62379D83808N747P365Q183P811P164O982P057P150P650Q756R806J0058R676R423
$$ 483808 489555 496920 505103 512914 520078 527060 534117 541267 548917 557673 567479 577537 587213 596636
62365E96636R776J0714J2111J3899J6070J8708K1975K5879L0212L4650L8958M3111
$$ 596636 606412 617126 629237 643136 659206 677914 699889 725768 755980 790630 829588 872699
62353H72699M7406N2122N6861O0600O2738O3701O3960O2962N9795N4564M8124
$$ 872699 920105 972227 1029088 1089688 1152426 1216127 1280087 1343049 1402844 1457408 1505532
62342A505532M0668L1662K1236J0668J093p406j5180k2253k8588l4387l9596m3665
$$ 1505532 1546200 1577862 1599098 1609766 1610859 1603453 1588273 1566020 1537432 1503045 1463449 1419784
62330A419784m6211m7576m8372m8756m8447m7139m4724m1459l8031l5157l3031
$$ 1419784 1373573 1325997 1277625 1228869 1180422 1133283 1088559 1047100 1009069 973912 940881
62319I40881l1397l0061k8948k7803k6408k5012k3929k2842k1200j9201j7577
$$ 940881 909484 879423 850475 822672 796264 771252 747323 724481 703281 684080 666503
62308F66503j6420j5147j3698j2721j2254j1300r292p025n526m653l598k147p89
$$ 666503 650083 634936 621238 608517 596263 584963 575671 568646 563120 558467 554869 552722 551933
62295E51933K7J90j40m27m4R36J679J761J780K313K881K713K012J671J992K495
$$ 551933 551960 552150 552010 551583 551539 552475 554154 555915 557695 560008 562889 565602 567614 569285 571277 573772
62279E73772K815L051L183K928K311J907K190L002L738M037M128M572N654P142
$$ 573772 576587 579638 582821 585749 588060 589967 592157 595159 598897 602934 607062 611634 617288 624430
62265F24430Q711J0477J2715J5183J7209J8618K0138K2635K6284L0708L5518M0495
$$ 624430 633141 643618 656333 671516 688725 707343 727481 750116 776400 807108 842626 883121
62253H83121M5536N0591N5456N9522O2170O3483O4073O4010O2463N8635N2590
$$ 883121 928657 979248 1034704 1094226 1156396 1219879 1283952 1347962 1410425 1469060 1521650
62242A521650M4817L5567K5013J3715K399q437j8497k7502l5390m2299m8162n2674
$$ 1521650 1566467 1602034 1627047 1640762 1643161 1634724 1616227 1588725 1553335 1511036 1462874 1410200
62230A410200n5895n8351o0232o0926n9780n6935n3084m8735m4169l9715l5646
$$ 1410200 1354305 1295954 1235722 1174796 1115016 1058081 1004997 956262 912093 872378 836732
62219H36732l1980k8663k5649k2647j9223j5496j2274j0107q660p315n915m492
$$ 836732 804752 776089 750440 727793 708570 693074 680800 670693 662033 654718 648803 644311
62207F44311k832q91P83J688K152K950M327N897P291Q427R314J0003J0619J1061
$$ 644311 641479 640588 641371 643059 645211 648161 652488 658385 665676 674103 683417 693420 704039 715100
62193G15100J0917R994Q711P669P031O637O311N797M765L297K078J710K126K903
$$ 715100 726017 736011 744722 752391 759422 766059 772370 778167 782932 786229 788307 790017 792143 795046
62179G95046L794M561M825M470L887L415K979K544K447K834L444M406O576J0282
$$ 795046 798840 803401 808226 812696 816583 819998 822977 825521 827968 830802 834246 838652 845228 855510
62165H55510J4479J8064K1526K6204L2196L8062M2517M5396M6925M7049M5802
$$ 855510 869989 888053 909579 935783 967979 1006041 1048558 1093954 1140879 1187928 1233730
62154A233730M3524M0369L6073L0469K3789J6340Q317P8p752j4701k0723k6062
$$ 1233730 1277254 1317623 1353696 1384165 1407954 1424294 1432611 1432689 1424937 1410236 1389513 1363451
62142A363451l0971l5439l9070m1378m2414m2708m2367m0772l7644l3867l0554
$$ 1363451 1332480 1297041 1257971 1216593 1174179 1131471 1089104 1048332 1010688 976821 946267
62131I46267k7699k4434k0476j6547j3499j1606j0601r807q496o620m915l742
$$ 946267 918568 894134 873658 857111 843612 832006 821405 811598 803102 796482 791567 787825
62119G87825k373k56J712K344K267L300N713P626P547O142M875M122L569L413
$$ 787825 785452 785196 786908 789252 791519 794819 800532 808158 815705 821847 826722 830844 834413 837826
62105H37826M034N003N497N412N232M975M090K414N18r54j831k152j839q36O40
$$ 837826 841860 846863 852360 857772 863004 867979 872069 874483 875001 874047 872216 870064 868225 867389 868029
62090H68029K175L393L998L742K570R09l42l76Q48K624M263N610O805P949R255
$$ 868029 870204 873597 877595 881337 883907 884816 884474 884098 884946 887570 891833 897443 904248 912197 921452
62075I21452J1113J3577J6153J8453K0753K3281K5384K6199K5951K5712K5936
$$ 921452 932565 946142 962295 980748 1001501 1024782 1050166 1076365 1102316 1128028 1153964
62064A153964K6043K5621K5167K5317K6088K7179K8416K9540L0099K9950K9341
$$ 1153964 1180007 1205628 1230795 1256112 1282200 1309379 1337795 1367335 1397434 1427384 1456725
62053A456725K8242K6182K3057J9423J5487J0497L861l628j0530j6391k1881k7463
$$ 1456725 1484967 1511149 1534206 1553629 1569116 1579613 1583474 1579846 1569316 1552925 1531044 1503581
62041A503581l2723l7126m0819m4338m7886n0997n2799n2653n0847m8494m6401
$$ 1503581 1470858 1433732 1392913 1348575 1300689 1249692 1196893 1144240 1093393 1044899 998498
62030I98498m4170m0913l6726l2730k9619k6855k3687k0330j7567j5563j3856
$$ 998498 954328 913415 876689 843959 814340 787485 763798 743468 725901 710338 696482
62019F96482j2288j1265j0996j1079j1074j0952j0768j0351r677r101q791q295
$$ 696482 684194 672929 661933 650854 639780 628828 618060 607709 598032 588931 580140 571845
62007E71845p169n782m904m613m225l235j757o0J694L161L886L921L822L804L473
$$ 571845 564676 558894 553990 549377 545152 541917 540160 540100 541794 544955 548841 552762 556584 560388 563861
61992E63861K650J882J689J730J224p3j736l225m257m868n434o380p619q569q918
$$ 563861 566511 568393 570082 571812 573036 572963 571227 568002 563745 558877 553443 547063 539444 530875 521957
61977E21957q950q940q682p994p145o366n409m072k759j900j305n62K37Q32J399
$$ 521957 513007 504067 495385 487391 480246 473880 468471 464399 461640 459740 458435 457873 458110 458942 460341
61962D60341K225L066L519L780M289M888M980M473L856L510L399L394L401L399
$$ 460341 462566 465632 469151 472931 477220 482108 487088 491561 495417 498927 502326 505720 509121 512520
61948E12520L672M696O324P603Q006Q276R302J0714J1596J2067J3011J4596J6247
$$ 512520 516192 520888 527212 534815 542821 551097 560399 571113 582709 594776 607787 622383 638630
61935F38630J7896J9956K2052K3176K3215K3124K3293K2969K1712K0175J8942
$$ 638630 656526 676482 698534 721710 744925 768049 791342 814311 836023 856198 875140
61924H75140J7606J5628J3177J0518P413L874P00j458l007m779o886q720r635
$$ 875140 892746 908374 921551 932069 939482 943356 944056 942598 939591 934812 927926 919206 909571
61911I09571r211p349m562j728Q13L475O529R592J2226J4420J6094J6839J6522
$$ 909571 900360 893011 888449 886721 887534 891009 897538 907130 919356 933776 949870 966709 983231
61898I83231J5520J3879J1004O710J838k741p125j1647j5795j8642k0003k0534
$$ 983231 998751 1012630 1023634 1030344 1032182 1029441 1022316 1010669 994874 976232 956229 935695
61886I35695k0888k1335k1874k2145k1661k0531j9570j9210j8789j7513j5648
$$ 935695 914807 893472 871598 849453 827792 807261 787691 768481 749692 732179 716531
61875G16531j4126j3353j3045j2855j2455j1439r806q370p854p783o970m920k220
$$ 716531 702405 689052 676007 663152 650697 639258 629452 621082 613228 605445 598475 593555 591335
61862E91335L54K454L984N023N986P345R162J1194J3379J5762J8141K0271K2369
$$ 591335 591689 594143 598127 603150 609136 616481 625643 636837 650216 665978 684119 704390 726759
61849G26759K4959K8211L1774L5151L7924L9793M0771M1097M0721L9086L5926
$$ 726759 751718 779929 811703 846854 884778 924571 965342 1006439 1047160 1086246 1122172
61838A122172L1921K8065K4522K0618J5771R944L479k949q253j1488j2558j2056
$$ 1122172 1154093 1182158 1206680 1227298 1243069 1253013 1256492 1253543 1245290 1233802 1221244 1209188
61826A209188j0515q141n051j280L251Q226J2637J5524J6862J7183J6472J4092
$$ 1209188 1198673 1190532 1185481 1184201 1187452 1195678 1208315 1223839 1240701 1257884 1274356 1288448
61814A288448R741L840k963j0033j6592k2064k6670l1023l5048l7989l9522m0100
$$ 1288448 1298189 1302029 1299066 1289033 1272441 1250377 1223707 1192684 1157636 1119647 1080125 1040025
61802A040025l9969l8722l6242l3381l1052k9136k6870k4053k1221j8911j7171
$$ 1040025 1000056 961334 925092 891711 860659 831523 804653 780600 759379 740468 723297
61791G23297j5785j4467j2921j1060r181p705o669n720m643l677l218l311l507
$$ 723297 707512 693045 680124 669064 659883 652178 645509 639789 635146 631469 628251 624940 621433
61778F21433l332k850k625k978l482l408k622j720j319j483j858k058j798j005
$$ 621433 618101 615251 612626 609648 606166 602758 600136 598416 597097 595614 593756 591698 589900 588895
61764E88895p9L23n1o73q04k63N29J120J349J223Q58N40N99J040J465J506J214
$$ 588895 588816 589139 589088 588415 587611 587348 587877 588997 590346 591569 592427 592967 593566 594606 596071 597577 598791
61747E98791Q58M67k31j261k106k128j346n05l71r99j816k230k044j432p45k91
$$ 598791 599649 600116 599885 598624 596518 594390 593044 592539 592168 591169 589353 587123 585079 583647 582902 582611
61731E82611j19K8L98R05J225J249J238J428J686J746J627J638J932K346K692
$$ 582611 582492 582520 582918 583823 585048 586297 587535 588963 590649 592395 594022 595660 597592 599938 602630
61716F02630L008L357L610L630L514L402L139K458J427M21m42j436k664l744m302
$$ 602630 605638 608995 612605 616235 619749 623151 626290 628748 630175 630596 630154 628718 626054 622310 618008
61701F18008m458m499m327l674k756k244k484l050l194k613j729j280j564k118
$$ 618008 613550 609051 604724 601050 598294 596050 593566 590516 587322 584709 582980 581700 580136 578018
61687E78018k279k033k019k562l108k947k158j445j287j619k131k501k549k484
$$ 578018 575739 573706 571687 569125 566017 563070 560912 559467 558180 556561 554430 551929 549380 546896
61673E46896k747l305l443k819k179k434l339l913l855l660l484k992k286j959
$$ 546896 544149 540844 537401 534582 532403 529969 526630 522717 518862 515202 511718 508726 506440 504481
61659E04481k038j871j268q24p75n70K0L77K11K81J212K334K558J841J010O66
$$ 504481 502443 500572 499304 498480 497705 497135 497155 497532 497743 498024 499236 501570 504128 505969 506979 507645
61643E07645R82K080L734N014N076M188L319K891K585K116J526P56l63j620k461
$$ 507645 508627 510707 514441 519455 524531 528719 532038 534929 537514 539630 541156 541912 541549 539929 537468
61628E37468k625k420k418l012m080m851m454l003j756j722k508l049l095l119
$$ 537468 534843 532423 530005 526993 522913 518062 513608 510605 508849 507127 504619 501570 498475 495356
61614D95356l054k202n76N65Q8j640l269m035m336m878n720o358o456o201n950
$$ 495356 492302 490100 489524 490089 490177 488537 485268 481233 476897 472019 466299 459941 453485 447284 441334
61599D41334n791n577n239m828m379l916l480k987k328j819k137l353m388m158
$$ 441334 435543 429966 424727 419899 415520 411604 408124 405137 402809 400990 398853 395500 391112 386954
61585C86954k978k053j749j471j137j498k622l312k708j525q92q19o30k25j5j19
$$ 386954 383976 381923 380174 378703 377566 376068 373446 370134 367426 365901 365009 364190 363560 363335 363320 363201
61569C63201m11r58j695k085j817j363j227j134o72j47j1L0M33Q37O85L65O87
$$ 363201 362790 361832 360137 358052 356235 354872 353645 352511 351839 351692 351681 351711 352144 352981 353666 354031 354718
61552C54718J451J629R03N1j89J59P44J264J370R49M98N78R88J169J273J954L138
$$ 354718 356169 357798 358701 358752 358563 358722 359466 360730 362100 363049 363547 364125 365113 366282 367555 369509 372647
61535C72647L804L263J980R88Q69J427J978J969J622J690K255K291J051o85j549
$$ 372647 376451 379714 381694 382682 383551 384978 386956 388925 390547 392237 394492 396783 397834 397149 395600
61520C95600j390j159j289j329j060r25j154j375j274r48n14m2J74r5n28p04q78
$$ 395600 394210 393051 391762 390433 389373 388448 387294 385919 384645 383697 383183 383141 383315 383220 382692 381988 381110
61503C81110j524k308k464k006j580j256n75K77M92l6n25o33q16j173j078m15
$$ 381110 379586 377278 374814 372808 371228 369972 369397 369674 370166 370130 369605 368972 368156 366983 365905 365490
61487C65490M6m8k9N21R33N95%j26M5k7k08L1P37J532K136K338J863Q61J56M63
$$ 365490 365536 365488 365459 365980 366913 367508 367508 367382 367427 367400 367192 367223 367960 369492 371628 373966 375829 376690 376846 377309
61467C77309J518K358K285J399M45K24P97J294R78L72N73J514J899J054j72p78
$$ 377309 378827 381185 383470 384869 385314 385538 386335 387629 388607 388979 389552 391066 392965 394019 393847 393069
61451C93069q25q06p10l98j07P0N02J178J336O90K60J066K577L432L273K873K779
$$ 393069 392244 391438 390728 390330 390223 390293 390795 391973 393309 393999 394259 395325 397902 401334 404607 407480 410259
61434D10259K800K828L162L890M540M587L965L035K316K170K447K514J929J006
$$ 410259 413059 415887 419049 422939 427479 432066 436031 439066 441382 443552 445999 448513 450442 451448
61420D51448M99Q84K007L266L954L782L210K948L044K861K032R52J60k68m57m87
$$ 451448 451947 452831 454838 458104 462058 465840 469050 471998 475042 477903 479935 480887 481047 480779 480322 479835
61404D79835o43j340k439l167l129k812k774k855k670k215j631r01l24n29j429
$$ 479835 479192 477852 475413 472246 469117 466305 463531 460676 458006 455791 454160 453259 452935 452406 450977
61389D50977j877j110Q5M85J30r5m3l10q36o86N31J985K704K571K048J510J193
$$ 450977 449100 447990 448075 448560 448690 448595 448552 448242 447406 446720 447251 449236 451940 454511 456559 458069 459262
61372D59262J263J605J767J451Q21K40o9j1M38J102J604J715J627J720K075K355
$$ 459262 460525 462130 463897 465348 466169 466409 466340 466329 466767 467869 469473 471188 472815 474535 476610 478965
61356D78965K266K064K330L179L965M106L889M077M992O395Q103J0036J1773J2822
$$ 478965 481231 483295 485625 488804 492769 496875 500764 504841 509833 516228 524331 534367 546140 558962
61342E58962J3283J3557J3376J2056R840P927O850N851M398L247L112L201K183
$$ 558962 572245 585802 599178 611234 621074 629001 635851 641702 646100 649347 652459 655660 657843
61329F57843O0j995l260l930m210m046l749l913m540m970m781m195l492k552j287
$$ 657843 657903 655908 652648 648718 644508 640462 636713 632800 628260 623290 618509 614314 610822 608270 606983
61314F06983m4O47O50M02O00J606L044M149M539M511M550N017O279Q579J1413
$$ 606983 606939 607586 608236 608638 609238 610844 613888 618037 622576 627087 631637 636654 642933 651512 662925
61299F62925J3617J4532J4583J4324J3430J1210P707L726%l136n563p366q792
$$ 662925 676542 691074 705657 719981 733411 744621 752328 756054 756054 752918 747355 739989 731197
61286G31197r837j0213r965r643r428q742p281n858n376n448m911l407j644k78
$$ 731197 721360 711147 701182 691539 682111 673369 666088 660230 654854 649406 644495 641088 639444 639166
61272F39166O40J186J354J378J670K300L000L554L928M175M587N561O882P600
$$ 639166 639806 640992 642346 643724 645394 647694 650694 654248 658176 662351 666938 672499 679381 686981
61258F86981P281O910P801R972J2350J4211J5546J6229J5808J4084J1174P251
$$ 686981 694262 701172 708973 718945 731295 745506 761052 777281 793089 807173 818347 825598
61246H25598K923n09k235l198m972p554r432r907r901j0148j0036q988p779p327
$$ 825598 828521 828012 825777 822579 817607 810053 800621 790714 780813 770665 760629 751641 743862 736535
61232G36535p060n663l025m25J092J587J530J184R52J613L591O218Q226Q966Q891
$$ 736535 729475 723812 720787 720362 721454 723041 724571 725755 726707 728320 731911 738129 746355 755321 764212
61217G64212Q758Q674Q155O915N218L566K403K090K624L345L432K917K572K602
$$ 764212 772970 781644 789799 796714 801932 805498 807901 809991 812615 815960 819392 822309 824881 827483
61203H27483K157N89j406k515k195p49J340L508N051N929P297J0197J4004J7014
$$ 827483 829640 830229 828823 826308 824113 823364 824704 828212 833263 839192 846489 856686 870690 887704
61189H87704J8559J9616K1257K3325K4718K4328K1699J7471J3138R836P372N107
$$ 887704 906263 925879 947136 970461 995179 1019507 1041206 1058677 1071815 1081651 1089023 1094130
61177A094130L349K886L284K924R90j650l931n887p963r941j1367j2452j3746
$$ 1094130 1097479 1100365 1103649 1106573 1107563 1105913 1101982 1096095 1088132 1078191 1066824 1054372 1040626
61164A040626j5260j6531j7395j8165j9088k0014k0559k0543k0189j9937j9829
$$ 1040626 1025366 1008835 991440 973275 954187 934173 913614 893071 872882 852945 833116
61153H33116j9306j7814j5520j3025j0592q134n764l796k183n99R88K301L210
$$ 833116 813810 795996 780476 767451 756859 748725 742961 739165 736982 736383 737371 739672 742882
61140G42882L587K901P65k135m505n928o989p839p699o200m253k871j820j68K315
$$ 742882 746469 749370 750135 748000 743495 737567 730578 722739 715040 708840 704587 701716 699896 699728 702043
61125G02043N056P603J0028J2510J5021J7415J9511K1236K2804K4576K6589K8520
$$ 702043 707099 714702 724730 737240 752261 769676 789187 810423 833227 857803 884392 912912
61113I12912L0221L1827L3199L3702L2960L1511L0304K9665K9108K8030K6308
$$ 912912 943133 974960 1008159 1041861 1074821 1106332 1136636 1166301 1195409 1223439 1249747
61102A249747K4152K1681J8773J5462J2239R607P275M142n43o374j2367j7955
$$ 1249747 1273899 1295580 1314353 1329815 1342054 1351661 1358936 1363078 1362535 1356161 1343794 1325839
61090A325839k2941k7004k9995l2349l4516l6079l6267l5174l3673l2255l0751
$$ 1325839 1302898 1275894 1245899 1213550 1179034 1142955 1106688 1071514 1037841 1005586 974835
61079I74835k9137k7692k6287k4457k2272k0257j8396j6151j3648j1765j0717
$$ 974835 945698 918006 891719 867262 844990 824733 806337 790186 776538 764773 754056
61068G54056r585p689n564l985k896j854q85k37J41M43P93J516L007M986O613
$$ 754056 744471 736782 731218 727233 724337 722483 721598 721361 721502 721945 722738 724254 727261 732247 738860
61053G38860P634Q704J0186J1499J2158J2606J3439J4560J5797J7548K0042K2641
$$ 738860 746494 755198 765384 776883 789041 801647 815086 829646 845443 862991 883033 905674
61041I05674K4686K6407K8177K9522K9850K9715L0326L1894L3438L4124L4102
$$ 905674 930360 956767 984944 1014466 1044316 1074031 1104357 1136251 1169689 1203813 1237915
61030A237915L3947L3913L3897L3780L3653L3784L4260L4737L4934L5286L6459
$$ 1237915 1271862 1305775 1339672 1373452 1407105 1440889 1475149 1509886 1544820 1580106 1616565
61019A616565L8230L9755M1030M3061M6305N0175N4581O0527O8166P5706Q1638
$$ 1616565 1654795 1694550 1735580 1778641 1824946 1875121 1929702 1990229 2058395 2134101 2215739
61008B215739Q7115R4625J05197J18590J35556J57891J86469K21201K63030L14303
$$ 2215739 2302854 2397479 2502676 2621266 2756822 2914713 3101182 3322383 3585413 3899716
60998C899716L77111M53462N47876O67293Q15472R85982J159683J308410J404109
$$ 3899716 4276827 4730289 5278165 5945458 6760930 7746912 8906595 10215005 11619114
60989A1619114J431772J400300J341607J295485J291954J344980J454987J604339
$$ 11619114 13050886 14451186 15792793 17088278 18380232 19725212 21180199 22784538
60981B2784538J742470J783521J639662J276605P44622J54719l77763p73300r93662
$$ 22784538 24527008 26310529 27950191 29226796 29971418 30126137 29748374 28975074 27981412
60972B7981412j037147r45697q08201p32555p94001j000117j297796j607120j852840
$$ 27981412 26944265 25998568 25190367 24457812 23663811 22663694 21365898 19758778 17905938
60963A7905938j982906j978875j857944j661325j433696j208064j003265q27898
$$ 17905938 15923032 13944157 12086213 10424888 8991192 7783128 6779863 5951965
60955E951965o83230n65228m68207l88257l23376k71545k30026j96324j68889
$$ 5951965 5268735 4703507 4235300 3847043 3523667 3252122 3022096 2825772 2656883
60946B656883j46815j29415j15999j05626r7113q9529q2542p6122p0176o4726
$$ 2656883 2510068 2380653 2264654 2159028 2061915 1972386 1889844 1813722 1743546 1678820
60936A678820o0101n6497n3550n0787m8318m6575m5403m4012m1900l9337l6667
$$ 1678820 1618719 1562222 1508672 1457885 1409567 1362992 1317589 1273577 1231677 1192340 1155673
60925A155673l3664l0072k6462k3888k2619k1819k0593j8969j7410j5834j3654
$$ 1155673 1122009 1091937 1065475 1041587 1018968 997149 976556 957587 940177 924343 910689
60914I10689j0820q153o414n381m249k781j455n07O72K728N338P494Q716R437
$$ 910689 899869 891716 885302 879921 875672 872891 871436 870929 871601 874329 879667 887161 895877 905314
60900I05314J0179J0936J1578J2241J2920J3155J2733J2327J2740J3682J4136
$$ 905314 915493 926429 938007 950248 963168 976323 989056 1001383 1014123 1027805 1041941
60889A041941J3892J3905J4807J5932J6368J6340J6793J7875J8664J8397J7375
$$ 1041941 1055833 1069738 1084545 1100477 1116845 1133185 1149978 1167853 1186517 1204914 1222289
60878A222289J6417J5838J5212J3842J1343P886M023K75l224o563r642j2120j3831
$$ 1222289 1238706 1254544 1269756 1283598 1294941 1302827 1306850 1307125 1303901 1297338 1287696 1275576 1261745
60865A261745j5150j6738j8921k1310k3071k3593k2956k1850k1065k0976k1328
$$ 1261745 1246595 1229857 1210936 1189626 1166555 1142962 1120006 1098156 1077091 1056115 1034787
60854A034787k1447k0817j9634j8641j8312j8351j8178j7737j7424j7334j6983
$$ 1034787 1013340 992523 972889 954248 935936 917585 899407 881670 864246 846912 829929
60843H29929j5978j4551j3288j2507j2138j2065j2298j2760j3086j2866j2139
$$ 829929 813951 799400 786112 773605 761467 749402 737104 724344 711258 698392 686253
60832F86253j1572j1764j2415j2510j1518j0046q947q216p276o087n214m848m442
$$ 686253 674681 662917 650502 637992 626474 616428 607481 599265 591989 585902 580688 575840 571398
60819E71398l503k223j128n18m29o85q54n51J09O56R59J278J626J636J211P94
$$ 571398 567895 565672 564544 564026 563597 562912 562058 561507 561616 562272 563231 564509 566135 567771 568982 569776
60803E69776P29Q73J020J238J430J155K66o50r49o83m04m86r66j654k151k152
$$ 569776 570505 571378 572398 573636 575066 576221 576487 575837 574888 574205 573801 573315 572349 570695 568544 566392
60787E66392j920k116k811l270l032k688l010l788m228m133m004m138m374m656
$$ 566392 564472 562356 559545 556275 553243 550555 547545 543757 539529 535396 531392 527254 522880 518224
60773E18224n197n966o513o479n976n352m815m389m090l967m001l895l103j355
$$ 518224 513027 507061 500548 494069 488093 482741 477926 473537 469447 465480 461479 457584 454481 453126
60759D53126P82K180K245J481Q43P87J135J581K037K607L394M246M688M354L550
$$ 453126 453908 456088 458333 459814 460657 461444 462579 464160 466197 468804 472198 476444 481132 485486 489036
60744D89036L000L031L444M096N010N731N316L352N28k137m040m833m278k918
$$ 489036 492036 495067 498511 502607 507617 513348 518664 522016 522544 520407 516367 511534 507256 504338
60730E04338k117k733m136n145n465n539n509n182m767m735n045n199n024m789
$$ 504338 502221 499488 495352 490207 484742 479203 473694 468512 463745 459010 453965 448766 443742 438953
60716D38953m584m199l640l237l138l068k656j839j005q43j700k928l306k454
$$ 438953 434369 430170 426530 423293 420155 417087 414431 412592 411587 410744 409044 406116 402810 400356
60702D00356j317q40p55l31K55K44l43o24j15P64J414J623J358P58L72P95J796
$$ 400356 399039 398199 397444 397113 397368 397612 397269 396645 396530 397294 398708 400331 401689 402447 402819 403614 405410
60685D05410K416K158J590J594K394L515M353M670M674M767N095N466N722O035
$$ 405410 407826 409984 411574 413168 415562 419077 423430 428100 432774 437541 442636 448102 453824 459859
60671D59859O555P058P246P091O655N892M938M253L987L603K578J148j49j297
$$ 459859 466414 473472 480718 487809 494464 500356 505294 509547 513534 517137 519715 520863 520714 519417
60657E19417k521l514l685l048k202j529r98o43o00o95n69j53L73R46J393J075
$$ 519417 516896 513382 509697 506649 504447 502918 501920 501277 500677 499982 499413 499260 499633 500579 501972 503047
60641E03047n26k914m911n886o166o309o461o421n845m533k912j994k263k865
$$ 503047 502521 499607 494696 488810 482644 476335 469874 463453 457608 453075 450163 448169 445906 443041
60627D43041k576j353k03K68L76N28O96P51O60K78m11r13p36j95k1k59l23q9o6
$$ 443041 440465 439112 438909 439177 439553 440081 440777 441528 442188 442466 442055 441142 440406 440211 440190 439931 439608 439519 439453
60608D39453m00o18m78k53rO06J532K103J940J433J017O48K62O4L0k16o32m89
$$ 439453 439053 438435 437957 437704 437695 438301 439833 441936 443876 445309 446326 446974 447236 447300 447330 447114 446482 445993
60590D45993O49K138K921K723K187K060K542L209L451L080K477J980J369M10l75
$$ 445993 446642 448780 451701 454424 456611 458671 461213 464422 467873 470953 473430 475410 476779 477189 476814
60575D76814k40O58J406J693K157L173M224M809N264O106P195Q074Q807R859J1381
$$ 476814 476574 477232 478638 480331 482488 485661 489885 494694 499958 506064 513259 521333 530140 539999 551380
60560E51380J2997J4226J4821J4822J4359J3447J2024J0302Q800P636O093L432
$$ 551380 564377 578603 593424 608246 622605 636052 648076 658378 667178 674814 680907 684339
60548F84339Ql003m894n841o157n908n277m576l733k339l73J792M154P133J0667
$$ 684339 684347 681344 676450 670609 664452 658544 653267 648691 644958 642619 642246 644038 648192 655325 665992
60533F65992J3913J6143J7430J8246J8881J9410J9684J9187J7439J4727J1947
$$ 665992 679905 696048 713478 731724 750605 770015 789699 808886 826325 841052 852999
60522H52999R612P472N110K371p85m185p164r050r951j0390j0239r004p147n956
$$ 852999 862611 870083 875193 877564 876779 872594 865430 856380 846429 836039 825800 816796 809649 803693
60508H03693n739n300l749j812n43L61J999M497O859Q419R724J1873J5411J9939
$$ 803693 797954 792654 788905 787093 786550 786911 788910 793407 800266 808685 818409 830282 845693 865632
60494H65632K4601K8961L3392L8428M3920M9124N3464N6694N8523N8743N7647
$$ 865632 890233 919194 952586 991014 1034934 1084058 1137522 1194216 1252739 1311482 1369129
60483A369129N5564N2023M6158L7962K8303J7691O029o280j8045k8458l7648m5762
$$ 1369129 1424693 1476716 1522874 1560836 1589139 1606830 1612859 1606579 1588534 1560076 1522428 1476666
60471A476666n2441n7592o1566o4108o4237o1831n8327n4997n1467m6764m1099
$$ 1476666 1424225 1366633 1305067 1240959 1176722 1114891 1056564 1001567 950100 903336 862237
60460H62237l5595l0870k6878k3578k0893j8334j5609j3208j1703j0791r831q899
$$ 862237 826642 795772 768894 745316 724423 706089 690480 677272 665569 654778 644947 636048
60448F36048q436q149p234n680m482m406n103n629n463m818m239l959l666l024
$$ 636048 627612 619463 612229 606549 602067 597661 592558 586929 581466 576648 572409 568450 564784 561760
60434E61760k305k089k349k357j716q52k44K42Q46J281J189P46L38m3o27j329
$$ 561760 559455 557366 555017 552660 550944 550092 549848 550090 550936 552217 553406 554152 554490 554447 553820 552491
60418E52491j811j859j483q61l18n1J65N78P95K21q98j560j354p60n2J096K478
$$ 552491 550680 548821 547338 546477 546159 546108 546273 546851 547646 547867 546969 545409 544055 543295 543243 544339 546817
60401E46817L027K340J551J840K828L327L047K609K352K107J870J915K351L064
$$ 546817 549844 552184 553735 555575 558403 561730 564777 567386 569738 571845 573715 575630 577981 581045
60387E81045L819M117L509K421K031K754L552L340K484K078K393K869L167L362
$$ 581045 584864 588981 592490 594911 596942 599696 603248 606588 609072 611150 613543 616412 619579 622941
60373F22941L442L403L471L658L461K718K257K968M567N954O458O078N020L814
$$ 622941 626383 629786 633257 636915 640376 643094 645351 648319 652886 658840 665298 671376 676396 680210
60359F80210L328L862M507M264L421L038L445M176N063O410Q230J0203J2365J5057
$$ 680210 683538 687400 691907 696171 699592 702630 706075 710251 715314 721724 729954 740157 752522 767579
60345G67579J8124K0852K2736K3833K4346K4409K4123K3359K1582J8316J3610
$$ 767579 785703 806555 829291 853124 877470 901879 926002 949361 970943 989259 1002869
60334A002869P852J471m942j0643j5322j9268k2551k4603k5054k4377k3194k1505
$$ 1002869 1010721 1012192 1007250 996607 981285 962017 939466 914863 889809 865432 842238 820733
60322H20733j9206j6708j4465j2387j0342q614p295n893m208k841k164j660r44
$$ 820733 801527 784819 770354 757967 747625 739011 731716 725823 721615 718774 716610 714950 714006
60309G14006n11m51M67L170O684R540J2065J5661K0384K4934K8679L2037L4919
$$ 714006 713495 713044 713511 716681 723365 732905 744970 760631 781015 805949 834628 866665 901584
60296I01584L6517L6757L6452L5711L3479K8924K2153J3503L375p034j6134k3567
$$ 901584 938101 974858 1011310 1047021 1080500 1109424 1131577 1145080 1148455 1141421 1125287 1101720
60284A101720l0329l6890m2053m4246m3154l9727l5223l0578k6152k1908j8091
$$ 1101720 1071391 1034501 992448 948202 905048 865321 830098 799520 773368 751460 733369
60273G33369j5480j4316j3493j1756r496q140q010p995p449o908o688o083m632
$$ 733369 717889 703573 690080 678324 668828 660688 652678 644683 637234 630326 623638 617555 612923
60260F12923l057k201j838j228k85M64O28K02n51j190j363j182j010q56m22K46
$$ 612923 609866 607665 605827 604599 604314 604778 605406 605608 605057 603867 602504 601322 600312 599456 599034 599280
60244E99280P06P27M93J63k45n62n82l90j89P8M29M93P3k34K46J241J983K416
$$ 599280 599986 600713 601206 601369 601124 600562 599980 599590 599401 599479 599908 600401 600474 600240 600486 601727 603710 606126
60226F06126L016L695L879L629L567L723L469K705K189K433L088L579L660L300
$$ 606126 609142 612837 616716 620345 623912 627635 631104 633809 635998 638431 641519 645098 648758 652058
60212F52058K732K586L245M176M690N100O168P585Q155P509O447N637N047M775
$$ 652058 654790 657376 660621 664797 669487 674587 680755 688340 696495 704004 710451 716088 721135 725910
60198G25910N156N790N633M448L163K440J877R80j05j148k265l326l796l580l337
$$ 725910 731066 736856 742489 746937 750100 752540 754417 755397 755292 754144 751879 748553 744757 741177 737840
60183G37840l537l938m065l649k503q36L75K85n12o74j06m2r43j728j475o32Q7
$$ 737840 734303 730365 726300 722651 720148 719312 719687 719972 719460 718786 718680 718638 717695 715967 714492 713860 713947
60166G13947P79J547J799J164L54K27O58R88R93Q49O28L00j86j045k334l392l380
$$ 713947 714726 716273 718072 719236 719590 719817 720475 721463 722456 723305 723933 724233 724047 723002 720668 717276 713896
60149G13896k550k034k195k183j404l65M13J241K409L478M045M434N043N755O480
$$ 713896 711346 709312 707117 704934 703530 703165 703578 704819 707228 710706 714751 719185 724228 729983 736463
60134G36463P496Q695R321R003Q331P885P393O425N196M165L417K828K263J353
$$ 736463 743959 752654 761975 770978 779309 787194 794587 801012 806208 810373 813790 816618 818881 820234
60120H20234j66j716k321k018j809j962j573k82Q70J001O65P70J196J322J109
$$ 820234 820068 818352 816031 814013 812204 810242 808669 808387 809257 810258 810923 811693 812889 814211 815320
60105H15320Q14L51k88p12q64j396k645l974m687m834m593l760k434j340p66j41
$$ 815320 816134 816485 816197 815485 814621 813225 810580 806606 801919 797085 792492 788732 786298 784958 784192 784051
60089G84051P51J181R17J003K067K968K423J105P22J536K301K310K127K247K164
$$ 784051 784802 785983 786900 787903 789970 792938 795361 796466 797188 798724 801025 803335 805462 807709 809873
60074H09873J096r92l322n021n918o736q197j0013j1287j1866j2367j2797j2258
$$ 809873 810969 809977 806655 801634 795716 788980 780783 770770 759483 747617 735250 722453 710195
60061G10195j0468q467p202o409n504m546l704k782j987k106l155l963l850l580
$$ 710195 699727 691260 684058 677649 672145 667599 663895 661113 659126 657020 653865 649902 646052 642472
60047F42472l731l494k209q37m24k15J137L270M648M827M653M673M773M978N271
$$ 642472 638741 635247 633038 632201 631777 631562 632699 635969 640617 645444 650097 654770 659543 664521 669792
60032F69792M888L177Q11r62j988k887l523l309k749l195m973o982q285q938r143
$$ 669792 674680 677857 678668 677706 675718 672831 669308 665999 663250 660055 655082 648100 639815 630877 621734
60017F21734q690p589o395n642n392n398n214m294k576p16O29J401J679J265L92
$$ 621734 613044 605455 599060 593418 588026 582628 577414 573120 570544 569828 570457 571858 573537 574802 575194
60002E75194J00R95K259K809K828L139L688L822L625L709M024L940L356K670J947
$$ 575194 575294 576289 578548 581357 584185 587324 591012 594834 598459 602168 606192 610132 613488 616158 618105
59987F18105J113N82P16R73O36j1k59k90p40j387j536j410j812k640l145l419
$$ 618105 619218 619800 620516 621489 622125 622114 621855 621565 620825 619438 617902 616492 614680 612040 608895 605476
59971F05476m223n341n593m649l542l101l054k872k414j455L02K419L858M244
$$ 605476 601253 595912 590319 585670 582128 579027 575973 573101 570687 569232 569534 571953 575811 580055
59957E80055M223M424M813N203N499N388M625L735L517L779L479K261R71M27N41
$$ 580055 584278 588702 593515 598718 604217 609605 614230 617965 621482 625261 628740 631001 631972 632399 632940
59942F32940Q50J177J343R50j81j716l092l886m063m121m683n547n618m370k748
$$ 632940 633790 634967 636310 637260 637079 635363 632271 628385 624322 620201 615518 609971 604353 599983 597235
59927E97235j903j648j163n27l72m92j07P70J470J965K753L622L880L681L847
$$ 597235 595332 593684 592521 591994 591622 591130 591023 591793 593263 595228 597981 601603 605483 609164 613011
59912F13011M326M320L934M292N715P150P680P434O605M883K391J33j037j183
$$ 613011 617337 621657 625591 629883 635598 642748 650428 657862 664467 669350 671741 671874 670837 669654
59898F69654p09J06P87P83K53m5K24P81J522K566L446L404K623K132K329K672
$$ 669654 668945 669051 669838 670621 670874 670829 671053 671834 673356 675922 679368 682772 685395 687527 689856 692528
59882F92528K922L500M375M833M745M831N225N021L820K538J954J477K32j500
$$ 692528 695450 698950 703325 708158 712903 717734 722959 727980 731800 734338 736292 737769 738001 736501
59868G36501k784l389l821m430n161n907o575p008p139p054o789o353n780m923
$$ 736501 733717 730328 726507 722077 716916 711009 704434 697426 690287 683233 676444 670091 664311 659388
59854F59388l438j495m4M10P50J976L503M047L894M615O472P917Q058P933Q582
$$ 659388 655950 654455 654411 654821 655571 657547 661050 665097 668991 673606 680078 687995 696053 703986 712568
59839G12568R357R194Q421Q146Q537Q780Q332P513P029P253P714P290N405K888
$$ 712568 721925 731119 739540 747686 756223 765003 773335 780848 787877 795130 802844 810134 815539 818427
59825H18427R24n69k422m382n301n234n718p536r739j1443j3021j4657j5304j4173
$$ 818427 819351 818782 816360 811978 806677 801443 795725 788189 778450 767007 753986 739329 724025 709852
59811G09852j2086j0207q493o496m672l709l292k772k299k270k257j659q48o49
$$ 709852 697766 687559 679066 672570 667898 664189 660897 658125 655826 653556 651299 649640 648792 648143
59797F48143j076j592k154l028l897m127l697l118k654k323k264k442k369j849
$$ 648143 647067 645475 643321 640293 636396 632269 628572 625454 622800 620477 618213 615771 613402 611553
59783F11553j570k224l347l889l660l342l266l011k243j250n43l56n78r24j144
$$ 611553 609983 607759 604412 600523 596863 593521 590255 587244 585001 583751 583208 582852 582274 581350 580206
59768E80206j290j550j787j593r29k88O3M59J201J999K483K719K915L003K985
$$ 580206 578916 577366 575579 573986 573057 572769 572832 573291 574492 576491 578974 581693 584608 587611 590596
59753E90596L185L805M537N015N223N183M736M021L605L800M209M374M337M204
$$ 590596 593781 597586 602123 607138 612361 617544 622280 626301 629906 633706 637915 642289 646626 650830
59739F50830L691K652J593J164J395J790J885J451N52l14m98M9O42O79K14l54
$$ 650830 654521 657173 658766 659930 661325 663115 665000 666451 667003 666689 666191 666240 666882 667561 667775 667421
59723F67421o99n03L47J322J549Q78P7k16j03J60N97J058J007K40p49j403j626
$$ 667421 666722 666219 666566 667888 669437 670315 670392 670176 670073 670233 670830 671888 672895 673135 672386 670983 669357
59706F69357j447q12Q8Q23J294J665J711J069K45L20J357K177K131K022K653L515
$$ 669357 667910 667098 667186 668009 669303 670968 672679 673748 673993 674313 675670 677847 679978 682000 684653 688168
59690F88168L719L437L495M098M688M618L491J351j004k444k635k250j868j470
$$ 688168 691887 695324 698819 702917 707605 712223 715714 717065 716061 713617 710982 708732 706864 705394
59676G05394j196j601k711l744m262m668n207n483n461n777o439o497n649m951
$$ 705394 704198 702597 699886 696142 691880 687212 682005 676522 671061 665284 658845 652348 646699 641748
59662F41748n001m776l363j586o13j47N82J092N69k73j7J228K137K350K730L509
$$ 641748 636747 631971 628608 627022 626409 626262 626844 627936 628505 628232 628215 629443 631580 633930 636660 640169
59646F40169L833L354K802K581J937J06k441m411m925m193l262l092l540l531
$$ 640169 644002 647356 650158 652739 654676 654782 652341 647930 643005 638812 635550 632458 628918 625387
59632F25387k513j279q20r45p70j38L11K40j07n68j191j757j894j651j429j413
$$ 625387 622874 621595 620775 619830 619060 618922 619233 619473 619366 618798 617607 615850 613956 612305 610876 609463
59616F09463j445j385j162p16k43k02o87j163j162q66n87j64O27J522K080K223
$$ 609463 608018 606633 605471 604755 604512 604310 603623 602460 601298 600432 599845 599681 600308 601830 603910 606133
59600F06133K037J554R78O31L30m35j460j835j381j069j330j215m8J103Q47m72
$$ 606133 608170 609724 610702 611333 611663 611228 609768 607933 606552 605483 604153 602938 602890 603993 604840 604368
59584F04368j407j414j078q08n78o55j378k409l111l441l679l654l074k260j679
$$ 604368 602961 601547 600469 599661 599083 598428 597050 594641 591530 588089 584410 580756 577682 575422 573743
59569E73743j204o51m64q97j114k75R30J113K57l08J02P80R46O74K89j70o36q02
$$ 573743 572539 571888 571424 570527 569413 569138 570068 571181 571438 571130 571232 572012 572958 573632 573921 573751 573115 572313
59551E72313m78K58J252K263K920L029K769K309J738J531K390M189N862O908Q104
$$ 572313 571835 572093 573345 575608 578528 581557 584326 586635 588373 589904 592294 596483 602345 609253 617357
59536F17357J0082J2188J3639J4766J6008J6645J5920J4584J3837J3246J1271
$$ 617357 627439 639627 653266 668032 684040 700685 716605 731189 745026 758272 769543
59525G69543P557L362k2j997k220q27R62J780J584J172O01p29k733m770o896r563
$$ 769543 777100 780462 780440 778443 776223 775396 776358 778138 779722 780894 781495 780766 778033 773263 766367 756804
59509G56804j2199j3548j3480j3132j3060j2595j1287r742q656p961p348o759
$$ 756804 744605 731057 717577 704445 691385 678790 667503 657761 649105 641144 633796 627037
59497F27037o042m903l396j955p99J07O24O45N85R83J720K226K261J922J294P13
$$ 627037 620995 616092 612696 610741 609942 610049 610673 611318 611903 612886 614606 616832 619093 621015 622309 623022
59481F23022Q70J928L083L770M627O275Q053R099R877J1178J2332J2122J0928
$$ 623022 623892 625820 628903 632673 637300 643575 651628 660727 670604 681782 694114 706236 717164
59468G17164J0269J0366R964Q427O352M125J522j017k382k354j825j194J46K449
$$ 717164 727433 737799 747763 756190 762542 766667 768189 767172 764790 762436 760611 759417 759563 762012
59454G62012N042P404R676J1869J3636J4994J6196J6871J6399J5055J3587J1781
$$ 762012 767054 774458 784134 796003 809639 824633 840829 857700 874099 889154 902741 914522
59442I14522Q832N068J734r67l990p479j0309j1973j3326j4885j5910j5756j4832
$$ 914522 923354 928422 930156 929189 925199 917720 907411 895438 882112 867227 851317 835561 820729
59429H20729j3595j1853r746q198p695p462o504m650k244M12K985N355Q043J1599
$$ 820729 807134 795281 785535 777337 769642 762180 755676 751026 748782 749194 752179 757534 765577 777176
59415G77176J5491J8604K0710K2372K3605K3969K3778K3587K2553J9192J4055
$$ 777176 792667 811271 831981 854353 877958 901927 925705 949292 971845 991037 1005092
59404A005092R576O592K938l475j1654j8622k2201k1793j7868j1977o401k551
$$ 1005092 1014668 1021260 1024198 1020723 1009069 990447 968246 946453 928585 916608 910207 907656
59392I07656j49J338J318j249o412j3099j9764k4822k7189k6898k4672k0989j6328
$$ 907656 907507 908845 910163 908914 902502 889403 869639 844817 817628 790730 766058 745069 728741
59379G28741j2032r439q083o240l552j501q28l18J075K508K825K494K721L633
$$ 728741 716709 707270 699187 692947 689395 687894 687066 686748 687823 690331 693156 695650 698371 702004
59365G02004M502N007N318N575O012O984Q250Q984Q972Q966R423R902J0139J0645
$$ 702004 706506 711513 716831 722406 728418 735402 743652 752636 761608 770574 779997 789899 800038 810683
59351H10683J1695J2831J3922J5566J7763J9400J9819J9822K0284K0864K0847
$$ 810683 822378 835209 849131 864697 882460 901860 921679 941501 961785 982649 1003496
59340A003496K0256J9242J7370J4444J1117P843M108m91n244r248j2550j5603
$$ 1003496 1023752 1042994 1060364 1074808 1085925 1093768 1097876 1097385 1092141 1082893 1070343 1054740
59328A054740j8384k0738k2777k4304k4638k3693k2289k0867j8892j6114j3373
$$ 1054740 1036356 1015618 992841 968537 943899 920206 897917 877050 858158 842044 828671
59317H28671j1362r679p921o618o197n999n280m272l436k575j578j053j289j442
$$ 828671 817309 807630 799709 793091 786894 780895 775615 771343 767907 765332 763754 762701 761412 759970
59303G59970p52K62P28P55R79J562K463L941N867P345P805P770P811P594O709
$$ 759970 759218 759480 760208 760963 761942 763504 765967 769908 775775 783120 790925 798695 806506 814100 820809
59288H20809N537M488L349K143J673K324L250L561L375K900J533j068l982o118
$$ 820809 826346 830834 834183 836326 837999 840323 843573 847134 850509 853409 854942 853874 849892 843774
59274H43774p345p659o350l149P85M223P293J0447J2964J3819J3272J2253J0834
$$ 843774 836429 828770 822420 819271 820056 824279 831572 842019 854983 868802 882074 894327 905161
59261I05161Q447N143J456k355o052r048j1261j3514j6147j8019j8006j6604j4975
$$ 905161 913608 918751 920207 917852 911800 902752 891491 877977 861830 843811 825805 809201 794226
59248G94226j3306j1275r318q010o868n048k732o05J351L385M954N470N533O267
$$ 794226 780920 769645 760327 752317 745449 740401 737669 737064 738415 741800 746754 752224 757757 764024
59234G64024P769R300J0402J0863J0265Q611O750N206L363Q06j559k991m482p264
$$ 764024 771793 781093 791495 802358 812623 821234 827984 833190 836553 837359 835800 832809 828327 821063
59220H21063j0564j2487j2598j1973j1225j0058q462o786m867k473l63M72M12
$$ 821063 810499 798012 785414 773441 762216 752158 743696 736910 732043 729570 729207 729679 730091
59207G30091P16J670K512K851K879K425J189k68j071j400k061k913l058k388j694
$$ 730091 730807 732477 734989 737840 740719 743144 744333 744065 742994 741594 739533 736620 733562 731174 729480
59192G29480j281p84k66l02q42j204j190j204j248q47lP17J066J287J464J484
$$ 729480 728199 727415 727149 726847 726005 724801 723611 722407 721159 720312 720309 721026 722092 723379 724843 726327
59176G26327J513J778K082K274K798M004N323O071O641P884R673J1152J2084J2875
$$ 726327 727840 729618 731700 733974 736772 740776 746099 752170 758811 766695 776368 787520 799604 812479
59162H12479J3495J3423J2610J1550J0443R036P166M875K258l93k694m905p756
$$ 812479 825974 839397 852007 863557 874000 883036 890202 895077 897335 896942 894248 889343 881587
59149H81587j1054j3362j3867j3510j3392j3151j2153j1083j0891j1034j0455
$$ 881587 870533 857171 843304 829794 816402 803251 791098 780015 769124 758090 747635
59138G47635r534r473j0156j0339r562q448p374o277n428n092m676l477j891o68
$$ 747635 738101 728628 718472 708133 698571 690123 682749 676472 671044 665952 661276 657799 655908 655240
59124F55240M48K081L780M692N158O148P600Q775R754J1032J2145J2299J1940
$$ 655240 655688 657769 661549 666241 671399 677547 685147 693922 703676 714708 726853 739152 751092
59111G51092J2093J2596J2564J2175J2157J1991J0550Q338P022O814O301M920
$$ 751092 763185 775781 788345 800520 812677 824668 835218 843556 850578 857392 863693 868613
59099H68613L685L110K274N11j527l042m098m977n576n773n545m638l046j535
$$ 868613 872298 875408 877682 878193 876666 873624 869526 864549 858973 853200 847655 843017 839971 838436
59085H38436q59p33o19r67k399m314n719o837q437j0076j0694j0442j0200r871
$$ 838436 837577 836844 836225 835258 832859 828545 822826 815989 807552 797476 786782 776340 766140 756269
59071G56269q910q035q305q974q385o717n600n261m446l050k365k500k055p57
$$ 756269 747359 739324 731019 722045 713660 706943 701343 696082 691636 688586 686221 683721 681666 680909
59057F80909k3m19q29p25j022j924k187j403r09j475k010j608j064j216j502j216
$$ 680909 680886 680467 679638 678913 677891 675967 673780 672377 671468 669993 667983 666375 665311 664095 662593 661377
59041F61377p59o05l88Q7K49m9r0L26L96n6K1J180K586L550M527N838O832P234
$$ 661377 660618 660013 659625 659712 659961 659912 659822 660148 660544 660488 660509 661689 664275 667825 672352 678190 685022 692256
59023F92256P891R362J1057J2505J4100J5766J6289J4943J2583J0274P960N295
$$ 692256 700147 709509 720566 733071 747171 762937 779226 794169 806752 817026 824986 830281
59011H30281K638L33j928m253n939o433o009n068l673k086o86Q88L288O004P654
$$ 830281 832919 833252 831324 827071 821132 814699 808690 803622 799949 797863 797177 798065 801353 807357 815011
58996H15011P984Q079Q467Q627Q553Q936R326Q214N615L502K809J957m87l666
$$ 815011 822995 831074 839541 848168 856721 865657 874983 883197 888812 892314 895123 897080 896593 892927
58982H92927o195q262j0471j2090j2090j0773r007o898m428k260o43J362M350
$$ 892927 886732 878470 867999 855909 843819 833046 824039 817141 812713 810453 809810 811172 815522
58969H15522P252Q793R330J0105J1521J3192J4894J6415J7282J7523J7815J8153
$$ 815522 822774 831567 840897 851002 862523 875715 890609 907024 924306 941829 959644 977797
58957I77797J7300J4452J0464O499K494k085o937j1358j5221j8561k0903k1853
$$ 977797 995097 1009549 1020013 1026512 1029006 1026921 1019984 1008626 993405 974844 953941 932088
58945I32088k1691k0865j9579j8245j7323j6306j4095j0819q070o684n677m086
$$ 932088 910397 889532 869953 851708 834385 818079 803984 793165 785095 778411 772734 768648
58933G68648k457j650j521j700k416l589m306m119l780l849l780l237k943l310
$$ 768648 766191 764541 763020 761320 758904 755315 751009 746890 743110 739261 735481 732244 729301 725991
58919G25991l535l056k576k626k459j520n97k71M08K264M206M666L936L531M020
$$ 725991 722456 719400 716824 714198 711739 710219 709622 709351 709759 712023 716229 720895 724831 728362 732382
58904G32382M882N870P142Q527R788J1246J3169J5074J6413J7354J8223J8841
$$ 732382 737264 743134 750276 758803 768591 779837 793006 808080 824493 841847 860070 878911
58892H78911J9155J9752K1019K2475K3606K4615K5850K7286K8980L0952L2230
$$ 878911 898066 917818 938837 961312 984918 1009533 1035383 1062669 1091649 1122601 1154831
58881A154831L1250K7807K3393J9071J4336Q660K687k927q468j4127j9300k3651
$$ 1154831 1186081 1213888 1237281 1256352 1270688 1279348 1282035 1279108 1270640 1256513 1237213 1213562
58869A213562k7476l0340l0933k9137k6585k4330k1679j8324j5686j4739j4324
$$ 1213562 1186086 1155746 1124813 1095676 1069091 1044761 1023082 1004758 989072 974333 960009
58858I60009j3158j1983j2026j2827j3242j3348j3720j4017j3794j3572j3644
$$ 960009 946851 934868 922842 910015 896773 883425 869705 855688 841894 828322 814678
58847H14678j3020j1151r441r364j0170j0172r260q507q128p582o974o766o719
$$ 814678 801658 790507 781066 771702 761532 751360 742100 733593 725465 717883 710909 704143 697424
58834F97424o371o003n978n894n422n068n133m975m239l642l492k859j360j97
$$ 697424 691053 685050 679072 673178 667756 662688 657555 652580 648341 644699 641207 638348 636988 636791
58820F36791n1M20K317M332M643L742L402L945M377M378M294M014L347K868K928
$$ 636791 636740 637160 639477 643809 648452 652194 655596 659541 663918 668296 672590 676604 679951 682819 685747
58805F85747K802K023J386J350Q56p76k212k114j358j442k048k136k120k856l681
$$ 685747 688549 690572 691958 693308 694164 693388 691176 689062 687704 686262 684214 682078 679958 677102 673421
58790F73421l600l315l864m377l410j604o63m68M92K413M071M950N446N453M707
$$ 673421 669821 666506 662642 658265 654855 653251 652588 652120 652612 655025 659096 664046 669492 674945 679652
58775F79652M022M315M914M550L368K250R35j325l930n632o417o908o776n625
$$ 679652 683674 687989 692903 697453 700821 703071 704006 702681 698751 693119 686702 679794 673018 667393
58761F67393m561m874n860n942n141m429l501j428J160K774L399M018M460L920
$$ 667393 662832 657958 652098 646156 641015 636586 633085 631657 632817 635591 638990 643008 647468 651388
58747F51388L037L144L902L854L048K974M122N664P192Q861J0119J0194R545R126
$$ 651388 654425 657569 661471 665325 668373 671347 675469 681133 688325 697186 707305 717499 727044 736170
58733G36170Q730P804P177P935R306R712R288R295R650R270Q353Q040Q256P941
$$ 736170 744900 752704 759881 767816 777122 786834 796122 805417 815067 824337 832690 840730 848986 856927
58719H56927P055O388N970N639O375Q876J1486J1976J0796J0157J0399R770P460
$$ 856927 863982 870370 876340 881979 888354 897230 908716 920692 931488 941645 952044 961814 969274
58706I69274M348R81k799o402q955j1068j4014j7479k0155k2092k4256k6284k6927
$$ 969274 973622 974603 971804 965402 956447 945379 931365 913886 893731 871639 847383 821099 794172
58693G94172k6280k5280k3664k0736j7509j5558j4348j2310r857q586q125o785
$$ 794172 767892 742612 718948 698212 680703 665145 650797 638487 628630 620044 611919 605134
58681F05134m970m727o114p039o670o067n479m045k244j595j663l71K402M476
$$ 605134 600164 595437 589323 582284 575614 569547 564068 560023 557779 556184 554521 554150 556552 561028
58667E61028N012N620P310R164J0606J2408J4726J6454J6979J6392J3956Q886
$$ 561028 566040 571660 578970 588134 598740 611148 625874 642328 659307 675699 689655 698541
58655F98541K720j722l936n701p530q048p156o685p318p716p294p143p529p174
$$ 698541 701261 699539 695603 689902 682372 674324 667168 660483 653165 645449 638155 631012 623483 616309
58641F16309n736m433l604k107K22J975K626L157L850L906L606M250N547N626
$$ 616309 610573 606140 602536 600429 600651 602626 605252 608409 612259 616165 619771 624021 629568 635194
58627F35194M135K701J996J060j15q3J339K644L331M432N881O202N368N165O162
$$ 635194 639329 642030 644026 645086 644971 644888 646227 648871 652202 656634 662515 668717 674085 679250 685412
58612F85412P033P345Q151R286Q992O854M305J848j351m652o011n466n393o555
$$ 685412 692445 699790 707941 717227 726219 733073 737378 739226 737875 733223 727212 721746 716353 709798
58598G09798p132o322n603n558m851l378l026m130m484l049j478o79Q17L792O778
$$ 709798 702666 696344 690741 685183 680332 676954 673928 669798 665314 662265 660787 660108 660925 664717 671495
58583F71495Q853J0952J3156J3898J3175J3206J4529J4777J2781J0578R649Q608
$$ 671495 680348 691300 704456 718354 731529 744735 759264 774041 786822 797400 807049 815657
58571H15657O434M790N065O208P438J0043J4460J8479K0557K2195K5023K8099
$$ 815657 822091 826881 831946 838154 845592 855635 870095 888574 909131 931326 956349 984448
58559I84448L0161L1819L3455L3413L0408K5539K0134J3837O454n67o016j0164
$$ 984448 1014609 1046428 1079883 1113296 1143704 1169243 1189377 1203214 1209668 1209101 1203085 1192921
58547A192921j3012j3761j3067j3016j3791j3377j1598j1086j2976j5202j6576
$$ 1192921 1179909 1166148 1153081 1140065 1126274 1112897 1101299 1090213 1077237 1062035 1045459
58536A045459j8812k2616k5481k5671k4916k4757k3575j9894j5471j2432j0122
$$ 1045459 1026647 1004031 978550 952879 927963 903206 879631 859737 844266 831834 821712
58525H21712p283m647k987j213J270K961L124L419M730N314M171L134L376K999
$$ 821712 814429 809782 806795 805582 806852 809813 812937 816356 821086 826400 830571 833705 837081 840080
58511H40080N67k095l099l492m616n474n198n170o159o376m797l389l628l920
$$ 840080 840647 838552 835453 831961 827345 821871 816673 811503 805344 798968 794171 790782 787154 783234
58497G83234k952k308l175l859l225l175m820n648l654r18J06N05J996L400L458
$$ 783234 780282 777974 774799 770940 767715 764540 759720 754072 750418 749500 749606 750111 752107 755507 758965
58482G58965L845N980Q061Q709J0190J4314J8431J9451J8762J9052J9200J6565
$$ 758965 762810 768790 776851 785560 795750 810064 828495 847946 866708 885760 904960 921525
58470I21525J1693O681J337n032j0452j2911j3869j5350j5978j3749j0240q057
$$ 921525 933218 939899 941236 936204 925752 912841 898972 883622 867644 853895 843655 835598
58458H35598o522l794q88N16J888N336R387J1383J1967J3150J4002J2304Q655
$$ 835598 829076 825282 824394 824910 826798 832134 841521 852904 864871 878021 892023 904327 912982
58445I12982N087J437l297p913j0859j2921j4787j4478j0859o980o000o285m553
$$ 912982 918069 919506 916209 908296 897437 884516 869729 855251 844392 837412 831412 825127 820574
58432H20574j296J050K712N050O902O790O461Q082J0261J0941J1540J3907J5935
$$ 820574 819278 820328 823040 828090 834992 841782 848243 856325 866586 877527 889067 902974 918909
58419I18909J4823J1985J0052P773K907k428m663m743o008q196q815q457r451
$$ 918909 933732 945717 955769 963542 966449 964021 959358 954615 948607 940411 931596 923139 913688
58406I13688j0962j0645r539j0209j1682j1117q993p791p157n144k611j662j383
$$ 913688 902726 892081 882542 872333 860651 849534 840541 832750 825593 820449 817838 816176 814793
58393H14793K95K343K693K495L766N031M001K156J972K109L32j510o56J175R09
$$ 814793 815088 817431 820124 822619 826385 831416 835417 837573 839545 841654 841986 840476 839820 840995 841904
58378H41904q6J150L279L394K830M353O299N560L786M426O300O339N949Q034J0555
$$ 841904 841818 842968 846247 849641 852471 856824 863123 868683 872469 876895 883195 889534 895483 903517 914072
58363I14072R909Q042R200J2172J2979J2585J4445J6904J5897J2922J2325J2751
$$ 914072 923981 932023 941223 953395 966374 978959 993404 1010308 1026205 1039127 1051452 1064203
58351A064203R603M096J421J456j59l005k632N98K009J342K585N700O799O136
$$ 1064203 1073806 1077902 1079323 1080779 1080620 1077615 1074983 1075581 1077590 1078932 1081517 1087217 1094016 1100152
58337A100152P708J1259J2708J2103J3238J5881J6348J5164J6046J8042J6916
$$ 1100152 1107860 1119119 1131827 1143930 1157168 1173049 1189397 1204561 1220607 1238649 1255565
58326A255565J3578J2670J3668J1888P639N495N335L062m40l87K479K918J123
$$ 1255565 1269143 1281813 1295481 1307369 1315008 1320503 1325838 1328900 1328460 1328073 1330552 1333470 1334593
58313A334593K160N945P442O538P871J1084J1321R277J0534J4782J6107J4163
$$ 1334593 1336753 1342698 1350140 1356678 1364549 1375633 1386954 1396231 1406765 1421547 1437654 1451817
58301A451817J4565J7832J8599J6364J6290J8651J8252J5108J4825J7692J8193
$$ 1451817 1466382 1484214 1502813 1519177 1535467 1554118 1572370 1587478 1602303 1619995 1638188
58290A638188J6129J7071K1094K2338K0519K1408K5214K6160K4325K5773L0301
$$ 1638188 1654317 1671388 1692482 1714820 1735339 1756747 1781961 1808121 1832446 1858219 1888520
58279A888520L1462K9473L1110L6057L6843L3393L3713L8692M0529L8073L9063
$$ 1888520 1919982 1949455 1980565 2016622 2053465 2086858 2120571 2159263 2199792 2237865 2276928
58268B276928M4881M7948M6847M9085N5962N9813N9351O2370O9989P3669P1358
$$ 2276928 2321809 2369757 2416604 2465689 2521651 2581464 2640815 2703185 2773174 2846843 2918201
58257B918201P0862P3949P3199O8053O7283P1831P2313O7451O7295P4137P8441
$$ 2918201 2989063 3063012 3136211 3204264 3271547 3343378 3415691 3483142 3550437 3624574 3703015
58246C703015P8005Q2247R2799R9455J00518J06969J20845J30285J32161J38166
$$ 3703015 3781020 3863267 3956066 4055521 4156039 4263008 4383853 4514138 4646299 4784465
58236D784465J51963J62292J65820J74090J90310K02591K08144K19934K41036
$$ 4784465 4936428 5098720 5264540 5438630 5628940 5831531 6039675 6259609 6500645
58227F500645K57649K66415K82361L10164L35039L52320L77383M15222M50244
$$ 6500645 6758294 7024709 7307070 7617234 7952273 8304593 8681976 9097198 9547442
58218I547442M78065N15988N69292O20331O64613P22443Q00304Q78326R52182
$$ 9547442 10025507 10541495 11110787 11731118 12395731 13118174 13918478 14796804 15748986
58209A5748986J047178J173062J308004J447160J621016J843999K095342K375844
$$ 15748986 16796164 17969226 19277230 20724390 22345406 24189405 26284747 28660591
58201B8660591K729674L183111L722302M363655N179474O216283P459951Q922516
$$ 28660591 31390265 34573376 38295678 42659333 47838807 54055090 61515041 70437557
58193G0437557J0681843J2795623J5288028J8286608K2040887K6699710L2162533
$$ 70437557 81119400 93915023 109203051 127489659 149530546 176230256 208392789
58186B08392789L8123608M3826973M7393749M5785520L6451948J9703102o49674
$$ 208392789 246516397 290343370 337737119 383522639 419974587 439677689 439028015
58179D39028015j9380127l2781205l9911826m1775508l9984214l6080247l1342865
$$ 439028015 419647888 386866683 346954857 305179349 265195135 229114888 197772023
58172A97772023k6620522k2276582j8406017j5070324j2297725j0002878q057015
$$ 197772023 171151501 148874919 130468902 115398578 103100853 93097975 85040960
58165H5040960o423053n160786m330477l936276l922511m168385m503183m767635
$$ 85040960 78617907 73457121 69126644 65190368 61267857 57099472 52596289 47828654
58157D7828654m862782m745289m418168l943648l423536k933821k493994k105405
$$ 47828654 42965872 38220583 33802415 29858767 26435231 23501410 21007416 18902011
58149A8902011j782408j529154j322219j141090r90490q74800p77654o85760o07745
$$ 18902011 17119603 15590449 14268230 13127140 12136650 11261850 10484196 9798436 9190691
58140I190691n50895n02684m52870m11119l85270l63472l34840l07646k90495
$$ 9190691 8639796 8137112 7684242 7273123 6887853 6524381 6189541 5881895 5591400
58131E591400k74715k51653k29265k15651k03226j84386j66627j57384j49615
$$ 5591400 5316685 5065032 4835767 4620116 4416890 4232504 4065877 3908493 3758878
58122C758878j36552j25615j23658j23030j15969j08802j08429j08246j00775
$$ 3758878 3622326 3496711 3373053 3250023 3134054 3025252 2916823 2808577 2707802
58113B707802r1620q7939q5141p7479p0037o8178o6391n9323n2754n2321n2403
$$ 2707802 2616182 2528243 2443102 2365623 2295586 2227408 2161017 2101694 2048940 1996619 1944216
58102A944216m7346m2765m4396m6498m2719l8239l9614m2324l9781l5478l5038
$$ 1944216 1896870 1854105 1809709 1763211 1720492 1682253 1642639 1600315 1560534 1525056 1490018
58091A490018l5060l0763k6277k6579k7309k3035j7790j7211j7961j5055j2141
$$ 1490018 1454958 1424195 1397918 1371339 1344030 1320995 1303205 1285994 1268033 1252978 1240837
58080A240837j4352j8128j8076j7075j9828k3113k2104j9919k1383k3477k1283
$$ 1240837 1226485 1208357 1190281 1173206 1153378 1130265 1108161 1088242 1066859 1043382 1022099
58069A022099j7534j7137j7979j5976j3615j4732j6367j4316j1251j1096j0980
$$ 1022099 1004565 987428 969449 953473 939858 925126 908759 894443 883192 872096 861116
58058H61116p189l398m405p155o598n192p727j1773j2130j0268j0620j1711r634
$$ 861116 853927 850529 846124 838969 832371 827179 819452 807679 795549 785281 774661 762950 753316
58045G53316o371o279p769o637m186m324n878n402m293n794q080p511n578n752
$$ 753316 746945 740666 732897 726260 722074 717750 711872 706470 702177 696383 688303 680792 675214 669462
58031F69462o727n587m279o158r321j0108r795j1302j2756j1033q215p866q361
$$ 669462 662735 657148 652869 646711 637390 627282 617487 606185 593429 582396 574181 566315 557954
58018E57954o533m339n091o609n134k612k986m605l527j233j684l553k818m94
$$ 557954 551421 547082 541991 535382 530248 527636 524650 520045 516518 515285 513601 510048 507230 506736
58004E06736n09k173j982o78j410k954j833O85O82j082p72J189J156q00j493q37
$$ 506736 506227 504054 502072 501394 499984 497030 495197 495882 496564 495482 494710 495899 497055 496255 494762 493925
57988D93925j139j611J67K686K571P77P00J587R3k983l863k606k625m296m984
$$ 493925 492786 491175 491342 494028 496599 497376 498076 499663 499756 496773 492910 490304 487679 483383 478399
57973D78399m486m743n062l330r62j036k600k390r11j160k476j744L86N11j115
$$ 478399 473913 469170 464108 460778 459816 458780 456180 453790 452879 451719 449243 447499 447885 448396 447281
57958D47281j144N06P58o78j112k93m50j380r57L6j068l402l596j683n99l92J423
$$ 447281 446137 446643 447401 446723 445611 445318 444868 443488 442531 442567 441499 438097 434501 432818 432219 431827 433250
57941D33250M302N213M462N236P464P854O197N870P816R442R947J1287J3357J3514
$$ 433250 437552 442765 447227 452463 459927 467781 473978 479848 487664 497106 507053 518340 531697 545211
57927E45211J1599J0354J0275R010O365M884M791L307j28k799l679m806o907q245
$$ 545211 556810 567164 577439 586449 592814 597698 602489 605796 605668 602869 599190 594384 587477 579232
57913E79232q654j0200j2859j3919j2625j1298j0959r986p919o504o201n568m739
$$ 579232 570578 560378 547519 533600 520975 509677 498718 488732 480813 474309 468108 462540 457801
57900D57801n474p212p189n169l960m545m760l606k774k975k611j088J64O91J625
$$ 457801 452327 445115 437926 432757 428797 424252 419492 415886 413112 410137 407526 406438 406602 407293 408918
57885D08918K824K977K794M276O679P157N672N064N981O013M455L394L279J874
$$ 408918 411742 414719 417513 421789 428468 435625 441297 446361 452342 458355 462810 466204 469483 471357
57871D71357j300l764m391m992o409p077o545o551p389p102n346m295m583m254
$$ 471357 470057 466293 461902 456910 450501 443424 436879 430328 422939 415837 410491 406196 401613 397359
57857C97359k829k410l518l785k177o83l02P41L153M734M141L072K990L017K582
$$ 397359 394530 392120 388602 384817 382640 381957 381655 382396 385549 390283 394424 397496 400486 403503 406085
57842D06085K881M051M199K747J637J783J472k58j897k523l339m685m847l373
$$ 406085 408966 413017 417216 419963 421600 423383 424855 424597 422700 420177 416838 412153 407306 403933
57828D03933k379k933l289k328j580k084k294r96N35J098J562K659L343K996K796
$$ 403933 401554 398621 395332 393004 391424 389340 387046 386050 386585 387683 389245 391904 395247 398243 401039
57813D01039L436L887L623L592L894L183J355J84K77K06m78m12N54O65m14r16
$$ 401039 404475 408362 411985 415577 419471 422654 424009 424193 424470 424676 424198 423786 424340 425005 424591 423675
57797D23675o22j638m321o103n782n415o234o433m877l483l680l974l186k873
$$ 423675 423053 421415 417094 410991 405209 399794 393560 387127 382250 378767 375087 371113 367927 365054
57783C65054m065m813l484j598r48o81L81J206Q99Q95K376L919M150M335N798
$$ 365054 360989 356176 352692 351094 350146 349465 349846 351052 351951 352846 355222 359141 363291 367626 373424
57768C73424P116O428M568L493L375L368L410L385K372M14q72r47j428l069m328
$$ 373424 380540 386968 391536 395029 398404 401772 405182 408567 410939 411353 410481 409534 408106 405037 400709
57753D00709m372m738o126o544m781k833k449k092n5K044J833K5j219j774k665
$$ 400709 396337 391599 385473 378929 374148 371315 368866 366774 366719 368763 370596 370621 369402 367628 364963
57738C64963l420l149k661l079l746l651l358l487l064j511l81r14j729j218k99
$$ 364963 361543 358394 355733 352654 348908 345257 341899 338412 335348 333837 333456 332542 330813 329595 329296
57723C29296m87j033m97N10O33K53L56L67n95j722j896j733k208k684k250j525
$$ 329296 328809 327776 327279 327789 328422 328675 329031 329398 328803 327081 325185 323452 321244 318560 316310 314785
57707C14785j316j102n72q50k287l060k010q20j227k136j777p71n21n30J60O41
$$ 314785 313469 312367 311795 310945 308658 305598 303588 302768 301541 299405 297628 296857 296336 295806 295966 296607
57691B96607j16r05l29N20Oj009p71J70J57n22l73O77J780L069M773N849N813
$$ 296607 296491 295586 295257 295777 295783 294774 294003 294173 294330 293808 293435 294112 295892 298961 303734 309583 315396
57674C15396O423R170J2751J5479J8458K3631L0322L6664M2897N0128N7033O0960
$$ 315396 321819 330989 343740 359219 377677 401308 431630 468294 511191 561319 618352 679312
57662F79312O1296N8747N2342M0275K3108L310j7453l7740n4073o2740o3783o0536
$$ 679312 740608 799355 851697 891972 915080 918390 900937 863197 809124 746384 682601 622065
57650F22065n5528m9260m2386l6098l0393k4416j8530j4062j1243r291p954p165
$$ 622065 566537 517277 474891 438793 408400 383984 365454 351392 340149 330858 322904 315739
57638C15739o012m040k620k937l712l095j668j168j348p65L28N74J59K37M72j93
$$ 315739 309727 305687 303067 300130 296418 293323 291655 290487 289139 288374 288702 289276 289435 289672 290144 289951
57622B89951j135j023m58r28j911j770q74r51j907k108j418j137j282p08L34M29
$$ 289951 288816 287793 287335 286407 284496 282726 281852 280901 278994 276886 275468 274331 273049 272341 272675 273104
57606B73104l65p12m85o28r26m76N7o64j916j810n75r1m99j68R94J200p1j274
$$ 273104 272739 272027 271542 270914 269988 269512 269569 268905 266989 265179 264604 264513 264014 263846 264840 266040 265969 264695
57588B64695j506j526j786j757j429j344j208m38Q4q95k584l135k658k740l417
$$ 264695 263189 261663 259877 258120 256691 255347 254139 253701 253785 252890 250306 247171 244513 241773 238356
57573B38356l339k555k364k607j955p69p00j550j542p49j088k647l167j784l13
$$ 238356 235017 232462 230098 227491 225536 224767 224067 222517 220975 220226 219138 216491 213324 211540 211227
57558B11227p4k11Qr1p14q42k03J49r2K9P22J058R15J141J550J066P6J71J290
$$ 211227 211153 210942 210950 210859 210145 209303 209100 209249 209157 209186 209908 210966 211881 213022 214572 215638 215714 215885 217175
57539B17175J635P82L07Q52J284J217J693K758K982K124J675K089J981Q79J97
$$ 217175 218810 219592 219899 220751 222035 223252 224945 227703 230685 232809 234484 236573 238554 239433 239630
57524B39630O68J251J439K173L613M443M214M044M244L714K415J879K363K153
$$ 239630 240298 241549 242988 245161 248774 253217 257431 261475 265719 269433 271848 273727 276090 278243
57510B78243O70m03j28K40j23j90M38L41j031k036j753j621k552k964j621p0j81
$$ 278243 278913 278510 278382 278622 278499 278309 278747 279088 278057 276021 274268 272647 270095 267131 265510 265440 265259
57493B65259j245j620j489j909k591k601k098j739j428j038j134j791j938j056
$$ 265259 264014 262394 260905 258996 256405 253804 251706 249967 248539 247501 246367 244576 242638 241582
57479B41582j57p2k23j00l39j151j408n35K53j61j094j446j290r88k23R11J340
$$ 241582 241425 241353 241130 241030 240691 239540 238132 237597 237850 237689 236595 235149 233859 232871 232648 233559 234899
57462B34899P24K93Q51J460J188O86Q07J090Q40M37N01R05J465K238K623J736
$$ 234899 235623 235916 236767 238227 239415 240101 240908 241998 242838 243275 243776 244681 246146 248384 251007 252743
57446B52743K41k2J108J747J132Q42J797K532J909J232J849K761K450J394Q42
$$ 252743 252984 252962 254070 255817 256949 257791 259588 262120 264029 265261 267110 269871 272321 273715 274557
57431B74557P42N70P43J525J979J519J054J199R90j07p23J83J323J111J22l19
$$ 274557 275299 275869 276612 278137 280116 281635 282689 283888 284878 284771 284048 284231 285554 286665 286787 286468
57415B86468m26r17j118j46J248J861K037K604L065K547J576J159J154J021J115
$$ 286468 286042 285125 284007 283861 285109 286970 289007 291611 294676 297223 298799 299958 301112 302133 303248
57400C03248J679J827J032M09R12J611J381R22J305J872J526Q88J119J686J366
$$ 303248 304927 306754 307786 308195 309107 310718 312099 313021 314326 316198 317724 318612 319731 321417 322783
57385C22783N97P84J988L099L668L938L778L136K813L280L604K911J982J921K312
$$ 322783 323380 324164 326152 329251 332919 336857 340635 343771 346584 349864 353468 356379 358361 360282 362594
57370C62594K238K011K271K473J976J571K196L189L417L192L316L370K700K088
$$ 362594 364832 366843 369114 371587 373563 375134 377330 380519 383936 387128 390444 393814 396514 398602
57356C98602K587L650M138M215M515M557L811L230L778M479L965K900K790L345
$$ 398602 401189 404839 408977 413192 417707 422264 426075 429305 433083 437562 441527 444427 447217 450562
57342D50562L210K542K603L394L820L660L524L387K981K935L776M567M355L964
$$ 450562 453772 456314 458917 462311 466131 469791 473315 476702 479683 482618 486394 490961 495316 499280
57328D99280M491N154M720L962M332N224N089M378M693N709N727M850M773N706
$$ 499280 503771 508925 513645 517607 521939 527163 532252 536630 541323 547032 552759 557609 562382 568088
57314E68088O190N924O104O895P126O686O713P281P207O449O337P096P456P025
$$ 568088 574278 580202 586306 593201 600327 607013 613726 621007 628214 634663 641000 648096 655552 662577
57300F62577O868P330P472P123P340Q314Q885Q722Q930R891J0433R974R599J0214
$$ 662577 669445 676775 684247 691370 698710 707024 715909 724631 733561 743452 753885 763859 773458 783672
57286G83672J1186J1676J1832J1973J1921J1806J2313J3507J4486J4625J4171
$$ 783672 794858 806534 818366 830339 842260 854066 866379 879886 894372 908997 923168
57275I23168J3427J2546J2129J2770J3826J4014J3337J3070J3716J4425J4593
$$ 923168 936595 949141 961270 974040 987866 1001880 1015217 1028287 1042003 1056428 1071021
57264A071021J4587J4602J4289J3824J4055J5171J6400J7190J7655J7717J7138
$$ 1071021 1085608 1100210 1114499 1128323 1142378 1157549 1173949 1191139 1208794 1226511 1243649
57253A243649J6458J6702J7928J9210K0072K0792K1354K1383K1164K1425K2072
$$ 1243649 1260107 1276809 1294737 1313947 1334019 1354811 1376165 1397548 1418712 1440137 1462209
57242A462209K2338K2176K2279K2738K2974K2984K3402K4370K5497K6774K8396
$$ 1462209 1484547 1506723 1529002 1551740 1574714 1597698 1621100 1645470 1670967 1697741 1726137
57231A726137K9917L0764L1314L2236L3226L3720L4220L5414L6550L6428L5413
$$ 1726137 1756054 1786818 1818132 1850368 1883594 1917314 1951534 1986948 2023498 2059926 2095339
57220B095339L4696L4060L2448L0346K9390K9707K9844K9395K9514L0789L2590
$$ 2095339 2130035 2164095 2196543 2226889 2256279 2285986 2315830 2345225 2374739 2405528 2438118
57209B438118L4725L7663M0853M2888M3668M4523M5943M7072M7633M8379M9339
$$ 2438118 2472843 2510506 2551359 2594247 2637915 2682438 2728381 2775453 2823086 2871465 2920804
57198B920804M9640M9355M9580N0411N0802N0638N0844N1199N0360M8457M7275
$$ 2920804 2970444 3019799 3069379 3119790 3170592 3221230 3272074 3323273 3373633 3422090 3469365
57187C469365M7282M6837M5106M3350M2367M1101L8961L7323L7228L7602L7223
$$ 3469365 3516647 3563484 3608590 3651940 3694307 3735408 3774369 3811692 3848920 3886522 3923745
57176C923745L6727L7165L8106L8614L8775L8955L8793L8134L7824L8489L9602
$$ 3923745 3960472 3997637 4035743 4074357 4113132 4152087 4190880 4229014 4266838 4305327 4344929
57165D344929M0689M2244M4582M6978M8811N0445N2155N3485N4306N5236N6272
$$ 4344929 4385618 4427862 4472444 4519422 4568233 4618678 4670833 4724318 4778624 4833860 4890132
57154D890132N6424N5513N4768N4723N4049N1582M8091M4777M1323L6775L1292
$$ 4890132 4946556 5002069 5056837 5111560 5165609 5217191 5265282 5310059 5351382 5388157 5419449
57143E419449K5709K0169J4395Q722L888L59j452r14K309P955J5697K5087L4923
$$ 5419449 5445158 5465327 5479722 5488444 5492332 5492691 5491239 5490325 5492634 5500589 5516286 5541373 5576296
57130E576296M3656N0696N6097N8910N7448N1657M3855L6546L0878K7723K8517
$$ 5576296 5619952 5670648 5726745 5785655 5843103 5894760 5938615 5975161 6006039 6033762 6062279
57119F062279L4054M3571N5733O9337Q2554R3185J00775J07474J16127J28481
$$ 6062279 6096333 6139904 6195637 6264974 6347528 6440713 6541488 6648962 6765089 6893570
57109F893570J45618J68520J97172K30375K67516L09882L59945M20687M96218
$$ 6893570 7039188 7207708 7404880 7635255 7902771 8212653 8572598 8993285 9489503
57100I489503N91727P11951Q60730J042904J265689J537441J865385K254169K704637
$$ 9489503 10081230 10793181 11653911 12696815 13962504 15499945 17365330 19619499 22324136
57091B2324136L212693L769629M363600M979866N599220O196390O739180P188321
$$ 22324136 25536829 29306458 33670058 38649924 44249144 50445534 57184714 64373035
57083F4373035P499201P626286P528534P175877O559806N703930M659475L479496
$$ 64373035 71872236 79498522 87027056 94202933 100762739 106466669 111126144 114605640
57075A14605640K192624Q05517o66530k173226l631820m950594o051528o883205
$$ 114605640 116798264 117603781 116937251 114764025 111132205 106181611 100130083 93246878
57067I3246878p425633p686863p692884p479157p089045o572852n981131n357073
$$ 93246878 85821245 78134382 70441498 62962341 55873296 49300444 43319313 37962240
57059C7962240m734949m141538l594901l103133k667868k288912j964267j688368
$$ 37962240 33227291 29085753 25490852 22387719 19719851 17430939 15466672 13778304
57051A3778304j454053j255888j089643r50042q31614p30780o44842n70164n03715
$$ 13778304 12324251 11068363 9978720 9028678 8197064 7466284 6821442 6251278 5747563
57042E747563m45243l95400l52789l15088k81839k53525k28935k06134j85233
$$ 5747563 5302320 4906920 4554131 4239043 3957204 3703679 3474744 3268610 3083377
57033C083377j67531j52494j38167j24049j11146r9516q8088p6584o5420n3925
$$ 3083377 2915846 2763352 2625185 2501136 2389990 2290474 2202386 2125802 2060382 2006457
57023B006457m0716k5711j0152M829J7889K6598K9143K6735K2624J9084J7045
$$ 2006457 1965741 1940030 1929878 1934707 1952596 1979194 2008337 2035072 2057696 2076780 2093825
57012B093825J7649K1867K8519L4325L5564K8535R975k0304n7298r3236j22101
$$ 2093825 2111474 2133341 2161860 2196185 2231749 2260284 2270259 2249955 2192657 2099421 1977320
57001A977320j40823j47918j43819j32066j17423j02521q7807p3970o2133n2160
$$ 1977320 1836497 1688579 1544760 1412694 1295271 1192750 1104943 1030973 968840 916680
56991I16680m3152l5367k9486k4472j8521j2002o893l368N68N709J0180J1730
$$ 916680 873528 838161 808675 784203 765682 753680 746787 743419 743987 749696 759876 771606
56979G71606R509L408o100j6802k5361l0056l1737l1759l0404k7589k3734j9453
$$ 771606 781115 784523 778423 761621 736260 706204 674467 642708 612304 584715 560981 541528
56967E41528j5329j2021r569o900l162R06M195P200J1169J5974K0657K5477L0923
$$ 541528 526199 514178 504609 497709 494547 495453 499648 506848 518017 533991 554648 580125 611048
56954F11048L4756L2632K2521O980r369k3042l2275l6610l6982l5134l2075k7802
$$ 611048 645804 678436 700957 707937 698568 675526 643251 606641 569659 534525 502450 474648
56942D74648k2539j7240j2604q492m515m11L975Q488J2626J6503K1239K7645L5025
$$ 474648 452109 434869 422265 413773 409258 408847 412822 421310 433936 450439 471678 499323 534348
56929E34348M1845M6377M5822L6759J8702l614k3540l7602m5924m9223m7982m3885
$$ 534348 576193 622570 668392 705151 723853 720239 696699 659097 613173 563950 515968 472083
56917D72083l9175l4393k8831k2959j8372j5382j2864j0369q447p020n490m308
$$ 472083 432908 398515 369684 346725 328353 312971 300107 289738 281291 274271 268781 264473
56905B64473m326m689l619j283K99L35O5L59P23R52J652K656K912K422K490L660
$$ 264473 260147 255458 251839 250556 250855 251190 251255 251614 252337 253289 254941 257597 260509 262931 265421 269081
56889B69081N142O535Q420J1020J3946J7239K0739K2417J9475J1620J521q066
$$ 269081 274223 280758 289178 300198 314144 331383 352122 374539 394014 405634 407155 399089
56877C99089j5818k0757k2087k0620j8292j5718j2012p224k769R53N163J0378
$$ 399089 383271 362514 340427 319807 301515 285797 273785 266561 263792 264745 269908 280286
56865B80286J5464J9736K4091K9403L5552M2604N1143O0606O8406P1093O5411
$$ 280286 295750 315486 339577 368980 404532 447136 498279 558885 627291 698384 763795
56854G63795M9216K3858m374k7804m3000n1232n3935n0868m3052l3969k6199j9134
$$ 763795 813011 836869 832495 804691 761691 710459 656524 605656 562604 528635 502436 483302
56842D83302j1431l422M173J1826K0083K8635L7723M8755O2452P7902R3915J08720
$$ 483302 471871 468449 472622 484448 504531 533166 570889 619644 682096 759998 853913 962633
56830I62633J17088J10713Q4482M1989o355m9756q1260r8405j02646r7997q8562
$$ 962633 1079721 1190434 1274916 1316905 1310550 1260794 1179534 1081129 978483 880486 791924
56819G91924p6858o4219n1588l9421k7864j7442q586m09Q598J8507K8160L7578
$$ 791924 715066 650847 599259 559838 531974 514532 505946 505537 514135 532642 560802 598380
56807E98380M8300O0823P2997Q0971Q0119O5896L7235J05l4920o0156p4603q0529
$$ 598380 646680 707503 780500 861471 941590 1007486 1044721 1044826 1009906 949750 875147 794618
56795G94618p9562p3251o4305n4827m5059l5229k6759k0161j3878o852l34M592
$$ 794618 715056 641805 577500 522673 477614 442385 415626 395465 381587 374735 374401 378993
56783C78993R344J5752K3307L0376L6534M1401M2346L5933K1589K514j6694l2359
$$ 378993 388337 404089 427396 457772 494306 535707 578053 613986 635575 638089 621395 589036
56771E89036m2619m7502m8142m5531m0437l4369k9113k4995k1087j7359j4876
$$ 589036 546417 498915 450773 405242 364805 330436 301323 276328 255241 237882 223006
56760B23006j3513j1594q613o219n524n444m764l959l724l580l149l029l274k824
$$ 223006 209493 197899 189286 183067 177543 172099 167335 163376 159652 156072 152923 149894 146620 143796
56746A43796j580j114k076k942k585k023k157j968o41N43L18m16l87j48o09r92
$$ 143796 142216 141102 139026 136084 133499 131476 129319 127351 126710 127253 127571 127155 126768 126620 126011 125019
56730A25019k66Q31J041N92K82ml18J55J377J616J34j059p3J923K708K296K007
$$ 125019 124753 125584 126625 127217 127499 127495 127177 127332 128709 130325 130459 129400 129327 131250 133958 136254 138261
56713A38261J784Q51j71j40N12P08P39J375J968J522P46R94J946K291J890J435
$$ 138261 140045 140896 140725 140585 141097 141805 142544 143919 145887 147409 148155 149149 151095 153386 155276 156711
56697A56711P88m93j720j941j529j310j034k71J57o06j761k040j647j396j005
$$ 156711 157499 157006 155286 153345 151816 150506 149472 149201 149358 148752 146991 144951 143304 141908 140903
56682A40903M6R91Q99L55L33M45p9p11p52q59j691k177j161L25N03m60j073r84
$$ 140903 140949 141940 142839 143194 143527 143972 143893 143182 142430 141571 139880 137703 136542 136867 137370 136910 135837 134853
56664A34853p56k41Q86J757J497R23J246J951J854J308J428K032K275K396K941
$$ 134853 134097 133856 134742 136499 137996 138919 140165 142116 143970 145278 146706 148738 151013 153409 156350
56649A56350L312K925K787L825M918M633L808M052M846M609L592L163L065K082
$$ 156350 159662 162587 165374 169199 174117 178750 182558 186610 191456 196065 199657 202820 205885 207967
56635B07967O85M09J049J056K41l32o94j648k579k199j174j410k887l772l594
$$ 207967 208652 209061 210110 211166 211407 211075 210381 208733 206154 203955 202781 201371 198484 194712 191118
56620A91118l751m662m934l813k296j360q92o94q64r55l66L69J69p62j171o57
$$ 191118 187367 182705 177771 173958 171662 170302 169410 168716 167852 166897 166531 166900 167069 166307 165136 164479
56604A64479O9N95R89R36K03m35j37N56O62L82M00L47l27q24j74R28J276J241
$$ 164479 164548 165143 166132 167068 167271 166836 166699 167255 167917 168299 168699 169046 168719 167895 167721 168649 169925 171166
56586A71166J738K085J089n11r56k19L69N82J156J740J338L88J98O91P80M86O46
$$ 171166 172904 174989 176078 175567 174611 174392 174761 175343 176499 178239 179577 179965 180163 180854 181634 182120 182766
56569A82766J042R26Q34J774L194L890M199N098O027N989N922P378R525J0217
$$ 182766 183808 184734 185568 187342 190536 194426 198625 203723 209750 215739 221661 229039 238564 248781
56555B48781R456R058R386R231Q487Q083P573N683L091J803J885J604O82N23J241
$$ 248781 258237 267295 276681 285912 294399 302482 310055 315738 318829 320632 322517 324121 324803 325326 326567
56540C26567J357O01K01J51r55l054m217l707k919k942l387l944m848n597n333
$$ 326567 327924 328525 328726 328877 327922 324868 320651 316944 314025 311083 307696 303752 298904 293307 287974
56525B87974m582m542m920m646m226m903n934n540m167l802m331l762k066j466
$$ 287974 283392 278850 273930 269284 265058 260155 254221 248681 244514 240712 236381 232619 230553 229087
56511B29087k551l294k506j346p86l15K25J94m1N98J523J062m01p35K25L48j011
$$ 229087 226536 223242 220736 219390 218604 218289 218514 218708 218667 219265 220788 221850 221449 220714 220939 221287 220276
56494B20276j983j564j060j357j547j107q29q45k92N01J20j171j462m87o5p91
$$ 220276 218293 216729 215669 214312 212765 211658 210829 209984 209692 210193 210313 209142 207680 207193 207128 206337
56478B06337j121l77J92N2K50R83J051M33N98J607J723N75j83M5p0q22p37M92
$$ 206337 205216 204839 205031 205083 205333 206316 207367 207800 208398 210005 211728 212303 212120 212165 212095 211273 210536 211028
56460B11028J238R37R12J475J253J73jR84J109l17j429j161p68r72o81L47O54
$$ 211028 212266 213203 214115 215590 216843 217016 217015 217999 219108 218791 217362 216201 215433 214461 213780 214127 214781
56443B14781QJ04J280J703Q30M17J021R27k29k57J560K767J790M30M51Q48L97
$$ 214781 214789 214893 216173 217876 218706 219123 220144 221071 220842 220585 222145 224912 226702 227132 227583 228431 228828
56426B28828k9L31M68o7J05J442K205J464O34O07K46p53p36O80J404N68K08J431
$$ 228828 228799 229130 229598 229531 229636 231078 233283 234747 235381 235988 236234 235481 234745 235425 236829 237397 237605 239036
56408B39036K208J053l68l82n8o15j037m40j2m80m75O37J173K90k52N16Q83q2
$$ 239036 241244 242297 241929 241547 241489 240874 239837 239397 239385 238905 238430 239067 240240 240530 240278 240794 241677 241595
56390B41595m13J051K172J228J0N05J541J483J352K420L444L134K854M003N190
$$ 241595 241182 242233 244405 245633 245643 246148 247689 249172 250524 252944 256388 259522 262376 266379 271569
56375B71569M623L056J856N72j168j906r71k85j192k028j244k34n52j119p24n02
$$ 271569 276192 279248 281104 281676 280508 278602 277631 277346 276154 274126 272882 272648 272096 270977 270253 269751
56359B69751j257j250N88K087J395L02R62K071J489J28m2M51J92j77L48O29m50
$$ 269751 268494 267244 267832 269919 271314 271616 272578 274649 276138 276266 276224 276675 276867 276690 277038 277667 277217
56342B77217j450p80M36O30O01J445K033J300O34J298J904J113L27R71J779J456
$$ 277217 275767 274987 275423 276053 276654 278099 280132 281432 282066 283364 285268 286381 286708 287679 289458 290914
56326B90914J285K286K758J523O51J776K889K026J080K335M207M144K999K830
$$ 290914 292199 294485 297243 298766 299417 301193 304082 306108 307188 309523 313730 317874 320873 323703
56312C23703L010K261J792K737L185J496j93L87J495P82j11J252L234L076K094
$$ 323703 326713 328974 330766 333503 336688 338184 337991 338378 339873 340655 340544 341796 345030 348106 350200
56297C50200L154N335N905N430O167P260O296M003K823K436J127p7Q77K811L038
$$ 350200 353354 358689 364594 370024 376191 383451 389747 393750 396573 399009 400136 400059 400936 403747 406785
56282D06785J945J716K237K272K827N136P222O756N371N875P247O934N894O595
$$ 406785 408730 410446 412683 414955 417782 422918 430140 436896 442267 448142 455389 462323 468217 474812
56268D74812P982P579O648Q139J1037J1980J1122J1346J2892J3781J4382J6622
$$ 474812 482794 490373 497021 505160 516197 528177 539299 550645 563537 577318 591700 608322
56256F08322J9661K1265K2362K5544L0159L3670L6626M1497M7737N2851N7208
$$ 608322 627983 649248 671610 697154 727313 760983 797609 839106 886843 939694 996902
56245I96902O2961O9410P4297P8503Q4450R1063R5303R7440R9721J01023R8259
$$ 996902 1059863 1129273 1203570 1282073 1366523 1457586 1552889 1650329 1750050 1851073 1949332
56234A949332R2025Q5466P8372O7781N3694L8958K4130P704r251k3923l6511m9191
$$ 1949332 2041357 2126823 2205195 2272976 2326670 2365628 2389758 2397462 2388211 2364288 2327777 2278586
56222B278586o1139o9759p5834q2162q7894q9725q7973q5969q4137q0210p4643
$$ 2278586 2217447 2147688 2071854 1989692 1901798 1812073 1724100 1638131 1553994 1473784 1399141
56211A399141p0219o6775o1854n6074n2301n0056m6265m1125l7562l5483l2248
$$ 1399141 1328922 1262147 1200293 1144219 1091918 1041862 995597 954472 916910 881427 849179
56200H49179k8326k6557k6252k3946j9756j7048j6119j4132j1122r978j0499r527
$$ 849179 820853 794296 768044 744098 724342 707294 691175 677043 665921 655943 645444 635917
56188F35917o987n848o065m668j869j015k264k366r43r49k660l129j981j837k743
$$ 635917 628930 623082 617017 612349 610480 609465 607201 604835 603892 602943 600283 597154 595173 593336 590593
56173E90593k034J18Q37J93Q80K462K028K96O97K659K417L87Q47M101N936N215
$$ 590593 588559 588677 589514 589707 590587 593049 595077 595373 596070 598729 601146 601533 602380 606481 612417 617632
56157F17632N167O625O867N833O635R283J0452J0053J1356J4252J5279J4645J6192
$$ 617632 622799 629424 636291 642124 648759 658042 668494 678547 689903 704155 719434 734079 750271
56144G50271K0009K2223K2605K5040K9977L3898L6832M2744N1733N9541O5457
$$ 750271 770280 792503 815108 840148 870125 904023 940855 983599 1035332 1094873 1160330
56133A160330P3038Q2229Q8877R2845R8402J05518J09142J08313J07400J06890
$$ 1160330 1233368 1315597 1404474 1497319 1595721 1701239 1810381 1918694 2026094 2132984
56123B132984J01676R0356P7716O6158N3185L9291K9562K4878J9908J2141M717
$$ 2132984 2234660 2325016 2402732 2468890 2522075 2561366 2590928 2615806 2635714 2647855 2652572
56112B652572j757j1473k5054l7363m6180n4885o4439p1312p5522q2009r1485
$$ 2652572 2650815 2639342 2614288 2576925 2530745 2475860 2411421 2340109 2264587 2182578 2091093
56101B091093r8635j01540j03904j05746j01470q9986p7496o7406n6723m4890
$$ 2091093 1992458 1890918 1787014 1681268 1579798 1489812 1412316 1344910 1288187 1243297
56091A243297l6387l1632k5204j6247j0715j0201q691l777p08j632j345K279M119
$$ 1243297 1206910 1175278 1150074 1133827 1123112 1112911 1104220 1100443 1099735 1098103 1096758 1099037 1103156
56078A103156K183J723M878O608N111N621R639J1321Q915Q696J2885J5064J2476
$$ 1103156 1105339 1107062 1111940 1118548 1123659 1129280 1138919 1150240 1159155 1167851 1180736 1195800 1208276
56065A208276J1337J4764J7081J5571J6043K0846K3254J9912J7193J8903J9481
$$ 1208276 1219613 1234377 1251458 1267029 1283072 1303918 1327172 1347084 1364277 1383180 1402661
56054A402661J5763J3525J5698J6150J1977R916J3569J6432J4654J4395J9256
$$ 1402661 1418424 1431949 1447647 1463797 1475774 1485690 1499259 1515691 1530345 1544740 1563996
56043A563996K2935K1778K2020K6987K9963K7519K6763L1523L4632L2066L0981
$$ 1563996 1586931 1608709 1630729 1657716 1687679 1715198 1741961 1773484 1808116 1840182 1871163
56032A871163L5490L8461L6010L5730M1602M5513M3012M2483M9016N4533N3849
$$ 1871163 1906653 1945114 1981124 2016854 2058456 2103969 2146981 2189464 2238480 2293013 2346862
56021B346862N4656O1324O5079O1287N9691O6019P0478O6645O4353P1049P8018
$$ 2346862 2401518 2462842 2527921 2589208 2648899 2714918 2785396 2852041 2916394 2987443 3065461
56010C065461P8319Q0394Q9999R7083R5164R5123J04686J13250J12788J14051
$$ 3065461 3143780 3224174 3314173 3411256 3506420 3601543 3706229 3819479 3932267 4046318
56000D046318J25613J36845J39007J42830J57088J70650J74459J79942J96162
$$ 4046318 4171931 4308776 4447783 4590613 4747701 4918351 5092810 5272752 5468914
55991E468914K10921K14850K21354K41259K61414K70811K83303L10685L38799
$$ 5468914 5679835 5894685 6116039 6357298 6618712 6889523 7172826 7483511 7822310
55982G822310L55410L75398M11909M50079M77251N10369N63845O20488O65785
$$ 7822310 8177720 8553118 8965027 9415106 9892357 10402726 10966571 11587059 12252844
55973A2252844P19194P97779Q82648R57804J046649J170901J311245J451182J619432
$$ 12252844 12972038 13769817 14652465 15610269 16656918 17827819 19139064 20590246 22209678
55964B2209678J842796K100942K379214K719810L165345L704266M335840N132581
$$ 22209678 24052474 26153416 28532630 31252440 34417785 38122051 42457891 47590472
55956D7590472O165592P427986Q911248J0688311J2834855J5363535J8358702
$$ 47590472 53756064 61184050 70095298 80783609 93618464 108981999 127340701
55949A27340701K2075458K6744057L2345462L8642736M5042820M9883038N0039311
$$ 127340701 149416159 176160216 208505678 247148414 292191234 342074272 392113583
55942C92113583M2285248K5964675M375720j6893579l3226884m2882431m6500847
$$ 392113583 434398831 460363506 464739226 447845647 414618763 371736332 325235485
55935C25235485m5660841m2004654l6978415l1646659k6578094k2007910j8071907
$$ 325235485 279574644 237569990 200591575 168944916 142366822 120358912 102287005
55928A02287005j4830162j2204945j0060317q321829o948979n855576m946871
$$ 102287005 87456843 75251898 65191581 56869752 49920773 44065197 39118326
55921C9118326m193508l595760l112822k691475k327629k038113j802333j585977
$$ 39118326 34924818 31329058 28216236 25524761 23197132 21159019 19356686 17770709
55913A7770709j392846j241881j118972r98326q86786q02964p35360o62530n92992
$$ 17770709 16377863 15135982 14017010 13018684 12131898 11328934 10593574 9931044 9338052
55904I338052n45707n11132m68910m25213l96826l76083l45852l12843k93185
$$ 9338052 8792345 8281213 7812303 7387090 6990264 6614181 6268329 5955486 5662301
55895E662301k80413k58921k34490k21396k13176j95293j73733j62983j57979
$$ 5662301 5381888 5122967 4888477 4667081 4453905 4258612 4084879 3921896 3763917
55886C763917j45084j29088j22842j21188j10835r5879q8830q5911p5296o0782
$$ 3763917 3618833 3489745 3366903 3245715 3134880 3039001 2950171 2864260 2788964 2728182
55876B728182n4145n2428m5108l5560l3889l6378l2979k7535l0107l6799l7308
$$ 2728182 2674037 2621609 2576501 2540941 2507052 2470674 2437695 2410160 2380053 2343254 2305946
55865B305946l5235m1114n2085n7799n9974o7082p5760p6287p0926o8846o8366
$$ 2305946 2270711 2229597 2177512 2119713 2059739 1992657 1916897 1840610 1769684 1700838 1632472
55854A632472o1790n2396m9052m9040m3489l5038l3127l6194l5219l0795l0362
$$ 1632472 1570682 1518286 1469234 1420194 1376705 1341667 1308540 1272346 1237127 1206332 1175970
55843A175970l2488k9912k4618k4212k6726k4320j8687j7765k0353j8845j4317
$$ 1175970 1143482 1113570 1088952 1064740 1038014 1013694 995007 977242 956889 938044 923727
55832I23727j4129j7268j6432j2288j1621j3759j2445q830r125j1716j0097o209
$$ 923727 909598 892330 875898 863610 851989 838230 825785 816955 807830 796114 786017 779808
55820G79808p441j2460j3462j0637j0981j4308j3797r387p688r240q304m706l788
$$ 779808 772367 759907 746445 735808 724827 710519 696722 687335 679647 670407 662103 657397 653609
55807F53609n175l429P61J592k70J401O501Q948Q381J0139J3950J3930R794P147
$$ 653609 648434 645005 645766 647358 647088 648489 654990 663938 672319 682458 696408 710338 720132 727279
55793G27279O535K955l626p825r095j2168j7020j8543j6471j5748j6771j5183
$$ 727279 733814 736769 733143 725318 716223 704055 687035 668492 652021 636273 619502 604319
55781F04319j1381j0393j1930j0586o271m603o348o317l563k805m594l696J136
$$ 604319 592938 582545 570615 560029 553758 549155 542807 536490 532927 530122 525528 521832 522968
55768E22968M941N610O463Q284P452L571Q04mk693q005j2112j3963j6476j9523
$$ 522968 527909 533519 539982 548266 555718 559289 560093 560089 557396 549391 537279 523316 506840 487317
55754D87317j9459j6534j5087j5555j3991j0189q391r082q118m997m008n864o199
$$ 487317 467858 451324 436237 420682 406691 396502 388111 379029 370911 365914 361906 356042 349843
55741C49843l750k284k970k543m80l74k508k670j22Q03j157j870L46J800N23p09
$$ 349843 346093 343809 340839 338296 337816 337442 334934 332264 332142 332945 331788 329918 330264 332064 332587 331878
55725C31878o30j944n241o956n754m785n566n648m155l564m211l170k49J029L1
$$ 331878 331248 329304 324063 317107 311353 306568 301002 295354 291199 287635 283424 280254 280005 281034 281065
55710B81065M02L115M633L627L258M715M916K785J594K681K742j03l252m842o526
$$ 281065 281467 284582 289215 292842 296100 300815 305731 308516 310110 312791 315533 315430 312178 307336 300810
55695C00810q873r468p762o553o707n696l096k010l201l431j465j71p38m88J612
$$ 300810 291937 282469 274707 268154 261447 255751 252655 250645 247444 244013 242548 242377 241639 241151 242763
55680B42763K897K474L007N020N239K824J441K639K997N23j694j270m99j563k774
$$ 242763 245660 248134 251141 256161 261400 264224 265665 268304 271301 271824 270130 268860 268361 266798 264024
55665B64024k618k683l662l172m16J599J177Q11K283L559L143K987M328N115M246
$$ 264024 261406 258723 255061 251889 251473 253072 254249 255060 257343 260902 264045 267032 271360 276475 280721
55650B80721L994N568O532N251L615K918J362j832m201m516n202p695r633r233
$$ 280721 284715 290283 296815 302066 305681 308599 309961 308129 303928 299412 294210 286515 276882 267649
55636B67649q264q192p597n876n211o315o499m459k706k759k445n77K84j328k687
$$ 267649 259385 251193 243596 237720 232509 226194 219695 215236 212530 209771 207326 206749 207033 205705 203018
55621B03018j683m16r61j744j261j259k917l882k449q78j330k224j724j147j731
$$ 203018 201335 200919 199958 198214 196953 195694 192777 188895 186446 185568 184238 182014 180290 179143 177412
55606A77412j813l74L58r99j970o31P52j50j575j185k04n56j128m71m0j285k488
$$ 177412 175599 175225 175583 174584 172614 171983 172735 172585 171010 169825 169621 169065 167937 167466 167426 166141 163653
55589A63653j853p38p18n31Q28J294o06k401j518N24J143Q91J229J196r6o13J235
$$ 163653 161800 161062 160344 159813 160641 161935 161329 158928 157410 157934 159077 159968 161197 162393 162297 161684 162919
55572A62919L179K702J354J762L024K948K353L170M458M270L466L826M262K695
$$ 162919 166098 168800 170154 171916 174940 177888 180241 183411 187869 192139 195605 199431 203693 206388
55558B06388Q4j056p55q52j556j896k214l274m209m054l770m323m515l264k044
$$ 206388 206472 205416 204661 203809 202253 200357 198143 194869 190660 186606 182836 178513 173998 170734 168690
55543A68690k422l145k434j117p59p40M0O13j03p61J29J367J290P42J036J100
$$ 168690 166268 163123 160689 159572 158813 158073 158113 158726 158623 157862 157991 159358 160648 161390 162426 163526
55527A63526l90k105k283j831k253k551j372j38q58k590l264l211l786m339l771
$$ 163526 163136 161031 158748 156917 154664 152113 150741 150603 149745 147155 143891 140680 136894 132555 128784
55512A28784l340m622o309o158m612l369k147j5J791J741J137K015L438L228J930
$$ 128784 125444 120822 114513 108355 103743 100374 98227 98212 100003 101744 102881 104896 108334 111562 113492
55497A13492J577J823Q62r06j530r10l65K83J984L685L520K003J148J122P17J89
$$ 113492 115069 116892 117754 116848 115318 114408 114043 114326 116310 119995 123515 125518 126666 127788 128505 128694
55481A28694O86J549J188N3p9P53R78L31q1k7j40k12K99P83M45j05j08k20r69
$$ 128694 129380 130929 132117 132170 132091 132844 133822 134153 134072 134045 133905 133693 133992 134775 135220 135115 135007 134787 133818
55462A33818j137J43J357R39k6P7L99n17j646j209L5K46j75K67J042P13j16j8
$$ 133818 132681 132824 134181 135120 135094 135171 135570 135053 133407 132198 132233 132479 132304 132571 133613 134326 134210 134192
55444A34192L52m20j454j013J65J92m28J73J596J803O78j32k38m16l76M87R92
$$ 134192 134544 134124 132670 131657 131822 132014 131586 131759 133355 135158 135836 135704 135466 135050 134674 135161 136153
55427A36153k26j886j821n66j81n29L1J144J132L60O21J695J848J224J479K501
$$ 136153 135927 134041 132220 131654 131473 130944 130975 132119 133251 133611 134232 135927 137775 138999 140478 142979
55411A42979K721K275K650L582L459K418J944J799N63j219j707j207j673l017
$$ 142979 145700 147975 150625 154207 157666 160084 162028 163827 164390 163171 161464 160257 158584 155567
55397A55567l252k148j469j683j619j391k270l695l571j803m01l8M18R05L8j704
$$ 155567 152315 150167 148698 147015 145396 144005 141735 138040 134469 132666 132265 132227 132645 133550 133588 131884
55381A31884j941j78J367J380J054J410J650R73j64j189j924j856p89M8m42j134
$$ 131884 129943 129765 131132 132512 133566 134976 136626 137599 137435 136246 134322 132466 131677 131725 131283 130149
55365A30149m26P48M08q52q65J13j63j763k441j655j189j521j055N14J389Q78
$$ 130149 129723 130471 130879 130027 129162 129275 129112 127349 124908 123253 122064 120543 119488 120002 121391 122269
55349A22269L60M89L46j18K25J070P76m79o02Q01J719J210N84N20K3j076j501
$$ 122269 122629 123118 123464 123346 123571 124641 125417 124938 124336 125137 126856 128066 128650 129170 129193 128117 126616
55332A26616j049r10r47L02K329K666R02m81k26jr48j746j428j080j379j224j56
$$ 126616 125567 124657 123710 124012 126341 129007 129909 129428 129202 129201 128253 126507 125079 123999 122620 121396 121240
55315A21240N07K53L99J309J387R8p56j67M31j3l70J79M90j07l45M80R83L03k89
$$ 121240 121747 122000 122399 123708 125095 125193 124437 124270 124701 124688 124318 124497 124987 124880 124535 125015 125998 126301 126012
55296A26012P5J52q07j271n6J465J726J396J562J587O77k57j84K33J70K56J002
$$ 126012 126087 126239 125432 124161 124105 125570 127296 128692 130254 131841 132518 132261 132077 132310 132480 132736 133738
55279A33738J354M82o14q55p92j065r13J63R33L53o39q17o42r26j112n25J19J10
$$ 133738 135092 135574 134960 134105 133313 132248 131335 131498 132431 132784 132145 131328 130686 129760 128648 128123 128242 128352
55261A28352K27J179J957J444L72QJ02k29o55l61K89M20J61J95M47M94M40M59
$$ 128352 128579 129758 131715 133159 133531 133539 133641 133412 132757 132396 132685 133105 133266 133461 133908 134402 134842 135301
55243A35301K03l78n44P7P68Q66O47M49O2m70o31n16q71j546j472o12k46p27q21
$$ 135301 135504 135126 134582 134659 135427 136293 136940 137389 137451 136981 136350 135834 134963 133417 131945 131333 131087 130360 129539
55224A29539LO02K82j4L78O61L87M69J201J271M8r93n87L80O48N16N74K52p81
$$ 129539 129542 130144 130426 130412 130790 131451 131838 132307 133508 134779 134827 133834 133247 133627 134275 134791 135365 135617 134836
55205A34836j409q99l38p10j080l59O87Q83O42P96Q28O3o67l67K90J89k73j92
$$ 134836 133427 132528 132190 131480 130400 130041 130728 131611 132253 133049 133877 133940 133273 132906 133196 133385 133112 132920
55187A32920Jn57j374j404q02l45N1P26J101N69k09l21n9p0qO00J082O18l06p19
$$ 132920 132921 132364 130990 129586 128784 128439 128490 129216 130317 130886 130677 130356 130297 130227 130219 130819 131901 132519 132213 131494
55167A31494n62j77N71J457J368m1j283j001R6O22O59R39J080L70n74o28O7O10
$$ 131494 130932 130755 131326 132783 134151 134110 132827 131826 131922 132544 133203 134142 135222 135592 135018 134390 134457 135067
55149A35067Q68J030N73p60j791j387l70k51p13k29J254K079J328m7p09l77L73
$$ 135067 135935 136965 137538 136778 134987 133600 133230 132979 132266 132037 133291 135370 136698 136651 135942 135565 135938
55132A35938R16J004Q41P14M35l16j058q68M7L71l38r92p85k81l0L58R12P25l42
$$ 135938 136854 137858 138699 139413 139848 139532 138474 137606 137653 138024 137686 136694 135909 135628 135598 135956 136868 137593 137251
55113A37251r61m30J17j98m39K70J018Q75P28J543K259J470n5n50M0M75M46M69
$$ 137251 136290 135860 135977 135779 135340 135610 136628 137503 138231 139774 142033 143503 143448 142898 142938 143413 143859 144328
55095A44328L66k21n19L30J497J533N87k1K3l6m43p68r12r25m32N17Q54j4q87
$$ 144328 144694 144473 143954 144284 145781 147314 147901 147880 147903 147867 147424 146656 145744 144819 144387 144904 145758 145744 144857
55076A44857m63O32R50N15L42N41N18L72M02J8j208k136j414L69J574J832J840
$$ 144857 144394 145026 145976 146491 146833 147374 147892 148264 148666 148684 147476 145340 143926 144295 145869 147701 149541
55059A49541J593O27n20r35r06j276j737j425o45l32m12k93k95q55j028J92J747
$$ 149541 151134 151761 151241 150306 149400 148124 146387 144962 144317 143985 143573 143280 142985 142130 141102 141294 143041
55042A43041J735L50m82p9M80N08L89J87m52j004n77L89O47K58L49Q44M42j008
$$ 143041 144776 145126 144644 144565 145045 145553 145942 146129 145677 144673 144096 144485 145132 145390 145739 146583 147025 146017
55024A46017k051j831j073n59k14J9j54m66j90O24J178J239J263J272R28N23N96
$$ 146017 143966 142135 141062 140503 140289 140308 140154 139688 139498 140122 141300 142539 143802 145074 146002 146525 147121
55007A47121P12J20o07j66J257K072J635R09O04K82l10n82k46R2m0l15l01O1P53
$$ 147121 147833 147953 147346 147180 148437 150509 152144 153053 153657 153939 153629 153047 152801 152893 152853 152538 152237 152298 153051
54988A53051J555J786J092L12M14R17N83n67j285j072o95o85o96m77l14l28k92
$$ 153051 154606 156392 157484 157796 158210 159127 159710 159143 157858 156786 156091 155406 154710 154233 153919 153591 153299
54971A53299k11k12j6N82J074R95Q45J194J463Q40j83n71m29m90n30R4R07J042
$$ 153299 153088 152876 152860 153442 154516 155511 156356 157550 159013 159853 159670 159099 158670 158180 157650 157744 158651 159693
54953A59693R50J520K004R49r85j477J30J970K380J568L39r07j525q52L91N80
$$ 159693 160643 162163 164167 165116 164131 162654 162784 164754 167134 168702 169041 168134 166609 165757 166148 166728
54937A66728m80j284j017n12m12j65N31R44P72Q93J857K863L038K647K324K189
$$ 166728 166248 164964 163947 163435 163023 162858 163389 164333 165105 165998 167855 170718 173756 176403 178727 180916
54921A80916K235K774L930N392O899Q262Q978Q709P943P203N888L202j44k655
$$ 180916 183151 185925 189855 195247 202146 210408 219386 228095 236038 243241 249129 252331 252187 249532
54907B49532m212n873p676q475q049p520p318o581n010l646l252l418l654l944
$$ 249532 245320 239447 231771 223296 215247 207727 200409 193828 188818 185172 181920 178502 174848 170904
54893A70904l782k357j50J182J072P40J097J524J285P20L44J01R6P84J985K922
$$ 170904 167122 164765 164615 165797 166869 167609 168706 170230 171515 172235 172579 172680 172776 173560 175545 178467
54877A78467L617M880O574P462P192O804O866O683N896N111M234K055j584m821
$$ 178467 182084 186964 193538 201000 208192 214996 221862 228545 234441 239552 243786 245841 244257 239436
54863B39436o101o047o045o325o478o547o557n983m723l582k967k267j237p75
$$ 239436 233335 227288 221243 214918 208440 201893 195336 189353 184630 181048 178081 175814 174577 173802
54849A73802j411k230k282j944j917j970j645j245j084p54k7M03k3p45r89p97
$$ 173802 172391 170161 167879 165935 164018 162048 160403 159158 158074 157320 157293 157696 157673 156928 155939 155142
54833A55142m75M2N29K13r26j573p25Q41J608J162J60p24j130r25m69m03o84n84
$$ 155142 154667 154709 155238 155451 154525 152952 152227 153068 154676 155838 155998 155274 154144 153219 152750 152347 151663 151079
54815A51079R7P59J136J623K060J581K68m55J52J004R89O14P87J172R13J30n22
$$ 151079 151176 151935 153071 154694 156754 158335 158603 158148 158300 159304 160293 160907 161694 162866 163779 163909 163387
54798A63387r46j274j120k47P07J083J122J243J170O50K80O35J160R10j05j098
$$ 163387 162441 161167 160047 159800 160507 161590 162712 163955 165125 165775 166055 166690 167850 168760 168655 167557
54782A67557j596j600j101j77Q16J592K201K624K667K429K306K369K412K654L434
$$ 167557 165961 164361 163260 163083 163899 165491 167692 170316 172983 175412 177718 180087 182499 185153 188587
54767A88587M269M381M212M995O657P741P745P825Q516Q622P270N313L584J351
$$ 188587 192856 197237 201449 206444 213101 220842 228587 236412 244928 253550 260820 266133 269717 271068
54753B71068k009n325p112p637p938p931p048n868n428n537n214m338l564l085
$$ 271068 269059 263734 256622 248985 241047 233116 226068 220200 214772 209235 204021 199683 196119 193034
54739A93034k688k551k857k999k289j104l74l16m84n98n15R5J269K423L184L923
$$ 193034 190346 187795 184938 181939 179650 178546 178172 177856 177372 176774 176259 176354 177623 180046 183230 187153
54723A87153M897N664N959O227O618O494N730N344N806N920M526K239K04j734
$$ 187153 192050 197714 203673 209900 216518 223012 228742 234086 239892 245812 250338 252577 252781 251047
54709B51047m146o254o799o075n480n447n335m959m737m533l806k771k151j894
$$ 251047 246901 240647 233848 227773 222293 216846 211511 206552 201815 197282 193476 190705 188554 186660
54695A86660j340n80m44j116j771j745j215o72m06n20q94j188j245j256j272j100
$$ 186660 185320 184740 184296 183180 181409 179664 178449 177777 177371 176851 175957 174769 173524 172268 170996 169896
54679A69896r08j171j646j430n32k67j238k115j501L6J005J105R55N88k51r51
$$ 169896 168988 167817 166171 164741 164209 163942 162704 160589 159088 159124 160129 161234 162189 162777 162526 161575
54663A61575o99N4K17k27m32k57l30p42r10o25k03K61Q14J095Q58O16Q39R40J58
$$ 161575 160876 160930 161147 160920 160488 160231 159901 159159 158249 157624 157421 157682 158496 159591 160449 161065 161904 162844 163002
54644A63002r23r95J11J255J570J187N63M4j38j66o35j513j651l80J120J181r1
$$ 163002 162079 161084 161195 162450 164020 165207 165770 165814 165676 165510 164875 163362 161711 161331 162451 163632 163541
54627A63541j177j325j056p67k46M67R14R89R61P72K01m32o08m70n06o89p06o51
$$ 163541 162364 161039 159983 159216 158970 159437 160351 161340 162301 163073 163274 162842 162234 161764 161258 160569 159863 159212
54609A59212o08q7J152K187K018J039L55M7n15j125q90J97J162J523J604J472
$$ 159212 158604 158517 159669 161856 163874 164913 165268 165315 164800 163675 162785 162982 164144 165667 167271 168743
54593A68743Q33jj77M03Q80O48j3n60o96l30K87N85L55J69M64P81O25L60L95K58
$$ 168743 169576 169575 169398 169801 170681 171329 171316 170756 170060 169730 170017 170602 170957 171126 171590 172371 172996 173356 173751 174009
54573A74009m38r02l31N87P48M93Q52J510J316M48J58N40L94n78j221q81k99j55
$$ 174009 173571 172669 172338 172925 173673 174166 175018 176528 177844 178292 178450 178990 179384 178806 177585 176704 176405 176250
54555A76250j05K44N90N88L35j8l12j12O63J079L05q74r67J7O83M44J05K71O54
$$ 176250 176145 176389 176979 177567 177902 177884 177572 177460 178123 179202 179507 178633 177666 177683 178366 178810 178915 179186 179840
54536A79840J097J789K335J991J039N30O16M72rn1L57K33o12j150q97n89o59n70
$$ 179840 180937 182726 185061 187052 188091 188621 189237 189709 189700 189649 190006 190239 189627 188477 187580 186991 186332 185762
54518A85762j17O4k01k36N8q7o55m71P59J615J109J96J47O22N80k5n50q77j259
$$ 185762 185645 185709 185508 185272 185330 185243 184588 184117 184876 186491 187600 187796 187943 188565 189145 189120 188570 187693 186434
54499A86434j548j499j245q56j18P65J053O50M47R59J478J310Q59P46O82J62n19
$$ 186434 184886 183387 182142 181286 181168 181933 182986 183636 184083 185042 186520 187830 188689 189435 190117 190279 189760
54482A89760p84o58m15P6Q78J487J509J273J148Q77K91k8M12J058J095P27P97
$$ 189760 188976 188318 187903 187979 188857 190344 191853 193126 194274 195151 195442 195414 195826 196884 197979 198706 199503
54465A99503J469K059K072J652J094M77j51o41q99r41q29n92j97L67Q34P17l3
$$ 199503 200972 203031 205103 206755 207849 208326 208175 207534 206635 205694 204865 204273 204076 204443 205277 205994 205961
54448B05961p07o62k10j16m34o04m66l58l71l95p25j625k390j977o66J32j14m07
$$ 205961 205254 204592 204382 204266 203832 203228 202762 202404 202033 201638 200913 199288 196898 194921 194255 194387 194273 193866
54430A93866J05R32J229R34L53m26j127j144l83M27P64R22J286J638J690J541
$$ 193866 193971 194903 196132 197066 197419 196993 195866 194722 194339 194766 195530 196452 197738 199376 201066 202607
54414B02607J261O39k34q18q48o19l90j64j51n86r77m96O34J216P64J26M9L02
$$ 202607 203868 204507 204273 203455 202607 201988 201598 201434 201283 200697 199720 199224 199858 201074 201838 201964 202013 202315
54396B02315N71J078J696J608N91k74j8R22J538J638J655J699J566J220P42J92
$$ 202315 202886 203964 205660 207268 207859 207585 207567 208489 210027 211665 213320 215019 216585 217805 218547 218739
54380B18739j62q4N2m18j342j811j539j178j054p25j07J27k06l34P8L16L1K1P96
$$ 218739 218577 218493 218545 218127 216785 214974 213435 212257 211203 210478 210371 210498 210292 209958 210036 210352 210383 210404 211200
54361B11200J533J375O93J35m76j286j482n30O78J064R88J290J565Q73l52p15
$$ 211200 212733 214108 214801 214936 214460 213174 211692 211162 211840 212904 213892 215182 216747 217620 217268 216553
54345B16553K2O34L49j72NQ57J651J774J083n2r56j162q19m25k84m12o34p09o20
$$ 216553 216575 217209 217558 217386 217391 218248 219899 221673 222756 222704 221748 220586 219767 219342 219058 218646 218012 217303 216683
54326B16683q05j593k387k128p66M74O01j35r96j691k113j999j401q56o28m28
$$ 216683 215878 214285 211898 209770 209004 209478 210079 209944 208948 207257 205144 203145 201744 200888 200260 199832
54310A99832k11l87q62q42r5N17M10J83M44P19L60l30p53r99j284j201m87K18
$$ 199832 199621 199234 198372 197530 197435 197952 198362 198545 198989 199708 200068 199738 198985 197986 196702 195501 195014 195232
54292A95232K72J02L86P93N95rk33j4K1l71q00r24p36l83j99n48j203j341o28
$$ 195232 195504 195606 195992 196785 197380 197371 197138 197124 197145 196774 195974 195050 194314 193931 193732 193184 191981 190640 190012
54273A90012K34N30M62O07R92J293J313Q99Qp40m63O46J306R45M57O36J015R79
$$ 190012 190246 190776 191238 191845 192837 194130 195443 196342 196350 195610 195147 195793 197099 198044 198501 199137 200152 201131
54255B01131Q52J022J072P30N90R80J203Q15M63M27k07j750k698j887n34l84r96
$$ 201131 201983 203005 204077 204807 205397 206377 207580 208395 208858 209285 209078 207328 204630 202743 202209 201825 200829
54238B00829q79k87o55j847k272j511p72o75n29L5L66O2m28o87p13m19K37P24
$$ 200829 199950 199663 199008 197161 194889 193378 192606 191931 191402 191437 191803 191865 191437 190750 190037 189618 189855 190579
54220A90579N89L16M94O47J29l79J64J221J365N87R3R4l19j152j365r19r52j530
$$ 190579 191168 191484 191978 192625 192754 192375 192539 193760 195125 195712 195805 195899 195580 194428 193063 192144 191192 189662
54202A89662j165P15K537K706J525K24o62j106r63m26k33o44r53n48K47Q07R29
$$ 189662 188497 189212 191749 194455 195980 196204 195542 194436 193473 193047 192814 192170 191217 190669 190916 191723 192652
54185A92652O10j18p81o73K26J203J758J891J482M17o81r28n15m51q83r31l37
$$ 192652 193262 193144 192363 191690 191916 193119 194877 196768 198250 198667 197986 197058 196543 196092 195209 194278 193941
54168A93941K7k76n53l55k42n19m98J69N89j6r66j114m32L12P53R68P91N3q05
$$ 193941 193968 193692 193139 192784 192542 192023 191525 191694 192283 192267 191301 190187 189755 190067 190820 191788 192579 192632 191827
54149A91827j121q61n71o62j014j164o67M24J412J618J161O66L29o0l45q8N47
$$ 191827 190706 189845 189274 188612 187598 186434 185767 186191 187603 189221 190382 191048 191377 191317 190972 190884 191431
54132A91431Q74P99Q78J174J076M85J74N39R97R73O46K28m50j201j245l98M14
$$ 191431 192305 193104 193982 195156 196232 196717 196891 197430 198427 199400 200046 200274 199824 198623 197378 196980 197394
54115A97394M27Q2J17M76P81J107J504J477Q16L26P98J735J996J350N24k5m78
$$ 197394 197821 197903 198020 198496 199277 200384 201888 203365 204181 204507 205305 207040 209036 210386 210910 210885 210407
54098B10407q96r14l69L49O88M63n8l73j04O44J325J462R79P7q68j374j207p53
$$ 210407 209511 208597 208228 208577 209265 209728 209670 209297 209193 209837 211162 212624 213603 213680 212812 211438 210231 209478
54080B09478n97p20n81l8M51O39Q44J285J698J906K140K489K613K381K142K083
$$ 209478 208881 208161 207580 207542 207993 208632 209476 210761 212459 214365 216505 218994 221607 223988 226130 228213
54064B28213J871J339R70J113J312J051P56J355L002M833O021O616P297Q407R397
$$ 228213 230084 231423 232393 233506 234818 235869 236625 237980 240982 245815 251836 258452 265749 274156 283553
54049B83553R282P873O226N452N152L806Q20k566m765n584n943o349o349n376
$$ 283553 292835 300708 306934 312386 317538 321344 322164 319598 314833 309249 303306 296957 290608 285232
54035B85232l611j805n06M54J577K867L673L616L264L404L902L948L344K782K805
$$ 285232 281621 279816 279310 279764 281341 284208 287881 291497 294761 298165 302067 306015 309359 312141 314946
54020C14946L157L317L095K515J661Q32L66K55K76M02N36J43j097k428k802k487
$$ 314946 318103 321420 324515 327030 328691 329523 329889 330144 330420 330822 331358 331501 330404 327976 325174 322687
54004C22687k783l970m756m212l203l095l917m605m490l809l130k853k980l042
$$ 322687 319904 315934 311178 306966 303763 300668 296751 292146 287656 283847 280717 277864 274884 271842
53990B71842k525j644j185j397j624j331q35o04n17l31k58n78j019j134r42p61
$$ 271842 269317 267673 266488 265091 263467 262136 261301 260697 260180 259849 259591 259013 257994 256860 255918 255157
53974B55157p16p49p91o55j42N41P61K48m90p26k25P13J566K000K207K782L856
$$ 255157 254441 253692 252901 252246 252104 252645 253406 253654 253164 252438 252213 252926 254492 256492 258699 261481 265337
53957B65337M698M831N048O238P525P040M571J953N01m22j657k705k889k766l070
$$ 265337 270035 274866 279914 286152 293677 300717 305288 307241 307742 307320 305663 302958 300069 297303 294233
53942B94233l252k306m32J350K674L828M673M686L946L195K995L367M032M522
$$ 294233 290981 288675 288243 289593 292267 296095 300768 305454 309400 312595 315590 318957 322989 327511
53928C27511M373L653K925K402J717Q83O32J233J829J681J283J430J977K424L037
$$ 327511 331884 335537 338462 340864 342581 343464 344096 345329 347158 348839 350122 351552 353529 355953 358990
53913C58990M284N814O922P584Q086Q207P824P644Q233Q874Q643Q102Q463R469
$$ 358990 363274 369088 376010 383594 391680 399887 407711 415355 423588 432462 441105 449207 457670 467139
53899D67139R692Q843Q209Q467Q607P534N580L803K664K015J617J101p5k144m864
$$ 467139 476831 485674 493883 502350 510957 518491 524071 527874 530538 532553 534170 535271 535196 533052 528188
53884E28188p999j1426j4621j6658j7152j6690j6054j5371j4331j2821j1069r418
$$ 528188 520189 508763 494142 477484 460332 443642 427588 412217 397886 385065 373996 364578
53872C64578q151p343o729n987n207m787m854n057n028m730m279l728l147k708
$$ 364578 356427 349084 342355 336368 331161 326374 321520 316463 311435 306705 302426 298698 295551 292843
53858B92843k570k725k999l175l123k880k485j864j052m73n76j166j575j575j554
$$ 292843 290273 287548 284549 281374 278251 275371 272886 271022 269970 269497 268921 267755 266180 264605 263051
53843B63051j680j573j127q73j074j199q97p27j155j520j000r0J7p56j316j044
$$ 263051 261371 259798 258671 257798 256724 255525 254628 253901 252746 251226 250226 250136 250153 249397 248081 247037
53827B47037m56j40jK08M39O71J014J221P81j97p97l57O73J257R66L43K60J059
$$ 247037 246581 246441 246440 246648 247087 247758 248772 249993 250774 250577 249780 249423 250096 251353 252319 252662 252922 253981
53809B53981K212K879K766K283J805J257O91P13J709L004L484K973K333K344L070
$$ 253981 256193 259072 261838 264121 265926 267183 267874 268587 270296 273300 276784 279757 282090 284434 287504
53794B87504M194N355O081O003N313M579M131L893L786L822L861L741L560L434
$$ 287504 291698 297053 303134 309137 314450 319029 323160 327053 330839 334661 338522 342263 345823 349257
53780C49257L122K319J183J30p22j483k046k367k824l712m519m524l977l830m244
$$ 349257 352379 354698 355881 356011 355289 353806 351760 349393 346569 342857 338338 333814 329837 326007 321763
53765C21763m317l567k829l147m332n155m725l348k161k078k934l583l106j831
$$ 321763 317446 313879 311050 307903 303571 298416 293691 290343 288182 286104 283170 279587 276481 274650
53751B74650q98q68j257j384j168r60j013j309j626j692j496j376j519j528r05
$$ 274650 273752 272884 271627 270243 269075 268115 267102 265793 264167 262475 260979 259603 258084 256556 255651
53736B55651J14P48O77M04M45O78O47J83l93n56m2Q07J279J093P24O48O53M04
$$ 255651 255765 256513 257190 257594 258039 258717 259364 259547 259154 258598 258556 259363 260642 261735 262459 263107 263760 264164
53718B64164L01R25J862K022J211M79O90J454J870J698J323J107J199J611K133
$$ 264164 264465 265390 267252 269274 270485 270964 271654 273108 274978 276676 277999 279106 280305 281916 284049
53703B84049K401K347K292K384K289J749J118J050J761K892L906M453M458M063
$$ 284049 286450 288797 291089 293473 295762 297511 298629 299679 301440 304332 308238 312691 317149 321212
53689C21212L483K875K371K063J860J480Q66M03M50P84Q69N47O7m32r76j379j369
$$ 321212 324695 327570 329941 332004 333864 335344 336210 336613 337063 337847 338716 339263 339330 338898 337922 336543 335174
53672C35174j123j166j582j860j610j034m96p2K46L11P6k16l01k38k70n29r31
$$ 335174 334051 332885 331303 329443 327833 326799 326303 326231 326477 326788 326864 326648 326347 326109 325839 325310 324379
53655C24379j263j326j156j059j184j177o42J35M15K2l52j00N12Q07O35M51O18
$$ 324379 323116 321790 320634 319575 318391 317214 316572 316707 317122 317144 316792 316692 317204 318011 318646 319097 319715
53638C19715R97J249J292J293J339J233P92K38J20P32J759K553K635J939Q36L0
$$ 319715 320712 321961 323253 324546 325885 327118 327910 328148 328268 329000 330759 333312 335947 337886 338722 338752
53622C38752Q5Q23J518J827K196L052M016M362L961L292K763K450K372K522K769
$$ 338752 338837 339660 341178 343005 345201 348253 352269 356631 360592 363884 366647 369097 371469 373991 376760
53607C76760L046L488M102M549M578M387M179L782L165K884L306L847L676K935
$$ 376760 379806 383294 387396 391945 396523 400910 405089 408871 412036 414920 418226 422073 425749 428684
53593D28684K423K308K068J559J240J235J058M42k67o70o75k44N53J151R62K70
$$ 428684 431107 433415 435483 437042 438282 439517 440575 441017 440750 440080 439405 439161 439714 440865 441827 442097
53577D42097l8J91J59n41j259j312r29o47m31M3O89J082R33J40j210k611l353
$$ 442097 442059 442250 442409 441868 440609 439297 438368 437721 437290 437333 438022 439104 440037 440177 438967 436356 433003
53560D33003l291l040l129l320l133k589k014j474q25j00N17R83J381J733K053
$$ 433003 429712 426672 423543 420223 417090 414501 412487 411013 410188 410088 410605 411588 412969 414702 416755
53545D16755K384K630K633K466K438K686L038L357L634L681L226K470K190K935
$$ 416755 419139 421769 424402 426868 429306 431992 435030 438387 442021 445702 448928 451398 453588 456523
53531D56523M410N898P041P943Q733R341R629R623R687J0342J1655J2900J3289
$$ 456523 460933 466831 473872 481815 490548 499889 509518 519141 528828 539170 550825 563725 577014
53518E77014J3061J3304J4556J6098J6921J7004J7180J8058J9452K0768K1582
$$ 577014 590075 603379 617935 634033 650954 667958 685138 703196 722648 743416 764998
53507G64998K1878K1997K2390K3352K4913K6842K8643K9615K9299K7954K6438
$$ 764998 786876 808873 831263 854615 879528 906370 935013 964628 993927 1021881 1048319
53496A048319K5508K5278K5316K5101K4412K3443K2544K1819K1094K0305J9663
$$ 1048319 1073827 1099105 1124421 1149522 1173934 1197377 1219921 1241740 1262834 1283139 1302802
53485A302802J9369J9430J9917K0876K1780K1665K0324J8809J8125J7889J7069
$$ 1302802 1322171 1341601 1361518 1382394 1404174 1425839 1446163 1464972 1483097 1500986 1518055
53474A518055J5660J4660J4500J4492J3857J2447J0352P569M367J350j116l102
$$ 1518055 1533715 1548375 1562875 1577367 1591224 1603671 1614023 1621592 1625959 1627309 1626193 1623091
53462A623091m749o243q116j0864j4125j6872j8544j9481k0165k0689k1038k1265
$$ 1623091 1618342 1612099 1603983 1593119 1578994 1562122 1543578 1524097 1503932 1483243 1462205 1440940
53450A440940k1272k1024k1008k1795k3096k3959k4059k3966k3995k3583k2220
$$ 1440940 1419668 1398644 1377636 1355841 1332745 1308786 1284727 1260761 1236766 1213183 1190963
53439A190963k0292j8568j7381j6600j5927j4933j3261j1064q875o927n078l360
$$ 1190963 1170671 1152103 1134722 1118122 1102195 1087262 1074001 1062937 1054062 1047135 1042057 1038697
53427A038697k042j033J12J509K963M637O885R316J0976J1732J2609J4350J6483
$$ 1038697 1036655 1035622 1035734 1037243 1040206 1044843 1051728 1061044 1072020 1083752 1096361 1110711 1127194
53414A127194J8224J9558K0940K2578K4512K6727K8800L0097L0746L1690L3393
$$ 1127194 1145418 1164976 1185916 1208494 1233006 1259733 1288533 1318630 1349376 1381066 1414459
53403A414459L5216L6580L7981M0132M2775M5087M6821M8390N0132N2146N4511
$$ 1414459 1449675 1486255 1524236 1564368 1607143 1652230 1699051 1747441 1797573 1849719 1904230
53392A904230N7047N9082O0009O0056O0165O1096O2684O3814O3314O1191N8815
$$ 1904230 1961277 2020359 2080368 2140424 2200589 2261685 2324369 2388183 2451497 2512688 2571503
53381B571503N7390N6476N4776N2097M9428M7159M4524M1031L7205L3431K9247
$$ 2571503 2628893 2685369 2740145 2792242 2841670 2888829 2933353 2974384 3011589 3045020 3074267
53370C074267K4411J9540J4944R860L682k912q974j4625k0476k6467l2161l7667
$$ 3074267 3098678 3118218 3133162 3143022 3146704 3143792 3134818 3120193 3099717 3073250 3041089 3003422
53358C003422m3349m9007n4135n8499o1921o4047o4959o5345o5469o4644o2475
$$ 3003422 2960073 2911066 2856931 2798432 2736511 2672464 2607505 2542160 2476691 2412047 2349572
53347B349572n9931n8291n7611n7006n5938n4430n2540n0493m8821m7651m6380
$$ 2349572 2289641 2231350 2173739 2116733 2060795 2006365 1953825 1903332 1854511 1806860 1760480
53336A760480m4732m3386m2756m1934l9879l7006l4426l2203k9536k6340k3387
$$ 1760480 1715748 1672362 1629606 1587672 1547793 1510787 1476361 1444158 1414622 1388282 1364895
53325A364895k1087j9187j7601j6528j5775j4837j3594j2249j0824r327q123p457
$$ 1364895 1343808 1324621 1307020 1290492 1274717 1259880 1246286 1234037 1223213 1213886 1205763 1198306
53313A198306o906o061n268m959m698l760k201m62J545L997O253P563Q347R636
$$ 1198306 1191400 1185339 1180071 1175112 1170414 1166654 1164453 1163991 1165536 1169533 1175786 1183349 1191696 1201332
53299A201332J1514J3213J4443J5552J6649J7684J9117K1323K3574K4946K5939
$$ 1201332 1212846 1226059 1240502 1256054 1272703 1290387 1309504 1330827 1354401 1379347 1405286
53288A405286K7768L0171L1495L1125L0231K9756K9181K7940K6680K6148K5758
$$ 1405286 1433054 1463225 1494720 1525845 1556076 1585832 1615013 1642953 1669633 1695781 1721539
53277A721539K4247K1213J7394J3714J0618P988N449K838L58k041n026q987j3096
$$ 1721539 1745786 1766999 1784393 1798107 1808725 1816713 1822162 1825000 1825358 1823317 1818291 1809304 1796208
53264A796208j6128j8085k0031k2376k4468k5927k7256k8849l0454l1904l3421
$$ 1796208 1780080 1761995 1741964 1719588 1695120 1669193 1641937 1613088 1582634 1550730 1517309
53253A517309l4863l5611l5598l5523l5703l5562l4703l3581l2701l1995l1415
$$ 1517309 1482446 1446835 1411237 1375714 1340011 1304449 1269746 1236165 1203464 1171469 1140054
53242A140054l1298l1526l1247l0026k8580k7708k7179k6392k5449k4814k4307
$$ 1140054 1108756 1077230 1045983 1015957 987377 959669 932490 906098 880649 855835 831528
53231H31528k3267k1479j9361j7437j6071j5436j5257j4802j3593j1968j0681
$$ 831528 808261 786782 767421 749984 733913 718477 703220 688418 674825 662857 652176
53220F52176j0101j0032j0099j0069j0038j0411j1372j2364j2535j1839j1135
$$ 652176 642075 632043 621944 611875 601837 591426 580054 567690 555155 543316 532181
53209E32181j0984j0907j0229r133q380q235q255p950p312o660o235n997n780
$$ 532181 521197 510290 500061 490928 482548 474313 466058 458108 450796 444136 437901 431904 426124
53196D26124n607n686n962o008n630n306n534o007o048n630n249m933m254l319
$$ 426124 420517 414831 408869 402861 397231 391925 386391 380384 374336 368706 363457 358524 354270 350951
53182C50951k880l163l406k908j939j248j171j486j716j422o99l89j158k362k689
$$ 350951 348071 344908 341502 338594 336655 335407 334236 332750 331034 329612 328913 328524 327366 325004 322315
53167C22315j932j225j251j305o63J11O0p66j552j825j555o94N00J144N25r21
$$ 322315 320383 319158 317907 316602 315939 316050 316110 315344 313792 311967 310412 309718 310218 311362 311887 310966
53151C10966k064k315j868j066k44N8n19j519k042j770j159o73l31j9J78J41j04
$$ 310966 308902 306587 304719 303653 303409 303467 302948 301429 299387 297617 296458 295785 295454 295435 295613 295754 295650
53134B95650m04n48l63K6K38J05l0K56Q72J370J497J328R62M55K0o6K47Q23J563
$$ 295650 295246 294698 294335 294361 294599 294704 294674 294930 295802 297172 298669 299997 300959 301414 301434 301368 301615 302438 304001
53115C04001K312K643K158J121M16O06J267J490R35J00m46p14j015j356j475j365
$$ 304001 306313 308956 311114 312235 312651 313257 314524 316014 316949 317049 316603 315889 314874 313518 312043 310678
53099C10678j365j658k035k206k071j562o89J29K20n29j442j919k106k276k124
$$ 310678 309313 307655 305620 303414 301343 299781 299092 299221 299441 298912 297470 295551 293445 291169 289045
53084B89045j282k21J25m56j240j508j114l13M54O68J96l21j38O24J195J262J246
$$ 289045 287763 287542 287667 287211 285971 284463 283349 283036 283490 284158 284354 284033 283895 284519 285714 286976 288222
53067B88222J465J668J540J152O90J46n92j542k478k821k004k67J187J332L59
$$ 288222 289687 291355 292895 294047 294737 294883 294291 292749 290271 287450 285446 285179 286366 287698 288057
53052B88057q83j936k573k288r45M13N86j15l78J36N14L23J79L72K93l09p46o94
$$ 288057 287174 285238 282665 280377 279432 279845 280431 280316 279938 280074 280588 280911 281090 281462 281755 281446 280700 280006
53034B80006r05j846k624k184q64J44L09pl89o56p00n70n16n53l77L9K79K12K50
$$ 280006 279101 277255 274631 272447 271583 271727 272036 272029 271640 270984 270284 269714 269198 268645 268268 268307 268586 268798 269048
53015B69048N56O75M10L18P75J242J153Q93J045J218N52p74j575j140l6P76J023
$$ 269048 269604 270279 270689 271007 271782 273024 274177 275070 276115 277333 277885 277111 275536 274396 274360 275136 276159
52998B76159J061J138J057N82n9l35r8J63L0k25j41J50J54j33k68j03J63N74J228
$$ 276159 277220 278358 279415 279997 279938 279603 279505 279668 279698 279473 279332 279482 279636 279503 279235 279132 279295 279869 281097
52979B81097J691J369N16K3K17O40J023J503J890J733J221J048J280J363J216
$$ 281097 282788 284157 284673 284696 284913 285553 286576 288079 289969 291702 292923 293971 295251 296614 297830
52964B97830J131O77p81k335k063J56K109K215J420J139J122O33K06N95J118P08
$$ 297830 298961 299638 298857 296522 294459 294615 296724 298939 300359 301498 302620 303253 303459 304054 305172 305880
52948C05880k82q17j009j642k556k950k850k889l018k710k046j445p92L4L87j63
$$ 305880 305598 304781 303772 302130 299574 296624 293774 290885 287867 285157 283111 281666 280874 280908 281295 281132
52932B81132p02k35N28K01r52j402q21l66n37n09J31N81K26m56q78j094j143p19
$$ 281132 280430 280195 280723 280924 279972 278570 277749 277383 276846 276337 276468 277049 277275 276819 275941 274847 273704 272985
52914B72985M7M22J43j89j13J3k54p49j068j033o11Q3N49L03l99p85n12J17P90
$$ 272985 273032 273454 273597 273408 273295 273308 273054 272305 271237 270204 269593 269676 270225 270528 270129 269344 268832 268949 269739
52895B69739J350J488J031M34K97M77M70L69N88P80J92r94j707j526j017n73K
$$ 269739 271089 272577 273608 274042 274339 274816 275286 275655 276243 277023 277215 276221 274514 272988 271971 271398 271400
52878B71400N55M39k83o19o0P54J137J196J088N02m85r56k94Q52J483J511J481
$$ 271400 271955 272394 272111 271492 271432 272186 273323 274519 275607 276109 275624 274668 274374 275226 276709 278220 279701
52861B79701J609J708J688J605J537J721K394L173L223K308J144L04n22j685k723
$$ 279701 281310 283018 284706 286311 287848 289569 291963 295136 298359 300667 301811 302115 301593 299908 297185
52846B97185l045k975l256l849l991l339k437j976k058k245k069j481q95p54r82
$$ 297185 294140 291165 287909 284060 280069 276730 274293 272317 270259 268014 265945 264464 263569 262815 261833
52831B61833j096q51m79j70K08O96R35O75K76L37R71J702J968J536N87m15j033
$$ 261833 260737 259886 259407 259237 259445 260141 261076 261751 262027 262364 263335 265037 267005 268541 269128 268713 267680
52814B67680j196j144j062r42p83o35l97Q7P05J205J689K601L924M831M397K542
$$ 267680 266484 265340 264278 263336 262553 261918 261521 261608 262313 263518 265207 267808 271732 276563 280960 283502
52798B83502J10j833k665k501k063k082k674l299l413k938k087j081k08O9n04
$$ 283502 283612 281779 279114 276613 274550 272468 269794 266495 263082 260144 258057 256976 256768 256837 256333
52783B56333j497k021j572n36K95O39R05J436J944J922J424Q97M74ql64j35N64
$$ 256333 254836 252815 251243 250707 251002 251641 252546 253982 255926 257848 259272 260169 260643 260635 260271 260136 260700
52766B60700R72P64M72M47K18n38j090n76O30J356J120M13k35o82p71l17M30R48
$$ 260700 261672 262436 262908 263355 263573 263035 261945 261369 261999 263355 264475 264888 264653 263971 263200 262883 263313 264261
52748B64261J115J237J447J528J329R36N47M40Q11J336J330P15L39Q23J597J751
$$ 264261 265376 266613 268060 269588 270917 271853 272400 272840 273651 274987 276317 277032 277371 278194 279791 281542
52732B81542J267P06K21k08j33P41J641J558P08J60K38M19N33Q74J201Q52r3q71
$$ 281542 282809 283515 283736 283528 283395 284136 285777 287335 288043 288203 288441 288860 289393 290267 291468 292320 292227 291356
52714B91356j265j699k163k185j925k043k372k001q66rN8p6o6l93j091j218l89
$$ 291356 290091 288392 286229 284044 282119 280076 277704 275703 274837 274828 274886 274810 274744 274351 273260 272042 271653
52697B71653L65N4q71j375j229p76r5P65J342J297R89Q95R75J025J142J408J530
$$ 271653 272018 272072 271201 269826 268597 267821 267726 268491 269833 271130 272119 273014 273989 275014 276156 277564 279094
52680B79094J296R19O89P03J035J610J859J299M43K01M21J17p07q97j26M27J2
$$ 279094 280390 281309 281998 282701 283736 285346 287205 288504 288947 289148 289569 289686 288979 288082 287956 288383 288395
52663B88395m19J23J033J196O60J15l81r89j175m07P63J379J395J322J205Q92
$$ 288395 287976 288099 289132 290328 290988 291103 290722 289733 288558 288151 288914 290293 291688 293010 294215 295107
52647B95107Q54J580K477K427J247k49j422k130k213j566o72l27o92j201j316
$$ 295107 295961 297541 300018 302445 303692 303443 302021 299891 297678 296112 295440 295113 294421 293220 291904
52632B91904r79m56r3K6K96J124K085K263J602J107J282J419R69M91M87L02o55
$$ 291904 290925 290469 290376 290402 290698 291822 293907 296170 297772 298879 300161 301580 302549 303040 303527 303829 303174
52615C03174j652j752j407j569j952j624p91m37n04m9Q59J024J20p36p32m05m18
$$ 303174 301522 299770 298363 296794 294842 293218 292427 291990 291486 291437 292296 293320 293440 292704 291972 291567 291149
52598B91149l92K31J127J538J386J173J137R58K98o21j111p51QL39J81L54J213
$$ 291149 290757 290988 292115 293653 295039 296212 297349 298307 298605 297984 296873 296122 296130 296469 296650 297004 298217
52581B98217J915J606P03J88J80J20j6K25P93J136J140J144J113O82J2k75m8K12
$$ 298217 300132 301738 302441 302629 302809 302929 302913 303138 303931 305067 306207 307351 308464 309146 309158 308883 308835 309047
52563C09047K36J39j68q94j688j851j360q60o54m53j48j6l3J61M97M66L0k67k39
$$ 309047 309283 309422 309254 308360 306672 304821 303461 302601 301947 301494 301346 301330 301297 301458 301955 302421 302451 302184 301945
52544C01945l76q99j335j268q63m06J3J22m38j323j512n64O75J056L24q63j603
$$ 301945 301569 300670 299335 298067 297204 296798 296811 296933 296495 295172 293660 293096 293771 294827 295151 294288 292685
52527B92685j213L42K057K545J523K35m7N48R93Q38N84P82J337J785J896J837
$$ 292685 291472 291814 293871 296416 297939 298174 298127 298675 299668 300506 301090 301872 303209 304994 306890 308727
52511C08727J924K250K659K972L155L150K838K318J921J617Q00q47k548l209k874
$$ 308727 310651 312901 315560 318532 321687 324837 327675 329993 331914 333531 334331 333484 330936 327727 324853
52496C24853k659l239m045m165l416k275j254o26l86k34J82Q52J446J698J533
$$ 324853 322194 318955 314910 310745 307329 305054 303800 303174 302788 302554 302736 303588 305034 306732 308265
52481C08265R25J05k38M66J818K730K583J722P82J31k9L46R02J121J018J060J371
$$ 308265 309190 309295 309057 309523 311341 314071 316654 318376 319158 319289 319260 319606 320508 321629 322647 323707 325078
52464C25078J618J837K625M045N080M755L424K260J790J464O51n70j665k353k798
$$ 325078 326696 328533 331158 335203 340283 345038 348462 350722 352512 353976 354627 354057 352392 350039 347241
52449C47241l243l727m151m471m586m171k997j448l71j60m03o14q57j282j564
$$ 347241 343998 340271 336120 331649 327063 322892 319895 318447 318076 317916 317513 316899 316042 314760 313196
52434C13196j418j248j608k257k477k139j731j445r78k24N38J161J710K037J932
$$ 313196 311778 310530 308922 306665 304188 302049 300318 298873 297895 297671 298209 299370 301080 303117 305049
52419C05049J680J755K004J827J223Q61J020J263J295J333J481J558J738K565
$$ 305049 306729 308484 310488 312315 313538 314399 315419 316682 317977 319310 320791 322349 324087 326652
52405C26652L918M883N057N239O220P579Q300Q110P537P048O635O055M983L153
$$ 326652 330570 335453 340510 345749 351969 359548 367848 375958 383495 390543 397178 403233 408216 411369
52391D11369O94j834l976n693p021p795p949p681p133o268n181m134l086j708
$$ 411369 412063 410229 406253 400560 393539 385744 377795 370114 362981 356713 351532 347398 344312 342604
52377C42604r0J088J391J209J179J501K085K892L752M291M423M524M787M788M021
$$ 342604 342514 343602 344993 346202 347381 348882 350967 353859 357611 361902 366325 370849 375636 380424 384445
52362C84445K520O82j102k347k542j766q74o07q23r01n79p6L35N07M29L24M27
$$ 384445 386965 387647 386545 384198 381656 379890 379016 378409 377586 376685 376106 376030 376365 376872 377301 377625 378052
52345C78052N86M56K01M53J337K172K484K655L074L346K982K374K362L149M196
$$ 378052 378638 379094 379295 379748 381085 383257 385741 388396 391470 394816 397798 400172 402534 405683 409879
52330D09879N019N460N538N545O032P152Q265Q723Q773R149J0022J0946J1623
$$ 409879 414898 420358 425896 431441 437473 444625 452890 461613 470386 479535 489557 500503 512126
52317E12126J2055J2075J1413J0240R142Q551Q554R145J0131J0958J1169J1073
$$ 512126 524181 536256 547669 557909 567051 575602 584156 593301 603432 614390 625559 636632
52305F36632J1424J2409J3463J4107J4499J4992J5619J6191J6625J6907J6957
$$ 636632 648056 660465 673928 688035 702534 717526 733145 749336 765961 782868 799825
52294G99825J6674J5988J4862J3289J1332R093O719M532K932K011J423Q30K82
$$ 799825 816499 832487 847349 860638 871970 881063 887782 892314 895246 897257 898680 899510 899792
52281H99792jp8j79l46m39m09l29k65l01n32q33q45m12J56N01O92J010J517K119
$$ 899792 899791 899713 899534 899188 898749 898340 898011 897746 897445 896913 896080 895235 894823 894979 895480 896172 897182 898699 900818
52262I00818K858L751M508M887N144N767O737P493P693P709Q243R572J1242J2416
$$ 900818 903676 907427 911935 916822 921966 927733 934470 941963 949656 957365 965608 975180 986422 998838
52248I98838J2647J2288J2006J1911J1446J0233Q554O844N165L546K345J847J747
$$ 998838 1011485 1023773 1035779 1047690 1059136 1069369 1077923 1084767 1089932 1093478 1095823 1097670 1099417
52235A099417J606J420J309R70J11q35j185j025j078j621k268k849l651m589m959
$$ 1099417 1101023 1102443 1103752 1104722 1104833 1103998 1102813 1101788 1100710 1099089 1096821 1093972 1090321 1085732 1080773
52220A080773m455l763l674m101m474m639m757m639l891k691j781j489j214k23
$$ 1080773 1076318 1072555 1068881 1064780 1060306 1055667 1050910 1046271 1042380 1039689 1037908 1036419 1035205 1034982
52206A034982J345K592K927K694K678L171L771M030M020M112M389M549M371M114
$$ 1034982 1036327 1038919 1041846 1044540 1047218 1050389 1054160 1058190 1062210 1066322 1070711 1075260 1079631 1083745
52192A083745M312N218O498P436P531O896O086N506N062M421L465K346J184j51
$$ 1083745 1088057 1093275 1099773 1107209 1114740 1121636 1127722 1133228 1138290 1142711 1146176 1148522 1149706 1149555
52178A149555j835l754n382o165o173o184o858p858q228p701p091p065p062o054
$$ 1149555 1147720 1143966 1138584 1132419 1126246 1120062 1113204 1105346 1097118 1089417 1082326 1075261 1068199 1062145
52164A062145m083k262j284p11O9Q79J292J555K221L064L148K111P87J43J39M5
$$ 1062145 1058062 1055800 1054516 1053805 1053874 1054753 1056045 1057600 1059821 1062885 1066033 1068144 1068931 1069074 1069213 1069258
52148A069258l94p50p24n47m10k6R25K234L355L952L986L493K618J732J129O72
$$ 1069258 1068864 1068114 1067390 1066843 1066433 1066407 1067332 1069566 1072921 1076873 1080859 1084352 1086970 1088702 1089831 1090503
52132A090503L6p57j343j425r33J89J996M250O457Q276R788J1302J2974J4595
$$ 1090503 1090539 1089782 1088439 1087014 1086081 1086270 1088266 1092516 1098973 1107249 1117037 1128339 1141313 1155908
52118A155908J5726J6135J6143J6307J6644J6590J5845J4899J4277J3715J2583
$$ 1155908 1171634 1187769 1203912 1220219 1236863 1253453 1269298 1284197 1298474 1312189 1324772
52107A324772J0839R031P653O968P166Q029Q817R142R726J1406J3735J5424J6049
$$ 1324772 1335611 1344642 1352295 1359263 1366429 1374458 1383275 1392417 1402143 1413549 1427284 1442708 1458757
$$ [...]
##END NTUPLES=NMR SPECTRUM
##END=
