
##TITLE=UV1224_M6_1234-1212_30_7231337_LlRSUDQFCa
##JCAMPDX= 6.0         $$ Bruker NMR JCAMP-DX V2.0
##DATA TYPE= NMR SPECTRUM
##DATA CLASS= NTUPLES
##ORIGIN= BRUKER
##OWNER= Administrator
$$ 1.72 TOPSPIN		Version 2.1
$$ 2013-01-23 22:42:51.822 -0500  Administrator@X
$$ Compression mode = diff/dup
##.OBSERVE FREQUENCY= 400.02188249412
##.OBSERVE NUCLEUS= ^1H
##.ACQUISITION MODE= SIMULTANEOUS (DQD)
##.ACQUISITION SCHEME= undefined
##.AVERAGES= 8
##.DIGITISER RES= 22
##SPECTROMETER/DATA SYSTEM= spect
##.PULSE SEQUENCE= zg30
##.SOLVENT NAME= COFFEE_meoh
##.SHIFT REFERENCE= INTERNAL, COFFEE_meoh, 1, 14.98509
##AUDIT TRAIL= $$ (NUMBER, WHEN, WHO, WHERE, PROCESS, VERSION, WHAT)
$$ ##TITLE= Audit trail, TOPSPIN		Version 2.1
$$ ##JCAMPDX= 5.01
$$ ##ORIGIN= Bruker BioSpin GmbH
$$ ##OWNER= Administrator
$$ $$ E:\/data/COFFEE/nmr/UV1224_M6_1234-1212_30_7231337_LlRSUDQFCa/30/pdata/1/auditp.txt
$$ ##AUDIT TRAIL=  $$ (NUMBER, WHEN, WHO, WHERE, PROCESS, VERSION, WHAT)
(   1,<2013-01-23 22:42:43.775 -0500>,<Administrator>,<X>,<go>,<TOPSPIN 2.1>,
      <created by zg
	started at 2013-01-23 22:41:36.822 -0500,
	POWCHK enabled, PULCHK disabled,
       configuration hash MD5:
       86 BA 57 50 F2 9D 5C 9B 26 00 A9 28 5F 66 2E 89
       data hash MD5: 64K
       BD 31 26 59 27 06 46 5C F5 B5 1D 20 CC F5 48 24>)
(   2,<2013-01-23 22:42:46.822 -0500>,<Administrator>,<X>,<proc1d>,<TOPSPIN 2.1>,
      <Start of raw data processing
       efp LB = 0 FT_mod = 6 PKNL = 1 PHC0 = 0 PHC1 = 0 SI = 32K 
       data hash MD5: 32K
       48 64 39 90 6A 16 C8 D7 20 1D 20 69 D4 AC 72 DA>)
(   3,<2013-01-23 22:42:47.290 -0500>,<Administrator>,<X>,<proc1d>,<TOPSPIN 2.1>,
      <pk PHC0 = 98.87146 PHC1 = 0 
       data hash MD5: 32K
       2E AE 41 F5 B6 CE 8D A9 3E 47 81 CC 9D 03 C2 31>)
(   4,<2013-01-23 22:42:47.525 -0500>,<Administrator>,<X>,<proc1d>,<TOPSPIN 2.1>,
      <abs ABSG = 1 
       data hash MD5: 32K
       A3 5B 1B 33 2F 72 09 E3 BA B6 C0 2C 7C E3 A2 D6>)
(   5,<2013-01-23 22:42:47.681 -0500>,<Administrator>,<X>,<proc1d>,<TOPSPIN 2.1>,
      <abs ABSG = 2 
       data hash MD5: 32K
       6E C9 BD 77 75 33 86 5A 7A 2D 8E 6B 43 4E 55 CE>)
(   6,<2013-01-23 22:42:47.822 -0500>,<Administrator>,<X>,<proc1d>,<TOPSPIN 2.1>,
      <abs ABSG = 3 
       data hash MD5: 32K
       47 FF BC B5 80 7C EF 4F 7D 1B 5A 47 C1 E1 62 FC>)
(   7,<2013-01-23 22:42:47.962 -0500>,<Administrator>,<X>,<proc1d>,<TOPSPIN 2.1>,
      <abs ABSG = 4 
       data hash MD5: 32K
       EE 71 61 F4 D4 AE 54 19 E3 69 D8 2C 66 2B E6 FE>)
(   8,<2013-01-23 22:42:48.134 -0500>,<Administrator>,<X>,<proc1d>,<TOPSPIN 2.1>,
      <abs ABSG = 5 
       data hash MD5: 32K
       2A 53 82 37 AF 40 5D F5 ED C1 38 A5 20 43 C2 F2>)
$$ ##END=
$$ 
$$ $$ hash MD5
$$ $$ 7A D9 85 65 F0 4B A4 80 BD DC 6C A9 EE BA 35 34
##$RELAX= 
##$RELAX= 
##$RELAX= 
##$RELAX= 
##$RELAX= 
##$RELAX= 
##$RELAX= 
$$ Bruker specific parameters
$$ --------------------------
##$DU= <E:\>
##$EXPNO= 30
$$ [...]
150 150 150 150 150 150 150 150
##$TP07= 0
##$TPNAME0= <>
##$TPNAME1= <>
##$TPNAME2= <>
##$TPNAME3= <>
##$TPNAME4= <>
##$TPNAME5= <>
##$TPNAME6= <>
##$TPNAME7= <>
##$TPOAL= (0..7)
0.5 0.5 0.5 0.5 0.5 0.5 0.5 0.5
##$TPOFFS= (0..7)
0 0 0 0 0 0 0 0
##$TUNHIN= 0
##$TUNHOUT= 0
##$TUNXOUT= 0
##$USERA1= <user>
##$USERA2= <user>
##$USERA3= <user>
##$USERA4= <user>
##$USERA5= <user>
##$V9= 5
##$VALIST= <valist>
##$VCLIST= <CCCCCCCCCCCCCCC>
##$VD= 0
##$VDLIST= <DDDDDDDDDDDDDDD>
##$VPLIST= <PPPPPPPPPPPPPPP>
##$VTLIST= <TTTTTTTTTTTTTTT>
##$WBST= 1024
##$WBSW= 4
##$XGAIN= (0..3)
0 0 0 0
##$XL= 0
##$YL= 0
##$YMAX_a= 687645
##$YMIN_a= -585794
##$ZGOPTNS= <>
##$ZL1= 120
##$ZL2= 120
##$ZL3= 120
##$ZL4= 120
##$ABSF1= 14.98509
##$ABSF2= -5.573092
##$ABSG= 5
##$ABSL= 3
##$ALPHA= 0
##$AQORDER= 0
##$ASSFAC= 0
##$ASSFACI= 0
##$ASSFACX= 0
##$ASSWID= 0
##$AUNMP= <proc_prof1d_extract_pilot.lims>
##$AXLEFT= 0
##$AXNAME= <>
##$AXNUC= <1H>
##$AXRIGHT= 0
##$AXTYPE= 0
##$AXUNIT= <>
##$AZFE= 0.1
##$AZFW= 0.1
##$BCFW= 0
##$BC_mod= 0
##$BYTORDP= 0
##$COROFFS= 0
##$CY= 15
##$DATMOD= 1
##$DC= 0
##$DFILT= <>
##$DTYPP= 0
##$F1P= 0
##$F2P= 0
##$FCOR= 0.5
##$FTSIZE= 32768
##$FT_mod= 6
##$GAMMA= 0
##$GB= 0
##$INTBC= 1
##$INTSCL= 1
##$ISEN= 128
##$LB= 0
##$LEV0= 0
##$LPBIN= 0
##$MAXI= 10000
##$MC2= 0
##$MEAN= 0
##$ME_mod= 0
##$MI= 0
##$NCOEF= 0
##$NC_proc= -8
##$NLEV= 6
##$NOISF1= 0
##$NOISF2= 0
##$NSP= 0
##$NTH_PI= 0
##$NZP= 0
##$OFFSET= 14.98509
##$PC= 1
##$PHC0= 98.87146
##$PHC1= 0
##$PH_mod= 1
##$PKNL= yes
##$PPARMOD= 0
##$PPDIAG= 0
##$PPIPTYP= 0
##$PPMPNUM= 2147483647
##$PPRESOL= 1
##$PSCAL= 4
##$PSIGN= 0
##$PYNMP= <proc.py>
##$REVERSE= no
##$SF= 400.02
##$SI= 32768
##$SIGF1= 0
##$SIGF2= 0
##$SINO= 400
##$SIOLD= 32768
##$SPECTYP= <>
##$SREGLST= <1H.CDCl3>
##$SSB= 0
##$STSI= 32768
##$STSR= 0
##$SW_p= 8223.68421052631
##$SYMM= 0
##$S_DEV= 0
##$TDeff= 65536
##$TDoff= 0
##$TI= <>
##$TILT= no
##$TM1= 0
##$TM2= 0
##$TOPLEV= 0
##$USERP1= <user>
##$USERP2= <user>
##$USERP3= <user>
##$USERP4= <user>
##$USERP5= <user>
##$WDW= 1
##$XDIM= 32768
##$YMAX_p= 478822475
##$YMIN_p= -724866
##$CURPLOT= <Network HP LaserJet P1505>
##$CURPRIN= <$Network HP LaserJet P1505>
##$DFORMAT= <normdp>
##$LAYOUT= <+/1D_H.xwp>
##$LFORMAT= <normlp>
##$PFORMAT= <normpl>
##$SURQMSG= 1
$$ End of Bruker specific parameters
$$ ---------------------------------
##NTUPLES= NMR SPECTRUM
##VAR_NAME=  FREQUENCY,     SPECTRUM/REAL,   SPECTRUM/IMAG
##SYMBOL=    X,             R,               I
##VAR_TYPE=  INDEPENDENT,   DEPENDENT,       DEPENDENT
##VAR_FORM=  AFFN,          ASDF,            ASDF
##VAR_DIM=   32768,         32768,           32768
##UNITS=     HZ,            ARBITRARY UNITS, ARBITRARY UNITS
##FACTOR=    0.250966925370066, 1,           1
##FIRST=     8223.43324360094, -187714,      -122431
##LAST=      0,             -230139,         -163228
##MIN=       0,             -724866,         0
##MAX=       8223.43324360094, 478822475,    0
$$ Real data points
##PAGE= N=1
##DATA TABLE= (X++(R..R)), XYDATA
$$ [...]
23817 -86161 -24722 -226845 156451 251708 -8343 41399 16932 -205659 -104381 -15178 123997
23805 -129445 -209526 127243 -128060 -5085 159291 -43719 -247062 -43197 -154750 -177582 164198
23793 -178993 -71434 140031 -27467 470954 -512753 132819 -259709 -276548 138319 -2098
23782 -134647 307954 -446001 19140 146572 87895 53420 -272341 45457 2579 -61084 -95546
23771 -95546 6076 -360320 -85917 -279331 -41136 1312 177332 4599 435948 70645 46521
23760 46521 46950 70712 199888 -277393 236201 -149087 -14541 -49264 -200556 -74925 -247627
23749 -247627 76267 -57149 -41039 65052 -105134 32757 56362 101142 -256934 -105594 63668
23737 134915 161972 -13320 -279198 57069 49285 -178836 -194240 55206 -187273 162481 432059
23726 432059 254489 62118 133450 -176091 -25799 -213287 -25645 125227 -2606 -197555 264979
23714 -84036 490545 -65443 -87005 -49197 -106442 173687 -68056 167028 -138199 -57145 -63613
23703 -63613 198948 1247 324462 148694 -293706 42895 87477 -325464 93507 -250072 -202039
23692 -202039 169472 225355 -124608 6218 18520 159560 308468 23765 41843 115095 -193220
23680 329987 660 8804 274274 329086 -117807 292939 -75498 187804 -83618 -95329 -149626
23669 -149626 169968 162483 -8462 -260417 53102 -23821 -63225 -43044 -472142 -267481 -96195
23657 67491 -59314 -111485 -441905 151877 -404615 -417364 -355879 166228 -20823 226874 179632
23646 179632 307977 118969 -58073 -156969 240923 -73305 72725 -53011 -211919 151087
23635 139288 -143889 -143662 410285 -288315 -196083 -84184 186550 77226 66128 71117 -470997
23623 54912 -86044 -65182 -87502 -63079 32109 39526 115410 190602 -245431 -81500 87444 44221
23611 44221 -93406 -119205 115419 -48441 -24309 -62153 -104820 -51924 65544 -139490 -229660
23600 -229660 163529 -180051 -174156 189586 311923 2544 -271604 -363072 34854 -38964 61644
23588 -164736 128914 61674 -229377 178567 49451 -97231 -52121 42665 261990 195845 62021
23576 -73791 81733 61724 -298802 -260171 283742 -209195 -227666 -8574 -177079 60759 -297072
23564 -157288 -317480 248327 168577 -240389 -386859 -173833 89455 36029 -102261 149064
23553 64763 22305 -63776 68756 173091 2744 -328201 -49380 125352 -996 -134216 -429333
23542 -429333 -134163 39745 201398 -55920 -109604 -207834 -250801 176726 22424 -286430 -63581
23530 -82760 108478 168052 -166833 -214374 -183398 -300523 -153457 145668 102724 107030 218431
23519 218431 -3117 -103287 39406 103944 -18894 13928 -11980 122579 -175541 -100855 -91262
23508 -91262 219441 41205 -101717 -265892 -43354 40222 -38475 20768 -380314 364687 -107930
23496 -97427 -103628 -34394 105154 110654 239173 117372 -50039 -86519 -203750 -114854 148981
23484 -365696 248694 322518 1146 -45011 124483 32198 86831 76957 15794 213774 -391316
23472 67251 218445 10571 -72931 -214768 -20902 155661 -428336 -132450 38333 -1386 130873
23460 -8724 -220948 152762 106647 122267 65840 -323047 -61968 -262243 20159 -75879 33099
23448 -387786 72332 18313 -88145 -164601 -56343 6586 115588 -86934 -26425 -20904 -174518
23437 -174518 -41145 -166642 -199453 160668 -118662 94917 -68046 -40443 -103020 -42005 233148
23425 -90546 74881 -266425 123265 130047 197889 58120 75144 129627 129138 -336505 -61977 -60525
23413 -60525 76909 76861 189118 -365768 250429 -235919 288801 123704 -16410 -59122 -158153
23402 -158153 7004 280825 197371 99875 220614 -120459 107953 -220382 254247 41352
23391 -55326 194215 -216317 40442 129587 36776 -111610 -386613 123888 56378 230570
23381 230570 38044 -86621 23081 -49337 109124 -258881 -140561 88021 -46123 93668 59911
23370 59911 92635 33436 53252 -19111 47958 63251 -79984 -101627 -101804 -57119 -48383 -142777
23358 -142777 -190740 -360150 -15872 -21236 -292579 -237624 -49537 -177608 -218435 12673 -299234
23346 57067 -194631 155092 64813 -10173 858 178126 313168 130038 44884 65262 69744
23335 69744 -17379 -345047 -125599 11510 -362493 -352521 147414 -73099 688 -115089 15066
23323 -35434 -264187 324859 53258 122673 24691 40714 152028 -99538 30214 -375721 -51052
23311 133290 -181156 34160 -50634 281206 110427 -58045 355038 -267694 137614 93977
23301 93977 -240614 105134 -144057 -425491 -404238 310544 -250317 -79552 -155602 -58994
23290 -208271 -336078 -85188 -331716 108762 -183058 -41594 21797 75342 -57166 -326717
23280 -326717 74320 150811 -37690 210251 361485 -56886 261915 -247726 257708 -212249
23269 148355 -319842 -50480 -54978 169199 123379 -250829 -271890 198312 -284019 -172394
23259 -172394 -415270 -7709 -128816 -235880 109189 -165293 -66958 -276566 17671 97587
23249 97587 72602 130731 -248182 291532 127843 30346 62997 -170221 -220386 69087 136449
23238 136449 51791 -40328 -238369 -86828 87908 115281 -240563 -25805 91206 18016 -356605
23226 -240424 92914 -47466 -111569 315123 -127171 697 -6530 -158351 129855 -107833 -150851
23215 -150851 167351 60891 -50443 393806 -11354 102206 -276959 -45863 145408 -197026
23204 99121 197772 157368 -472042 84196 -49829 146088 -58374 202726 -17646 -68451 -4104
23192 -25843 -268979 -140499 31323 -241610 126348 -353207 -136380 6422 28669 98479 123190
23181 123190 202581 170826 -97971 92653 203129 -306946 163978 156091 -249560 -199725 -44878
23169 -17566 77696 92132 -137099 -209217 267406 40277 -256269 -126085 49797 88308 3573
23157 -272769 152635 -96099 100056 -30294 -49992 -386760 -150710 266754 -100194 -346692
23147 -346692 64043 -212744 27507 3398 106270 -67036 -63085 -180835 -5962 250354 -181547
23135 18882 -30850 246240 56706 -48128 -206689 -146090 -87873 15883 182919 196761 218863
23124 218863 159832 159241 -4912 -136886 139523 12435 86258 -258611 117306 202549 -139466
23112 76748 126986 -14968 91737 -117608 -144333 -112409 -44376 99183 28412 -86053 226131
23100 13197 148681 -64730 -332117 -22900 13083 -282391 -66652 385085 -173679 35996 -247736
23088 141152 -299051 116804 -204965 60715 -88362 -260692 108103 33000 557184 -163228
23077 -67937 -48411 126396 136030 34623 -105750 139849 48827 88386 -225493 -218532 32738
23065 2788 170209 149194 409023 65650 -23303 271850 232490 202970 169982 137466 -121036
23053 -271617 -164225 108785 230678 114142 -221326 27213 -236149 -1108 25845 107349
23043 107349 174678 -180748 229639 27293 -141815 228230 17981 229933 253502 -54011
23032 -108642 68710 -395045 -29901 -80142 59974 105547 -138114 -162304 1668 -133777 -274589
23021 -274589 -30587 72077 41162 14758 -316677 174886 14954 -69098 -129965 28253 -152051
23009 65214 -99024 47608 188016 -252130 154984 -112740 -116780 52899 -139548 -191414 205658
22997 -28415 -88676 -212284 -140246 -278051 154601 -23164 220260 127269 60104 -173596 -223962
22986 -223962 -58033 77161 -33975 59329 -317944 -102445 -142851 -21640 -105554 69801 13720
22974 -96870 -148722 16959 -177448 -309323 99188 -90647 62108 -9687 -144625 259917 -210522
22962 -219514 200940 89220 -448653 -263440 -374670 -259302 64757 -16267 -64681 -164731
22952 -164731 105127 -58669 -129236 -382190 -61279 220219 65746 -150370 -183817 -89337 -149451
22941 -149451 111276 -285689 -187479 -156531 264622 -75181 -248114 233825 70939 4295 -3486
22929 313225 -152818 36834 -36788 6025 251642 -54144 -326110 -466573 64024 301464 -244222
22917 175653 64292 -207372 -198581 -22529 88317 144176 91724 52396 44897 -15332 -222614
22906 -222614 3499 -306710 -114242 238197 -65587 5243 137832 39593 -88616 -32986 84786
22894 -123851 -176559 117921 30325 -297567 -46586 -258025 -518886 -89740 -175675 -142427 21669
22882 106839 -36032 -388415 -304480 -62522 -104937 -98187 104130 -160461 178524 103874 -117659
22870 143095 -103316 190939 -89601 -6819 -127524 370731 294565 125686 157019 -44812 208272
22858 117381 -27009 316960 -14964 -71024 110462 -31234 160620 -76035 -227240 55331 -157892
22846 -272283 108342 -226026 146845 200403 -215784 -150745 49077 37704 238406 -27012
22835 253380 -212511 -107706 55803 -256489 -157887 449903 -281440 -104258 85078 -101670
22824 -48835 -182024 -4154 -133215 -19999 128516 149309 -197088 -402365 -40586 70718 -434712
22812 -81346 -115896 -79199 14655 -5828 33737 161614 -191137 226078 -96290 -24369 -173244
22801 -173244 297402 -27629 -342611 -212976 -234676 65798 -13178 1779 -159477 30579 238108
22790 238108 -180322 -204523 -32635 235990 -68319 -136182 119732 -216878 15606 2050 165508
22779 165508 -191755 -96993 -86078 -97774 27251 -155622 79922 -329633 -94486 307715 200163
22768 200163 -104342 73823 -465226 -53415 139272 -16497 -154403 61886 -470129 155142
22757 48582 7267 -42824 -183402 86380 -14683 -248861 162571 -183019 179870 -31934 -32767
22746 -32767 -39669 72485 -249654 69479 -82118 -126386 100459 -41000 -104217 -58154 -54815 178831
22733 369130 -131597 46107 -64992 45863 -66446 -314951 -113453 -142078 -461722 196671
22722 -237675 -270427 -234271 42662 -85389 -10952 -281101 -82138 -197416 -22598 -306737 -236129
22711 -236129 -104831 163 -68396 -233870 28667 231688 279599 -4623 -21112 -252587 -134944
22700 -134944 -306976 95221 101570 -165114 -15166 466335 47867 69014 -7305 -231731 -121973
22689 -121973 151110 5811 -30150 428594 -220937 -25937 -135008 17732 -107864 12602 160612
22678 160612 1899 138674 399899 196032 334523 139973 -49977 -165516 16680 -138356
22667 -110483 117487 180579 -71313 58886 -102065 -172321 -209357 -108275 -159205 -153116 109155
22655 140717 -170525 -108354 -156186 93870 -497373 -160768 95736 279269 -83249 18917 73395
22644 73395 -298934 -103391 -42358 -183288 -56019 135043 -540 -285564 -112668 -387615 132964
22632 -230285 -63611 -227039 -57822 -222787 -105485 -115190 -73814 -38939 46123 68968 -185696
22620 22933 329903 -166079 -188770 -66607 259900 -77275 173659 189821 -240682 -148978 -53535
22608 -143556 -160476 73690 -47832 -192239 127785 -105292 -125862 -55546 -168853 -199845 -15089
22596 -1538 117067 99794 125229 -87931 -414258 -496842 -14838 35595 169915 -71348 -23576
22584 76812 5035 234888 -482374 108980 111669 -131392 131580 -294530 -5599 -152116 -309143
22573 -309143 -11349 1575 -444008 3963 -270987 -450568 -265452 112801 12505 270009 65188
22561 -119550 -303144 86737 -130165 -90509 32569 80778 -330307 -78989 -31681 -18692 -156254
22550 -156254 -153930 220228 -138006 -35161 42998 134885 -138424 -15418 -16791 133474 -14429
22538 -130346 232452 179806 130446 202264 -171091 -52312 130395 -323362 -315161 173025 -54509
22526 -41034 -199897 -79910 217313 -95975 97746 -31253 -373580 146817 -268803 164949
22515 -30626 -178474 -23469 241999 -144788 57709 -96402 87398 -240739 -34990 33586 332653
22504 332653 -186489 -161463 180717 19426 -101687 -105076 -198673 -234757 -304159 132213 -125553
22492 -129539 -410171 457606 20288 174255 55734 29663 195998 44562 -989 101555 -195164
22480 154092 -217979 -243829 129529 263336 -130884 146520 -348891 -139642 14826 -219232
22469 -106010 -64079 93717 -268212 72628 48442 -113727 -19818 -301850 -156537 165081
22458 -23835 -2306 -246633 -130811 11069 -459607 -414771 65473 214299 311539 -14618 184422
22446 295030 433323 -180928 214164 123775 22145 -20661 129489 -78060 42506 -112585
22435 -339972 -175744 -252552 -235838 -125267 -130508 -148102 -110435 -269160 -228760 -54875 -96391
22424 -96391 -18364 -111894 64999 -386720 -112730 8613 -288760 -128550 18618 19512 -59323
22412 242538 -87773 2039 -321466 -169663 -68902 13959 -190670 -256871 357889 77225 -377063
22400 -16284 -418477 -2562 -162359 299553 338750 -16141 -93368 -160998 136169 182256 -14441
22388 -2571 -58920 193021 269187 92079 -58154 11773 50422 17061 18864 116475 206915 15400
22375 -220426 -202144 -272428 -249781 68792 -131041 -158526 -43757 156466 4845 -132325 -288134
22364 -288134 -254522 -17149 -407136 42532 80322 204665 -200202 -172023 -50887 262714 112760
22352 -97989 120534 82029 -204010 45567 -70548 -27684 -97263 58203 -14078 195185 5636
22340 -130201 -221555 107745 -264065 -55466 -90840 194529 -95198 -371161 66553 311735
22330 311735 562 -196604 328142 -301708 -50383 -302306 -117966 22889 276439 -87086 77784
22318 -23940 15511 -45847 -69881 -136207 156689 146490 -80933 -260806 -67997 -2531 24940
22306 -196263 -102126 -15834 157457 149949 -29186 98182 -76252 307357 147131 46163 -272
22294 -141739 122844 -400770 -172778 -18077 -32254 -299960 303872 182984 -144264 35754
22283 49107 -367384 126950 -42123 -242768 75377 58910 182211 -84054 -232939 55342 -536451
22271 273763 -468023 255289 -309033 -229914 -34775 201563 81303 49123 -134712 73016
22260 -12139 -83537 81802 -49045 -30387 -10419 -88521 233266 -278335 -222393 313181 -94258
22248 218337 36293 62719 -27335 -206850 -142465 -196936 -110584 -108021 -14412 -389995 391793
22236 -178906 -29807 -140918 -140957 253390 -49746 104425 -82672 -43302 -209852 111751 -108664
22224 226657 250635 -283554 -22316 -261273 -197571 -46251 -258136 44252 -58708 310823 -238989
22212 -89880 200991 -130396 -70133 113466 111348 40831 182268 -170309 148204 -46763 -204917
22201 -204917 108990 82879 -38834 -290337 -107758 178125 72080 59335 -331355 -107478
22190 113990 -8434 293978 -110876 411919 144594 -50732 -128842 47199 -70976 -65770 -169473
22179 -169473 225779 42659 -127146 -163436 -440930 422115 58201 -199252 -118844 245448
22168 -392224 -86329 -42169 -196974 210318 -210944 -74098 181350 -307893 52870 -176745
22157 -78087 152757 -194815 -89291 -200769 228392 -64043 73923 -149201 57083 -283387
22146 -145252 227021 179378 314875 163686 228842 -200477 -219337 -165262 -21456 -51727 -152182
22135 -152182 -87577 -152157 -211351 -190886 17984 -159954 99140 -413140 -171569 -281891 22462
22123 -248067 -555231 -151368 -49585 35531 231455 13769 -559895 288486 191459 134819
22113 134819 251343 -284869 -151458 -159937 120755 -117929 -120942 -143269 -246655 -121732
22102 -141179 -298203 95809 -454131 218178 -10802 -89267 -105278 -208298 62138 164165
22092 164165 51571 -205554 -193240 -173256 -43743 -236807 215522 93500 95144 -109803 -215856
22081 -215856 -208444 -164064 -326082 276547 -135311 -157023 -265760 -17457 -226314 -41714 -114528
22070 -114528 57522 -73566 -61662 -91989 169974 96982 -25988 -279299 -230534 -300636 -223446
22059 -223446 302311 159098 289633 -322986 9519 234534 -52591 204782 -221098 -38110
22048 -56986 -199577 -148665 -235425 -236010 65123 71385 746 -154740 190653 -197080 -212988 194474
22035 111172 114486 -139717 170878 215592 -403062 58417 138211 112834 -233852 -55867 -29247
22024 -29247 -78689 54960 -158534 65688 -260244 -21287 -186033 177679 186828 -8634 -91933
22013 -91933 -86304 -398517 -199372 -178216 206319 353377 -120181 -201287 50632 -14020 -174494
22002 -174494 -76832 -62211 56288 67666 -189334 -232457 -16678 22910 -13097 -111806 -15995
21990 179180 22672 -175058 -19278 194521 141354 -108770 -81721 322147 12473 -162915
21979 5579 -19615 -137313 -117585 9079 -109608 -309088 -29369 244083 -270796 -151238 -2977
21967 -106900 343703 -42973 13354 50756 38520 55842 -18122 -72019 -62377 256268 -38585
21955 -42920 -144601 -281545 -53268 -135558 -159473 -33472 -9884 -15305 -180800 -219190 -45948
21943 88151 139758 106089 152077 -87181 -178862 39680 -41648 118096 173668 19058 -386311
21931 -11757 -69375 -186585 -408877 -120574 -96612 269725 -170783 146729 -368445 -323236
21921 -323236 91798 225958 86507 -129346 70751 -207429 -36239 -196684 -63668 -42992 -119913
21910 -119913 -85494 -323892 -155703 -441 -83311 -165791 305144 8280 70810 24513 -243435
21898 -72306 -139129 198030 207786 179914 22220 -221075 -119161 -11550 -49222 12285 85167
21887 85167 -149547 -382069 -290458 -67089 -7763 -160770 -198023 99669 80355 -242930 -136040
21876 -136040 81383 24866 -286033 99291 -83080 -2468 -318258 349446 -139292 198114 -68852
21864 -84930 505212 -366464 -210367 71271 7802 -430298 -122060 212077 67054 -118770
21853 -66621 125798 90458 145277 -184338 -31710 -76676 39753 -23820 51074 -2330 -20575
21842 -20575 269284 61047 -232285 -156475 -295985 -126302 -272214 111925 117008 66539 199614
21831 199614 -221079 -35454 -254490 -301637 47855 -50386 -122802 -237329 44760 129087 26342
21819 -300557 -217054 7367 4667 236126 -344397 9261 -238089 234489 292448 -175357 -137541
21808 -137541 202864 38466 -273905 145466 172398 -65477 -316927 326892 69713 422984
21798 422984 -415513 375072 -326568 -33244 -83645 -82172 219525 129836 -15478 -9440 -206137
21787 -206137 -19833 -125421 -430372 -79833 -188242 -68585 -57535 354881 236500 -392569
21776 -149584 211927 -85530 -71745 -46471 217704 -116492 -16341 -58257 115514 -49399 -74317
21765 -74317 194913 -10634 -173884 23301 45394 -73181 111579 309426 -121528 21110 23986
21754 23986 -133238 -101515 -184584 20763 -132046 281100 65791 30881 -74519 315298 102826
21742 -295489 319085 -13886 -47137 -166973 -163872 -48472 45576 -40223 100480 -244240 -31850
21730 50799 -290900 164032 50902 -19615 -97056 4008 -99228 8025 -8924 273943 291468 -87527
21717 66314 -342796 -346520 182449 89009 43517 -15557 -285670 360111 470663 -477684 112865
21705 -227932 -139272 -204701 -51305 -55686 -12742 90296 -89124 -79607 -225910 117734 128729
21694 128729 -85830 54838 257422 -110959 -140318 24530 122287 -219312 217542 -78387 -29377
21682 -77512 -97569 -113344 -16353 -24622 -108197 -7138 -56188 -375492 -158955 -273156 200256
21670 2283 -3221 28317 67859 51321 149466 78314 28608 -86315 -38561 -111107 319318 -156040
21657 -133187 180438 -104691 128198 -224910 -19535 111895 -187233 75474 -133225 -269257
21647 -269257 -153634 -137177 58784 -156166 -23871 -114969 101631 269044 -119922 -154890
21637 -154890 18084 -60614 -4596 211389 -167237 -158325 -251204 -138108 -26281 106382 82018
21626 82018 -20754 -242559 10001 -232718 -46843 -67101 -151924 -101835 -123603 -202748 -173581
21615 -173581 -233887 -166820 -171989 -190245 -172540 -40301 74749 -253538 221091 -235765 -123965
21604 -123965 1901 264576 -234691 250952 144600 39984 -273823 173982 157742 38182
21593 -376349 37270 -238372 -177690 -87381 -9664 -177258 45085 9376 73201 4077 -191545
21581 -243556 40245 56027 43247 -164650 -111646 20799 -190938 130542 44282 -22299 355696
21569 -388794 45685 126089 -198650 -212779 -213907 -70541 161584 -329713 -117652 17683 -150121
21557 149419 -210372 -222420 -90615 -98846 -155219 19198 300618 -294951 2016 73952 -5926
21545 115105 -13481 -133141 -65013 153269 -57611 -151386 363621 -247581 309338 55074
21534 -17914 -156348 -291525 -69776 -167139 -126560 63859 -133391 -40777 -75640 -83270 -49280
21523 -49280 22394 63436 -56391 84759 -366542 -40038 -274250 43121 199489 77503 -35811
21511 206300 -139284 -266534 -262526 162936 96021 184086 5546 14872 -231989 66501 186843
21500 186843 -234884 -239247 67877 169505 25731 131763 -80063 118501 -178385 -70050 126461
21488 -33810 -30854 -301593 274581 -14952 341692 -6285 240307 39502 -261843 -136121 -436499
21477 -436499 -191328 -69741 -320715 -51467 -172864 -263726 -43804 -101138 11780 121323 233250
21466 233250 -27253 -78368 -220095 -14848 -152661 8184 -67257 -423124 -84650 -114593 -257565
21455 -257565 96227 -12191 -54955 319527 -171597 210739 -1517 -189203 241000 43676 197418
21444 197418 139974 283487 31134 257054 -166832 124551 484531 404968 285604 583142
21434 583142 323869 642338 270215 204127 183201 -146591 -91179 8138 -100540 -118891 162801
21422 -4166 -289187 186994 -138391 -184550 -451069 -73304 -96497 -177032 104247 -304543 -42467
21410 -40916 55510 107366 -73080 142848 96622 -35401 141293 -23487 68689 -55690 -1889
21398 22648 -186878 189439 -210802 84651 -263348 186640 243605 94626 328667 131625
21387 -147629 -39033 28652 -228475 -90614 -177817 -60166 -103978 -166487 92851 -3910 139739
21375 -373396 -21290 -419775 -4873 -159118 136838 32395 -209035 -46166 -328415 -349660 -252427
21364 -252427 -191258 44379 77950 -175216 -273345 -93030 -136964 1739 -26609 85992 212162
21353 212162 -84582 78709 -174622 115880 26109 15097 -467721 -105531 197266 98820
21343 98820 -153672 549601 -320199 -232973 147830 -136768 -113925 -36277 -234279 -28744
21332 131627 -182161 -48452 37436 -403194 206192 114650 323329 -114583 -124709 11188
21321 43210 10167 156649 -288947 -49016 -66126 -168203 128929 21870 82233 -374588 -59000
21309 -22442 -50077 -43675 77682 -245330 -71935 47534 -123259 -165090 -81605 -358016 149604
21297 -378597 98423 -271980 -457479 68977 262064 -77467 -57250 94321 -369773 -201139
21287 -201139 -229322 -26275 220858 -39602 62032 35007 45121 -68584 382050 -44396 216714
21275 -131448 -43225 -54368 -130357 -58715 -92459 33586 -109090 325977 -146642 23098 202942
21264 202942 94372 -64959 -159352 -107564 78108 -167763 257968 -374355 486424 -379335
21253 -137521 -160244 -75300 -217041 82523 251978 -74715 -302769 -34006 -389485 -130223
21242 -237134 -371467 -68370 -133693 -195884 86946 132683 -277992 196146 -27607 251444 -140514
21230 163546 -46116 -59145 -4509 -13572 -384098 36432 -234690 255992 342240 -19795 -335385
21219 -335385 -106300 -67549 16031 307077 -157223 163186 -261764 -150875 -114520 -255798
21209 -255798 270015 171412 73739 -136977 -152449 -59805 206900 -31358 -35580 60338 83400
21198 83400 16718 80651 387403 -249171 -268267 67321 -91622 -153821 -153677 22065 -5603 -318913
21186 -318913 -81788 -76264 26956 40990 -135275 32183 -319355 17190 -208957 -174562 -155827
21175 -155827 26191 -9104 -154320 -225342 175936 -41095 343772 17009 -211501 -418357 263397
21163 -155688 -61196 -241043 -145093 117369 -262754 207923 -324729 284803 -79354 25110
21152 -223299 -324370 247105 -15149 130589 -74955 -159096 255750 150719 -164519 -164000 -1662
21140 4168 119792 75706 423137 247343 97678 -71253 -137625 -32397 139641 -44714 126872
21128 -348572 -311478 232017 66984 171087 -77020 113223 12921 -38045 20548 -178087 43025
21116 -91728 89868 -15572 108845 118581 15645 120027 248006 -187448 243669 -45798 68449
21104 140883 194879 -114851 -74997 186763 -58391 204437 -282708 -138831 50848 -48518
21093 -123779 -143907 280326 48771 260865 -44704 -103842 -92501 220096 229763 29289 -187911
21081 -27892 -6580 -195671 205190 -168753 1144 184679 -46818 317785 -139098 -47580 -140016
21070 -140016 -107106 -108666 -32352 -270921 -295888 -108130 -82995 52485 -48145 -85485 222197
21058 -161790 -3558 -187616 -524143 37115 39046 31843 -69188 -40994 100314 -113270 103483
21046 74961 -277351 -342193 -165962 4582 -500924 -152751 138532 -123623 77676 -57242 129810
21034 -21490 28973 3903 -454811 -289743 94475 73551 -165630 168003 -1632 -74690 -55577
21023 -55577 40722 132893 -162776 -73023 -401642 35114 -229803 -191106 172244 989 -167014
21011 181476 -72025 -144391 105364 81996 -163206 102007 -420806 65479 392377 97398
21000 -54710 47673 109858 -429687 -21388 45192 -185585 -48845 79080 -355539 184004 206596
20989 206596 -123846 90986 29214 -68261 -203211 -190173 -168154 -193216 -48653 48678 35297
20978 35297 -81808 -65813 -237283 -48360 -215682 -287226 58007 104251 221912 582527 -142401
20966 -220514 193135 -199892 -294009 397026 128396 175518 118151 -109406 90065 -137347
20955 -55040 -309886 -22604 -37889 14706 73692 -94771 -44854 -209541 57359 -256036 -15250
20943 -24613 239685 -180614 -33915 -283254 -43140 -77517 -16542 1160 16399 130604 -167243
20931 -115303 -125686 -10885 -171222 150505 102564 65872 -208602 -44858 -285301 -272715 -258325
20920 -258325 -285747 -24769 -5364 -288364 -234641 -77300 -280316 -51480 -187029 1092 -6677
20908 -192389 -216624 -237792 162741 24259 -124107 148695 -162532 -44270 151370 49401
20897 26567 -32596 62308 -47242 -31495 -318693 34304 -112104 -141176 -14743 -46205 134772
20885 -324260 -24994 17455 -15564 -77492 -61003 172668 -74093 204067 17203 -165643 5683
20873 -223243 245331 223740 -51763 -17127 -179328 153628 45563 -196158 -339168 228434
20862 5408 213342 -126941 -172589 232756 -190214 213892 -40107 69443 273614 40419 -199117
20850 8763 264253 -278494 223669 -400465 -12701 -81819 202051 334688 160215 -43708
20839 127723 -119948 114068 -231182 214909 -88318 -237921 -167760 -176262 -127250 -428044
20829 -428044 -176616 -54136 -65885 136156 -12423 -157577 141142 -218007 -138320 -277954
20819 -277954 -58814 -64170 12269 -107034 -101003 -54892 -173358 12008 -212933 117230 -54427
20807 -109134 48188 -358069 -109765 -186391 -220755 103819 307730 -233344 90470 -86013
20796 -500057 -353135 74663 -170168 -170000 76201 -259860 -232953 -139770 36024 -99846 -218350
20785 -218350 -313122 166411 -93453 -193979 -35949 -232317 269893 -215994 -167980 -61381
20774 -18334 -191394 -211433 -340715 90866 32947 -39782 45439 174636 36233 -76803 -175595
20763 -175595 -182939 -190615 -64171 -183883 -102826 -150312 88802 216155 27334 -204812 145249
20751 224720 230741 -26776 377568 -108456 -110388 -165642 -240159 282046 183954 -37873 -105556
20740 -105556 -127737 25294 155091 -219377 -47653 171113 -19915 13808 -263837 -102024
20729 -402426 92338 -90356 -43681 -16502 42387 -89528 -70092 -62098 -69052 -146986 70414 188500
20717 188500 141993 78140 12490 -201011 11205 -240721 -10278 -285957 -12739 155013 -83681
20705 160624 -343728 -88339 -147416 217302 45681 -67802 166518 -101655 -84061 230357
20694 264133 -264303 21765 14443 -222724 -218201 66418 -104960 -143732 27924 26610 36823
20683 36823 -15785 -175932 -209071 -348865 -161465 -277176 43380 -370636 -327436 139472
20672 -185140 -261343 64154 -328424 -285152 -99890 -383202 228050 68469 -117956 -412643
20662 -412643 -285045 -171125 -121403 123496 -140948 -252155 -29325 -73108 -84113 -104750
20652 -104750 -2936 -256678 12998 -92722 -64000 -330306 264020 -220176 -99086 -4620 -77200
20641 -77200 -231841 -159494 -40734 121877 -57013 -297309 -74115 -153195 454179 -176566 49243
20629 175622 -100795 -67549 190426 134339 93122 70474 -11095 41263 104132 67057 86098
20618 86098 -108212 39164 -47112 162923 -122548 -139199 97910 -419301 -204766 -163700 -84594
20607 -84594 -134203 -89989 -247959 -239243 -74042 -231356 -114014 -63662 -28777 -60102 153130
20595 -182009 -548132 -157039 -134124 -250711 -59135 2310 234610 -42901 -128813 144593 101772
20584 101772 -77168 -584 -346862 -290658 231566 150955 8116 -238175 -14067 136930 -154400
20572 50195 -25579 -634 238291 -147564 -125096 111417 91366 -108069 -473928 -101346 -13508
20560 208804 -246318 -84117 135661 39500 -452893 -46520 47852 -13678 -35808 -123047 -106957
20549 -106957 -76570 -52675 -155708 -90360 117917 -213068 -246456 106069 -203319 -111559
20539 -111559 -195453 83771 -197637 62537 -168828 124388 430666 -291718 -35742 -30957 217344
20527 -50704 -61013 -89721 -147312 -68451 -35480 171119 -213388 4579 5740 -88906 195859
20515 -57811 -206788 -116793 50720 -127695 101534 112089 -23990 44729 -393160 -194570 156515
20503 -134300 -351893 156199 96134 67750 -15566 269646 -20754 -36841 -281309 -229462 -343713
20492 -343713 -147790 20323 129097 -298155 27734 21580 114823 -185621 -267649 217801 54314
20480 -155206 -165099 -8317 -133509 127475 -293683 24982 -244244 286744 -256240 401345
20469 -122998 -90049 226855 -89672 -219359 230252 -19142 -27251 23308 88863 41224 -53722
20457 103798 132587 25846 -120313 164622 165736 -189743 -335458 -279789 180410 300041
20447 300041 -154237 95633 -453703 -308117 -4564 99346 -66178 175884 -141622 -83625 -341630
20436 -341630 -225767 139530 -176304 -276991 76549 242073 146002 -153329 -81059 27195
20425 160664 -86044 -264267 -41749 -350253 122321 358170 -163277 60443 82312 -343033
20414 -151912 193109 -95272 10718 66051 24302 -461273 -151969 -145728 129745 139716 -110649
20402 -6014 -151302 128288 -84873 2301 386174 -18981 136290 -362565 123586 -150883 -359673
20391 -359673 22253 69570 37194 109894 -25726 -402445 -342664 -185520 -70837 105286 -274142
20379 -170317 -141502 -137181 -270904 133132 -61511 -172543 -482180 -68835 61514 75085 -32849
20367 73163 81394 -107562 89225 92516 182642 50477 208365 -50790 121506 -58101 175328
20355 27793 -45782 -457171 -121492 84288 -86678 7530 175691 40347 -69981 110218 206242
20344 206242 179786 -155381 85833 -365825 -188747 17511 -146925 -144737 -71163 -264582 -119453
20332 16527 162664 -149183 120082 -23 -160777 207380 -111766 247773 21581 190883 -251001
20320 -84586 138019 -142206 -126820 294069 -136196 -198815 -267210 223682 -118662 -133818
20310 -133818 -57010 -137476 -264338 30656 -222349 -401258 -189082 -139308 -9357 6191 -77373
20298 170830 -164067 -212207 103610 68576 201165 -289872 -131718 22992 -204562 -45964
20287 62174 12613 78849 -326441 132999 -60375 -181166 46467 -263947 -82534 -144966 -77151
20276 -77151 -19230 234566 -182008 8030 -339759 60626 16527 -252570 25083 163235 287171
20265 287171 -402800 -338292 -18231 -53162 -260779 24624 -134980 -71126 -189083 51447 100860
20254 100860 -226820 -230048 100035 -83124 -114406 -150072 -181484 -121258 -156408 -95532 200004
20242 219635 -490419 -155569 -213481 -48771 -103411 -35727 -174427 -105297 -6082 -283558 122713
20230 -84932 -122622 -302687 -234804 7251 -55772 40560 70478 -395634 135689 -131027 -186567
20219 -186567 -345407 -164736 117614 -249459 -70091 -174248 78020 192071 -340598 214821
20208 -241831 -228453 122582 -50572 136228 99737 -445759 -241327 8816 -233240 -184956 -94504
20197 -94504 -149295 -452408 -46971 -92439 62180 7135 -99081 -325739 -14236 -97096 118206
20185 -90227 -185174 144862 491428 -62311 98080 -146433 20021 -71270 196790 131576 56112
20173 22724 -235306 28568 -136860 156380 142004 -40595 -446437 -145902 -15255 290568
20162 -235513 65663 7626 59231 227322 41109 205331 -48400 148561 269517 -1774 78046
20150 39271 47178 334786 -382170 2836 -140140 276896 46536 2950 239192 -138819 -70366
20139 -70366 -98336 49993 131395 82385 -167913 -236264 -76603 -78925 -394137 142914 114765
20128 114765 274997 -32034 -52764 267136 -639372 -176351 237681 351219 -336728 231654
20117 144302 53544 109465 -128234 135490 143811 171236 -70344 -124168 -121007 130359 -49132
20105 32850 -334619 -154707 351487 -122877 -319396 -92241 129230 -285633 135435 7368
20094 -18815 -87330 -317093 -344306 -54865 84624 -213111 12464 -81873 -8475 217793 91201
20082 -326027 291833 -169300 -25614 -54439 -212993 -52384 -263143 103398 180636 -156740
20071 3524 -334364 -9802 -196671 -121420 -249432 -135559 -32275 -71470 -58124 -337433 -34887
20059 -84841 195987 -165909 296563 -244831 -149392 -160286 -161509 -185884 -2737 199738 -83341
20047 118268 -429343 -25924 -73176 126640 44467 85178 -243428 -514311 -14910 -117661
20037 -117661 184490 -117825 148623 21604 52498 -167122 -49183 39395 -115390 -31346
20026 -18412 -49720 5070 34230 100929 71912 37258 -271360 -17435 113616 121507 -157953
20014 -295365 20364 -48323 -282627 -48197 -66955 -107730 123006 146003 182437 8036 39299
20003 39299 -127045 213956 -68692 -61190 19617 -154796 -358660 -68128 -68143 -55648 85493 -165243
19990 -150339 -4894 -345199 -102306 -35672 77482 -47592 113976 -308051 -92623 231827 182970
19979 182970 27334 -29563 -12868 -8973 262377 -86090 -27909 -189276 -246820 -4982 -109233
19968 -109233 -237910 164307 170597 -22955 -214258 115196 -159033 -131205 -15044 1113 -61877
19956 -272466 -35077 -132814 -278569 -275813 87890 -153248 23112 57830 -164189 172217 -43570
19944 234412 63913 -155396 -74962 -386741 -276141 26179 -54453 41376 86119 -34511 -398350
19933 -398350 99209 135494 72592 -200601 -276609 -74489 -113314 -13542 -341541 208332 217025
19922 217025 -304319 44239 71650 -541618 216795 83534 -23419 60835 -101050 88615 -198834
19910 -171554 93121 -147773 293040 235902 -105376 -258360 -436668 71923 -282677 -144475
19900 -144475 -216906 119905 -64891 59896 17815 415568 -46320 -319563 -97328 -158102 -330699
19889 -330699 -15293 -354276 117627 140573 -311724 -43468 -49927 231906 176997 34145 54096
19878 54096 -500038 -226151 16371 -71748 59275 247623 -271258 -54556 -22126 -222416 -253476
19867 -253476 -275164 -187278 142166 -274871 -95513 -254986 83126 -178176 88018 -115321
19856 -113939 -125224 43956 -41099 99470 6188 260004 23669 -326521 4951 -26800 -212347
19845 -212347 88038 -143911 25097 -1920 -353443 -367473 -236871 -102811 -163093 92781 -9652
19833 -8187 34195 291130 80275 235623 -85855 -166511 -361104 226387 -68184 -79287 -46176
19822 -46176 -377631 -120996 -28960 85016 -120339 -257973 261957 162199 -69404 -95254 -231543
19811 -231543 126874 -127500 -211942 16524 -170037 124741 -144589 -4702 103527 19756
19800 -323325 42622 325822 -310635 -113643 7292 -9788 89671 -76490 -311111 -76525 65934
19788 -80000 6020 107427 -81280 -66962 -243054 -55318 -89871 -111 -51254 103943 -25775 -13925
19776 -13925 42550 323451 -364464 46804 -204233 -127365 71053 71820 -120427 -114646 221864
19764 -122597 -401428 109670 -78018 -105847 -337321 76672 80101 -259982 162224 -243379
19753 177185 -79049 -154897 -257683 -137963 -146029 -1392 102248 -54457 -40622 -219728 156647
19741 -337390 57752 -48950 61319 -432163 -32753 -204449 58835 -168616 14214 -8328 -396723
19730 -396723 156785 -150667 -267140 49628 -157782 22212 333504 451758 -108584 -78881
19720 -78881 147450 -79585 -12832 194656 -264073 -134133 250364 109527 -128598 -121733
19710 -121733 -230474 52666 318703 -365947 -275924 -134820 70400 141489 -212193 66544
19699 -179015 77860 -245084 -56820 -98556 -133083 -27353 19507 -485072 45346 -201612 -30308
19687 -79681 -138314 -37001 -55441 -185025 -22100 -97456 -67909 -133141 -69877 62556 -135386
19675 211876 205547 28342 271509 64606 51167 269634 -237882 -83734 143843 -150854 -184575
19664 -184575 153609 -39268 192949 -8025 -138252 133646 -175088 -158678 -279481 223283
19653 -207260 -95732 -208238 79518 189102 -120671 -192901 -178027 -76993 -142192 -173736 -79255
19641 -82114 119176 -57041 -102011 -119185 -380520 -39880 115548 -149296 -22857 11046 137554
19630 137554 282675 -3046 -952 -80731 -56073 -66542 -40097 -23774 308650 -296603 -61753
19618 -77819 152108 44806 36939 9733 134047 69905 81871 -277711 43470 70681 -72643
19606 209455 -83734 -10350 -85072 -47419 356920 -143377 -80392 -125763 -138953 -5916 -21967
19595 -21967 -155398 -566 -129694 -271046 -100870 163782 125864 -97229 -212246 -377845 -67207
19583 214384 -54421 56515 -299931 -174050 37338 377698 85572 24008 -68346 -290150 -68159
19571 -321723 65933 147092 -82430 -44890 -177787 -186483 -94424 -53390 139333 -210910 -121685
19560 -121685 -70369 -133739 57636 -93656 -299767 -76771 223593 -40323 12274 -47199 -198519
19549 -198519 22432 20157 -24897 -148836 145821 -312353 30616 -214129 -241996 -218750 120985
19537 111 -219972 -304030 -75615 86769 282620 1220 -84412 -237384 -229396 39694 168504 2803
19524 -216223 7712 46010 60147 -60907 -105705 -17353 -310137 1221 -216578 -56098 -55479 -49316
19512 -49316 -93609 -212746 -41915 -7476 -713749 -163594 -300115 -129722 -336867 185074
19501 75168 -7122 35824 102868 -276818 -209930 -146035 -95327 -1756 59334 -145014 -226945 -221357
19489 -221357 15765 -483729 -50817 -253241 -157953 -374042 20591 321330 -56960 61820 139830
19478 139830 -225490 44420 -176812 -35452 367631 -143370 102742 -30391 -146790 145219
19467 -297060 -231022 -508961 32886 89896 -170892 48523 -280696 40908 -2205 -44955 -215937
19456 -215937 -298166 9886 175092 -201171 191963 -307726 -47861 153635 -28720 -11636 -181291
19445 -181291 -106849 -50635 -173956 -224111 103758 -24094 9665 -283125 -127618 -123790 290032
19433 191674 -496221 154782 -95712 227997 289724 -107218 -196886 -99846 -180278 -76996 77952
19421 -18110 43238 -232258 -132596 -198647 14835 -275642 -201612 13156 -177047 -66434 121004
19409 200487 -179823 -250516 -132664 -138691 -27602 -3979 -54554 -147013 -92354 328367 -235271
19397 -571130 -105665 -11581 -245499 56569 7236 242374 -14188 61796 100567 -113119 120475
19385 -252081 -65643 180779 -137293 274974 -215339 15477 -60338 198758 -85118 -97523
19375 -97523 21787 112370 -474642 -98536 -312996 -156477 -201036 -96277 -61844 183899 -398893
19363 -210539 -98786 111121 172246 255245 -95967 203403 116970 -89937 -59301 -243235 -11598
19351 -244054 -86827 -174234 -118954 346442 348496 -110456 45757 -13384 -145110 20900 228321
19340 228321 -7766 -55559 23740 -27608 18343 -99958 133589 93440 -127344 91579 -49038
19328 54503 -135899 -217944 439527 52588 44472 -80229 -16444 -255403 -595251 -47679 -164390
19317 -164390 -170075 -237266 43856 -26080 -146804 238860 73747 -486217 129705 62557 340358
19306 340358 -341468 -439392 -276602 109492 -156081 101383 128947 7002 -40708 -6704 -160304
19295 -160304 -110163 -477829 -207749 62855 8029 -14165 28361 -195487 -120637 55529 -154238
19283 -132059 69488 306062 -191134 -31291 179145 73721 -111112 -15624 -59799 50934 141376
19272 141376 -233989 55360 134474 -27295 -63190 -66165 -136941 -107399 -90257 -57756 -342721
19261 -342721 -102950 94377 78519 167453 54514 83517 172652 23590 -140692 7197 -309872
19249 -234449 -31889 -187101 -37611 -9902 -104292 -49347 -53076 284826 66537 -108633 -63369
19238 -63369 53397 -93914 53300 10138 29096 -17283 257176 -63592 -153894 -108874 -63343
19227 -63343 -251985 -55527 48137 257788 -121339 17802 87368 71842 -180296 -198174 -2319
19215 -417522 1566 -19258 208773 -86445 37789 77222 -92162 -285594 -321251 -144298 232236
19203 -101203 -262921 -110807 -143740 113450 126238 -8368 50100 50061 -97076 -84715 158116
19191 120222 432294 14682 31140 88155 -210124 -107949 -102364 -167152 170691 -362373 -217107
19180 -217107 16693 94389 -216661 75000 -40055 -283640 -25820 -43262 -313669 -268318 -329882
19169 -329882 -234286 -128357 -4060 61847 -206786 -11061 36860 -253568 -161486 56524 -12565
19157 -211810 43336 37409 -25353 -121312 -303919 -497090 5879 168302 54824 -32037 -29015
19146 -29015 -300773 -34298 275663 -140982 -241144 -172973 792 -55637 -208535 -156123 -135206
19135 -135206 309276 -169294 -32976 -156939 -240879 96248 -274409 -154024 -139744 -210817
19125 -210817 -38842 -186149 16883 195282 -95333 -303886 27450 -185209 -250505 -13073 209017
19113 56535 -125207 -37257 -127256 -373242 106513 29459 -114639 -46889 102244 239790
19103 239790 60354 -335815 18009 -19283 1625 178142 -114593 67608 284058 -251703 178712
19091 -5044 -49547 64603 -237265 -98906 -160717 -160511 87670 -237277 -507728 -122705 214298
19079 -216421 -50396 152026 11987 87613 -111226 -229623 135460 -103988 169158 171685
19069 171685 -292422 -130966 84398 -307714 -84444 7674 -116669 278850 85877 96205 40162
19057 -168611 1849 97658 108681 -36110 -225976 43780 -168912 -84410 -392029 -37597 -11001
19045 -97891 132558 162579 -94342 86457 7371 160135 91333 60959 140910 35927 99376
19034 99376 -236107 259261 150504 111189 97403 59665 25826 18237 -52399 -147966 52135
19022 40023 122012 -46014 298385 -174263 41634 -251397 58349 -50345 -299116 -428953 -160400
19010 -4995 -79216 119001 52082 -78067 -324165 -20652 148368 -48187 -213129 50565 56342
18999 56342 47415 -13262 -56786 -44794 -109309 -107257 -283220 330591 7083 -502337 171403
18987 -35637 98141 -6042 -44847 -344848 8546 -4961 -150468 79908 106602 176092 214926 -164492
18974 51038 -22026 43937 131283 -23260 -228416 84195 9574 -161210 -260709 64488 -183315
18962 -139850 -315811 286425 -93403 -201006 92792 -23666 82669 83565 62037 -284563 -88200
18950 -223771 -143193 -148768 -105698 365405 177707 89108 -268085 -3915 -186737 -26278 -121719
18939 -121719 47302 137068 -122955 -27009 18979 -182343 -61369 243588 45102 -328862 104461
18927 17592 169312 26608 -35630 -170466 132757 -530660 30487 -328359 -97704 -29420 -115837
18916 -115837 -279227 -42919 116630 -23737 5169 -139767 -81898 -27843 53981 72437 234475
18905 234475 -93932 -137730 246315 -413910 42306 194515 -156584 99593 65028 252281
18895 252281 -28580 -148311 -178061 -119929 -97981 -47886 -45027 195638 -374974 869 17237
18884 17237 68749 83678 -155159 48147 76568 -147894 -312529 -53613 -11856 -130859 -91121
18873 -91121 -83832 -115855 -272547 68372 -207918 -274139 8675 -340982 46363 -282482 189181
18861 45722 -181673 154978 -117190 -488884 -30266 -45288 -305026 12659 -107628 -58190
18851 -58190 -29293 20145 8995 -88928 -100986 280891 -373177 -112423 188625 10998 -7628
18839 -124965 -391932 -78978 49177 13036 32838 1787 -35404 -133429 -259868 254341 -200710
18827 -140198 160805 518580 -411340 -122362 -82343 -36056 -166481 78373 70147 -85469 149848
18815 154693 -134990 -201102 112754 96687 -89938 154090 -108244 -72402 114395 95891
18805 95891 177553 -259980 42618 11014 -157273 -37115 -304265 -3982 -132869 -70753 82231
18793 -174060 -455725 -36046 -524920 -23672 -55094 12982 -294644 -1348 13223 308717 -96003
18781 -566296 -320109 113842 10561 156490 248186 -318743 -111749 -31317 -215799 161686
18770 -265496 -191754 16582 77149 -276255 -194069 -194665 -108913 -110513 47012 -56553 -63369 314218
18757 -177826 -423716 -280136 -130646 -464541 269839 -109103 -69332 110421 -409716 78561
18746 -41917 -101671 39797 -209287 -404024 227448 -9644 80824 -73659 -110426 -189622 2656
18734 109944 -465154 143800 -625051 -64182 202331 170351 79247 -365472 43512 7926 121817
18723 121817 -88263 53573 5688 11982 134755 -132760 80817 -290708 57097 -179361 -287306
18712 -287306 -314347 308722 -98127 940 -43091 -89576 -52416 -130414 167342 -175614 131905
18700 6032 -161745 153704 -65139 114203 138944 160234 131357 22171 19419 32571 -182917
18688 -296265 -68235 -2571 -274722 -164274 -240879 -102805 89059 101867 297901 -33254 -152689
18677 -152689 -74932 -189004 -194370 210092 -36776 72301 92617 -206638 -19158 -97122 -76934
18666 -76934 234712 -134181 -50431 -93101 205727 1060 116213 -118998 -199539 176044 142666
18655 142666 226907 -146205 -249133 -375060 -199178 4014 -16986 -29890 -201877 -227235 38008
18643 11629 170749 -86764 24619 -150080 63062 -50626 50965 211538 -209420 13666 298762
18632 298762 -274633 25006 141540 -246017 138266 -77380 -332940 -70741 -271251 41494
18621 -228512 -222172 183266 -30489 55584 -417857 -136752 2979 44376 67381 -8081 -131890
18610 -131890 128355 -173998 45043 -187719 -101758 -241181 34510 -103794 -172977 -203293
18600 -203293 -159791 -199006 317264 -42436 -149660 -81004 45862 -341751 -200689 -137461 67104
18588 103237 57377 121498 -145806 -45549 -267992 96844 -232383 64702 323611 -40398 135323
18576 -256543 -126489 8558 -228241 185158 -279504 -240059 -129541 -114437 -307464 -37663
18565 -187485 -11469 -53744 205623 -125584 -418287 -183737 -501382 -2456 -79176 -216242
18555 -216242 -171605 -417362 2010 -25846 -181626 -40435 -37607 128843 -227314 -289000 -349364
18544 -349364 47697 -102026 380597 -159453 183081 184406 7980 -311466 183440 62470 74692
18533 74692 -29002 -12707 -205076 138482 83706 -202452 -85885 44222 33367 128894 7166
18521 255036 236598 -150347 -116347 -4006 -89589 -116906 -206309 726 -236013 -133272 240565
18509 167804 -183560 198714 11198 -108195 -91104 -340006 96789 -143594 232993 124842
18499 124842 184240 -119464 15634 -154718 -28866 -81922 -51558 -578227 -48324 -154506 -265603
18488 -265603 -27082 21277 160506 18065 227432 8374 -142238 -57353 25870 -187948 -73468
18476 81338 -25925 98818 -24759 209001 -2274 -239228 -220290 43060 -158257 -93784 -9077
18464 113369 -72184 -118697 -94794 21680 106285 292288 -273803 -83598 -136197 -93061 -67699
18453 -67699 -120733 -64716 46138 -127991 -56948 -277280 78780 347638 -196010 58216 46947
18442 46947 -170873 -204772 -76952 301784 -360041 245779 -334646 -345840 3585 39491 -223782
18430 87017 300499 -74553 40619 -137805 -49211 125954 -147214 -108721 257512 26073 -484325
18418 120405 184097 -33060 34747 -69736 -225976 128344 -124976 95176 -84062 -81312 -16299
18406 -232429 -4606 -402182 -138347 343487 -73993 129601 249005 -120869 64792 90700
18396 90700 110956 -97610 -22119 -211402 71564 -132508 5588 217993 -133495 -268683 267533
18384 130814 130220 475461 143437 -127449 323489 -32647 79432 353246 -87744 121359 4056
18372 11242 -153367 3958 -237348 -87016 100637 80075 -47946 -28271 -216956 -209033 -131632
18361 -131632 -193077 329144 -144893 220783 112224 -169324 -114794 -185741 188299 -190968
18350 -438185 -123921 -403748 -165634 -115104 -183162 112206 -88789 -252174 -119451 49124
18339 -27743 -121271 188285 -765 -262913 -47479 -38901 -341333 -59669 60418 175441 -319956
18327 -4261 100306 -31778 351987 57494 37231 -133436 33219 -239956 -189247 6909 -418654
18315 323804 47219 66211 -39740 -134741 108377 -146757 159918 -221193 124950 174803
18305 174803 323808 -161654 -354079 -141544 -307293 -160983 183429 -178688 128589 -373518
18294 38725 -217000 -384512 -75712 9004 -44954 -33230 -581233 84161 -208093 -127114 -129316
18283 -129316 172068 280710 39635 -301646 146270 -177661 -277809 -190615 -122878 176408
18272 253494 -199544 -126809 -75012 -74918 -126743 131853 12939 -170742 -97744 78458 -157004
18260 221585 -101473 -97822 27640 105605 -71148 -143787 -203381 221875 -314470 -137090 40466
18248 -18616 -18968 153950 -279688 7808 -450199 -46985 -46424 299162 20768 -285095 -192541 40210
18235 -562627 -130667 -13643 589489 146727 -211739 219878 339040 399071 -88636 -128555
18225 -128555 245887 74661 89711 -25932 -321203 -64581 -117374 -71988 153306 -4066 53968
18213 380599 120074 -272685 -378026 -129740 -136730 7678 -30563 78686 96956 41855 10207
18201 -299705 33435 -229510 -182544 -148015 182454 -124574 342365 208602 21701 215803
18191 215803 119924 -118701 14663 152022 136094 -51380 -82510 113072 23102 -80138 -45206
18180 -45206 102480 -193740 -192103 -15861 -306276 -150394 188815 -166764 -165168 41098 -138476
18168 -103540 -108963 -280650 99872 6375 110220 112682 -84392 -179112 -72307 -73622 139021 232888
18156 232888 -50647 -236747 -213753 -74512 8054 62420 38748 193732 -91127 -9437 50831
18144 111088 187139 -59918 -40247 97801 -95420 -48795 -134844 149180 -130199 -4362 -90752
18133 -90752 -60056 -166174 -49623 33691 147600 423439 84985 -19553 176976 121397 123145
18122 123145 -173226 -55819 -135588 -323507 132840 -216986 39346 -45673 -46312 -226995 303001
18110 186530 -125968 -37342 86394 -126148 -254452 72801 -186467 -163069 37192 100831 168694
18099 168694 31565 -413188 -194677 -356025 -290361 147741 271588 -108253 -47420 -134046
18089 -134046 119619 -100911 -325757 -24720 -116581 -170310 160317 -166232 50854 -218154
18078 97644 -347210 -417597 -260037 -97898 205383 37275 -390918 -43614 -295463 110400
18067 16770 2213 -285822 -388809 213144 -189526 214878 25378 -516581 159181 -171988
18056 93747 216140 60183 -168633 -92082 -194611 350266 131001 -39526 -59162 69633 109634
18045 109634 -293932 -81614 177009 90043 -52873 -348098 221649 -242078 -313096 19563
18034 24389 -131051 -64958 149099 110871 266051 12786 -178991 244540 -38185 11787 -37306
18022 82675 -11397 136446 362922 -97894 119431 -155908 -30879 72589 -12732 89751 186964
18011 186964 71599 334438 172221 -78047 -199400 16406 -119123 -178002 -217354 943 96298
18000 96298 -305700 207431 76668 61893 -171063 199946 -10211 254726 -313767 77241
17989 70116 545165 12007 93670 67995 -74937 -88253 -189319 283117 16513 -81736 -44699
17978 -44699 -164052 -58737 -134487 -411816 295202 -443704 33384 159007 58004 260882
17968 260882 -234367 -61746 -91610 -150028 281950 -34320 -88088 227490 -2209 27381 -104662
17956 113517 121538 -462349 -86103 345260 27315 -82021 68193 -251041 -178948 -360146 -157511
17944 -25914 -393267 -88995 -172792 102744 -118779 -102503 292165 -120305 -214521 -359003
17934 -359003 -156148 -84860 -104504 140077 -145489 169883 -67174 64316 -55731 9200 326356
17923 326356 50051 -98218 137770 82185 -117813 42133 6244 160157 13301 -198930 35609
17911 -134950 205720 -42191 353946 -132327 -39004 120130 153907 315953 -63324 -167318
17901 -167318 501695 -456072 -325170 -13450 120313 -11214 -276997 89740 -121212 -20431
17890 159884 273025 2036 122220 60347 -245516 -36263 -263833 -140287 10166 187060
17880 187060 149488 -172484 -219948 -110603 -186768 -157618 86767 -185523 -178326 391449 22674
17868 -82924 261125 141719 108484 -101047 25709 -312916 -76811 -17102 12780 -127268 266675
17856 -171642 127886 -21557 217446 430793 -186019 -269817 82961 -169499 78236 78412 -79042
17844 -17931 10958 102571 129749 218934 -35123 6100 93713 26635 -117968 -222743 179226
17832 210229 -82647 -72467 -224492 -208342 -231798 15955 128875 638102 -162493 -49043 -270477
17821 -270477 -41583 -76713 20459 -65939 -29607 -1359 -33917 -199128 44794 294472 22726
17809 -151084 62871 -48618 -289318 -176745 65965 322924 464998 -371266 -43461 126058
17798 -165850 -191328 -397826 -2158 489515 -129236 -161243 -147161 -110636 -143379 -204601 -102867
17787 -102867 285459 69833 -68092 -101152 -270205 -24336 -32330 321599 168788 189445 -143036
17775 157479 -184826 29191 44556 -101269 130764 -242250 135482 -281323 33399 -118052
17764 201008 -165512 -65330 250490 72321 -66710 64854 182806 123043 44914 51992 130559
17753 130559 -66453 -195579 -112231 103616 33173 93585 -331425 170091 -8032 160760 -48388
17741 164162 -195537 -121105 163721 74215 -207078 -339146 -137558 26840 112368 363252
17731 363252 207958 1570 -73203 189400 -168135 117891 64975 -507449 220002 -75084
17720 -174265 149333 -38097 89433 32650 -78173 -301445 -79761 -215019 -36850 -365797 159540
17708 273934 -233079 342013 -212039 -36182 -100782 155552 -65142 95229 -37446 214802
17697 116323 89705 174177 337503 14397 -142216 232083 -43055 -62934 189135 -203206
17686 -32188 -35456 -41156 80990 -19943 -158247 178987 -572 180863 -44996 -15556 315911 147852
17673 89710 123285 -343864 11774 256798 228827 261591 -7021 -212086 -40330 20559 -92828
17661 70655 139976 -69256 286214 -45607 172777 358015 73563 385678 299100 117629 162027
17650 162027 260766 242896 -145697 -196667 163187 105429 -104424 114762 15362 -73071 13733
17638 173470 186497 -149947 -32409 -35088 -9318 -256053 101316 -111225 45324 251650 270483
17627 270483 -161607 111570 244545 -141580 -156937 254258 183637 19 -976 69757 91447
17616 91447 -332243 28325 22174 381980 44485 -71041 207205 172000 139171 -193660 305374
17604 91984 187120 34849 277733 -226884 31653 85944 -227283 -100059 -63370 227716 -54438
17592 -478350 -1606 -136501 25094 -68422 67727 151173 170032 -54489 230566 -277566 289815
17580 276764 224205 276312 -206 -102648 218698 -336800 -176752 64124 54857 293290 266392
17569 266392 203637 -208414 73091 -51849 -115059 -64807 77885 170885 375598 535016 -15638
17557 -98116 117811 -32491 -47889 -337666 446528 349343 -188615 -37460 90572 -113392 137019
17545 301806 19809 4105 59578 219481 -104264 164462 196822 -29654 -242813 157028 -165484
17533 155169 110607 -41193 11484 222942 -174680 265678 118746 -135585 19248 -92204
17522 92964 -31829 217800 18722 347204 464704 305422 103253 -218174 -196191 271648
17511 -110221 -88884 62688 149518 23670 405800 69959 20296 217542 124140 195465 -57442
17499 96404 -217802 -346106 198205 229084 -146225 -67563 46668 488768 199452 191726 125383
17488 125383 90635 12723 -103104 -88927 142282 -170655 205483 -11190 -60129 330477
17477 158490 54866 97819 284780 573038 -85319 155836 402137 -48912 7179 71497 -87003
17465 274391 -92054 188210 -3070 -99999 13424 -23733 -55001 377509 85970 206887 181060
17454 181060 58959 194186 308768 107524 257102 302036 253555 401932 415350 346408
17444 346408 12876 22747 369617 156661 87719 358111 199306 574978 -21365 180457
17433 379637 492280 33319 296238 270462 245409 13445 -18548 321855 -17091 523404 146543
17421 829882 617093 17922 357687 169976 88051 307513 309479 195320 145189 152505 225109
17410 225109 -30342 115171 211459 76340 -63491 160108 411616 135146 182356 217291 34691
17398 154744 -64794 162688 428032 243626 226416 67724 110977 -105628 278652 86947
17387 214456 196979 104466 -18800 360683 17237 172751 -110290 27816 71152 127634 322650
17376 322650 203491 334318 31169 271085 286247 133281 95033 198968 10624 382318
17366 382318 5961 223259 172664 -88467 782991 142437 -391203 167465 -97415 144198
17355 38672 106603 316907 112715 32774 -110197 152889 161773 61223 75184 132832 111363
17344 111363 -156928 198377 -36671 -111736 -30543 -193507 195716 250410 246657 28790 248652
17333 248652 134598 250801 85792 107469 118432 364054 9881 249086 203658 258375 -122876
17321 53248 571625 417309 -49258 263312 297933 171392 243800 161200 163566 172934 203840
17310 203840 414188 297502 300328 332424 49503 274347 -41109 143674 289905 254320 81308
17298 -145465 -52046 119456 126232 199009 149180 291479 483166 457941 434269 148053 158586
17287 158586 127808 250150 350660 253069 26818 53029 118977 445393 273029 99065 43128
17275 152528 249000 -14002 9706 192353 120896 164808 -70799 -115746 487937 -26509 469551
17263 434687 393931 58956 165556 279059 299150 389952 173521 358326 297844 62547 -67707
17251 -42326 -4494 175141 378882 365733 349469 49692 -17627 -28462 32061 85938 -42735
17239 298597 37750 234173 255660 191216 193467 140107 -69615 74053 -86467 128492 193002
17228 193002 8487 -37214 377059 -160716 -156084 151392 180951 371231 165964 569330 61293
17216 237316 298721 238273 356941 5866 60458 -84013 83535 191255 178784 244449 307903
17205 307903 307780 139670 581828 23019 39261 19017 224462 382737 107920 343311 62230
17193 180374 26611 146203 441327 414553 428563 237173 574560 612992 311355 58303
17182 213668 344760 375948 325250 324305 297527 380950 108253 356738 520970 538067 277346
17171 277346 139637 610625 407665 402613 270145 264946 521167 448125 208789 169005 308416
17160 308416 339123 52 492259 392617 326644 174450 336696 122232 216626 399247 274203
17149 274203 144683 442393 -127820 393737 422405 375710 -9809 725953 376625 248493
17139 248493 281194 432692 424797 330920 420560 158217 285843 409108 392314 483476 583461
17128 583461 562632 233694 418577 381645 672863 676695 538403 408577 376455 441683 169904
17116 608146 469193 133921 531546 367907 666497 506868 288215 833991 536215 205344
17105 260749 284943 113233 497330 576583 359937 374211 432042 357496 588264 541658 788671
17094 788671 537876 511798 398762 382258 625562 133806 374552 648603 283150 341702
17084 341702 645731 438045 182863 334378 781090 566193 338121 802940 514880 528215
17074 528215 461134 491395 508880 466372 183819 734916 453150 649089 509639 210983
17063 261495 482218 536090 647883 406202 292468 256763 382354 774088 344699 431792
17053 431792 394544 424012 765080 452408 431639 528323 669172 670000 327312 586617 633585
17042 633585 362464 579739 671694 502472 567730 426519 699613 650449 962157 639216
17032 639216 488994 685886 534001 385669 689662 983885 974593 534371 716363 855767
17022 855767 650950 279927 801733 574210 523134 633851 539974 445099 566420 364698
17012 364698 798748 894607 493313 681717 478694 506386 678450 1003363 737892 754197
17002 754197 771605 569883 745773 1206404 788397 759100 725066 824613 810703 900942 806769
16991 806769 866982 924703 604907 844124 934850 816255 901750 1040311 1210521 869039
16981 869039 574903 958451 958665 724758 1020491 803228 1244858 704679 1149150 1250178
16971 1250178 830052 735947 898723 669338 777859 1080775 1130587 806594 979719 1299340
16961 1299340 1062131 925932 1248174 1168825 1021920 977703 1054531 984484 849842 1295365
16951 1295365 945231 1240503 1226969 766403 1077844 1183165 1254139 1476617 1302734 1249758
16941 1249758 1288713 1272762 1207542 1321104 1254070 1322173 1175580 1435115 1372121 1231180
16931 1231180 1468851 1255982 1354449 1426203 1579746 939268 1497229 1484816 1625527 1264668
16921 1264668 1477241 1480826 1340385 1672158 1488937 1557857 1628168 1515311 1777878 1516710
16911 1516710 1571286 1997154 1650435 1959646 1804604 1711757 1766871 1679835 1721860 1611004
16901 1611004 1849887 1815957 1956358 2123322 2064124 2199606 1662002 1720367 1773818 2299321
16891 2299321 1970346 2145033 1918774 2351566 2383194 2405312 2246662 2221028 2027967 2343947
16881 2343947 2389530 2172849 2070418 2198821 2172618 2451277 2346241 2548346 2324449 2430445
16871 2430445 2531997 2749787 2789756 2974333 2738071 2817606 2790688 3219637 2658206 2812613
16861 2812613 3260585 3473329 3111906 3046444 3275117 3302539 3095326 3393498 3177166 3408864
16851 3408864 3516598 3626327 3440251 3219489 4034872 3692663 3803435 3903583 3564169
16842 3564169 3874458 3985566 4076420 4233350 4265146 4544698 4258525 4288026 4456920 4459657
16832 4459657 4763303 4711324 4826355 4827214 5081781 5365792 5777074 5411563 5428262 5251313
16822 5251313 5410257 5761019 5364454 5741611 5948987 6019462 6297334 6413053 6580444 6353381
16812 6353381 7029854 6890076 7199167 7240735 7297422 7595284 7967244 7851012 7791540 8078427
16802 8078427 8422823 8767554 8620091 8769238 9398804 9047942 9959607 9619298 9893359
16793 9893359 10388983 10772393 10729216 11656888 11731499 11691065 11976321 12708920 12775686 13415075
16783 13415075 13758260 13992262 14233410 14699954 14947456 15558181 16456786 16878915 17233802
16774 17233802 17771070 18544261 19226195 19870424 20500569 21101471 22021805 22363560 23490171
16765 23490171 24396808 24963105 26207713 27346188 28285650 29279229 30999051 32154582 33580473
16756 33580473 34703198 36488023 37997961 39972541 41608954 43684136 45351038 47689557
16748 47689557 50124662 52729642 55197260 58461286 61454485 64587997 68185195 72045219
16740 72045219 75765615 79972421 84621170 89382864 94967021 100302051 105894806 112117678
16732 112117678 118663554 125463253 132443229 139475101 147148903 154097189 161558056 168703728
16724 168703728 175629144 182157620 187635641 192666677 196414393 199010646 200398466 200734045
16716 200734045 199572852 197306772 193514237 188792191 183715047 176882300 170126525 162930077
16708 162930077 154986502 147432562 139729257 131840162 124593430 117613184 111190322 104573181
16700 104573181 98179963 92920570 87145167 82602917 77858642 73535157 69289953 65586027
16692 65586027 61684211 58242922 55262678 52241088 49661062 47173097 44920708 42922657
16684 42922657 40661756 38543815 36754439 34923942 33641542 32314785 30482972 29271744
16676 29271744 28151051 26976190 26047295 25123384 23775648 23244237 22173878 20967585
16668 20967585 20356793 19751921 19018725 18301728 17781159 17091811 16632280 16279522 15738657
16659 15738657 15159668 14470821 14227354 14401682 13239316 13173065 12817389 12398032 11450693
16650 11450693 11560881 11124102 11034075 10781591 10601991 10115583 9840653 9307739 9302261 8977573
16640 8977573 8676479 8170100 8100569 8227627 8117417 7846980 7569747 7296630 7036657 7188159
16630 7188159 6766086 6763168 6594076 6224273 6457921 5695256 6038693 5825525 5786707 5817807
16620 5817807 5504142 5367499 5465836 5059198 4800988 4833620 5007954 4672611 4675492 4459577
16610 4459577 4653616 4256921 4533088 4635937 4320249 4184887 3591752 3964077 3702752
16601 3702752 3897164 3527360 3655463 3646032 3959063 3413820 3819402 3440199 3369069 3397078
16591 3397078 3170287 3033642 3222213 3178676 3184713 2890090 3098363 3009159 3023689 2569005
16581 2569005 2640212 2645410 2662018 2586774 2734425 2539576 2431679 2747682 2156492 2554205
16571 2554205 2827495 2305880 2300711 2222453 2507780 2580562 2262470 2039449 2424744 1872644
16561 1872644 2317330 2215088 2071569 1879663 1897968 1858840 1591552 2106318 2126791 1907711
16551 1907711 1798577 1678657 2028948 1994499 1957487 1693063 1673390 1608713 1278413 2060319
16541 2060319 1809674 1408186 1645674 1468137 1634085 1592170 1502500 1335248 1510808 1779925
16531 1779925 1504475 1323282 1733043 1355558 1134538 1224492 1231533 1430105 1286703 1297597
16521 1297597 1179538 1182863 1227273 1053253 1316667 1105693 1204060 1408609 1085039 816884
16511 816884 1359087 1077761 932004 1201795 1185053 1003014 970510 1333027 1246769 972489
16501 972489 1117578 707163 1021639 1090136 1059809 1205059 912604 733600 1037996 1207958
16491 1207958 1151605 1141034 800003 869548 549747 728059 735348 886466 984590 1056499 831604
16480 831604 746412 479583 1166797 999215 900656 794354 732649 873777 1255866 832008
16470 832008 764000 742591 581805 462919 808340 566517 601970 796046 667812 637525
16460 637525 1051004 735885 772598 734750 860889 639283 662857 436974 554184 843220
16450 843220 792820 707520 595846 753227 1102949 601767 714010 907536 701779 884079
16440 884079 586440 367620 583500 443255 399098 480829 342790 676395 565962 360642
16430 360642 127676 433908 551975 582068 568375 650087 508272 721547 560266 482679
16420 482679 745808 665138 492943 687082 433225 702687 755284 667336 617644 227902
16409 688715 472014 396781 238082 642382 498561 358844 734688 297557 265315 613120
16399 613120 488448 582714 370141 282901 279824 309743 357873 508158 531601 270022 131374
16387 469865 233465 527951 282656 193208 461098 735350 292708 351926 702155 221803
16376 47597 399908 312097 363270 588425 -23724 274367 370497 314177 478807 255183 421766
16365 421766 277586 203978 244982 34133 206133 503983 315922 226493 422251 122037
16354 478850 239480 292699 347971 232019 163567 110513 194825 423674 26224 338278 69003
16342 508175 334586 318219 283414 141480 324928 88433 95778 444468 279159 257096 295082
16331 295082 438252 259129 188734 223801 167952 81534 150138 206638 586601 -3991 289471
16319 687 112168 -23687 182077 309974 150516 257888 306810 550700 53776 494681 135507
16307 117893 -215832 221053 -217447 335625 114228 -31661 96204 87195 241268 427206
16297 427206 477977 -124651 97561 4515 76186 1031 296866 71184 179495 139833 132052
16286 132052 199402 311195 -14921 359034 54173 307704 175878 16594 -186898 173686
16275 337048 237565 21702 35030 -93933 183603 99734 53351 194661 445371 180299 80639
16263 246222 -148534 358255 45934 17429 441842 -9861 210857 -107919 -14414 156382
16252 33481 119729 538888 334158 351639 134549 13717 367172 298623 42391 68012 -175264
16240 -15411 100484 293753 135940 122509 258413 41196 102100 -26739 164585 144435 31676
16228 -35591 -126417 177135 100647 164170 -78001 -10595 154137 178593 -41954 172840 339768
16217 339768 -186462 94735 184045 138951 173245 255242 -127199 -163391 82985 126782 2458
16205 173287 -67506 -439654 150758 -350698 96093 -92082 -147358 401086 -59346 122260
16194 286791 -184018 245581 123429 363748 175552 88030 -119440 249935 212493 114805
16184 114805 127897 267899 414790 -11192 -4855 124433 160078 -30738 -178775 82240 188057
16173 188057 -111434 -54976 498032 43658 -140772 365005 68040 -405744 -108203 139977
16162 -319173 -63300 -55249 -92173 174664 -163569 25326 -966 50242 -2898 59605 291959 271467
16150 271467 131051 72465 40386 119925 -14416 -29698 150621 -327187 -342273 -35871 261387
16138 -13307 -242128 69351 168837 -34441 -91218 -64799 -28239 -144946 -50830 110287 54911
16126 125735 221431 -34445 90083 -39432 100243 126369 56665 4307 -120610 27541 -97325
16114 129610 9459 4174 -74128 189892 -103271 -290931 -95750 -67301 41229 -10238 -80219
16103 -80219 90211 249911 31205 166651 -25380 -34026 230645 239353 97146 -160382 -71833
16091 82390 -85515 415437 -43760 187336 -193634 -192747 236076 115525 -228451 3830 -47481
16079 74368 183422 -97048 197325 -33485 91808 66629 41720 20715 -175147 197668 406600
16068 406600 -238198 -78135 -31651 -210813 -25082 216600 -11388 294275 42213 17147 -294853
16056 -493125 -148189 -100268 -217192 -196488 344128 -114942 -122238 2520 42762 -97736 -61989
16045 -61989 144307 -9406 27760 -210796 -180366 25976 -52929 308153 253770 -75479 -167115
16034 -167115 161298 -29256 154031 34879 -200161 141020 131815 92826 139181 143806 -75107
16022 163126 -91237 -34469 -67442 -227148 -36530 189293 -170018 -129503 -76364 124681 -239353
16010 186666 -72735 35275 -283533 129007 -90132 227939 45780 171745 -74247 250119
15999 14260 95184 32007 -330898 41381 -139393 -96237 -16228 94888 -304992 231190 -55073
15987 -37551 -38609 -81118 89235 67369 -164970 141387 247675 -97846 136658 429211 71086
15975 104262 434160 -86803 -76117 -202222 -65595 -109968 -359506 322576 180875 -135427
15964 -41080 220319 268173 -86755 63974 -225405 27805 -58155 503901 227808 51859 -210456
15952 195057 110587 -162191 44258 707552 -118988 38825 -194196 41953 -66185 137314
15941 -171088 22382 -44928 176444 254000 -201267 -47533 52373 -184874 -164261 346733 -317191
15929 362042 -30420 -270344 167491 -13673 28448 105229 -143645 -112608 -63535 -25911 -81781
15918 -81781 -115552 -270558 111104 -23076 -340845 169920 -54356 -252140 -1487 -193242 -258772
15907 -258772 -145696 -41229 330709 2473 138702 -102776 91035 23822 -138525 -130141 14686
15895 -32628 -135768 -87315 -344650 -255566 89724 -127691 -164163 -290155 -81965 156122 61387
15883 18646 -47267 -233167 -194303 237543 -113771 -227078 -291686 183841 346523 -84201
15872 47856 219336 -121302 -166948 106618 26856 73896 -283711 133055 196845 -265704
15861 -174352 89636 -108907 -260358 -31036 -413038 123296 -216740 -164123 80081 39963
15850 264236 -230430 -27559 241923 80843 -367012 88612 -308394 -74730 53501 187503
15840 187503 249663 40664 -96597 -73728 101444 -52842 -187633 -125020 -115756 -307335 -134463
15828 144672 127091 -118120 -173260 -378001 48368 25099 -277509 -104836 -203651 -20394 -171579
15817 -171579 -29779 109873 169842 -56870 -342135 75440 56538 -8535 158816 -63112 33951
15805 -282837 -69953 -95859 28295 -85474 -194093 -134293 -111213 -101881 -117618 465401 -2172
15793 6786 227166 -309084 -55454 -62796 200132 31859 29603 199741 8879 -285504 3080 427481
15781 427481 9109 -252549 -333814 -173636 -111967 -142238 52568 18013 -75923 -54392 283913
15769 131520 -120204 71431 102185 76801 -108042 1541 -315908 -50340 -257134 306319 -53812
15757 -14787 -37532 -88192 323871 -165708 -57911 -288685 -283949 17504 -38282 -134237 -25149
15745 -2085 282523 -62514 170083 -11845 36086 -20054 61522 -264171 -96149 55936 -224244
15733 -88325 281983 1790 -34419 -134905 26562 -66718 31629 -257868 218911 4716 -447071
15721 131621 -176724 -120672 -370626 -191949 26545 -76894 -268602 -389005 122575 358061
15711 358061 -142567 -66863 -179543 75677 -92867 -172109 103551 254672 115270 -213369
15700 118562 191957 -41546 121951 141986 122523 -27709 195400 36568 -211872 273401 331734
15689 331734 -45872 -224565 211476 -303743 -234449 -229792 -22271 21782 -426426 -147936 255702
15677 -219892 -69483 -250385 38865 -24775 -181823 165945 169040 -38051 17842 182287 177588
15666 177588 54215 -11817 -143050 -133888 -291266 65562 -208325 -281175 -7108 73225 -122158
15654 7437 -263940 -123078 214271 -62741 19936 -190546 48168 -262493 -154749 159335
15643 32964 -103384 92336 -260309 -184243 104573 -5748 -335765 -249696 -34913 -214090 125774
15631 37086 33512 -145782 -68666 -80305 354592 -3316 -290462 113126 -90813 44473 -260502
15619 -193136 -46546 -373732 43903 143291 -284926 -229993 -102685 43568 -20392 94034 -62320
15607 -298580 -132318 103924 -318179 158413 -113349 -192784 180249 -229770 -1525 57534
15596 1739 -226310 173153 200916 -41903 35759 177559 -11047 60068 -39685 24177 -130136
15584 316934 66325 -425555 -65968 482775 73740 -71127 -314748 -18927 -36664 185890 -15999
15572 79546 84316 -44650 46384 22983 -46697 -386840 -87086 -88484 148108 8605 251707 147362
15560 147362 174283 -41680 14020 -488515 -70289 133829 129538 26266 241215 40016 -57528
15548 -188598 316965 -47211 -31501 -107198 339682 -144793 78756 -68447 5873 18533 541429
15537 541429 -40053 84255 99990 164611 169626 -41460 229409 253575 -48304 -72829 175606
15525 -232424 86403 -194511 106059 288200 -32643 -85460 -172626 290682 225784 -1228 -252811
15514 -252811 -27478 74994 108871 138459 -42991 69093 -382015 -69966 -546598 -196517 -61701
15502 -190769 17875 -237837 220016 -260278 -125963 -39296 -324066 341410 -265808 135333
15491 283522 64189 89596 -359061 29719 -25502 -60789 203394 78340 -131093 -123480 -75570
15480 -75570 306723 -201943 -110842 -40617 -208433 -223856 137095 -256863 -35166 -19458 -49165
15469 -49165 189084 435267 85183 129289 -442466 -4488 225387 -95646 -147738 117359 228530
15458 228530 43871 385666 241898 -114192 -141030 294185 -58832 -55297 105507 75861 -356669
15446 73773 70773 261419 -184251 -4308 57842 69131 73663 -87651 152458 199939 26666 97381
15434 97381 -107970 -24733 179613 79851 -61284 174066 -166719 -271587 -28507 -156700
15424 -156700 -106725 -186659 -296618 -2369 -161312 -350016 -86777 -31338 187300 15977 -69628
15412 39925 -31257 -187691 -203320 20820 -206946 180621 -348584 -14007 266056 57712 112859
15401 112859 -166464 -120839 -198280 30859 -30365 256244 -441793 -219802 234142 186020
15391 186020 -33316 -292570 124046 302242 39628 -82417 221218 11166 -187006 -65819
15380 -166853 -151372 -272816 64750 75113 76761 -329903 -28544 -249717 -114088 -160117 -223604
15369 -223604 32354 70564 -48144 -121899 120724 314914 41642 -84438 189093 -368923 -55000
15357 -155320 65958 -113812 315658 1113 -58512 -252756 511465 -141982 -20368 290229
15346 27407 785025 120541 -241664 17980 136985 48299 303551 -316075 65681 -195026
15335 -66695 44477 -152587 -180039 -358415 -181024 -178951 295882 584 162948 -126766 145888
15323 183637 138134 159816 -135082 268769 -447751 214657 -181136 26830 13578 -82878
15312 123899 -92730 322135 89180 -94155 -249356 -231777 -141386 -56121 -263461 264395 -105371
15300 196534 352386 13526 59636 234570 -5256 -55128 65175 9956 74320 243743 35536
15288 200200 161425 13771 -49136 189449 -39356 207246 -67671 -81792 29849 -211087 -152083
15277 -152083 185658 296837 357239 -173369 315095 44351 13939 -456075 -123840 134567
15266 -160628 162521 -46095 279765 -234809 -340449 -38526 49809 -100053 70063 338522
15256 338522 -62282 85721 -171772 -17575 301079 265923 278128 131551 848948 1088192
15246 1088192 2222282 1158657 1654790 1554770 148041 348488 -7822 -60184 561422 163814
15235 -95476 6700 107263 258244 204706 41079 187249 172614 48339 22474 25753 169001
15224 169001 253223 -165285 -104526 641524 72045 248121 257252 175613 144315 275757 34663
15212 192641 446378 -56775 180513 202258 -14694 76602 -185983 -266077 -9793 -207084 -70860
15200 277340 177886 181795 214009 206641 119563 45467 149381 113830 -63268 -144371 166983
15188 -79722 -43531 40389 53095 105235 61996 7297 155716 285584 152639 103122 -78180
15176 368449 -177358 -50622 186450 72832 -47702 185294 -161362 35093 21987 10137 345888
15165 345888 91096 137205 192677 416736 189393 168282 480063 262609 -8654 50255 -12602
15153 272609 115925 -139027 -224269 -20613 144641 216566 485433 265341 -170582 152738
15142 211027 288155 76035 -141959 -157192 -285270 -115886 23165 248495 -69341 74860 -55236
15130 292594 -297947 -94534 209566 176435 113237 298195 239261 379149 135233 261644
15120 261644 35482 -10149 234180 102172 -112242 54065 35572 174199 167769 350638 -140695
15108 39364 -61292 129676 -128218 260777 59915 250354 146621 493383 24495 204042
15098 204042 94109 161874 -1610 -30036 8755 364891 -16580 135815 427174 -22442 216934
15086 277492 355330 208390 443588 496996 151352 255261 -60434 283258 255792 285521
15076 285521 197503 -194161 51140 172593 78698 198480 -167211 186134 115484 47368
15065 -85914 177039 -201716 198794 367283 14647 191031 109223 61441 121393 24918 209964
15054 209964 -101265 -115682 107618 -3031 -45797 471516 -95164 -7912 185210 146839 226159
15043 226159 136537 204439 66519 282771 -48437 361336 364278 71707 107597 411496 271548
15032 271548 442369 378919 97217 163966 27138 82223 214813 344546 280823 222508 -323787
15020 -91857 -306165 299968 87765 -154813 466886 511359 -1788 123381 422411 -167831
15009 591736 221157 -158865 88055 141767 113472 484636 144389 65590 310443 392210
14999 392210 159961 91631 95160 -29861 -6194 251271 462706 215808 -97888 283723 21632
14987 97448 654646 -23618 -64565 -6993 284411 156940 157950 364810 362983 467372 127809
14975 -30930 378016 241852 355986 488354 -39051 517868 495176 391185 492671 197397
14964 270344 203489 -33929 423631 -134326 312307 372346 127424 423548 434260 331760
14954 331760 171781 -3649 461068 216527 352012 124571 279694 233599 287843 136075
14943 468673 274114 384523 148583 427865 219140 188942 409900 362778 318412 71021
14932 292877 16201 59714 228005 485390 123726 467554 402261 440419 243952 339147
14922 339147 304744 250702 241983 95824 363070 390480 197280 613974 157031 474214 228479
14910 486850 319191 314505 529649 7774 257155 417075 365637 158653 731466 515160
14900 515160 407140 380959 179858 351784 520552 585557 555142 480979 599514 342362
14890 342362 542698 390520 505262 270662 316282 524399 629116 398923 180306 384601
14880 384601 672062 326077 259190 246512 397981 520451 211962 101493 430332 358781
14870 358781 275264 -83692 534832 420457 197664 660231 294153 313542 540411 473424
14860 473424 300988 620354 472421 314967 442833 313706 518003 530934 714559 612463
14850 612463 437576 596255 460328 431854 164643 346970 205491 238048 371545 860309
14840 860309 473783 520006 311890 452621 676631 461535 515914 567855 238429 386002
14830 386002 182439 107859 449071 724940 702256 319097 344269 444790 307271 346093
14820 346093 274215 482340 284500 459698 353173 523333 714274 676193 464562 473214
14810 473214 339255 145481 611901 289291 325159 681207 547073 559410 590061 847045
14800 847045 651920 452756 235938 392740 759045 510967 560195 852297 686760 689608
14790 689608 739952 547855 365115 637790 438124 518496 310463 645160 467210 752013
14780 752013 452894 918623 489853 590273 620708 565444 330509 552278 675848 607326
14770 607326 605741 809854 856368 439400 876950 1149544 538114 474249 943645 555678
14760 555678 714779 752407 648804 520580 454014 847459 575155 597236 841045 436584
14750 436584 856613 923910 700794 868835 1085350 801720 908533 813350 761117 780188
14740 780188 619053 1176157 676480 518502 627676 655389 701220 822380 488653 827332
14730 827332 840672 847999 703929 719222 872758 659562 833775 651433 641645 925166 1039641
14719 1039641 667439 1006475 768442 810998 876719 915563 782194 906090 1132441 856359
14709 856359 740483 878439 983174 835563 897303 691855 826384 1164520 715022 987686
14699 987686 717846 807214 886476 1252584 986035 950843 1073397 748163 842966 1152810
14689 1152810 1087370 1108131 1058367 875898 1184968 586885 946471 944411 1156887 1045629
14679 1045629 1278466 728425 955924 1074842 946839 1300299 1218870 1006192 1151542 875043
14669 875043 1075998 1025386 1333631 1183984 1174643 852039 1220672 1270949 991638 1032147
14659 1032147 1281672 1015383 1516785 834134 1445817 992752 1276355 1452219 1152906
14650 1152906 1419155 1102974 1267961 1595381 1322493 1169853 1203139 1273259 1173227 1447521
14640 1447521 1245510 1476286 1658777 1399299 1397332 1155183 1280986 1420617 1195187 1073096
14630 1073096 1319323 1628041 1671099 1515275 1396622 1145476 1451666 1418154 1655172 1709315
14620 1709315 1387091 1336774 1441207 1514025 1359687 1749912 1219069 1519049 1721875 1446283
14610 1446283 1824516 1571093 1939990 1995010 1404642 1533365 1974314 2063617 1543867 1765506
14600 1765506 1531112 1603769 1472264 1449146 1724853 1905735 2040668 1903119 2097990 1950200
14590 1950200 1654351 1965119 2250548 1863562 2098981 1966770 2202251 2300226 2133127 1861517
14580 1861517 2205320 1856607 2353127 2122035 2364884 2370723 2131157 2584884 2396275 2658852
14570 2658852 2303710 2361518 2389786 2549456 2724574 2299028 2473200 2738815 2847550 2744935
14560 2744935 2774871 3114442 3307490 3274585 3458306 3504223 3964030 3963519 4510490 5242319
14550 5242319 6195000 8070126 12031878 20612346 39746336 49872930 22693273 10664719
14541 8045993 4273398 2610759 2063054 2276209 2543849 2012510 2300087 2376548 1884161
14532 1884161 2129687 2465584 2339758 2372031 2528290 2438711 2189538 2755188 2365713 2564491
14522 2564491 2392252 2684100 2407342 2931325 2869846 2696956 2467476 2717473 2592836 2719296
14512 2719296 2695549 2355936 3133166 2984317 2792278 3076031 3093850 2924522 3072651 3234939
14502 3234939 3206183 3350387 3352562 3325971 3374401 3329741 3237780 3240597 3584091 3840732 3471136
14491 3471136 3560790 3906913 3673784 4258517 3722275 3870465 3771186 3744824 4086850 4025530
14481 4025530 4192383 4146834 4383843 3780412 4164603 4411368 4313902 4189249 4111027 4422629
14471 4422629 4227617 4788722 4580387 4503730 5019746 4456223 4782980 5104387 4867791 5165385
14461 5165385 5148137 5326652 5058242 5185545 5128811 5200062 5493197 5349378 5595520 5753289
14451 5753289 5720136 5835205 5953941 6022282 6131041 6235584 6128176 6292023 6508241 6371036
14441 6371036 6726298 6420198 6371532 6736975 6790509 6776565 7253787 7005435 7152955 7154306
14431 7154306 7428606 7644120 7262933 7670792 7192691 7869674 8021074 8294675 8356710 8386964
14421 8386964 8393039 8535082 8805363 9167411 9054441 9030509 9105232 9083666 9534780 9442582
14411 9442582 9653671 9939493 9940929 9774002 10093183 10651765 10683430 10735260 10929899 11068326
14401 11068326 11020506 11407122 11285949 11785420 11993631 12147921 12189973 12531997 12841923 13090882
14391 13090882 13181906 13687175 14028819 13739177 14197511 14199160 14239702 14732875 15166310 15420889
14381 15420889 15834905 15765004 16473262 16731519 16824456 17537176 17691610 18178515 18327742 18949241
14371 18949241 19122880 19426588 19963890 20213562 20445694 21279918 21526695 22035569 22142152
14362 22142152 22640547 23067290 23817449 24410614 24766238 25455733 26595200 27042155 27292793
14353 27292793 28055849 28648072 29113032 29741648 30865390 31434966 32089797 32954377 33687342
14344 33687342 34734527 35775455 36914154 37434908 38483549 39980666 40914696 41851103
14336 41851103 43243478 44338120 45633249 46940158 48341752 50062007 51551506 53244962
14328 53244962 54527350 56454101 58257139 60574232 62275554 64322020 66685265 68913355
14320 68913355 71571232 73781005 76688052 79624264 82483111 85504594 88984259 92639985
14312 92639985 96279267 99772889 103769862 108095426 112533279 117392410 122409888 127712127
14304 127712127 133355094 139260501 145719135 151904535 159166471 166627328 174207879 182543248
14296 182543248 191126357 200484667 210150270 220358105 231022248 242355303 254209497
14289 254209497 266831468 279652018 293222645 306877344 321003895 336083532 350668355
14282 350668355 365928907 380998245 395997623 410820068 424482065 438114359 450155552
14275 450155552 461149799 469502510 474441789 477231555 478224835 478127685 478822475 477325363
14267 477325363 473032156 466397563 457640090 446559995 434116579 420180278 405381021
14260 405381021 389761378 373757989 357558971 341748400 325817469 310022580 295640672
14253 295640672 282091107 268597046 255348313 242538472 230833251 219424959 208680649
14246 208680649 198664578 188997454 180280661 171962009 163921605 156235619 148670105 142585159
14238 142585159 136088051 130751118 125001217 119126075 114238176 109492351 105445467 101354642
14230 101354642 97739250 93412537 89614517 86280779 83099589 79911725 77234231 73985215
14222 73985215 71803474 69176613 67344728 64725904 62654910 60615146 58539444 56851926
14214 56851926 55383060 53842362 52200201 50309639 48826141 47293327 45966813 45437208
14206 45437208 44265916 42512820 40935259 40410225 38930936 38511885 37552310 36468565
14198 36468565 35328491 34074317 33747583 32863201 32060952 30919892 30512427 29248809 29211848
14189 29211848 28052333 27206582 27072348 26369423 25413307 25340145 24525499 24079439 23310113
14180 23310113 23166050 22595947 22092569 21429935 21148066 20615394 20205790 19930291 19682436
14171 19682436 18639613 18875060 18346441 17919253 17838320 17531621 17200637 16578725 16443040
14162 16443040 16306327 15883128 15602230 15354979 15221663 14884351 14624872 14311637 14208648
14153 14208648 13819258 13461890 13544016 13005944 13039273 13228669 12489046 12636881 11957923 12285740
14143 12285740 11930715 11856526 11654799 11561904 11432586 11142006 10584767 10615414 10469474 10129913
14133 10129913 10478642 10061160 9803168 10174659 9491309 9675490 9490316 9345021 9054037
14124 9054037 8900597 8741524 8925587 8503712 8495280 8564459 8348849 8344589 8234041 8148870
14114 8148870 8045627 7636250 7687607 7429367 7742167 7315189 7388137 6950580 7225984 6989147
14104 6989147 6983271 6770379 6882577 6762435 6787431 6583562 6436301 6356366 6398033 6166272
14094 6166272 6190688 6055034 6017225 6069694 6008731 5802936 5809030 5724215 5627507 5640905 5364376
14083 5364376 5693895 5590452 5146178 5482025 4985592 5293896 4884062 5154788 5130068 5038801
14073 5038801 5003861 4901228 4791867 4952855 4625015 4864802 4661106 4761892 4473988 4584385
14063 4584385 4606415 4418867 4647134 4572834 4329145 4537579 4558741 4572648 4416866 4400883
14053 4400883 4284903 4342755 4149393 4161876 4091330 3940157 3874521 4087681 3625312 3430369
14043 3430369 3321385 3397384 3713503 3887543 3941142 3715285 3305672 3593109 3632489 3591361
14033 3591361 3417619 3599430 3397979 3552788 3210946 3407200 3595117 2851324 3125740
14024 3125740 3313564 3189791 3098525 3129387 2759930 3017154 2873258 3280476 2823162 2672350
14014 2672350 2859813 2634910 2815301 2815250 2832168 2654657 2796521 2572313 2425134 2710811
14004 2710811 2654423 2874609 2588956 2688257 2694393 2345691 2390806 2656597 1992001 2309471
13994 2309471 2400464 2380775 2492793 2374491 3159162 4203448 6733773 13868973 32323229
13985 32323229 50711767 29486969 14431697 8531297 6183781 5129985 4356544 3914240
13977 3914240 3883236 3623032 3530881 3006242 2723575 2861187 2547331 2796738 2880825 2840586
13967 2840586 2608011 2540867 2662748 2512248 2388477 2103336 2506069 2235646 2441502 2083716
13957 2083716 2320606 2153873 2390510 1755304 2008152 2048542 1985207 1998534 2007085 2096993
13947 2096993 1923039 1729843 1936374 2088591 1816169 1746191 1971871 2264331 1672522 1863856
13937 1863856 2082496 1810364 1989030 1510926 2039776 1973223 1761249 1808757 2094282 2013184
13927 2013184 1883679 1720789 1653795 1909802 1526750 1866833 1596668 1754369 1648554 1641031
13917 1641031 1831359 1759042 2166126 1478296 1557167 1774993 1500329 1425888 1469479 1477710
13907 1477710 1606055 1658935 1308486 1359425 1576916 1143473 1501264 1323356 1710710 1326764
13897 1326764 1448866 1403443 1423380 1389864 1343616 1262603 1412454 1056198 1272904 1284187
13887 1284187 1381405 1755224 1339917 1398236 1370676 1218337 1423194 1353473 1314421 1167722
13877 1167722 1729644 1426540 1390171 1162318 1003438 1344962 1340609 1704604 1070093 951693
13867 951693 1083529 1253738 1291531 1388262 1463476 1204591 1357309 974214 1038661 1196225
13857 1196225 1078047 1152473 1201602 1237711 1266896 1166229 1175720 1225973 1232512 1160159 972949
13846 972949 1162331 1108096 648185 1296695 1091644 1155583 873469 1339838 1101775 1348448
13836 1348448 801821 1095583 627366 1041629 1030527 845958 1178776 1000698 818478 1133047
13826 1133047 950210 954017 909230 1322172 946935 1166992 838822 669939 892454 1165035
13816 1165035 840763 1061940 1293783 777655 1201737 947983 1198448 1210776 1011668 923092
13806 923092 816044 1021819 677485 889416 1144625 802049 1001383 857765 887680 818541
13796 818541 827938 820561 639016 776765 828427 847372 1186213 695120 819581 544897 826802
13785 826802 764830 900461 821072 714401 843454 687023 764046 1015803 1019588 747550
13775 747550 1009867 1137519 826544 894950 900492 795797 883115 1078481 533503 621857
13765 621857 645043 462922 833808 582673 1053545 951782 783563 841971 528704 753238
13755 753238 852961 885685 641994 728601 741642 580714 1028245 593376 614227 397809
13745 397809 855417 968593 632874 666415 523425 734227 1012945 944560 655041 752489
13735 752489 570232 604750 442870 378965 298605 714640 428553 438247 908367 695478
13725 695478 623069 479184 510858 457334 651026 534337 673328 691882 604372 656790 688197
13714 688197 815165 665828 897613 639471 597154 431618 353215 502986 841498 496637
13704 496637 540406 593250 681156 790122 485706 347775 701083 396028 760221 644828
13694 644828 719316 671069 829165 659066 939779 763631 437757 567027 572189 589106
13684 589106 399415 726258 735494 830126 357387 493519 333037 581693 863837 522592
13674 522592 654544 511549 551651 427822 307545 872226 465414 247674 590483 577188
13664 577188 425019 648437 193257 -55375 494162 516332 380328 309827 684325 561086
13654 561086 635327 428707 528805 681380 607941 97674 609927 421084 589325 181951
13643 229188 708460 373802 390750 285859 839805 321476 158345 244241 378286 718385
13633 718385 316559 342299 538489 434660 194957 349002 581054 436966 200053 463861
13623 463861 825389 455311 413957 374954 301100 549176 652858 405042 374555 501367
13613 501367 485547 542987 485724 667155 372167 711166 201253 516743 511203 544576 463531
13602 463531 156265 471387 327488 798031 299424 311788 400130 215672 251567 396729
13592 396729 487778 602145 371408 894904 676450 249260 297729 447362 142610 515861
13582 515861 418660 458487 198962 357661 273532 638478 297649 171763 254219 -11170
13571 338662 443500 176736 399328 531693 95584 264463 336315 336321 90196 444422 715151
13560 715151 277943 136552 158127 269308 214994 234176 61820 300562 356584 508645
13550 508645 408137 253305 318497 5975 762048 194287 7798 536269 558427 417006 273545
13539 273545 313558 68996 302285 200844 493527 285375 22015 412417 368493 421946
13529 421946 445362 195696 212041 713468 -63082 456742 556311 374351 316215 31588 484227
13518 484227 259741 287408 440833 556360 237828 264078 -94127 198778 264002 145243
13508 145243 263114 93276 28688 596409 377828 37054 310413 343427 792943 507354
13498 507354 485037 523795 379496 194477 273122 340326 726294 720401 235809 350259 161464
13486 252158 293176 513031 445711 6193 483758 286300 190843 386336 343726 182449 420247
13475 420247 513772 62614 330370 393828 374298 101668 200597 231934 90998 210199 539291
13464 539291 351839 278063 548435 398396 209503 145680 420510 65310 -144804 173396
13453 201577 116588 337635 241272 163160 197373 -40394 31167 511526 268947 368159 -11239
13441 511 368132 256397 620595 21830 83597 142801 150782 -23935 -1822 -38376 93592 -12491
13428 426975 224379 315794 75957 196032 250719 144028 114082 702626 263476 415233
13418 415233 145363 -63905 355692 404555 95452 213914 428840 331004 273464 100085
13407 197149 361072 393144 -89911 70439 284418 -23245 42971 212352 50412 240208 406370
13396 406370 239380 181636 -262340 94462 226490 -91073 305700 27057 215873 424306
13386 424306 230490 252950 405293 248232 -178637 244443 390661 332901 89687 240849
13376 240849 287171 260662 167165 240957 284318 540021 284891 -193680 63245 164179 225187
13365 225187 47769 -4820 377252 203187 27739 387537 538535 541014 240328 -97609 328036
13353 255607 122130 20630 258546 232078 329641 309231 172295 227784 629527 144136
13342 440104 198293 192146 238284 217459 317930 406680 302471 249718 431535 222280 5793
13330 -41797 83098 -69899 135264 417225 469676 285134 -8581 -54551 71629 337876 423781
13319 423781 370305 755410 174277 386165 166711 175001 68963 225753 223617 64920 40039
13308 40039 321215 340624 444672 228924 195144 181239 303098 189089 154048 -179620
13297 446835 236331 198335 -97906 69994 20027 -28264 -201643 358561 199956 339606
13287 339606 62613 -121643 358743 400705 -65603 66551 -29902 -182893 340598 102599
13276 452 114789 170053 319323 347010 77715 40623 -89100 77194 63881 107498 -268429
13264 89228 130678 117477 -137354 -122233 145699 162578 297924 128344 -154031 -195725 -140672
13253 -140672 296346 35375 516112 259972 664721 232891 388568 -189854 236576 125644
13243 125644 369230 266344 304499 -304547 231171 -250207 327084 23521 -1611 203221
13232 155605 434337 115615 -94992 -186923 395894 29877 386033 195875 82761 219630
13222 219630 231847 451489 452569 214575 -46301 65854 112178 342134 483754 118628 150303
13211 150303 201880 319731 252352 -152136 -237712 58428 101275 -36392 58588 -90518 -5288
13199 -31160 -164 -103430 61964 358071 -304535 22615 -111642 223569 92928 175112 150606
13188 150606 294276 29322 206389 305186 228056 53207 174406 454166 -317609 -105600
13177 -63295 -71784 -179433 229832 167108 215881 217879 -44362 133033 29737 114701 351108
13166 351108 10709 302718 -60859 365040 85288 154577 466114 55829 -172158 331251
13155 108975 -5266 185579 -149783 135628 277281 340773 50695 261030 149252 208323
13145 208323 14410 -55713 -103514 11594 219068 301361 116958 192325 188043 294514 8789
13133 237451 175703 67902 201752 71091 -210518 -40215 138373 37990 195130 171119 164587
13122 164587 -144490 245996 88641 216033 -181958 -54431 68020 423523 364956 327635
13112 327635 -172379 -181068 202451 -44117 96372 215894 -58910 -94108 215028 -47296 -215308
13101 -215308 -21813 -18182 -79156 495937 194941 303999 51597 -172081 80192 307006 10010
13089 122050 214565 146534 -84369 584281 13016 -52697 10763 -149985 -14564 50673 164118
13078 164118 430088 134593 456472 -87546 193783 332450 -20995 -79691 -65651 -129819
13068 -129819 203784 217001 -211808 121622 369018 196980 37773 177076 213202 -111380
13057 -202177 202560 160124 16902 241945 289375 38181 -124168 -255132 144485 210113
13047 210113 33602 247739 -147805 286599 221598 167094 178668 160849 235647 138755 48157
13035 107854 275263 89254 82638 -63498 77897 337183 209605 217481 409643 457745 -59436
13023 102043 495001 116144 141075 69081 407286 -64846 -5448 106355 124126 149352 161617
13012 161617 30508 145675 -54178 175943 287557 99661 -126805 203943 191975 145810
13002 145810 167593 303177 408905 246336 369539 95946 -22427 -195543 295977 23315
12991 172974 108660 387191 -244702 -8425 233267 73469 146583 204647 -177808 9507 67006
12980 67006 130010 443846 -27590 -188822 429087 111666 178039 152897 424269 78507 171349
12969 171349 -279861 90656 -140550 178540 83708 270070 -89989 -109028 67978 187838
12959 187838 80344 22112 27007 -36395 222601 73443 -172592 174291 -182248 363952 -74640
12947 171572 -18994 -228314 149455 183161 243545 84841 63864 239393 24118 240907 -67974
12935 153842 228900 -33814 22726 -16459 84560 166464 93689 -17776 -50440 372680 85453
12923 55428 202364 287954 -166325 -144965 500298 -170779 -114653 -252222 230260 -229710
12912 -418164 -2112 4359 -76180 -238283 268881 178719 59788 422609 91442 312674 27787
12900 116326 -40648 -55448 21522 288387 226353 195724 -33408 149974 832 421994 36249
12888 78416 265615 -56131 52647 77083 122775 200384 55395 202161 101012 -127185 176113
12876 165792 360860 -162652 27485 -23082 -187010 -4595 -67949 -48251 -315879 167132 248826
12865 248826 -135360 66251 98199 -163652 144698 39245 5877 -342423 -174575 -215433 186094
12853 -142459 224626 92401 137386 -58107 -10048 4649 93669 302467 -119091 -170469 83641
12841 138675 177745 -135223 -49741 -366123 85521 -5020 286576 -229843 92063 42044 -174082
12829 86591 158148 -93304 39288 126187 96475 183879 245938 207869 332753 -94982 -109301
12818 -109301 -140346 72066 271373 -186151 72980 11631 -107087 154077 -268724 149321
12807 -355699 -250093 156570 -128301 -431001 220813 202052 134478 -37390 -52120 -236259
12797 -236259 102818 79255 69096 255477 184560 -246377 264542 65430 36748 122809 186533
12786 186533 100270 -51438 -142926 353244 -96408 -150107 253351 100152 89577 181333 370223
12775 370223 -113292 96295 34298 4170 45441 -297438 71056 -365860 -10155 351918 250996
12764 250996 450910 252288 455066 228765 11549 -14990 129534 6452 179499 -253902
12753 -15494 -378448 -52365 -53803 -162599 -66217 439014 -48270 315486 -168702 306865 91814
12741 60615 44504 117372 -180257 164382 -47144 102105 47484 630070 -42621 98163 141826
12730 141826 94764 207751 53150 53000 51921 230574 195338 98989 -106777 -55939 -9229 171901
12717 102063 -122921 9912 180495 -93088 73472 -16287 388537 460000 -145490 93722 336466
12706 336466 -6187 270430 -154638 247458 364508 351358 63075 100241 117884 281897 385944
12695 385944 -39525 461781 647053 -130679 -250595 -46929 79590 68776 -56837 425331
12684 -30708 -53798 -109279 156769 205735 305823 -128603 -49004 -156559 425136 -155259
12673 308233 231834 147214 108146 -94676 -223654 120236 203 -70829 251617 150540 68221
12661 112912 -79241 389044 105610 78382 73805 266046 338374 338527 -112669 90845 3088
12649 -219435 -87052 -115844 2821 104885 -224234 78701 64477 -64303 -134967 -41535 50150
12637 40315 -4487 100727 -20824 -70459 63664 26806 386909 47349 -127011 189367 298058
12626 298058 294455 56511 288066 289170 327163 -41327 56449 454264 29630 -644 213414 -44027
12613 -156591 45195 7816 -42140 -28030 -231366 208810 -240953 116254 -43766 139070 199553
12602 199553 190485 -48590 83662 458477 139671 406515 -27774 216234 125633 -92670 60159
12590 -9988 217081 216377 140903 12312 121632 -121794 77550 139711 383155 -457284 109130
12578 -48686 93793 -219785 -150809 174878 33963 202284 290299 189151 -222049 760 -94089
12566 -120643 183163 -358318 43661 99816 -20794 -117055 -129291 -4122 342054 366281 166916
12554 52441 -72079 43004 -186481 -252853 193715 -131707 -104919 85717 -109511 -135676 16133
12542 -6778 52382 51762 218271 62046 -126791 -129122 -186442 87796 270183 141369 149872 -53930
12529 66541 -81029 39716 -55643 101996 200708 -48517 79891 -93303 -1774 145138 276056
12518 276056 -61745 352030 119862 317596 -166885 237479 62110 46935 28267 305058
12508 305058 27005 -48038 -179577 39819 95881 -218795 117928 -54658 -96454 -40138 138719
12496 250857 505675 390073 180578 -148760 -90018 181549 342930 -62136 53009 -211920
12485 -44743 -162699 234437 -135554 112236 12823 -124426 -55692 198423 -155521 128029
12474 200485 47003 23060 35149 -77138 -838 -127440 -221493 215667 75377 74124 37928 47667
12462 47667 -342238 100816 1059 69628 -220249 51652 -74527 -69477 -203103 -393757 262069
12450 10913 171171 310219 -71934 132975 -46602 -43422 103691 -305575 182047 29664 30017
12439 30017 -186743 -45420 -21103 95843 -2577 164696 31192 -21250 -188420 -78579 137342
12427 204846 121010 226577 -36572 223072 -156706 -62773 -214127 302919 5428 456105
12417 456105 154829 -174208 91060 -143292 -25009 -356788 -194811 -50751 -157543 -87555
12407 -87555 39657 64403 -121880 -12138 -201837 -41196 21236 -124635 -42102 -276728 31662
12395 211462 -127163 -106702 116394 51873 -102920 -231274 -109624 245549 284440 80347
12384 300667 -195674 104908 25 13737 267464 29538 11191 -56111 -12031 -70588 301606
12372 -23301 15039 116987 -32198 -16978 42461 210374 116241 21624 145934 127741 8124
12360 111917 -243797 64639 -419750 79371 -71295 -262970 264802 144065 -288319 56629
12349 -172774 -98313 -21517 134447 -156746 175196 10469 -93826 -213 247729 -226442 -109823
12337 127110 204202 190997 -127335 -61929 82701 167146 144144 138893 -6443 121933 -207817
12325 111183 -59008 -193068 301122 -256094 -22241 -110081 -352744 -98548 35346 161356
12315 161356 195995 -196410 -49738 319322 -6154 677 21681 73119 -235631 -43541 -93868
12304 -93868 128350 -97189 -125784 45653 138391 -155322 -115591 54524 -216489 143333 178383
12293 178383 80746 -184705 142205 -18264 -155728 253645 -248162 407105 649932 75152
12282 279377 -28277 118054 235528 4967 -137831 -191841 -149987 38690 121923 -65255 -206346
12271 -206346 229351 -85510 -153793 -84125 55576 -5546 6267 -111133 201693 232053 -128575
12259 405450 -216389 195095 -52082 52450 -141836 103501 -77467 113083 311221 175633
12249 175633 282739 328621 97626 -16281 -24244 -9876 120043 -176929 -2316 396793 156985
12237 215053 110742 52364 350263 426547 191209 59465 -42077 462505 -93590 335101
12226 89297 286925 251994 170472 156678 92939 -71046 330121 184508 157783 101482 298073
12215 298073 108318 56305 197403 298513 67870 237014 212196 -60753 -87601 151691
12204 129166 231487 87910 -125153 389909 373619 141257 221846 25516 183760 622782
12194 622782 185092 59077 361315 193898 177828 425617 511660 137602 81465 -3165 41846
12182 116581 167932 384560 -14916 202742 328056 315080 -50292 518062 116354 21744
12171 145675 -778 -75683 228628 32132 -166838 45889 141751 244845 114898 -131522 -277958
12160 -277958 41014 21973 264369 499753 40907 155483 1732 318005 -245877 -114207
12149 -177218 40104 154471 -481551 -148866 176641 315183 -57036 -98445 -72290 -3561 -250900
12138 -250900 -110948 -74493 -81481 417035 205783 -124233 26043 177756 259063 -258061
12127 -43750 -52248 -34511 8040 -47945 52282 31134 -144024 240687 174539 55898 113486 110804
12115 110804 -126566 33705 332138 255812 -4197 -207882 -58333 172337 -91554 126313 -297796
12103 -16852 26916 118459 130671 355849 -158049 151745 217935 39769 71352 -213952 108988
12091 -49254 -255327 171567 -143758 88326 184172 249230 158874 -116878 125534 -118657
12080 -65968 47750 -111696 82694 -238236 2732 -140423 -62036 -54372 151344 40502 347041
12069 347041 899332 1864766 704307 -87703 -45845 22522 241940 -92648 -121824 46921 211079
12058 211079 -105164 41526 88559 -61779 -184988 190919 104336 -357954 404537 -236334
12047 -103616 -73702 -89562 -177582 -228505 -87942 -43728 -344665 -429694 162015 -65902 -412491
12036 -412491 -46749 -324673 47425 -242899 -269477 116939 -370937 -11715 156824 27947
12025 51944 -30040 132235 309203 249883 -112103 -5414 -143483 -89159 115044 -36582 149966
12013 -9733 -226820 -65386 -31320 -267524 -118448 389202 -310804 -116240 -57591 -112447 33273
12001 -308591 -127312 -176210 142571 -321728 26694 -46470 -173975 260002 36878 20399
11991 20399 23660 -44336 145810 -171945 44440 131449 52707 99675 119603 -28407 34747
11979 179261 -13477 196572 133873 7269 186181 -136981 -373539 110214 148013 21533 -146054
11967 -148858 54703 22270 228862 63108 -74909 180224 -434770 -211056 -224566 -185138 164926
11955 -46515 -28121 309598 -108086 -103537 -175403 142940 -111846 249199 -186104 128364
11944 -37365 169006 -16812 -38441 181674 98299 -38958 122184 33546 -61375 -103973 -240410
11933 -240410 33985 -100308 -154606 -152074 -289673 -69278 178684 -266860 -237153 64820 -127084
11921 37363 -48954 62515 -248548 -37077 54097 35756 -98261 76541 -367364 56371 -246504
11909 33847 -263131 -402161 94151 -44092 -72474 238494 -190783 -186 210416 217975 -53594
11897 -266922 -64954 130505 135306 -62469 -73495 34626 83662 295696 29469 175969 -57516
11885 -61978 -88136 247604 19407 236875 187374 -217813 -106636 411040 20018 -67713 -207880
11874 -207880 -5522 170783 65515 54343 295352 -48420 -258872 26184 146991 -282737 321917
11862 -12314 -115978 188371 202469 -131645 -29194 -251096 185691 -176039 -99665 39160
11851 -22081 -121179 -446356 144534 191122 96788 -271361 19304 -47672 -213497 -39109 -105461
11840 -105461 -101354 -270720 30868 18251 -222384 -397257 -136083 -26457 -192668 -375328
11830 -375328 -228112 4119 -66668 -170619 124694 61535 44294 166810 13117 53076 47090
11819 47090 99063 -217154 -76744 65328 -133366 -161639 -123723 126964 -143293 -100748 2209
11807 -106514 61178 225022 -176694 -84488 -238799 -65074 -112754 294402 -157655 -14213
11796 580 16504 212792 -146634 -75736 118134 -33498 -41939 -81228 8309 263671 206493 -274545
11783 -286511 126174 31847 -38027 -149825 79224 202168 -2254 -425895 -85856 -168974 261840
11771 93482 354307 227662 376047 -34166 -229621 81096 320341 145547 -213169 -32264
11760 -352736 12463 45651 -53730 88598 137758 -52977 -247545 70967 129482 267328 21420
11748 -277589 -126087 -52085 -195531 194267 21024 36336 17487 332009 477109 -84094
11737 38034 -48463 -105869 53983 184705 -271119 25779 -220935 344447 292764 -86373 -156655
11726 -156655 82802 92038 158889 269141 -247674 214207 70148 -175661 214302 222721 15506
11714 -536157 -82208 -233078 151871 132532 25681 15950 72467 -71503 -290946 196473 260741
11703 260741 -170153 261333 52116 182935 -29975 81078 178558 134271 63467 -46988 -236560
11692 -236560 8997 -59172 -163861 -165965 -273352 -64816 -7808 -11062 306004 -113785 -117069 280547
11679 61977 -175753 33323 -67580 -227642 -677 -434280 -97685 -9659 -273023 88276 -396207
11667 198199 -197985 -151837 376184 -178938 29808 -96935 -12607 -22573 36540 108012 192745
11656 192745 -348669 -100904 148651 -4580 -535520 120579 -22256 376238 -225512 -232065
11646 -232065 557 -81038 -8265 119740 28076 -6776 64497 -184092 -37819 -153222 -49994 5473
11633 -191091 132361 21551 114097 169575 -11039 -105303 -268997 -67021 148904 12427 83184
11622 83184 -61448 58582 326877 323687 171247 -31019 88883 232139 375755 123684 -256214
11610 293456 -78066 -32758 -50770 -106823 97397 91020 -85745 39702 31058 -8846 -183525 291815
11597 289713 109809 -1676 -57437 -51499 -333726 -196603 -87822 62464 162710 84348 -123449
11585 207447 227449 -96389 87688 312655 303756 -1198 149984 -12427 -33272 334199 48503
11573 133453 -53936 389173 -52074 -262310 29744 -13548 11673 35459 183241 324819 -13715
11561 -169563 85215 255076 6793 -71931 145346 -75105 447263 -139522 -188204 89252 26280
11549 225136 -233856 -171606 277524 65182 228757 202007 -231581 -61581 -293716 -20353
11538 85128 -109063 147629 239767 203069 -179408 -43898 -44091 46947 154856 -30317 -401261
11527 -401261 416121 -59630 196611 497813 195586 259207 152252 -97680 -204754 54655
11516 230287 104757 -54313 43661 363127 365579 324544 373549 -105908 95234 189622 -61810
11504 -199480 165142 -50844 337741 214969 172373 602916 77037 212035 60371 125585
11494 125585 64970 3501 54252 299653 182545 -123386 210718 -114136 119226 231974
11484 231974 -64784 -176757 272880 -282139 285584 120556 -259528 119771 -560 -35057
11474 -35057 -119359 93699 -33861 62925 280435 -124453 -49867 465888 -125602 -78792 -157127
11463 -157127 252512 -68359 359668 182489 -240724 131444 151430 -103466 294422 177310
11453 177310 78266 99289 251152 -68318 32156 245810 -46878 -111173 151468 17720 -321428
11441 -393128 127799 66104 125282 72298 -132891 -56511 1433 -117652 192562 -187838 76661
11429 198624 -50241 182898 153335 156434 204270 50206 -181604 -155702 -87240 -190453 7931
11417 21863 -1297 -21471 64367 35647 -53945 104598 37827 79282 3822 -124951 176587
11405 -11215 -21556 -97001 -31829 360867 135700 320493 94598 236583 57315 77181 83671
11394 83671 262330 105435 -181445 151361 95515 -57104 131211 -216220 205614 126981
11384 126981 -42091 43913 250576 -9893 -31278 -153948 -149595 -85820 2975 17972 -184825
11372 202195 148378 4136 -144488 88722 112200 410252 -302715 -129198 -18231 156237 -91997
11360 29150 412605 -388226 -392594 138208 -176760 61515 -258284 436991 -107554 231965
11349 -132046 -440482 6379 -8745 3977 161140 351683 -137792 53945 198061 68104 177124
11338 177124 -233297 46978 58557 240603 -26670 284656 -427899 -182197 60984 285512
11328 285512 -27846 244304 -100636 178230 -284242 -160404 -101091 -282008 -14687 86066
11317 -209175 -177057 163386 194190 -143343 -12259 -137845 -77475 112167 33534 108579 263816
11306 263816 -98890 -32349 48752 -39784 9107 -170784 78722 -377307 -179777 -48700 -27740
11295 -27740 -148808 10361 -70678 195897 -216884 -447206 -255216 -14524 -88522 -147718 -130787
11284 -130787 -90011 -249097 -187378 385074 -59473 -205017 104762 -105060 316445 163452
11274 163452 -176156 -356148 -152609 74934 -264394 37408 -189267 -90789 -22406 -252605
11264 -252605 -67174 -52439 -197508 123925 8298 -78846 -119578 -17750 -101830 7713 -212386
11252 350120 51765 -142909 -304647 -32107 -120417 -238189 88037 100886 50004 31069 -58205
11240 111124 -6434 97113 -371931 -162351 34998 -89885 -277079 22397 31051 -449366 161433
11228 -375971 -356234 -29265 -28182 64152 320785 302329 264232 -374982 -48515 -130435 -154804
11217 -154804 -375438 62935 -21025 233361 -256621 129279 56898 -171867 119832 -185371
11206 27906 -98975 -33858 129519 -7250 -4383 -248493 127566 -76975 -210488 -44119 56712
11194 -175733 120191 -89965 -178121 -39272 9671 27777 -86617 213235 52560 -268209 -68067
11182 223264 52307 -15105 97376 7976 58262 -82657 -160301 77453 -307918 -57116 -144945
11171 -144945 105214 -235458 250062 -75737 35244 -190560 -59155 121680 -281999 -176939
11161 -176939 -197989 80067 -79575 30039 132483 -75520 139371 -327557 -302278 217583 -309648
11149 115185 -9342 44627 -194335 49852 111612 198799 97696 16562 -31467 -136873 -128157
11138 -128157 -362270 -107163 262393 -113526 69598 55876 164057 -1150 63690 -10036 86598
11126 165841 -20011 201014 -65104 137572 19164 132256 412242 175049 -28497 -163717
11116 -163717 356065 120425 27034 278101 123361 47741 -19472 303101 -233746 238898
11105 73244 495091 466984 -346592 120633 222334 116374 -68585 239167 163967 58596
11094 292236 -7793 37425 144775 447308 4252 48437 276724 188250 401348 64972 188934
11083 188934 134086 157812 125519 608745 431410 223927 207053 138952 406874 157975
11072 183416 219955 352852 165416 293933 302080 518888 316784 556120 401741 618211
11062 618211 299669 202117 791185 693833 587183 431123 357497 595758 794587 455415
11052 455415 869558 767681 489043 511555 583492 765665 539910 935334 868436 789885
11042 789885 699288 778874 608320 605297 1085951 777944 666693 783196 702484 456932
11032 456932 712142 668263 912706 387180 651049 866724 746687 674829 730736 834805
11022 834805 943352 771842 559398 779872 752089 1004114 581898 688083 674714 637149
11012 637149 534437 720197 360447 706892 741638 922309 675228 766894 633027 897118
11002 897118 747949 705151 891159 998312 475794 658846 804498 796368 782243 539811
10992 539811 617425 801278 939345 843180 745622 767112 916770 843058 864923 1155224 958627
10981 958627 1155157 1414183 1146967 1520384 1516013 1882393 2349500 2412832 2510937 3089767
10971 3089767 2959248 2754862 2745705 2682346 2342368 2184497 2170449 1989668 1559770 1642144
10961 1642144 1600959 1429983 1737189 1621886 1598245 1542847 1623833 1430324 1048429 1224142
10951 1224142 963999 783448 618925 395910 830633 522015 579229 199718 149129 278319
10941 278319 250049 152767 334093 207739 -46126 239789 220507 221139 301023 36791 397787
10930 397787 233902 74004 399411 -76234 137900 -146471 -126299 102765 31320 106567
10920 106567 -295375 -134237 -72535 157724 275 49025 -68472 7245 83352 -2546 19934 167629
10908 167629 -117940 -266435 -49837 342926 -122454 -46040 539851 -156901 -565697 -206300
10897 78953 219408 34412 -29378 -36775 24933 -71763 -39637 -111779 -48360 -140973 93420 -226982
10884 -67061 25685 193451 272961 205518 131422 -16096 232052 399756 14213 225381 244648
10873 244648 138854 149137 193384 -61565 -234670 -456600 -151349 493 76685 143763 -392581
10861 -86698 233110 107935 15098 221949 188764 -35482 50065 -35679 -33032 119855 -27799
10849 -126805 4090 -298288 64299 -419611 -274055 233287 -97767 260254 250750 -201244 -13627
10837 7655 181358 146999 14895 -254496 -72518 2365 40693 -22456 -16630 212508 184002 -299170
10824 -36569 28790 10890 -329545 -145097 -47832 148277 -133193 -141224 -208150 59581 45101
10813 45101 -115366 182125 34181 -47824 -198333 279702 -160596 -228557 35016 169525
10803 169525 27772 242171 121516 -147328 -147325 303349 -41889 -88441 -198095 194978 429878
10792 429878 -251317 -150392 -163011 47904 57111 -245192 -151723 -89379 -154218 -86310 -91878
10781 -91878 -179861 67778 -345122 174414 74534 239321 -15215 32415 -76497 -150082 -174493
10770 -174493 -12646 64545 -25988 -85567 -50493 123064 -297042 80620 -92271 -226755 -59006
10758 -71083 69160 -158599 22028 -340269 -27059 186938 -72073 -185058 171298 228038 -145937
10746 -224172 -52722 -124450 161866 -97437 -140895 -258101 114999 -2748 119939 -174265 -394611
10735 -394611 -60080 -253469 -192935 -116579 1790 -90346 44957 31040 -41171 -135862 -59395
10723 62001 380 105058 -264626 -89446 65610 -120540 116567 -168811 -97521 164249 189633
10712 189633 -67747 -183798 -359222 211622 -4482 11372 11948 95146 -101237 18300 14803
10701 14803 65350 168143 -231364 -82318 -562 -50683 -377750 -313999 210995 -141872 -142188
10690 -142188 -69891 -233230 -210150 -117183 -182793 61360 133847 -9474 -155649 -192280 -360455
10679 -360455 -61127 -132533 -206915 3037 -94192 -152743 -30776 190760 -297543 -205945 -34610
10667 227914 57760 -161507 157718 -364791 -116789 -317610 -13955 -54177 -1007 -145852
10657 -145852 81584 -146704 57944 113592 129113 -85349 -59945 -58384 -157623 218154 -97190
10645 27055 -293085 147162 36457 453837 -155727 270509 -333379 -44949 290626 -83690
10634 -49672 291201 27803 -377616 217436 -101683 66090 -116593 -175806 95183 -14630 -231729
10623 -231729 -29114 -39080 95665 12779 -529023 -58376 -244150 -8146 45340 65169 -80846
10611 54960 20454 -36781 -3831 105529 -27363 -386074 -126637 58416 -345105 358820 36796
10599 -190860 -208932 54691 -122710 -196401 16532 -36803 -320492 -95253 -33676 302268 -106630
10587 26795 -174607 127579 -44054 -271061 22708 -318794 -129672 -15474 61802 142353 34623
10575 100459 -58386 -27428 -73204 205656 -26878 -187999 -268530 172818 13232 -15443 2672
10563 -129247 -178639 217226 158444 -257013 -263845 -136628 -328987 -202445 75616 -251451
10552 -19555 -15180 151828 -113915 253785 -10282 67105 -56789 -169607 -163163 -171767 411821
10540 -33740 163505 -342150 -54726 93708 182219 -36989 -2354 459092 -125993 -1852 80942
10528 36618 -242869 -210970 -152548 202657 -107924 -351640 23568 -228626 -114030 437136
10517 246105 -404095 -182607 -106136 258124 -10837 103345 171561 13260 -169409 -304140
10507 -304140 -141442 53406 397236 -231789 120631 260262 -13004 -76720 65874 -58361
10496 -265836 -73279 83864 77897 -233808 -131996 181976 -113453 -286308 -311447 -95163 25159
10484 -199497 -42187 69225 113889 416523 444542 283762 416735 104345 23012 -10651 -133492
10473 -133492 17859 199584 -56933 58750 31198 168056 284151 230811 63685 -19984 -159676
10462 -159676 -475444 -23239 6969 213656 -235426 -124912 -341938 56575 170450 217729
10452 217729 312761 105431 27691 38489 118385 72769 -154350 22968 -211478 88009 -183490
10440 -65197 -102806 -148165 255573 -14386 -418249 209002 -46119 -175810 192027 -553 -187551
10429 -187551 115328 126430 23103 -74754 257294 44678 -8088 280832 16996 -264052 -123599
10417 -91104 30726 233365 -4963 -130627 -96444 -252617 -22793 -61530 -202396 70036 5979
10405 204914 -108402 142842 -176508 34013 95326 -102946 70453 128951 445091 166704
10394 -50369 101160 102533 -12456 47674 344128 38690 -168886 -76631 351791 150813 418493
10383 418493 47369 140492 234447 426099 291669 4575 -59955 263847 294145 191026 119363
10372 119363 247534 -27757 257875 286454 471488 474040 443626 500767 267651 309943 492106
10361 492106 296986 244440 91940 208690 492921 -173306 151778 386891 499451 480451
10351 480451 836414 674563 336897 386990 450188 105088 226681 628241 563692 105388
10340 299949 96326 250092 525552 -2781 319854 287710 -204280 146761 -90991 545772
10329 132120 210995 -104876 121932 -111828 185703 82591 228460 450069 254729 163209
10319 163209 32369 4031 -138476 6517 140175 -191133 281489 115602 -76400 -290006 -124120
10307 89908 66442 265363 -117652 -12040 -124523 143498 37674 34537 -28718 -44277 193278
10295 -71442 175625 -5041 298987 -289810 271134 277878 -153872 -322899 -199943 51049 -166505
10283 -571292 168526 -130126 -42374 -81171 188222 27365 73084 315600 100033 -140224
10272 -225409 120013 -307611 -254527 -40251 268266 -335829 -30914 -263129 161956 78411
10261 234325 102220 297023 213043 440697 30264 124460 440285 61743 110532 104136 -367485
10249 -349849 221121 -423000 223391 -231480 -147208 -141353 184691 -234441 5606 -249045
10238 -111687 -19153 202684 -163216 -238752 -288459 222759 280089 -151554 -221522 -241086 -285106
10227 -285106 -128422 -183135 -5617 -6764 106437 33513 126271 180315 -283063 -30129 -116643
10216 -116643 -139885 112351 305158 42881 -33127 -166711 -249196 -112710 184532 -221695
10205 -98482 -171160 -163891 -5136 -624 -109184 50666 79850 -59297 -316265 -88301 479837 -224660
10192 -149697 -28204 -166864 86496 56711 -46323 163796 -324657 -233549 73700 -384781 -100051
10180 205279 -117039 -89083 -195965 171540 -52039 -153729 -256807 -415688 16567 375636
10170 375636 -8047 -164691 -218230 -72227 -37210 59381 -413954 -201575 -311385 83938 -22098
10158 8164 117888 -115072 -152919 -165221 -67246 -95958 -252351 -119098 153195 -67470 -238864
10147 -238864 -17483 108725 16793 -183624 121943 123433 125118 -178215 -85825 -44381 -98205
10136 -98205 -42322 -496938 -63483 -172751 -162597 -208150 227499 -46941 -60279 -111057 162538
10124 268628 -100402 -36168 192610 -437826 -171956 -14769 -160552 214537 319891 12399
10113 44740 -60525 -125395 224093 -7356 -61666 40397 199546 -10084 -234967 -280666 124213
10101 -197641 -232329 66964 -150490 -21178 -204883 -257477 -107204 -278814 134823 -103774
10090 -6454 -416288 -558865 202140 59354 -100504 -105371 65421 -229790 -52862 51014 426
10078 -289075 9587 22881 280981 -217381 -54867 70561 92566 -58318 251874 -341572 161165
10066 333397 152953 -533559 72588 -172265 43943 -166658 -64028 -194370 -59417 -1445 161926
10054 -166654 -61949 6344 166112 -270247 374916 -189722 25872 251654 -12453 -51404 41959
10042 -341556 -158239 154314 241158 15223 12423 4248 -127048 -102421 151492 -249155 7888
10030 -198648 63850 -326785 -265095 -68811 98962 -264191 -96083 -413996 -227614 279882
10019 61062 -131405 -112056 -77292 -311487 -58770 -358260 -144696 -5445 -107004 41922 80791
10008 80791 48299 139120 20494 -245457 283041 -211000 -133849 -159040 -170547 -124038 -167759
9997 -167759 -658 -435962 110800 -327785 325063 -168233 -377821 -148671 -160284 -255725 -3162
9985 -229266 105474 -39862 -332437 -115908 3491 -160446 75734 28847 -153297 -55833 -46329
9974 -46329 270534 -73901 81564 -96136 -283623 121258 150190 -112475 -20367 103423 -24581
9962 -222403 -150338 -111127 -420155 36621 287983 181882 -253313 -94463 -186855 142359 -182170
9950 23775 38260 -298287 -145587 -409861 5476 31218 191119 -87506 113192 -355129 -132134
9938 -337935 -407855 -233800 -42684 -252741 -59287 -184571 -69102 -54789 201764 -106973 -239860
9927 -239860 -249521 -37924 4172 175711 -126792 35309 -26054 -327834 -181159 -141253 18247
9915 -2847 -159287 -127793 -190948 -147092 -37530 298277 -317209 -170046 82392 67756 -9603
9903 43894 -305418 -69647 58379 -89077 193430 204752 130545 150262 -341744 -27032 18658
9891 -248436 -289691 -132582 49473 -190699 -454896 -123132 -293846 280516 134806 -223418
9880 -169172 -154332 -244651 -118279 164911 -124847 21057 -180182 -136340 -91449 437097 -211132
9868 98387 77745 -120072 -497696 56077 -185985 -346805 -124547 -180863 -239949 36778 -264768
9856 -54339 -155722 -132641 -414084 189843 -79816 -149962 -292325 -227599 -232120 -65268 240456
9844 63139 19021 -66713 -18385 -123934 121661 -183828 70914 -167855 -40736 -168497 -62577
9832 -215848 -31562 -102198 -419654 167275 173856 -151438 -116550 -443930 -36049 12554 -42376
9820 -41443 -70237 364485 129083 -55168 -86828 -167772 75028 -144795 85078 666 -192914
9808 -74015 189486 24668 259253 -279083 -10072 261273 -168542 9377 177292 -490783 78164
9796 -204043 -86813 -357808 -5417 205333 -266165 -228022 7676 -218048 66891 -316312 -247889
9785 -247889 -28700 242639 -74774 -72932 -172808 71659 65755 -329255 -128479 60628 82288
9774 82288 -14452 -341590 -94752 -47589 -58305 -164942 175041 -394946 99476 116628 103904
9763 103904 -397076 -41905 -152083 -2945 -107156 50107 -414454 178446 -201326 -200938 -126628
9752 -126628 -105229 -228705 -138914 -28717 124614 -85496 -125873 139388 -127499 -93084 -182100
9741 -182100 -113256 -352973 -108558 -10741 -182199 120441 -138673 143805 -80989 80072
9730 423859 166795 -101053 106340 -82534 -73516 -42324 -48140 102139 150086 44356 -371333
9718 96491 514036 -57722 -368886 180360 -306093 -215763 -138144 -235209 -200952 -181625 8329
9706 -18668 -157431 50854 104821 73627 -16080 -195181 452361 237981 -53498 -57866 -285023
9695 -285023 -158670 58138 -48980 8819 -168284 -346662 -60174 250875 -84176 11410 -163806
9683 -286942 -314379 135030 -212209 -118819 266728 -87272 94404 242507 -143970 -174037 -20421
9671 325564 95454 13749 -128720 -46071 -45232 -15121 -243257 -29278 72714 -131195 -442156
9660 -442156 93476 -344774 85820 -52235 78018 -140617 43437 -190242 181829 -84989 213155
9648 -361750 209254 -70661 65983 -65306 -286011 -195489 -109014 -327201 -14321 79819 314394
9637 314394 -183016 -149534 55412 -163570 -100866 -217523 -199899 44179 -245621 182950 -74278
9625 153951 282061 43732 2104 85797 -207243 -365874 -23694 -369373 -94060 141764 342546
9614 342546 -254317 -3100 19421 -230312 -45298 -171661 -136525 -102332 -89965 -111709 -107487
9603 -107487 -65698 -241843 141471 -94051 -76562 -53092 -190254 -241108 32759 -339760 -33822
9591 78357 -83614 -161022 51290 37364 -72965 -255506 11891 -261746 -343582 21824 75976
9580 75976 147034 11272 -19797 99328 -76892 8136 106476 -155788 -35897 -278242 -191087 -358393
9568 -358393 -169421 -339886 -809 -351600 -75456 -44872 -104570 67304 -151779 -58212 -87845
9557 -87845 162738 -86881 -350787 57230 29548 -311847 -46229 113121 -129819 102449 170687
9546 170687 43553 197208 -145861 -272850 -273253 -196366 -50087 -337680 230717 -335380 -164125
9534 -96695 219723 -69214 58005 60321 257104 -180996 288151 -65126 201125 -104798 -186950
9523 -186950 -325801 45507 -129640 166467 -323966 303585 159606 43389 349626 -399470
9512 202843 -229971 182013 -15966 -47479 23912 -175512 166177 -118559 45459 118307 -225120
9500 -172851 -147914 -459556 268785 -210159 164924 26017 121794 131424 -325108 20950 153721
9489 153721 67571 -210663 -105152 -21329 -261115 -52036 -143464 -48791 60224 -131857 -232704
9478 -232704 -334735 132865 -46182 186468 124024 -47042 83601 -155754 -113039 -437835 -210639
9466 -143686 81752 193139 -114870 -365429 28221 95858 -175950 74728 -264999 -136309
9456 -136309 -271712 88756 65383 -245946 2223 81955 151120 -220056 121404 -249058 -243435
9445 -243435 -5671 144523 -134581 212006 -332928 -68693 -361917 -239914 -110183 -260676
9435 -260676 -172257 6473 -175948 147147 -202485 284346 -18079 -162390 -140193 341754 108233
9423 -123682 -193916 49420 -24256 282521 88310 11573 -109660 -220642 -135597 113571 -214436
9411 -234506 80270 168596 -9294 -79803 20016 -408509 -23451 -200014 -139241 154563 133859
9400 133859 -335495 81098 -194470 -73977 -206856 -178244 235553 -61137 156669 175302 -209442
9388 -290700 -209178 -130923 48637 232612 414424 -143052 -411539 -207583 -94867 -93921 -220253
9377 -220253 33348 -7873 49407 9634 4608 -401310 60872 63742 -177463 43181 128428 -150724
9364 97978 -24255 -180338 -169411 140958 -47216 -475847 -209901 55102 5932 -159379 -114073
9353 -114073 363779 -9775 172408 244667 412874 -175790 206802 -150892 161877 -200609
9342 -129245 -254435 62117 21037 136756 92361 -235582 15355 -1414 -303286 -397772 -328433
9331 -328433 228871 -47076 -186045 -62557 172190 298268 56606 29632 25698 -42793 -295258
9320 -295258 -139146 -260490 -277289 77471 -2372 103614 -159180 -38719 36017 -449301 -21150
9308 -19071 -37096 178843 274658 30629 -64883 71273 -70764 -67871 1491 -215472 -150973 -374330
9296 -374330 -6302 -57638 -25060 -36964 -55416 -364278 -116478 116977 -268555 79064 -87948
9284 68505 42356 381109 -151931 -249792 46019 -53559 -107559 -304886 -76256 -147375 29292
9272 88231 347611 -168287 -220592 70327 -102433 -222928 -80772 -187583 -30212 66516 265439
9261 265439 -236011 -476240 -185481 -30624 -121265 96396 -169213 38045 -174950 -121735 119402
9249 -139042 -121271 -26593 -150233 24230 223084 21542 45690 -116346 -137176 54748 -196847
9237 -143761 -511320 -227419 -53175 64135 -162620 -97165 -111616 297216 -133297 62147 100195
9226 100195 278234 60414 3809 -23619 -122467 304214 -226341 -67292 -53280 -381125 80445
9214 -488324 78874 89338 -93433 160211 -37601 33090 -861 -315460 -47616 -16780 198263
9202 52015 -85918 -23050 -120663 161419 -2494 -274156 224995 -161683 230309 -130589 92926
9190 -124533 -139819 -273262 -59625 284171 -338675 -303858 -67113 127822 215876 -318692 149715
9178 -69533 308110 -505273 289326 119607 -128905 121336 72468 169013 42802 -47499 74404
9166 98629 -188321 -29534 91070 101399 158290 107501 -13110 100909 368017 -155760 -350106
9155 -350106 -266302 -152142 -148720 -140984 -334979 -15419 -1201 -83973 180875 -357580 -108103
9143 16662 27400 -108828 103186 -112185 -395803 -141032 147867 -45651 27484 -116291
9132 -121764 -142974 -256223 -532919 -197941 232941 305436 -74533 -478238 107139 -310354
9121 27985 -91689 -51408 165221 51862 -159673 -6534 47825 47606 66799 -166870 -42055 -487453
9109 -487453 123163 43281 409341 122426 31106 -5609 -348715 -49910 -317114 -2786 -56870
9098 -56870 -20064 -201906 268270 -209821 74920 36892 -101924 -212533 -30835 -240066 -51077
9086 -232479 -123786 156700 -16753 -127192 -234187 3746 -196251 -71699 245288 -46792 319898
9074 101288 40088 -89146 -29752 -245927 32483 -141542 -200200 -117521 -45458 14599 -243667
9062 -206584 -392070 -507346 -162131 -228027 -93938 -4874 4232 3527 225197 -199865 -117644
9051 -117644 127490 37437 -63633 81718 20805 175305 -72693 -250124 -192993 -163288 -212894
9040 -212894 3030 89853 -334880 -319818 -252026 -36811 46159 -170171 -173441 -547805 -20941
9028 -203230 104619 -225821 -262891 349819 -258197 160951 8584 76350 221426 37409 45916
9017 45916 -119343 164785 -123408 190099 -15584 -140847 28410 162734 -477624 9863 -5996
9005 -176014 -230225 -15451 56762 65687 -261872 236574 -36251 149681 -111286 19293 49155
8994 49155 14814 -138748 -58385 -14134 -175626 125709 -242588 60223 -21644 -309956 55912
8982 357 133357 -358118 -241720 81346 -7786 -20822 -208925 -297907 -291316 209602 8210 17539
8970 17539 -366037 93374 -218758 -142954 -225035 40293 98501 -41983 287453 124068 -344833
8958 -219953 155914 72300 -340633 15317 -54049 -492859 -31704 -181624 -125415 169467 -78161
8946 -198883 -244384 -344907 280447 -155638 133611 -222990 50228 237326 193567 324675
8936 324675 -67215 -32861 684667 208198 127532 226790 -127523 518206 -150960 309194
8925 423011 959653 1233387 3299726 10337046 20269851 5090511 1094817 568956 632514
8916 632514 58365 141604 -120212 123011 -74497 266732 186448 -175919 283660 544182
8906 544182 179293 -120073 50730 192221 -13642 -18970 -374732 -157841 -184187 -96188 -17229
8894 24813 54525 227491 -160169 -201995 -71287 371681 17733 50728 -3594 -252960 -166267
8883 -166267 146981 -441487 -260974 -1842 129749 100553 231702 58025 7300 -134650 -371287
8872 -371287 -154425 -92477 -177289 -149099 162872 78743 68909 61148 -27060 -245076 -240499 58157
8859 388076 -225644 -207744 -89541 133750 -88326 -93994 3749 -164990 9853 -4526 93620 126376
8847 126376 15247 -188652 -72224 -45400 207721 25527 -143 -82876 65398 -347878 -150878
8835 -47269 -71915 -182157 210277 -118218 -60687 -13745 -125375 -124878 89430 -233161 -305971
8824 -305971 -316227 -130707 194509 159260 -19777 -146948 95894 150369 19167 -62421 -32046
8813 -32046 -282629 140049 -86998 295006 -200598 -3891 -64153 19954 39866 -41607 -39901
8802 -39901 -350542 -280444 -176587 156426 -197451 55094 -95874 -99269 182172 -50931 -74026
8791 -74026 202738 -247718 -157786 87297 -57420 -106456 34816 126863 -142979 28865 153920
8780 153920 18129 66430 -327864 1505 -64363 -32442 -193093 -155237 -538 -76700 -76959 -235191
8768 -235191 109404 -492230 -63513 -21091 137067 -170850 114995 -35684 -45961 136748
8757 141906 -146694 -30417 161181 -254447 231484 -314170 -133243 -184446 -115961 -284771
8747 -284771 75591 112201 -92948 40302 138568 -23252 -160516 73117 -232614 -70310 -55030
8736 -55030 -53992 -39752 48181 -157881 7760 188364 -284343 -218255 -32821 9072 -36288 -334275
8724 -334275 -107823 95699 -84805 -156989 43177 193 -323663 295170 -16948 -95683 -184888
8713 -184888 -59366 124322 -84503 241294 25074 -238082 -57342 -273225 5423 111217 -339069
8701 -79275 -231733 -132054 -228135 -106962 -51948 -306921 -158760 24900 -167013 65544 -2284
8689 -103530 128283 92280 -100104 137490 -156919 -53454 290521 33029 380481 352468
8679 352468 119884 -219619 7409 -182504 188609 -186240 -37010 -50370 117348 36 77727
8668 77727 18539 10360 -10876 -84031 -231546 238221 -143762 -194929 -64550 -119910 244151
8656 -204132 -91389 -130094 -88674 -38156 171371 -150368 300234 36234 -106997 -116376 4619
8644 -542853 -71238 111868 63831 63526 -73385 -83575 -37812 41493 1945 13910 55364 880
8631 164271 -56215 26736 140315 -323712 323197 73844 269277 -243473 -101832 -105867 -160033
8620 -160033 -72755 -193008 136323 -542327 192436 -3489 163168 57232 -27535 -85133 -253243
8609 -253243 -154901 211991 -54339 60558 -77346 -424711 42751 -5188 225814 -184006 -209196
8598 -209196 216983 104702 -114233 88705 -148647 -110068 -12942 -144111 -71405 -20884 -124101
8587 -124101 150818 -262016 -132914 -269897 77058 -42873 -103149 193974 76619 -300023
8576 39676 -214839 -222932 -35644 -59508 1580 189329 -121303 51855 -112281 439481 -21625
8564 -282043 -194351 4044 -79551 -305942 -27263 21489 61405 50281 -30786 287371 -85964
8552 -211381 -175209 -241744 122800 -51115 -443849 -226769 76255 -313990 -345439 394177 -394063
8540 16328 -140015 32209 63919 174811 -119519 -33388 -320693 -74782 141047 -211701 311987
8528 -39278 -77634 -131309 -358345 -82487 6775 -163005 -132426 157806 -349236 122288 -13147
8516 35092 40138 -197712 -5230 -4394 -98595 157832 -226298 206519 -11137 -180776 -67472 -76044
8504 -76044 -42846 -191122 -30402 113106 -2762 -165327 95602 74113 167420 205586 -84411
8492 78538 210650 80602 -132847 -106443 21149 278950 -151598 162250 6579 -409295 -50884
8480 82412 526610 224352 33913 -225015 81429 -217028 -219250 -74963 -81422 83656 23359
8468 37129 -14302 -525131 -325157 16348 157794 -158427 31336 58599 -291412 6546 -10827
8456 -183059 -174611 306686 138691 200281 -31542 11258 -212572 177408 183950 -151430 -141940
8445 -141940 143924 179342 -119060 80194 -199280 166000 -53460 41364 -20697 -241732 176938
8433 -291893 -149145 252154 -17015 -287407 -64839 -125667 180509 -179247 -271015 135253
8422 343622 66555 264641 149919 96251 197048 -109372 126699 -36405 22311 -189219
8411 -219449 -316614 41634 -26550 -81603 -245389 -80164 -43031 -262374 144381 -28469 26289
8399 -162144 -172144 -20031 59948 69713 -43786 -156113 -52854 -338821 -23001 -118436 227602
8387 -118897 203602 300754 -83679 78471 -154560 61481 152873 -184182 133798 -130746 -175574
8376 -175574 -148683 -111149 -25466 -120406 -143739 175945 -124492 -73127 43123 -103287 229551
8364 61250 19173 257151 -78283 -261936 -287358 -216013 114247 117630 -152961 -20324 -206660
8353 -206660 -314813 52877 -239899 -271206 -236493 -96462 -122007 -20787 -208823 177417 -7354
8341 198783 157032 166493 -269207 -170978 127930 118260 49371 -364807 264611 -371631 -160605
8329 -180789 -57189 149794 26395 -126270 -161922 -229961 174657 121207 -96034 -101695 65078
8317 -242812 58914 220410 288975 239904 57394 -187727 221561 -15694 -90204 48031 -212091
8305 -173429 18855 -258662 -90990 88658 -128143 -47593 -281890 -76081 9208 -173023 57583
8293 -476337 -310953 -76014 -27995 209816 50114 -46814 111960 -103091 -64559 15638 -16670
8281 -300189 44474 -356083 163081 83298 228268 56471 -197935 -215251 -188590 252735 -436670
8269 106717 43947 -392266 -4785 69906 -54413 239826 -61211 -21565 91954 -179330 -60406
8257 -30519 -12268 12635 -159519 188324 -23259 62610 206462 -31265 -12038 26303 -268153
8245 -95114 -21158 215227 98458 93483 159007 100561 91229 -51119 182072 -508301 -96739 -227843
8233 -227843 38765 57400 -166737 -94223 133399 -150468 35586 -117924 59146 32677 -229019
8221 197995 126395 -144106 159717 -140905 -229492 182150 -32459 -91750 191796 -169295
8210 -350019 7399 -411679 -219423 -82581 43762 79398 -375349 -59708 -102787 -272417 81676
8198 -182272 -76845 -164914 121284 -129201 93398 40097 -268731 396546 1427 143741 133179
8187 133179 -287665 -382355 -100978 -318803 70154 -274439 233044 -397740 -455194 -31965
8176 284485 272706 -21737 -254539 -195612 251286 -445751 -49533 -353232 99727 -76500 -65994
8165 -65994 141818 -166645 -246661 -177123 -348897 322965 27970 158202 157659 -35009 -44944
8154 -44944 -16730 -30306 -15493 -146602 142286 -168384 19966 116808 -68443 -246128 -22078
8142 -157839 -382843 18157 44654 -346037 100952 2998 163452 -124794 -16528 -196434 93939
8130 226627 -66646 -211033 -266868 -43646 -196751 42444 100850 -11576 300269 -90583 -107882
8119 -107882 15454 -112272 -193155 1337 -62699 -226097 307922 -124885 -190735 -179890 -93312
8108 -93312 -98868 283607 4465 48387 348706 -144999 -217943 170319 74878 29332 147659
8097 147659 4277 -205427 -140596 -215055 14990 23229 -99411 9200 45276 -174304 12084 -388259
8084 216146 229858 -36260 -75845 -363497 -116451 141267 287124 -171662 -98450 -145793 84165
8072 -82363 -67030 206600 -39105 -158999 -193557 -204044 -178733 -79095 71651 162688 -303551
8060 33099 135793 -44784 247523 -188816 -295083 324684 99319 -116689 -106558 91469 70035
8049 70035 -379993 124468 -70893 30364 -180350 -1517 -287587 -356578 1251 -54396 -61494 -1260
8036 -170761 -117736 -242333 413487 184787 -265317 -39754 -56025 -225946 -198682 21426 284862
8025 284862 18781 316858 -255756 -134794 -83959 -328854 -60607 66563 177520 409715
8015 409715 -140965 -1908 337180 -18900 -38000 -111780 -76417 -85647 34999 102396 -348493
8003 168222 -58170 97632 86291 99512 119900 -305946 241490 121119 -111108 -250647 -140960
7992 -140960 -155913 515373 -221879 193683 65239 -259914 17796 -153985 -79339 24835 -60103
7980 -366204 161901 -4624 -33168 -179054 187495 -44953 -138748 21615 -282329 35529 36127
7969 36127 222101 45378 99023 73631 -99142 -132718 -170599 177864 89571 118309 6077 -176501
7956 -205282 -180481 -238512 -58053 319242 -830 196574 196288 175198 -180298 -279194 -259588 117837
7943 -134496 -36182 232570 68972 30063 -12079 6185 -133595 82288 18007 76268 -75871
7931 -47646 26482 -238074 -234566 -117244 -292882 101337 157799 150531 -317573 -52088 -417904
7920 -417904 216395 -9774 -183549 35986 69930 -331641 -27785 -168108 14035 -61174 -78249
7909 -78249 -320689 237047 -52558 -101863 -77942 43512 98909 -156922 117111 -377968 400954
7897 -306982 -177478 358633 -129393 -136181 -78805 -140683 198811 -87685 -31274 -46139 -47914
7886 -47914 76917 42708 20648 -132975 224870 -60419 -285298 -99080 -171293 47490 229487
7875 229487 237707 -105462 -10048 12430 -17261 36911 328157 233163 -118305 120482 -190243
7863 54990 -208965 -68040 -61940 2664 95267 -116016 -295964 117136 -149022 30888 -80932
7851 141252 35913 70838 -37951 -351743 66123 -56306 -146881 -4845 -105494 331456 16906
7839 -53222 257159 -307835 -109131 -237172 -4334 -118450 28535 402657 -122374 67078 64852
7828 64852 -123722 148786 -7321 -18712 -56375 77755 -19082 -122150 -81148 -302867 -2449
7816 191730 -129176 121607 180144 -16397 -73844 101311 -310055 -163232 -386167 127279
7805 -57680 -176426 15988 14356 158522 193781 -242754 -82378 130753 7720 -85875 -173977
7794 -173977 544375 29786 123774 -43638 -50390 -139984 -233254 -220638 -103413 166882 176437
7783 176437 -212073 3405 4034 -194005 -99948 130322 58503 -62010 31144 50074 120257 -270538
7770 -266992 -170767 107915 -171633 332336 -116035 110796 -386644 308172 -221403 -51716
7759 -227572 284517 92777 53472 -50613 -155359 -14102 -31331 -86923 -298615 26736 39218
7748 39218 31419 -60336 -32775 16877 162222 85389 -265512 223522 4240 -96844 -2724 -62607
7736 -62607 -91013 -182289 -141424 -21588 -154021 -359266 78144 48689 145345 258085 -378335
7724 165160 119260 -41762 -284672 -166278 -6399 -102640 152326 -88125 77359 180187 156671
7713 156671 -140636 -253187 -82710 -30824 212007 -390935 38696 233323 146947 33912 -412002
7701 93830 -258698 -28363 -307548 33246 -168465 -200062 -274422 -409452 -452061 -34273 216023
7689 -117992 -111509 184224 -16222 -12011 -171719 -2831 23037 118092 197631 -14 -120162 -60707
7677 -60707 306008 293280 -125277 240909 -279895 158792 -102786 -62173 49310 106011 -194350
7665 184061 -327290 125547 -84382 35716 -50125 12648 -94020 -205393 307121 -195597 -54038
7653 151115 -255928 -238797 41692 -276062 -190687 100040 -32246 -2862 -169227 -78803 -64535
7642 -64535 -315784 -75964 -170082 -218121 -233528 -264926 -225662 -207937 -26045 -25407 -316560 96310
7629 61288 126475 -207151 343379 155948 97169 -183140 -124419 161440 -348493 -80048 -28972
7617 -72803 39323 -220757 212779 -391522 -74719 219923 81586 -353031 115843 189908 243656
7606 243656 -44884 -145327 158858 -95931 292909 122276 161858 112023 15521 75491 103724
7595 103724 19944 -214607 -383525 -183601 -119948 -76578 -115368 -74600 60784 257257 4674
7583 23984 77968 -54713 24996 46074 43757 232869 -393905 -55625 -221846 -175848 271277
7571 -141335 169433 -84082 -135839 97367 -117360 96751 101720 -102721 292248 48411 186979
7560 186979 -474014 55432 -244147 7461 22577 -324832 -22847 49146 121203 133976 203390
7549 203390 13201 84284 345038 97300 16961 12378 55324 85499 3970 -106120 34681 -53151
7536 56351 -254398 165076 -113934 89347 -165347 131096 209441 22436 395369 -207972
7525 278594 -227412 -208708 -102509 -150595 47518 -158229 -94980 154742 -44518 48329 -97768
7513 -313246 226852 137347 -41164 139329 -45100 124859 165247 -11622 -67156 -20527 222102
7501 -47834 -395637 -523 -105054 -86622 64291 217522 -68354 -194027 -239321 -177939 -12206
7489 40547 -270289 157543 137535 25923 176297 35855 15832 166613 242754 153442 130677
7478 130677 278265 -12390 44907 -3570 61451 -64305 -101261 -149414 -373508 289549 -295811
7466 -274674 57535 -85877 54524 136837 -130732 82435 -279011 131453 -354310 55937 -199998
7454 -43392 -10785 -110851 -174664 -276208 77443 289499 -136075 77774 -14745 115432 -166367
7442 73186 -48928 -174736 -70074 -29454 -171732 -300690 -254802 243132 95561 -180300 -297829
7431 -297829 -139778 36461 -285299 -396789 -58995 -312418 177399 -44672 -228394 45850
7420 -142112 13963 11468 -45626 -6321 -939 -213874 -138550 42411 -330839 336741 54379 123122
7408 123122 193284 -30654 119329 140310 -385821 -35585 2450 201450 246520 409720 25667
7396 -9938 -197444 172102 -40144 -37428 224096 -392899 -104645 133634 -142549 1624 -263175
7384 -289057 13512 176752 -173199 -232996 332354 -154884 -280995 167786 -164428 35855
7373 80629 20319 -124397 109666 294395 -63058 -167381 121883 -157882 17477 -24152 -111129
7362 -111129 -312824 -345861 146526 -156664 376897 -104959 -164998 -33336 15541 -204128
7351 -190029 381773 -115478 34590 -75908 -28172 -114543 177925 9857 229123 2606 260357
7340 260357 180425 -64011 709 -440507 155455 77826 -241896 316348 147094 12356 -70903
7328 293801 -215019 -23317 -70811 -164360 -126112 -183292 117932 -185353 -253572 148067 -133484
7316 139522 -204864 -84884 88048 150725 -118812 -29478 166180 125152 24701 -245111 -371582
7305 -371582 136678 -62056 42440 -293234 -52767 -300179 -130394 -122435 -94196 239076 19994
7293 -75087 -236648 -33043 -32704 3965 -93060 -61649 -156795 153064 57495 -122328 139693 -99764
7280 -292895 -57490 -157213 -157957 -161775 31580 93767 -298969 56422 49048 -288533 36269 -33476
7267 217489 40906 105017 -316182 41045 -243257 78666 -196621 -35350 -96317 -232620 -322567
7256 -322567 -10040 -234776 -148335 59325 -446749 14582 14513 -88091 -305917 23981 47656 115399
7244 115399 -49455 71679 52064 -58646 -394536 -178019 120556 -220689 141111 115083 -79061
7232 148721 20733 -5298 -197348 -82499 -245529 66345 256769 297532 -146291 -217166 -112999
7221 -112999 -11625 116843 -280680 -49951 -162060 -104208 -137482 -130705 185385 95155 81096
7210 81096 34619 -227518 -118108 -62675 136724 31677 217856 -143148 166170 51429 -16020
7198 89583 -9690 339676 -316696 34445 -466076 41514 -110115 -28466 154178 90869 47932
7187 47932 -149509 -19700 77661 -279343 -190705 210912 -68053 120349 184943 28252 -136257
7175 141631 -222258 -223927 26837 -130610 115069 -318756 -4702 87814 -18268 87054 -195517
7163 -98981 -204836 -283981 -83039 10106 -135797 97545 -257134 -620 -724866 -110314 -37604
7151 -200885 15884 204161 20895 -82164 188812 -165249 171225 -28340 218923 42181 156041
7140 156041 235918 146379 -126401 346158 248157 67390 49292 175726 290258 176124 276345
7129 276345 -321648 32946 -165103 226850 309053 -315535 426811 135774 -102014 108864
7118 -732 -92043 3201 -76161 -133461 -91824 -71315 123495 -27056 -57382 231788 278898 149773
7106 149773 -208955 -138231 -310080 -243356 213939 -34254 -46565 31335 -67942 38404 -56981
7094 93951 132788 -9688 369186 -224849 -100152 -432419 -5292 -94536 -372484 110301 243173
7083 243173 174260 9028 -147058 118257 61824 -56450 388244 295553 87757 -130973 -51911
7071 141967 -164234 63986 -144736 -232513 -558268 226932 -58583 -39184 67769 -27287 219785
7059 -132500 -102060 187994 -217740 -12778 161371 178 -99650 179894 495044 -151011 193166
7047 -136587 -195909 -64762 -221792 -327608 172625 -16314 120697 126085 232102 -347514 13636
7035 -262184 -102282 79675 94971 -94427 -70686 -24285 -138723 427418 -84814 27815 155953
7024 155953 -2452 -155950 229638 -46116 64104 -336861 70083 84563 -81786 -231426 -4031
7012 87382 300778 -19238 7319 41837 35655 91804 77964 -179475 -109283 -47096 153008 -199373
6999 -494573 -170428 -179908 -231161 -129657 -59703 -36281 -332807 -142538 54403 98453 320779
6988 320779 -191390 -371169 9200 71340 -33118 105700 -290644 -16032 223539 -122308 98611
6976 224831 -221886 149108 -245607 -93030 -126851 94368 52733 39897 -190400 92020 12681
6964 -99228 -42779 -430519 -167961 -74521 162264 172566 113719 -66017 -604744 198015 -12429
6952 -327934 -206569 240507 -139575 217385 232609 -112050 -127199 -12148 -228761 -110503
6941 -371985 -21673 232104 46828 413938 -293719 -8213 -164771 -136860 -294181 -6564 251552
6929 -97035 -89793 79256 -286546 62986 -62284 -271882 58472 23734 -62195 -112570 113395
6917 -44544 169774 47481 -209869 -187631 -214717 186209 10239 -67566 -240999 166043 -114537
6905 -68580 -76681 -360277 176637 -18696 8336 45365 95559 -58615 126659 -54390 351092
6893 26420 -89553 209956 75251 113993 -184751 -200930 -110817 -143104 -187190 -30901 4647 -189367
6880 -295572 63346 42335 4942 310220 -69872 -67186 -88215 -117542 207982 -1797 959 -69265
6867 -80165 -182671 -118554 -145574 -214446 -79120 334574 111245 -150516 172870 63150 27299
6855 179457 41853 -159768 1579 -82481 -27512 -272931 25168 -11123 129633 210166 -254014
6843 -151017 -724 -21206 -118120 -365 115048 165860 370528 -119025 -214818 -34715 -48331 72977
6830 -140413 291274 -94112 -380207 49656 65401 125115 234898 51685 -56957 -391078 -95757
6818 73035 -121463 -25055 -63626 382043 -20090 53166 143120 -350415 -153158 66708 116916
6807 116916 -323390 44763 -58008 -39888 -226258 -78850 57125 -75982 -384470 216725 70848
6795 -201412 57848 249952 -21605 -111541 -18656 216936 69773 242297 -305694 350797 -68922
6783 -102300 -43431 -304215 178023 80542 -137356 -174522 340297 164402 -133714 -199712
6773 -199712 18321 -426925 -343387 -368424 -180106 38645 63117 -190749 73071 77445 65915
6762 65915 82435 21071 -241135 -202638 -95646 157607 54166 147038 -35283 -288202 -49105
6750 -112842 80184 -296763 24909 -296286 316939 263972 141452 -133891 -159926 -184880 36500
6738 5202 -53750 -268117 -467083 -53131 -40535 -160960 160399 -50771 -96378 32215 -23862
6726 -92353 73085 344213 -38843 -49075 -77389 188617 -45531 273553 245421 14350 -155658
6714 128774 -89413 -101560 22489 -156509 -247980 86233 43872 -189048 -7058 -245011 -212590
6703 -212590 -119640 84014 -11193 184373 100884 25256 222268 -262169 37371 -139575 151398
6691 272154 -216568 -209500 482490 106326 -145571 -236753 -25316 -149744 224438 -273265
6680 69817 374337 -89558 138004 -266586 110975 26477 -32200 115284 -179536 416994
6669 166541 -341341 -125950 171381 -119061 148485 183764 -185378 -240212 165254 -155328
6658 -162557 131193 20509 -47873 -422150 -165205 -152329 -282869 121207 -250638 303809
6647 -65633 287872 -243301 178079 -79098 -216226 -100432 -155708 -202276 -225615 -186224 337832
6635 55224 -68086 -270478 157503 -159537 8540 76143 46841 -145456 18675 -192405 110464
6623 -136981 -19934 233737 -237156 -54302 289648 -97020 -152716 -7805 284746 -251864 -186552
6612 -186552 -63935 130942 167097 93785 -211898 -48966 -63292 389128 -93641 4484 -267633
6600 193165 -74499 -310894 -124788 326346 -190236 -169082 99453 -170267 -5297 -55779 124302
6588 74650 41283 52590 244031 300446 43230 139221 -105485 -146144 147139 -167501 -131556
6577 -131556 202661 225468 -312000 -123727 -10171 38518 -167030 -53110 -251242 46913 -302889
6565 -1068 103189 232221 146671 -342012 -175974 380148 -284617 -66798 -99232 164579 -143508
6553 86115 -87810 92880 -38138 -255535 -131732 -20820 -55928 289874 -68259 79202 103144
6542 103144 141969 -66258 245455 201887 -226951 -329741 -2303 -317469 -117324 123542 -89736
6530 -70400 -30456 -163173 31982 -266107 -134923 140962 -632839 -6675 -85141 -327756 -423374
6519 -423374 -323625 -4424 167870 56625 -81689 -121977 10804 -114474 -361525 -32004 414181
6507 324666 364173 -237548 41718 -73776 4777 -60791 -114359 434146 139744 -104952 -181784
6496 -181784 101986 -107657 134103 -21128 -226096 -95770 89932 -67569 -2800 -188380 -447142
6485 -447142 -222648 -18554 59425 -58935 -31780 29753 93886 111694 -11563 149687 94992
6474 94992 -108258 -130633 171793 95329 70967 180428 -74453 -24310 -8114 -353868 -44281
6462 -440554 23520 -258698 -16911 135315 -174435 -117016 -58773 -143620 -131233 58610 -205618
6450 -256608 -5677 31476 -165405 408014 98254 -259460 93507 62230 66075 -264720 -64715
6438 -41675 -203226 -104119 113506 -234013 -91171 80104 -2127 -21688 -27137 43381 -47697 -137980
6426 -137980 -173829 -127995 -210790 111158 -77849 108593 -239392 -95181 -63243 125075 -311852
6414 -41908 78146 36141 -175518 -17314 -63280 191630 122813 -33237 159192 160919 240226
6403 240226 -479484 -27892 -253611 94913 236715 -33818 -307520 -25017 157956 -120975
6392 86401 -189859 -214440 -68380 -485762 332345 -94790 130164 247645 109653 -6361 -885
6380 286610 19005 11424 155362 42545 81427 -104912 -66018 -376767 -130710 -58872 316478
6368 -109738 -86340 146913 -273281 -170962 -299530 416814 365367 68558 -3692 -120475 172054
6356 -207889 55897 171427 -3366 -83313 -160802 371417 -35392 203601 14300 -63224 -215959
6345 -215959 -182393 -54608 75029 -171099 41416 264446 164520 -115120 201633 325866 66416
6333 -163348 -124418 63696 -91036 152012 127846 159316 -225583 259041 232360 44145 40694
6322 40694 195354 -51750 -176141 298476 -39575 -66423 117726 -15097 -143651 -16946 -346993
6311 -346993 -299735 -161376 -177843 154850 6547 -58140 -31568 -4774 -166832 -15193 -362564
6300 -362564 -180551 377490 1777 62862 387281 260539 122029 -80489 98446 -375617 -9926
6288 155154 -261956 -24828 -160358 -98727 19401 -13418 -91876 -204583 -132095 -52672 -184283
6277 -184283 -124942 283395 -119349 85331 294024 -191184 20696 -50605 153719 -55583 -67745
6266 -67745 -30436 -170031 -202355 130942 -75198 -99420 214972 5514 -384479 -233134 -113781
6254 280786 241817 327823 -179973 21798 -12957 -102988 -267400 -44043 337548 107031 -60854
6242 -99983 85999 -85290 65227 -238145 -51860 184498 418633 96600 -173344 229426 -108940
6230 -12039 -58700 270904 -97769 -137022 197982 130637 -433 77278 -150289 86685 256475
6219 256475 -299573 -6945 -257818 -239739 -1677 -18589 -12346 -54017 -486925 -448885 79533 79835
6207 79835 -3510 -365946 -334376 134940 8580 -32328 -94709 -58918 -22703 -25168 -170169 77321
6194 179063 -73098 -100251 94431 862 18759 234499 53515 -195889 -192222 -177537 458645 30054
6181 -35819 78556 -59823 -204244 19314 -51946 216094 202344 -45827 -245278 -384194 470022
6169 -63559 131678 -119036 -182977 -127762 7027 -168349 -140752 -188361 -14809 34738 -83010
6157 -158396 12804 -7919 -173176 -41926 393138 56167 -139816 201215 113974 228170 43687
6145 192331 3035 34518 202221 390378 11757 247268 -117389 -218610 -115369 5251 121949
6134 121949 -60150 -185948 -21833 -161512 87646 -402287 289366 -385277 240324 -96316
6123 -368463 40984 55345 -52879 207353 -424995 -14842 147014 38123 210094 -65223 -80257
6112 -80257 -86710 -161569 -60562 -179396 16081 262259 -261732 -81653 -240361 217373 83692
6100 -239690 28933 271717 -28183 -49087 225890 130941 -294465 -111118 -185177 -29015 -102132
6089 -102132 163006 434858 -13340 -161212 104429 -12814 -89319 316820 293599 5286 152615
6078 152615 126056 -198385 349261 -312163 -377308 133123 -263787 45538 -7333 71412 285362
6067 285362 255893 -169913 -67704 50291 16654 -280311 116809 -311509 3200 -232328 -309957
6056 -309957 -334748 30163 -44320 142551 -264642 95375 -268174 -175479 -35855 -45179 -149895
6045 -149895 88186 -136973 -9736 -502349 333213 179665 120056 -170257 -55217 151704 341828
6034 341828 -1737 191799 -105489 63885 -145804 -98860 -109199 -77843 19575 146431 -62325
6022 28989 -297552 -141506 -51900 316921 -325599 25505 149407 45712 215164 190068 22414
6010 276474 150455 -66944 97341 60151 -130057 -91358 59031 -165073 181787 -193089 76229
5998 -111214 -326887 -182924 297863 -27043 -144512 -46689 310611 75164 95798 198997
5988 198997 176371 -86788 -73828 8765 -15730 -139221 359231 21753 38108 10285 -181101
5976 268006 -66492 -64311 -161709 138155 157392 248776 -231781 -167886 -32572 -80902 -446462
5965 -446462 140996 50124 185955 -22295 -80135 -240157 107070 -68458 368534 231964
5955 231964 -164199 226765 125015 62892 -171646 162148 228114 50882 -110005 -109076 73737
5943 -84217 107557 -372156 161069 -289809 -115550 -114912 83631 160712 -75935 220656 204921
5932 204921 192508 115242 -176179 138566 -189091 -270684 232616 -31634 -353414 125930
5921 -276901 -135047 -184856 136733 98703 -121693 95119 -348684 -37598 131801 6335 -175280
5909 -459051 235938 -70306 -4560 -2355 242992 -160689 12088 95812 349041 -284608 217308
5897 -91813 -173515 -64214 -79759 -107780 75543 159620 -7386 -92490 272874 -74506 256694 79115
5884 244278 -132973 -274980 -165708 138347 -187010 79097 -6494 -187971 -186575 -116853 -111595
5873 -111595 54656 101713 -172700 -282751 -8820 -30605 134670 59197 -223490 -45528 -232237
5862 -232237 131081 -215091 28662 -136617 -110734 282850 313090 127668 -122407 -12567
5851 -151350 146139 138092 -113514 75939 -189781 286271 -80833 12304 125631 75646 -420288
5839 514334 207819 139317 -389042 -57075 -168993 121505 -83338 395589 -67375 103706
5828 154562 1351 33788 -103367 33088 189041 283856 -195234 -35582 -321050 -75633 71597
5816 118715 121075 -217167 -288609 -181530 -44808 -295700 121065 -322396 -42860 -312155 -47286
5804 103843 103477 142266 -177593 91719 201165 47817 62637 78065 -289931 60154 -52022
5792 -259371 -247566 163748 -228954 45004 29106 -22855 -152978 62773 73366 109167 -181985
5780 83026 238490 243835 -24785 37152 -27900 170534 -93924 -124085 -85636 86508 -127319
5768 -222594 72986 152187 -68997 4836 -72594 205741 -116070 83079 169743 -115879 -209150
5757 -209150 157275 51692 -71611 -193564 -35648 -55338 143250 -75169 113093 -330952 -26900
5745 76837 213112 12009 66999 -332610 -32193 229187 192331 -51214 27091 -151841 177660
5733 -46595 -271827 231020 25019 357182 66469 235628 39984 69275 137946 -36266 59240
5721 5944 -95319 -274668 236400 -64401 83632 -289690 -93134 -268622 -85901 -107474 -83553
5710 -83553 96674 -148963 305467 75079 -71595 5247 62966 307134 -326407 -172816 -157220
5699 -157220 225073 -3160 276201 -188916 -437613 132434 146365 375899 5304 -304425 22587
5687 -101542 -422351 432339 -327965 90036 235686 -179535 -155461 -189402 -238861 142182
5676 -48188 15660 -21730 -35480 -25418 128515 -2472 -94028 -236152 -149374 -145816 109522 84981
5664 84981 46459 452913 -244045 -47680 -113465 -67346 -312974 -54687 28725 109468 88491
5653 88491 356079 326287 248342 -305652 156351 108957 186713 81930 34229 -185051 45049
5641 35576 -103823 60067 -35757 -23187 -92613 -202230 256620 83434 137377 -127848 -70481
5630 -70481 106907 -43428 -23579 354188 404139 -154551 281555 73902 -96296 -292541 110100
5618 67756 -211965 -115396 204234 27440 -16268 -172362 25415 -82638 -133629 181626 79643
5606 -36848 -269048 -58391 -122825 90812 202648 -25213 232068 -243479 180089 182649 -83244
5594 -167126 -124721 96667 136037 379332 -173140 46970 70611 34071 -116337 -53278 -138583
5583 -138583 -369011 319239 -202435 -179035 -58375 -123196 -286145 61952 74687 162560 -20655
5571 271333 -49668 -399421 108859 262954 157918 -345343 233365 -254862 31338 -114641
5560 69169 -38450 -106767 120994 56609 128241 346061 138312 25975 25768 -302825 266734
5548 -248855 104518 78991 -34848 110360 -215082 -55073 -137755 102136 -9663 -112437 -268808
5537 -268808 -161106 -284133 29284 -127180 280328 -143352 23622 63354 36095 2380 1265
5526 1265 -53896 -167806 -78260 -352941 -40167 266305 -50578 114889 -206964 -26371 -168149
5515 -168149 212540 -24486 211726 240267 -251660 163721 35630 -188054 152023 13497
5504 142951 -264791 -187433 52080 170203 144160 -274581 -70249 -2118 141923 -124244 121881
5492 121147 -188208 -207573 39869 -15370 -38850 -121576 88600 71226 182499 -132099 84556
5480 229155 -19904 69447 -193751 4494 -109371 360393 26207 -8688 174172 38127 -170329
5468 83918 307032 -195344 -157953 -65551 -170953 -111720 -90011 -156843 49755 124419 -101867
5456 -23402 -109768 387555 -48868 60235 -75116 7444 60833 -21155 -155400 -405016 -59019
5444 152195 89309 145274 -57416 -124278 10875 73559 169357 261822 253043 1191 -64747 144355
5431 -48684 -88414 11472 327545 -65889 -51570 90919 234343 143800 -384489 192687 172890
5420 172890 115815 311926 -20961 397325 -116316 105639 -52016 -101297 -42335 -34974 184537
5408 -166417 -161824 82548 46119 -93931 81752 -304351 -154086 236346 -186253 8030 52850
5397 52850 62231 43113 -164334 -97216 -75266 -42772 283920 -8707 -50718 -178565 -313420
5386 -313420 -37372 -74553 4610 -66017 242594 109589 20781 -222957 221791 130428 2219
5374 65607 291827 -104124 53581 -107725 32186 660767 138804 33743 92594 220629 181375
5363 181375 -15094 -86725 30317 -352067 2756 28691 -76303 -147742 -52173 184973 -304078
5351 -228159 7338 249915 317951 64129 -220487 -106200 85221 57258 -74200 -70224 132163
5339 31041 -171367 -245121 288606 -172280 849 11012 -11541 126494 75587 192100 26082
5327 -101259 245983 160837 -117787 185374 -123013 -104608 -155416 126155 80218 283989
5317 283989 -203038 -86476 -140358 -144705 176312 215373 95730 -158702 -207119 -352451 -130415
5305 -171148 -35087 -107933 285323 110018 -253021 -20348 25829 -126596 -3969 -99962 71751
5293 -70853 72753 -74888 -149582 68967 -152636 -56379 146968 -100737 129345 71980 -50131
5281 -98056 -205631 419203 -200065 -23762 10068 -144679 244172 -296607 183990 -409394
5270 -229173 -146837 -40551 139529 107975 -128738 -66915 -349131 -26996 65756 10855 -96610
5258 110915 -33633 150295 72506 291435 27207 -234579 -106569 25045 -26950 -220267 -17811
5246 377216 -23990 104417 353310 56820 -144844 39092 150076 114063 123649 -22376 -91909
5235 -91909 7621 264232 -246617 153717 135261 -2929 273606 23748 -188089 132438 248157
5224 248157 155947 73020 152774 -266327 -18540 -161269 44400 -42721 -144618 -48334 206645
5212 -211175 -373512 479914 -35188 -237990 230793 166306 213853 -441758 368254 264302
5202 264302 71489 29622 -54058 -414970 -99547 -228419 -141230 215237 -51544 28979 -88661
5190 157743 33066 -369800 47905 -101068 -185065 -168381 -65390 192635 -538719 56850 -78943
5178 44034 -193930 38165 298319 -185658 108689 135713 39970 204521 189786 -236093 177533
5166 1555 -25343 -12217 78850 138914 119606 136175 118174 -37917 -95413 -23466 116502 -13887
5153 237387 303877 71656 -5669 -90568 45759 415023 78822 60176 -84576 199898 -147819
5141 -316143 -45508 355875 109712 235546 76309 -31604 -14425 343136 -79071 -167067 156213
5129 320360 270894 158513 74253 -330463 28567 -220101 193548 18529 82935 61102 -32200
5117 125229 -7249 -397869 215577 93700 143146 43323 -44266 265439 46267 -85702 176982
5105 89547 -140536 1747 -216782 4207 -160502 110602 -50190 289046 -41426 -114150 117340
5093 -12808 57421 265716 -241432 -33359 123031 79154 122488 -270904 -140267 136186 156018
5082 156018 19579 -279998 10632 31527 -264672 -175713 198142 -161552 -96194 -14142 195940
5070 -10839 11721 -1220 -81685 95359 -232677 -187056 256664 -180266 -150539 -97623 6848 207290
5058 207290 249898 84893 -35040 -23578 -32038 -92229 -156201 264932 178709 140779 15611 493521
5046 493521 -179962 -258054 187493 136355 79607 -207395 -223886 -167363 -103842 5702 -73131
5034 -50066 -281915 252074 375368 -160360 -349007 -72509 76296 221535 -305347 -424304
5024 -424304 140847 9172 -92152 83810 -122341 -153016 210688 21330 -146932 180102 -49824
5012 -89197 -134536 439448 -403586 8501 -174882 -29238 -37533 52101 -131474 -28816 7341 -17362
4999 12628 106920 30436 116977 183172 288780 127513 235144 77270 -86064 197871 162965
4988 162965 19360 357592 -105412 362374 65675 160254 -91777 -33358 226358 -216679 -132677
4977 -132677 78573 183830 133742 89880 166156 374109 -64298 -73790 -128170 204881 122377
4966 122377 50762 -149669 -6202 -93448 57291 68624 81776 294124 18272 145924 12970
4954 27820 41987 -310977 224876 148639 186690 125101 89593 -337673 24058 55668 179239
4943 179239 -256641 16361 -288180 42982 -113827 -279865 -208015 158865 -26462 -13585 -170727
4932 -170727 -157596 124892 153687 299310 -45829 2165 175801 -177314 24212 -329240 -98558
4920 97881 120732 -278544 201184 -133813 -215449 -206253 -250879 74695 160212 20321 -100338
4908 -325108 -176775 74325 -27298 -318073 6528 -118972 131769 -12439 -1372 20700 323166
4897 323166 30000 414084 -140016 222088 -83876 6918 -152418 -20817 108003 302877 34910
4885 -87409 -10474 86543 295757 -41104 -147160 174485 -292881 -140586 -53527 202456 191517
4874 191517 -172385 -46853 -111245 -221788 236470 -185110 -233837 49810 -7218 269298 -338137
4862 176948 322362 -17462 55527 -256503 -87334 -93861 290263 -19953 54123 -7717 -165917
4851 -165917 -113139 -191461 -153178 39310 -232078 50214 -194265 247283 -281372 186353 165052
4840 165052 -193938 -28561 188962 -168075 -94759 119290 182849 -49631 329703 -347669
4829 -246305 243470 261247 274435 -150354 161645 211943 139343 -158308 269009 -50825 -66263
4818 -66263 -244851 179224 -167883 132699 9989 -224303 132384 -177884 41421 138020 8895
4806 -38703 -751 -180111 -284631 -314279 -227543 105805 30462 50855 -61535 -63174 398809 -291061
4793 48646 -106709 124722 98091 -89365 -205002 -23355 68044 -326071 -121694 -272246 445358
4781 -19334 -41015 359293 113843 -121294 40439 236983 230591 36444 739 -390957 29163
4769 -49075 265033 59281 248222 186086 55540 -128090 284345 -89881 -368414 -22539 -126116
4758 -126116 405815 -56455 -73000 -64708 379940 -26089 -132425 138386 -21361 -303308 -76506
4746 21410 399645 116989 45107 -138495 142760 -93971 -63534 -26397 -113679 174286 -28657
4734 -135309 89151 -246741 -215284 -273792 -232921 136425 -233350 -286102 -103673 -160507 27227
4722 125803 15967 59743 -200070 -92306 132423 -113577 -1156 -134961 -4628 145394 -180399
4710 161138 -8748 67246 -96685 219930 1353 80208 87098 -304663 16932 58755 45170 -42643
4697 146714 -101287 -402982 30582 130458 -109675 -60476 44631 6240 180042 64745 -105888
4685 237169 150777 -42141 -85769 -167524 84438 97244 -334713 143779 47082 -114567 23086
4673 101454 1033 -64050 -187760 -92297 248829 67969 -156901 149597 -293323 -171573 -30296
4661 275482 -263638 -40505 210735 34492 326925 18143 252981 284688 83145 -123406 -74263
4650 -74263 140043 -157242 208059 94635 290821 -338392 181350 57660 306648 86309
4639 110183 230777 -23885 67583 -39031 -192576 -42454 32086 115119 125798 97094 -126036
4627 117801 19575 2662 133250 224305 -174957 -35007 236621 -384382 -211706 298519 37295
4615 237982 71858 22519 4863 -55262 151500 -136308 19209 141594 -105911 94334 228818
4604 228818 64870 -62456 165569 -38427 -144766 -182395 -203027 160683 -222499 -247028 52082
4592 118389 35876 -50596 -95730 221752 113577 180942 -132736 104793 20649 -31195 119975
4580 167768 -142603 120842 22140 46423 -121264 4655 -119970 56107 -23725 -35666 -274619
4569 -274619 275742 -124465 439 32548 114991 112201 11107 296399 -240604 -3885 178483
4557 -120643 339880 209481 -171795 -30931 57301 -57477 -165191 -254445 154693 11839 105803
4546 105803 -180703 -62899 -347309 135007 -4464 128180 -12773 -81535 126558 471953 -45262
4534 265928 328475 -420048 -88882 151307 -166325 -92978 65851 140402 -124169 -344447 104243
$$ [...]
##END NTUPLES=NMR SPECTRUM
##END=
