
##TITLE=UV1224_M6_1234-1212_30_7231337_LlRSUDQFCa
##JCAMPDX= 6.0         $$ Bruker NMR JCAMP-DX V2.0
##DATA TYPE= NMR SPECTRUM
##DATA CLASS= NTUPLES
##ORIGIN= BRUKER
##OWNER= Administrator
$$ 1.72 TOPSPIN		Version 2.1
$$ 2013-01-23 22:55:54.712 -0500  Administrator@X
$$ Compression mode = diff/dup
##.OBSERVE FREQUENCY= 400.02188249412
##.OBSERVE NUCLEUS= ^1H
##.ACQUISITION MODE= SIMULTANEOUS (DQD)
##.ACQUISITION SCHEME= undefined
##.AVERAGES= 64
##.DIGITISER RES= 22
##SPECTROMETER/DATA SYSTEM= spect
##.PULSE SEQUENCE= noesygpps1d.comp
##.SOLVENT NAME= COFFEE_meoh
##.SHIFT REFERENCE= INTERNAL, COFFEE_meoh, 1, 14.96109
##AUDIT TRAIL= $$ (NUMBER, WHEN, WHO, WHERE, PROCESS, VERSION, WHAT)
$$ ##TITLE= Audit trail, TOPSPIN		Version 2.1
$$ ##JCAMPDX= 5.01
$$ ##ORIGIN= Bruker BioSpin GmbH
$$ ##OWNER= Administrator
$$ $$ E:\/data/COFFEE/nmr/UV1224_M6_1234-1212_30_7231337_LlRSUDQFCa/32/pdata/1/auditp.txt
$$ ##AUDIT TRAIL=  $$ (NUMBER, WHEN, WHO, WHERE, PROCESS, VERSION, WHAT)
(   1,<2013-01-23 22:55:48.759 -0500>,<Administrator>,<X>,<go>,<TOPSPIN 2.1>,
      <created by zg
	started at 2013-01-23 22:44:18.697 -0500,
	POWCHK enabled, PULCHK disabled,
       configuration hash MD5:
       86 BA 57 50 F2 9D 5C 9B 26 00 A9 28 5F 66 2E 89
       data hash MD5: 64K
       8F 2B EF 1B 7E C6 8F 87 84 E3 EF A8 1E 9D 5F D9>)
(   2,<2013-01-23 22:55:51.978 -0500>,<Administrator>,<X>,<proc1d>,<TOPSPIN 2.1>,
      <Start of raw data processing
       efp LB = 0.3 FT_mod = 6 PKNL = 1 PHC0 = 0 PHC1 = 0 SI = 128K 
       data hash MD5: 128K
       EC D1 D3 6D 5A 95 83 AA 0E 17 B0 07 C2 B5 1C AA>)
(   3,<2013-01-23 22:55:53.025 -0500>,<Administrator>,<X>,<proc1d>,<TOPSPIN 2.1>,
      <pk PHC0 = -78.93127 PHC1 = 0 
       data hash MD5: 128K
       BD 16 6D 5C 6F 50 65 69 C3 BF 7A 81 4E 5A 6C E7>)
(   4,<2013-01-23 22:55:53.681 -0500>,<Administrator>,<X>,<proc1d>,<TOPSPIN 2.1>,
      <abs ABSG = 1 
       data hash MD5: 128K
       D3 CE DC 8B 8E D8 A5 BB 8E F5 1B 86 14 11 4B 60>)
(   5,<2013-01-23 22:55:53.868 -0500>,<Administrator>,<X>,<proc1d>,<TOPSPIN 2.1>,
      <abs ABSG = 2 
       data hash MD5: 128K
       C8 F9 27 A3 8A 19 BF F4 4B A0 47 9A 45 EF A1 A7>)
(   6,<2013-01-23 22:55:54.056 -0500>,<Administrator>,<X>,<proc1d>,<TOPSPIN 2.1>,
      <abs ABSG = 3 
       data hash MD5: 128K
       2B D5 4D 10 52 EA 3E 10 1D 60 40 08 89 CF 74 4C>)
(   7,<2013-01-23 22:55:54.243 -0500>,<Administrator>,<X>,<proc1d>,<TOPSPIN 2.1>,
      <abs ABSG = 4 
       data hash MD5: 128K
       09 FD 57 23 96 24 1B 22 18 27 66 06 F4 FF D5 76>)
(   8,<2013-01-23 22:55:54.431 -0500>,<Administrator>,<X>,<proc1d>,<TOPSPIN 2.1>,
      <abs ABSG = 5 
       data hash MD5: 128K
       C1 FA 31 37 A9 DA BE 60 1F B5 E7 36 55 86 5D E7>)
$$ ##END=
$$ 
$$ $$ hash MD5
$$ $$ 54 1D 12 56 4C DA 8C 3E 1D B3 72 31 46 B9 F0 BB
##$RELAX= 
##$RELAX= 
##$RELAX= 
##$RELAX= 
##$RELAX= 
##$RELAX= 
##$RELAX= 
##$RELAX= 
$$ Bruker specific parameters
$$ --------------------------
##$DU= <E:\>
##$EXPNO= 32
$$ [...]
##$TP07= 0
##$TPNAME0= <>
##$TPNAME1= <>
##$TPNAME2= <>
##$TPNAME3= <>
##$TPNAME4= <>
##$TPNAME5= <>
##$TPNAME6= <>
##$TPNAME7= <>
##$TPOAL= (0..7)
0.5 0.5 0.5 0.5 0.5 0.5 0.5 0.5
##$TPOFFS= (0..7)
0 0 0 0 0 0 0 0
##$TUNHIN= 0
##$TUNHOUT= 0
##$TUNXOUT= 0
##$USERA1= <user>
##$USERA2= <user>
##$USERA3= <user>
##$USERA4= <user>
##$USERA5= <user>
##$V9= 5
##$VALIST= <valist>
##$VCLIST= <CCCCCCCCCCCCCCC>
##$VD= 0
##$VDLIST= <DDDDDDDDDDDDDDD>
##$VPLIST= <PPPPPPPPPPPPPPP>
##$VTLIST= <TTTTTTTTTTTTTTT>
##$WBST= 1024
##$WBSW= 4
##$XGAIN= (0..3)
0 0 0 0
##$XL= 0
##$YL= 0
##$YMAX_a= 6312017
##$YMIN_a= -13662638
##$ZGOPTNS= <>
##$ZL1= 120
##$ZL2= 120
##$ZL3= 120
##$ZL4= 120
##$ABSF1= 14.96109
##$ABSF2= -5.597092
##$ABSG= 5
##$ABSL= 3
##$ALPHA= 0
##$AQORDER= 0
##$ASSFAC= 0
##$ASSFACI= 0
##$ASSFACX= 0
##$ASSWID= 0
##$AUNMP= <proc_prof1d_extract.lims>
##$AXLEFT= 0
##$AXNAME= <>
##$AXNUC= <1H>
##$AXRIGHT= 0
##$AXTYPE= 0
##$AXUNIT= <>
##$AZFE= 0.1
##$AZFW= 0.1
##$BCFW= 0
##$BC_mod= 0
##$BYTORDP= 0
##$COROFFS= 0
##$CY= 15
##$DATMOD= 1
##$DC= 0
##$DFILT= <>
##$DTYPP= 0
##$F1P= 0
##$F2P= 0
##$FCOR= 0.5
##$FTSIZE= 131072
##$FT_mod= 6
##$GAMMA= 0
##$GB= 0
##$INTBC= 1
##$INTSCL= 1
##$ISEN= 128
##$LB= 0.3
##$LEV0= 0
##$LPBIN= 0
##$MAXI= 10000
##$MC2= 0
##$MEAN= 0
##$ME_mod= 0
##$MI= 0
##$NCOEF= 0
##$NC_proc= -2
##$NLEV= 6
##$NOISF1= 0
##$NOISF2= 0
##$NSP= 0
##$NTH_PI= 0
##$NZP= 0
##$OFFSET= 14.96109
##$PC= 1
##$PHC0= -78.93127
##$PHC1= 0
##$PH_mod= 1
##$PKNL= yes
##$PPARMOD= 0
##$PPDIAG= 0
##$PPIPTYP= 0
##$PPMPNUM= 2147483647
##$PPRESOL= 1
##$PSCAL= 4
##$PSIGN= 0
##$PYNMP= <proc.py>
##$REVERSE= no
##$SF= 400.020009601442
##$SI= 131072
##$SIGF1= 0
##$SIGF2= 0
##$SINO= 400
##$SIOLD= 131072
##$SPECTYP= <>
##$SREGLST= <1H.CDCl3>
##$SSB= 0
##$STSI= 131072
##$STSR= 0
##$SW_p= 8223.68421052631
##$SYMM= 0
##$S_DEV= 0
##$TDeff= 65536
##$TDoff= 0
##$TI= <>
##$TILT= no
##$TM1= 0
##$TM2= 0
##$TOPLEV= 0
##$USERP1= <user>
##$USERP2= <user>
##$USERP3= <user>
##$USERP4= <user>
##$USERP5= <user>
##$WDW= 1
##$XDIM= 131072
##$YMAX_p= 439978116
##$YMIN_p= -13175
##$CURPLOT= <Network HP LaserJet P1505>
##$CURPRIN= <$Network HP LaserJet P1505>
##$DFORMAT= <normdp>
##$LAYOUT= <+/1D_H.xwp>
##$LFORMAT= <normlp>
##$PFORMAT= <normpl>
##$SURQMSG= 1
$$ End of Bruker specific parameters
$$ ---------------------------------
##NTUPLES= NMR SPECTRUM
##VAR_NAME=  FREQUENCY,     SPECTRUM/REAL,   SPECTRUM/IMAG
##SYMBOL=    X,             R,               I
##VAR_TYPE=  INDEPENDENT,   DEPENDENT,       DEPENDENT
##VAR_FORM=  AFFN,          ASDF,            ASDF
##VAR_DIM=   131072,        131072,          131072
##UNITS=     HZ,            ARBITRARY UNITS, ARBITRARY UNITS
##FACTOR=    0.0627417313425164, 1,          1
##FIRST=     8223.62146879497, -1710,        -67746
##LAST=      0,             -118,            -68218
##MIN=       0,             -13175,          0
##MAX=       8223.62146879497, 439978116,    0
$$ Real data points
##PAGE= N=1
##DATA TABLE= (X++(R..R)), XYDATA
$$ [...]
61568C24270p93O15J276P36l63r76o78P4M93J54o42j183j072o61n11o02m20K79
61550C19996J165J849K281K489K344J764R30R3n84q78m66O36J771K180J798J364
61534C38732J619K552L526L971L865L541L146K450J182m72j845k354k089j734
61520C56090j759j897j613j059j000j659k160j606l86L09Q4k96k03J6j44l85j07
61503C42225N49Q03K81n64j095j118r14q61j083j317j185o77k12m2R8N10R24P72
61485C37094K7n88l76N14J237J247R46J169J972K377J588J64o07k73M96J032J335
61468C49354J500J379J063R99J125P81j09n56M0P86N45l31n90J0N47N09M23P30
61450C58205J078J029P55O58Q42J171J438J364R29O70J151K082K582K371K040
$$ y = [324270, 323477, 324092, 325368, 326104, 325741, 324765, 324087, 324161, 324654, 324808, 324166, 322983, 321911, 321250, 320739, 320137, 319717, 319996, 321161, 323010, 325291, 327780, 330124, 331888, 332818, 332911, 332327, 331449, 330983, 331619, 333390, 335570, 337368, 338732, 340351, 342903, 346429, 350400, 354265, 357806, 360952, 363402, 364584, 364112, 362267, 359913, 357824, 356090, 354331, 352434, 350821, 349762, 348762, 347103, 344943, 343337, 342951, 343260, 343344, 343048, 342845, 342861, 342717, 342332, 342225, 342774, 343577, 343858, 343294, 342199, 341081, 340167, 339306, 338223, 336906, 335721, 335044, 334832, 334790, 334888, 335398, 336322, 337094, 337121, 336533, 336157, 336671, 337908, 339155, 340101, 341270, 343242, 345619, 347207, 347371, 346764, 346491, 346987, 348019, 349354, 350854, 352233, 353296, 354295, 355420, 356201, 356092, 355536, 355576, 356362, 356907, 356576, 355986, 355996, 356543, 357052, 357475, 358205, 359283, 360312, 361067, 361725, 362567, 363738, 365176, 366540, 367469, 368139, 369290, 371372, 373954, 376325, 378365]
61435C78365K083K338K601L042L696M088L888L419L108K874K446J918J518J125
61421D16509N62J39M19J484K761L628L906L718L140K195J125M85O63J255J198
61406D43187j38k123l484l645l078k458k025j821j905k096j959j426r92r97j074
61391D13966p79l80m50q75q78r6Q76J264J059Q56R98J269J342J264J244J245J067
61374D22992P28M90N26P68J151J620J898J664J103R03J300J647J321O80N15R00
61358D40206J300J645K435L649M442M249L630L586M472N920P459Q813R885J0742
61344E12433J1483J1938J1732J0824R590Q274O719M974L703L493L947L993L072
61331F06175J629L67n89j600k810l844m338m499m804n151m785l385j829j244j554
$$ y = [378365, 380448, 382786, 385387, 388429, 392125, 396213, 400101, 403520, 406628, 409502, 411948, 413866, 415384, 416509, 417071, 417210, 417629, 419113, 421874, 425502, 429408, 433126, 436266, 438461, 439586, 440071, 440734, 441989, 443187, 443049, 440926, 437442, 433797, 430719, 428261, 426236, 424415, 422510, 420414, 418455, 417029, 416037, 415040, 413966, 413187, 412807, 412357, 411482, 410604, 410508, 411384, 412648, 413707, 414563, 415561, 416830, 418172, 419436, 420680, 421925, 422992, 423720, 424210, 424736, 425504, 426655, 428275, 430173, 431837, 432940, 433843, 435143, 436790, 438111, 438791, 439306, 440206, 441506, 443151, 445586, 449235, 453677, 457926, 461556, 465142, 469614, 475534, 482993, 491806, 501691, 512433, 523916, 535854, 547586, 558410, 568000, 576274, 582993, 587967, 591670, 595163, 599110, 603103, 606175, 607804, 608171, 607582, 605982, 603172, 599328, 594990, 590491, 585687, 580536, 575751, 572366, 570537, 569293, 567739]
61316E67739j649r34L1O28J022J617K315K866L411M110M666M847N147O277Q198
61301F10291J0208J1794J2801J2916J1761R553P036M565J779j545m758o835p384
61288F72182o988o624o940p860q728q896q276p274o292n391m472l495k483j436
61274E87027l94N56J369K079K723L289L823M421N030N361N181M667M324M490N015
61259F38961N577O230P421R337J1521J3333J4528J5071J4557J2439Q935N176K179
61246G65265J1j808l450m823o088p580r176j0204j0066q830p162n826n126m692
61232F80445l930k857k180k289k474j671J87K151L471M307N136O066O958P729
61218G01049Q199Q028P146N925M748L642K727K526L350M542M951M212L109K484
$$ y = [567739, 566090, 565156, 565187, 565815, 566837, 568454, 570769, 573635, 577046, 581156, 585822, 590669, 595816, 602093, 610291, 620499, 632293, 645094, 658010, 669771, 679324, 686360, 690925, 692704, 691159, 686401, 679566, 672182, 665194, 658570, 651630, 643770, 635042, 626146, 617870, 610596, 604304, 598913, 594441, 590946, 588463, 587027, 586633, 587189, 588558, 590637, 593360, 596649, 600472, 604893, 609923, 615284, 620465, 625132, 629456, 633946, 638961, 644538, 650768, 658189, 667526, 679047, 692380, 706908, 721979, 736536, 748975, 757910, 763086, 765265, 765276, 763468, 760018, 755195, 749107, 741527, 732351, 722147, 712081, 703251, 696089, 690263, 685137, 680445, 676515, 673658, 671478, 669189, 666715, 665044, 665231, 667382, 670853, 675160, 680296, 686362, 693320, 701049, 709248, 717276, 724422, 730347, 735095, 738737, 741464, 743990, 747340, 751882, 756833, 761045, 764154, 766638]
61204G66638K170J332l19k001k589j685J40K059L786N609P872J0629J3689J6715
61190H24045J9245K0911K1779K2224K2247K1196J8414J4175R715O278M237L126
61178A007592K290J502Q79M29j77j266k753m327n944p821r925j1864j3380j4531
61164I40704j5224j5155j4563j4489j5626j7258j8089j7890j7541j7499j7110
61153G60260j5762j3864j2206j0828r144o857m300j939O6J802L278M101L609J639
61139F99855r39k947m264n776p811r339r175p344m674j688J341L791N168O004
61125F62202P316R252J1129J2754J4685J7030J8987K0063K0915K2421K4550K6698
61113H68002K8596L0213L1194L1139L0245K9139K8097K6957K5622K4187K2604
$$ y = [766638, 768808, 770140, 769821, 767820, 765231, 763546, 763686, 765745, 769531, 775140, 783012, 793641, 807330, 824045, 843290, 864201, 885980, 908204, 930451, 951647, 970061, 984236, 993951, 1000229, 1004466, 1007592, 1009882, 1011384, 1012263, 1012692, 1012515, 1011249, 1008496, 1004169, 998225, 990404, 980479, 968615, 955235, 940704, 925480, 910325, 895762, 881273, 865647, 848389, 830300, 812410, 794869, 777370, 760260, 744498, 730634, 718428, 707600, 698456, 691599, 687299, 685360, 685426, 687228, 690506, 694607, 698216, 699855, 698916, 695969, 691705, 685929, 678118, 668779, 659604, 652260, 647586, 645898, 647239, 651030, 656198, 662202, 669518, 678770, 689899, 702653, 717338, 734368, 753355, 773418, 794333, 816754, 841304, 868002, 896598, 926811, 958005, 989144, 1019389, 1048528, 1076625, 1103582, 1129204, 1153391, 1175995]
61102A175995K0649J8327J5893J3430J0672P323L271j483o811j2270j7219k1345
61090A206432k4835k7869l0130l1147l1011l0383k9738k9006k8058k7198k6695
61079H90362k6094k4585k2089j9427j7251j5369j3420j1620j0356r412q240o747
61067G05752n264l902k553j445r93j010o51O67K664M615N976O587O687O881P676
61052G31687Q920R989J0660J1412J2778J4718J6749J8500K0053K1852K4207K6787
61040I28312K8792K9886L0638L1680L2841L3610L3995L4347L4565L4349L3984
61029A286999L4095L4846L6058L7915M0595M3440M5537M7057M8959N1446N3674
61018A760621N5109N6107N7245N9164O2962O9549P8623Q9415J02181J17509J34514
$$ y = [1175995, 1196644, 1214971, 1230864, 1244294, 1254966, 1262289, 1265560, 1264077, 1257266, 1244996, 1227777, 1206432, 1181597, 1153728, 1123598, 1092451, 1061440, 1031057, 1001319, 972313, 944255, 917057, 890362, 864268, 839683, 817594, 798167, 780916, 765547, 752127, 740507, 730151, 720739, 712499, 705752, 700488, 696586, 694033, 692588, 691595, 690585, 689934, 690601, 693265, 697880, 703856, 710443, 717130, 724011, 731687, 740607, 750596, 761256, 772668, 785446, 800164, 816913, 835413, 855466, 877318, 901525, 928312, 957104, 986990, 1017628, 1049308, 1082149, 1115759, 1149754, 1184101, 1218666, 1253015, 1286999, 1321094, 1355940, 1391998, 1429913, 1470508, 1513948, 1559485, 1606542, 1655501, 1706947, 1760621, 1815730, 1871837, 1929082, 1988246, 2051208, 2120757, 2199380, 2288795, 2390976, 2508485, 2642999]
61007B642999J51720J69786J91448K18829K52972K95816L49911M16177M95249
60998E184907N91469P12106Q62886J049137J280110J561228J876170K185526K450166
60989A7753705K641775K711398K561201K095717J338313M86541j86042n06517
60981B8896091m87777k59307M5132L13079M10629J93016l92112j218275k028591
60972B5471885k590642k816327k757487k521526k202794j865842j551637j280012
60964G885618j052697q63785p08440n82396m79499l94437l25688k72966k33593
60955B972117k03426j79591j60296j43608j28254j14370j01959q9930p7831o7012
60945A705840n8594n1854m6085m2440m2119m3940m5543m6033m5789m4671m2313
$$ y = [2642999, 2794719, 2964505, 3155953, 3374782, 3627754, 3923570, 4273481, 4689658, 5184907, 5776376, 6488482, 7351368, 8400505, 9680615, 11241843, 13118013, 15303539, 17753705, 20395480, 23106878, 25668079, 27763796, 29102109, 29588650, 29402608, 28896091, 28408314, 28149007, 28194139, 28507218, 28917847, 29110863, 28718751, 27500476, 25471885, 22881243, 20064916, 17307429, 14785903, 12583109, 10717267, 9165630, 7885618, 6832921, 5969136, 5260696, 4678300, 4198801, 3804364, 3478676, 3205710, 2972117, 2768691, 2589100, 2428804, 2285196, 2156942, 2042572, 1940613, 1850683, 1772852, 1705840, 1647246, 1595392, 1549307, 1506867, 1464748, 1420808, 1375265, 1329232, 1283443, 1238772, 1196459]
60934A196459l9429l7043l4889l2135k9172k7092k5804k4217k1931j9454j7076
60923H88217j4911j3633j3714j4212j3670j2072j0593r650q561p062n736m851
60911G59552l977k889j808o97O67J907K375K350K852M166N496O237O636P017P278
60896G97162P481Q097R267J0401J0829J0506R912R630J0011J0920J1972J3242
60884I19430J5262J7872J9710J9695J8621J8243J9103K0211K0667K0453J9671
60873A128938J8158J6054J3827J1558Q956O180L706J424j225m076o322q055j0469
60860A178654j3952j7023j8148j7896j8228j9987k2009k2789k2236k1497k1508
60849I63381k2118k2590k2524k2074k1371k0292j8869j7488j6389j5364j4382
$$ y = [1196459, 1157030, 1119987, 1085098, 1052963, 1023791, 996699, 970895, 946678, 924747, 905293, 888217, 873306, 859673, 845959, 831747, 818077, 806005, 795412, 785762, 777201, 770139, 764403, 759552, 755575, 752686, 750878, 750181, 750848, 752755, 755130, 757480, 760332, 764498, 769994, 776231, 782867, 789884, 797162, 804643, 812740, 822007, 832408, 843237, 853743, 863655, 873285, 883296, 894216, 906188, 919430, 934692, 952564, 972274, 991969, 1010590, 1028833, 1047936, 1068147, 1088814, 1109267, 1128938, 1147096, 1163150, 1176977, 1188535, 1197491, 1203671, 1207377, 1208801, 1207576, 1203500, 1197178, 1189123, 1178654, 1164702, 1147679, 1129531, 1111635, 1093407, 1073420, 1051411, 1028622, 1006386, 984889, 963381, 941263, 918673, 896149, 874075, 852704, 832412, 813543, 796055, 779666, 764302, 749920]
60838G49920j4024j4726j5932j6665j6744j6695j6642j6061j4726j3102j1644
60827E82959j0305r004p966p298o651n640m397l403k948k833k558j773o36K74
60813E17821N49K75k26o85p75j62J010J984K194J922J766J843J859J696J419J007
60797E33497M83O5j70m85r19j051p45n74r10j208r73q02j543k832l635l837m162
60780E10199m666m605l879l415l830m656n237n553n821n982n899n554m870l892
60766D42340l115k935k821j908m51K78k57j106j193n58J55O32P99N17p2l97q9
60749D29819O66J637K835L992M450M128L967M765N941O109M662K302J32j247j885
60734D72273k164k477k943l321l260k712k118k116k901l942m547m700m930n336
$$ y = [749920, 735896, 721170, 705238, 688573, 671829, 655134, 638492, 622431, 607705, 594603, 582959, 572654, 563650, 555684, 548386, 541735, 536095, 531698, 528295, 525347, 522514, 519956, 518183, 517547, 517821, 518370, 518645, 518419, 517734, 516959, 516797, 517807, 519791, 521985, 523907, 525673, 527516, 529375, 531071, 532490, 533497, 533980, 534045, 533875, 533390, 532471, 531420, 530675, 530101, 529191, 527983, 527010, 526208, 524665, 521833, 518198, 514361, 510199, 505533, 500928, 497049, 493634, 489804, 485148, 479911, 474358, 468537, 462555, 456656, 451102, 446232, 442340, 439225, 436290, 433469, 431561, 431110, 431388, 431131, 430025, 428832, 428274, 428429, 429061, 429860, 430377, 430305, 429908, 429819, 430485, 432122, 434957, 438949, 443399, 447527, 451494, 456259, 462200, 468309, 472971, 475273, 475405, 474158, 472273, 470109, 467632, 464689, 461368, 458108, 455396, 453278, 451162, 448261, 444319, 439772, 435072, 430142, 424806]
60720D24806n317m586l773l525l601l519l526m012m456l958k604j403r92j250
60706C78284j981k937l408k818j787j453j843j932j366q37o10j5J126J896J715
60691C62034J345J679K412K654K211J529R47O49Q75J634K565L397M145M661M685
60676C97422M534M962N990O649O376N847N874O222O127N446M548L620K681J883
60662D68181J310P99L58L02O45Q79O56J99k88r33j564j570q65k76m15q18q14n77
60644D65209o61j029j366j817k723l938m993n661n835n353m391l651l496l393
60630D16902k782j986j638j638j390p29N4P75J341J408P49k65j038j396j418r83
60614D05966n7Q72J265J152Q40L15n26j296j398o89M92J710K497K422J627Q83
$$ y = [424806, 419489, 414903, 411130, 407605, 404004, 400485, 396959, 392947, 388491, 384533, 381929, 380526, 379534, 378284, 376303, 373366, 369958, 367140, 365353, 363900, 362057, 360125, 358759, 357922, 357312, 357297, 358423, 360319, 362034, 363379, 365058, 367470, 370124, 372335, 373864, 374811, 375460, 376335, 377969, 380534, 383931, 388076, 392737, 397422, 401956, 406918, 412908, 419557, 425933, 431780, 437654, 443876, 450003, 455449, 459997, 463617, 466298, 468181, 469491, 470290, 470648, 470950, 471595, 472474, 473130, 473329, 473041, 472108, 470544, 468974, 468109, 467833, 467418, 466600, 465786, 465209, 464548, 463519, 462153, 460336, 457613, 453675, 448682, 443021, 437186, 431833, 427442, 423791, 420295, 416902, 414120, 412134, 410496, 408858, 407468, 406739, 406793, 407568, 408909, 410317, 411066, 410801, 409763, 408367, 406949, 405966, 405909, 406781, 408046, 409198, 410038, 410353, 409827, 408531, 407133, 406444, 406936, 408646, 411143, 413565, 415192, 416075]
60598D16075O49M99n3o25n35J51Q24J301J836K447K869L082L222L187K821K332
60582D40082J999J647R84J96k40j31M84J574K765L245K731K175K690M056N191
60567D69448N927P226R633J2429J4663J6229J7532J8669J9344J9190J7849J5009
60555F43148J0673N365q5m879q492j0755j1789j1710j0590q661o350l917j326
60542E80632J347L705N528P139R033J1336J3893J6589J9242K1529K3230K4311
60530G37514K4436K2924J9486J4713R445M146q41m934p795r719j0983j1323j0569
60517G76500r385q645q373p916o921n506l782j886k70O71J155J710K503L506M919
60502G38280O872R038J1232J4052J8137K3102K8023L2836L8369M4936N1826N8193
$$ y = [416075, 416724, 417223, 417170, 416545, 416010, 416161, 416985, 418286, 420122, 422569, 425438, 428520, 431742, 434929, 437750, 440082, 442081, 443728, 444712, 444908, 444668, 444537, 445021, 446595, 449360, 452605, 455336, 457511, 460201, 464257, 469448, 475375, 482601, 492234, 504663, 519326, 535555, 553087, 571756, 591100, 610290, 628139, 643148, 653821, 659186, 659101, 654222, 645730, 634975, 623186, 611476, 600886, 592225, 585875, 581958, 580632, 581979, 585684, 591212, 598351, 607384, 618720, 632613, 649202, 668444, 689973, 713203, 737514, 761950, 784874, 804360, 819073, 828518, 832664, 831823, 826889, 819094, 809375, 798392, 787069, 776500, 767115, 758470, 750097, 742181, 735260, 729754, 725972, 724086, 723816, 724487, 725642, 727352, 729855, 733361, 738280, 745152, 754190, 765422, 779474, 797611, 820713, 848736, 881572, 919941, 964877, 1016703, 1074896]
60490A074896O3731O8150P0694P0482O7043O0388N0981L9586K6729J2273m015
60479A600938k1345l7814n1590o1935o9127p3625p5479p4459p0738o5262n9184
60468I40380n2977m6581m0360l5136l1052k7260k3220j9460j6534j4116j1894
60457F21790j0419j0039r775q548o887o089o140n920n253n073n573n720n032m292
60443E27030m042l673k739j989k163k633k300j236m67m09m40K5P51J105Q08J19
60427E07747n15q49r44j039j308j727k002j709p82J64L73n3j81N20J504K032K134
60410E03365K130J849J060K44P7M61P55P45O54N15K89L40J021J921K362K340K252
60393E22380K021J398Q76J211K188K871K989L022L027K577J901J857K515K910
$$ y = [1074896, 1138627, 1206777, 1277471, 1347953, 1414996, 1475384, 1526365, 1565951, 1592680, 1604953, 1600938, 1579593, 1541779, 1490189, 1428254, 1359127, 1285502, 1210023, 1135564, 1064826, 999564, 940380, 887403, 840822, 800462, 765326, 734274, 707014, 683794, 664334, 647800, 633684, 621790, 611371, 601332, 591557, 583009, 576122, 570033, 563893, 557973, 552720, 547647, 542074, 536354, 531322, 527030, 522988, 519315, 516576, 514587, 512424, 509791, 507491, 506255, 505788, 505379, 504939, 504964, 505715, 506820, 507628, 507747, 507232, 506383, 505439, 504400, 503092, 501365, 499363, 497654, 496872, 497036, 497409, 497356, 497175, 497695, 499199, 501231, 503365, 505495, 507344, 508404, 508648, 508725, 509186, 509941, 510686, 511340, 511855, 512144, 512484, 513505, 515426, 517788, 520128, 522380, 524401, 525799, 526675, 527886, 530074, 532945, 535934, 538956, 541983, 544560, 546461, 548318, 550833, 553743]
60379E53743K545K147K439L176L772M076M118L807L331L148L281L325L387M112
60365F00407N443O205N508L887K597K279K717L305L430K934K515L149M895O936
60351F56207Q873J1194J4225J7498K0603K3788K7215L0221L1831L1519K9135K4716
60339I27025J8730J1837M145m582j3691k1445k6540k9026k9408k7830k4760k1521
60327G62934j9074j6971j4376j1631r830r193q797p863o514n303m523m041l445
60314F41373k378r26M77J661K887M290N642O947Q736J1419J4851J8865K3681K9359
60300G66884L5351M1067M6255N0191N1079M7173L8396K6242J2239k841j8291l2658
60288A061087m3969n0662n2400n0189m5644l9996l3809k7528k1855j7411j4306
$$ y = [553743, 556288, 558435, 560874, 564050, 567822, 571898, 576016, 579823, 583154, 586302, 589583, 592908, 596295, 600407, 605850, 612055, 617563, 621450, 624047, 626326, 629043, 632348, 635778, 638712, 641227, 644376, 649271, 656207, 665080, 676274, 690499, 707997, 728600, 752388, 779603, 809824, 841655, 873174, 902309, 927025, 945755, 957592, 961737, 957155, 943464, 922019, 895479, 866453, 837045, 809215, 784455, 762934, 743860, 726889, 712513, 700882, 691052, 681859, 673062, 665199, 658685, 653382, 648859, 644818, 641373, 638995, 638069, 638546, 640207, 643094, 647384, 653026, 659973, 668709, 680128, 694979, 713844, 737525, 766884, 802235, 843302, 889557, 939748, 990827, 1038000, 1076396, 1102638, 1114877, 1112036, 1093745, 1061087, 1017118, 966456, 914056, 863867, 818223, 778227, 744418, 716890, 695035, 677624, 663318]
60277F63318j2254j0924j0088r625r446r275q675p589o632o320o218n529m340
60264E56403l474l152k782k171j890k153k279j719q08l6O06J142J295J145J230
60249E41357J488J037l56j504j329l65J64Nk83m83o60n54j4L34l9m23K80J853
60231E40508L099L699M503N762O399N527L804K528K006J522O65m5N7Q54J566J701
60215E84155J516J474J653J971K683L976N316N934N920O085O569O616N959N444
60201F45271N620N690M756L328K607K781L039K971K885K860K483J586N20m19j262
60186F84716k034k690l338l980m089l061j228J59J51r75k107k350j691q29m90
60171F56164p58j144j217r10j37J294L094M240L880K256L28j248k369l008l138
$$ y = [663318, 651064, 640140, 630052, 620427, 610981, 601706, 593031, 585442, 578810, 572490, 566272, 560743, 556403, 552929, 549777, 546995, 544824, 542934, 540781, 538502, 536783, 535975, 535939, 536545, 537687, 538982, 540127, 541357, 542845, 543882, 543526, 542022, 540693, 540328, 540492, 540497, 540214, 539731, 539071, 538517, 538503, 538837, 538798, 538375, 538655, 540508, 543607, 547306, 551809, 557571, 563970, 569497, 573301, 575829, 577835, 579357, 580022, 579977, 580034, 580888, 582454, 584155, 585671, 587145, 588798, 590769, 593452, 597428, 602744, 608678, 614598, 620683, 627252, 633868, 639827, 645271, 650891, 656581, 661337, 664665, 667272, 670053, 673092, 676063, 678948, 681808, 684291, 685877, 686397, 685978, 684716, 682682, 679992, 676654, 672674, 668585, 665524, 664296, 664455, 664606, 663631, 661524, 659174, 657483, 656654, 656164, 655406, 654262, 653045, 652135, 651998, 653292, 656386, 660626, 664506, 666762, 667090, 665842, 663473, 660465, 657327]
60156F57327l032l134l465l559l060k172j427j144j201j215q67l4J295K979M515
60141F41806N247N165N138N850O802P018O522O276O793P675Q484R075Q966P516
60127G38333N090K984J742M97j451l381m181l850l191k596j854p69O00J950K648
60112G32571K219J138M82N55P37Q04J271K018J914N47q46j132q54j100j862k615
60096G35847l514m697n351m759l614k974k545j372L08J359J511J549J919K383
60082G16050K828L345L729L769L747L777L162J394q53k741m583o904q939r585
60068G08196r257r230r620r592r171r046q832p465n319m041m085m196l729l652
60054F10961m596n589n546m803m293m167l951l326k247r19Q4M35P53J866L407
$$ y = [657327, 654295, 651161, 647696, 644137, 641077, 638905, 637478, 636334, 635133, 633918, 633051, 633017, 634312, 637291, 641806, 647053, 652218, 657356, 663206, 670008, 677026, 683548, 689824, 696617, 704292, 712776, 721851, 730817, 738333, 743423, 746407, 748149, 748646, 747195, 743814, 739633, 735783, 732592, 729996, 728142, 727373, 727973, 729923, 732571, 734790, 735928, 736410, 736965, 737702, 738506, 739777, 741795, 743709, 744256, 743410, 742278, 741424, 740324, 738462, 735847, 732333, 727636, 722285, 717526, 713912, 710938, 708393, 707021, 707329, 708688, 710199, 711748, 713667, 716050, 718878, 722223, 725952, 729721, 733468, 737245, 740407, 741801, 740948, 738207, 733624, 726720, 717781, 708196, 698939, 689709, 680089, 670497, 661326, 652280, 643448, 635983, 630664, 626623, 622538, 618342, 614613, 610961, 606365, 600776, 595230, 590427, 586134, 581967, 578016, 574690, 572443, 571524, 571608, 572043, 572796, 574662, 578069]
60039E78069M275M378M609N078M882L852L021K872K641J853J117P40j8j527k952
60024F12890l732m573o024p288p548p471q114r158r428q532o939n033l095j783
60010E24172j452j310k55J582K955L065K341J693J618K014K462K637K644K771
59996E46937K899K547J563L49p27j627k303k588k571k423j843m09J376K327K090
59981E45597J524J246P77l89j837k959l754m272m117l210k291j927j747j362j232
59966E20047j724k052j258L41J651K386L090L914M414M488M541M690M576M065
59952E53169L456K940K430J957J774J916K038J784J124L72l5Q4L41J47n43j195
59936E71759j582k121l027l750l769l403l257l233k860k246j974k092j954j110
$$ y = [578069, 582344, 586722, 591331, 596409, 601291, 605143, 608164, 611036, 613677, 615530, 616647, 617387, 617369, 615842, 612890, 609158, 604585, 598561, 591273, 583725, 576254, 568140, 558982, 549554, 541022, 534083, 529050, 525955, 524172, 522720, 521410, 521155, 522737, 525692, 528757, 531098, 532791, 534409, 536423, 538885, 541522, 544166, 546937, 549836, 552383, 553946, 554295, 553568, 551941, 549638, 547050, 544479, 542056, 540213, 539804, 541180, 543507, 545597, 547121, 548367, 549144, 548755, 546918, 543959, 540205, 535933, 531816, 528606, 526315, 524388, 522641, 521279, 520047, 518323, 516271, 515013, 515354, 517005, 519391, 522481, 526395, 530809, 535297, 539838, 544528, 549104, 553169, 556625, 559565, 561995, 563952, 565726, 567642, 569680, 571464, 572588, 572960, 572925, 573009, 573350, 573497, 572954, 571759, 570177, 568056, 565029, 561279, 557510, 554107, 550850, 547617, 544757, 542511, 540537, 538445, 536491, 535381]
59922E35381J56J247J850J990J834J590J438J542K106L227M625N758O343O570
59908E75657O649O478N869M861L613K268J083L77J33p6n39j037j181q77l03L30
59892F03305Q39J138J395J866K540L197L778M364M828M938M762M516M099L323
59878F48888K525K253K392K367K230K592L271L058J262j312l469m919n909o369
59864F48860o225n983o174o533o334n328l868k406j318q73r07p61M0J290K490
59849F05970L450M192M727N234O164P831J0077J2446J4369J5258J5001J4221J3321
59836G32261J1389P219J568k870m285l435j908r1K113L689L133K41l906q289j2273
59821G24556j5035j5988j5646j5125j4709j3787j2048r914p857n998m452l315
$$ y = [535381, 535537, 536784, 538634, 540624, 542458, 544048, 545486, 547028, 549134, 552361, 556986, 562744, 569087, 575657, 582306, 588784, 594653, 599514, 603127, 605395, 606478, 606855, 606988, 606912, 606373, 605336, 604155, 603278, 602975, 603305, 604144, 605282, 606677, 608543, 611083, 614280, 618058, 622422, 627250, 632188, 636950, 641466, 645565, 648888, 651413, 653666, 656058, 658425, 660655, 663247, 666518, 669576, 670838, 669526, 666057, 661138, 655229, 648860, 642635, 636652, 630478, 623945, 617611, 612283, 608415, 606009, 604691, 603818, 602911, 602150, 602190, 603480, 605970, 609420, 613612, 618339, 623573, 629737, 637568, 647645, 660091, 674460, 689718, 704719, 718940, 732261, 743650, 750869, 752437, 749567, 745282, 741847, 739939, 739848, 741961, 745650, 748783, 749024, 745118, 736829, 724556, 709521, 693533, 677887, 662762, 648053, 634266, 622218, 612304, 604447, 598449, 593997, 590682]
59809E90682k364j295l11J18l9l56o30j004j527j974k150j996j588j237j371j974
59793E70984k488k555k461k498k403j961j612j824k265k257j755j223q72o66p66
59778E43378j253j689j690j689k373l489l985l318k007q13J5N81R49J091R98P73
59762E25479O46O97O24J61k54J21J095J572J205J101K211L869M816M957N067N325
59746E58692N283M884M457L944L157K558K747L322L304K601K017J867J606R28
59732F01367K37r3j60p8J31K01o6j66N26J510J568N15m31l77J07R7l39n46l60
59713F03643j42q5j32k92n98q21o39o6M67M98Rl78Q4J334K352K336J773J734K314
59694F13391K534J867J027R41J571K175K322K030J268n3j543k318j834o43Q8j66
$$ y = [590682, 588318, 587023, 586712, 586830, 586791, 586435, 585805, 584801, 583274, 581300, 579150, 577154, 575566, 574329, 572958, 570984, 568496, 565941, 563480, 560982, 558579, 556618, 555006, 553182, 550917, 548660, 546905, 545682, 544810, 544144, 543378, 542125, 540436, 538746, 537057, 534684, 531195, 527210, 523892, 521885, 521072, 521087, 521668, 522617, 523708, 524706, 525479, 526125, 526822, 527446, 527607, 527353, 527474, 528569, 530141, 531346, 532447, 534658, 538527, 543343, 548300, 553367, 558692, 563975, 568859, 573316, 577260, 580417, 582975, 585722, 589044, 592348, 594949, 596966, 598833, 600439, 601367, 601604, 601511, 601351, 601273, 601404, 601605, 601539, 601373, 601899, 603409, 604977, 605492, 605061, 604684, 604791, 604888, 604549, 604003, 603643, 603501, 603416, 603284, 602992, 602394, 601573, 600934, 600868, 601335, 601833, 601842, 601464, 601548, 602882, 605234, 607570, 609343, 611077, 613391, 615925, 617792, 618819, 619760, 621331, 623506, 625828, 627858, 629126, 629073, 627530, 625212, 623378, 622735, 622823, 622657]
59678F22657p45q04m84o86j827l326m401m773m549m069l995m855o162o676n877
59663E69428m540l468k524j415n81m66n84k33L92O62O79J004J656K247K840L699
59647E68796M472M510L854K972J759k33k622m247m508l885l104k494k153j988
59633E61129j600p20K23O31O60R20J293R59l90k055l151l312k646j643j052j244
59617E48002j691j679j393j583k306k807k608j960j132n7J193K175K561K428K082
59602E41225J893K109K404J980O28p55j286j284j502j781j493q89q02j183j168
59587E38096n41mJ7j88m61r97j590j681j280j008j108j283j450j747j835j295
59571E21645o80r87k057k616k118j363j085j004o52j26L12N73M38j80o43j91P81
$$ y = [622657, 621912, 621108, 620624, 619938, 618111, 614785, 610384, 605611, 601062, 596993, 592998, 588143, 581981, 575305, 569428, 564888, 561420, 558896, 557481, 556900, 556434, 555850, 555617, 556009, 556671, 557350, 558354, 560010, 562257, 565097, 568796, 573268, 577778, 581632, 584604, 586363, 586130, 583508, 579261, 574753, 570868, 567764, 565270, 563117, 561129, 559529, 558809, 559032, 559663, 560323, 561243, 562536, 563495, 563105, 561050, 557899, 554587, 551941, 550298, 549246, 548002, 546311, 544632, 543239, 541656, 539350, 536543, 533935, 531975, 530843, 530786, 531979, 534154, 536715, 539143, 541225, 543118, 545227, 547631, 549611, 550239, 549484, 548198, 546914, 545412, 543631, 542138, 541249, 540447, 539264, 538096, 537555, 537551, 537568, 537380, 536919, 535922, 534332, 532651, 531371, 530363, 529255, 527972, 526522, 524775, 522940, 521645, 520965, 519978, 517921, 515305, 513187, 511824, 510739, 509735, 509083, 508957, 509269, 509842, 510280, 510100, 509457, 509266, 510047]
59554E10047J110O07K49N83J159J685K407L092L071K609K838L913M714M843N399
59539E48326P055Q984J0525J2437J5394J8586K0856K1885K1017J6495P768k324
59527G07004r494j1886j0776q079m749j366J414L423M977O054O149N064L156Q58
59513F91749j589m027o412q795j0867j1960j1897j1447j1388j1507j1087r983
59501E80790q592p212o009n341n329n382m719l273j688n73j11j33j83J63Q05J251
59485E34464J361J410J352Q29K21O25K255L789M112L826M183N223O105O584P004
59470E83343P178O586N478M649M159L293J857O01J18J22J46K68R10K311M405O829
59454F32253Q958J0270J0854J1242J1719J2033J1831J1126J0251R402Q314O448
$$ y = [510047, 511157, 511764, 512013, 512596, 513755, 515440, 517847, 520939, 524010, 526619, 529457, 533370, 538084, 542927, 548326, 555381, 564365, 574890, 587327, 602721, 621307, 642163, 664048, 685065, 701560, 709328, 707004, 697510, 685624, 674848, 666769, 662020, 660654, 662068, 665491, 670468, 676522, 682671, 687735, 690891, 691749, 690160, 686133, 679721, 670926, 660059, 648099, 636202, 624755, 613367, 601860, 590773, 580790, 572198, 564986, 558977, 553636, 548307, 542925, 538206, 534933, 533245, 532672, 532561, 532428, 532245, 532408, 533213, 534464, 535825, 537235, 538587, 539416, 539637, 540262, 542517, 546306, 550418, 554244, 558427, 563650, 569755, 576339, 583343, 590521, 597107, 602585, 607234, 611393, 614686, 616543, 617144, 617262, 617384, 617530, 617798, 618708, 621019, 625424, 632253, 641211, 651481, 662335, 673577, 685296, 697329, 709160, 720286, 730537, 739939, 748253, 754701]
59442G54701L567ml852p919j1960j4955j5783j4562j2559j0710r004p395o254
59429F43311n557m653l346k311j804q82J264M073O564Q801J1397J4175J6344J7711
59415G05087J8746J9775K0884K2301K4052K5559K6295K6263K4883K0028R839m371
59403I39341j8100k6962k9455k6670k0581j3027n379J547P036R714P817P10r971
59390H16020k0915k8819l1872l0302k5927k0905j6560j3166j0483q192n977l712
59378E99190j684l57K15N58J278K468L663M387M656M873N187N251M868M530M797
59363F43880N385N570N391N588O333O899O970P257Q339R700J0650J1456J2732
59350G46150J4232J5190J5633J6469J8233K0310K1495K1063J9351J7494J6367
$$ y = [754701, 758268, 758264, 754412, 746493, 734533, 719578, 703795, 689233, 676674, 665964, 656960, 649565, 643311, 637754, 633101, 629755, 627444, 625640, 624758, 626022, 630095, 636659, 645460, 656857, 671032, 687376, 705087, 723833, 743608, 764492, 786793, 810845, 836404, 862699, 888962, 913845, 933873, 943712, 939341, 921241, 894279, 864824, 838154, 817573, 804546, 799167, 800714, 807750, 817464, 825281, 825991, 816020, 795105, 766286, 734414, 704112, 678185, 657280, 640720, 627554, 617071, 608879, 602902, 599190, 597506, 597149, 597364, 597922, 599200, 601668, 605331, 609718, 614374, 619247, 624434, 629685, 634553, 639083, 643880, 649265, 654835, 660226, 665814, 672147, 679046, 686016, 693273, 701612, 711312, 721962, 733418, 746150, 760382, 775572, 791205, 807674, 825907, 846217, 867712, 888775, 908126, 925620, 941987]
59339I41987J5685J4359J1778Q284M401K99l746p173r919j2696j5961j9071k1016
59326I07211k1543k1088k0146j9090j8152j7135j5649j3914j2640j1770j0248
59315G25836p630n061l813l579l162k243j469j197j115r27n70O9J046K140L229
59300G01554M528N997P034P371P808R359J1992J4821J7144J8746J9488J9089J6911
59287H61842J1833L238p357j6602k2055k3911k3550k1555j8150j4393j1266q319
59275G09755m629o44K347M181N856P851R812J1632J3509J4959J5065J3715J1566
59262H14975Q866N466J805j372m229p436j0626j2566j3002j2979j3111j2879j2008
59249G30904j1249j1072j0688r147o684m328k670j578o10O55K349M094N344O047
$$ y = [941987, 957672, 972031, 983809, 992093, 996494, 996793, 993047, 985874, 975955, 963259, 947298, 928227, 907211, 885668, 864580, 844434, 825344, 807192, 790057, 774408, 760494, 747854, 736084, 725836, 718206, 713145, 709332, 705753, 702591, 700348, 698879, 697682, 696567, 695640, 695070, 695139, 696185, 698325, 701554, 706082, 712079, 719113, 726484, 734292, 743651, 755643, 770464, 787608, 806354, 825842, 844931, 861842, 873675, 876913, 869556, 852954, 830899, 806988, 783438, 761883, 743733, 729340, 718074, 709755, 705126, 704482, 706829, 711010, 716866, 724717, 734529, 746161, 759670, 774629, 789694, 803409, 814975, 823841, 829307, 831112, 829740, 825511, 818075, 807449, 794883, 781881, 768902, 755791, 742912, 730904, 719655, 708583, 697895, 688748, 682064, 677736, 675066, 673488, 672878, 673533, 675882, 679976, 685320, 691367]
59235F91367O599P138P402P316P097O788O128M966L361J320j077l377n132o463
59221G33433p695q617q701q039p372p225p441p506o862n193k927j144m09k1R79
59206F55260K442L476L654L122J957M10o27m90K02L63j3j26J14J27o0J22M93L14
59188F70740k33j93L78K67q48j598q81N57J307J171R99J329J911K296K317K247
59172F81766K683L933N488O528P004P630Q808J0165J1270J2129J2805J3070J2607
59159G95886J1183Q727N662K927J033o20k837n343p216q336r355j0379j0711j0081
59145G60540r139q592q584r003r622r929r545q828q380q153p768p415p457p409
59131F40716o449m791l487k885k426j842j340o69O89K378L465L983M911O458P773
$$ y = [691367, 697966, 705104, 712506, 719822, 726919, 733707, 739835, 744801, 748162, 749482, 748405, 745028, 739896, 733433, 725738, 717121, 708420, 700381, 693009, 685784, 678343, 670837, 663975, 658782, 655855, 654711, 654302, 654281, 655260, 657702, 661178, 664832, 667954, 669911, 670321, 669694, 669204, 669406, 669769, 669756, 669630, 669744, 669871, 669811, 669933, 670426, 670740, 670507, 670314, 670692, 670959, 670111, 668513, 667632, 668189, 669496, 670667, 671666, 672995, 674906, 677202, 679519, 681766, 684449, 688382, 693870, 700398, 707402, 715032, 723840, 734005, 745275, 757404, 770209, 783279, 795886, 807069, 815796, 821458, 824385, 825418, 824798, 821961, 816618, 809402, 801066, 791711, 781332, 770621, 760540, 751401, 742809, 734225, 725222, 715600, 705671, 696126, 687298, 678918, 670765, 662997, 655582, 648125, 640716, 634267, 629476, 625989, 623104, 620678, 618836, 617496, 616827, 617516, 619894, 623359, 627342, 632253, 638711, 646484]
59116F46484Q512R314J0369J0922J0723J0601J1052J1407J0977R951Q694P325
59104G66331O352O484P193O760M550K112J096J145P40o56k342l571m136m092l627
59089G84339l051k589k373k579l056l068k298j885l246n925p915q357q451r272
59075G20274j0162j0060r108q138p512p238p285p156o086m307l090k999l155k802
59061F31176k455k670k897k468j768j467j460j416j470j598j165j06M60k67j416
59046F09013j661j020m14j80m1j5k42l38J12P53R65P29L24k37p38m25R83K489
59028F10057L067L192M069N812P407Q366R275J0684J2280J3392J3758J3594J3218
59015G28171J2619J1322Q863N512K159n95k845m758o146o792o641n505l251m46
$$ y = [646484, 654996, 664310, 674679, 685601, 696324, 706925, 717977, 729384, 740361, 750312, 759006, 766331, 772683, 779167, 786360, 793120, 797670, 799782, 800878, 802023, 802763, 802107, 799765, 796194, 792058, 787966, 784339, 781288, 778699, 776326, 773747, 770691, 767623, 765325, 763440, 760194, 754269, 746354, 737997, 729546, 720274, 710112, 700052, 690944, 682806, 675294, 668056, 660771, 653615, 647529, 643222, 640132, 637133, 633978, 631176, 628721, 626051, 623154, 620686, 618918, 617451, 615991, 614575, 613105, 611507, 610342, 610236, 610696, 610429, 609013, 607352, 606332, 605918, 605738, 605697, 605682, 605440, 605102, 605214, 605967, 606932, 607661, 607985, 607748, 607010, 606585, 607568, 610057, 613124, 616316, 620385, 626197, 633604, 641970, 651245, 661929, 674209, 687601, 701359, 714953, 728171, 740790, 752112, 760975, 766487, 768646, 768051, 765206, 760448, 754302, 747510, 740869, 735364, 732113, 731667]
59001G31667J932L635N248O958Q161Q560Q667Q749Q264O963N587M763M051K828
58987H16033J414L83n65k233m666o985q323q506q048p670p560p079n621l535j547
58972G45492M27K930N570P293Q072R034J0644J2164J3162J4085J5001J5163J4447
58959H73484J3711J3188J1968R722P364N173J923l097q619j3091j6463j9117k0486
58946H55660k0128j9009j8235j7494j5986j4001j2214j0388q043n623l783k355
58934G08401j129p51j601k673k831k396k305k603k877l272l855l935l271k975
58920F71927l835m730m195k641j578j358j292j221j319j020K60J872K834L436
58906F57140M472N569N884N904O848Q712J0476J1959J3783J5753J6883J6955J6679
$$ y = [731667, 733599, 737234, 742482, 749440, 757601, 766161, 774828, 783577, 791841, 798804, 804391, 809154, 813205, 816033, 817447, 817830, 817265, 815032, 810366, 803381, 795058, 786552, 778504, 770834, 763274, 756195, 750574, 747039, 745492, 745919, 748849, 754419, 761712, 769784, 778818, 789462, 801626, 814788, 828873, 843874, 859037, 873484, 887195, 900383, 912351, 922073, 929437, 934610, 936533, 933436, 924817, 911726, 895263, 876146, 855660, 835532, 816523, 798288, 780794, 764808, 750807, 738593, 728205, 720162, 714539, 710756, 708401, 707272, 706521, 704920, 702247, 699416, 697020, 694715, 692112, 689235, 685963, 682108, 678173, 674902, 671927, 668092, 663362, 659167, 656526, 654948, 653590, 652298, 651077, 649758, 648738, 648998, 650870, 653704, 657140, 661612, 667181, 673065, 678969, 685817, 694529, 705005, 716964, 730747, 746500, 763383, 780338, 797017]
58893G97017J6426J6120J6192J7298J9164K0928K2506K4503K6913K8998L0177
58882A036242L0099K8238K4528J9988J5636J1206O001M23m645r345j4377j9419
58870A124575k3402k5982k7521k7906k6708k4207k1149j7838j4558j2280j1707
58859H91317j2143j2494j2730j3242j3569j3209j2837j3090j3052j1666r897r438
58847G43950r945r667q420p673p894p977p477p248p616p787p406p036o828o305
58833F34671n665n636n872n210l779l083l616m016l227j952j219q47j06J074K204
58818E93721K889L038K923L065L578L841L511L279L740M217L826L036K794K770
58804F40228K065J021O30O24m9j200j748j809k464l632m174m001m094m427l924
$$ y = [797017, 813443, 829563, 845755, 863053, 882217, 903145, 925651, 950154, 977067, 1006065, 1036242, 1066341, 1094579, 1119107, 1139095, 1154731, 1165937, 1171938, 1172361, 1167716, 1158371, 1143994, 1124575, 1101173, 1075191, 1047670, 1019764, 993056, 968849, 947700, 929862, 915304, 903024, 891317, 879174, 866680, 853950, 840708, 827139, 813930, 801093, 788003, 774951, 763285, 753388, 743950, 734005, 724338, 715918, 708245, 700351, 692374, 684897, 677649, 670033, 662246, 654840, 647804, 640976, 634671, 629006, 623370, 617498, 612288, 608509, 605426, 601810, 597794, 594567, 592615, 591396, 590549, 590443, 591517, 593721, 596610, 599648, 602571, 605636, 609214, 613055, 616566, 619845, 623585, 627802, 631628, 634664, 637458, 640228, 642293, 643314, 643944, 644568, 644519, 643319, 641571, 639762, 637298, 633666, 629492, 625491, 621397, 616970, 613046]
58789F13046k680k042k232j961p91J84N22J324L125M785N273M998M585L860K904
58774F34900K612L283L778K899P39j806l978n310n778o062o743p313o962o079
58760E98180n633n360m181k282r97o05lJ265K405K977L427L797L587L131L384
58745F03092M186M494M475N424P357Q621Q408P720P424P261P261Q077R308R456
58731G02564Q339P675Q443R480R552R084Q891Q800Q426P905P189N988M962N356
58717H12654O992Q243Q499Q818R667J0060R556R106Q953P767M874J490j312m032
58703I01335p083r618j1236j3113j6087j9240k1526k3329k5124k6077k5341k3445
58691F80116k1262j8780j5958j3452j1521r469p066n271m677m623m594m983n681
$$ y = [613046, 610366, 608324, 606092, 604131, 603340, 603524, 604046, 605370, 608495, 613280, 618553, 623551, 628136, 631996, 634900, 637512, 640795, 644573, 647472, 648211, 646405, 642427, 637117, 631339, 625277, 618534, 611221, 604259, 598180, 592547, 587187, 583006, 580724, 579727, 579122, 579119, 580384, 582789, 585766, 589193, 592990, 596577, 599708, 603092, 607278, 611772, 616247, 621671, 629028, 637649, 646057, 653777, 661201, 668462, 675723, 683800, 693108, 702564, 710903, 718578, 727021, 736501, 746053, 755137, 764028, 772828, 781254, 789159, 796348, 802336, 807298, 812654, 819646, 827889, 836388, 845206, 854873, 864933, 874489, 883595, 892548, 900315, 905189, 906679, 905367, 901335, 894252, 884634, 873398, 860285, 844198, 824958, 803432, 780103, 754979, 728902, 703561, 680116, 658854, 640074, 624116, 610664, 599143, 589674, 582608, 577337, 572660, 568037, 563443, 558460, 552779]
58678E52779n561m269k986k532k186j331n29j06O46J961L026L819N589Q508J0799
58663E67627J1472J1919J3360J4572J3797J1276Q251N008J450j712l875n447o694
58650F41004p043o548o456p184p418o459n571n718n815m778l443k819k209q55
58636E68688L10L72K80J160K389L023L552M355M185K206k2p09m63o67p82L29J860
58619E90066K293K168L166N267P140Q513R998J1228J1235J0256R180P859N698
58606F84067L203J207o32k867m676n038m650m828n363n319n065n513o094n587
58592F32845m300l435k843j339J131L474N218O707P915Q667R538J1081J2648J3267
58578G00574J3043J2409J1039Q904P299P147P303O394N315N894P991J0004J1602
$$ y = [552779, 547218, 542949, 539963, 537431, 535245, 533914, 533385, 533279, 533925, 535886, 538912, 542731, 548320, 556828, 567627, 579099, 591018, 604378, 618950, 632747, 644023, 652274, 657282, 658732, 657020, 653145, 647698, 641004, 633961, 627413, 620957, 613773, 606355, 599896, 594325, 588607, 582792, 578014, 574571, 571752, 569543, 568688, 568998, 569370, 569650, 570810, 573199, 576222, 579774, 584129, 588314, 590520, 590498, 589789, 589326, 588659, 587877, 588206, 590066, 592359, 594527, 597693, 602960, 610100, 618613, 628611, 639839, 651074, 661330, 670510, 678369, 684067, 687270, 688477, 687845, 684978, 680302, 675264, 670614, 665786, 660423, 655104, 650039, 644526, 638432, 632845, 628545, 625110, 622267, 620928, 622059, 625533, 630751, 637458, 645373, 654040, 663578, 674659, 687307, 700574, 713617, 726026, 737065, 745969, 753268, 760415, 767718, 774112, 779427, 785321, 793312, 803316, 814918]
58565H14918J3807J6762J9520K1827K4330K7054K9183L0245L0241K8892K5906
58554A082685K1589J6349J0269M031q69l900o335r151j1404j2014j1696j1554
58542A068000j1287j0528j0523j2446j5254j7224j8549k0428k2608k3826k3780
58531H81547k2889k0998j8051j4947j2235r142n484k924k414k082J56L414N460
58518G79411O002O008N342L633K064J677J279m36k199k333j996l245n282n934
58504G83991n522n873o497n445l210k207k755l005k518k542k969k402j197j167
58490G36682k251k564j786j430j639q40J246L172M581O536Q971J0616J1674J3699
58476G86667J6508J8110J7859J6998J5816J3139Q933M645N42m421r698j2876j2994
$$ y = [814918, 828725, 845487, 865007, 886834, 911164, 938218, 967401, 997646, 1027887, 1056779, 1082685, 1104274, 1120623, 1130892, 1134923, 1134054, 1130154, 1123819, 1114668, 1103264, 1091250, 1079554, 1068000, 1056713, 1046185, 1035662, 1023216, 1007962, 990738, 972189, 951761, 929153, 905327, 881547, 858658, 837660, 819609, 804662, 792427, 783285, 777801, 774877, 772463, 770381, 770537, 773951, 779411, 785413, 791421, 796763, 800396, 802460, 804137, 805416, 804980, 802781, 800448, 798452, 795207, 789925, 783991, 778469, 772596, 766099, 760654, 757444, 755237, 752482, 749477, 746959, 744417, 741448, 739046, 737849, 736682, 734431, 731867, 730081, 728651, 727012, 726172, 727418, 730590, 735171, 741707, 750678, 761294, 772968, 786667, 803175, 821285, 839144, 856142, 871958, 885097, 894030, 898675, 899217, 894796, 885098, 872222, 859228]
58463H59228j1671j0441r278q132p390o279l279J285N161P161Q248R423J0528
58450H44564J1342J1830J1238Q819N310J952j500n715r559j1359j1649j1990j1824
58437H31459r493n740k963j428N16K753L466K860L269N229O715O827P083Q515
58423H59068J0350J2085J4063J5611J5282J3217J0757P759L154k052n384o503
58411I47407p284q402q968r311j0712j2421j2326j0635r535r276q141o190n179
58398H29027m732k582J074L415L591L571M061L633K454K663M219M488K800J486
58384H59168J512J166l0k48P07N76j071j736l65J135J861L307N608O636O182O824
58368H91232R161J0404R380Q651R857J1161J1234J1735J3637J5026J4730J4469
$$ y = [859228, 847557, 837116, 827838, 819706, 812316, 806037, 802758, 804043, 809204, 816365, 824613, 834036, 844564, 855906, 867736, 878974, 887793, 893103, 895055, 893555, 887840, 878281, 866922, 855273, 843283, 831459, 821966, 816226, 813263, 811835, 812351, 815104, 818570, 821430, 824699, 829928, 836643, 843470, 850553, 859068, 869418, 881503, 895566, 911177, 926459, 939676, 950433, 958192, 961346, 959294, 953910, 947407, 940123, 931721, 922753, 913442, 902730, 890309, 877983, 867348, 857813, 848537, 840396, 834206, 829027, 824295, 821713, 822787, 826202, 829793, 833364, 837425, 841058, 843512, 846175, 850394, 854882, 857682, 859168, 860680, 861846, 861816, 861568, 862275, 862851, 861780, 860044, 859679, 860814, 862675, 865982, 871590, 878226, 884408, 891232, 900393, 910797, 920177, 928828, 938685, 949846, 961080, 972815, 986452, 1001478, 1016208, 1030677]
58356A030677J5288J5423J3708J1659J0282Q309N409L600L663L593K406J905L021
58343A128943M052M177N057P269Q849R045R768J1782J3272J3646J4782J7000J7971
58330A265613J7181J7163J8714J9178J7236J4922J3280J0590O683M316M315M029
58318A413220K439K027L750N126N207O278Q700R528Q325Q705J1778J3893J3422
58305A512398J3726J6513J8382J7306J6482J8240J9918J9457J9275K0921K1630
58294A714248K0010J9256K0932K1656J9890J9757K3727K7736K8220K7917K9830
58283A973179L1537L0707L0315L2976L5640L5284L4419L5840L7445L7245L7920
58272B352507M1226M3742M3227M3323M6769N0177N0911N2617N8196O3850O5990
$$ y = [1030677, 1045965, 1061388, 1075096, 1086755, 1097037, 1105346, 1110755, 1114355, 1118018, 1121611, 1124017, 1125922, 1128943, 1132995, 1137172, 1142229, 1149498, 1158347, 1167392, 1177160, 1188942, 1202214, 1215860, 1230642, 1247642, 1265613, 1282794, 1299957, 1318671, 1337849, 1355085, 1370007, 1383287, 1393877, 1400560, 1404876, 1409191, 1413220, 1415659, 1417686, 1421436, 1426562, 1431769, 1438047, 1446747, 1456275, 1464600, 1473305, 1485083, 1498976, 1512398, 1526124, 1542637, 1561019, 1578325, 1594807, 1613047, 1632965, 1652422, 1671697, 1692618, 1714248, 1734258, 1753514, 1774446, 1796102, 1815992, 1835749, 1859476, 1887212, 1915432, 1943349, 1973179, 2004716, 2035423, 2065738, 2098714, 2134354, 2169638, 2204057, 2239897, 2277342, 2314587, 2352507, 2393733, 2437475, 2480702, 2524025, 2570794, 2620971, 2671882, 2724499, 2782695, 2846545, 2912535]
58261B912535O7644P1918P5722P6203P6619P9470Q0746P7652P4952P6867P9850
58250C750178Q0318Q1944Q7898R3781R6042R9517J08354J17528J22011J26171
58240D763742J35102J44878J50830J57143J68418J80206J87998J96982K12271
58231F297570K28368K39412K50828K69182K89755L06332L23857L48591L75473
58222H929368L98571M24246M59889M99836N37094N78418O32256O92874P52919
58213A3905471Q20244R04796J000984J101881J218341J364053J535107J726295
58205B3577172J953723K237760K578625K975011L450641M032578M719104N502538
58197E1027152O410407P493510Q796417J0383085J2372545J4902254J8075605
$$ y = [2912535, 2980179, 3052097, 3127819, 3204022, 3280641, 3360111, 3440857, 3518509, 3593461, 3670328, 3750178, 3830496, 3912440, 4000338, 4094119, 4190161, 4289678, 4398032, 4515560, 4637571, 4763742, 4898844, 5043722, 5194552, 5351695, 5520113, 5700319, 5888317, 6085299, 6297570, 6525938, 6765350, 7016178, 7285360, 7575115, 7881447, 8205304, 8553895, 8929368, 9327939, 9752185, 10212074, 10711910, 11249004, 11827422, 12459678, 13152552, 13905471, 14725715, 15630511, 16631495, 17733376, 18951717, 20315770, 21850877, 23577172, 25530895, 27768655, 30347280, 33322291, 36772932, 40805510, 45524614, 51027152, 57437559, 64931069, 73727486, 84110571, 96483116, 111385370, 129460975]
58190A29460975K1986989K6729031L2213142L7883100M2597314M4779752M2734099
58183C78384402L5144317K1857534M591863j3235245k7871747l6942934m0223973
58176C21704217l9070068l5266410l0261697k5059889k0415290j6916773j4845331
58169A39868759j3993118j3726262j3355908j2530967j1309111r917663q525702
58162E6510028p219832o064715n097669m300162l631755l077465k633182k272448
58154B2212800j963419j700291j488074j313286j157104j021983r18473q38108
58146A1812062p63573o94410o39811n95705n50456n04808m66417m32121l93797
58137F770964l54776l23354k96817k67818k39741k20366k06851j92069j79379
$$ y = [129460975, 151447964, 178176995, 210390137, 248273237, 290870551, 335650303, 378384402, 413528719, 435386253, 439978116, 426742871, 398871124, 361928190, 321704217, 282634149, 247367739, 217106042, 192046153, 171630863, 154714090, 139868759, 125875641, 112149379, 98793471, 86262504, 74953393, 65035730, 56510028, 49290196, 43225481, 38127812, 33827650, 30195895, 27118430, 24485248, 22212800, 20249381, 18549090, 17061016, 15747730, 14590626, 13568643, 12650170, 11812062, 11048489, 10354079, 9714268, 9118563, 8568107, 8063299, 7596882, 7164761, 6770964, 6416188, 6092834, 5796017, 5528199, 5288458, 5068092, 4861241, 4669172, 4489793]
58128D489793j76056j77763j74283j65646j58635j52227j40582j26368j17319
58119C100914j12682j05712r6716r1414q9137q4436p8014p4943p4077p0008o3531
58108B160244n9976n8959n5621n0277m7483m7129m5476m3311m4259m6691m5886
58097A615176m2687m1742m2689m1233l7433l4987l3672l0301k5864k4099k4192
58086A236277k2204j8556j6936j7125j5959j4088j4705j6804j6742j5363j6621
58075A051174k0048k1508k0605k0637k1823k1212j8881j7817j8070j6959j4664
58064H38950j3774j3829j2105r219q272r064q755p581q185r992r957q381q387
58051G11449r999j0378r393r488j0359r373o916n928o390n650l911l901n394n510
$$ y = [4489793, 4313737, 4135974, 3961691, 3796045, 3637410, 3485183, 3344601, 3218233, 3100914, 2988232, 2882520, 2785804, 2694390, 2605253, 2520817, 2442803, 2367860, 2293783, 2223775, 2160244, 2100268, 2041309, 1985688, 1935411, 1887928, 1840799, 1795323, 1752012, 1707753, 1661062, 1615176, 1572489, 1530747, 1488058, 1446825, 1409392, 1374405, 1340733, 1310432, 1284568, 1260469, 1236277, 1214073, 1195517, 1178581, 1161456, 1145497, 1131409, 1116704, 1099900, 1083158, 1067795, 1051174, 1031126, 1009618, 989013, 968376, 946553, 925341, 906460, 888643, 870573, 853614, 838950, 825176, 811347, 799242, 790023, 781751, 772687, 763932, 756351, 748166, 738174, 728217, 719836, 711449, 701450, 691072, 681679, 672191, 661832, 652459, 645543, 639615, 633225, 627575, 623664, 619763, 614369, 608859]
58037F08859m396n004p226p756o104n344o376o839o247o957r229j0336r576r351
58023E08118j0407j0581r238q432q589p496m725k849l108l644l160k635k505j777
58009D28972p50j123k633l056k077j696k348k288j288j230k337k502j094M1O2
57994D04653J95P13L27p58o04R36J732J059N14P23M64m05m83J24l76k052k929
57977D03833k629k949m208m501l338k639l187l373k431j780k110k183j411q45
57963C66249p41kJ271J558Q48Q70J851J979P48k92o49j650l355l909k833j893
57947C60050j862j353K26J556K030K663L650L934L809M880O867P665P185P821
57933D09121J0241J2208J2544J2773J3691J3757J2257J0622R277O560K296r82
$$ y = [608859, 604463, 599459, 592233, 584477, 578373, 573029, 566653, 559814, 553567, 546610, 537381, 527045, 517469, 508118, 497711, 487130, 477892, 469460, 460871, 453375, 448650, 445801, 442693, 439049, 435889, 433254, 430749, 428972, 428222, 427099, 424466, 421410, 419333, 417637, 415289, 413001, 411713, 410483, 408146, 405644, 404550, 404591, 404653, 404848, 405561, 405888, 405130, 404526, 405462, 407194, 408253, 408767, 409490, 409954, 409549, 409066, 409190, 408814, 406762, 403833, 401204, 398255, 394047, 389546, 386208, 383569, 380382, 377009, 374578, 372798, 370688, 368505, 367094, 366249, 365508, 365506, 366777, 368335, 369183, 370053, 371904, 373883, 374631, 374339, 373690, 372040, 368685, 364776, 361943, 360050, 358188, 356835, 357061, 358617, 360647, 363310, 366960, 370894, 374703, 379583, 386450, 394115, 401300, 409121, 419362, 431570, 444114, 456887, 470578, 484335, 496592, 507214, 516491, 523051, 525347, 524365]
57921E24365k069l064n518p862q641r144j0680j2116j2298j2192j2528j1992r895
57908D06366q001p515o844m603k408k217l123l247k830l082l731l951m128m608
57894C46078m337k658q52j14L30J426K431K679L252M948O349N985M777M349M436
57879C79079L960L225L039K901J983O87l67j696l702n439o113o465p171p417o543
57864C49961n528n318n216m598m434n378n969m679k336o42L55J487K565L116L689
57849C17075M611M810L658K597L002L824L326J894R68M51o30j867k234k207k919
57834C36359l887l721k573j872k068k475k863l408l429k104j42R15R50J241K395
57819C13318L662M293M317M027L649L400L191K558J495P13O12P87R86J427J650
$$ y = [524365, 522296, 519232, 513714, 505852, 497211, 488067, 477387, 465271, 452973, 440781, 428253, 416261, 406366, 398365, 390850, 384006, 379403, 376995, 374778, 371655, 368408, 365578, 362496, 358765, 354814, 350686, 346078, 341741, 339083, 338231, 338117, 338447, 339873, 342304, 344983, 348235, 353183, 359532, 365517, 370294, 374643, 379079, 383039, 386264, 389303, 392204, 394187, 394874, 394507, 392811, 389109, 383670, 377557, 371092, 363921, 356504, 349961, 344433, 339115, 333899, 329301, 324867, 319489, 313520, 308841, 306505, 305863, 306218, 307705, 310270, 313386, 317075, 321686, 326496, 330154, 332751, 335753, 339577, 342903, 344797, 345765, 346216, 345586, 343719, 341485, 339278, 336359, 332472, 328751, 326178, 324306, 322238, 319763, 316900, 313492, 310063, 307959, 307817, 308732, 309682, 310923, 313318, 316980, 321273, 325590, 329617, 333266, 336666, 339857, 342415, 343910, 344623, 345235, 346022, 347008, 348435, 350085]
57804C50085M89j981l968m438m476n102n397m380l104l061l791l908l342k873
57790C00753k436j739j501k277k933k139n54K53J81J59J70l44p14K91K401M115
57774B93686M750M754M484M175M485N651O545O048M721L756L041J747J27r24j416
57759C45630j904k226k122k256l074l577k904k164k739l760l392j908j133j442
57745C11029j623j385j555k009j800j341k161m195n594n551n233n392n160l909
57731B64121k559k141k442k744k778k366j317q3N41O31J023J733J774P30n56j269
57715B52298j510j660j767j873k120k378k388k238k133j942j641j703k207k305
57701B24433j534q91j272j799j279m91r81k137j815J93J643J146j29o47n05m01
$$ y = [350085, 350574, 348593, 344625, 340187, 335711, 330609, 325212, 320832, 317728, 314667, 310876, 306968, 303626, 300753, 298317, 296578, 295077, 292800, 289867, 287728, 287174, 287427, 287608, 287767, 287937, 287593, 286879, 287170, 289571, 293686, 298436, 303190, 307674, 311849, 316334, 321985, 328530, 334578, 339299, 343055, 346096, 347843, 347970, 347046, 345630, 343726, 341500, 339378, 337122, 334048, 330471, 327567, 325403, 322664, 318904, 315512, 313604, 312471, 311029, 309406, 308021, 306466, 304457, 302657, 301316, 299155, 294960, 289366, 283815, 278582, 273190, 268030, 264121, 261562, 259421, 256979, 254235, 251457, 249091, 247774, 247691, 248232, 248863, 249886, 251619, 253393, 254123, 253567, 252298, 250788, 249128, 247361, 245488, 243368, 240990, 238602, 236364, 234231, 232289, 230648, 228945, 226738, 224433, 222899, 222008, 220736, 218937, 217658, 217167, 216186, 214049, 212234, 212427, 214070, 215216, 215087, 214440, 213935, 213534]
57685B13534k07M59J438K551L945N433O418O862P446Q491R717J1234J3688J7266
57671C08275K1656K7055L4064M2406N0878N8706O5629P0309O9788O1042M2668
57660H52476J5702j5612m4182o3394p1241p0516o5016n6944m7757l9198l2261
57649C62057k6469k1132j6534j3162j0758q830p237n839m384l084k425k171j501
57636B38531l41N25Q19J071J351J056K43j50O0o1q17j139l68N76O74K29j08n72
57618B41579j519k392k501k101j809j580j082l88L59J348K419K773J978P37q8
57603B37733n14r51j350j494j571j767j833j577j259j037o51r8M1n25j280j698
57587B20169j938k233k281j856j317j038q68o25m93m90k60J77K02l40o84l32Q4
$$ y = [213534, 213327, 213786, 215224, 217775, 221720, 227153, 233571, 240433, 247879, 256370, 266087, 277321, 291009, 308275, 329931, 356986, 391050, 433456, 484334, 543040, 608669, 678978, 748766, 809808, 852476, 868178, 852566, 808384, 744990, 673749, 603233, 538217, 481273, 433516, 394318, 362057, 335588, 314456, 297922, 284760, 274002, 265172, 257935, 252096, 247712, 244628, 242203, 240032, 238531, 238190, 238715, 239534, 240605, 241956, 243012, 243255, 243105, 243165, 243104, 242287, 241148, 240780, 241356, 242030, 242259, 242151, 241579, 240060, 237668, 235167, 233066, 231257, 229677, 228595, 228207, 228566, 229914, 232333, 235106, 237084, 237821, 237733, 237219, 236268, 234918, 233424, 231853, 230086, 228253, 226676, 225417, 224380, 223729, 223631, 223672, 223147, 221867, 220169, 218231, 215998, 213717, 211861, 210544, 209506, 208638, 208013, 207520, 207030, 206770, 206947, 207149, 206809, 206125, 205793, 205877]
57570B05877j69p37q42n35m59p81j066r85n98j88j25m95o54J72J622K314J686
57553B04037Q54J003J797K210K166K288K549K330J650J286J526J667J021q2p07
57538B25595m49J54L63K00K98P92Q96qj328k000j897j660j414p27K54P44N21J38
57520B20472q2j95L09K142M588N727M913L739L697M201L967L142K737K809K620
57505B64786K112J945K283K589K523K236J896J548J290J082O75Q4k86l46n99j219
57489B82599j538j040k27J41Q5L1lj36j21J36J42k56j48J241L097L825L032J771
57471B92631J026Q63R66J148J212J017P28O21P26R92J537K215K400J779J041J113
57455C12015K030L091L851M250M135L449K704K500K667K543K013J620J678J943
$$ y = [205877, 205708, 204971, 204129, 203594, 203135, 202354, 201288, 200303, 199705, 199517, 199392, 198897, 198243, 198415, 200037, 202351, 204037, 204891, 205894, 207691, 209901, 212067, 214355, 216904, 219234, 220884, 222170, 223696, 225363, 226384, 226302, 225595, 225146, 225300, 225663, 225863, 226161, 226953, 227849, 227841, 226513, 224513, 222616, 220956, 219542, 218815, 219069, 219813, 220334, 220472, 220390, 220195, 220504, 222646, 227234, 232961, 237874, 241613, 245310, 249511, 253478, 256620, 259357, 262166, 264786, 266898, 268843, 271126, 273715, 276238, 278474, 280370, 281918, 283208, 284290, 284965, 285049, 284763, 284417, 283818, 282599, 281061, 280021, 279794, 279935, 280020, 280051, 280048, 279912, 279791, 279927, 280069, 279813, 279665, 280906, 284003, 287828, 290860, 292631, 293657, 294520, 295486, 296634, 297846, 298863, 299591, 300212, 300938, 301930, 303467, 305682, 308082, 309861, 310902, 312015, 314045, 317136, 320987, 325237, 329372, 332821, 335525, 338025, 340692, 343235, 345248, 346868, 348546, 350489]
57441C50489K153K321K436K367K160K077K229K434K438K163J798J735K179K816
57427C81795L198L403L794M139L789K934K728L614M433L971K605J646J596K053
57413D25698K751L649M317M297L985M231N094N731N541M801M116L834L975M268
57399D86288M304L994L735L813L978L963L999M335M711M783M693M653M530M404
57385E46183M891O177P349P645P678Q347R128Q817P651P074P432P476O499N513
57371F47860N537N988N679M650L930M032M586N262O181P293P997P745O805O151
57357G29696O572P982R570J0554J0608R776Q371P034O502O997Q062R158J0059
57344H40941J0570J0387R589Q853Q731R027R261R386R624R953J0211J0429J0612
$$ y = [350489, 352642, 354963, 357399, 359766, 361926, 364003, 366232, 368666, 371104, 373267, 375065, 376800, 378979, 381795, 384993, 388396, 392190, 396329, 400118, 403052, 405780, 409394, 413827, 417798, 420403, 422049, 423645, 425698, 428449, 432098, 436415, 440712, 444697, 448928, 454022, 459753, 465294, 470095, 474211, 478045, 482020, 486288, 490592, 494586, 498321, 502134, 506112, 510075, 514074, 518409, 523120, 527903, 532596, 537249, 541779, 546183, 551074, 557251, 564600, 572245, 579923, 588270, 597398, 606215, 613866, 620940, 628372, 635848, 642347, 647860, 653397, 659385, 665064, 669714, 673644, 677676, 682262, 687524, 693705, 700998, 708995, 716740, 723545, 729696, 736268, 744250, 753820, 764374, 774982, 784758, 793129, 800163, 806665, 813662, 821724, 830882, 840941, 851511, 861898, 871487, 880340, 889071, 898098, 907359, 916745, 926369, 936322, 946533, 956962, 967574]
57331I67574J0510J0061R713R831J0129J0204J0295J0947J2115J3109J3327J2676
57319A100491J1551J0714J0821J1724J2614J3117J3701J4634J5322J5292J5052
57308A245033J5165J5155J4343J3232J2963J3723J4683J5326J5774J6055J5976
57297A407428J5742J5773J5968J5950J5943J6462J7256J7494J7086J6872J7379
57286A589353J8206J8803J9131J9311J9275J9005J8677J8434J8345J8513J8901
57275A795954J9280J9711K0728K2410K3781K3908K3245K3036K3656K4440K4980
57264B045129K5597K6544K7592K8456K9025K9234K9258K9554L0110L0099K9078
57253B359676K7958K7829K8353K8536K8531K9214L0296L0472K9521K8652K8624
$$ y = [967574, 978084, 988145, 997858, 1007689, 1017818, 1028022, 1038317, 1049264, 1061379, 1074488, 1087815, 1100491, 1112042, 1122756, 1133577, 1145301, 1157915, 1171032, 1184733, 1199367, 1214689, 1229981, 1245033, 1260198, 1275353, 1289696, 1302928, 1315891, 1329614, 1344297, 1359623, 1375397, 1391452, 1407428, 1423170, 1438943, 1454911, 1470861, 1486804, 1503266, 1520522, 1538016, 1555102, 1571974, 1589353, 1607559, 1626362, 1645493, 1664804, 1684079, 1703084, 1721761, 1740195, 1758540, 1777053, 1795954, 1815234, 1834945, 1855673, 1878083, 1901864, 1925772, 1949017, 1972053, 1995709, 2020149, 2045129, 2070726, 2097270, 2124862, 2153318, 2182343, 2211577, 2240835, 2270389, 2300499, 2330598, 2359676, 2387634, 2415463, 2443816, 2472352, 2500883, 2530097, 2560393, 2590865, 2620386, 2649038, 2677662]
57242B677662K8944K9152K9468K9779K9488K8860K9109L0528L1835L2071L1909
57231C008805L2413L3506L4592L5587L6472L6662L5771L4400L3371L2701L1991
57220C386271L1276L0825L0614L0439L0200K9746K8995K8391K8541K9163K9249
57209C713710K8477K7590K7104K6711K6387K6800K7974K8770K8612K8652L0052
57198D020839L2090L3169L3087L2970L3373L3741L3636L3433L3670L4450L5479
57187D389937L6140L5709L4110L2282L1252L0927L0366K9037K7312K5830K4894
57176D727796K4406K4051K3474K2613K1738K1045K0352J9367J8023J6507J5198
57165D954570J4547J4632J4832J4435J3493J2534J1504R815P408M915K599J79
$$ y = [2677662, 2706606, 2735758, 2765226, 2795005, 2824493, 2853353, 2882462, 2912990, 2944825, 2976896, 3008805, 3041218, 3074724, 3109316, 3144903, 3181375, 3218037, 3253808, 3288208, 3321579, 3354280, 3386271, 3417547, 3448372, 3478986, 3509425, 3539625, 3569371, 3598366, 3626757, 3655298, 3684461, 3713710, 3742187, 3769777, 3796881, 3823592, 3849979, 3876779, 3904753, 3933523, 3962135, 3990787, 4020839, 4052929, 4086098, 4119185, 4152155, 4185528, 4219269, 4252905, 4286338, 4320008, 4354458, 4389937, 4426077, 4461786, 4495896, 4528178, 4559430, 4590357, 4620723, 4649760, 4677072, 4702902, 4727796, 4752202, 4776253, 4799727, 4822340, 4844078, 4865123, 4885475, 4904842, 4922865, 4939372, 4954570, 4969117, 4983749, 4998581, 5013016, 5026509, 5039043, 5050547, 5060362, 5067770, 5072685, 5075284, 5075463]
57153E075463k109l351l385l337m118n284o078o642p372p824p129m999j719K243
57139E014359O061Q728J0098J1015J1741J1144Q238L744q36m882q509j1576j3981
57126E045344j6286j8793k0466j9951j7280j3449q762k828M143J1355J8635K6455
57114D988117L4907M3792N3609O5287P9020R4571J12727J35251J63300J97078
57104E967659K37327K86064L45698M18696N08569O20102P57950R25751J126887
57095A1194703J365033J643178J962577K322813K721476L152398L603932M058687
57087C2024797M493687M880463N187006N382704N443224N352242N101381M691271
57079G2556775M131852L437461K618764J681233O36026m84610j622202k703145
$$ y = [5075463, 5073354, 5070003, 5066618, 5063281, 5059163, 5053879, 5047801, 5041159, 5033787, 5025963, 5018834, 5013835, 5012116, 5014359, 5020420, 5029148, 5039246, 5050261, 5062002, 5073146, 5081384, 5085128, 5084292, 5079410, 5070901, 5059325, 5045344, 5029058, 5010265, 4989799, 4969848, 4952568, 4939119, 4930357, 4927529, 4931672, 4943027, 4961662, 4988117, 5023024, 5066816, 5120425, 5185712, 5264732, 5359303, 5472030, 5607281, 5770581, 5967659, 6204986, 6491050, 6836748, 7255444, 7764013, 8384115, 9142065, 10067816, 11194703, 12559736, 14202914, 16165491, 18488304, 21209780, 24362178, 27966110, 32024797, 36518484, 41398947, 46585953, 51968657, 57411881, 62764123, 67865504, 72556775, 76688627, 80126088, 82744852, 84426085, 85062111, 84577501, 82955299, 80252154]
57071H0252154l657366m432354m998304n347671n492036n456447n272758m975175
57063D0620043m598469m176050l736716l302602k890003k510635k171224j873053
57055A5361291j613909j390867j200893j039919r03215p87061o89156o07218n38168
57046F590885m79073m28093l84095l45872l12190k82140k55037k30289k07641
57037C666455j87209j69023j52676j37718j24092j11868j00722r0066p9670o9680
57027B443731n9884m9392l7339k3513p690J1083L3471N8109Q2176J03497J19579
57016B673828J23274J02631N0245k5905j03791j61699j91129j96665j87120j69417
57006A914252j48307j27301j08289r1732p7828o6685n7616m9454m1904l5637l1043
$$ y = [80252154, 76594788, 72162434, 67164130, 61816459, 56324423, 50867976, 45595218, 40620043, 36021574, 31845524, 28108808, 24806206, 21916203, 19405568, 17234344, 15361291, 13747382, 12356515, 11155622, 10115703, 9212488, 8425427, 7736271, 7129053, 6590885, 6111812, 5683719, 5299624, 4953752, 4641562, 4359422, 4104385, 3874096, 3666455, 3479246, 3310223, 3157547, 3019829, 2895737, 2783869, 2683147, 2593081, 2513411, 2443731, 2383847, 2334455, 2297116, 2273603, 2265913, 2276996, 2310467, 2368576, 2450752, 2554249, 2673828, 2797102, 2899733, 2949978, 2924073, 2820282, 2658583, 2467454, 2270789, 2083669, 1914252, 1765945, 1638644, 1530355, 1438623, 1360795, 1294110, 1236494, 1187040, 1145136, 1109499, 1078456]
56995A078456k7684k4951k2513k0141j7782j5756j4240j2657j0180o660k519J934
56983I05307O342R760J0982R359M842k230j0694j8431k3674k6244k6880k5825
56971H12614k3061j9450j6357j4231j2424j0316p780m747j255K189N188Q216J1967
56958G30553J6236K0247K3597K5653K4515J8195P103n844j7676k6896l2735l4553
56946G48395l2662k8606k3958j9381j5088j1343q110m945j599J821N368R340J3789
56933F33021J8644K4125L0165L5377L7454L4734K6764J3867k528j9205l2356m0121
56921G59941m3176m2875l9973l5354l0456k6206k2439j8857j5683j2995j0477
56910D61450q308p259p377p547o966o078n445m677l310j875j164r90m88P41K378
$$ y = [1078456, 1050772, 1025821, 1003308, 983167, 965385, 949629, 935389, 922732, 912552, 905892, 903373, 905307, 911649, 921409, 932391, 941750, 946592, 944362, 933668, 915237, 891563, 865319, 838439, 812614, 789553, 770103, 753746, 739515, 727091, 716775, 708995, 704248, 702993, 705182, 710370, 718586, 730553, 746789, 767036, 790633, 816286, 840801, 858996, 866099, 860255, 842579, 815683, 782948, 748395, 715733, 687127, 663169, 643788, 628700, 617357, 609247, 604302, 602703, 604524, 609892, 619232, 633021, 651665, 675790, 705955, 741332, 778786, 813520, 840284, 854151, 851623, 832418, 800062, 759941, 716765, 673890, 633917, 598563, 568107, 541901, 519462, 500605, 484922, 471927, 461450, 453142, 445883, 438506, 430959, 423993, 417915, 412470, 407793, 404483, 402608, 401444, 400454, 399966, 400707, 403085]
56895D03085L856M674M754M883O235R019J2237J5157J8161K1675K4981K6776K6220
56882E81713K2791J5965O148m480j3101j8353k0695k0992j9439j6001j1286o510
56870D95760k618N18L870Q101J2856J7502K2262K8099L5529M4201N3423O2142
56858G81645O8151O8215N9723M2389J8624p145k9836m5640n3465n4604n1117m4828
56846G52112l7218k9163k0719j1806l048M972J2901K2022L2530M3679N5538O9157
56834H90957Q4476R9070J09118J10611R9760P4382L6410p498m8707q0182r8357
56823A270040j03541r9283r0076p8698o5967n2730m0538l0089k0511j0863j164
56812F76580Q550J8890L0186M2030N4098O5976P5585P9144P3513N7667L2155n18
$$ y = [403085, 406941, 411615, 416369, 421252, 427487, 436506, 448743, 463900, 482061, 503736, 528717, 555493, 581713, 604504, 620469, 626617, 622137, 609036, 590683, 569988, 548996, 529557, 513556, 502270, 495760, 493142, 493660, 497530, 505631, 518487, 535989, 558251, 586350, 621879, 666080, 719503, 781645, 849796, 918011, 977734, 1020123, 1038747, 1031602, 1001766, 956126, 902661, 848057, 796940, 752112, 714894, 685731, 665012, 653206, 650158, 655130, 668031, 690053, 722583, 766262, 821800, 890957, 975433, 1074503, 1183621, 1294232, 1393992, 1468374, 1504784, 1497286, 1448579, 1368397, 1270040, 1166499, 1067216, 977140, 898442, 832475, 779745, 739207, 709118, 688607, 677744, 676580, 685130, 704020, 734206, 776236, 830334, 896310, 971895, 1051039, 1124552, 1182219, 1214374, 1213856]
56800A213856l4333o1319p6855q2333q1581p6497o7652n6853m6434l6973k7918
56789E65108j9653j2999p414j612M579J0711J7282K4884L2365L7633L9779L8496
56777G29159L2217J9272J062j7936l3635m4334m9627m9557m5473l9967l5023l1048
56765D35110k7781k5038k2356j9163j5637j2507j0045q020o555n888n503m659
56753B71958l639l286l460l265k662k485k798k663j737q10n63q62j468k274k715
56738B37271k178j142p31j017j017m45j36m30n50o2L60J96k8K20N85N90M17L53
56720B32256K23m6o0K90M55M9n56q25o70k06M56Q92O27n9l11N6K70j02m47r6O58
56699B32854J094R83M80k94j087j379r61l23r3l00m86l30R9N24P95J025J351J523
$$ y = [1213856, 1179523, 1118204, 1041349, 959016, 877435, 800938, 733286, 676433, 629999, 593026, 565108, 545455, 532456, 525042, 523430, 528009, 538720, 556002, 580886, 613251, 650884, 690663, 729159, 761376, 780648, 781710, 763774, 730139, 685805, 636178, 586621, 541148, 501181, 466158, 435110, 407329, 382291, 359935, 340772, 325135, 312628, 302583, 294563, 288008, 282120, 276617, 271958, 268319, 265033, 261573, 258308, 255646, 253161, 250363, 247700, 245963, 245153, 244590, 243728, 242260, 239986, 237271, 235093, 233951, 233220, 232203, 231186, 230741, 230605, 230175, 229625, 229563, 229923, 230119, 230091, 230311, 230896, 231486, 231903, 232256, 232479, 232433, 232373, 232663, 233118, 233167, 232611, 231786, 231116, 230910, 231366, 232258, 232885, 232826, 232515, 232571, 232841, 232739, 232292, 232196, 232854, 233948, 234931, 235411, 235117, 234030, 232651, 231690, 231367, 231274, 230974, 230488, 230158, 230257, 230781, 231576, 232601, 233952, 235475]
56681B35475J053Pq02q10l74o9J63M81M42k69r49p47n6R0k98k43N29J270J533
56662B36426J637J732J499J017Q72J162J310J085R25J058J196J298J760K589L126
56647B58692K877J940O11p87j688j682j148p68n24J8O56P50L63J41J39j66p59
56630B58665j088j119j287j416r55k50k90j013j265p12l74r42j713j761j075j27
56614B43278O42O48m14j648j618k89Q32Q33M30M62N93J11r64k115k830k585j350
56597B34016k13l30j124r15M44J225N95o4N82J838K398K270K125J907J322Q03
56581B46879P60O92N1o68o80o5O26J239J717J720J254J028J440J955K059K082
56565B62089K465L031L616M564N993P350Q303R211J0229J0896J1007J0769R722
$$ y = [235475, 236528, 236535, 235733, 234923, 234549, 234480, 234643, 235124, 235566, 235297, 234348, 233601, 233545, 233635, 233337, 233094, 233623, 234893, 236426, 238063, 239795, 241294, 242311, 243183, 244345, 245655, 246740, 247665, 248723, 249919, 251217, 252977, 255566, 258692, 261569, 263509, 264120, 263333, 261645, 259963, 258815, 258047, 257523, 257541, 258197, 258947, 259310, 259451, 259590, 259424, 258665, 257577, 256458, 255171, 253755, 252800, 252550, 252260, 251247, 249982, 249270, 248896, 247954, 246241, 244480, 243405, 243278, 243920, 244568, 244154, 242506, 240888, 240599, 241431, 242264, 242694, 243156, 243749, 243860, 242896, 240781, 237951, 235366, 234016, 233803, 233473, 232349, 231434, 231878, 233103, 233698, 233634, 234216, 236054, 238452, 240722, 242847, 244754, 246076, 246879, 247639, 248331, 248382, 247714, 247034, 246969, 247595, 248834, 250551, 252271, 253525, 254553, 255993, 257948, 260007, 262089, 264554, 267585, 271201, 275765, 281758, 289108, 297411, 306622, 316851, 327747, 338754, 349523, 359245]
56552C59245O942L033L41J55J066J192O43M67N57K19k25j12J8q02k195k928k788
56535C64828k653k980l472l953m457m716m569m548n106n717n623n050m664m356
56521C02964l571k469j746j563j567j670j994k374k580k673k564j855p09o9k81
56506B75279l85L28J002N68m73q95o63o36r41j001p91p86r41r31j080j863k745
56489B63046k717j814j008p68o95m69j54L41J091J567J114m2r43j036n69l9J90
56472B57095M2r8K61Q75R85O87J063K304K959K014N76J80N16L34k49j18P28J138
56454B71292P23K43J41O7j60l55o25j145j394p17M90J194J171J013R40O92M68
56437B74038Q02J522J848J476Q00J77k79m26l69o31j347j773j381p53m89o8J059
$$ y = [359245, 366187, 369220, 369561, 369716, 370782, 371974, 372617, 373084, 373641, 373860, 373635, 373523, 373541, 372739, 370544, 367616, 364828, 362175, 359195, 355723, 351770, 347313, 342597, 338028, 333480, 328374, 322657, 317034, 311984, 307320, 302964, 299393, 296924, 295178, 293615, 292048, 290378, 288384, 286010, 283430, 280757, 278193, 276338, 275629, 275560, 275279, 274894, 275222, 276224, 276792, 276319, 275424, 274761, 274125, 273184, 272183, 271392, 270606, 269665, 268734, 267654, 265791, 263046, 260329, 258515, 257507, 256739, 256044, 255575, 255421, 255762, 256853, 258420, 259534, 259492, 258549, 257513, 256944, 256905, 257095, 257137, 257039, 257300, 258175, 259160, 259847, 260910, 263214, 266173, 268187, 268763, 268943, 269459, 269793, 269544, 269426, 270154, 271292, 272015, 272258, 272399, 272466, 272306, 271951, 271326, 270181, 268787, 268070, 268560, 269754, 270925, 271938, 272878, 273570, 274038, 274840, 276362, 278210, 279686, 280486, 280663, 280384, 279958, 279589, 278958, 277611, 275838, 274457, 273704, 273215, 273147, 274206]
56420B74206K081J998J389J400J587O30j058j484L2J809K139J183J44k86j52J16
56404B85734m7p59j220n89Q13J869K117J947J672J301J026R83Q09K95P1O43J280
56387B97945J053M67O74J504J765J293J085J437J495R01M44P58J466J989K235
56372C16511K191J691Q43L3n30p47m32K82P84Q56J066J519J208l20j662j310J23
56355C22106R35Q41P12N74j57r27n88N42J090R54J232J926J830Q50L89R78J451
56338C34738J014M98Q42J774K571K991K979K582K359K852L481L183K100J460J763
56323C67187K364K795L133L140K426J436J006J001P25L71N34O76j70j461j748
56308C83415j118r75j430r52J046L212M264M307L879L350L437M593N753N348L666
$$ y = [274206, 276287, 278285, 279674, 281074, 282661, 283291, 282233, 280749, 280781, 282590, 284729, 285912, 286056, 285770, 285618, 285734, 285687, 284928, 283708, 283119, 283932, 285801, 287918, 289865, 291537, 292838, 293864, 294847, 295656, 295951, 296022, 296665, 297945, 298998, 299465, 300139, 301643, 303408, 304701, 305786, 307223, 308718, 309619, 310063, 310821, 312287, 314276, 316511, 318702, 320393, 321236, 321269, 320739, 319992, 319560, 319842, 320626, 321482, 322548, 324067, 325275, 324955, 323293, 321983, 322106, 323041, 323882, 324594, 325168, 325011, 324084, 323496, 324038, 325128, 326082, 327314, 329240, 331070, 331920, 332309, 333287, 334738, 335752, 336250, 337092, 338866, 341437, 344428, 347407, 349989, 352348, 355200, 358681, 361864, 363964, 365424, 367187, 369551, 372346, 375479, 378619, 381045, 382481, 383487, 384488, 385213, 385584, 386118, 386794, 386624, 385163, 383415, 382297, 381322, 379892, 378940, 379986, 383198, 387462, 391769, 395648, 398998, 402435, 407028, 412781, 418129, 421795]
56293D21795K382J952J483J095J948L649M168K983J973K423L379L809M171M845
56279D62055N111M712M621N159N248M522M360N687P469Q476Q993R671J0254J0493
56265E56831J0946J1866J2528J2588J2772J3631J4878J6495J9014K2194K5000
56254G28743K7467L0936L5842M1011M5694N0569N5991O1155O5767P0822P6777
56243A290774Q2677Q7789R2399R6239R7978R7083R4475R0525Q4155P4714O2935
56232B251743M9404L3885J6969M01j5000k9827m3887n5643o4658p2307p9086q3500
56220A908494q4680q3954q2622q0337p6959p3732p1241o8142o3433n8056n3099
56209A112239m8283m3522l9838l7449l4873l1246k7585k4735k2090j9444j7732
$$ y = [421795, 424177, 426129, 427612, 428707, 430655, 434304, 438472, 441455, 443428, 445851, 449230, 453039, 457210, 462055, 467166, 471878, 476499, 481658, 486906, 491428, 495788, 501475, 508944, 517420, 526413, 536084, 546338, 556831, 567777, 579643, 592171, 604759, 617531, 631162, 646040, 662535, 681549, 703743, 728743, 756210, 787146, 822988, 863999, 909693, 960262, 1016253, 1077408, 1143175, 1213997, 1290774, 1373451, 1461240, 1553639, 1649878, 1747856, 1844939, 1939414, 2029939, 2114094, 2188808, 2251743, 2301147, 2335032, 2352001, 2352402, 2337402, 2307575, 2263688, 2208045, 2143387, 2071080, 1991994, 1908494, 1823814, 1739860, 1657238, 1576901, 1499942, 1426210, 1354969, 1286827, 1223394, 1165338, 1112239, 1063956, 1020434, 980596, 943147, 908274, 877028, 849443, 824708, 802618, 783174, 765442]
56198G65442j6821j4996j1945r688r161q539o597m946m976n279m312l072k855
56185F62255k646j242K18K52l66l30k31r29j411n84N18N61K05M44N37k56p21L42
56167F56616J945K886L924N771O987O259M919M804N445N692O157P580Q772Q745
56153G36502Q893J0451J1854J1434J0794J2454J5788J8405K0052K2092K4599K6957
56141I30275L0195L5666M2451M8768N5050O3113P3308Q4571R6049J06465J13418
56130A679329J15582J13982J09172R9457Q4479O8216N5388M6752M0692L6953L5200
56119B485202L2063K3783J0954k600j4329k3417k8704l0034l0697l5090m4474
56108B342657n7404p2560q8158j00474j06543j07226j04650r8463q7765p4789
$$ y = [765442, 748621, 733625, 721680, 711992, 702831, 694292, 687695, 682749, 677773, 672494, 668182, 665110, 662255, 659609, 658367, 658585, 658837, 658471, 658141, 657910, 656981, 655570, 654986, 655504, 656065, 656270, 656714, 657251, 656995, 656274, 656616, 658561, 661447, 665371, 671142, 678129, 684388, 689307, 694111, 699556, 705248, 711405, 718985, 727757, 736502, 745395, 755846, 767700, 779134, 789928, 802382, 818170, 836575, 856627, 878719, 903318, 930275, 960470, 996136, 1038587, 1087355, 1142405, 1205518, 1278826, 1363397, 1459446, 1565911, 1679329, 1794911, 1908893, 2018065, 2117522, 2202001, 2270217, 2325605, 2372357, 2413049, 2450002, 2485202, 2517265, 2541048, 2552002, 2549402, 2535073, 2511656, 2482952, 2452918, 2422221, 2387131, 2342657, 2285253, 2212693, 2124535, 2024061, 1917518, 1810292, 1705642, 1607179, 1519414, 1444625]
56098A444625o2848n2252m1797l2490k5947k0780j4662q587n118l760k091j55
56086A174138M28M31J921M232N083M768N320O567O907O887Q089R583R466Q719
56072A252539R574J1367J1918J1744J2756J4257J4455J4447J6351J9015J9947
56061A408370J9972K1306K2756K1772J9691J9734K1164K0681J8444J7400J7728
56050A629018J7291J6568J7898K0630K2186K2905K4814K6905K6846K6006K7283
56039A878350K9562K9903K9563L1716L4931L5377L4057L5149L8344L9726L9214
56028B255892M0213M2839M4400M5661M9581N4657N6740N6562N8274O1510O2576
56017B828905O2375O5196P0419P3531P4679P7963Q3045Q5999Q7761R2885J00474
$$ y = [1444625, 1381777, 1329525, 1287728, 1255238, 1229291, 1208511, 1193849, 1185262, 1180144, 1176384, 1174293, 1174138, 1174566, 1174997, 1176918, 1181150, 1186233, 1191001, 1196321, 1202888, 1209795, 1216682, 1224771, 1234354, 1243820, 1252539, 1262113, 1273480, 1285398, 1297142, 1309898, 1324155, 1338610, 1353057, 1369408, 1388423, 1408370, 1428342, 1449648, 1472404, 1494176, 1513867, 1533601, 1554765, 1575446, 1593890, 1611290, 1629018, 1646309, 1662877, 1680775, 1701405, 1723591, 1746496, 1771310, 1798215, 1825061, 1851067, 1878350, 1907912, 1937815, 1967378, 1999094, 2034025, 2069402, 2103459, 2138608, 2176952, 2216678, 2255892, 2296105, 2338944, 2383344, 2429005, 2478586, 2533243, 2589983, 2646545, 2704819, 2766329, 2828905, 2891280, 2956476, 3026895, 3100426, 3175105, 3253068, 3336113, 3422112, 3509873, 3602758, 3703232]
56006C703232J05411J07950J12862J19790J24181J27118J33968J43741J50440
55997D828693J54689J62981J75442J85852J93944K05780K21535K35012K46016
55988F609944K60747K79292K95595L10562L31716L58894L84283M07798M37802
55979I676633M75379N13192N51343N98348O54878P13426P75767Q52901R45854
55970A5757721J045725J154918J288089J449821J633603J845856K107270K427248
55962B8710251K803025L247870L790877M443189N196411O063561P092102Q334341
55954F9681627R847160J1730491J4120962J7135501K0865074K5403110L0732715
55947A99516640L6438018M1490455M4334180M3221802L6711167K4371614P510352
$$ y = [3703232, 3808643, 3916593, 4029455, 4149245, 4273426, 4400544, 4534512, 4678253, 4828693, 4983382, 5146363, 5321805, 5507657, 5701601, 5907381, 6128916, 6363928, 6609944, 6870691, 7149983, 7445578, 7756140, 8087856, 8446750, 8831033, 9238831, 9676633, 10152012, 10665204, 11216547, 11814895, 12469773, 13183199, 13958966, 14811867, 15757721, 16803446, 17958364, 19246453, 20696274, 22329877, 24175733, 26283003, 28710251, 31513276, 34761146, 38552023, 42995212, 48191623, 54255184, 61347286, 69681627, 79528787, 91259278, 105380240, 122515741, 143380815, 168783925, 199516640, 235954658, 277445113, 321779293, 365001095, 401712262, 426083876, 433594228]
55940D33594228j0767539k6674373l7465912m2467317m2726581l9916019l5510940
55933A98065547l0571118k5783783k1500918j7817605j4717605j2163528j0089271
55926F5421719q398497p012377n888783m986182m247490l631158l124013k711537
55918B5421682k364222k062470j807356j596627j413786j249178j109213r96089
55910A2822741q98305q08597p32262o70585o13856n57484n08486m69760m33533
55901G129873l96168l64159l39837l15655k88399k65006k48616k32187k11835
55892D468011j93715j81923j71346j58326j47005j39564j30911j18611j07894
55883C118716j01451r4031q2247p0411o1527n1735l8726k7027j9912j4510r851
$$ y = [433594228, 422826689, 396152316, 358686404, 316219087, 273492506, 233576487, 198065547, 167494429, 141710646, 120209728, 102392123, 87674518, 75510990, 65421719, 57023222, 50010845, 44122062, 39135880, 34888390, 31257232, 28133219, 25421682, 23057460, 20994990, 19187634, 17591007, 16177221, 14928043, 13818830, 12822741, 11924436, 11115839, 10383577, 9712992, 9099136, 8541652, 8033166, 7563406, 7129873, 6733705, 6369546, 6029709, 5714054, 5425655, 5160649, 4912033, 4679846, 4468011, 4274296, 4092373, 3921027, 3762701, 3615696, 3476132, 3345221, 3226610, 3118716, 3017265, 2923234, 2840987, 2770576, 2709049, 2657314, 2618588, 2591561, 2571649, 2557139, 2547288]
55872B547288j1533k3087l9898n6359p1900q5751r3351r3079q9955q7945q4668
55861A809762p7763p0225o5032o0425n4707n0122m8060m5723m1294l7176l4924
55850A224311l2278k8401k6437k7660k8565k6979k5568k6090k5760k2783j9993
55839I33797j9486j8904j6620j5307j6665j7748j6278j4653j4961j4874j2444
55828G55857j0251j0624j1240r598p706q201r617r628r396j0680j1995j1483j0499
55815F24939j0776j1022r773q492q586q362o270m084l661l496j687N57J610K724
55801E53621N433Q340R637J0246J1476J2089J0584P959N473K217k437o621q870
55788F19147j0624j3186j4903j4117j2231j1057r828p627o134o979q817r904j1051
$$ y = [2547288, 2535755, 2512668, 2472770, 2416411, 2344511, 2258760, 2165409, 2072330, 1982375, 1894430, 1809762, 1731999, 1661774, 1596742, 1536317, 1481610, 1431488, 1383428, 1337705, 1296411, 1259235, 1224311, 1192033, 1163632, 1137195, 1109535, 1080970, 1053991, 1028423, 1002333, 976573, 953790, 933797, 914311, 895407, 878787, 863480, 846815, 829067, 812789, 798136, 783175, 768301, 755857, 745606, 734982, 723742, 714144, 706438, 698237, 688620, 678992, 669596, 658916, 646921, 635438, 624939, 614163, 603141, 593368, 584876, 576290, 567928, 561658, 557574, 553913, 550417, 548730, 549287, 550897, 553621, 559054, 567394, 577031, 587277, 598753, 610842, 621426, 629385, 634858, 637075, 634638, 628017, 619147, 608523, 595337, 580434, 566317, 554086, 543029, 533201, 525574, 519440, 512461, 503644, 493740, 482689]
55775D82689j3152j4366j2871j0035p826n422j535K264L895M316N289N563K779
55762D41588k219o349q417r367r580q828p946p903q091p648p318p963q669q379
55748C32911p923q272q377p028n262m630m557l784k875k974l373k718j410o15
55734B69113j61N80R83M08k67k22l97j671k918k935k695l553m773m936m366l985
55718B38205l331j846o35o97q99J35J565J928J708K111K855L323M287O105O863
55703B61677M851J464r23k412m349o150o368n675n889o790o768n753m888m021
55689B08006k232k89Q8r04j422p77J73R93J927K657K784L024M070M936M333K899
55673B30266K119J786O32j257k690l339l539k916j227K51J57q21j134p86o11k12
$$ y = [482689, 469537, 455171, 442300, 432265, 424439, 419017, 417482, 419746, 423641, 427957, 433246, 438809, 441588, 439369, 433020, 424603, 415236, 405656, 396828, 388882, 380979, 372888, 365240, 357922, 349959, 341290, 332911, 324988, 316716, 308339, 301311, 296049, 291419, 286862, 283078, 280203, 277229, 273856, 271138, 269728, 269113, 268952, 269532, 270515, 270923, 270656, 270434, 270037, 268366, 265448, 262513, 259818, 256265, 251492, 246556, 242190, 238205, 234874, 233028, 232393, 231696, 230797, 230932, 232497, 234425, 236133, 238244, 241099, 244422, 248709, 254814, 261677, 266528, 267992, 267069, 264657, 260308, 254158, 247790, 242115, 236226, 229436, 222668, 216915, 212027, 208006, 205774, 205485, 205573, 204669, 203247, 202470, 202643, 203636, 205563, 208220, 211004, 214028, 218098, 223034, 227367, 230266, 232385, 234171, 234803, 233546, 230856, 227517, 223978, 221062, 219835, 220086, 220243, 219422, 218288, 217502, 216891, 216679]
55657B16679J113K373K185J308J580L023M272N083O053O584N561L584K131J054
55643B62583p47k799l758m131n610p933q998q191p099o815o737o307n831n363
55629A82264m554l737l496l366k538j499j234j352r56o56j530k651k151l92L87
55614A52539n01j543j769j741j736j264o57q42j420j060J6J81q07j415j008o46
55598A36327q46p52n7K96n7l27l33r13k017k332j434n58n59q31p64o54n20K97
55580A23966J676K400J916J082O32L18LJ60P79J122R84R56J188J227J223J808
55564A41440K558K179O01p04q38m71l42l28m38j156k257k644j966j141q81q85
55548A32727p87o49k81N97J333R33j40l26O49J329Q56Q3j52j86l36l3J031K068
$$ y = [216679, 217792, 220165, 222350, 223658, 225238, 228261, 232533, 237616, 243669, 250253, 255814, 259398, 261529, 262583, 261836, 259037, 255279, 251148, 245538, 237605, 228607, 220416, 213317, 206502, 199765, 193458, 187627, 182264, 177710, 173973, 170477, 167111, 164573, 163074, 161840, 160488, 159532, 158876, 157346, 154695, 152544, 152152, 152539, 152038, 150495, 148726, 146985, 145249, 143985, 143328, 142486, 141066, 140006, 140022, 140203, 139396, 137981, 136973, 136327, 135481, 134729, 134672, 134968, 134911, 134584, 134251, 133338, 131321, 128989, 127555, 126997, 126438, 125607, 124843, 124189, 123669, 123966, 125642, 128042, 129958, 131040, 131672, 131990, 131993, 132153, 132932, 134054, 135038, 135994, 137182, 138409, 139632, 141440, 143998, 146177, 146778, 146074, 145236, 144765, 144423, 144095, 143657, 142501, 140244, 137600, 135634, 134493, 133612, 132727, 131940, 131291, 131010, 131607, 132940, 133873, 133733, 133407, 134056, 135385, 136241, 136324, 136172, 135986, 135650, 135617, 136648, 138716]
55530A38716K324J964J400O98M7k32m01r87j675j679j261j482k386k873k583k292
55514A27298k288j910j024m23l38j75L4m13j164q51O05J518R42l2k83k40o51j253
55496A19352j587j770j780j338j012j904l540l833k020J24R20R17J247J583J205
55481A06564O52O98Q31K87l89k71K82K75k41m63k62j76l20l64k86l61n63o24l63
55462A04906K87J170J683J345P21Q04J417J348L25m90l98j95o24j176j206j076
55446A08841j246j349r96n84m49k22K85N32L08K98Q62J302J135R86J346J564R46
55429A13559j11r02j357j425o63O92J379Q58K78O74J318J049J83j42K27O09P57
55412A16983Q55Q49P42Q80J113N01j168k525k321j191n45n77o07n59p78r25m43
$$ y = [138716, 141040, 143004, 144404, 145102, 145149, 144917, 144516, 143529, 141854, 140175, 138914, 137432, 135046, 132173, 129590, 127298, 125010, 123100, 122076, 121653, 121315, 121140, 121174, 120761, 119597, 118746, 119351, 120869, 121811, 121779, 121496, 121256, 120605, 119352, 117765, 115995, 114215, 112877, 111865, 109961, 106421, 102588, 100568, 100692, 101612, 102529, 103776, 105359, 106564, 107216, 107914, 108745, 109032, 108643, 108372, 108654, 108929, 108688, 108225, 107963, 107787, 107467, 107103, 106817, 106456, 105893, 105269, 104906, 105193, 106363, 108046, 109391, 110112, 110916, 112333, 113681, 114006, 113516, 113118, 112923, 112299, 111123, 109917, 108841, 107595, 106246, 105250, 104666, 104217, 103995, 104280, 104812, 105120, 105418, 106280, 107582, 108717, 109703, 111049, 112613, 113559, 113448, 112546, 111189, 109764, 109101, 109793, 111172, 112030, 112308, 112982, 114300, 115349, 115532, 115390, 115617, 116226, 116983, 117838, 118687, 119429, 120309, 121422, 121923, 120755, 118230, 115909, 114718, 114173, 113596, 112989, 112430, 111652, 110727, 110284]
55395A10284L30O36N35N39M87o2p20o61P0O85Q10O70L94J7j64k6n4o01j079p25
55375A11365K71J111J477J534J345R45O66O66O29L91K45J02p06k150k956k281
55359A12654j065p31j327j926k075j790r92j5J77n96r66L4J218J014K7OR05J031
55341A05583m0p76j13J160J933K109J968J422N08l48r15j262j182m58K64mj025
55324A08824j412n81M81Q24P80J020J301J007L24k1Q9l0q61j948k411j986j389
55307A04011j390j736j449k62Q77J097P32O54R71J138R83Q70R64J082J154J265
55291A10961J303J047N70J69J6J35M53O47L74j11j43K15L8r23j461n23J152K013
55273A15932J734J137O02j93j142j556j239p43m48j93K05P26J455K285K516J526
$$ y = [110284, 110614, 111250, 111785, 112324, 112811, 112749, 112029, 111368, 111438, 112123, 112933, 113603, 113997, 114014, 113850, 113824, 113770, 113169, 112090, 111365, 111636, 112747, 114224, 115758, 117103, 118048, 118714, 119380, 120009, 120400, 120645, 120747, 120041, 117891, 114935, 112654, 111589, 110858, 109531, 107605, 105530, 103740, 102748, 102733, 102910, 102314, 101348, 101382, 102600, 103614, 103641, 103647, 104552, 105583, 105543, 104767, 104654, 105814, 107747, 109856, 111824, 113246, 113754, 113406, 112491, 111229, 110047, 109589, 109853, 109849, 108824, 107412, 106831, 107312, 108136, 108916, 109936, 111237, 112244, 112568, 112547, 112636, 112606, 111745, 109797, 107386, 105400, 104011, 102621, 100885, 99436, 99174, 100051, 101148, 101880, 102534, 103505, 104643, 105626, 106496, 107460, 108542, 109696, 110961, 112264, 113311, 113881, 114050, 114066, 114201, 114654, 115301, 115675, 115564, 115421, 115636, 115674, 114751, 113290, 112767, 113919, 115932, 117666, 118803, 119405, 119212, 118070, 116514, 115275, 114532, 114084, 113891, 114096, 114822, 116277, 118562, 121078, 122604]
55257A22604j39j171j021k87L85R41J332J161L01o61j001o57k40l15p83r66n29
55240A18954j31o08j569j651m87N81L97l77m40J64L59j53o25n26l3N66J090J193
55222A16704P54L12L48M18j58j077j440j105o81m43j55J18P8o5J52N44N10J13
55204A14927oL21O31O69N59K68k80o96n94l25l88l74L64J245R62m87j550j209
55186A14037j86L24J83L4K85Q30J343J507J249Q27M19j31p92j010n06J23L54P14
55168A19604J729K544J941M13l19J86O10P1p03p83l12J81O35J004R59O01O19J220
55150A30200J664J276K39q80j641j637p67J83J83n94r61n35j89m08m20L50J174
55133A27237J174O70M11K85k51j017j306r38m06j93m56j094j702j786j322p53
$$ y = [122604, 122465, 121294, 120273, 119986, 120371, 121312, 122644, 123805, 124106, 123445, 122444, 121787, 121547, 121232, 120449, 119483, 118954, 118823, 118215, 116646, 114995, 114508, 115089, 115486, 115109, 114669, 114833, 115192, 115039, 114414, 113888, 113855, 114421, 115511, 116704, 117458, 117770, 118118, 118536, 118378, 117301, 115861, 114756, 114075, 113632, 113477, 113595, 113673, 113608, 113760, 114304, 114814, 114927, 114921, 115242, 115873, 116542, 117101, 117369, 117089, 116393, 115799, 115474, 115086, 114712, 115076, 116321, 117283, 116796, 115246, 114037, 113851, 114175, 114358, 114392, 114677, 115507, 116850, 118357, 119606, 120433, 120852, 120721, 119929, 118919, 118413, 118536, 118890, 119604, 121333, 123877, 125818, 126231, 125912, 126098, 126708, 126779, 126076, 125293, 124981, 125162, 125797, 126801, 127760, 128361, 128980, 130200, 131864, 133140, 133379, 132499, 130858, 129221, 128454, 128637, 128820, 128226, 127265, 126730, 126541, 126133, 125713, 126063, 127237, 128411, 129081, 129492, 129777, 129526, 128509, 127203, 126265, 125859, 125666, 125210, 124116, 122414, 120628, 119306, 118553]
55117A18553k81L47J065J262P37K10L38P58P13K41P4O21J495J971J638P55J04
55100A30601K24P54Q33J84o23r76p56p5Q71J498J141p0j152j343p57J44J045J597
55082A33140J394N40k69n33l42R7P08J120P25m44j479j620j075n06j88K3K85O36
55064A32212R22P47r1j085j432j011m02K3L36L68k95j371j789r72L80J183J142
55047A28865P01L97N14R04R88L20p28j349j288q67j94P82J506J255L91J26P25
55030A33048J118O27n0j80j76o29j082o79M74J461J641J100L69M1K82N33J80m78
55012A37600o57m15n00q78n86N88J549J528J012N14l04j501k178j793j056o19
54996A32304o4Q49J242O42K17J011J965J402k38r52q1J041J233O88k9p86j390
$$ y = [118553, 118272, 118619, 119684, 120946, 121683, 121893, 122231, 122989, 123702, 123943, 124017, 124638, 126133, 128104, 129742, 130497, 130601, 130825, 131579, 132412, 132596, 131973, 130997, 130241, 130166, 131037, 132535, 133676, 133606, 132454, 131111, 130354, 130498, 131543, 133140, 134534, 135074, 134805, 134272, 133930, 134027, 134735, 135855, 136580, 136136, 134657, 133037, 131962, 131456, 131268, 131291, 131576, 132212, 133134, 133881, 133790, 132705, 131273, 130262, 129860, 129883, 130219, 130587, 130292, 128921, 127132, 126160, 126540, 127723, 128865, 129566, 129963, 130477, 131381, 132369, 132689, 131961, 130612, 129324, 128457, 128263, 129045, 130551, 131806, 132197, 132323, 133048, 134166, 134793, 134743, 134563, 134387, 133758, 132676, 131997, 132471, 133932, 135573, 136673, 137042, 137083, 137365, 137898, 138078, 137600, 136943, 136528, 136028, 135150, 134564, 135152, 136701, 138229, 139241, 139755, 139451, 137950, 135772, 133979, 132923, 132304, 132240, 133089, 134331, 134973, 135190, 136201, 138166, 139568, 139330, 138378, 138297, 139338, 140571, 141259, 141230, 140444, 139054]
54979A39054j464j156j076j318j269n49N01J380J844J800J301P15M10M15O56J223
54963A42467J942K068J127k95j174j173o17J23O13L06o60j114k48J063J338N27
54947A46293j71j62L3M9J47L08L7o43r51n31k5l3j90K28J223K049K058J352P00
54928A51771Q32J639K253K138J789K003K761L415L675L840M255N062O300P667
54914A99400Q356P725N984L811J514r31l288n227o788q038q513p739o208n042
54900A75016m688m583m104l222k213j276n31L0N33R31R65O60M54M83L10j17J4
54883A58662J158K398K662K340K598L520M268M754N714P082P700O975N632M490
54869B19953L487K224O39j297l623n897p288p510o998o136n050m226m289m957
$$ y = [139054, 137590, 136434, 135358, 134040, 132771, 132222, 132723, 134103, 135947, 137747, 139048, 139763, 140173, 140588, 141244, 142467, 144409, 146477, 147604, 147309, 146135, 144962, 144345, 144468, 145081, 145387, 144727, 143613, 143365, 144428, 145766, 146293, 146122, 145960, 145993, 146042, 146189, 146497, 146534, 145891, 144940, 144409, 144384, 144351, 144161, 144389, 145612, 147661, 149719, 151071, 151771, 152603, 154242, 156495, 158633, 160422, 162425, 165186, 168601, 172276, 176116, 180371, 185433, 191733, 199400, 207756, 215481, 221465, 225276, 226790, 225859, 222571, 217344, 210556, 202518, 194005, 186266, 180058, 175016, 170328, 165745, 161641, 158419, 156206, 154930, 154399, 154429, 154962, 155893, 156858, 157518, 157972, 158455, 158765, 158648, 158662, 159820, 162218, 164880, 167220, 169818, 173338, 177606, 182360, 188074, 195156, 202856, 209831, 215463, 219953, 223440, 225664, 226303, 225006, 221383, 215486, 208198, 200688, 193690, 187554, 182504, 178278, 173989, 169032]
54855A69032n143m381l346k648k080j425j093j381j843j923j647j260q20m85n46
54840A39011p78m92L22O58j35j355j926j757j461j192o02M05J446K097K087J357
54824A37685L27k19K6M49L88O4J47N92O69O5n70m43M00J099R07mp22n23L94J190
54804A41921J260P04N0k37m9L25M86L73L20N23O98N71L80M82P75R23Q55O11M3
54785A51014o35n93N58J752J639N09n9N58J400J634J606J784J888J653J455J544
54769A67707J596J650K453M130N529N832N907O894Q255Q501P406O047M890L198
54755B39995N42k320m475n885o904p472p322o558n624m869m433m256m033l364
54741A73022k201r59j18J93J53L7J03M74R72J236J137R36R02R01O74M53Q98K191
$$ y = [169032, 163889, 159508, 156162, 153514, 151434, 150009, 148916, 147535, 145692, 143769, 142122, 140862, 140042, 139557, 139011, 138233, 137741, 138063, 138721, 138586, 137231, 135305, 133548, 132087, 130895, 130293, 130698, 132144, 134241, 136328, 137685, 138012, 137793, 137819, 138268, 138656, 138720, 138867, 139459, 140128, 140193, 139623, 139180, 139580, 140679, 141586, 141582, 140860, 140337, 140731, 141921, 143181, 143885, 143935, 143698, 143649, 143974, 144460, 144833, 145153, 145676, 146374, 146945, 147325, 147807, 148582, 149505, 150360, 150971, 151014, 150379, 149786, 150344, 152096, 153735, 154244, 154185, 154743, 156143, 157777, 159383, 161167, 163055, 164708, 166163, 167707, 169303, 170953, 173406, 177536, 183065, 188897, 194804, 201698, 209953, 218454, 225860, 231907, 236797, 239995, 240537, 238217, 233742, 227857, 220953, 213481, 206159, 199601, 193977, 189108, 184675, 180419, 176386, 173022, 170821, 169862, 169744, 169937, 170090, 170127, 170230, 170704, 171676, 172912, 174049, 174985, 175887, 176788, 177462, 177915, 178813, 181004]
54723A81004L535M035L887M127N161O206O427N968N354M463K851O62j537l587
54709B28556n588p119p538p031o513o330n960n067l989k898j465J79J055N41n95
54694A70238j132q45m51n14r92j538j728j277n18l04r96j889k101j692j315j100
54678A51846o28J54O92N85O6m16p00q61r21q10n21j95o2j89l86m43l94k97P4Q98
54658A47492J729J818J111L60M8j76p24j335j540j370j021l53P60J843K209J777
54642A52628J075N55L64N37R28J103P23j1n75p35n90k97K0J91J94K27K70q3r96
54623A55528j847j890j280r19j183j399p33O99J900K032J208K85o7L9J21M8R2
54606A52634L46O20Q86J285J567J152N4q45q61l09J31L83O90Q59N59Q2N8M71O58
$$ y = [181004, 184539, 188574, 192461, 196588, 201749, 207955, 214382, 220350, 225704, 230167, 233018, 233680, 232143, 228556, 222968, 215849, 208311, 201280, 194767, 188437, 182477, 177410, 173421, 170523, 169058, 169237, 170292, 170833, 170238, 169106, 168261, 167810, 167296, 166304, 164766, 163038, 161761, 161243, 160939, 159943, 158054, 155953, 154261, 152946, 151846, 151218, 151372, 152064, 152649, 152715, 152299, 151599, 150738, 149817, 149007, 148486, 148291, 148229, 148040, 147654, 147211, 146817, 146520, 146594, 147492, 149221, 151039, 152150, 152510, 152558, 152382, 151658, 150323, 148783, 147413, 146392, 146039, 146799, 148642, 150851, 152628, 153703, 154258, 154622, 155159, 156087, 157190, 157913, 157902, 157327, 156592, 156002, 155705, 155725, 155916, 156110, 156337, 156607, 156524, 155528, 153681, 151791, 150511, 149592, 148409, 147010, 146277, 146976, 148876, 150908, 152116, 152401, 152334, 152373, 152494, 152542, 152634, 152980, 153600, 154486, 155771, 157338, 158490, 158544, 157699, 156838, 156529, 156660, 157043, 157733, 158592, 159151, 159233, 159291, 159762, 160420]
54587A60420L14n6J36Q66J601J827J369N01k36n15m86m64m75l53j22O8K01L45
54569A64941M40L75J75j03m21n70k41M24P57L77k61n85p00r01p97J65J498J936
54551A66509J070k4j57N92J207J044L79j14q9K94P29J146J616J892J459K84p97
54534A77040r23k09N38Q84R75Q17J13j019j808j678q97j06M10O44M55k60j105
54517A73871j414j002l59k4J9J15L11K70j75o41o20r4N30R56J144R77K86o79j241
54498A72230j023l68J64L85M00K88K00L71O99P07K87R0O48J406J327L12o44p67
54480A76712l25M1K70P95J764K727L047K536J586P75M12N24J029J572J394O1j558
54463A93362j791j33J887K396J317P0m43n93q97j133q96l29J40L84N71P42P06
$$ y = [160420, 160734, 160678, 160814, 161680, 163281, 165108, 166477, 166978, 166742, 166227, 165741, 165277, 164802, 164449, 164327, 164395, 164596, 164941, 165381, 165756, 165931, 165828, 165407, 164837, 164596, 165020, 165777, 166154, 165893, 165308, 164608, 163707, 162910, 163075, 164573, 166509, 167579, 167555, 167398, 167990, 169197, 170241, 170620, 170506, 170417, 170711, 171440, 172586, 174202, 176094, 177553, 177837, 177040, 176117, 175908, 176446, 177330, 178305, 179122, 179235, 178216, 176408, 174730, 173833, 173727, 174137, 174781, 175236, 174976, 173871, 172457, 171455, 171096, 171072, 171091, 171206, 171517, 171787, 171612, 170971, 170351, 170257, 170787, 171743, 172887, 173864, 174150, 173471, 172230, 171207, 170839, 171003, 171388, 171788, 172076, 172276, 172647, 173346, 174053, 174340, 174430, 175078, 176484, 177811, 178123, 177479, 176712, 176387, 176428, 176698, 177493, 179257, 181984, 185031, 187567, 189153, 189928, 190340, 190864, 191893, 193465, 194859, 194920, 193362, 191571, 191438, 193325, 195721, 197038, 197108, 196665, 196072, 195175, 194042, 193146, 192817, 192957, 193341, 193912, 194654, 195360]
54446A95360K13p61j820k328j981j237q86j237j891k204j822q82M2L77J29j24
54430A78948KK75L81M48O94R17Q76P58Q12P60K62l58n01j77J26L04N56P21L75
54411A86179l98j041j315j344j047l18L60L70K3K06R62J398J162R43J205J509
54395A88854J515J605J903J711O83l03l77J1r8o54r44r14j058j265r32j70K18
54378A89785O8J52Q76J532J301M04k99l83q0K61M68L90r5q28j363j296o02L99
54360A90690J298J879K108J988J551J012P69J020J480J674J478J227J197J178
54346B10549P72L9l56J35J215J899J520L69p70j432j668j637j438j290j499k105
54330B04303k741k949k572j870j339j325j634j655j063k99k9k85n17l92j34J3
$$ y = [195360, 195573, 194812, 192992, 190664, 188683, 187446, 186560, 185323, 183432, 181228, 179406, 178524, 178566, 178943, 179072, 178948, 178950, 179225, 179606, 180054, 180748, 181665, 182541, 183299, 184111, 184871, 185133, 184775, 184274, 184097, 184223, 184527, 185083, 185804, 186179, 185781, 184740, 183425, 182081, 181034, 180716, 181076, 181446, 181469, 181675, 182637, 184035, 185197, 186140, 187345, 188854, 190369, 191974, 193877, 195588, 196271, 195968, 195591, 195602, 195504, 194850, 193906, 192992, 191934, 190669, 189737, 189567, 189785, 189853, 190005, 190881, 192413, 193714, 194118, 193819, 193436, 193356, 193617, 194085, 194475, 194380, 193552, 192189, 190893, 190291, 190690, 191988, 193867, 195975, 197963, 199514, 200526, 201295, 202315, 203795, 205469, 206947, 208174, 209371, 210549, 211321, 211360, 211004, 211139, 212354, 214253, 215773, 216142, 215372, 213940, 212272, 210635, 209197, 207907, 206408, 204303, 201562, 198613, 196041, 194171, 192832, 191507, 189873, 188218, 187155, 186856, 186827, 186542, 186025, 185633, 185499, 185512]
54314A85512J87O05J206J721J862J391K55j182k289k653k293j403k40P43J038
54299A84460N56k46p98q39m19J85N63N03K80K85L54l3q53j313p14O80J918K182
54281A86751J315j42j278j522j144p90n53l1Q44J586J923K051J930J132k59j317
54265A90496j389r36o43l70K55P94N79n4j15M95Q81O19L45N62P99M93k9j51m3
54246A92588l54j082j462j061l70j04l53o54o83m97k62k2J83K19o7o52j301j681
54228A82385j581j178r20j022j136q40l28j72l72k09O49J465J378O13Q6P1L1l10
54210A78610n76n11m19n15m98j43J71J9m38p57q35p72m38L75J430K119K058J430
54192A80310Q02O40Q93R77L46p68j452j125k20M00M31K88L76N99O18L49M1r5j64
$$ y = [185512, 185699, 186304, 187510, 189231, 191093, 192484, 192739, 191557, 189268, 186615, 184322, 182919, 182679, 183422, 184460, 185016, 184770, 183972, 183133, 182714, 182899, 183462, 183965, 184245, 184530, 184884, 184851, 183998, 182685, 181971, 182651, 184569, 186751, 188066, 187924, 186646, 185124, 183980, 183190, 182637, 182606, 183450, 185036, 186959, 189010, 190940, 192072, 191813, 190496, 189107, 188171, 187528, 187158, 187413, 188207, 188786, 188732, 188617, 189112, 189993, 190612, 190957, 191519, 192318, 192811, 192782, 192631, 192588, 192234, 191152, 189690, 188629, 188259, 188155, 187802, 187148, 186465, 185968, 185706, 185684, 185867, 186086, 186019, 185367, 184066, 182385, 180804, 179626, 178706, 177684, 176548, 175708, 175380, 175208, 174836, 174627, 175276, 176741, 178119, 178732, 178818, 178889, 178920, 178610, 178034, 177523, 177104, 176589, 176091, 175948, 176119, 176138, 175700, 174943, 174108, 173336, 172898, 173273, 174703, 176822, 178880, 180310, 181112, 181752, 182645, 183622, 183968, 183200, 181748, 180623, 180403, 180803, 181234, 181522, 181898, 182497, 183115, 183464, 183505, 183410, 183246]
54173A83246l39m77l03n1l72j360k066j561j52J023J316R04R1q03j081k40J052
54156A78827J495Q37O5k38n39j075j164m76J57J04N5P71J554J238P2o62n29k36
54138A80256k29j60K13O10Q12Q16M52l97j185j104k27N93R09J013J085Q79M29
54121A84765J87K16L8m18m81J89R13R72O75Q40J488J741J016j34n76J68J362J827
54103A94788J247M28J75K97J19l98o50m07r5m7l5K03N48P47P41N76L10J32K16
54084A98895M00L47L8k43l85m96m33R4Q68J159O86P4Q3P03J301J423J192J096
54066B06802J480K136K419J991J347J184J409J351R74J079K125L544M653N648
54052B38142P069Q703R699R609Q821P854O660M717J667k089n420p231p321o350
$$ y = [183246, 182907, 182430, 182127, 182076, 181704, 180344, 178278, 176717, 176565, 177588, 178904, 179808, 179899, 179096, 178015, 177775, 178827, 180322, 181159, 181224, 180986, 180447, 179372, 178208, 177732, 177889, 177993, 178048, 178819, 180373, 181611, 181683, 181021, 180492, 180256, 180027, 179867, 180080, 180690, 181502, 182318, 182770, 182373, 181188, 180084, 179857, 180450, 181359, 182372, 183457, 184336, 184765, 184952, 185168, 185206, 184788, 184307, 184496, 185409, 186381, 187056, 187896, 189384, 191125, 192141, 192007, 191431, 191599, 192961, 194788, 196035, 196463, 196638, 196935, 197054, 196656, 196006, 195599, 195504, 195457, 195422, 195625, 196173, 196920, 197661, 198237, 198547, 198679, 198895, 199295, 199642, 199680, 199437, 199052, 198556, 198123, 198217, 199085, 200244, 200930, 201004, 201087, 201790, 203091, 204514, 205706, 206802, 208282, 210418, 212837, 214828, 216175, 217359, 218768, 220119, 221093, 222172, 224297, 227841, 232494, 238142, 245211, 253914, 263613, 273222, 282043, 289897, 296557, 301274, 302941, 300852, 295432, 288201, 280880, 274530]
54038B74530m991l405j585J59J400K037K312K538K977L755M653N143M835L819
54024B98177K556J527J072J193J459J340Q01L88N61J134J491J204K60j027k178
54009C09958k829l012l056l167l314l499l803m103m028l470k841k671l049l574
53995B63542l663k913j478k69l08j680l301l950l365k190j251r99j374j815j686
53980B33300r35j63R7o8l32o70j183j602j489p88M0M88L78l8k62L9N95P57L55
53961B28519K7M08J322K130K624L078L571L903M135M677N634O481O640O081N163
53946B84393M143L028J827O93j39m66k46L43J031J698K362K982L351L327L094
53931C11421L005L222L517L448K712J374j08j073j074k38P96J447J701J953K454
$$ y = [274530, 269539, 266134, 264549, 264708, 266108, 268145, 270457, 272995, 275972, 279727, 284380, 289523, 294358, 298177, 300733, 302260, 303332, 304525, 305984, 307324, 308125, 308513, 309074, 310208, 311699, 312903, 313163, 312136, 309958, 307129, 304117, 301061, 297894, 294580, 291081, 287278, 283175, 279147, 275677, 272836, 270165, 267116, 263542, 259879, 256966, 255488, 255219, 254911, 253231, 249930, 245980, 242615, 240425, 239174, 238175, 236801, 234986, 233300, 232365, 232202, 232299, 232231, 231899, 231229, 230046, 228444, 226955, 226167, 226207, 226695, 227073, 227035, 226773, 226812, 227407, 228164, 228519, 228546, 228954, 230276, 232406, 235030, 238108, 241679, 245582, 249717, 254394, 260028, 266509, 273149, 279230, 284393, 288536, 291564, 293391, 294084, 293945, 293479, 293233, 293576, 294607, 296305, 298667, 301649, 305000, 308327, 311421, 314426, 317648, 321165, 324613, 327325, 328699, 328591, 327518, 326444, 326206, 327002, 328449, 330150, 332103, 334557]
53916C34557L113L824M602N329N733N879O350P516Q828R303Q687P740P371P707
53902D26539Q165Q153P719P611Q612J0591J2386J2897J2106J0574Q230M267j633
53889E36217q510j4712j8960k0854k0840j9831j8495j6811j4607j2334j0796j0049
53877C49418r258p813o001m434l390k970l257l875m053l531k940k852k975k762
53863B89307k343k239k501k768k913l065l148k962k588k319k286k474k891l363
53849B51447l460k994k348j951j669j115l12M22R66J358J497J298R16M09m10j393
53833B42661j799j281o33p45j211r37R1P61N56J91L24O38O69O32Q42R63N47j12
53815B42157k70L43J346K221K616K339J476M83o2J45R73J940K476K408K218K519
$$ y = [334557, 337670, 341494, 346096, 351425, 357158, 363037, 369387, 376903, 385731, 395034, 403721, 411461, 418832, 426539, 434704, 442857, 450576, 458187, 466799, 477390, 489776, 502673, 514779, 525353, 533583, 537850, 536217, 527707, 512995, 494035, 473181, 452341, 432510, 414015, 397204, 382597, 370263, 359467, 349418, 340160, 332347, 326346, 321912, 318522, 315552, 312295, 308420, 304367, 300836, 297896, 295044, 292069, 289307, 286964, 284725, 282224, 279456, 276543, 273478, 270330, 267368, 264780, 262461, 260175, 257701, 254810, 251447, 247987, 244993, 242645, 240694, 239025, 237910, 237598, 238020, 238986, 240344, 241841, 243139, 244055, 244464, 244054, 242661, 240862, 239581, 238948, 238203, 236992, 236055, 236146, 236907, 237463, 237654, 237978, 238616, 239285, 239917, 240759, 241722, 242269, 242157, 241887, 242230, 243576, 245797, 248413, 250752, 252228, 252711, 252649, 252794, 253767, 255707, 258183, 260591, 262809, 265328]
53799B65328L286L893M025M063M451N059N517N727N751N418M450K960J555R22
53785C22405J275K144K716K552J935J338P05l42j806l220m295n107n624n663n455
53770C03558n573o027o035n087l785l064l004k930k372j535r12q76j409j931j709
53755B57309p95k20p45j753k019j326n97n29q68j139j371j774k164k118j484n34
53739B37873K34L99j0m56m60j59L9K50R34J890K155J307K04o6M87J071J351J616
53721B48659J886J709R69K59O7J76J90K51P70J647K273K304K108K310K988L495
53705B72061L097J879Q11P70J537K089J892J495J670K434L253L814M103M070L731
53690C08706L421L372L190K353J169N07N69O76M25K32L40J86o15j365j247o39
$$ y = [265328, 268614, 272507, 276532, 280595, 285046, 290105, 295622, 301349, 307100, 312518, 316968, 319928, 321483, 322405, 323680, 325824, 328540, 331092, 333027, 334365, 335070, 334728, 332922, 329702, 325407, 320300, 314676, 309013, 303558, 297985, 291958, 285923, 280836, 277051, 273987, 270983, 268053, 265681, 264146, 263234, 262358, 260949, 259018, 257309, 256514, 256294, 255549, 253796, 251777, 250451, 249854, 249325, 248457, 247318, 245947, 244173, 242009, 239891, 238407, 237873, 238107, 238506, 238496, 238040, 237580, 237421, 237460, 237710, 238644, 240534, 242689, 243996, 244200, 244134, 244621, 245692, 247043, 248659, 250545, 252254, 253223, 253482, 253549, 253725, 253915, 254166, 254936, 256583, 258856, 261160, 263268, 265578, 268566, 272061, 275158, 277037, 277848, 278618, 280155, 282244, 284136, 285631, 287301, 289735, 292988, 296802, 300905, 304975, 308706, 312127, 315499, 318689, 321042, 322211, 322718, 323287, 323963, 324388, 324620, 324960, 325146, 324531, 323166, 321919, 321280]
53674C21280n76j149j421r06k44j88o64j106j223j122j108j433k000k190j530
53659C04420m78J9j99l67q2R7k87o97n10j62m68j183j216k72O53O55L6l14j20
53640B99525J99L26L87N51P44Q19Q54J103J722K547L190L382L199K915K607K079
53624C26149J200K64j45L07J375K453L077L211L060K820K698K961L759M830N582
53609C63601N598M978M159L529L285L447L863M186M095L540K754K009J494J327
53595D11865J541J940K112J736R82M31M70Q19Q62M00q1k5N87J337J872K063J874
53578D30785J361P41O1r88k644m441n478n391m684m010l575l346l346l415l119
53563C88511k319j557j362j437r97J49J331J828J535Q39K98L51R81J542J435J001
$$ y = [321280, 320704, 319555, 318134, 317228, 316984, 316796, 316132, 315026, 313803, 312681, 311573, 310140, 308140, 305950, 304420, 303942, 303961, 303762, 303395, 303313, 303410, 303123, 302426, 301916, 301754, 301286, 300103, 298887, 298615, 299268, 299923, 299959, 299645, 299525, 299724, 300050, 300437, 300988, 301732, 302551, 303405, 304508, 306230, 308777, 311967, 315349, 318548, 321463, 324070, 326149, 327349, 327613, 327468, 327775, 329150, 331603, 334680, 337891, 340951, 343771, 346469, 349430, 353189, 358019, 363601, 369199, 374177, 378336, 381865, 385150, 388597, 392460, 396646, 400741, 404281, 407035, 409044, 410538, 411865, 413406, 415346, 417458, 419194, 420176, 420607, 421077, 421896, 422758, 423158, 423077, 423052, 423639, 424976, 426848, 428911, 430785, 432146, 432887, 432948, 431960, 429316, 424875, 419397, 414006, 409322, 405312, 401737, 398391, 395045, 391630, 388511, 386192, 384635, 383273, 381836, 380839, 380988, 382319, 384147, 385682, 386521, 386819, 387170, 388151, 389693, 391128, 392129]
53547C92129J250K425L483L402K612K427L309M420M877M813M889N333N870O254
53533D47493O426O356O173O358P376Q997J0361J0834J0629J0547J1275J2899J4770
53520E70494J5833J5501J4338J3648J4178J5499J6769J7726J8664J9892K1534
53509G54076K3607K5798K7410K7989K7935K7985K8216K8043K7158K5955K4936
53498A049108K4196K3594K2999K2263K1354K0598K0378K0497K0337J9751J9346
53487A284421J9582K0150K0492K0500K0309J9816J8914J7927J7329J7167J7084
53476A493691J6744J5916J4409J2314J0113Q132O075L516O38k014m367o848r630
53463A558689j2351j4696j6711j8410j9439j9490j8812j8131j8121j9031k0708
$$ y = [392129, 393379, 395804, 399287, 402689, 405301, 407728, 411037, 415457, 420334, 425147, 430036, 435369, 441239, 447493, 453919, 460275, 466448, 472806, 480182, 489179, 499540, 510374, 521003, 531550, 542825, 555724, 570494, 586327, 601828, 616166, 629814, 643992, 659491, 676260, 693986, 712650, 732542, 754076, 777683, 803481, 830891, 858880, 886815, 914800, 943016, 971059, 998217, 1024172, 1049108, 1073304, 1096898, 1119897, 1142160, 1163514, 1184112, 1204490, 1224987, 1245324, 1265075, 1284421, 1304003, 1324153, 1344645, 1365145, 1385454, 1405270, 1424184, 1442111, 1459440, 1476607, 1493691, 1510435, 1526351, 1540760, 1553074, 1563187, 1571319, 1577394, 1580910, 1581548, 1579534, 1575167, 1568319, 1558689, 1546338, 1531642, 1514931, 1496521, 1477082, 1457592, 1438780, 1420649, 1402528, 1383497, 1362789]
53452A362789k2756k4670k5867k5865k4688k3128k2161k1923k1639k0786j9843
53441A109463j9398j9013j7690j5303j2783j0756q837o457l849j825q64o79m49
53428I91560O42K713M948O415P155Q092R749J1694J3379J4944J6730J8560K0090
53415A126671K1457K2998K4578K5802K6785K8078K9842L1621L3072L4420L6011
53404A441335L7769L9372M0798M2435M4660M7340M9860N1727N3159N4848N7006
53393A960309N8949N9901O0073O0457O1594O2907O3411O2712O1178N9267N7047
53382B627805N4334N1169M7909M4839M1748L8135L3842K9233K4745K0452J6267
53371C030478J2188Q065L451j931p779j3696j9960k7198l5365m3549n0895n7172
$$ y = [1362789, 1340033, 1315363, 1289496, 1263631, 1238943, 1215815, 1193654, 1171731, 1150092, 1129306, 1109463, 1090065, 1071052, 1053362, 1038059, 1025276, 1014520, 1005683, 999226, 995377, 993552, 992688, 992009, 991560, 992202, 994915, 999863, 1006278, 1013433, 1021525, 1031274, 1042968, 1056347, 1071291, 1088021, 1106581, 1126671, 1148128, 1171126, 1195704, 1221506, 1248291, 1276369, 1306211, 1337832, 1370904, 1405324, 1441335, 1479104, 1518476, 1559274, 1601709, 1646369, 1693709, 1743569, 1795296, 1848455, 1903303, 1960309, 2019258, 2079159, 2139232, 2199689, 2261283, 2324190, 2387601, 2450313, 2511491, 2570758, 2627805, 2682139, 2733308, 2781217, 2826056, 2867804, 2905939, 2939781, 2969014, 2993759, 3014211, 3030478, 3042666, 3050731, 3054182, 3052251, 3044472, 3030776, 3010816, 2983618, 2948253, 2904704, 2853809, 2796637]
53359B796637o2271o5723o7164o6942o5872o4558o3252o2097o1114n9944n7993
53348B099707n5035n1672m9077m8100m8385m8558m7600m5913m4673m4215m3666
53337A572813m2235m0053l7566l4835l1930k9343k7263k5036k2045j8706j5852
53326A247949j3532j1409r846r532j0160j0690j0894j1374j1901j1173q798o189
53314A122451m667l742k306n16P43J640L165N436P442Q523R032R471R999J0863
53300A177534J2413J4455J6350J7954J9717K1709K3360K4508K5784K7629K9568
53289A410981L0994L1959L2705L2910L2095L0383K8356K6324K4175K1721J8874
53278A721477J5746J2745J0271Q002M999Q73l567p266j0071j2491j4738j6649
$$ y = [2796637, 2734366, 2668643, 2601479, 2534537, 2468665, 2404107, 2340855, 2278758, 2217644, 2157700, 2099707, 2044672, 1993000, 1943923, 1895823, 1847438, 1798880, 1751280, 1705367, 1660694, 1616479, 1572813, 1530578, 1490525, 1452959, 1418124, 1386194, 1356851, 1329588, 1304552, 1282507, 1263801, 1247949, 1234417, 1223008, 1213162, 1203630, 1193470, 1182780, 1171886, 1160512, 1148611, 1137438, 1128640, 1122451, 1117784, 1114042, 1111736, 1111220, 1111963, 1113603, 1116768, 1122204, 1129646, 1138169, 1147201, 1156672, 1166671, 1177534, 1189947, 1204402, 1220752, 1238706, 1258423, 1280132, 1303492, 1328000, 1353784, 1381413, 1410981, 1441975, 1473934, 1506639, 1539549, 1571644, 1602027, 1630383, 1656707, 1680882, 1702603, 1721477, 1737223, 1749968, 1760239, 1768241, 1773240, 1774113, 1770546, 1763280, 1753209, 1740718, 1725980, 1709331]
53266A709331j8275j9921k1726k3716k6049k8667l0931l2196l2656l3100l3866
53255A408228l4611l5011l5094l4914l4440l3839l3287l2544l1242k9671k8600
53244A044975k8255k8097k7780k7630k7788k7603k6427k4589k3016k2178k1848
53233G59764k1629k1129j9734j6950j3147r663p790p742q593r218r251r230r777
53220E95911j0753j1345j0985j0049r502r973j1186j2233j2401j1821j1244j1030
53208D63389j0637r407p654o357n851n497m853m408m724n423n703n515n542o144
53194C75674o859p013o342n141m094l836m301m604m073l152k755k886k717j978
53180C15923j390j476j766j661j325j169j083q84r14j365j500o23M86L43j047
$$ y = [1709331, 1691056, 1671135, 1649409, 1625693, 1599644, 1570977, 1540046, 1507850, 1475194, 1442094, 1408228, 1373617, 1338606, 1303512, 1268598, 1234158, 1200319, 1167032, 1134488, 1103246, 1073575, 1044975, 1016720, 988623, 960843, 933213, 905425, 877822, 851395, 826806, 803790, 781612, 759764, 738135, 717006, 697272, 680322, 667175, 657512, 649722, 641980, 633387, 624169, 614918, 605688, 595911, 585158, 573813, 562828, 552779, 543277, 533304, 522118, 509885, 497484, 485663, 474419, 463389, 452752, 443345, 435691, 429334, 423483, 417986, 413133, 408725, 404001, 398578, 392875, 387360, 381818, 375674, 368815, 361802, 355460, 350319, 346225, 342389, 338088, 333484, 329411, 326259, 323504, 320618, 317901, 315923, 314533, 313057, 311291, 309630, 308305, 307136, 306053, 305169, 304255, 302890, 301390, 300767, 301253, 301596, 300549]
53165C00549j983j486o05o59j261j226o35o01j265j450n65L87K10q55j628j545
53149B85382j035o95o75q02q67p70o00n17m75k81L1J79J01R4K51K05k82q62j068
53130B77314r35p36m66k9L27K72o1k26M8P90J876K818K862J903R69J065J880K335
53112B92006K065J469O35o34j814j974j314j178k101l038l013k478k231k085j566
53097B72749j071j200j489j008J15Q47Q19O78Q82J049P08Ln55n95j28L14Lj125
53079B70996k027j623p8J517K430K633K124R47k16m62J51O11L26k63o40r09j214
53062B74303j250q03k50p6l37q25j233j089j73P46L91j346l006l286k457j536
53046B57773q39j18N05P50Q85J342J780J401J30j190j774j551r25m49n02q91r10
$$ y = [300549, 298566, 297080, 296475, 295816, 294555, 293329, 292694, 292093, 290828, 289378, 288813, 289200, 289410, 288555, 286927, 285382, 284347, 283652, 282977, 282175, 281308, 280538, 279938, 279421, 278946, 278665, 278696, 278875, 278976, 279070, 279321, 279526, 279244, 278382, 277314, 276379, 275643, 275177, 275148, 275475, 275747, 275686, 275460, 275508, 276298, 278174, 280992, 283854, 285757, 286726, 287791, 289671, 292006, 294071, 295540, 296175, 295541, 293727, 291753, 290439, 289261, 287160, 284122, 281109, 278631, 276400, 274315, 272749, 271678, 270478, 268989, 267981, 268096, 268943, 269762, 270440, 271322, 272371, 273079, 273082, 272527, 271932, 271804, 272118, 272121, 270996, 268969, 267346, 267268, 268785, 271215, 273848, 275972, 276919, 276703, 276241, 276392, 277003, 277329, 277066, 276426, 275517, 274303, 273053, 272250, 272000, 271924, 271587, 270762, 269529, 268440, 268267, 269013, 269404, 268058, 265052, 261766, 259309, 257773, 256934, 256816, 257321, 258071, 258956, 260298, 262078, 263479, 263609, 262419, 260645, 259094, 258169, 257720, 257218, 256327, 255417]
53029B55417k83K89R0n26p16m56l02k31K23P74N38m20r35m65J25R2MO33J522J717
53009B57090J314J217J649J875J422P14L78M83O72N81J00n58r76r50p58p29p60
52992B62764n27k8M38P11Q59R18Q59P15M93J50r9J92R60J277M68o84o42R21K586
52973B72331K904J957Q91N19P89J205J277P69o1o27o71n52o49p54l44O70J742
52956B81396K134J446r0j641k353k063j326o69j84L5l43j322k181k229j672j211
52940B67727j064j014j137j656k132j670k02J162J507J164R25P64O7j155k041
52925B61245j944j187n36l20k99j47J40K77j0o76j287j304n35O42J524J622J009
52908B58214J65n16r26j074q85m36j65m24r42j056n39J59O08Q77J136J195Q21
$$ y = [255417, 255134, 255423, 255513, 254987, 254271, 253815, 253513, 253282, 253505, 254279, 254817, 254397, 253462, 252997, 253122, 253214, 253218, 253851, 255373, 257090, 258404, 259621, 261270, 263145, 264567, 265281, 265659, 266142, 266814, 267395, 267495, 266937, 265961, 265011, 264253, 263524, 262764, 262237, 262209, 262647, 263358, 264217, 265135, 265994, 266709, 267202, 267352, 267253, 267445, 268405, 269682, 270150, 269466, 268824, 269745, 272331, 275235, 277192, 278083, 278602, 279391, 280596, 281873, 282642, 282581, 281954, 281283, 280731, 280082, 279328, 278984, 279654, 281396, 283530, 284976, 284886, 283245, 280892, 278829, 277503, 276834, 276650, 276685, 276342, 275020, 272839, 270610, 268938, 267727, 266663, 265649, 264512, 262856, 260724, 259054, 258852, 260014, 261521, 262685, 263610, 264374, 264441, 263286, 261245, 259301, 258114, 257578, 257258, 256959, 256812, 256952, 257229, 257219, 256543, 255256, 253952, 253417, 254059, 255583, 257205, 258214, 258379, 257863, 256937, 255863, 254978, 254542, 254377, 253953, 253011, 251955, 251416, 251575, 252183, 253060, 254196, 255391, 256212]
52891B56212K06k76n74q56j053r57o08j50M84J295J773J371M47K1L90O49rj086
52873B57279j420o79M32J195J512J563J473J416J606K028K481K970L685M480M731
52858B84752M009K613J212J44o99j443k020k360k557k750k933k990k921k956l306
52843B65795l769l757k937j715q44o36q63j271j723j846j154J31R94Q11J86P8
52827B47480M05L00m62j063q05JN80N90J89l21n57k04N41R86P60L21K78N00M50
52808B49969K11N75J968L758M791M375K652L07j855l244l727l605l296k986k538
52793B47355j749p24Q8L24J50L0L0k88j087j791j762j160o35l17K64J176J722
52776B41626J342M31j27m9J90J13j97l49j33K99N84M51j0l35q2O44J179R61J68
$$ y = [256212, 256418, 256142, 255568, 254712, 253659, 252702, 252094, 251944, 252428, 253723, 255496, 256867, 257314, 257335, 257725, 258374, 258365, 257279, 255859, 255180, 255612, 256807, 258319, 259882, 261355, 262771, 264377, 266405, 268886, 271856, 275541, 280021, 284752, 288761, 291374, 292586, 292730, 292031, 290588, 288568, 286208, 283651, 280901, 277968, 274978, 272057, 269101, 265795, 262026, 258269, 255332, 253617, 252773, 252137, 251274, 250003, 248280, 246434, 245280, 245411, 246405, 247216, 247402, 247480, 247885, 248185, 247723, 246660, 245855, 245856, 246436, 247026, 247215, 246894, 246337, 246133, 246674, 247660, 248420, 248741, 249019, 249519, 249969, 250180, 250755, 252723, 256481, 261272, 265647, 268299, 268606, 266751, 263507, 259780, 256175, 252879, 249893, 247355, 245606, 244882, 244970, 245294, 245444, 245474, 245504, 245216, 244129, 242338, 240576, 239416, 238781, 238464, 238728, 239904, 241626, 242968, 243399, 243272, 243223, 243413, 243526, 243329, 242980, 242847, 243146, 243730, 244181, 244171, 243836, 243754, 244398, 245577, 246538, 246706]
52757B46706n07p16q00j079j128k81J212K132J689M93l43n80p85j111r41J34J612
52740B45707K621K860K666K423K161J619P04j49k53N05J303J346R17R13J440J685
52724B68468J306R89J206J262L55r71j409p01l0n02j916l235l734l451k787k037
52708B52813j227l63K55K00m71j020p42K93J418K077K069J394L18n65q02o07n16
52691B54524o82q97j041j013m18R35K284K543J771J235J626K089J575L95l44l51
52675B64231k65m28n01k98j77l34m07j27J72J20j4K34P09Q12M51K39O23J229J396
52656B67665J031N80L70L75O30J404K722L940M076K641J83j994k765k126j190
52641B77542j045j609j932j517q26l65j5L85M03k92j046q95R5R52J214J380J828
$$ y = [246706, 246199, 245483, 244683, 243604, 242476, 242195, 243407, 245539, 247228, 247721, 247378, 246798, 246013, 244902, 243961, 244095, 245707, 248328, 251188, 253854, 256277, 258438, 260057, 260761, 260612, 260359, 260864, 262167, 263513, 264430, 265343, 266783, 268468, 269774, 270763, 271969, 273231, 273586, 272615, 271206, 270505, 270475, 269973, 268057, 264822, 261088, 257637, 254850, 252813, 251586, 251223, 251478, 251678, 251207, 250187, 249445, 249738, 251156, 253233, 255302, 256696, 257014, 256449, 255647, 255040, 254524, 253842, 252945, 251904, 250891, 250473, 251408, 253692, 256235, 258006, 259241, 260867, 262956, 264531, 264926, 264582, 264231, 263966, 263538, 263037, 262739, 262562, 262228, 261821, 261694, 261866, 261986, 261972, 262206, 262915, 263727, 264178, 264417, 265040, 266269, 267665, 268696, 269276, 269646, 270021, 270651, 272055, 274777, 278717, 282793, 285434, 285617, 283623, 280858, 278732, 277542, 276497, 274888, 272956, 271439, 270613, 270248, 270233, 270618, 271021, 270729, 269683, 268788, 268883, 269835, 271049, 272429, 274257]
52624B74257K206K232K220K335J931M09j690l118l344k890k392j860r96J21R38
52609B70359R08Q8p96j070q44p94j127j243o32L57R72R52N83K12J33O05J443J860
52591B71966J290J67o25q84j005j006m59N85J444J778J947K109J758O02o23q65
52575B78179M4J350K206K178J292J06n03j85M22M36k11q61j089j032q89o27k84
52558B80532o4n4j20j85k96m03l80l26m72p46q03n37k30q1K7J92K85K73L54O21
52538B77587Q58Q80P36M27j80q72j063o11j60k43m26n6N72O21R9p0N49J295J453
52519B81396J137P41K22n18j064r13j47Q27J863K920L615L561L031K694K707K584
52503C04656K005J221N88Qq78k165l408l834l013j495n48q51j642j657p52O7J64
$$ y = [274257, 276463, 278695, 280915, 283250, 285181, 285590, 283900, 280782, 277438, 274548, 272156, 270296, 269300, 269421, 270359, 271267, 271355, 270559, 269489, 268645, 267851, 266724, 265481, 264849, 265206, 266178, 267130, 267713, 267925, 268058, 268663, 270106, 271966, 273256, 273423, 272798, 271914, 270909, 269903, 269444, 270029, 271473, 273251, 275198, 277307, 279065, 279667, 279044, 278179, 278223, 279573, 281779, 283957, 285249, 285355, 284852, 284667, 285089, 285525, 285314, 284453, 283364, 282332, 281443, 280816, 280532, 280468, 280414, 280294, 280109, 279813, 279410, 279030, 278704, 278232, 277486, 276683, 276146, 275916, 275835, 275862, 276054, 276339, 276612, 276966, 277587, 278445, 279325, 280061, 280488, 280308, 279436, 278373, 277762, 277602, 277359, 276933, 276877, 277449, 278070, 278169, 278099, 278648, 279943, 281396, 282533, 283274, 283496, 282978, 281914, 281001, 280854, 281681, 283544, 286464, 290079, 293640, 296671, 299365, 302072, 304656, 306661, 307882, 308470, 308478, 307600, 305435, 302027, 298193, 295180, 293685, 293137, 292286, 290644, 288987, 288235, 288302, 288466]
52486B88466O3M22R39R23M85M20R62J325Q06j18k48P81J839J537L4r65k34J460
52468B98897K404K122J688J973K588K893L062L443L534K666J354Q79J427J591
52454C30521K11k071l691m076l968m056m123l768l290l282l653l646k849j725
52440B86534r72o92n01j68J87L91L80J79l3oJ72n5r49j789j580l68P52J083J028
52421B83593J110J117P80N90J172K137K400J619O21L93J126K330L396L982M111
52406C10477M117M287M707N606P445J0195J2688J3441J2105R565O558K897j632
52393D02456o260r702j1327j1408j0481q863o780m553k530j009j77Nj12q2K21
52378C29398M99L95k2k16K68J207J938K209K553L460M513M810M207L523L375L302
$$ y = [288466, 288529, 288951, 289890, 290813, 291298, 291718, 292680, 294005, 294811, 294693, 294445, 295226, 297065, 298602, 298636, 297671, 297437, 298897, 301301, 303423, 305111, 307084, 309672, 312565, 315627, 319070, 322604, 325270, 326624, 327503, 328930, 330521, 330732, 328661, 324970, 320894, 316926, 312870, 308747, 304979, 301689, 298407, 294754, 291108, 288259, 286534, 285562, 284870, 284369, 284201, 284388, 284779, 285159, 285338, 285305, 285299, 285471, 285416, 284467, 282678, 281098, 280730, 281482, 282565, 283593, 284703, 285820, 286600, 287190, 288362, 290499, 292899, 294518, 295139, 295532, 296658, 298988, 302384, 306366, 310477, 314594, 318881, 323588, 329194, 336639, 346834, 359522, 372963, 385068, 394633, 401191, 404088, 402456, 396196, 386494, 375167, 363759, 353278, 344415, 337635, 333082, 330552, 329543, 329366, 329371, 329259, 329177, 329398, 329897, 330292, 330270, 330054, 330322, 331529, 333467, 335676, 338229, 341689, 346202, 351012, 355219, 358742, 362117, 365419]
52362C65419K410N71j424k729l081k648j774r03m31l62k48K53Q84J094Q23O60
52346C58514J002J425J298Q34R08J756K488K292J630J587K363L143L394L582M356
52331C90572N538O390O595O657P304Q647J0046J0809J1014J1369J2180J2850J2705
52318E12676J1993J1495J1390J1188J0763J0633J1078J1627J1884J2239J3224
52307F40190J4533J5276J5119J4663J4665J5171J5592J5533J5339J5599J6154
52296H07834J6103J5037J3698J2796J1647R110N630L011J920R83r42k910l433
52283H90484k887k915m012n113n443n351n219m784l974l301k890k030k99J605
52269H43871K753L220L729M491N097N336N535O004O636P123P363P602Q259R517
$$ y = [365419, 367829, 368400, 366976, 364247, 361166, 358518, 356744, 355841, 355410, 355048, 354800, 355053, 355937, 357031, 357854, 358514, 359516, 360941, 362239, 363073, 363981, 365737, 368225, 370517, 372147, 373734, 376097, 379240, 382634, 386216, 390572, 396110, 402500, 409095, 415752, 423056, 431703, 441749, 452558, 463572, 474941, 487121, 499971, 512676, 524669, 536164, 547554, 558742, 569505, 580138, 591216, 602843, 614727, 626966, 640190, 654723, 669999, 685118, 699781, 714446, 729617, 745209, 760742, 776081, 791680, 807834, 823937, 838974, 852672, 865468, 877115, 886225, 891855, 894866, 896786, 897769, 896827, 893917, 890484, 887597, 884682, 880670, 875557, 870114, 864763, 859544, 854760, 850786, 847485, 844595, 842565, 842266, 843871, 846624, 849844, 853573, 858064, 863161, 868497, 874032, 880036, 886672, 893795, 901158, 908760, 917019, 926536]
52255I26536J1074J2370J3226J3953J4771J5337J5132J4101J2638J1035R255P255
52243A076683N251L544K131P24q71k398l366l604l501l551l799l893l676l522
52229A056152l967n112o410p082o805o053n614n813o287o522o241n278l600j710
52215I79658n09l25m68k45J17K49O80K073L734M258L628L396M359N397N307M597
52199A015906M424M756M738M312M204M581M939N174N697O389O542N999N465N361
52185A088487N139M137K493Q12n47j556k342l335n074p461r516j0261r670q487
52171A042819p392o638o153n710n096m372l756l159k141n13J338K929M198N209
52157A011563N729N416M279K597O70j087k167k456k448k506k182q51J147K639
$$ y = [926536, 937610, 949980, 963206, 977159, 991930, 1007267, 1022399, 1036500, 1049138, 1060173, 1069428, 1076683, 1081934, 1085478, 1087609, 1088333, 1087462, 1085064, 1081698, 1078094, 1074593, 1071042, 1067243, 1063350, 1059674, 1056152, 1052185, 1047073, 1040663, 1033581, 1026776, 1020723, 1015109, 1009296, 1003009, 996487, 990246, 984968, 981368, 979658, 979149, 978824, 978356, 978111, 978228, 978477, 979157, 981230, 984964, 989222, 992850, 996246, 1000605, 1006002, 1011309, 1015906, 1020330, 1025086, 1029824, 1034136, 1038340, 1042921, 1047860, 1053034, 1058731, 1065120, 1071662, 1077661, 1083126, 1088487, 1093626, 1097763, 1100256, 1101068, 1100521, 1098965, 1096623, 1093288, 1088214, 1080753, 1071237, 1060976, 1051306, 1042819, 1035427, 1028789, 1022636, 1016926, 1011830, 1007458, 1003702, 1000543, 998402, 997889, 999227, 1002156, 1006354, 1011563, 1017292, 1022708, 1026987, 1029584, 1030254, 1029167, 1027000, 1024544, 1022096, 1019590, 1017408, 1016557, 1017704, 1020343]
52143A020343K970K599K254K019J552P54j11p56j075j162j253j446j377m82J265
52128A026094L162M594N767P327R425J1519J3150J4520J6188J8308K0360K1623
52116A172037K1851K1403K0708J9818J8570J7077J5677J4476J3279J2084J1237
52105A358217J0911J0736J0303R809R824J0567J1656J2518J2800J2468J1808J1192
52093A492809J0559R253O680L012j076n215r357j3065j5510j6433j6525j6465
52081A428667j6021j4587j2296r990q200o773n495m593m309m358m134l318k097
52068A332496q10M19J717L180M586N528N863N953O279O905P574Q274R303J0625
52054A407892J1536J1371J0376R479R189R034Q178O302L739J015j477l522n109
$$ y = [1020343, 1023313, 1025912, 1028166, 1030185, 1031737, 1032491, 1032380, 1031624, 1030549, 1029387, 1028134, 1026688, 1025311, 1024829, 1026094, 1029256, 1033850, 1039617, 1046944, 1056369, 1067888, 1081038, 1095558, 1111746, 1130054, 1150414, 1172037, 1193888, 1215291, 1235999, 1255817, 1274387, 1291464, 1307141, 1321617, 1334896, 1346980, 1358217, 1369128, 1379864, 1390167, 1399976, 1409800, 1420367, 1432023, 1444541, 1457341, 1469809, 1481617, 1492809, 1503368, 1512621, 1519301, 1522313, 1521237, 1516022, 1506665, 1493600, 1478090, 1461657, 1445132, 1428667, 1412646, 1398059, 1385763, 1375773, 1367573, 1360800, 1355305, 1350712, 1346403, 1342045, 1337911, 1334593, 1332496, 1331686, 1332105, 1333822, 1337002, 1341588, 1347116, 1352979, 1358932, 1365211, 1372116, 1379690, 1387964, 1397267, 1407892, 1419428, 1430799, 1441175, 1450654, 1459843, 1468877, 1477055, 1483357, 1487096, 1488111, 1486634, 1483112, 1478003]
52041A478003o433p699q917j0031j1087j2046j2487j1918j0508r152q574q601
52029A360550q652q637q996r928j1088j2043j2680j2985j2879j2485j2235j2371
52017A225571j2550j2280j1669j1323j1452j1422j0429q527o698n849n954o295
52005A111123o465o835p953r769j1785j3767j5906j8293k0487k1779k1626j9865
51993I36593j6932j3914j1951j1201j0759r957r303r702j1029j2167j2420j2250
51981G95008j2417j2940j3293j3286j3343j3931j4955j5723j5548j4345j2631
51970F42596j0857q964o757m493k608r75J027L577O049P815Q945R761J0128R679
51956F64923Q464O857M903K262j160m851q013r952j0256r025p004n124l654k025
$$ y = [1478003, 1471570, 1463871, 1454954, 1444923, 1433836, 1421790, 1409303, 1397385, 1386877, 1377725, 1369151, 1360550, 1351898, 1343261, 1334265, 1324337, 1313249, 1301206, 1288526, 1275541, 1262662, 1250177, 1237942, 1225571, 1213021, 1200741, 1189072, 1177749, 1166297, 1154875, 1144446, 1135919, 1129221, 1123372, 1117418, 1111123, 1104658, 1097823, 1089870, 1080101, 1068316, 1054549, 1038643, 1020350, 999863, 978084, 956458, 936593, 919661, 905747, 893796, 882595, 871836, 861879, 852576, 842874, 831845, 819678, 807258, 795008, 782591, 769651, 756358, 743072, 729729, 715798, 700843, 685120, 669572, 655227, 642596, 631739, 622775, 616018, 611525, 608917, 607942, 608969, 612546, 618595, 626410, 635355, 645116, 655244, 664923, 673387, 680244, 685147, 687409, 686249, 681398, 673385, 663433, 653177, 644152, 637148, 632024, 628370, 626345]
51942F26345L50L293O055Q121R600J0929J2396J3842J4743J4588J3298J1264Q877
51929G53701O168L007m88l987p273j0330j3076j5292j6849j7871j8562j8966j8910
51916F21272j8092j6265j3598j0833q742p287n599l093k38K124L943N902Q328
51903E57822J0879J3371J6194J9530K2775K5244K6953K8067K7859K4976J8691
51892G92361R398j898j3837k4508l1953l5390l5541l3521k9892k5027j9676j4549
51880E35967r816n543k232j94J286L364O243R097J1295J2925J3950J3676J1643
51867F01661Q422M964J502k285o243r499j1323j1721j1145r977q468o872n340
51854E33676l783k018n4J821L140L489K777J366j59j460k629l904n253o324o819
$$ y = [626345, 626695, 629988, 636043, 644164, 653764, 664693, 677089, 690931, 705674, 720262, 733560, 744824, 753701, 759869, 762876, 762388, 758401, 751128, 740798, 727722, 712430, 695581, 677710, 659148, 640182, 621272, 603180, 586915, 573317, 562484, 553742, 546455, 540856, 537763, 537525, 539649, 543592, 549494, 557822, 568701, 582072, 598266, 617796, 640571, 665815, 692768, 720835, 748694, 773670, 792361, 801759, 799861, 786024, 761516, 729563, 694173, 658632, 625111, 595219, 570192, 550516, 535967, 526151, 520608, 518376, 518182, 519468, 522832, 529075, 538172, 549467, 562392, 576342, 590018, 601661, 610083, 615047, 616549, 614264, 608021, 598522, 587199, 575478, 564333, 554356, 545888, 539016, 533676, 529893, 527875, 527821, 529642, 532782, 536271, 539048, 540414, 540255, 538795, 536166, 532262, 527009, 520685, 513866]
51839E13866o871o996p515p977p379n256k467n09M6J28R42K459L559L504K750
51824D82284K129J673P25r30k581l443l648l953m516m506l164r09J125K501L720
51809D66507M974N407M245K133N40k8m30j451k789l809m495n037n038l996k361
51794D54372j226r37p05J36J090J115m4j595k605k749k194j175O9J071J252M56
51778D46331p19j460j597j678k038k215j567k03J270K678M421O596Q555R637R914
51763D77925R992J0229J0416J0005Q470N691K137j452m641p341r286j0009r521
51750D92615q586p881p268o323n203m411l867k892j209O65K067K889L453M133
51736D58182N215O745Q254Q995Q689P809O834N624L822J669p2r82j377j751k119
$$ y = [513866, 506995, 499999, 492484, 484507, 477128, 471872, 469405, 468896, 468942, 469070, 470012, 472471, 476030, 479534, 482284, 484413, 486086, 486811, 485881, 483300, 479857, 476209, 472256, 467740, 463234, 460070, 459161, 460286, 462787, 466507, 471481, 476888, 481133, 483266, 483806, 483778, 483348, 481897, 479108, 475299, 470804, 465767, 460729, 456733, 454372, 453146, 452209, 451504, 451640, 452730, 453845, 453801, 452206, 449601, 446852, 444658, 443483, 443552, 444623, 445875, 446331, 445612, 444152, 442555, 440877, 438839, 436624, 435057, 434854, 436124, 438802, 443223, 449819, 458374, 468011, 477925, 487917, 498146, 508562, 518567, 527037, 532728, 534865, 533413, 528772, 521431, 512145, 502136, 492615, 484029, 476148, 468880, 462557, 457354, 452943, 449076, 446184, 444975, 445640, 447707, 450596, 454049, 458182, 463397, 470142, 478396, 487391, 496080, 503889, 510723, 516347, 520169, 521838, 521766, 520784, 519407, 517656, 515537]
51721E15537k060j330l34Nr95l035m947n713n341m541l764k909j916j100o95m89
51705D76373k29k8j0K56J402L361N262O235N914M209J262k034m039l618j317J141
51689D94140K494K824K862K886K426P93k136n575q208r137q513p099n385l338
51675D59034r31J441L198M011L906L120J875L01j440k812k974j520R81L506N533
51660D77229P044P707O814M303J272j005k263l088l780l835k538K28L791P182
51646D99061R705J1130J1306R844O469J596l745q596j2340j4430j4513j3038j1149
51633D71300r564p978n909l709k226j758j790j621r23J23R58J063N59P0j49n77
51617D37869j497k308k312j801j640k026k453k669k881k980k455j237QP17R80
$$ y = [515537, 513477, 512147, 511813, 511818, 510823, 507788, 502841, 497128, 491787, 487246, 483482, 480573, 478657, 477557, 476862, 476373, 476144, 476116, 476106, 476362, 477764, 481125, 486387, 492622, 498536, 502745, 504007, 501973, 497934, 494316, 492999, 494140, 496634, 499458, 502320, 505206, 507632, 508425, 506289, 500714, 492506, 483369, 474856, 467757, 462372, 459034, 458103, 459544, 462742, 466753, 470659, 473779, 475654, 475955, 474515, 471703, 468729, 467209, 468190, 471696, 477229, 484273, 491980, 498794, 503097, 504369, 503364, 501101, 498013, 494233, 490398, 487860, 488088, 491879, 499061, 508766, 519896, 531202, 541046, 547515, 549111, 545366, 536770, 524430, 510000, 495487, 482449, 471300, 461736, 453758, 447849, 444140, 441914, 440156, 438366, 436745, 435822, 435945, 436903, 437966, 438525, 438595, 438446, 437869, 436372, 434064, 431752, 429951, 428311, 426285, 423832, 421163, 418282, 415302, 412847, 411610, 411618, 412335, 413315]
51602D13315J096J142J242J783K947M380N598O499P296Q240R536J1192J2725J3293
51588E00284J2339R911O392K224j868m939o420o583o088n183l537p95K771O264
51574E04772Q863J0676J2674J5555J8827K1328K2534K2936K3317K4102K5342K6701
51562G37627K7455K7107K6327K6706K9354L4007L9569M5029M9566N2303N2385
51551A147435M9131M1987L0790J6417P33j4362k7757l8898m7396n3205n6817n8744
51539I89314n9016n7409n3945m8929m2809l6347l0532k5896k2096j8557j5312
51528E78466j2879j1443j0559r565q074o201m480l478l306l672m392n444o406
51515D88567o396n048l197k097k117k590k739k336j647j149j237j873k489k521
$$ y = [413315, 414411, 415553, 416795, 418578, 421525, 425905, 431503, 438002, 445298, 453538, 463074, 474266, 486991, 500284, 512623, 522534, 528926, 531150, 529282, 524343, 517923, 511340, 505252, 500069, 496532, 495737, 498508, 504772, 513635, 524311, 536985, 552540, 571367, 592695, 615229, 638165, 661482, 685584, 710926, 737627, 765082, 792189, 818516, 845222, 874576, 908583, 948152, 993181, 1042747, 1095050, 1147435, 1196566, 1238553, 1269343, 1285760, 1286493, 1272131, 1244374, 1205476, 1158080, 1104875, 1048058, 989314, 930298, 872889, 818944, 770015, 727206, 690859, 660327, 634431, 612335, 593778, 578466, 565587, 554144, 543585, 534020, 525946, 519745, 515265, 511787, 508481, 504809, 500417, 494973, 488567, 482171, 477123, 473926, 471829, 469712, 467122, 464383, 462047, 460400, 459251, 458014, 456141, 453652, 451131]
51501D51131j948j174m72K22J122K293L421L863L217J870O71J0l75o80p60p30
51485D61681j072j809k298k290k454l254m080m246m129m451m910m666l756k966
51471D15300k543k095j664j735k226k473k345k386k704k786k539k485k612k127
51457C82580q90K4j88q02o90R2P16J097J970L553N056N700N704O028P340R439
51441D26729J1603J3440J5208J7079J8271J7527J4557J0478O695L776J738O39
51429E57740L38l3j569m561q307j1807j4339j5497j5172j3629j1425r080o936
51416D45723n166l828k857k127j518r71n37k86m5N70J673K749L164K914K607K772
51400D44837L499M640N886O749O912O681O651O957P317P658Q150Q737R347J0471
$$ y = [451131, 449183, 448009, 447537, 447759, 448881, 451174, 454595, 458458, 461675, 463545, 464216, 464226, 463851, 463171, 462411, 461681, 460609, 458800, 456502, 454212, 451758, 448504, 444424, 440178, 436049, 431598, 426688, 422022, 418266, 415300, 412757, 410662, 408998, 407263, 405037, 402564, 400219, 397833, 395129, 392343, 389804, 387319, 384707, 382580, 381690, 381714, 381526, 380724, 380034, 380126, 380842, 381939, 383909, 387462, 392518, 398218, 403922, 409950, 417290, 426729, 438332, 451772, 466980, 484059, 502330, 519857, 534414, 544892, 551587, 555363, 557101, 557740, 558078, 558045, 556476, 551915, 543608, 531801, 517462, 501965, 486793, 473164, 461739, 452659, 445723, 440557, 436729, 433872, 431745, 430227, 429256, 428719, 428433, 428388, 428958, 430631, 433380, 436544, 439458, 442065, 444837, 448336, 452976, 458862, 465611, 472523, 479204, 485855, 492812, 500129, 507787, 515937, 524674, 534021, 544492]
51386E44492J2643J5290J7148J8173K0012K4016K9644L5468M1049M6958N3504
51375H58397O0163O5983O9962P1421P0396O7160O0971N0252L4748J6743p99j6703
51363A408694l1265m4290n4886o2794o8434p1665p1875o9456o5832o1632n6119
51352G50446m8922m1280l4781k9658k5128k0784j6937j3952j1871j0489r455q460
51340D78729p620p274p292p039o241n331m590l594k013m53J42l85j361k172k700
51325D20806l104l628m420n151n022l668j852p86q08j201j208p44j76J38j5n32
51309C88629q98n89L36J298J922K324K671K881K884K835K859K815K547K107J549
51294D16170P88m5m00Q8Q89R04l33k065l042k718j657r23j070j659j696p32O08
$$ y = [544492, 557135, 572425, 589573, 607746, 627758, 651774, 681418, 716886, 757935, 804893, 858397, 918560, 984543, 1054505, 1125926, 1196322, 1263482, 1324453, 1374705, 1409453, 1426196, 1425397, 1408694, 1377429, 1333139, 1278253, 1215459, 1147025, 1075360, 1003485, 934029, 868197, 806565, 750446, 701524, 660244, 625463, 595805, 570677, 549893, 532956, 519004, 507133, 496644, 487189, 478729, 471109, 463835, 456543, 449504, 443263, 437932, 433342, 429748, 427735, 427282, 427424, 427039, 425678, 423506, 420806, 417702, 414074, 409654, 404503, 399481, 395813, 393961, 393175, 392367, 391166, 389958, 389214, 389038, 389176, 389161, 388629, 387731, 387142, 387478, 388776, 390698, 393022, 395693, 398574, 401458, 404293, 407152, 409967, 412514, 414621, 416170, 416958, 416913, 416513, 416601, 417490, 418394, 418061, 415996, 412954, 410236, 408579, 407656, 406586, 404927, 403231, 402499, 403107]
51277D03107J309J197J124J814K892L352K685J234l44j473j698q76M89J516J853
51262D18181K008K579L365L488K337K49j718k619k390j843j784k164k319j989
51248D15381j650j711j880j648j096p41p55p59m02K19P61J005R02M94j08o60q42
51231D06510m89J50N80N84M90N97N57j93j400k070j694r01n30o64r02j078j117
51214C98430o83M10J632K202J991J520J234J193J328J530J689J965K772M056N026
51199D26295N127M842M893N027M493L402K621K430K185J390K13j070k291l012
51185D56545k820k157j898k073j898j251r52j265j401r79q39j594k460k517k177
51170D30264k304k638k332j586j375j733j537j62J615K646K729K582K938L771
$$ y = [403107, 404416, 405613, 406737, 408551, 411443, 414795, 417480, 418714, 418370, 416897, 415199, 414323, 414812, 416328, 418181, 420189, 422768, 426133, 429621, 431958, 432207, 430489, 427870, 425480, 423637, 421853, 419689, 417370, 415381, 413731, 412020, 410140, 408492, 407396, 406655, 405900, 405141, 404739, 404958, 405719, 406724, 407626, 408120, 408012, 407352, 406510, 406021, 406171, 406751, 407335, 407825, 408422, 408979, 408786, 407386, 405316, 403622, 402721, 402191, 401527, 400625, 399547, 398430, 397747, 398157, 399789, 401991, 403982, 405502, 406736, 407929, 409257, 410787, 412476, 414441, 417213, 421269, 426295, 431422, 436264, 441157, 446184, 450677, 454079, 456700, 459130, 461315, 462705, 462918, 461848, 459557, 456545, 453725, 451568, 449670, 447597, 445699, 444448, 443496, 442231, 440830, 439851, 439012, 437418, 434958, 432441, 430264, 427960, 425322, 422990, 421404, 420029, 418296, 416759, 416597, 418212, 420858, 423587, 426169, 429107, 432878]
51156D32878M263L628K108Q40M72L74k26j012j219j016j302k243l013l004k438
51141D29090j698q40K4N96Q77J176J473J353P59K11J06K35K58P0m34j414k580
51124D29262l062k263o01Q68J493J508J634K270L004L040K258J555J792K646L102
51109D48506K879K618K731K876K768K709K939L105K866K506K485K742K873K717
51095D87320K392J934J283N15k22q58j455k140k971l662l649k796j870j742k194
51080D69885k248j572p84k56L37J051J298R70Q60J284J331M55k18N90K197K904
51064D78084K556K612L774N181O216P564R799J2210J3858J4822J5467J5246J3247
51051F00636R722O237M419N008P786J1763J5536J8004J8835J8110J5897J2534
$$ y = [432878, 437141, 440769, 442877, 443717, 444189, 444563, 444337, 443325, 442106, 441090, 439788, 437545, 434532, 431528, 429090, 427392, 426552, 426576, 427172, 428049, 429225, 430698, 432051, 432810, 433021, 433127, 433362, 433620, 433690, 433256, 431842, 429262, 426200, 423937, 423336, 424204, 425697, 427205, 428839, 431109, 434113, 437153, 439411, 440966, 442758, 445404, 448506, 451385, 454003, 456734, 459610, 462378, 465087, 468026, 471131, 473997, 476503, 478988, 481730, 484603, 487320, 489712, 491646, 492929, 493444, 493222, 492364, 490909, 488769, 485798, 482136, 478487, 475691, 473821, 472079, 469885, 467637, 466065, 465281, 465025, 465362, 466413, 467711, 468681, 469541, 470825, 472156, 472611, 472393, 472983, 475180, 478084, 480640, 483252, 487026, 492207, 498423, 505987, 515786, 527996, 541854, 556676, 572143, 587389, 600636, 610358, 616595, 621014, 626022, 633808, 645571, 661107, 679111, 697946, 716056, 731953, 744487]
51039G44487Q888N634K479j274n423q741j0259j0222r704r732j0896j3233j6140
51026F65864j8528j9404j8363j5665j2134q861o566n001l358j393K21R52J351
51013E59115K404M204N866O785P329Q049Q792R081R057R408J0400J1504J2178
51000F64172J2558J3053J3570J3597J2927J1877J0727R466Q223P537P691Q013
50988G93411P461O004M864N057O035O248M970L097K058K410L674N186O645P967
50974H65087R037R767J0124J0069R646R308R920J2253J6436K1889K7667L2860
50962A044063L6942L9990M2562M5146M7711M9838N1168N1641N1300N0172M8282
50951A558815M5663M2267L8088L3371K8551K3943J9635J5803J2883J1166J0380
$$ y = [744487, 753375, 759009, 761488, 760214, 754791, 746050, 735791, 725569, 715865, 706133, 695237, 682004, 665864, 647336, 627932, 609569, 593904, 581770, 572909, 566343, 561342, 557984, 556591, 556812, 557764, 559115, 561519, 565723, 571589, 578374, 585703, 593752, 602544, 611625, 620682, 630090, 640490, 651994, 664172, 676730, 689783, 703353, 716950, 729877, 741754, 752481, 761947, 770170, 777707, 785398, 793411, 800872, 806876, 811740, 816797, 822832, 829080, 834050, 837147, 839205, 841615, 845289, 850475, 857120, 865087, 874124, 883891, 894015, 904084, 913730, 923038, 932958, 945211, 961647, 983536, 1011203, 1044063, 1081005, 1120995, 1163557, 1208703, 1256414, 1306252, 1357420, 1409061, 1460361, 1510533, 1558815, 1604478, 1646745, 1684833, 1718204, 1746755, 1770698, 1790333, 1806136, 1819019, 1830185, 1840565]
50940A840565R985R889J0468J1732J2716J2012Q914L881j978p620j2316j5645
50928A882603j7642j8975k0722k3710k7965l2733l7121m0809m4133m7480n0651
50917A520662n2978n3933n3469n1799m9168m5920m2444l8884l5109l1172k7542
50906A038244k4595k2189k0062j8401j7519j7082j6292j4908j3464j2327j1062
50895H50343r164o965n348m699m631m525m031l062j743n14N5j79o41m32Q45K605
50879H07914L780L909L718M263N577O592O591O196O578P954R473J0344J0627J0973
50865I04489J1946J3634J5576J7131J8211J9496K1559K4076K6453K8973L2574
50854A134118L7412M2544M7280N2035N7434O3296O9169P5308Q2278Q9825R6865
$$ y = [1840565, 1850550, 1860439, 1870907, 1882639, 1895355, 1907367, 1916281, 1920162, 1918184, 1910564, 1898248, 1882603, 1864961, 1845986, 1825264, 1801554, 1773589, 1740856, 1703735, 1662926, 1618793, 1571313, 1520662, 1467684, 1413751, 1360282, 1308483, 1259315, 1213395, 1170951, 1132067, 1096958, 1065786, 1038244, 1013649, 991460, 971398, 952997, 935478, 918396, 902104, 887196, 873732, 861405, 850343, 841179, 834214, 828866, 824167, 819536, 815011, 810980, 807918, 806175, 805661, 805716, 805537, 804896, 804464, 805309, 807914, 811694, 815603, 819321, 823584, 829161, 835753, 842344, 848540, 855118, 863072, 872545, 882889, 893516, 904489, 916435, 930069, 945645, 962776, 980987, 1000483, 1022042, 1046118, 1072571, 1101544, 1134118, 1171530, 1214074, 1261354, 1313389, 1370823, 1434119, 1503288, 1578596, 1660874, 1750699, 1847564]
50843A847564J02629J07215J11086J14445J17163J18807J18669J16154J11212
50834B864944J04037R4350Q1567O5908M9025L3049J9147P153l475j2608j9279
50823C283818k2420k1740j7962j2277n579J692R086J5618J9799K0231J6341Q648
50811C295255j758j4086k8115m3583n9664p5227q9436j01814j11871j19014j22856
50800B527831j23343j20726j15638j08988j01367r2620q2474p1435o0666n0947
50790A599627m2300l4607k7881k1809j5764r747m688j305Q60K643M041M453L788
50777A457311K492O98j747m390o278p256q338j0364j2861j4806j6049j7345j9222
50764A341845k1445k3533k5265k6606k7512k7963k7902k7104k5352k2854k0203
$$ y = [1847564, 1950193, 2057408, 2168494, 2282939, 2400102, 2518909, 2637578, 2753732, 2864944, 2968981, 3063331, 3144898, 3210806, 3259831, 3292880, 3312027, 3319180, 3315705, 3303097, 3283818, 3261398, 3239658, 3221696, 3209419, 3203840, 3205532, 3214618, 3230236, 3250035, 3270266, 3286607, 3295255, 3293497, 3279411, 3251296, 3207713, 3148049, 3072822, 2983386, 2881572, 2769701, 2650687, 2527831, 2404488, 2283762, 2168124, 2059136, 1957769, 1865149, 1782675, 1711240, 1650574, 1599627, 1557327, 1522720, 1494839, 1473030, 1457266, 1447519, 1442831, 1441526, 1442386, 1445029, 1449070, 1453523, 1457311, 1459803, 1460501, 1458754, 1454364, 1448086, 1440830, 1432492, 1422128, 1409267, 1394461, 1378412, 1361067, 1341845, 1320400, 1296867, 1271602, 1244996, 1217484, 1189521, 1161619, 1134515, 1109163, 1086309, 1066106]
50753A066106j7778j5447j2926j0218p476m709j899P36L029N283Q027J1210J4143
50740A038081J6461J8725K1695K5307K8952L2571L6784M1855M7124N1763N5596
50729A414914N8878O1608O3544O4577O4770O4234O3255O2195O0908N8630N4948
50718B092461N0487M5888M0435L2656K2338J1003J72r915j9310k6985l1364l1946
50706B175920k9606k5390j9728j2835n361J717P632J2063J4992J6311J5657J2702
50694B164074P585P63p621j7726k9128m0352m9780n6726o1205o2988o1676n7678
50682A727542n2313m6693m0928l4716k8147k1548j4962q228j466M972J1028J7062
50670A511603K3320K9506L4995L9335M2378M4011M4023M2369L9393L5619L1427
$$ y = [1066106, 1048328, 1032881, 1019955, 1009737, 1002261, 997552, 995653, 996389, 999418, 1004701, 1012728, 1023938, 1038081, 1054542, 1073267, 1094962, 1120269, 1149221, 1181792, 1218576, 1260431, 1307555, 1359318, 1414914, 1473792, 1535400, 1598944, 1663521, 1728291, 1792525, 1855780, 1917975, 1978883, 2037513, 2092461, 2142948, 2188836, 2229271, 2261927, 2284265, 2295268, 2295440, 2285525, 2266215, 2239230, 2207866, 2175920, 2146314, 2120924, 2101196, 2088361, 2083000, 2084717, 2092349, 2104412, 2119404, 2135715, 2151372, 2164074, 2171659, 2172422, 2164801, 2147075, 2117947, 2077595, 2027815, 1971089, 1909884, 1846896, 1785220, 1727542, 1675229, 1628536, 1587608, 1552892, 1524745, 1503197, 1488235, 1480007, 1478541, 1483513, 1494541, 1511603, 1534923, 1564429, 1599424, 1638759, 1681137, 1725148, 1769171, 1811540, 1850933, 1886552, 1917979]
50659A917979K7211K3713K1683K1012K0666J9787J8490J7251J5982J4314J2520
50648B130608J1430J1400J2026J2946J4380J6721K0111K4524K9797L5379M0640
50637B359962M5590N0681N5631N9030N9655N7733N4380N0276M5487M0320L5544
50626B914289L1769K9019K6999K5235K2765J7749P651r631l3529n9205p9150q7971
50614B805990q5961p7478o6266n3312l8844k4464j2262k922M105R004J1184J0195
50602B478969O128r10j0827k2881l5622m7704n8424o7359p4073p8413q0650q0921
50590A927313p8960p4746o9188o3603n8526n3440m7753m1740l6209l1548k7391
50579A344209k3322j9519j6518j4491j3010j1519r834q124o568n098l386j081
$$ y = [1917979, 1945190, 1968903, 1990586, 2011598, 2032264, 2052051, 2070541, 2087792, 2103774, 2118088, 2130608, 2142038, 2153438, 2165464, 2178410, 2192790, 2209511, 2229622, 2254146, 2283943, 2319322, 2359962, 2405552, 2456233, 2511864, 2570894, 2630549, 2688282, 2742662, 2792938, 2838425, 2878745, 2914289, 2946058, 2975077, 3002076, 3027311, 3050076, 3067825, 3075476, 3065845, 3032316, 2973111, 2893961, 2805990, 2720029, 2642551, 2576285, 2522973, 2484129, 2459665, 2447403, 2444481, 2448586, 2457590, 2468774, 2478969, 2485097, 2484187, 2473360, 2450479, 2414857, 2367153, 2308729, 2241370, 2167297, 2088884, 2008234, 1927313, 1848353, 1773607, 1704419, 1640816, 1582290, 1528850, 1481097, 1439357, 1403148, 1371600, 1344209, 1320887, 1301368, 1284850, 1270359, 1257349, 1245830, 1235996, 1227872, 1221304, 1216206, 1212820, 1211739]
50567A211739J735M369O125P157Q325J0066J1883J3319J4919J7570K1129K4534
50555A352870K7314L0139L3709L7777M1694M5172M7958M9326M8682M6446M3669
50544A804756M0928L8226L5876L4644L4964L6529L8926M2177M6478N1789N7902
50533B263195O4496P1062P7238Q3316Q9979R7326J04758J12026J19705J28143
50523C211244J36616J44158J50686J56359J60141J60120J55385J46709J35105
50514D556523J20500J02271Q0520N6118K9884K345k5797n3424p9391j02837j23079
50503D563633j39335j50759j56649j56677j50921j39760j23889j04371q2391n8702
50493C300179l3598p846J6534L7038N2297O2280O6783O4528N4374L6847J3786
$$ y = [1211739, 1213474, 1217843, 1223968, 1231125, 1239450, 1249516, 1261399, 1274718, 1289637, 1307207, 1328336, 1352870, 1380184, 1410323, 1444032, 1481809, 1523503, 1568675, 1616633, 1665959, 1714641, 1761087, 1804756, 1845684, 1883910, 1919786, 1954430, 1989394, 2025923, 2064849, 2107026, 2153504, 2205293, 2263195, 2327691, 2398753, 2475991, 2559307, 2649286, 2746612, 2851370, 2963396, 3083101, 3211244, 3347860, 3492018, 3642704, 3799063, 3959204, 4119324, 4274709, 4421418, 4556523, 4677023, 4779294, 4859814, 4915932, 4945816, 4948161, 4922364, 4868940, 4789549, 4686712, 4563633, 4424298, 4273539, 4116890, 3960213, 3809292, 3669532, 3545643, 3441272, 3358881, 3300179, 3266581, 3258735, 3275269, 3312307, 3364604, 3426884, 3493667, 3558195, 3612569, 3649416, 3663202]
50482C663202j3153m2594p2260r8889j19982j35098j44995j50095j50487j46990
50472B588659j41209j34351j26631j17979j08753r9395q9928q0406p1435o3696
50462A554876n7032n0729m4603l9176l4599l0157k5272k0401j6378j3260j0419
50451A212850p536m802k242M53L342N985P969R246R885R889R422Q821Q241P590
50437A279113O918O455O149N582M613L748L638M441N861P548R304J1124J3136
50424A367630J5332J7367J9040K0872K3621K7097L0223L2521L4934L8669M3767
50413A671073M9289N4492N9222O3615O7961P2523P7024Q0584Q2641Q3506Q3512
50402B445442Q2180P8950P4270O9001O3033N5397M5683L4364K1738P419q842k6533
$$ y = [3663202, 3650049, 3607455, 3535195, 3436306, 3316324, 3181226, 3036231, 2886136, 2735649, 2588659, 2447450, 2313099, 2186468, 2068489, 1959736, 1860341, 1770413, 1690007, 1618572, 1554876, 1497844, 1447115, 1402512, 1363336, 1328737, 1298580, 1273308, 1252907, 1236529, 1223269, 1212850, 1205314, 1200512, 1198270, 1198723, 1202065, 1208050, 1216019, 1225265, 1235150, 1245039, 1254461, 1263282, 1271523, 1279113, 1286031, 1292486, 1298635, 1304217, 1308830, 1312578, 1316216, 1320657, 1326518, 1334066, 1343370, 1354494, 1367630, 1382962, 1400329, 1419369, 1440241, 1463862, 1490959, 1521182, 1553703, 1588637, 1627306, 1671073, 1720362, 1774854, 1834076, 1897691, 1965652, 2038175, 2115199, 2195783, 2278424, 2361930, 2445442, 2527622, 2606572, 2680842, 2749843, 2812876, 2868273, 2913956, 2948320, 2970058, 2977477, 2968635, 2942102]
50390B942102m4622o1772p6327q6977r3633r7083r7646r4903q8803q0124o9682
50379B050530n7794m4864l1671j8713o045N878J5903K3189K7777K9701K8285K2868
50367B045044J3687J556j2578k7222m0347n0630n8210o3686o6976o7953o7333
50356A605352o5969o3743o0242n6062n2339m9292m6375m3587m1424l9527l6736
50345A050056l2695k8377k4673k1390j8101j4993j2386j0086p758n463l406j541
50333H69187K20J840L409N083O685P879Q911J0456J2573J4494J5683J6288J6021
50320I88729J3638Q374J490m527q068r228q944q067p050n830m012j600O21J858
50306I57384K252K578L244M085M948N787O315O204N665N303N377N690O138O794
$$ y = [2942102, 2897480, 2835708, 2759381, 2672404, 2578771, 2481688, 2384042, 2289139, 2200336, 2120212, 2050530, 1992736, 1947872, 1916201, 1897488, 1891443, 1897321, 1913224, 1936413, 1964190, 1993891, 2022176, 2045044, 2058731, 2060287, 2047709, 2020487, 1980140, 1929510, 1871300, 1807614, 1740638, 1672685, 1605352, 1539383, 1475640, 1415398, 1359336, 1306997, 1257705, 1211330, 1167743, 1126319, 1086792, 1050056, 1017361, 988984, 964311, 942921, 924820, 909827, 897441, 887355, 879597, 874134, 870728, 869187, 869407, 871247, 874656, 879739, 886424, 894303, 903214, 913670, 926243, 940737, 956420, 972708, 988729, 1002367, 1010741, 1012231, 1007704, 999636, 990408, 981464, 973397, 966347, 960517, 956505, 954905, 955526, 957384, 959636, 962214, 965458, 969543, 974491, 980278, 986593, 992797, 998462, 1003765, 1009142, 1014832, 1020970, 1027764]
50292A027764P419P524P102O778O998P520P995Q587R802J1868J4501J6833J7243
50279A157934J3861N967m816j5004k1357k2803k0646j7018j3163r079m605l26
50267A048945K860M749N904O701O850N922M053J960M69J1L30O47M76K76Q15J903
50251A092871K290J154q46k278k351j238N59K625M594O305Q053J0415J3770J8061
50237A153984K2926K7890L2602L7023M1154M4466M5982M5152M2445L8778L4794
50226A567196L0899K7526K4832K2431K0008J7792J5813J3054Q104N51q972j9742
50214A719492l1007m1308m9005n3764n6504n7588n6147n1714m5442l8893l2522
50203A205598k6226k0626j6787j5142j5596j8141k2318k6463k8772k9000k8090
$$ y = [1027764, 1035183, 1042707, 1049809, 1056587, 1063585, 1071105, 1079100, 1087687, 1097489, 1109357, 1123858, 1140691, 1157934, 1171795, 1177762, 1172946, 1157942, 1136585, 1113782, 1093136, 1076118, 1062955, 1053876, 1049271, 1048945, 1051805, 1056554, 1062458, 1069159, 1076009, 1081931, 1085984, 1087944, 1088413, 1088424, 1088754, 1089401, 1089877, 1090153, 1090968, 1092871, 1095161, 1096315, 1095469, 1093191, 1090840, 1089602, 1090161, 1092786, 1097380, 1103685, 1111738, 1122153, 1135923, 1153984, 1176910, 1204800, 1237402, 1274425, 1315579, 1360045, 1406027, 1451179, 1493624, 1532402, 1567196, 1598095, 1625621, 1650453, 1672884, 1692892, 1710684, 1726497, 1739551, 1747655, 1748206, 1739234, 1719492, 1688485, 1647177, 1598172, 1544408, 1487904, 1430316, 1374169, 1322455, 1277013, 1238120, 1205598, 1179372, 1158746, 1141959, 1126817, 1111221, 1093080, 1070762, 1044299, 1015527, 986527, 958437]
50192I58437k6372k3404j9626j6606j5106j4087j2357j0233q716p903p123o159
50180G90745n329m674l995l569l954m996n659n064l325j294J83P70P41O59P79
50165G52018Q74P05N16P26J370K160K942L723M448N034N491N718N505N192N907
50150H02329Q412J1788J4033J4052J2464J0398Q252N913L437J027j197k929l601
50137H84378l021j778n20Q71K933N702Q677J1562J4474J7408K0004K2050K3827
50124A006567K5821K8373L1722L6135M1727M8249N5217O2123O8485P3785P7541
50113A555745P9362P8940P6195P1694O6797O3005O0907N9830N8678N6823N3890
50102B281866M8830L9916K6153Q475j0814k9643m6940o2139p4674q4128r0391
$$ y = [958437, 932065, 908661, 889035, 872429, 857323, 843236, 830879, 820646, 811930, 804027, 796904, 790745, 785416, 780742, 776747, 773178, 769224, 764228, 758569, 753505, 750180, 748886, 749069, 749839, 750580, 751239, 752018, 752892, 753597, 754113, 754839, 756209, 758369, 761311, 765034, 769482, 774516, 780007, 785725, 791230, 796422, 802329, 810741, 822529, 836562, 850614, 863078, 873476, 881728, 887641, 891078, 892105, 890908, 887979, 884378, 881357, 879579, 879059, 879930, 882863, 888565, 897242, 908804, 923278, 940686, 960690, 982740, 1006567, 1032388, 1060761, 1092483, 1128618, 1170345, 1218594, 1273811, 1335934, 1404419, 1478204, 1555745, 1635107, 1714047, 1790242, 1861936, 1928733, 1991738, 2052645, 2112475, 2171153, 2227976, 2281866, 2330696, 2370612, 2396765, 2405240, 2394426, 2364783, 2317843, 2255704, 2181030, 2096902, 2006511]
50091B006511r3429r3240r0244q5361p9344p2388o4621n6635m9077m1999l5166
50080A245007k8921k4198k1549k0509j9989j9026j7198j4646j1876r326p074n037
50068A045658l315k062j126k88J70l88j975l685m694n209o053p499q916r506r068
50053I82044q051p151o864p143p459p223o211m565k656j061l28l38j03J283L528
50038I27702N450O424P037Q076R495J0805J1994J3375J4673J5034J4099J2561
50026A056725J1430J1040J1002J0688R516P185M153J653O59P78O85l23j641k444
50012A121106k909l861n503o961p161n719l010K89L581O569R448J2843J7378K3271
49998A159361L0268L7854M5368N2069N7186O0018O0006N6931N1138M3592L5714
$$ y = [2006511, 1913082, 1819842, 1729598, 1644237, 1564893, 1492505, 1427884, 1371249, 1322172, 1280173, 1245007, 1216086, 1191888, 1170339, 1149830, 1129841, 1110815, 1093617, 1078971, 1067095, 1057769, 1050695, 1045658, 1042343, 1040281, 1039155, 1038867, 1039037, 1038649, 1036674, 1032989, 1028295, 1023086, 1017033, 1009534, 1000618, 991112, 982044, 973993, 966842, 959978, 952835, 945376, 938153, 931942, 927377, 924721, 923660, 923332, 922994, 922891, 924174, 927702, 933152, 939576, 946613, 954689, 964184, 974989, 986983, 1000358, 1015031, 1030065, 1044164, 1056725, 1068155, 1079195, 1090197, 1100885, 1110401, 1117586, 1121739, 1123392, 1124051, 1124829, 1125514, 1125191, 1123550, 1121106, 1118197, 1114336, 1108833, 1101872, 1094711, 1088992, 1085982, 1086271, 1089852, 1096421, 1105869, 1118712, 1136090, 1159361, 1189629, 1227483, 1272851, 1324920, 1382106, 1442124, 1502130, 1559061, 1610199, 1653791, 1689505]
49987A689505K9018K4645K2699K1907K0131J5635P912k543j4946k8463m2042n4507
49975A688951o4904p2522p6720p7179p4441o9700o3877n7159m9720m2391l6176
49964A004162l1276k7128k3320j9938j7060j4452j2007r919q143n993k831J040
49952H33135M595P181R101J1032J3128J4793J5237J4177J2086R661P107M130P26
49939I56089k362m302n140n739o878q759j1283j4306j7465k0231k2239k3294k3005
49926G91086k1017j7826j4770j2796j1540j0122q403o861n514l836j740J27J296
49913F78084K100L003L831M165M075L993M083M296M894O401Q887J1718J4178J6026
49899G69734J7368J8273J8721J8691J8070J6607J4154J0949P462M041Q11k130
$$ y = [1689505, 1718523, 1743168, 1765867, 1787774, 1807905, 1823540, 1831452, 1828909, 1813963, 1785500, 1743458, 1688951, 1624047, 1551525, 1474805, 1397626, 1323185, 1253485, 1189608, 1132449, 1082729, 1040338, 1004162, 972886, 945758, 922438, 902500, 885440, 870988, 858981, 849062, 840919, 834926, 832095, 833135, 837730, 844911, 854012, 865044, 878172, 892965, 908202, 922379, 934465, 944126, 951233, 955363, 956089, 953727, 949425, 944285, 938546, 931668, 922909, 911626, 897320, 879855, 859624, 837385, 814091, 791086, 770069, 752243, 737473, 724677, 713137, 703015, 694612, 687751, 682237, 678401, 676661, 676788, 678084, 680184, 683187, 687018, 691183, 695258, 699251, 703334, 707630, 712524, 718925, 727812, 739530, 753708, 769734, 787102, 805375, 824096, 842787, 860857, 877464, 891618, 902567, 910029, 914070, 914881, 912751]
49887I12751m712p102r717j2826j6155j8902k0292k0136j8980j7704j6869j6417
$$ y = [912751, 908039, 900937, 891220, 878394, 862239, 843337, 823045, 802909, 783929, 766225, 749356, 732939]
$$ [...]
##END NTUPLES=NMR SPECTRUM
##END=
