
##TITLE=UV1225_M6_1234-1212_50_7231073_4BOEm63b0W
##JCAMPDX= 6.0         $$ Bruker NMR JCAMP-DX V2.0
##DATA TYPE= NMR SPECTRUM
##DATA CLASS= NTUPLES
##ORIGIN= BRUKER
##OWNER= Administrator
$$ 1.72 TOPSPIN		Version 2.1
$$ 2013-01-18 00:03:20.581 -0500  Administrator@X
$$ Compression mode = diff/dup
##.OBSERVE FREQUENCY= 400.02188249412
##.OBSERVE NUCLEUS= ^1H
##.ACQUISITION MODE= SIMULTANEOUS (DQD)
##.ACQUISITION SCHEME= undefined
##.AVERAGES= 8
##.DIGITISER RES= 22
##SPECTROMETER/DATA SYSTEM= spect
##.PULSE SEQUENCE= zg30
##.SOLVENT NAME= COFFEE_meoh
##.SHIFT REFERENCE= INTERNAL, COFFEE_meoh, 1, 14.98509
##AUDIT TRAIL= $$ (NUMBER, WHEN, WHO, WHERE, PROCESS, VERSION, WHAT)
$$ ##TITLE= Audit trail, TOPSPIN		Version 2.1
$$ ##JCAMPDX= 5.01
$$ ##ORIGIN= Bruker BioSpin GmbH
$$ ##OWNER= Administrator
$$ $$ E:\/data/COFFEE/nmr/UV1225_M6_1234-1212_50_7231073_4BOEm63b0W/20/pdata/1/auditp.txt
$$ ##AUDIT TRAIL=  $$ (NUMBER, WHEN, WHO, WHERE, PROCESS, VERSION, WHAT)
(   1,<2013-01-18 00:03:12.675 -0500>,<Administrator>,<X>,<go>,<TOPSPIN 2.1>,
      <created by zg
	started at 2013-01-18 00:02:06.175 -0500,
	POWCHK enabled, PULCHK disabled,
       configuration hash MD5:
       86 BA 57 50 F2 9D 5C 9B 26 00 A9 28 5F 66 2E 89
       data hash MD5: 64K
       44 35 86 7E 28 CF BE EA A8 78 0F AD 8C 5B AD 65>)
(   2,<2013-01-18 00:03:15.737 -0500>,<Administrator>,<X>,<proc1d>,<TOPSPIN 2.1>,
      <Start of raw data processing
       efp LB = 0 FT_mod = 6 PKNL = 1 PHC0 = 0 PHC1 = 0 SI = 32K 
       data hash MD5: 32K
       E7 83 EE 61 5D 39 CD 00 81 DE 91 9C 4D 27 42 8D>)
(   3,<2013-01-18 00:03:16.190 -0500>,<Administrator>,<X>,<proc1d>,<TOPSPIN 2.1>,
      <pk PHC0 = 95.51514 PHC1 = 0 
       data hash MD5: 32K
       CB 1A 9D 0C 1B 98 ED 93 D9 03 8A 35 F6 CE 6C 13>)
(   4,<2013-01-18 00:03:16.409 -0500>,<Administrator>,<X>,<proc1d>,<TOPSPIN 2.1>,
      <abs ABSG = 1 
       data hash MD5: 32K
       95 16 92 DE A0 9A 74 D3 AC B6 AF D2 72 4A 14 AA>)
(   5,<2013-01-18 00:03:16.550 -0500>,<Administrator>,<X>,<proc1d>,<TOPSPIN 2.1>,
      <abs ABSG = 2 
       data hash MD5: 32K
       CF 61 8D A7 63 0E 8B A6 89 0A 81 87 4D 96 8E 5B>)
(   6,<2013-01-18 00:03:16.706 -0500>,<Administrator>,<X>,<proc1d>,<TOPSPIN 2.1>,
      <abs ABSG = 3 
       data hash MD5: 32K
       C6 C4 18 EB 74 C3 35 89 78 76 53 5A 8D E7 CE CD>)
(   7,<2013-01-18 00:03:16.847 -0500>,<Administrator>,<X>,<proc1d>,<TOPSPIN 2.1>,
      <abs ABSG = 4 
       data hash MD5: 32K
       ED 22 78 9B 22 B0 32 67 17 44 14 17 21 08 F6 35>)
(   8,<2013-01-18 00:03:17.003 -0500>,<Administrator>,<X>,<proc1d>,<TOPSPIN 2.1>,
      <abs ABSG = 5 
       data hash MD5: 32K
       E9 CD C5 F6 EF 1E B4 71 1F 7E 9E 02 11 DD 63 91>)
$$ ##END=
$$ 
$$ $$ hash MD5
$$ $$ 0A D3 E1 3D F8 37 07 8F C0 9E 89 B6 5F 5F 5E 1B
##$RELAX= 
##$RELAX= 
##$RELAX= 
##$RELAX= 
##$RELAX= 
##$RELAX= 
##$RELAX= 
$$ Bruker specific parameters
$$ --------------------------
##$DU= <E:\>
##$EXPNO= 20
$$ [...]
##$TP= (0..7)
150 150 150 150 150 150 150 150
##$TP07= 0
##$TPNAME0= <>
##$TPNAME1= <>
##$TPNAME2= <>
##$TPNAME3= <>
##$TPNAME4= <>
##$TPNAME5= <>
##$TPNAME6= <>
##$TPNAME7= <>
##$TPOAL= (0..7)
0.5 0.5 0.5 0.5 0.5 0.5 0.5 0.5
##$TPOFFS= (0..7)
0 0 0 0 0 0 0 0
##$TUNHIN= 0
##$TUNHOUT= 0
##$TUNXOUT= 0
##$USERA1= <user>
##$USERA2= <user>
##$USERA3= <user>
##$USERA4= <user>
##$USERA5= <user>
##$V9= 5
##$VALIST= <valist>
##$VCLIST= <CCCCCCCCCCCCCCC>
##$VD= 0
##$VDLIST= <DDDDDDDDDDDDDDD>
##$VPLIST= <PPPPPPPPPPPPPPP>
##$VTLIST= <TTTTTTTTTTTTTTT>
##$WBST= 1024
##$WBSW= 4
##$XGAIN= (0..3)
0 0 0 0
##$XL= 0
##$YL= 0
##$YMAX_a= 600984
##$YMIN_a= -510596
##$ZGOPTNS= <>
##$ZL1= 120
##$ZL2= 120
##$ZL3= 120
##$ZL4= 120
##$ABSF1= 14.98509
##$ABSF2= -5.573092
##$ABSG= 5
##$ABSL= 3
##$ALPHA= 0
##$AQORDER= 0
##$ASSFAC= 0
##$ASSFACI= 0
##$ASSFACX= 0
##$ASSWID= 0
##$AUNMP= <proc_prof1d_extract_pilot.lims>
##$AXLEFT= 0
##$AXNAME= <>
##$AXNUC= <1H>
##$AXRIGHT= 0
##$AXTYPE= 0
##$AXUNIT= <>
##$AZFE= 0.1
##$AZFW= 0.1
##$BCFW= 0
##$BC_mod= 0
##$BYTORDP= 0
##$COROFFS= 0
##$CY= 15
##$DATMOD= 1
##$DC= 0
##$DFILT= <>
##$DTYPP= 0
##$F1P= 0
##$F2P= 0
##$FCOR= 0.5
##$FTSIZE= 32768
##$FT_mod= 6
##$GAMMA= 0
##$GB= 0
##$INTBC= 1
##$INTSCL= 1
##$ISEN= 128
##$LB= 0
##$LEV0= 0
##$LPBIN= 0
##$MAXI= 10000
##$MC2= 0
##$MEAN= 0
##$ME_mod= 0
##$MI= 0
##$NCOEF= 0
##$NC_proc= -8
##$NLEV= 6
##$NOISF1= 0
##$NOISF2= 0
##$NSP= 0
##$NTH_PI= 0
##$NZP= 0
##$OFFSET= 14.98509
##$PC= 1
##$PHC0= 95.51514
##$PHC1= 0
##$PH_mod= 1
##$PKNL= yes
##$PPARMOD= 0
##$PPDIAG= 0
##$PPIPTYP= 0
##$PPMPNUM= 2147483647
##$PPRESOL= 1
##$PSCAL= 4
##$PSIGN= 0
##$PYNMP= <proc.py>
##$REVERSE= no
##$SF= 400.02
##$SI= 32768
##$SIGF1= 0
##$SIGF2= 0
##$SINO= 400
##$SIOLD= 32768
##$SPECTYP= <>
##$SREGLST= <1H.CDCl3>
##$SSB= 0
##$STSI= 32768
##$STSR= 0
##$SW_p= 8223.68421052631
##$SYMM= 0
##$S_DEV= 0
##$TDeff= 65536
##$TDoff= 0
##$TI= <>
##$TILT= no
##$TM1= 0
##$TM2= 0
##$TOPLEV= 0
##$USERP1= <user>
##$USERP2= <user>
##$USERP3= <user>
##$USERP4= <user>
##$USERP5= <user>
##$WDW= 1
##$XDIM= 32768
##$YMAX_p= 402974786
##$YMIN_p= -681093
##$CURPLOT= <Network HP LaserJet P1505>
##$CURPRIN= <$Network HP LaserJet P1505>
##$DFORMAT= <normdp>
##$LAYOUT= <+/1D_H.xwp>
##$LFORMAT= <normlp>
##$PFORMAT= <normpl>
##$SURQMSG= 1
$$ End of Bruker specific parameters
$$ ---------------------------------
##NTUPLES= NMR SPECTRUM
##VAR_NAME=  FREQUENCY,     SPECTRUM/REAL,   SPECTRUM/IMAG
##SYMBOL=    X,             R,               I
##VAR_TYPE=  INDEPENDENT,   DEPENDENT,       DEPENDENT
##VAR_FORM=  AFFN,          ASDF,            ASDF
##VAR_DIM=   32768,         32768,           32768
##UNITS=     HZ,            ARBITRARY UNITS, ARBITRARY UNITS
##FACTOR=    0.250966925370066, 1,           1
##FIRST=     8223.43324360094, -53205,       72799
##LAST=      0,             295862,          -102115
##MIN=       0,             -681093,         0
##MAX=       8223.43324360094, 402974786,    0
$$ Real data points
##PAGE= N=1
##DATA TABLE= (X++(R..R)), XYDATA
$$ [...]
19545a64719O9054j54541L0436F7550a33321k1945p401F9869K4128a41299j32438
19534b73737j8520a00687C14099b13421f9031j50404h0524j41232a01098A61327
19523e53912a62832g4113I930b08083f0501j40593H9588a82318c0835A89479E189
19511A33061h0699H7728c8247A80222g9010j0418j46578k47056g5812l31615J50985
19500b56442M3181a3237l01471j4916E7993J57667a66420P9648C4026I298a93334
19488A37152c19908D693g0981E764J97575n5208J60579J13456a3650k22918j37552
19477c74120I9877f1438A25565h2700A50876M2664a95062C19823I8622i4489M944
19466h9545j40018A21751a0089j80913I1872e06616J42191J29369d2917A22413
$$ plain form
19545 -164719 -95665 -250206 -219770 67550 -133321 -155266 -162667 69869 93997 -141299 -273737
19534 -273737 -292257 -100687 314099 -213421 -69031 -219435 -80524 -221756 -101098 161327
19523 -553912 -162832 -74113 9930 -208083 -60501 -201094 89588 -182318 -30835 189479 5189
19511 133061 -80699 87728 -38247 180222 -79010 -89428 -236006 -483062 -75812 -407427 -256442
19500 -256442 -213261 -13237 -314708 -329624 57993 215660 -166420 -86772 34026 9298 -193334
19488 137152 -319908 4693 -70981 5764 203339 148131 308710 422166 -13650 -236568 -374120
19477 -374120 99877 -61438 125565 -82700 150876 193540 -195062 319823 98622 -94489 -89545
19466 -89545 -229563 121751 -10089 -191002 91872 -506616 -364425 -235056 -42917 122413
19455a19122A7492d7005k00571F0011c06482a27855B46880b37366j72362O2h0979
19443I3905b03103j9220d3451g578l68289C4580a66501I0756g8929l1382p8520
19432a88831a965j29923j35246a7075B7102d2709j03733c4890a0413O95A43563
19420b7622I8367K00639a60924P8919F860b96896B43888B7781b4971q1736n5108
19409a61815N9270B7170M20136a58137O9015k0281B23720a28287B26288i5183
19398G4364a07152a8564B5841J30440a29920I1797b97859D0315g8860I9382b45136
19386H8837Q9070D6235a01995d9054D50907C6526b28314J1361h3681B76922c22016
19374b28420j71867f0606k12914G9721a71526K5647q5680f1580a7906I0955b27677
$$ plain form
19455 -119122 17492 -47005 -247576 60011 -306482 -127855 246880 -237366 -409728 -409666 -80979
19443 93905 -203103 -222323 -43451 -7578 -375867 34580 -166501 90756 -78929 -110311 -188831
19432 -188831 -1965 -131888 -267134 -17075 27102 -42709 -146442 -34890 -10413 -9718 143563
19420 -27622 98367 299006 -160924 -82005 6860 -296896 243888 27781 -24971 -106707 -161815
19409 -161815 -102545 27170 447306 -158137 -89122 -109403 223720 -128287 226288 -95183
19398 74364 -107152 -18564 25841 156281 -129920 91797 -297859 40315 -78860 99382 -245136
19386 88837 177907 46235 -101995 -49054 450907 36526 -228314 -216953 -83681 276922 -322016
19374 -228420 -400287 -60606 -273520 79721 -171526 -145879 -231559 -61580 -17906 90955 -227677
19362b92404j5836a18878j32780b8408j2871l3105o4305B41624c37348B4089b25421
19350B32769b38153D5417f1443j60249B90446a93697K4997Q0657C4937N019A2400
19338E0615J01688B0901a89951h5673j12323I208b73314j13518A30853h4871j09365
19327a94236B939Q4386K2502e3142G3933a12455e5758B9817e0829k7324l05962
19316c84115a58772A50551a79818A12003i3064k3327F224a9296k77605g6651j04610
19305a81261n3907K324o9741a275l17639f841B68615l5831a93743B47502E1484
19293h9502j49988c8178j98700B31433a14807b8624J520A59801E1267i5470I088
19281b23449e2472B016b93427R9696A90776a28439O235A18372a8251n0781p900
$$ plain form
19362 -292404 -308240 -118878 -251658 -28408 -41279 -74384 -138689 241624 -337348 24089 -225421
19350 232769 -238153 45417 -61443 -221692 290446 -193697 -168700 -88043 34937 39956 12400
19338 50615 152303 20901 -189951 -85673 -197996 9208 -273314 -386832 130853 -84871 -194236
19327 -194236 2939 87325 109827 -53142 73933 -112455 -55758 29817 -50829 -78153 -384115
19316 -384115 -158772 150551 -179818 112003 -93064 -116391 6224 -19296 -296901 -76651 -181261
19305 -181261 -235168 -232844 -302585 -1275 -318914 -6841 268615 232784 -193743 247502 51484
19293 -89502 -239490 -38178 -236878 231433 -114807 -28624 -27104 159801 51267 -95470 9088
19281 -223449 -52472 2016 -293427 -193731 190776 -128439 -122204 118372 -18251 -69032 -76932
19270g6932b1068B9862A1045a75498d1377j54167B3468c08192A96108n2249a52623
19258I852a79827e1753q3117F9144b19875r0981c4484m0287C3068a3776q1400
19247i5176A14648b11524c9576r6344f1154l7922l0562K6958j14136k28508a13146
19235A7875J61688g1645j24540L2584E7108a60855d0581A34248c73397c2482D213
19223a05898K7717c7483j38226D7180a06353F8332a50382I9844h3802j1594n589
19212a00985A71311b24784e1310B92099b21317E30749A48376b8238A78985E3290
19201c51564j16153h2576j37918g2077p7833j09205M6729B49080a26540j8046
19191a44586E9822d2046j99096b0598A35057c80435N9338e2264o8099c4912l20097
$$ plain form
19270 -76932 -21068 29862 11045 -175498 -41377 -195544 23468 -308192 196108 143859 -152623
19258 9852 -179827 -51753 -134870 69144 -219875 -310856 -34484 -74771 33068 -13776 -95176
19247 -95176 114648 -211524 -39576 -135920 -61154 -99076 -129638 -102680 -216816 -445324 -113146
19235 17875 179563 -71645 -196185 -163601 57108 -160855 -40581 134248 -373397 -32482 4213
19223 -105898 -78181 -37483 -175709 47180 -106353 68332 -150382 99844 -83802 -95396 -100985
19212 -100985 171311 -224784 -51310 292099 -221317 530749 148376 -28238 178985 53290
19201 -351564 -467717 -82576 -220494 -72077 -149910 -259115 -212386 249080 -126540 -144586
19191 -144586 59822 -42046 -241142 -20598 135057 -380435 -321097 -52264 -120363 -34912 -355009
19180c55009A11803g2611G0666a12215I4713B820Q5620K38966p5540F6740K28711
19169B95451c44959h4554A18320h3216j01492b0966j09935n2639L0855C60811
19158d209C29276h4628l5447l75258a7786k09896J324g1768o2918c1755j72182
19147b03937c6455B1484M92932a02856R012D0190g7573D19385j04476a53635C00066
19135I4022b01334B08137C8973L8382A2955L33520N2805i7533r4658q8789j5372
19124b96352K4644b8480D0633Q9545P4873g6848l27234d5094L511p0866j90254
19113c02703J16067o9771i5673l3657C913b74768O0827A63716i7112o3652I522
19101b29550j60869a72821A24150k9332J00598A2843c65067D0717a54356F2746
$$ plain form
19180 -355009 111803 -72611 70666 -112215 94713 2820 88440 327406 251866 66740 295451
19169 295451 -344959 -84554 118320 -83216 -184708 -20966 -130901 -183540 -152685 360811
19158 -4209 329276 -84628 -120075 -495333 -17786 -227682 -226358 -71768 -134686 -31755 -203937
19147 -203937 -36455 21484 514416 -102856 -93844 40190 -77573 419385 314909 -153635 300066
19135 94022 -201334 208137 38973 77355 12955 346475 399280 -97533 -192191 -280980 -296352
19124 -296352 -271708 -28480 40633 130178 205051 -76848 -404082 -45094 -41583 -112449 -302703
19113 -302703 -186636 -256407 -95673 -129330 3913 -274768 -213941 163716 -97112 -160764 9522
19101 -229550 -390419 -172821 124150 94818 195416 12843 -365067 40717 -154356 62746
19090B6097L9980h9900k0398J9496B8002I804d60010F2633a86064A0879g6289
19078d75433D4316a34629o9137j43672q42R0718H3630J13063b70071B18671c53751
19066A15416b07562r5025a07670m4671p4713g132j75063A34972b26281F6501j3110
19055E3391c73066g5174B06131p4386C1114K08067a02750j10631D5275h7203B06038
19043b75663j78510A418a64460k0243j57451C8601O6913c07873a17682j55093
19033b72775B73368a24657B29789r3117a31746A24388d01678i966F8958p108g6371
19021c00029a29483a0659C94312a19238j72357A25522A4657J90129c51301a31196
19010h0141F3989d2711q1671C44672G195f6766E5211b75567A11032a25451l8193
$$ plain form
19090 26097 66077 -89900 -110298 -90802 28002 9804 -460010 62633 -186064 10879 -76289
19078 -475433 44316 -134629 -203766 -347438 -348280 -257562 83630 196693 -270071 218671 -353751
19066 115416 -207562 -302587 -107670 -152341 -227054 -7132 -182195 134972 -226281 66501 53391
19055 53391 -373066 -75174 206131 131745 31114 239181 -102750 -213381 45275 -87203 206038
19043 -275663 -454173 1418 -164460 -184703 -342154 38601 105514 -307873 -117682 -272775
19033 -272775 273368 -124657 229789 136672 -131746 124388 -401678 -9966 68958 61850 -76371
19021 -300029 -129483 -10659 394312 -119238 -291595 125522 14657 204786 -351301 -131196
19010 -80141 63989 -42711 -124382 344672 7195 -66766 55211 -275567 111032 -125451 -163644
18999a63644B538g662l36576C6529b30549a12203j98079A28384c3754j32847I6308
18987A61339a40819A7146b97129a7757n7864j03569a9107A37252a19018i575H0339
18975b14371h8341B9528d198A86418c0555A22707c973j6061j2067D3170a21844
18963c74620C4046d11575E391j547J76725c91268A46559O9970a30048j11880A14649
18951B45893I2021e4879E4945a53717e6208a4799L040j12917e95G2300c54208
18939A03471K71986b75031C10553j45601J15850k5889E6339r057b91492D2483
18928a31020j02000M8677A97166b16867B2249a51095J4866j12660C75367a3365
18917C20232m1045a77703H2236J74964j07685c08876A93485b36668g7051j4900
$$ plain form
18999 -163644 2538 -7662 -344238 36529 -230549 -112203 -310282 128384 -33754 -166601 96308
18987 161339 -140819 17146 -297129 -17757 -75621 -179190 -19107 137252 -119018 -9575 80339
18975 -214371 -88341 29528 -4198 186418 -30555 122707 -3973 -20034 -32101 43170 -121844
18963 -374620 34046 -411575 5391 3844 180569 -391268 146559 216529 -130048 -241928 114649
18951 245893 92021 -54879 54945 -153717 -56208 -14799 -11759 -124676 -595 72300 -354208
18939 103471 375457 -275031 310553 164952 280802 254913 56339 47282 -291492 42483
18928 -131020 -233020 -184343 197166 -216867 22249 -151095 -136229 -248889 375367 -13365
18917 320232 279187 -177703 82236 257200 149515 -308876 193485 -236668 -77051 -91951
18907i1951a8114B9463a42019p9119f3535n7876B27125i8491j30762B08458c7063
18895A23029B6521a17156q5646g7034j83015F0691c9619q9789A23070h2664j08715
18884a91379A50628a8759n1099b7124o8274K0813n3558j0839G0528B1358a76049
18872a10730m1161A700i9242k2516K5980j16582G2160b01183j3040f3589n17276
18861e80865a46073F0911g4649k20833g9588H7407I705J42612b19456B899O5644
18850F8543a99286j38789G9213J55705a94180B9739L386R1457b24562F4660a89445
18838H1594a56218n9046f0880n541j99592B58456b23620K8890g7214j50869M9752
18827a78331L220F8706K7596k9832B0356a23903A52371m9167b61910B59619M6850
$$ plain form
18907 -91951 -18114 29463 -142019 -221138 -63535 -121411 227125 -98491 -229253 208458 -37063
18895 123029 26521 -117156 -202802 -77034 -260049 60691 -39619 -129408 123070 -82664 -191379
18884 -191379 150628 -18759 -69858 -27124 -95398 -74585 -128143 -138982 70528 21358 -176049
18872 -110730 -151891 1700 -99242 -121758 -95778 -212360 72160 -201183 -214223 -63589 -580865
18861 -580865 -146073 60911 -74649 -295482 -79588 87407 9705 152317 -219456 2899 68543
18850 68543 -199286 -338075 79213 234918 -194180 29739 33125 124582 -224562 64660 -189445
18838 81594 -156218 -215264 -60880 -66421 -266013 258456 -223620 -194730 -77214 -228083 -178331
18827 -178331 -175111 68706 96302 66470 20356 -123903 152371 103204 -261910 259619 306469
18816C06469R971l3236B8622a96899A91202C5432J06728b24524a06705D2748R8670
18805A41418d0994B07227d653D189a84251Q1265c9715k1869A64544d3944r9890
18794a43834B0323L974b39481k52814a65944C30116g992A44342c4150M696A72938
18782A1017a24938j73760E9784a18720e0206p8237C9010b72053K0487B24406J04491
18771C28897b77773i4456l1617L8866o1382e6450I2161g6363a3030m9768H5816
18759a26369m47244a78396A31259n6968N1717B5278N7825c83305a4257k13347
18749b27604j0576A84096b09998k06968B61387a61090b3924l47218G9198k7792
18739E1406g2076A11716R3834i5285j02758O9511k7841N8339B9316J04957c95681
$$ plain form
18816 306469 316440 283204 28622 -196899 191202 35432 142160 -224524 -106705 42748 141418
18805 141418 -40994 207227 -4653 4189 -184251 -102986 -39715 -61584 164544 -43944 -143834
18794 -143834 20323 24297 -239481 -492295 -165944 330116 -7992 144342 -34150 -29454 172938
18782 11017 -124938 -298698 59784 -118720 -50206 -128443 39010 -272053 -251566 224406 328897
18771 328897 -277773 -94456 -126073 -87207 -148589 -56450 92161 -76363 -13030 -62798 85816
18759 -126369 -573613 -178396 131259 74291 126008 25278 83103 -383305 -14257 -227604
18749 -227604 -238180 184096 -209998 -416966 261387 -161090 -23924 -371142 79198 51406
18739 51406 -72076 111716 205550 -95285 -198043 -128532 -156373 -98034 29316 134273 -395681
18727a61997K1062r0412C1444c50407B21274d25483g060r1766L144F2648f5221
18715b59190D08338i8073R490p1229f3650j65160g9464A54082b24804j3096G1871
18703b049l36505f403n54579b5314j18802I9267J87011p5872C7849J47170o0824
18692A24195d7621A53733d16578J41169j25059a51375B475c28547a42648K9676
18682a12972E5155d28320a24224I1554i2512A8771a96669M2438B6410b183A82401
18670c59717B90280b20980M2816A18577b84560A28184g0882C63496H9126J7263
18660A06389c93679a47150A39157a65243A25861m4741a13852J5425M5121m5321
18650i8627E0248d3751C8404b75261R0581P2214E5801c05710b0663A3780a2098
$$ plain form
18727 -161997 -140935 -231347 31444 -350407 221274 -425483 -7060 -98826 -95682 62648 -65221
18715 -259190 408338 -98073 -88583 -159812 -63650 -228810 -79464 154082 -224804 -237900 71871
18703 -2049 -338554 -6403 -560982 -25314 -144116 99267 286278 210406 37849 185019 124195
18692 124195 -47621 153733 -416578 -275409 -400468 -151375 2475 -328547 -142648 -112972
18682 -112972 55155 -428320 -124224 91554 -92512 18771 -196669 -154231 26410 -2183 182401
18670 -359717 290280 -220980 -178164 118577 -284560 128184 -70882 363496 89126 106389
18660 106389 -393679 -147150 139157 -165243 125861 81120 -113852 -98427 -53306 -98627
18650 -98627 50248 -43751 38404 -275261 -184680 -112466 55801 -305710 -20663 13780 -12098
18638a17239o7596B76377q2296G3518b0438A43067a0277I1950m2454J77029b02033
18626A25745b46105B28855a92619d6012I9078b58652J21702O5066k06057A61739
18615a90838j58735J03370R9306m38023a97984j09103J14698G6241a38297B6111
18604i3634o4986f9018A4349a99299b8706a3776F3131O1252b86409e8346A03288
18592f8448C3725N5349J18193b13963A70481G2623a17942k7921a7613j18081n692
18581a41386a4403H9248D0072e74345F9882j2331J8592R6868a49295C2221b19980
18569A4410K0028b2177l52790e1214G0391O3660o6941K6906a54430A36763C0755
18557d7792A41958c14119A33691k7091J89059b45962O4827F8141g8841A34096
$$ plain form
18638 -117239 -184835 276377 194081 73518 -20438 143067 -10277 91950 49496 226525 -202033
18626 125745 -246105 228855 -192619 -46012 99078 -258652 -136950 -71884 -277941 161739
18615 -190838 -349573 -246203 -146897 -584920 -197984 -307087 -192389 76241 -138297 26111
18604 -93634 -158620 -69018 14349 -199299 -28706 -13776 63131 124383 -286409 -58346 103288
18592 -68448 33725 89074 207267 -213963 170481 72623 -117942 -145863 -17613 -135694 -141386
18581 -141386 -14403 89248 40072 -574345 69882 57551 76143 173011 -149295 32221 -219980
18569 14410 34438 -22177 -374967 -51214 70391 134051 67110 94016 -154430 136763 30755
18557 -47792 141958 -314119 133691 106600 295659 -245962 -181135 68141 -78841 134096
18546f1044o0499l16930a54103m3873L1052e2975J1920p1689B1628a79722h9241
18534g4232A65614a76231O6118L3441c5433j60546P0036d9063j24828A65995l9057
18523A26938N5165b53621L3124d0749A03988a08920A55620a53803h285j81694
18513a89979b7231D7149Q7424o2069e6160n0071m3606O7952m2747B85082f4347
18501g8064n6199m9174j35699A22496a11543f285D6816k2943O2864J62606a6141
18489A25245m0073R1413J00354j17990a54143A31500k7399a56902A56251e3695
18478c94074L5435i7822k86209H1056C3507a51202d4972r902k70421h0121j53815
18467b33936c3461E5897L81148b45667A807f7978j68814A43632n8899d1386j50433
$$ plain form
18546 -61044 -121543 -438473 -154103 -197976 -166924 -52975 -41055 -112744 21628 -179722 -89241
18534 -74232 165614 -176231 -110113 -76672 -35433 -195979 -125943 -49063 -173891 165995 126938
18523 126938 182103 -253621 -220497 -40749 103988 -108920 155620 -153803 -8285 -189979
18513 -189979 -27231 47149 134573 72504 -56160 -106231 -149837 -81885 -124632 285082 -64347
18501 -78064 -134263 -183437 -319136 122496 -111543 -6285 46816 23873 86737 249343 -16141
18489 125245 85172 176585 276939 158949 -154143 131500 104101 -156902 156251 -53695
18478 -394074 -358639 -97822 -384031 81056 33507 -151202 -44972 -54874 -325295 -80121 -233936
18467 -233936 -33461 55897 437045 -245667 1807 -67978 -236792 143632 84733 -41386 -191819
18456a91819Q1292C519M74522b55903e3093j32394p247k6984q6094A63822l7633
18445A26189a40614D8452e30911A17391a3814B61439m7099m9243a2557A9423b40527
18433c03200O1496d8200n36345b36500a1095D14849a28144C07704D880a39728
18422a21158j08500O0706I8833P8445i4481o5579J3909i907B8467a82148a6072
18410b80215I3033K00875d8264j6297A04049c54272A63282c18994F9186a91991
18399e4658j51500L8769k8887k73480J90899B64970c47100J27993e5391A81543
18388A43640C7288a39999B5585L03240i6081j14450j01506G471i2475B8303c60498
18376d2084l02622J05421A36123b099j29380A68820L64g7496F0608i6661B06874
$$ plain form
18456 -191819 -110527 3519 478041 -255903 -53093 -185487 -192734 -219718 -305812 163822 126189
18445 126189 -140614 48452 -530911 117391 -13814 261439 214340 165097 -12557 19423 -240527
18433 -303200 -241704 -48200 -584545 -236500 -11095 414849 -128144 307704 4880 -139728
18422 -121158 -229658 -168952 98833 177278 -94481 -160060 -146151 -9907 28467 -182148 -16072
18410 -280215 93033 293908 -48264 -64561 104049 -354272 163282 -318994 69186 -191991
18399 -54658 -206158 -167389 -196276 -469756 -278857 264970 -347100 -219107 -55391 181543
18388 143640 37288 -139999 25585 328825 -96081 -210531 -312037 7471 -92475 28303 -360498
18376 -42084 -344706 -239285 136123 -2099 -131479 168820 169184 -77496 60608 -96661 206874
18364a87543f5596B09297b9350D8230P0119J85628G6871K34978h4928A02188b14384
18352e7923b4585n29288a64660A03868a4026k43244j8236B52932b8194C0424f7749
18340b3131m09435A45050a84768L322I0130C5479M06853A12148a44199e2913F0576
18328A1182h0230B99491A22221J1520a14447d6974j9915k6931o2716C9352A2368
18316a15414K9829j7621d829A09343b31158B04882e126B31462A8086a00256l210
18305a03466C23490d7374l3292j8455B50501q3776b58980a11382l45992f191A63
18293G0886d4209n3410A64940a95446D1493K18743d3289C5171J16950R0060h0779
18281A95339b47663g2637j21508I9522C1503a2280j92331a705H832b43843I1046
$$ plain form
18364 -187543 -65596 209297 -29350 48230 118349 303977 76871 311849 -84928 102188 -214384
18352 -57923 -24585 -553873 -164660 103868 -14026 -257270 -275506 252932 -28194 30424 -67749
18340 -23131 -432566 145050 -184768 -181446 90130 35479 442332 112148 -144199 -52913 60576
18328 11182 -80230 299491 122221 133741 -114447 -46974 -66889 -93820 -156536 39352 12368
18316 -115414 -85585 -103206 -4829 109343 -231158 204882 -5126 231462 18086 -100256 -103466
18305 -103466 323490 -47374 -80666 -99121 250501 166725 -258980 -111382 -457374 -6191 163
18293 70886 -44209 -97619 164940 -195446 41493 260236 -43289 35171 152121 242181 -80779
18281 195339 -247663 -72637 -194145 99522 31503 -12280 -204611 -1705 8832 -243843 91046
18269C84830c26613d7987j11800M0705d1322A58779c86306c4928E4692a21942
18258a14522A31788c05597f8619B79073a50361J6068A02397c47768C9969e4002
18247f971k31821g0045F6696A1192a29639C23613A51219h2368o3175c245B96302
18235a74019e8135k4763C1b53838J17535B8866b26711P0289a1409j87866A31217
18223E2507J10663h9935A30309d11096a11995G0825O967P2573B5468J68364c70840
18211a49859k1470B9002K30575b00502A56588b30296Q4149O2129j11343D4324
18200b2548A87526i1320o7981E0184a25819F8120d40909a31239N3186a4263j64213
18189a78476D0137M0336J2830K46687a94927M5511I660O030i344j4220m2287j47767
$$ plain form
18269 384830 -326613 -47987 -159787 -119082 -41322 158779 -386306 -34928 54692 -121942
18258 -114522 131788 -305597 -68619 279073 -150361 -134293 102397 -347768 39969 -54002
18247 -6971 -238792 -70045 66696 11192 -129639 323613 151219 -82368 -145543 -3245 296302
18235 -174019 -58135 -82898 31 -253838 -136303 28866 -226711 -156422 -11409 -199275 131217
18223 52507 163170 -89935 130309 -411096 -111995 70825 77792 150365 25468 193832 -370840
18211 -149859 -171329 29002 259577 -200502 156588 -230296 -146147 -84018 -195361 44324
18200 -22548 187526 -91320 -159301 50184 -125819 68120 -440909 -131239 -78053 -14263 -178476
18189 -178476 40137 80473 93303 339990 -194927 -149416 9660 15690 -9344 -23564 -65851 -213618
18177b13618D700e6619A55807j6235N8603b23128A29010c54444A58553b6556F4022
18165c2163l69356f2428q1366m7272A3431J31148c1598j88255O8436E226a06316
18153c42962P9169Q7168h8222C7810Q6088a28333H2668a359p8328A58516a3423
18141c8242A46366c153C25881A00371b53543j604g2746B47751b38068G0619b16954
18129A55583o2778c4389A97195G2245e2808A89240b0377B5962P6978a93254j1334
18118b04588C63214c23307g5208I5644b72626J23531o9690g28l31461c2511D0141
18106D8999L8628j6688a57577p012B4038c75342M6002i3272j77353G6191o115
18095G0076K7396B5357a33891M8808G0497K25085f0569B7576a23848c3063A60549
$$ plain form
18177 -213618 4700 -56619 155807 139572 198175 -223128 129010 -354444 158553 -26556 64022
18165 -32163 -401519 -62428 -143794 -191066 13431 144579 -31598 -219853 -151417 5226 -106316
18153 -342962 -263793 -176625 -88222 37810 123898 -128333 82668 -1359 -79687 158516 -13423
18141 -38242 146366 -3153 325881 100371 -253543 -255147 -72746 247751 -238068 70619 -216954
18129 155583 92805 -34389 197195 72245 -52808 189240 -20377 25962 102940 -193254 -204588
18118 -204588 363214 -323307 -75208 95644 -272626 -149095 -218785 -728 -332189 -32511 40141
18106 48999 87627 70939 -157577 -164589 24038 -375342 -329340 -93272 -270625 76191 70076
18095 70076 97472 25357 -133891 -85083 70497 295582 -60569 27576 -123848 -33063 160549
18083c70618a21254K7534D00659C5632O4276K39409f5784A69633b21626A41616
18072B30550e1894I3281a5546l6082D1942b9888E8684d5666m956l26684B1836
18060a18431j3412A4301R1594a66024B47908I60J19908A7598Q7588c12163D4504
18048c2024k69557J1183B20249o6312e8460A61827d5192A01108J8084c03591i0866
18036g4169E9734B8271h8463k31092a32891f227r721A42575e2304l24204d8844
18024i0150A8612c50490A65664i811A1571d0891C8788a23969E7407J24774a22525
18012i9336B05059p4972a83653L7227C6281J56486h210A2882c2815I4011C3966
18000C56383C0639a9982k18222B13805A05338J56021a02047c5789D36229a8718
$$ plain form
18083 -370618 -121254 -93720 400659 35632 99908 339317 -65784 169633 -221626 141616
18072 230550 -51894 93281 -15546 -51628 41942 -29888 58684 -45666 -50622 -377306 21836
18060 -118431 -131843 14301 105895 -166024 247908 960 120868 17598 105186 -312163 44504
18048 -32024 -301581 -290398 220249 153937 -58460 161827 -45192 101108 119192 -303591 -90866
18036 -74169 59734 28271 -88463 -319555 -132891 -6227 -15948 142575 -52304 -376508 -48844
18024 -90150 18612 -350490 165664 -9811 11571 -40891 38788 -123969 57407 182181 -122525
18012 -99336 205059 130087 -183653 -146426 36281 192767 -8210 12882 -32815 94011 33966
18000 356383 30639 -19982 -238204 213805 105338 261359 -102047 -35789 436229 -18718
17989A31855M1877o898d57865G6583i7931r7783r8134A9654K31338a85502A0970
17977a43990d1491k088m7918k54932Q2243E5839c5348j09251q3058c2560k01931
17966b34491a12664N2014C5896a13007e6055r189D31290A55675c35628a47264
17955A85675f3555F6758J98747D3196d6933k93411J63730k5283L840H5490J57095
17944B42585l1960i9676I4937O9443o6133m4152g381A9948K51160a63173L4130
17933a29043q1235J8683L6268C66524d8281j00247j82368G833f8056p1487j42387
17922b81930B91038A36173a47150o3141B01649K510E75f0469B53195c7061D6510
17910i7474A28460a38314C18028j25900b8844k7831j24946A19160i399D76199
$$ plain form
17989 131855 173732 166834 -457865 76583 -97931 -195714 -293848 19654 250992 -185502 10970
17977 -143990 -41491 -43579 -91497 -346429 -264186 55839 -35348 -144599 -227657 -32560 -234491
17966 -234491 -112664 -60650 35896 -113007 -56055 -65244 431290 155675 -335628 -147264
17955 185675 -63555 66758 265505 43196 -46933 -340344 -176614 -201897 -198057 85490 242585
17944 242585 210625 -99676 94937 164380 98247 54095 -7381 19948 271108 -163173 -129043
17933 -129043 -210278 -191595 -155327 366524 -48281 -148528 -330896 7833 -68056 -139543 -281930
17922 -281930 291038 136173 -147150 -210291 201649 204159 575 -60469 253195 -37061 46510
17910 -97474 128460 -138314 318028 192128 -28844 -56675 -181621 119160 -9399 476199
17899A00586m6028a44686J7767A46039a98878m7477K0913G8551a68689C91724
17888a01994j17352k5440a8866k55063a20186C06268H9334I022a64462J255A46200
17876d2537D0028a85451g5694G391P8175c68734C1282J32248l5854F1891A3992
17864d02605E4316c6107m3395k91961G1144R1295n2803M0706J35980A3499h4573
17852a39872A728K79706i233A06119b02411k14591C4597K5347a66515o8312A8845
17840b08241g322A18523l6589C7966p900b60698a8759A6819a51165B75904F754
17828f6939k28351i3118M0858B53508o1006J31067C5803R2959d3917G4347a0339
17816b61625h7209B05504c3161k06237a809j46191C05481A10710d23542F12657
$$ plain form
17899 100586 54558 -144686 -126919 146039 -198878 -246355 -225442 78551 -168689 391724
17888 -101994 -219346 -244786 -18866 -273929 -120186 306268 89334 9022 -164462 -163207 146200
17876 -42537 40028 -185451 -75694 7391 85566 -368734 31282 163530 127676 61891 13992
17864 -402605 54316 -36107 -79502 -371463 71144 162439 109636 150342 286322 13499 -84573
17852 -139872 1728 281434 -9233 106119 -202411 -417002 34597 59944 -166515 -234827 18845
17840 -208241 -7322 118523 81934 37966 30066 -260698 -18759 16819 -151165 275904 6754
17828 -66939 -295290 -93118 -52260 253508 192502 323569 35803 128762 -43917 74347 -10339
17816 -261625 -87209 205504 -33161 -239398 -1809 -148000 305481 110710 -423542 612657
17805a38609C67818g8227C33354A33845b98008B5430c10580B54161F1910h2039
17794A30858j9954a21535K2884B5813a9563n3771H5322J96603A09219J53765g4496
17782c79586I0679j9394O7704o3161a9820A65085R2968h6419A16729a68622G6059
17770C32714E1199c1456j03545H0032f780A19575L02925D6278J52286c2404A75775
17758a45773j58309i9337m5897A15448c14911A11486k1495a42950B73451a61253
17747a52479a5036c79j23885m4476I5883a91627B51268r5800p1030a81032B4937
17735a43414B32730C946a45866c4674A07593a46879k65870a07287j55432h4475
17724A29633r133b64083d2622A23892f5657J7612B86585a16709d1372j29796J8109
$$ plain form
17805 -138609 367818 -78227 333354 133845 -298008 25430 -310580 254161 61910 -82039
17794 130858 110904 -121535 -98651 25813 -19563 -73334 85322 281925 109219 262984 -74496
17782 -379586 90679 71285 138989 75828 -19820 165085 258053 -86419 116729 -168622 76059
17770 332714 51199 -31456 -135001 80032 -6780 119575 422500 46278 198564 -32404 175775
17758 -145773 -304082 -99337 -145234 115448 -314911 111486 89991 -142950 273451 -161253
17747 -152479 -15036 -379 -124264 -168740 95883 -191627 251268 155468 84438 -181032 24937
17735 -143414 232730 3946 -145866 -34674 107593 -146879 -412749 -107287 -262719 -84475
17724 129633 120500 -264083 -42622 123892 -65657 -48045 286585 -116709 -41372 -171168 -153059
17713a53059A6436e50411a14790J5617A30746J3994c3373l67844C59983F9856
17702A05789a07571k3152B1624a4343A6651Q0404a15833K1381G1152b88261a19002
17690A494b2523k77242a00925A63717b30842d1998j03696G8525M0085m0829M4336
17679A22117n2035K68537I0624f6665B14020f3289B52576b2209A13047a58308
17668C5077Q0037J92a29742A66329n5967Q0705r2385m6488b30516A24728b9579
17656A51211J13594G4631c05319J34503B46217f9282A83165A3692d941q2927m03418
17645d91286a59812E2202N2718C9411J0665d655A34163D8805K03145J28463f2697
17633b12160f869j12900B12339D4500i6702A12664b61210A5914b12A66814c6319
$$ plain form
17713 -153059 16436 -550411 -114790 -99173 130746 144740 -33373 -401217 359983 69856
17702 105789 -107571 -130723 21624 -14343 16651 97055 -115833 -94452 71152 -288261 -119002
17690 1494 -22523 -299765 -100925 163717 -230842 -41998 -145694 78525 118610 77781 122117
17679 122117 70082 338619 90624 -66665 214020 -63289 252576 -22209 113047 -158308
17668 35077 115114 115306 -129742 166329 110362 191067 98682 52194 -230516 124728 -29579
17656 151211 264805 74631 -305319 -170816 246217 -69282 183165 13692 -4941 -87868 -491286
17645 -491286 -159812 52202 104920 39411 50076 -4655 134163 48805 251950 380413 -62697
17633 -212160 -6869 -119769 212339 44500 -96702 112664 -261210 15914 -212 166814 -36319
17621A42448b33824D1663b42791f1243p7080k7564M4627A98220a20521B88560
17610D03350A38379a45986e7373B13343a24286A03792a91680B26631G0905K897
17600G3802A6127a20606A6355J39447G4880e2028k06646f8886D1422f6856G4913
17588d8607A80336n6312d9391k3870C05725d04990A73872a26022G2648N6454k351
17577A26751P6351k4977Q2936C3557a48583G8690J06465b45094A32244j1423B5200
17565B18884B9241J85993D1808b4329p133E5996a16427J9007a3785k0944A04698
17553b33570j7787C98751G7405J11047r3163J36794m0599J49275A41452l0040
17543A11412G602K59544H4592a72025F7353A0630a08976B38513a88915A37239
$$ plain form
17621 142448 -233824 41663 -242791 -61243 -138323 -165887 -121260 198220 -120521 288560
17610 403350 138379 -145986 -57373 213343 -124286 103792 -191680 226631 70905 73802
17600 73802 16127 -120606 16355 155802 74880 -52028 -258674 -68886 41422 -66856 74913
17588 -48607 180336 124024 -49391 -73261 305725 -404990 173872 -126022 72648 129102 126751
17577 126751 203102 178125 261061 33557 -148583 78690 185155 -245094 132244 120821 25200
17565 218884 29241 215234 41808 -24329 -31462 55996 -116427 -97420 -13785 -34729 104698
17553 -233570 -251357 398751 77405 188452 95289 232083 191484 340759 141452 111412
17543 111412 7602 267146 84592 -172025 67353 10630 -108976 238513 -188915 137239
17532A02844a68336k147B81358b74003D47654g7625K865k8412A6258a08269D28461
17520B25641J47928A13136m3617c34427a13264L2178n2854D01982A11002f03A23368
17508b27201d9336a479A8243J15004L20222G2310c36784I9214b25965E8484K49122
17497C07606a29758M8257C38958C4497J01198o1766c4469A79914j4080B1609K47572
17486B69181E2444I361g6004B28169l0428G2229J23392o6441K36908J73914i7644
17474E0218a3888k7762A71481j8308L1194f0824B52495P4951j2237p6231a46302
17462C94834A48745O8653l8085M02911k82817F9045O25285B05232D3400J94665
17452B38065D9074J50110J24910e7206A58222Q1233o8402c3702B33130C1675K94615
$$ plain form
17532 102844 -168336 -170483 281358 -274003 447654 -77625 -74760 -103172 16258 -108269 428461
17520 225641 373569 113136 69519 -334427 -113264 -81086 -133940 401982 111002 -603 123368
17508 -227201 -49336 -1479 18243 133247 453469 72310 -336784 99214 -225965 58484 307606
17497 307606 -129758 -81501 338958 34497 135695 73929 -34469 179914 165834 21609 269181
17486 269181 52444 9361 -76004 228169 197741 72229 195621 129180 366088 540002 -97644
17474 50218 -13888 -41650 171481 153173 184367 -60824 252495 327446 315209 238978 -146302
17462 394834 148745 217398 179313 582224 299407 69045 694330 205232 43400 238065
17452 238065 49074 199184 324094 -57206 158222 239455 171053 -33702 233130 31675 326290
17441C26290j37995H1844L34471M8183G5591L2993B0129L00414R3606B06382j4200
17430A92182J21865j055j06649I7792J29832J12880q7471k4803O1135j9765j9117
17419B50483b17137D32785k13927J77285j91120J86891C7281J28603p9574b02193
17408A28961K45191P547F5470K29154a18448H5540B8213M2975J80856B2025a14914
17396C31662N3997E7148K39627r0169j01092A9490a98854b5560A06457M3966D0471
17384B07819q2946a30458I7031K54176K9366a2385C91171A52287N5974D8889J41763
17373A90652a77893D9257J96260j06400O8338R6683A07504g7328B32777l3242
17363A99535A1756J26415B680J847K07630K53849A02442M906d71482c4833B70602
$$ plain form
17441 326290 188295 81844 416315 464498 75591 108584 20129 320543 414149 206382 192182
17430 192182 314047 312992 206343 97792 227624 340504 253033 228230 289365 269600 250483
17419 250483 -217137 432785 218858 396143 205023 391914 37281 165884 86310 -202193
17408 128961 374152 381699 65470 294624 -118448 85540 28213 71188 252044 22025 -114914
17396 331662 385659 57148 296775 206606 105514 19490 -198854 -25560 106457 150423 40471
17384 207819 124873 -130458 97031 351207 380573 -12385 391171 152287 208261 48889 190652
17373 190652 -177893 49257 245517 139117 207455 304138 107504 -77328 232777 199535
17363 199535 11756 138171 2680 4527 212157 466006 102442 107348 -471482 -34833 270602
17351c3948B64797I2575L72084j84140d9547B46615D3642K2389a69085A76591
17340B65642A13181K88490N8472B16006p1094b20473G6708n6K28458F7891K91019
17329C58910E846J80426H7894A7885L41019h5057A07645m9480K74445e6571B47070
17317I6580L11344C6886J01122a16360B08518p8815n5572J04758a22745B58509
17306f6259A31460J7163L40423B18440Q8351d8445B3139M53219c0988H8004a3772
17294C44355a77340f0394q611B25855L36433f4832A61385C8314K08944a00740
17283A28215m2832j9220L3275J61319b5392D0872K97879I1553J73198F5882d66242
17271C36433i0248A76896L5265k7183R5320e8612A060a27408C00405J1286A9292
$$ plain form
17351 -33948 264797 92575 464659 280519 -49547 246615 43642 66031 -169085 176591
17340 265642 113181 401671 460143 216006 144912 -220473 76708 76652 305110 67891 358910
17329 358910 5846 186272 87894 17885 358904 -85057 107645 58165 332610 -56571 247070
17317 96580 407924 36886 138008 -116360 208518 129703 74131 178889 -122745 258509
17306 -66259 131460 148623 489046 218440 306791 -48445 23139 476358 -30988 88004 -13772
17294 344355 -177340 -60394 -69005 225855 562288 -64832 161385 38314 247258 -100740
17283 128215 85383 66163 99438 260757 -25392 40872 338751 91553 264751 65882 -466242
17271 336433 -90248 176896 212161 184978 280298 -58612 1060 -127408 300405 311691 19292
17259C88806I5938M5462k4043D0690J57939J01298n2851B7640K57240j3263G2200
17247A45170J41265K034j23383E1338g4915B77168r7994a29438A99440j842K03446
17236D01044c4280B75801o4057l4566J46461o5824I9894m4281b37490c0470A01502
17224G3958l3043K34924J22854A62629k4714q228P6909K62061q7503A38769Q9168
17213B27937K278p1341N0456K02167A34948K08544j13163K1204a02519B86471
17202c7583A57599k3690J09825Q7939N548j05283N9242E0785k1700K94865A33229
17190C02804J820A6731L79855J27556A40238O3635k6987L58218j67493A39400
17179f7055B36614K44447C9459P8259K78450j32932N7512G6189J69348C4066K46926
$$ plain form
17259 388806 95938 141400 117357 40690 198629 299927 247076 27640 284880 271617 72200
17247 145170 286435 288469 165086 51338 -74915 277168 179174 -129438 199440 197598 401044
17236 401044 -34280 275801 211744 177178 323639 257815 99894 55613 -237490 -30470 101502
17224 73958 40915 275839 398693 162629 137915 129687 206596 468657 381154 138769 227937
17213 227937 230215 158874 209330 411497 134948 343492 230329 251533 -102519 286471
17202 -37583 157599 133909 243734 331673 337221 231938 291180 50785 29085 323950 133229
17190 302804 304624 16731 396586 524142 140238 203873 176886 535104 367611 139400
17179 -67055 236614 481061 39459 117718 396168 263236 320748 76189 245537 34066 280992
17168B80992j15786M7465F4424J23422K58633n0473j73987E0466L52907j47023
17158B56350K38472n1640j63925L28426j66897j10304L9237O1339A42506M57495
17148F00001k87104K36616r959A27926L05597b2287D57416j56552a9892O433B49460
17136B42031K68572B44739O4647N1256h0914A80029J06493q5A24181L87427J93014
17125G04622C14223K35247k7499j8169M8762A51265K58860k0665N65974D54903
17114D53239L3853o7565A70019O1386J00498J56913j67646K24073L9640j51246
17104D33637C7148L98952B07686K26965r1619q0407E4616K51178J62819j00785
17094C67828j56078K63943J68055j40768K03829k03336B49759J16588J8782K49472
$$ plain form
17168 280992 165206 212671 64424 187846 446479 396006 222019 50466 403373 256350
17158 256350 494822 443182 279257 607683 440786 330482 369719 431058 142506 600001
17148 600001 312897 549513 539554 127926 433523 -22287 457416 300864 -19892 -13459 249460
17136 242031 510603 244739 309386 360642 -80914 180029 286522 286437 124181 511608 704622
17125 704622 314223 549470 521971 503802 552564 151265 410125 389460 955434 454903
17114 453239 487092 419527 170019 231405 331903 488816 321170 545243 584883 433637
17104 433637 37148 436100 207686 434651 343032 262625 54616 305794 468613 367828
17094 367828 211750 475693 643748 502980 706809 503473 249759 366347 385129 634601
17084F34601j41263j58920J44958J44750j04670j78236K31148L99082B60923L20535
17074E81458B21026J93653O8066A63937J97926N22232m25146k6890A65146J18822
17064B83968p0457J85269J18672j05032J35354R6562j1696B89400K75968j11313
17054D54055K7387L79294k67533j12018j69171M06587j33406k60290M27409j75262
17044E77052R8439j28518j19096j0321N0818o4606J65706Q6021J44550k80051
17034E19994K5973K54884j06991K02101C21115J90728m3699l9273M22852j02422
17024G49301j41687k54059K15548J78900M9929l41948R8029J62643L612j37934
17014E82334K19073l86456K25592J97251q2539j84773J7616J71449C73296J60466
$$ plain form
17084 634601 493338 334418 479376 624126 519456 341220 572368 971450 260923 581458
17074 581458 221026 414679 482745 163937 361863 884095 458949 432059 165146 283968
17064 283968 213511 398780 517452 412420 547774 644336 632640 289400 565368 454055
17054 454055 481442 860736 593203 481185 312014 718601 585195 324905 752314 577052
17044 577052 675491 546973 427877 417556 468374 403768 569474 655495 800045 519994
17034 519994 545967 800851 693860 895961 321115 511843 468144 428871 851723 749301
17024 749301 607614 353555 569103 748003 797932 455984 554013 716656 720268 582334
17014 582334 801407 414951 640543 837794 755255 570482 588098 759547 373296 533762
17004E33762M5457J98027P3367l85542R8026K99614P3958k54780J40850l7032
16994G85707J62052k87078J03146L9974l17689L5859M08926k75639O0323J02061
16984H17642J89232r0460m6129K05078j72580j50143L86491m17579L51896m51940
16974F21508M90069j03791k33676K36615k51974J03989J53674J39953l62756K17717
16964A011328R119j72852L287N5420K84259l47183K5703k09691L08713l6647J89043
16953A120499k38876M28793j40054k07007K19257j32736j16112J32447n4785N16299
16943A527725n30586J43215q811k63319K51796K58123m01714K08791q6706K14452
16933A312966r4112R4087n11592N92435L34251o29510O3905R8130J52392q6847
$$ plain form
17004 533762 579219 777246 850613 465071 563097 862711 936669 681889 822739 785707
16994 785707 947759 660681 763827 803801 486112 521971 930897 655258 715581 817642
16984 817642 1006874 916414 870285 1075363 902783 752640 1139131 721552 1073448 621508
16974 621508 1111577 1007786 774110 1010725 758751 862740 1016414 1156367 793611 1011328
16964 1011328 1020447 847595 850882 906302 1190561 843378 869081 659390 968103 931456 1120499
16953 1120499 881623 1310416 1170362 963355 1182612 1049876 933764 1066211 1011426 1527725
16943 1527725 997139 1140354 1131543 868224 1120020 1378143 976429 1185220 1098514 1312966
16933 1312966 1218854 1312941 801349 1393784 1728035 1098525 1162430 1260560 1412952 1326105
16923A326105K69970k17239L21713k45990R559n6094J35778k14344K04775l30421
16913A203812O42863n17331J97601l025k3132Q2384M1802J51462j79792L49173
16903A945817l49681J94113j54212J59949j67128M37047k36161p6696K09594K78995
16893B241637j50671j80392Q3344j06372K15564j1416M35134j31271m15040J84309
16883B164826J50323m5955q56k10633P9675J33106j6413L22322j81888Q3759K16836
16872B695102j18843M2191l93312N12309R8992l58610J83000J92058m0074R3549
16862B906362M6369K29960l30170K81848j35924K32719j64032J19602m3903J95402
16852C338233L5348K0850k42605K42879L58005J41520R1437j90866k14221P2972
$$ plain form
16923 1326105 1596075 1378836 1700549 1454559 1464118 1408024 1543802 1329458 1534233 1203812
16913 1203812 1846675 1329344 1526945 1523920 1500788 1583172 1624974 1776436 1596644 1945817
16903 1945817 1596136 1790249 1636037 1795986 1628858 2065905 1829744 1753048 1962642 2241637
16893 2241637 2090966 1910574 1993918 1887546 2103110 2091694 2526828 2395557 1980517 2164826
16883 2164826 2315149 2269194 2268338 2057705 2137380 2270486 2254073 2576395 2394507 2478266 2695102
16872 2695102 2576259 2618450 2225138 2737447 2836439 2477829 2660829 2852887 2812813 2906362
16862 2906362 2952731 3182691 2852521 3134369 2998445 3231164 3067132 3186734 3142831 3338233
16852 3338233 3373581 3394431 3151826 3394705 3752710 3894230 3985667 3794801 3580580 3653552
16842C653552M04513r7873J90376l81103K13627r842K84168M48493n21907K78758
16832D462762J52505K54820k39542Q3758N9885N13278q8639q4819J69006j80767
16822E102247K09125L72078j15237L78192j60120K97272J49803J22924j28654
16813F227630N84374N798j5513J26028k30042M52877L32405j24283N2217M52322
16803G863813L53269O5221N32069m7980L22307K13336K36286L38242k4378K97984
16793A0150169L23482K48878J89504L16980P39373K81364M20827N8288j0910R84016
16783A3701971K56220N42134K24515P33688M32777N35069L56786Q54937J92177
16774A7830274R72604N19531R97043N14141P45497J051238O87781O99315J107075
$$ plain form
16842 3653552 4058065 3960192 4150568 3769465 3983092 3973250 4257418 4705911 4184004 4462762
16832 4462762 4615267 4870087 4630545 4714303 4774188 5287466 5198827 5114008 5283014 5102247
16822 5102247 5311372 5683450 5568213 5946405 5786285 6083557 6233360 6356284 6227630
16813 6227630 6812004 6817802 6802289 6928317 6698275 7151152 7483557 7359274 7411491 7863813
16803 7863813 8217082 8282303 8814372 8766392 9088699 9302035 9538321 9876563 9852185 10150169
16793 10150169 10473651 10722529 10912033 11229013 11968386 12249750 12670577 12728865 12717955 13701971
16783 13701971 13958191 14500325 14724840 15458528 15891305 16426374 16783160 17638097 17830274
16774 17830274 18802878 19322409 20319452 20833593 21579090 22630328 23318109 24017424 25124499
16765B5124499J276652R35109J067175J418595Q46697J368193J782646J725750
16757C5545316J254277K166295J591743J916447K151717J980347K631936K452850
16749E1690928K770895L170221K893178L644209L089425L796360M046237M257194
16741G9358647M496233M983856N104582M738449N760317N763893N803554N501148
16733A21510679O333966N285285N275733M885573M493812L860988K694361K568342
16725A56908739J727463J045673Q2131m14472q24017j583570j638048k240409
16717A53063490k951263k949029l752986l965567m089832m534796m810793n170583
16709A20838641n399921m828195n698982n017816n083717n472286m636847m715542
$$ plain form
16765 25124499 26401151 27336260 28403435 29822030 30668727 32036920 33819566 35545316
16757 35545316 36799593 38965888 40557631 42474078 44625795 46606142 49238078 51690928
16749 51690928 54461823 57632044 60525222 64169431 67258856 71055216 75101453 79358647
16741 79358647 83854880 88838736 93943318 98681767 104442084 110205977 116009531 121510679
16733 121510679 127844645 133129930 138405663 143291236 147785048 151646036 154340397 156908739
16725 156908739 158636202 159681875 159764006 159349534 158525517 156941947 155303899 153063490
16717 153063490 150112227 147163198 143410212 139444645 135354813 130820017 126009224 120838641
16709 120838641 115438720 110610525 104911543 99893727 94810010 89337724 84700877 79985335
16701G9985335m285168m395021l704467m032949l392708l372454l152549k766651
16693E0883368k562927k758676k372442k189189k155735j882297j872476j554499
16685C3535127j529735j039673j480725j735466j082263r51463j416412p87191
16677B3512199o91047j247542p04074q89542q25631m88519m00237q03725j005188
16668A6456694n38763m74013m70106n16632o22433m47862j03110p01577k98568
16659A2283630m51443k36166l97680l67963l56811j2224o28745L6107l00550m20038
16649I148117k91366J57249n52152j12629j62418m69881K29817l09529n30818
16640G106390k3596o02908M52251l38597k27401l13138J49659j84467o2419J20144
$$ plain form
16701 79985335 75700167 71305146 67600679 63567730 60175022 56802568 53650019 50883368
16693 50883368 48320441 45561765 43189323 41000134 38844399 36962102 35089626 33535127
16685 33535127 32005392 30965719 29484994 27749528 26667265 25715802 24299390 23512199
16677 23512199 22821152 21573610 20869536 19979994 19154363 18665844 18265607 17461882 16456694
16668 16456694 15917931 15443918 14973812 14457180 13834747 13386885 13283775 12582198 12283630
16659 12283630 11832187 11596021 11198341 10830378 10473567 10461343 9832598 9868705 9568155 9148117
16649 9148117 8856751 9014000 8461848 8349219 8186801 7716920 7946737 7637208 7106390
16640 7106390 7082794 6479886 6932137 6593540 6366139 6053001 6202660 6018193 5955774 6075918
16630F075918l89716p3299j05972k83661p4940q4243j77741j54320j34850M03645
16620E000821n46569P2825k63547K98417m01979k25692p2507r6529p3245M19114
16610D111109l45848j1865r3052k25623l44602J64004J20686q4191j47132O2191
16600C205677k06982J61423m50648Q0670L53083m90821j06191L72295l76454j85561
16590B356491K23896j56569j34653M15811k67255m04445M53016k8609j50306j51859
16580B155518J35761O9456l04415K00346k05048j82923J94682k93361L25209k14136
16570A881089N01565o27627K0167Q4611j18639J55492L987k53921J83800m04050
16560A426474R3583J55124q7236q607O7184l5118L53909n50045J8486K29978m6123
$$ plain form
16630 6075918 5686202 5612903 5506931 5223270 5148330 5064087 4886346 4732026 4597176 5000821
16620 5000821 4454252 4527077 4263530 4561947 4159968 3934276 3861769 3765240 3691995 4111109
16610 4111109 3765261 3753396 3660344 3434721 3090119 3254123 3374809 3290618 3143486 3205677
16600 3205677 2998695 3160118 2709470 2790140 3143223 2652402 2546211 2918506 2542052 2356491
16590 2356491 2580387 2423818 2289165 2704976 2437721 2033276 2486292 2457683 2307377 2155518
16580 2155518 2291279 2360735 2056320 2256666 2051618 1868695 2063377 1770016 2095225 1881089
16570 1881089 2382654 1755027 1775194 1859805 1741166 1896658 1900645 1646724 1830524 1426474
16560 1426474 1520057 1675181 1587945 1579338 1646522 1611404 1965313 1415268 1433754 1663732 1617609
16549A617609j06394O6187N7877P790l71309K20315k96266M9276J59126k10447
16539A193764j5411K26870J61019n73507J30747l5401R9837j91776K9379M28482
16529A454003l35333j87584K78659r5961J5405J03259q9801K3968k48761L780
16519I21634M6770k52696J75502N1095J3849m5351J09630k14830N7197O4154r5387
16508H31567P3794J63627J53518n34492j75711J40981j21228L82735k3590j36297
16498G54904J96927j96626K84620j62170p8732C93448L21416Q8961k22779J95213
16488G76259p4196j06736j48300M04987j12051l6960J9794M1214o9077k03370
16478D91564K98744n9801k36039K37659l49712L45243l08054M47418j01952n4012
$$ plain form
16549 1617609 1511215 1577402 1635279 1643069 1271760 1492075 1195809 1245085 1404211 1193764
16539 1193764 1178353 1405223 1566242 992735 1123482 1088081 1187918 996142 1025521 1454003
16529 1454003 1118670 931086 1209745 1113784 1129189 1232448 1142647 1166615 917854 921634
16519 921634 968404 715708 891210 942305 956154 910803 1020433 805603 862800 926954 831567
16508 831567 905361 1068988 1222506 688014 512303 653284 532056 914791 891201 754904
16498 754904 951831 755205 1039825 877655 798923 393448 714864 803825 581046 776259
16488 776259 702063 595327 447027 852014 739963 703003 722797 764011 694934 491564
16478 491564 790308 730507 494468 732127 382415 727658 419604 867022 765070 711058
16468G11058B85340M98658C62967J90933J10729P7880L944j18906k11112K44530
16458F60965j06233J26004j57950J31242J19990j50085J2365n4074j08221r7644
16448C76359J88458P7721J8619k45917l8703J57903n4488P6235R0630k45341o0229
16437C41247K0399I3834M42171j18281M9086j09321p421R5144P9705q3988k0674
16426D20255j22706J98287J86838B95413o5121M13509A36673K77407Q9439D5068
16415D44619A40831M93652j63627K47545B35534a01594A43295K31958m3805A48940
16404B2429J51481K54756j84263l6793P8018J24276P8127o0176j85651M65670
16394G07874B04713P8483n7090L61037K01586l45315j89932k1508O87164B55947
$$ plain form
16468 711058 285340 783998 362967 553900 664629 742509 746453 627547 416435 660965
16458 660965 554732 680736 522786 654028 774018 623933 636298 582224 474003 376359
16448 376359 564817 642538 661157 415240 376537 534440 479952 556187 646817 401476 341247
16437 341247 361646 93834 536005 417724 466810 357489 350068 445212 524917 440929 420255
16426 420255 297549 495836 682674 295413 230292 643801 136673 414080 503519 45068
16415 444619 140831 634483 470856 718401 235534 -101594 143295 375253 331448 148940
16404 22429 173910 428666 244403 207610 285628 409904 488031 427855 242204 707874
16394 707874 204713 283196 226106 587143 788729 443414 253482 231974 919138 255947
16383A92140R7318j32894K74311p0030J0761j76489J03218d8240E16981B57484
16372D82774a31159B83715A3197J66561J33903D2460K96648q6352N6458q0845
16362B28369O5493G7603K79570F7139J57731b7908F4187L20370j13744H8855l5338
16351E3517J33169M3808K65887k45782a34698C1672N3541K54555j26079B4885
16340B52174a25726B12808l4414p3419a5389A36861a1481C37273A23879L29813
16330D53692A41089n7068J97991j06671b3021q546C61401a63706B68041I6965
16319D8454L4384K39814A7129M57863j91206r7081h4802a839B79398A02657N9444
16308A62101k5483a5798C85302H2868R6748M4899n5197G8649J20703j5598l3557
$$ plain form
16383 192140 289458 156564 430875 360845 371606 195117 298335 -48240 516981 257484
16372 482774 -131159 283715 13197 179758 313661 42460 339108 252756 309214 228369
16362 228369 293862 77603 357173 67139 224870 -27908 64187 384557 270813 88855 53517
16351 53517 186686 230494 496381 250599 -134698 31672 85213 339768 213689 24885
16340 252174 -125726 212808 178394 104975 -15389 136861 -11481 337273 123879 453692
16330 453692 141089 84021 282012 175341 -23021 -31567 361401 -163706 268041 96965
16319 48454 82838 322652 17129 474992 283786 186705 -84802 -1839 279398 102657 162101
16308 162101 136618 -15798 385302 82868 179616 224515 169318 78649 199352 183754 150197
16297A50197a08904B16225j6497K2760E7594L1366L0702d3740B66550J10989c27675
16285C74433A3282d2487j16880j02337k7791E07807A73474K1773N8113e2691A43219
16273D45553A11947m6999B9671K9633K31437K062a27075F9468B3194J12378E5557
16261A74546b00681H3673J75059n7332K71236i5762B92203N6123b79201D7935
16250a27529F9590f7829C18240c7895m43914a05326B87984q6692a02340A7445
16239B29918C9214J57288E0600j2254K58901A11378C3206b2798A36772J89862
16229C26634B0808K1883b07340C77787a72136B31276I2294B0577e4373C6891h0964
16217B63249b02279A41769m3918K42467A31035C9721J87452A02814h1465a836
$$ plain form
16297 150197 -108904 216225 199728 222488 57594 88960 119662 -43740 266550 377539 -327675
16285 374433 13282 -42487 -159367 -261704 -289495 507807 173474 195247 253360 -52691 143219
16273 445553 111947 64948 29671 59304 290741 292803 -127075 69468 23194 135572 55557
16261 174546 -200681 83673 258732 201400 472636 -95762 292203 348326 -279201 47935
16250 -127529 69590 -67829 318240 -37895 -481809 -105326 287984 201292 -102340 17445
16239 229918 39214 196502 50600 38346 297247 111378 33206 -22798 136772 326634
16229 326634 20808 42691 -207340 377787 -172136 231276 92294 20577 -54373 36891 -80964
16217 263249 -202279 141769 97851 340318 131035 39721 227173 102814 -81465 -1836
16206a06258b0836B70357F2606Q5926l3536f6495A13097g3941C34956d9618j78904
16195b28522A11143a1776m2139G7331C6623a29863A57445a50997A49863J110b55032
16183A95254m4621A1997a94672H5720a5061k34939B12410J01413H9505j5588K9918
16172A03835J08524L0906r5810j6034E3422J97300E9633L11618j64370c90782
16161B4667a18557C3432K12746I9056k0508B6939a40596a1253r9020a8958C50270
16149a12450p4036l127k25395a59324I8871a3710k59497A20334b56791P5347P7203
16138a04241A00492J2115L41495G703f1721r7605M8401e0809Q048D16966a58231
16126B17575A7791J94883a11538m2213C0092J5627c12405A70429a47611m6872
$$ plain form
16206 -106258 -20836 270357 62606 148532 114996 -66495 113097 -73941 334956 -49618 -228522
16195 -228522 111143 -11776 -53915 77331 36623 -129863 157445 -150997 149863 150973 -255032
16183 195254 150633 11997 -194672 85720 -15061 -250000 212410 313823 89505 73917 103835
16172 103835 212359 243265 147455 131421 53422 250722 59633 371251 206881 -390782
16161 24667 -118557 33432 246178 99056 78548 26939 -140596 -11253 -110273 -18958 350270
16149 -112450 -186486 -189613 -415008 -159324 98871 -13710 -273207 120334 -256791 -181444 -104241
16138 -104241 100492 112607 454102 7703 -61721 -159326 -110925 -50809 -42761 416966 -158231
16126 217575 17791 212674 -111538 -153751 30092 45719 -312405 170429 -147611 -194483
16116a94483k60445a76454O8234j88096Q0333I334J26088J69100A41845J7958
16106A59803M1872c78781B92455J03721A93069l6765I097g8873c2949A00626B0459
16094b72893b6487A21934c2519A88316M4594O273a80433e6223L007A29763n1734
16083G8029J74505b62413B30590c3681l85323J55008B6656K24513j17645d0260
16072d27732C56017c14425a46013M7913L0271B12863g811j65050k54625b5473
16061a4705A53532i3934D5082o288N0891d04306A47335c13502a06964I5050K44189
16050C39239a9815D5529h3496c8069j23895A59428b73540C3911c37861d4391F1195
16038B79013a84888B7165K53044B1008a59583A52901c28493f3867A00005a98348
$$ plain form
16116 -194483 -454928 -176454 -108220 -296316 -215983 9334 135422 304522 141845 159803
16106 159803 201675 -378781 292455 396176 193069 156304 9097 -78873 -32949 100626 20459
16094 -272893 -26487 121934 -32519 188316 232910 239183 -180433 -56223 -53216 129763 78029
16083 78029 252534 -262413 230590 -33681 -419004 -263996 26656 251169 133524 -40260
16072 -427732 356017 -314425 -146013 -98100 -67829 212863 -7811 -172861 -427486 -25473
16061 -14705 153532 -93934 45082 38794 89685 -404306 147335 -313502 -106964 95050 339239
16050 339239 -19815 45529 -83496 -38069 -161964 159428 -273540 33911 -337861 -44391 61195
16038 279013 -184888 27165 280209 21008 -159583 152901 -328493 -63867 100005 -198348
16027c97490a23079M3331L1535B25930h2153k06646B91256j40448i1920j8135
16017a10055q465J476j2147E5837c07565a16342h479B59761a90035P4637n3604
16006a69002j06784P9819h9125B53500G392J55371b02562i4483C9975d1053k13744
15995b54797C59542a42860B71507d453D1896M3726e5944k9885q2552A24347E7862
15983H7915a66183n5696C77812O5062A89237A7071J78111O7552a62670G6901e6153
15971A90155g2629j40969K5059I4514m2298J55094b10949G335K62816m6146a40651
15959B41013b3413J0367k9008B84372A3508i7966r0959j4373q5000J39981f2576
15947G105J28430c0509j08687B5829K75837b10860p1697M5530N6345C85100c14493
$$ plain form
16027 -397490 -123079 -79748 -48213 225930 -82153 -288799 291256 150808 -91920 -110055
16017 -110055 -118520 -117044 -129191 55837 -307565 -116342 -8479 259761 -190035 -115398 -169002
16006 -169002 -275786 -195967 -89125 253500 7392 162763 -202562 -94483 39975 -41053 -254797
15995 -254797 359542 -142860 271507 -4453 41896 85622 -55944 -85829 -168381 124347 57862
15983 87915 -166183 -221879 377812 442874 189237 17071 195182 262734 -162670 76901 -56153
15971 190155 -72629 -213598 -188539 94514 52216 207310 -210949 7335 270151 224005 -140651
15959 241013 -23413 -13046 -42054 284372 13508 -97966 -188925 -203298 -288298 -148317 -62576
15947 7105 135535 -30509 -139196 25829 301666 -210860 -282557 -237027 -180682 385100 -314493
15935B5573e2984B23308a81988J946d3k67722A96905m1219h2966r2650a0121B44840
15922A67443b8212b689j57737l1459C2508a3369l5638b3021q4345j74337A73869
15910B83093a05224j24532o366B80535C2936b38447C60837H8871K58875I1006
15899D00209b44921B94989k1699c09332O6430A067a33063A40861D9225c56024
15888b65560p0811P2516j9735G3152b555E2217b45178A10745b51271j4798A87499
15876I654g4119A43389c9845g227n18489B33371g8594C12901c82596C6977i3579
15864a26449n4700B30861b62458A64635a03920j05115R3861F8541c14245c4023
15853c30824a53134A3158L871C46J06931J30361K0015B8863O3936Q0070F5417
$$ plain form
15935 25573 -52984 223308 -181988 -180042 -43 -267765 196905 155686 -82966 -175616 -10121 244840
15922 167443 -28212 -2689 -160426 -191885 32508 -13369 -49007 -23021 -107366 -281703 173869
15910 283093 -105224 -229756 -236122 280535 32936 -238447 360837 88871 347746 91006
15899 400209 -244921 294989 273290 -309332 -242902 1067 -133063 140861 49225 -356024
15888 -265560 -336371 -263855 -283590 73152 -2555 52217 -245178 110745 -251271 -266069 187499
15876 9654 -74119 143389 -39845 -7227 -525716 233371 -78594 312901 -382596 36977 -93579
15864 -126449 -181149 230861 -262458 164635 -103920 -209035 -115174 68541 -314245 -34023
15853 -330824 -153134 13158 17029 346 107277 237638 257653 28863 92799 172869 65417
15841D7175J12239e37884J47857J34996i7874e20j22026M6980l6607D9167d03932
15829A68467b49414H0779d5623I0486c8941j90565C9371a50151L9883n3209Q0474
15818h3003H703f8238k33335j61967B40227d5000c634B10142q2178a90264k38271
15807d28535J22740a34821k86494B41949a07599C74948A6992e775j10817b3682
15796a86767A08361C4260b72452C64710e561k6520j39105B23067h1722j02029
15786a83751A13725a56178b8796l63196a35647l5925c6307B5601a34835O3240
15776g1595B44505I0552k1332a08361j38191A98399C1255a26271K9049k90441
15766c87663I6734k0267b26258i2989A203b1896k42458K1373J04258F6769a73373
$$ plain form
15841 47175 159414 -537884 -390027 -255031 -97874 -520 -122546 -75566 -112173 49167 -403932
15829 168467 -249414 80779 -45623 90486 -38941 -229506 39371 -150151 -110268 -163477 -83003
15818 -83003 8703 -68238 -301573 -463540 240227 -45000 -3634 210142 127964 -190264 -428535
15807 -428535 -305795 -134821 -421315 241949 -107599 374948 16992 -5775 -116592 -23682
15796 -186767 108361 34260 -272452 364710 -5561 -32081 -171186 223067 -81722 -183751
15786 -183751 113725 -156178 -28796 -391992 -135647 -171572 -36307 25601 -134835 -71595
15776 -71595 244505 90552 69220 -108361 -246552 198399 31255 -126271 -97222 -387663
15766 -387663 96734 76467 -226258 -92989 1203 -21896 -264354 -242981 -138723 66769 -173373
15754A49546b55824D6198a04017q9825b7469C29551a48607B0965c4148A6578h9931
15742f3762A05559C281c4048I9093e4626l9475a2917k09642C002J79766o3922
15731A18846d6927k05596c9986k94278i5542b2205A67939C8750a78034K800K7379
15720a47855h703l16295N5433D1262O8077D8229a04013B2153a05889o8394I2314
15708A23381k8500c2374C29723a73756k1003l2623A44076h6914k2701B42876g6848
15696F8354b101k35I0285K43423j4045e8605A68631b04793N2911B81228j14449
15685A66779J04958b8332c861l61316D2646h1211A6715J07988c5322o8752C7099
15673A0062a58702A1528a99678d1306A2443Q7554D6415c3312C18746a23338K0433
$$ plain form
15754 149546 -255824 46198 -104017 -193842 -27469 329551 -148607 20965 -34148 16578 -89931
15742 -63762 105559 3281 -34048 99093 -54626 -94101 -12917 -222559 3002 182768 118846
15731 118846 -46927 -252523 -39986 -334264 -95542 -22205 167939 38750 -178034 -175234 -147855
15720 -147855 -8703 -324998 -269565 41262 109339 48229 -104013 22153 -105889 -174283 92314
15708 123381 94881 -32374 329723 -173756 -194759 -227382 144076 -86914 -109615 242876 -76848
15696 68354 -2101 -2336 90285 333708 319663 -58605 168631 -204793 -151882 281228 166779
15685 166779 271737 -28332 -3861 -365177 42646 -81211 16715 124703 -35322 -104074 37099
15673 10062 -158702 11528 -199678 -41306 12443 99997 46415 -33312 318746 -123338 -102905
15662a02905j01447A10647b45456e647H045h9741C37727f8500F6652a42885A38015
15650a93215f8655J6840j14946b4501j41772B31696c2097G8850k1331f3476l1518
15639i4994j32686c1562a699j86477K5964L9705b8990C60300a13262p097l7710
15628a58069j27563e7876H1732c44937E7737K2331b31385c3333m6508j71296R1966
15617a59171n0729B74269r213j2216g2938o983B00628a70134G5621J51666j3826
15606B13461b9491E682J1106N7763b76822J36877N9887j81627A20856a31981A54905
15594a39052j75388P3954G7301b76460J24809l1278G695J94947q7944J36358k9692
15583B21364L1125a68891F9929a4448j7418j64105n5186b3347A11568h9669p8333
$$ plain form
15662 -102905 -204352 110647 -245456 -5647 8045 -89741 337727 -68500 66652 -142885 138015
15650 -193215 -68655 -51815 -166761 -24501 -166273 231696 -32097 78850 57519 -63476 -94994
15639 -94994 -227680 -31562 -1699 -188176 -162212 -122507 -28990 360300 -113262 -120359 -158069
15628 -158069 -285632 -57876 81732 -344937 57737 80068 -231385 -33333 -79841 -251137 -159171
15617 -159171 -209900 274269 265056 252840 -72938 -79921 200628 -170134 75621 227287 213461
15606 213461 -29491 5682 16788 74551 -276822 -139945 -80058 -261685 120856 -131981 154905
15594 -139052 -314440 -240486 77301 -276460 -151651 -182929 7695 202642 114698 251056 221364
15583 221364 252489 -168891 69929 -14448 -31866 -195971 -251157 -23347 111568 -89669 -168002
15572a68002B0359J73936a68083A03404c07439A3159a04852o4987D3854R0100
15562A33954c01181H1965K4538K14005c1985m3441a2881j39254c1890B0623L22517
15551C43140e8785C6351d17939J91980K0294k817f6852K0503J1738D2432g970
15539A3539N4022q706J93148f3991r6402Q209e5234A10680b42778A45797a82514
15527b02683i2561j11602A41904f3236H1106N9546J25269a07712K429A03257f4099
15515D9800L45752j34782b7405l23983B08028J18590f3836F5891a8891D14431
15504C6727J41397c347D5972b5188k7092D23749C2840M7845L09659e6638q9435
15493a46073A45260a47944A8416a8901A69484J47230d4071j78563A23549e5681
$$ plain form
15572 -168002 20359 194295 -168083 103404 -307439 13159 -104852 -169839 43854 133954
15562 133954 -301181 81965 106503 320508 -31985 -75426 -12881 -152135 -31890 20623 343140
15551 343140 -58785 36351 -417939 -225959 -205665 -208482 -66852 -46349 -34611 42432 -7970
15539 13539 67561 58855 252003 -63991 -160393 -152184 -55234 110680 -242778 145797 -182514
15527 -202683 -92561 -204163 141904 -63236 81106 140652 265921 -107712 -105283 103257 -64099
15515 49800 395552 260770 -27405 -351388 208028 326618 -63836 65891 -18891 414431
15504 36727 178124 -3347 45972 -25188 -52280 423749 32840 80685 390344 -56638 -146073
15493 -146073 145260 -147944 18416 -18901 169484 316714 -44071 -222634 123549 -55681
15482a36176a583A26720c5409J0756A22416c81498C18911b55612p8142A00421
15471a14869D403i1679A28628K1213F009L2514a1070m8261j76426c351q4329k93678
15459c81358H3928A7814J10476p847K08551j40848D308J25628e3198j3778A59074
15447C4907h6454A11698E984K20013D4810d61373i4666j14615C09875A01010c04010
15435a40396L2081A10600M94830A17350B8820b00661L6948I4875a63386E6038
15424d9405B97240b58148A29082f0734n1046B12047a05199B6249d10267I2909
15413B19485C7485q683m87N6370c1745J430B00556A9634R5102a7237l33391J30557
15401b20071C527h1185k8994D4732Q6856a40040r5738Q1827A61318G3061d25745
$$ plain form
15482 -136176 -1583 126720 -35409 -24653 122416 -381498 318911 -255612 -333754 100421
15471 -114869 4403 -91679 128628 149841 6009 38523 -11070 -59331 -235757 -3351 -87680 -381358
15459 -381358 83928 17814 128290 120443 328994 188146 4308 129936 -53198 -66976 159074
15447 34907 -86454 111698 5984 225997 44810 -461373 -94666 -209281 309875 101010 -304010
15435 -140396 -108315 110600 605430 117350 28820 -200661 -163713 94875 -163386 56038
15424 -49405 297240 -258148 129082 -60734 -111780 212047 -105199 26249 -410267 92909
15413 219485 37485 28802 28315 84685 -31745 -30315 200556 19634 114736 -17237 -350628 -220071
15401 -220071 3527 -81185 -110179 44732 131588 -140040 -235778 -153951 161318 73061 -425745
15389A0922c5913B3623J79816a37113r4073d109B86957a67260j001B03787b62630
15377i9578l2061j27630R7694B09749D1044g136A40396p776c96915a63397C2301
15365g7726l72222f8324r5182A49919Q8618L9799A6019Q4605J54572A3922Q2586
15354I6508L46941A84079a4357D3227Q2609R6166j0779E8221J1253a26424H2794
15342a33178D50486a71624k83729a24069G4926c7354A24720c6281p5807I359b4089
15330D00029d0023a957B4221a03457L0630o3011D0123b09616I4870R1994K9785
15319B16649q0656a1734G3181c4482A10508l306l0761a52044A76216M0902d9708
15307B04015b7835H066a43480c0645A70735b2616A56269J40433q5975l3792E1425
$$ plain form
15389 10922 -35913 23623 203439 -137113 -231186 -4109 286957 -167260 -168261 203787 -262630
15377 -99578 -131639 -259269 -161575 209749 41044 -7136 140396 132620 -396915 -163397 32301
15365 -77726 -449948 -68324 -163506 149919 238537 278336 16019 100624 255196 13922 96508
15354 96508 443449 184079 -14357 43227 125836 222002 211223 58221 69474 -126424 82794
15342 -133178 450486 -171624 -455353 -124069 74926 -37354 124720 -36281 -112088 9359 -24089
15330 400029 -40023 -1957 24221 -103457 -72827 -135838 40123 -209616 94870 186864 216649
15319 216649 135993 -11734 73181 -34482 110508 107202 76441 -152044 176216 217118 -49708
15307 204015 -27835 8066 -143480 -30645 170735 -22616 156269 296702 210727 176935 51425
15295A0915O7896K22956J7626r5488o8400a8934C21094A37553K45961f6933q0123
15284a47056D29208f0661b0379C03124D2492K97061j39069R8267C4516M1860K95893
15273C72269g3635G9570J19208a15218I7890L6812a2404R94q1654J2321B2313
15261A95529G1655J00345K19831a55709A45585F9582J8947a12651G6891b4891
15250a768A75848n0211N48264l17428M58993K79489R80076l81348l37136K64476
15240A621023C11950A12834J20289a6563B61238A26625J06206m9293d28487B90432
15229c81178E8951J758Q4119E2772O7196J07782q0281a49306C25203A9646Q0439
15218A00085K35184B3030a01652H7048C2363J55844R8516b8304A21023a39134
$$ plain form
15295 10915 78811 301767 319393 223905 155505 -18934 321094 137553 383514 -66933 -147056
15284 -147056 429208 -60661 -20379 303124 42492 339553 200484 298751 34516 76376 372269
15273 372269 -73635 79570 198778 -115218 97890 134702 -12404 -11410 -93064 -80743 22313
15261 195529 71655 172000 391831 -155709 145585 69582 88529 -112651 76891 -24891
15250 -1768 175848 125637 673901 356473 815466 1094955 2075031 1693683 1356547 1621023
15240 1621023 311950 112834 233123 -16563 261238 126625 232831 183538 -428487 290432
15229 -381178 58951 60709 144828 52772 119968 227750 147469 -149306 325203 19646 100085
15218 100085 335269 23030 -101652 87048 32363 188207 286723 -28304 121023 -139134
15207A92518L73773A2411J61854F1077a3884I3462h8766E45316n3708A84522a31724
15195G22J84912l8627g9140B46833A09378l483R2152b55694d5974J8550R354D4428
15182B43388E2566f8886A51418k5675e9703o9571k92I2513M9462f8206F2014M9719
15170A11733L61072b16919g5032q8402A76556m5617m2566J22965c9693F9725K12325
15159B82050A7886K37654i2863o1965A9356E154K22355J22560j16721b86478A09247
15147h1555B32418G7038J03457N6724o5601K15986a8061A53728K81687B5051K27866
15136B52917a07166l399B42232c2087A3434J5064K36134a96361B36775r2433n2647
15125I1695J6499e0316C02287j1914P3946l2654j11627c04349B75314b41601C58375
$$ plain form
15207 192518 566291 12411 174265 61077 -13884 93462 -88766 545316 491608 184522 -131724
15195 722 185634 147007 -79140 246833 109378 105895 198047 -255694 -45974 -27424 -18070 44428
15182 243388 52566 -68886 151418 125743 -59703 -129274 -129566 92513 141975 -68206 62014 111733
15170 111733 472805 -216919 -75032 -163434 176556 130939 88373 211338 -39693 69725 282050
15159 282050 17886 255540 -92863 -154828 19356 5154 227509 350069 233348 -286478 109247
15147 -81555 232418 77038 180495 237219 171618 387604 -18061 153728 435415 25051 252917
15136 252917 -107166 -110565 242232 -32087 13434 28498 264632 -196361 236775 144342 91695
15125 91695 108194 -50316 302287 290373 364319 331665 220038 -304349 275314 -241601 358375
15113A56647P123H703J83078b32412B68392a5698j14604I8302M6868h3307l2486
15102a15793H8697g237C04780o7238m4829H9247l8996a30006A18046j8691J39866
15091B39221c572E1055h809j10676G8274L59424A82862B3186J76234j3184D1767
15079A42571J04222Q9135D9292J63580j8154j7048F6130J38393b4124A94927J99647
15068C94574r2287j34532Q0540O8498j41100a10459A49695J16670M1361j20548
15058A87178q7827L53773A15463J48094h0573a7799C11885j31741d1162C96250
15047E5392K03553J95164j93738g1806A64836b05208A7890K25013q0709p4924
15037H7270B3530J25659R4360K15176k16816J06970A05330L1097A2827L9660k2730
$$ plain form
15113 156647 163770 8703 191781 -232412 268392 -15698 -130302 98302 145170 -83307 -115793
15102 -115793 88697 -7237 304780 237542 192713 89247 50251 -130006 118046 99355 239221
15091 239221 -3572 51055 -8809 -119485 78274 437698 182862 23186 199420 186236 41767
15079 142571 246793 335928 49292 212872 194718 177670 66130 204523 -24124 194927 394574
15068 394574 302287 167755 248295 316793 175693 -110459 149695 266365 307726 187178
15058 187178 99351 453124 115463 263557 -80573 -17799 311885 180144 -41162 396250
15047 55392 258945 454109 260371 -71806 164836 -205208 17890 242903 162194 87270
15037 87270 23530 149189 243549 458725 241909 348879 105330 136427 12827 52487 29757
15026B9757d5080B22667J05483L0663j62537g6190B22226e15B66450j27762J53590
15015B92278j36310J13235K10424j84584A01900J4722J3845L13189o4380q4304
15005B94972n2478j15165J73n1578d4721D07145j7448b24813A41754K12852b07
14993D10204q1544k944q3314E2088L25817E6657K07345R1761A69818p6674l4373
14982E8771J48557C3090J16216J49985H8656d9380B15770k2211n5283K83631j51442
14971B70465m1196O7634k8315j9644K93774k67564j31374J52951M59457l45602
14961D10586j51213F2167J44031R2652J22173r7082j50265L8397K70047B33230
14950E31732k5050A43688J04644K31840j62900A14640M62466A52727R7445M7240
$$ plain form
15026 29757 -45080 222667 328150 358813 196276 -76190 222226 -515 266450 138688 292278
15015 292278 155968 269203 479627 295043 101900 116622 130467 443656 379276 294972
15005 294972 242494 127329 127502 75924 -44721 407145 389697 -224813 141754 354606 -207
14993 410204 328660 325716 242402 52088 377905 56657 264002 355763 169818 93144 58771
14982 58771 207328 33090 149306 299291 88656 -49380 215770 193559 138276 421907 270465
14971 270465 229269 296903 268588 248944 542718 275154 143780 296731 756188 410586
14961 410586 259373 62167 206198 298850 421023 323941 173676 212073 482120 233230
14950 531732 506682 143688 248332 480172 317272 114640 577106 152727 250172 297412
14940B97412n1023k5199n1155P6350A17037J98762b33753C87356q3770J02559
14930D06145j71903p4759n4877M13483A71354K6515K54370j88406E1381N11492
14920E62873j73232a20448F17462H4541K78235K15674B27735n1817K76240A92631
14909D10636N9028I7850M63549j30056j56941j05889K48957j22728j32310n956
14899A56476M5842o6679K35434A03178J90872j6059I7379L47373j74738J57734
14889D27748E7181N61944p0821j49171L4834m7570p9285L22236k93781c5663B65761
14877E07338j2049q9743A90035L96439A64671J85787o0293L87452k9551B92376
14866A57935J90849j5411J74647B36152K23903o9442K43554j86943k145j90051
$$ plain form
14940 297412 246389 221190 170035 246385 117037 315799 -233753 387356 303586 406145
14930 406145 234242 159483 104606 518089 171354 197869 452239 263833 51381 562873
14920 562873 389641 -120448 617462 84541 362776 578450 227735 175918 452158 192631
14909 410636 469664 97850 561399 431343 274402 168513 417470 294742 162432 156476
14899 156476 202318 135639 371073 103178 294050 277991 97379 444752 270014 427748
14889 427748 57181 619125 548304 399133 433967 386397 307112 629348 335567 -35663 265761
14877 507338 495289 405546 190035 586474 164671 350458 290165 677617 648066 292376
14866 157935 348784 333373 508020 236152 460055 390613 634167 447224 445079 255028
14856B55028q3178N2071L54297r3646Q091M0647B58181R2543J07064L84120B57985
14844C97477k857O9430j59412J49460o5426L70716B82651J70033E7324O03692
14834F61016k56106N13599m03810k42890A06197J62924L12655N5562r7226J42510
14824F82622j79093j47486K10323N7942A55637K75628p4925L06317B70870M7840
14814C18710M10729C61716J69737J71971l49455K79066N103k29684J13696K3892
14804E46042j0824M7612K9162j75377K29673l16462L9096J62936J04032C12690
14793G15011j09381k75644J3267J14050J27822I3546M65588Q542B16712J46430
14783C63142K42391k4612M21665A96930L74824j84217Q5583K12973Q2326J56324
$$ plain form
14856 255028 171850 223921 578218 484572 492663 533310 258181 350724 457788 841908 257985
14844 397477 394620 464050 304638 454098 388672 759388 282651 452684 57324 661016
14834 661016 404910 918509 514699 271809 106197 269121 581776 637338 540112 682622
14824 682622 503529 356043 566366 624308 155637 431265 356340 662657 270870 318710
14814 318710 729439 361716 531453 703424 353969 633035 638138 408454 522150 546042
14804 546042 535218 582830 611992 436615 666288 349826 388922 551858 655890 312690
14793 715011 605630 329986 343253 457303 585125 93546 559134 567676 216712 363142
14783 363142 605533 580921 1002586 196930 571754 387537 473120 686093 768419 924743
14773I24743l32914j40628R7491J55872k34611K16129q9042K67504m01442M82690
14763I45792l14074K27605C25381J61624L19376j71256p2925K29524j02848j84711
14753E04165K81801l17517K33733r9831m832K477N4161j13982M81965l3048l81533
14742F07559j14373n4670J86833k04927L42056R2464l3323J54883k10977Q5376
14732H50901q6707A33296M48643L41244N5222j55176J65445n7750j89699q6778
14722F54447K8987O4248J06952K01913m14647L40214O4639k99148k6696j31426
14712E89483k9397M54868P3192l41474J19614P6588l81815K27344K09001K09853
14702A207257r5692j81833j24232j37747J08881j03946j56470N01163l01254O21710
$$ plain form
14773 924743 591829 451201 548692 704564 469953 686082 597040 864544 463102 945792
14763 945792 631718 859323 325381 487005 806381 635125 562200 791724 688876 504165
14753 504165 785966 468449 702182 602351 597519 599996 654157 540175 1022140 989092 607559
14742 607559 493186 438516 625349 420422 762478 854942 821619 976502 765525 850901
14732 850901 764194 133296 581939 923183 978405 823229 988674 930924 741225 654447
14722 654447 683434 747682 854634 1056547 641900 982114 1046753 747605 720909 589483
14712 589483 560086 1014954 1088146 746672 866286 942874 561059 788403 997404 1207257
14702 1207257 1111565 929732 805500 667753 776634 672688 516218 1017381 716127 1337837
14692A337837k43949n09875K65958l38836L24394L0095k615L79856K6689k82510
14682I87044j79411J71053j62710J96710K4889L6732J17637p9628k21754L4165
14672I24727Q5203k65642J82449o8786M1664L84753l48009J10904M7242j30768
14662I63737J83798L1151J70613p1059K24504k32146r8205l18942K8949o2320
14652H20080N50711j58874k8245J63758n3916K27427k74627J62725p9996k75344
14642A053699L35343k3055k0159j04528L5341l8363j02551j8556L46138j03665
14632A359644k08497J64530p464k00958N343K39993l84550L19738N5162K05812
14622A548753m10662K18732k78466M42407l20667K44203J81884p5696K94026l07579
$$ plain form
14692 1337837 1093888 584013 849971 511135 835529 865624 863009 1242865 1269554 987044
14682 987044 807633 978686 815976 1012686 1037575 1074307 1191944 1112316 890562 924727
14672 924727 1009930 744288 926737 857951 899615 1284368 936359 1047263 1094505 963737
14662 963737 1147535 1178686 1349299 1278240 1502744 1270598 1172393 853451 882400 820080
14652 820080 1370791 1211917 1183672 1347430 1293514 1520941 1246314 1409039 1329043 1053699
14642 1053699 1389042 1365987 1345828 1241300 1276641 1238278 1135727 1117171 1463309 1359644
14632 1359644 1151147 1315677 1308213 1107255 1112598 1352591 968041 1287779 1342941 1548753
14622 1548753 1138091 1356823 1078357 1520764 1200097 1444300 1626184 1550488 1844514 1536935
14612A536935q5755P6966O8659j38112L58152l57071J24249j31655J70736o2413
14602A560691J30648O8762j35624J14455k8405m11417L64353J96880j87762K32101
14592A904682o6416m28225O7605P4035N65692J45547k58331j47079J47671O6939
14582B072120n3524K86918k51757k597k59882K1341K47035N3759J88486j89049
14572B112850l6592K16844K92581m14221J14694J48387k32407M85489k17199j52307
14562B318119O43193n37229m8046M01281L40679k28215M99374J421M22797j7034
14552C796340O46110L84662J539850K544923M209750J1544637J5351519n865570
14544C4152221A5183616G165014k636679p86293J26920O33054j941574l48459
$$ plain form
14612 1536935 1451180 1528146 1596805 1458693 1816845 1459774 1584023 1452368 1623104 1560691
14602 1560691 1691339 1760101 1624477 1738932 1710527 1299110 1663463 1860343 1672581 1904682
14592 1904682 1838266 1410041 1477646 1551681 2117373 2262920 2004589 1857510 2005181 2072120
14582 2072120 2018596 2305514 2053757 2051160 1791278 1812619 2059654 2113413 2301899 2112850
14572 2112850 2076258 2293102 2585683 2171462 2286156 2434543 2202136 2687625 2470426 2318119
14562 2318119 2961312 2424083 2376037 2777318 3117997 2889782 3389156 3390577 3813374 3796340
14552 3796340 4442450 4827112 6366962 8911885 13121635 24666272 40017791 34152221
14544 34152221 15183616 7165014 4528335 3742042 3868962 4502016 2560442 2211983
14536B211983j80742l55495J64879J54907k13431N88269m26719K35708O7800k08283
14526B038876J95919L13409j41433K47319k87206j57084K39270q7823j81697L23993
14516B503543R4533K5273l7305L53218k05811J45045L8009L2690k69067O1994
14506B742122K70034k66085J35854L90848k66856J28057O410k42860J88371L15020
14496C400915J13316l57624j29549L13247J19055J5887l05071J6707O79039M084
14486C870006j33828o7044J4705M20537q9271m20741M81322M059r3742q21O4391
14475D049573k1187r2981j7861K14574K7854j1811K38211j88775J11025K79549
14465D588171L14101l69965J26836l24072Q36975k21600Q046P9663Q7074K99085
$$ plain form
14536 2211983 2031241 1675746 1840625 1995532 1782101 2370370 1943651 2179359 2247159 2038876
14526 2038876 2234795 2548204 2406771 2654090 2366884 2209800 2449070 2361247 2179550 2503543
14516 2503543 2598076 2623349 2586044 2939262 2733451 2878496 2916505 2949195 2680128 2742122
14506 2742122 3012156 2746071 2881925 3272773 3005917 3133974 3140384 2897524 3085895 3400915
14496 3400915 3514231 3156607 3027058 3340305 3459360 3475247 3170176 3186883 3865922 3870006
14486 3870006 3736178 3669134 3683839 4104376 4015105 3594364 4075686 4079745 3986003 3985182 4049573
14475 4049573 4028386 3935405 3917544 4132118 4159972 4148161 4386372 4197597 4308622 4588171
14465 4588171 4902272 4532307 4659143 4335071 5172046 4950446 4958492 5038155 5125229 5424314
14455E424314j79921m2445j10051O07393m46258n4051M3289L44388J37662r6641
14445E627679k25641O18553k34474L63263q5091L84038m45586N15530k94279l3112
14435F190880l58082P15358J42693n0004Q1562M10686j19386J10597j05808K9735
14425G048231L08562m8502M19631l12293N77641r610j13486M26852l72542L36484
14415H260968O31169j62608Q3665J15921J45124o494J99354P03095k66477k22684
14405I481033K57115K96462M93558K20270j56937K15844R2110k84988N96037o392
14395A1204112O40688l2416J00689R8856L99459J15008N58605k03484M69055K96330
14385A3646902J3384J18925L94361K55264M18500K11415j4091N64043N6173M75642
$$ plain form
14455 5424314 5244393 5201948 5091897 5699290 5253032 5198981 5242270 5586658 5724320 5627679
14445 5627679 5402038 6020591 5786117 6149380 6064289 6448327 6002741 6518271 6223992 6190880
14435 6190880 5832798 6548156 6690849 6640845 6722407 7133093 7013707 7124304 7018496 7048231
14425 7048231 7356793 7308291 7727922 7415629 7993270 7983660 7870174 8297026 7924484 8260968
14415 8260968 8892137 8729529 8813194 8929115 9074239 9067745 9267099 9970194 9703717 9481033
14405 9481033 9738148 10034610 10528168 10748438 10591501 10807345 10899455 10614467 11210504 11204112
14395 11204112 11844800 11812384 11913073 12011929 12411388 12526396 13085001 12881517 13350572 13646902
14385 13646902 13660286 13779211 14173572 14428836 14847336 15058751 15044660 15608703 15664876 16140518
14375A6140518K25690k4007N35836P54923o7438M67481N31950k9646L75181O21738
14365A9532226Q17539l7551M63158P42161O74571J01041J98113Q43623L05012
14356B3639893P72071K61809O03622Q28287O81605P56011K92135O30721R20886
14347B9387040P72075O85609R07395N03641J022546J012270Q70895O10573J338464
14338C7110508J129673J194729R25481J118697J789844Q62643J166576J379966
14330D6678117J394630K181040J234199J751936J309974K049379J556770K443381
14322F0599426J822793K041922K570767K381173K449298K591897K903455L257326
14314H0618057L059802K983851L186620L699603L946444L662446M443273M559555
$$ plain form
14375 16140518 16366208 16342201 16878037 17632960 17565522 18033003 18564953 18535307 18910488 19532226
14365 19532226 20349765 20312214 20775372 21517533 22192104 22293145 22491258 23334881 23639893
14356 23639893 24411964 24673773 25277395 26105682 26787287 27543298 27835433 28466154 29387040
14347 29387040 30159115 30844724 31752119 32255760 33278306 34290576 35161471 35772044 37110508
14338 37110508 38240181 39434910 40360391 41479088 43268932 44131575 45298151 46678117
14330 46678117 48072747 50253787 51487986 53239922 54549896 56599275 58156045 60599426
14322 60599426 62422219 64464141 67034908 69416081 71865379 74457276 77360731 80618057
14314 80618057 83677859 86661710 89848330 93547933 97494377 101156823 105600096 110159651
14306A10159651M228282N194671N188813N293502N503652O283361O398385P141610
14298A55391927O813752P567379Q270556P966548Q408499R347857R682055R895873
14290B23344446J0282938J0835787J1045082J1717764J1501631J1965411J2185600
14283C02878659J2258751J1961585J2233536J1671048J0975374J0606839R516598
14276C82102390Q648669O588191L683734J101439M50080M00283k434171k160320
14268C98380295r00372l699239o296748q743799r839478j0922116j1539738j2565203
14260C33873602j2709796j3296458j2885089j2451940j2818081j2144144j2187433
14253B45380661j1103168j0994414j0080847r233524r603482r280144q298718
$$ plain form
14306 110159651 114387933 119582604 124771417 130064919 135568571 141851932 148250317 155391927
14298 155391927 162205679 169773058 178043614 186010162 194418661 203766518 213448573 223344446
14290 223344446 233627384 244463171 255508253 267226017 278727648 290693059 302878659
14283 302878659 315137410 327098995 339332531 351003579 361978953 372585792 382102390
14276 382102390 390751059 397339250 401022984 402124423 402574503 402974786 400540615 398380295
14268 398380295 397479923 393780684 387483936 378740137 368900659 357978543 346438805 333873602
14260 333873602 321163806 307867348 294982259 282530319 269712238 257568094 245380661
14253 245380661 234277493 223283079 213202232 203968708 194365226 185085082 176786364
14246A76786364q730176p300514p191904p177876o370479o254706o171205m964396
14238A22625108n230413n011425m324548m725008m245154m104357l333504l302376
14230H8348323l548287l220606l230290k271937l188802k496611k575195k217927
14222F5598668k311560j934488k115398k013634j746819j936189j440120j752945
14214E0347515j392033r85995j577410j808473j313145j378269r47173p66112
14206D0178905p39484j696604j023466j116772r28434m15765p33555p94928j084388
14197C1645509q25263p73774p16102n84510p46942m07160n71457j000375o51430
14188B5368496m89967n76247n18139p06722n24968m48177j54203p25882l02636
$$ plain form
14246 176786364 168056188 160755674 153563770 146385894 140015415 133760709 127589504 122625108
14238 122625108 117394695 112383270 108058722 103333714 99088560 94984203 91650699 88348323
14230 88348323 84800036 81579430 78349140 76077203 72888401 70391790 67816595 65598668
14222 65598668 63287108 61352620 59237222 57223588 55476769 53540580 52100460 50347515
14214 50347515 48955482 47969487 46392077 44583604 43270459 41892190 40945017 40178905
14206 40178905 39439421 37742817 36719351 35602579 34674145 34258380 33524825 32729897 31645509
14197 31645509 30820246 30046472 29330370 28745860 27998918 27591758 27020301 26019926 25368496
14188 25368496 24878529 24302282 23784143 23077421 22552453 22104276 21950073 21224191 20921555
14179B0921555n65680l44122p28585L50214p51615o00034k86599l00687l39116
14170A7355331k44915j84126n21326j16131n85541l05417l21654K75120l08292
14161A5043049o00780k83343l34447p4269j91866l52852k35393k26601k83206
14152A2460292l51408j38532l509l07151J5712n38239L59381p75081K36504m93150
14142A0464819J46852l28327j47572n836m512l13723k62200j77813j87248j48803
14132I035637J15068k20642k8449j62365l25768J30877M5064j32709k6682j08307
14122H321724J06417j025276J72502r095J47532k17293l26201K06923k38257L7113
14112G176089N0932l86398k18955k07081p910K42854k87743j80328K90739k55882
$$ plain form
14179 20921555 20355875 20011753 19283168 19633382 18881767 18281733 17995134 17694447 17355331
14170 17355331 17110416 16926290 16404964 16288833 15703292 15397875 15076221 15351341 15043049
14161 15043049 14442269 14158926 13824479 13750210 13558344 13205492 12970099 12743498 12460292
14152 12460292 12108884 11970352 11966843 11659692 11675404 11137165 11496546 10721465 10957969 10464819
14142 10464819 10611671 10283344 10135772 10129936 10125424 9811701 9549501 9371688 9184440 9035637
14132 9035637 9150705 8930063 8901614 8739249 8413481 8544358 8589422 8456713 8430031 8321724
14122 8321724 8428141 7402865 7575367 7566272 7713804 7496511 7170310 7377233 7138976 7176089
14112 7176089 7227021 6840623 6621668 6414587 6406677 6649531 6361788 6181460 6472199 6216317
14102F216317m8259l11758L23203l90635L11077k88075l38731J60076R1946j61649
14092E563512J62552l17513p0415j90032M20505n05343O9286k30638j07732K09463
14082E003645j14111j46361O246K14708k28407N7770K0703j08798J61533m99570
14072D367358k34084K38444j28785K49813k22217N7723j82805n5577k67423R2466
14062C914913m9269J3081j5745J70520N8317O2823k59908l17178r5365K60624
14052C742813m1339o2782k4821j21781P8762j80260j23578N9319K40046n99964
14042B966415O40478m65741L48118n87888J81271R2554L41333l71588J08041k86808
14032B966185K46835K31426k55705N4612J3593j55313k55549j51191l41229L92091
$$ plain form
14102 6216317 6168058 5856300 6179503 5788868 6099945 5811870 5473139 5633215 5725161 5563512
14092 5563512 5726064 5408551 5338136 5148104 5568609 5063266 5132552 4901914 4794182 5003645
14082 5003645 4889534 4743173 4749419 4964127 4735720 4793490 4814193 4705395 4866928 4367358
14072 4367358 4133274 4371718 4242933 4492746 4270529 4328252 4145447 4089870 3822447 3914913
14062 3914913 3865644 3878725 3862980 4033500 4091817 4154640 3894732 3577554 3482189 3742813
14052 3742813 3701474 3638692 3613871 3492090 3570852 3390592 3267014 3326333 3566379 2966415
14042 2966415 3606893 3141152 3489270 2901382 3082653 3175207 3516540 3144952 3252993 2966185
14032 2966185 3213020 3444446 3188741 3243353 3256946 3101633 2846084 2694893 2353664 2745755
14022B745755J17097k3975l14237l3616J48795k09043j08400L00736k8207m1042
14012B553863n5368Q312j31395K70489l12530P861o663J19064l47641M06632j80017
14001B332607M4851J70836l44865J42412k03312J8687k0879m1922q0200J64030
13991B182245J47899M91066J668476K997012R471949J9307024J085929j6544777
13983B0806823r627949m732604j378515r75080m10037k62975j44108J9219l46260
13974B948514n80548M42612m06080K12448j2311l58050N79754n98717K61698m53780
13964B035540J68665L12897k34831l63079K20969N2148L97872o26875O1326l25518
13954A699114M41314l85848J50683K19146m85359M29766r3550J59824j77583k99351
$$ plain form
14022 2745755 2862852 2838877 2524640 2491024 2639819 2430776 2322376 2623112 2594905 2553863
14012 2553863 2498495 2506807 2375412 2645901 2333371 2341232 2334569 2453633 2105992 2512624 2332607
14001 2332607 2377458 2548294 2203429 2345841 2142529 2161216 2140337 2098415 2018215 2182245
13991 2182245 2330144 2821210 4489686 7486698 16958647 36265671 37351600 20806823
13983 20806823 11178874 6446270 5067755 4092675 3682638 3419663 3275555 3294774 2948514
13974 2948514 2367966 2810578 2404498 2616946 2604635 2246585 2826339 2227622 2489320 2035540
13964 2035540 2204205 2517102 2282271 1919192 2140161 2192309 2590181 1963306 2024632 1699114
13954 1699114 2140428 1754580 1905263 2124409 1639050 2068816 1975266 2135090 1957507 1658156
13944A658156M7887j26007J86638j76522L72566p1763l61381L15914k82033l5915
13934A527540K00926L2800j97299o625O567m15980O61127k46543j34144L69001
13924A797370l50006m7648J57085l58498O45123l72606L6928K77562O7459l51258
13914A501511p6141j55898K87929L7953o0177r6330k766k4829P4001j69638j0262
13903A305353J79078j62973J55801R0513n42100K15633J33871m3437m5285J72555
13893A459009k07307j01451J57722Q9959p8209q7870L3143K30072k05816J02223
13883A391475m15737K76514J14407o0411j51751K88521m32996K5155L58654n08456
13873H85375K35457N35313k74934J21483l15060k84068J78026M57370j34438m69960
$$ plain form
13944 1658156 1706043 1580036 1766674 1590152 1962718 1890955 1529574 1845488 1563455 1527540
13934 1527540 1728466 1761266 1563967 1557342 1563909 1147929 1809056 1562513 1428369 1797370
13924 1797370 1447364 1399716 1556801 1198303 1843426 1470820 1507748 1785310 1852769 1501511
13914 1501511 1425370 1269472 1557401 1595354 1535177 1438847 1436081 1411252 1485253 1315615 1305353
13903 1305353 1484431 1321458 1477259 1567772 1025672 1241305 1375176 1331739 1286454 1459009
13893 1459009 1251702 1150251 1307973 1397932 1319723 1231853 1264996 1495068 1289252 1391475
13883 1391475 975738 1252252 1366659 1306248 1154497 1443018 1010022 1035177 1393831 885375
13873 885375 1120832 1656145 1381211 1502694 1187634 903566 1081592 1538962 1404524 934564
13863I34564K79059k01302J31787k5183k47684K50192p2020m5712K4572J59203
13853A187476j86700J74056K34791o00127P0549K83074K9168n74155K77844K95654
13843A191630l72271j09296K57239o8765J79310O2656k80248j73594o6661k47730
13833C72270Q59241P7290F45492L55106K23165k92840K65502j39177j84426k73580
13823E99242L53386j28649m302O2873j9964Q1659q3142J38366l07545Q4409J66300
13812I42633K06899j57439J10403l02945j43339J67689j99241J08083K30463J42183
13802A105389k02324k23078K40380J48809E31380K30510J43625j6581m519k48598
13792F35817P4779j9643L05930r988j11757l98113J37906L5506j30164O2454K43260
$$ plain form
13863 934564 1213623 1012321 1144108 1118925 871241 1121433 1049413 1003701 1028273 1187476
13853 1187476 1000776 1174832 1409623 809496 880045 1163119 1192287 618132 895976 1191630
13843 1191630 819359 710063 967302 898537 1077847 1140503 860255 686661 620000 372270
13833 372270 1231511 1308801 645492 1000598 1223763 930923 1196425 1057248 872822 599242
13823 599242 952628 823979 819677 882550 862586 944245 861103 999469 691924 776333 942633
13812 942633 1149532 992093 1102496 799551 656212 823901 624660 732743 963206 1105389
13802 1105389 903065 679987 920367 1069176 531380 761890 905515 888934 884415 635817
13792 635817 710596 690953 996883 986895 875138 477025 614931 650437 520273 582727 825987
13781H25987J95537m88881J2329J76241j64761J85438j59433M68775k30096j40600
13771F80536m8710Q0524J29844j3540k05548N2777k014J0718O3579j89664K64296
13760H22798j96904p1812L31548n6278q2036j24886m1721j28389N657L29119l66088
13749D21008L58047l02059K50189j93919B45666L53179O9897j16755N9932j18641
13739D93278j9969j11977J30195J91899R8513C52702L05923J80453o5786r9457
13729F73835M14187B90545K53958l6190L29223k45651k92623K59581m4799L19173
13719H33217C63911M49484k55768J7362N2732K44398k01696K340M9946L32771
13709A055480l59220m7774l6631J24817B40988K25429n1379K05342l2513j87053
$$ plain form
13781 825987 1021524 532643 544972 721213 556452 741890 582457 1051232 821136 680536
13771 680536 631826 712350 842194 828654 623106 675883 673869 684587 748166 558502 822798
13760 822798 625894 554082 885630 829352 747316 622430 580709 452320 457977 787096 421008
13749 421008 779055 476996 727185 533266 245666 598845 668742 551987 611919 493278
13739 493278 473309 361332 491527 683426 781939 352702 658625 839078 773292 673835
13729 673835 1088022 290545 544503 508313 837536 591885 299262 558843 514044 833217
13719 833217 363911 813395 557627 574989 627721 872119 670423 672763 722709 1055480
13709 1055480 696260 648486 611855 736672 240988 466417 415038 620380 587867 400814
13699D00814K36417p3164p2673N0294p368q4362j23906N28671j97291K61235k04293
13688G14374l17787J19874J17737j07946j42883j52156F3624b818H22263j07646
13678G14617o7429J05994n0026k68725J16259j24956L6586j86607K81437j77960
13668C79190L02128l04872m6009R9317j96803F45M66301L17284j51665k53584
13658C78981j32264M21846l11378j02988L42411J6770k64974K61877j3446j97920
13648C98915K03430j55543O3620k28769L69537l13180o5211j28385K97838M3957
13638D86209H3000K47225K20390Q9181j76093k06499N960L83329K53582I1245
13627F16634k0890B95651L47198C19106L18937j52310o2008A63921K17021n5239
$$ plain form
13699 400814 637231 564067 491394 541688 534320 449958 326052 854723 657432 918667 714374
13688 714374 396587 516461 634198 526252 383369 231213 63624 -2818 822263 714617
13678 714617 647188 753182 703156 434431 550690 425734 462320 275713 557150 379190
13668 379190 681318 376446 330437 429754 232951 645 466946 784230 632565 378981
13658 378981 246717 668563 357185 254197 596608 613378 348404 610281 596835 398915
13648 398915 602345 446802 510422 281653 651190 338010 272799 144414 442252 486209
13638 486209 83000 330225 550615 639796 463703 257204 263164 646493 900075 91245
13627 616634 595744 295651 642849 319106 638043 485733 423725 163921 380942 325703
13617C25703m02J89626j15600K3911l4029j08461K8483J3677J25942k22704J28525
13606C54671J07963j11932e1133B69955k4943G0225J97663K97447I989L89556
13596C99545q6141M66749l51900j30517P0754J32865j45187m7711J26162J8377
13586D52996k09501M53201A12746L23840B10008J58583K8051K08052j31633p5431
13576C97630A96525J13929H6593J33753L22385B12189o2378K07299K09261j07560
13566D58811m2964R9017r1652A49721J54876l9152L09249e4710B75627J40669
13556D16296j3164L0448j59116l9195L64111j18778B17706M34093r1091G5405
13545A91146m174L16286J00893A82983m8147R497L00109j02236A66737d7408D65589
$$ plain form
13617 325703 325301 514927 399327 423238 389209 280748 309231 322908 448850 226146 354671
13606 354671 462634 350702 -51133 269955 245012 70225 267888 565335 9989 399545
13596 399545 313404 780153 428253 297736 368490 501355 356168 308457 434619 452996
13586 452996 243495 696696 112746 436586 210008 368591 396642 604694 473061 397630
13576 397630 196525 310454 86593 220346 542731 212189 149811 357110 566371 458811
13566 458811 415847 514864 423212 149721 304597 265445 574694 -54710 275627 416296
13556 416296 403132 433580 274464 235269 599380 480602 217706 651799 560708 75405
13545 191146 186972 503258 604151 182983 134836 144333 444442 342206 166737 -47408 465589
13533B91210I7606a15343E03985A43364P0432K75804A71705N44275l12278M412
13523D08114A55637E3758L29953I1107J38454M43243k99447j06405A6574K41683
13513B58257J31070r8734A20870n9M43265j69860Q5597b3813D74879k03683A21991
13501A74318O1451p8529j6302N0442r1920D3656N27096A05162M0699K04103N3980
13490D03944j95215N1905r9410C0649J48543J65164A52654K87982k10290g1599
13479D2564P7551K43472r7710r6206J1050J03945A35208P9247L2231k1226L6116
13468B61576r3125n2639M75797k73244j38026p2179K41040A71444j5828K0434
13458A76050b09369A84383L4350j2832h960C65809M6115j76659a5147C12896J04767
$$ plain form
13533 291210 97606 -115343 503985 143364 213796 489600 171705 715980 403702 408114
13523 408114 155637 53758 383711 91107 229561 672804 373357 266952 16574 258257
13513 258257 389327 290593 120870 120811 564076 394216 479813 -23813 474879 271196 121991
13501 174318 235769 157240 140938 191380 99460 43656 570752 105162 145861 349964 403944
13490 403944 208729 260634 161224 30649 179192 344356 152654 440636 230346 -71599
13479 42564 120115 363587 265877 169671 180721 284666 135208 214455 246686 225460 261576
13468 261576 168451 115812 591609 318365 180339 108160 349200 171444 155616 176050
13458 176050 -209369 184383 218733 205901 -8960 365809 411924 235265 -15147 312896 417663
13447D17663j96810h0033C7892j0609Q4000m8913K55609A25093J38418J81710
13437D45221C4674g6891A78377j4560o9063K74559A56282m4956L14899F6061b46702
13425a3379q4959A53166K20183N5270J89752k25787A30463b3556j07479A46514
13414B94258r8863g3181D25430A32938J57423m4027l3865J943J1708L51927A57391
13402h0898B65009a97368o2446C22812k4905a6115C36913C6487K19198k038J9474
13391B73121I3429J28177G9561O1969a6995C73881g177r1856A09197N1524J61280
13380C22001A36430J11777K25743F7101J32409L19653i9960C44535r9277M2031
13370B87289Q2311L9032j45204J7284p8894L08283B00397L1662a4207j38642H8575
$$ plain form
13447 417663 220853 -80033 37892 27283 111283 62370 317979 125093 263511 445221
13437 445221 34674 -76891 178377 163817 94754 369313 156282 111326 426225 66061 -246702
13425 -13379 -98338 153166 373349 428619 618371 392584 130463 -23556 -131035 146514
13414 294258 195395 -73181 425430 132938 290361 246334 212469 214412 226120 578047 157391
13402 -80898 265009 -197368 -259814 322812 297907 -16115 336913 36487 255685 253647 273121
13391 273121 93429 221606 79561 141530 -16995 373881 -7177 -99033 109197 160721 322001
13380 322001 136430 248207 473950 67101 199510 519163 -99960 344535 245258 287289
13370 287289 369600 408632 263428 280712 201818 510101 200397 232059 -14207 -152849 88575
13358B60675b13948c8216B67807P9551F4749g0990D10874B02488j1550J45933
13348C36871L9672j35200I2802B3061K06128M4228G2018B9770M44328B9502K00769
13337B30271O018l3971J93772c5781A1856K47032L27505j55153A98981a7066D27254
13325A30832J53219o9059K65086E5279J60414M15783A47219Q6591H1252O1736
13315A42988J14796c6745C41615H6382K09184j06786q3837J24417j5770p7073
13305A36517J23919N00494C42998c13072G7760b5502A389J59607J1844E8277K8310
13294H6587e3257K766H4353C4246J389M32831B32458G1657a92924c3008r7268
13283a30276A15472J54993j1632E3179J79397o556I2972a50186m5697C4993J57779
$$ plain form
13358 260675 -213948 -38216 267807 347358 64749 -70990 410874 202488 190938 336871
13348 336871 376543 241343 92802 23061 229189 273417 72018 29770 474098 29502 230271
13337 230271 236289 202318 396090 -35781 11856 258888 586393 431240 198981 -17066 427254
13325 130832 284051 214992 480078 55279 215693 631476 147219 233810 81252 142988
13315 142988 257784 -36745 341615 86382 295566 188780 104943 229360 213590 136517
13305 136517 260436 760930 342998 -313072 77760 -25502 1389 160996 172840 58277 86587
13294 86587 -53257 -50491 84353 34246 35635 468466 232458 71657 -192924 -33008 -130276
13283 -130276 115472 270465 258833 53179 232576 226020 92972 -150186 -195883 34993 192772
13272A92772a40298B06355H3163J71308B0016K02901D1598b2554k2461B29984
13261A23971e3209D46938A68409C7902a74022d6801b0168B44859r4807E6065a64911
13249C38894p4097G2905k7119N40637h4231C48500E7526R9630K9337a7016C35621
13237A75122J33412d9608e177G8217K73288A62743a28011d7350C06805r7129K94327
13226E04003C1936b16221A37679l3459j8247j8351R7480L4585H9004O266J15389
13215B10659D4055k762K9513J66957o9709b82918A34532L7739H1840K36389F8216
13203A43217C3870J54764f3843j28965B98477r4066G3112c516j03782a9008B16837
13191A5070f9621C03912m0194h5142A49639b2364d375B28237L7027j2500F060
$$ plain form
13272 192772 -140298 206355 83163 254471 20016 222917 41598 -22554 -45015 229984
13261 123971 -53209 446938 168409 37902 -174022 -46801 -20168 244859 150052 56065 -164911
13249 338894 264797 72905 45786 586423 -84231 348500 57526 157156 186493 -17016 335621
13237 175122 308534 -49608 -5177 78217 351505 162743 -128011 -47350 306805 209676 504003
13226 504003 31936 -216221 137679 104220 85973 67622 165102 199687 89004 95270 210659
13215 210659 44055 41293 70806 237763 168054 -282918 134532 172271 81840 318229 68216
13203 143217 33870 188634 -63843 -192808 298477 204411 73112 -3516 -107298 -19008 216837
13191 15070 -69621 303912 263718 -85142 149639 -22364 -4375 228237 265264 252764 6060
13179A04456J92364g1843j65499B47249D0096N9950C7332c19042B59408h6654
13168a72872D6764b6757I6901e347l2677B62846a92815j03774G8605a57608B33852
13156h2754A07353M5972M8469o5391F1271o534N50479B55451j12445J09744I5996
13144i385A38051K21072a17554d3846G1659K4332J74090j30310a0312H5665k5655
13133F0010L5951R9160M438d07939A04024O5100G0660J67075o3165k4009M428
13122A54989L8545l0970B204b73911A87173k5840L5603J13581j41149M4786m8527
13111A65627c13671j06523f0496B61014j10248J64777n5524A26609m4642c8961
13100A62487p3522f8848A87236J006k6007a0661A52794f9j6513B99088A39764
$$ plain form
13179 104456 296820 -71843 -237342 247249 40096 100046 37332 -319042 259408 -86654
13168 -172872 46764 -26757 96901 -5347 -38024 262846 -192815 -296589 78605 -157608 233852
13156 -82754 107353 153325 201794 136403 61271 54737 605216 255451 143006 252750 95996
13144 -9385 138051 359123 -117554 -43846 71659 95991 270081 139771 -10312 85665 60010
13133 60010 95961 195121 199559 -407939 104024 169124 70660 237735 174570 150561 154989
13122 154989 193534 162564 2204 -273911 187173 161333 196936 310517 169368 214154 165627
13111 165627 -313671 -420194 -60496 261014 150766 315543 260019 126609 81967 -38961
13100 162487 88965 -68848 187236 188242 162235 -10661 152794 -69 -16582 299088 139764
13088b52561A28840D587J26843a62381A70508N7310J07956E4587a82302A4809
13077A7560K09763c4361B11050e3112A58488J33506a46582F8316h3788A00223
13066a47268A81487G5809J43282a64515B4843J30401J164m9591J43509r6758k4842
13055A28726c23888A07411m1224k5231K35692j08453B8994A1574R1381J69676
13045B72631L397D0448a07405A13765K04613K3696A5312R1539a44443m7851B20359
13033A52029P1284b14309B94246a95677B05462J49916J21003k08976q7589k5678
13023A54138B8764K39063a05382E9848L41722c11155A61172c5135A13827L47093
13013D60920A76573J997i6715d5398A35102d16054C59883A69985f53333C93515
$$ plain form
13088 -252561 128840 4587 131430 -162381 170508 227818 335774 54587 -182302 14809
13077 17560 227323 -34361 211050 -53112 158488 291994 -146582 68316 -83788 100223
13066 -147268 181487 75809 219091 -164515 24843 155244 156408 106817 250326 153568 128726
13055 128726 -323888 107411 66187 40956 276648 168195 28994 11574 102955 272631
13045 272631 276028 40448 -107405 113765 318378 342074 15312 106851 -144443 -192294 220359
13033 152029 223313 -214309 294246 -195677 205462 355378 476381 267405 179816 154138
13023 154138 28764 267827 -105382 59848 401570 -311155 161172 -35135 113827 460920
13013 460920 176573 178570 -96715 -45398 135102 -416054 359883 169985 -653333 393515
13002A8246M19766b3798k42799D1177j3026J23673G5119e1608G811a27708F9369
12990A44070a8121M787C10889d841l2844A63232o8603i7115B21052b53986b559
12978A73707J00757j36457a71053n684D6226M3585j4820D848M15886B03416C4496
12966a33886C4940a61597I6101O846b6006C21446A04592m5482a42110B02400a05702
12954A33960c5170n2519B2214b7103A8036c15437B45598j04767J23596a89336
12943B28279r6526C7098M1851K03771j37224O9044j0602n9693C7141b32466G4121
12931B08194c53184a11637H1877N2000i7146j69385C5555c05117C45311A02845
12920a12832C8876O0551a0198A75963C2028Q0474C5844J1622J29441m8625j1152
$$ plain form
13002 18246 438012 -23798 -266597 41177 28151 151824 75119 -51608 7811 -127708 69369
12990 144070 -18121 -13334 310889 -4841 -37685 163232 94629 -97115 221052 -253986 -2559
12978 173707 274464 138007 -171053 -176737 46226 89811 74991 4848 420734 203416 34496
12966 -133886 34940 -161597 96101 102947 -26006 321446 104592 59110 -142110 202400 -105702
12954 133960 -35170 -87689 22214 -27103 18036 -315437 245598 140831 264427 -189336
12943 228279 131753 37098 78949 282720 145496 214540 203938 144245 37141 -232466 74121
12931 208194 -353184 -111637 81877 133877 -97146 -266531 35555 -305117 345311 102845
12920 -112832 38876 99427 -10198 175963 32028 112502 35844 47466 176907 128282 117130
12909A17130P8853f3044A62570d5489o641k4159A55093a86244k55094d0380l17045
12898c57425J71703A39272a97334b3101D16178B9147J06743i8094G1718a9330
12887g1185I4127K11166c83686e5820B07390a06853A07610c6388q6621A73427
12876a00721N0016A25389f0252k25110J33736f2170j02657j37726D22504b97347
12865B23381P4337o8141a97166C5216a86665B58837a72779A42177d8351A70818
12854b9153j01619G3316a55988J3446J4328o7521B65862n8986L636O9956a67423
12842D13445A13673J83038D3549C98L8877K44843e693j45643r2409A54514P7737
12831B32251d1898j89402C6485K00452c6158A76594H6302g9340B4068f4145E5150
$$ plain form
12909 117130 195983 -63044 162570 -45489 -52130 -76289 155093 -186244 -441338 -40380 -357425
12898 -357425 -185722 139272 -197334 -23101 416178 29147 135890 -98094 71718 -19330
12887 -71185 94127 305293 -383686 -55820 207390 -106853 107610 -36388 -123009 173427
12876 -100721 -50705 125389 -60252 -285362 -151626 -62170 -164827 -302553 422504 -297347
12865 223381 297718 229577 -197166 35216 -186665 258837 -172779 142177 -48351 170818
12854 -29153 -130772 73316 -155988 -142542 -128214 -195735 265862 206876 210512 280468 -167423
12842 413445 113673 296711 43549 398 39275 284118 -5693 -151336 -243745 154514 232251
12831 232251 -41898 -231300 36485 236937 -36158 176594 86302 -79340 24068 -64145 55150
12819B04761n4100a400A37476J15562g7962k3128j68617G4216b15484A81188a65297
12807F9651b1178A84756a02151B30651a0072C8428J4384N7856b9670m7468m2414
12796a19552a3787p6083D30824A11652c08268a9769A47301J28190f0939L822E6377
12784H3806a00796n5458c5421I3381J83977p5416g4730D04143A58686D6322a37845
12772e24441J54444a08131H4921a1794B80106a7265I5505m0583i9800A84564b19866
12760C04674e06621E9987J06773F4458A5368f6171A92275Q3804I2027l6408A5969
12748A50626M3352K78272a58848A76114e4614H5512h7922M1245C11701k4833P3653
12737C60521b33209a15072J5610A28305J45151G6417K79010j42862n8544A1101
$$ plain form
12819 204761 150661 -1400 137476 253038 -77962 -101090 -269707 74216 -215484 181188 -165297
12807 69651 -21178 184756 -102151 230651 -10072 38428 52812 110668 -29670 -77138 -119552
12796 -119552 -13787 -89870 430824 111652 -308268 -19769 147301 275491 -60939 -57117 56377
12784 83806 -100796 -156254 -35421 93381 277358 201942 -74730 404143 158686 46322 -137845
12772 -524441 -369997 -108131 84921 -11794 280106 -17265 95505 54922 -99800 184564 -219866
12760 304674 -506621 59987 166760 64458 15368 -66171 192275 276079 92027 55619 15969
12748 150626 193978 472250 -158848 176114 -54614 85512 -87922 -46677 311701 286868 360521
12737 360521 -233209 -115072 -99462 128305 273456 76417 355427 212565 154021 11101
12726C8731b03520H199h2072A57048a24028K7624A87069n3993A233b13368k03776
12715d17144f5549a3225n9619l30530A35545a15754c3A70105b18167A81663a27874
12703B07138A00371J65007L6223j21611l3278j8172j0209c58880a9791B12135
12692B2061K7960J93182a86836B74062A7195a77651J8534j27264A08098b1466
12681A5738j540f484B61549k3769B8821e5101G1642J53301n4353b46941A82545
12669a4433A22759c4279m686J2293C73621g5594B6406K06429c02382A00949Q0011
12658A80960R2405i4239F2957Q5356C9066a65001c735k3213q7864D6922a99206
12646A2203a17378A9482J8949K0812J29666o8479h2749J1324j1650L970B02650
$$ plain form
12726 38731 -203520 8199 -82072 157048 -124028 -96404 187069 133076 1233 -213368 -417144
12715 -417144 -65549 -13225 -72844 -403374 135545 -115754 -33 170105 -218167 181663 -127874
12703 207138 100371 265378 301601 179990 146712 128540 118331 -358880 -19791 212135
12692 22061 50021 243203 -186836 274062 17195 -177651 -159117 -286381 108098 -21466
12681 15738 14198 -6484 261549 237780 28821 -55101 71642 224943 170590 -246941 182545
12669 -14433 122759 -34279 -38965 -26672 373621 -75594 26406 232835 -302382 100949 180960
12658 180960 273365 -94239 62957 148313 39066 -165001 -3735 -26948 -114812 46922 -199206
12646 12203 -117378 19482 38431 59243 188909 120430 -82749 -71425 -83075 -79105 202650
12634a41884F1700P1953K9801G5041K10548a28438C64021j00873Q4393A2464e6759
12622D62629E7157J92163j07845M17995A84892B8551j2839K49331a02095j41525
12612b43620A77080c0462n6324B59598A23429h6127o8426B0451J3106M5221a96052
12600g9772j4988B09416l0850P1467q8357A0890J44165D5747K70875b70857B30035
12588C00353b7755n1581G145J40227b71310E605b59306F4952J41989a53577A43206
12576A91364C0796i9143B10363l2000f6526B02304d5549B12320b49662A01788
12565I8411K16042j29362q11E9713c71783A39491a55596A81021J0612O594b69721
12553G9346C8162d8865B44291a22533A02092b59205J03227A27861l4672L24281
$$ plain form
12634 -141884 61700 133653 163454 75041 285589 -128438 364021 263148 347541 12464 -56759
12622 462629 57157 249320 141475 559470 184892 28551 15712 265043 -102095 -243620
12612 -243620 177080 -30462 -86786 259598 123429 -86127 -154553 20451 33557 78778 -196052
12600 -79772 -94760 209416 178566 250033 161676 10890 155055 45747 316622 -270857 230035
12588 300353 -27755 -79336 7145 147372 -271310 5605 -259306 64952 206941 -153577 143206
12576 191364 30796 -99143 210363 178363 -66526 202304 -45549 212320 -249662 101788
12565 98411 314453 185091 184280 59713 -371783 139491 -155596 181021 191633 198227 -269721
12553 79346 38162 -48865 244291 -122533 102092 -259205 -155978 127861 93189 417470
12543D17470A57016j1631a44264B19001a01504k37556a63531G3707a21043I8144
12532B44102j1605e00480h5429D1582P3720i1454A78976O7225j271g7071A99091
12520h626p8578G6111l817b42128H4228i9765C2756M7896a19942E5733a93710
12508g1358A5296J13381f5156f216C7563a51133F7763f7611j30656E3028J20875
12497A73903m7131J95461i9610C3379c8102I5208K0996m6916C1026e8086j82486
12486b40572B22641D5759a84979C01819m9436r6761n372n8182a63820B80006b10740
12474a74351B6847b81819D6059B0405b08938B08557J77106b25275C00633a40482
12463F8212N8145b2895A47569A369b56718b5455k01062b5840B74974b74132I3831
$$ plain form
12543 417470 157016 145385 -144264 219001 -101504 -339060 -163531 73707 -121043 98144
12532 244102 232497 -500480 -85429 41582 115302 -91454 178976 246201 244930 -77071 199091
12520 -8626 -87204 76111 72294 -242128 84228 -99765 32756 80652 -119942 55733 -193710
12508 -71358 15296 128677 -65156 -6216 37563 -151133 67763 -67611 -198267 53028 173903
12497 173903 126772 322233 -99610 33379 -38102 95208 116204 69288 31026 -58086 -240572
12486 -240572 222641 45759 -184979 301819 252383 155622 150250 92068 -163820 280006 -210740
12474 -174351 26847 -281819 46059 20405 -208938 208557 385663 -225275 300633 -140482
12463 68212 126357 -22895 147569 1369 -256718 -25455 -226517 -25840 274974 -274132 93831
12451G1359i1466A77018d1247k1316G6689J7854i4351k14054A8948b52852M6511
12440b06341N7464C93415b13418A6199J00625a79267E775h3159J8694A01696J50843
12429B52539c1618o9286D02429a49781g2327j29525E7274K11372Q675J5689n65
12418B92445b03167A42895a93645C66800D9323a02580A90409F996a48047D08571
12407A38552g551H9593C7323d0857A40502m2489J42236j8326b70411a00488M3472
12396e7016m7719B67051b27964e4838A42717K2936O2082a25429A0725a49164b9969
12384E6994c8640j55914C41662A28434a0736F8501a36725A40853d9098A99996
12373A10744P4487q6016a71640O1702C5179a14962G8419b40051R4450A7751d11021
$$ plain form
12451 71359 -91466 177018 -41247 -62563 76689 94543 -94351 -308405 18948 -252852 -206341
12440 -206341 -148877 393415 -213418 16199 116824 -179267 5775 -83159 -64465 101696 252539
12429 252539 -31618 -100904 402429 -149781 -72327 -201852 57274 268646 277321 293010 292445
12418 292445 -203167 142895 -193645 366800 49323 -102580 190409 6996 -148047 408571
12407 138552 -7551 89593 37323 -40857 140502 98013 240249 221923 -270411 -100488 -57016
12396 -57016 -104735 267051 -227964 -54838 142717 165653 227735 -125429 10725 -149164 -29969
12384 56994 -38640 -194554 341662 128434 -10736 68501 -136725 140853 -49098 199996
12373 110744 185231 99215 -171640 -109938 35179 -114962 78419 -240051 -145601 17751 -411021
12361b39644J16543j43546n3656J01332P262A74871a33178A26234a00814C87440
12350f5594G2555f7546B1951a11478A97817a4990A02700e5191A28477J62554D428
12338h8561j66509C2495h420l35547I8075N1943b93694A60815f3635l39002c7026
12326A36684J56649a8575m338C6192a53504A34234N9708j0766m7671J83482F7722
12314A96393f1423A22546l1496J86805D8665M3240Q3442h4907b2928j21904M2970
12303a01862A53991J12307e4147A12791K15511F7231a01028k1565M0612F2779
12292H626c7107A23354J40833J56830A46468a15877I4474a6420n2148B14977d2549
12280E7589a18636A62955m5911c5395j20363B57045e6541E9072J82365A08140
$$ plain form
12361 -239644 -123101 -266647 -320303 -218971 -211709 174871 -133178 126234 -100814 387440
12350 -65594 72555 -67546 21951 -111478 197817 -14990 102700 -55191 128477 291031 4428
12338 -88561 -255070 32495 -8420 -343967 98075 150018 -293694 160815 -63635 -402637 -37026
12326 136684 293333 -18575 -22913 36192 -153504 134234 193942 183176 135505 318987 67722
12314 196393 -61423 122546 91050 277855 48665 91905 175347 -84907 -22928 -144832 -101862
12303 -101862 153991 266298 -54147 112791 328302 67231 -101028 -122593 -81981 62779
12292 8626 -37107 123354 264187 421017 146468 -115877 94474 -16420 -68568 214977 -42549
12280 57589 -118636 162955 117044 -35395 -155758 257045 -56541 59072 241437 108140
12269a55613N0283H1495F926L276b13452d511n9240M537j4943L4026m7891B46840
12256b85016h3938A56960D8839a63632E84147H5591i0137A64718a5730B4168a44631
12244h4197A61630l3154f6321M506K9226E6750a45745A46116D5032h6974H956
12232G2563J02178J06212p2415l1981J17086a56736A38953K16932r40A5617R7940
12221A13557R7924E4114K60354F1349a71923A37343K88653B2040J96543L2097
12211B50680D6843j6701J93044C2632K9369b92153B36529A01633J79999j751E1828
12199I5794N8819a5176A17486M02132B47193e1933A16460K45698A28926L03586
12189D32512j55785a28463A66749N5830j01698D8391K91282E9889a04121C09696
$$ plain form
12269 -155613 -105330 81495 6926 10202 -213452 -4511 -63751 -59214 -74157 -40131 -88022 246840
12256 -285016 -83938 156960 48839 -163632 584147 85591 -90137 164718 -15730 24168 -144631
12244 -84197 161630 128476 -66321 -61815 -32589 56750 -145745 146116 45032 -86974 8956
12232 72563 174741 280953 208538 176557 293643 -156736 138953 355885 354945 15617 113557
12221 113557 211481 54114 314468 61349 -171923 137343 425996 22040 218583 250680
12211 250680 46843 30142 223186 32632 62001 -292153 236529 101633 281632 279881 51828
12199 95794 154613 -15176 117486 519618 247193 -51933 116460 362158 128926 432512
12189 432512 276727 -128463 166749 222579 120881 48391 339673 59889 -104121 309696
12178I5177A0277L22716d3097D49259j14362a53697G0718c8713j50969g8823A52993
12166A34881j1123M00299B47572M11801a90328O3082J9843c3588k2704r3382A3998
12154A01197A8754J46672p2377a50785G4242a39354O4755A71750D5956a37077
12143i6973B84538n0152a80303G2234h9026E0049K11467H4930K82570r237a7083
12131A51646n492L5171C7063a29309N5398k64041f596k19986E8465A5209b24422
12119B26069i4146A30945F5468K16052A13884B0510K58591e7056q7682A91844
12108a20020A44864r224a60383B9722b79530m4819e6630q6101q0199C6780R2777
12097A29557a5619A04868K31981A24497c12060A49714c04822J30966d541G0068
$$ plain form
12178 95177 10277 332993 -43097 449259 334897 -153697 70718 -38713 -189682 -78823 152993
12166 134881 123758 524057 247572 659373 -190328 -127246 -107403 -33588 -56292 -149674 13998
12154 101197 18754 165426 93049 -150785 74242 -139354 -74599 171750 45956 -137077
12143 -96973 284538 234386 -180303 72234 -89026 50049 261516 84930 367500 358263 -17083
12131 151646 146154 181325 37063 -129309 -73911 -337952 -6596 -226582 58465 15209 -224422
12119 226069 -94146 130945 65468 281520 113884 20510 279101 -57056 -144738 191844
12108 -120020 144864 135640 -160383 29722 -279530 -324349 -56630 -142731 -222930 36780 129557
12097 129557 -15619 104868 336849 124497 -312060 149714 -304822 -173856 -4541 70068
12086I1111B9102e3427j20546H1391M8724h425E5238J14282f4020A21183g4365
12074A44099a36278f3662A10307C1512b37303B81056p2926J14773O58160K46015
12064A227078l73523k07514j87452a6659j32188q5704N3166F9174b69314g3701
12053F8545N1241b57885F1261K1643J22449c4058j31650j53284J50897d4459C6048
12041A60941a91685L4887b0603k80818a37990a3027O134l7483b1343A06468g4888
12029A658K5899b45137L8523A20418b06883D42483A1203J63381E7527g7661B923
12017a03291A33768d2854q3406A02428O1739i7531p757A20559n6865d5929j32057
12006a77986j74918J26283A58147J49669j44412m3606a4538H0549M4660C8269
$$ plain form
12086 91111 29102 -53427 -173973 81391 130115 -8425 55238 169520 -64020 121183 -74365
12074 144099 -136278 -63662 110307 31512 -237303 281056 208130 322903 981063 1227078
12064 1227078 853555 646041 458589 -16659 -148847 -234551 -181385 69174 -269314 -73701
12053 68545 119786 -257885 61261 82904 205353 -34058 -165708 -318992 -168095 -44459 36048
12041 160941 -191685 -156798 -20603 -301421 -137990 -13027 -6893 -44376 -21343 106468 -74888
12029 1658 27557 -245137 -206614 120418 -206883 442483 11203 174584 57527 -77661 2923
12017 -103291 133768 -42854 -126260 102428 164167 -97531 -105288 120559 63694 -45929 -177986
12006 -177986 -352904 -226621 158147 307816 163404 119798 -14538 80549 125209 38269
11995B06594e1956j99860M8677e5178C48934E8381k6194J77187F7156Q8407e38026
11983B82930a02536n7466B16361D1064g9093k81145D4304J70172K0864c92474
11972A52057L5701b17304j01247e8850r46C2219f0807J3303D3718a18901P024
11961a11877D7326L71O8910g6395j16216N6720j69228a12822F3505b19015O7895
11950a51120C8578M4433b42914B32820c23500N5958b3325A85345H369b0353m4584
11939f4937A32537b61140A40804n6911A7093K50988h2806J4923j79654H8316O4178
11928A52494D3764b02702a2171p3589H5041J36116c2074A61191b27378A20552
11917A560b43934o3598a25127j17802B39266m2990c67697a69415n8507K6720b1302
$$ plain form
11995 206594 -51956 -251816 -203139 -55178 348934 58381 32187 209374 67156 155563 -538026
11983 282930 -102536 -160002 216361 41064 -79093 -360238 44304 214476 235340 -392474
11972 152057 187758 -217304 -318551 -58850 -59796 32219 -60807 -47504 43718 -118901 -111877
11961 -111877 47326 47697 116607 -76395 -192611 -135891 -305119 -112822 63505 -219015 -151120
11950 -151120 38578 83011 -242914 232820 -323500 -267542 -23325 185345 8369 -20353 -64937
11939 -64937 132537 -261140 140804 83893 17093 268081 -82806 -67883 -247537 88316 152494
11928 152494 43764 -202702 -12171 -85760 85041 221157 -32074 161191 -227378 120552
11917 1560 -243934 -307532 -125127 -242929 239266 196276 -367697 -169415 -227922 -201202 -21302
11905F6504a36657O7554N135C584J88338c8878q9430N3070F3472k7482j7325c8483
11892f1710C84948a00618c1122j6467A0634J2255a0971B26296a35110D0062A1031
11880g0508a2744A18172K41553A7619J8794a33165A4592a07003A13699a73162
11869g7792f572q7538C23b53063E6695k4371f610m00088e3042m31307a2379G9950
11856a7741D3377J8499C149M7861b84935J36199D2866i0663B03063c04619B9920
11844c9717A19021a01233G161K1388b7722B14392r8385N3440L8188A9274K54151
11833B73425C5627r837g0379j35123A30109a96636j0835c23r0017D0012J02966
11822A42978g0722C20421g1707j69571M2695P8462C80906B0938e2650A71814H4208
$$ plain form
11905 66504 -136657 -69103 -63968 3584 191922 -38878 -128308 -75238 63472 35990 18665 -38483
11892 -61710 384948 -100618 -31122 -47589 10634 22889 -10971 226296 -135110 40062 11031
11880 -70508 -12744 118172 359725 17619 36413 -133165 14592 -107003 113699 -173162
11869 -77792 -6572 -94110 323 -253063 56695 32324 -6610 -406698 -53042 -484349 -12379 79950
11856 -17741 43377 61876 3149 51010 -284935 -148736 42866 -90663 203063 -304619 29920
11844 -39717 119021 -101233 7161 28549 -27722 214392 116007 169447 207635 19274 273425
11833 273425 35627 25790 -70379 -205502 130109 -196636 -207471 -323 -90340 40012 142978
11822 142978 -70722 320421 -71707 -241278 -198583 -120121 380906 20938 -52650 171814 84208
11810D1564g5772m1316l1414B6574J8836A8504J94051A00869c31486J45008d1297
11798C2090P6922c497q4595a601H3916h8206j18217B14309a78169k49774A53780
11786F9496a30712l09861J60724h6456b8896F3097b8373A45353a87070A27450
11775C4817A4343b93124J08876B89320Q5652i2376A25283i9673j1504c2371l17328
11764c49699b9807H6445d14582a18883B0434J29972d8263B79677c73211A70659
11753b20436p2386g0684B37273E4737K5669P6796a41609A25216i5497A70982a98062
11741G4330a1506A2471a9740j09374M8846A21217E7444n35b10630g4032m9169
11730a23201B31788k8661H7529i8160b7545j97312n6979B24022E1745b42764d8547
$$ plain form
11810 41564 -75772 -117088 -148502 26574 45410 18504 212555 100869 -331486 -186478 -41297
11798 32090 109012 -3497 -88092 -1601 83916 -88206 -206423 214309 -178169 -427943 153780
11786 69496 -130712 -440573 -279849 -86456 -28896 63097 -28373 145353 -187070 127450
11775 34817 14343 -293124 -184248 289320 374972 -92376 125283 -99673 -111177 -32371 -349699
11764 -349699 -29807 86445 -414582 -118883 20434 150406 -48263 279677 -373211 170659
11753 -220436 -292822 -70684 237273 54737 80406 157202 -141609 125216 -95497 170982 -198062
11741 74330 -11506 12471 -19740 -129114 -80268 121217 57444 56909 -210630 -74032 -123201
11730 -123201 231788 203127 87529 -98160 -27545 -224857 -281836 224022 51745 -242764 -48547
11718B43553h8445B91295A33850K62636j36189e8772j7857A47971C0633J00147
11708A30780f3465A08745J13250G1812i4233A50621l235C1935M6324k9645i3684
11696A18711D8626M5484j324J391h8596A36391O5268b47437A82672b6587A89516
11684f598k6022j59044i542A79429J72910h436b96n6473A93080q9797a12493B27315
11671E9822a65755B5062K59553C8045a2731C02043d49785a96821j4507B45226
11660h2348a3616F0037P7890b4252k48036j18164f0390j5268J3372K3983j33459
11649a71762m2200a04930A06788J30820e2896C0774L4031P7421C7115c61456A6238
11637A53279D2704d723o0777r5207A29320K34814H0186A0510K13004d9743A44351
$$ plain form
11718 243553 -88445 291295 133850 396486 260297 -58772 -76629 147971 30633 130780
11708 130780 -63465 108745 221995 71812 -94233 150621 147386 31935 78259 48614 -93684
11696 118711 48626 94110 92786 94177 -88596 136391 201659 -247437 182672 -26587 189516
11684 -6598 -32620 -191664 -9542 179429 352339 -8436 -296 -56769 193080 103283 -112493 227315
11671 59822 -165755 25062 284615 38045 -12731 302043 -449785 -196821 -211328 245226
11660 -82348 -13616 60037 137927 -24252 -272288 -390452 -60390 -75658 -62286 -38303 -171762
11649 -171762 -213962 -104930 106788 237608 -52896 30774 64805 142226 37115 -361456 16238
11637 153279 42704 -4723 -65500 -160707 129320 364134 80186 10510 223514 -49743 144351
11625e5004B4916N3142e8552a3911j74301E23341E8551d2389C08950b12523H5280
11613h1910c2910a336I7602b30443B5241a00291L1940A59398a54480C3367a2917
11601d363I0208R2826c13395f8271m978b7838o2246H1972g4262A866K41990D9992
11588B05406f4913G1954K11075e46104a74052e0670A93639C8451J24810n5787
11578A07474B3214M23403a49370E2514A9863e1699B08311k7755B7701J25915i7358
11566E8447J87362H6887B2168K23423j09820g2247F0727a02724b9024j23577H4656
11554B69634H0199b43976B19312G1914R8860C0114J58384b949l2251D60189B03342
11542B19853C5432a76483A34970L22090k23293a45932c8810A62674k5521d145
$$ plain form
11625 -55004 24916 78058 -58552 -13911 -188212 523341 58551 -42389 308950 -212523 85280
11613 -81910 -32910 -1336 97602 -230443 25241 -100291 -68351 159398 -154480 33367 -12917
11601 -4363 90208 183034 -313395 -68271 -73249 -27838 -90084 81972 -74262 1866 243856 49992
11588 205406 -64913 71954 283029 -546104 -174052 -50670 193639 38451 163261 107474
11578 107474 23214 446617 -149370 52514 19863 -51699 208311 180556 27701 153616 -97358
11566 58447 245809 86887 22168 245591 135771 -72247 60727 -102724 -29024 -152601 84656
11554 269634 80199 -243976 219312 71914 170774 30114 188498 -2949 -35200 460189 203342
11542 219853 35432 -176483 134970 457060 233767 -145932 -38810 162674 137153 -4145
11531A76424G4406J74283c7078J329r2098A31138k1685m975c0062C6662e9270
11519E0097M3364m379d12065G9725h5377m8744E5507b11303A68815C2983K01417
11508B34400b95125D21627j32225l4731L6857A24561M8664a60264B85356B5513
11497A44395n311P6686f5677K436C23462a14854F715K64906a1655G6167K31282
11486C07449J25124j79283b95853A72648l8685R6656C9660J63679a59061C38676
11475B32650r0409b1815A56330a66802A20567R4967a6059B97784f4689A53781
11464H3169O4307J40954A38647i0957D6421a2702D28490A73084a8671j13857c0343
11452A61999b0196E5693P5830p898a02238f50j64922b087l42881a23351B47324
$$ plain form
11531 176424 74406 248689 -37078 -35749 -127847 131138 109453 104478 -30062 36662 -59270
11519 50097 93461 89082 -412065 79725 -85377 -134121 55507 -211303 168815 32983 234400
11508 234400 -295125 421627 289402 254671 291528 124561 173225 -160264 285356 25513
11497 144395 139084 215770 -65677 -63241 323462 -114854 6715 271621 -11655 76167 307449
11486 307449 432573 253290 -295853 172648 133963 230619 39660 203339 -159061 338676
11475 232650 142241 -21815 156330 -166802 120567 215534 -16059 297784 -64689 153781
11464 83169 147476 288430 138647 -90957 46421 -12702 428490 173084 -18671 -132528 -30343
11452 161999 -20196 55693 131523 123625 -102238 -650 -165572 -2087 -344968 -123351 247324
11440C6028a18807J8267B21127D6686M25560a4134o2283Q514H6793b40328A33040
11428b40778C10487b66117A20717C8773g7729E4038J08102c20824A02970k2100
11418H0870a67848c1889C30981b34725A42984d74326b3180A08011H315K11487
11408B19802J10769q7186N4028b54838B14367a43615A40755A2744J72787a25932
11397h7587N61A54092a74291A61824n360e8748A36485b8298l0389B0085P5118
11386I5203C7051b40779D5074b21481B9652N5982J61026e0243h82A78752o5647
11375A13105M21143f2946E1273a91650g1543c0281o4954L8385I459a08500j12315
11364b20815H415e06722a61270A08364a03194b5046k47272f8220A20515a86941
$$ plain form
11440 36028 -118807 -100540 221127 46686 472246 -14134 -76417 -67903 86793 -240328 133040
11428 -240778 310487 -266117 120717 38773 -77729 54038 162140 -320824 102970 80870
11418 80870 -167848 -31889 330981 -234725 142984 -474326 -23180 108011 8315 219802
11408 219802 330571 243385 297413 -254838 214367 -143615 140755 12744 185531 -125932
11397 -87587 -87026 154092 -174291 161824 156464 -58748 136485 -28298 -58687 20085 95203
11386 95203 37051 -240779 45074 -221481 29652 85634 246660 -50243 -882 178752 113105
11375 113105 534248 -62946 51273 -191650 -71543 -30281 -95235 -56850 9459 -108500 -220815
11364 -220815 8415 -506722 -161270 108364 -103194 -25046 -272318 -68220 120515 -186941
11353h8932B65284B1878b71728A12797n3859j8850b10709a8301B46151A5517C60
11341g2197l90263A41886b8194h73E594f5355r8272f6260G3711J37716d44998
11329A03778L3680n1965a98797i7377A18664b9477j29212F0057e9361D8144J41668
11318A89812D0488b1667A98975a10951F9808h7947a4472k87240a35883H7248P1260
11307A58508b25690M9559C1086e9887b0629B0150a55242i022B82276A0728a07082
11295c4505A9882a8172j71617C19834C2697A0087b21668E5191b640C5756P3634
11284A09390b23492N964h6701A88333e5872k70451R2315E2618a23141k39197i7965
11272a42983m4666k11853a9579m2770k5993N165m388r7793B27312b8069j96732
$$ plain form
11353 -88932 265284 21878 -271728 112797 58938 40088 -210709 -18301 246151 15517 360
11341 -72197 -462460 141886 -28194 -873 5594 -65355 -163627 -66260 73711 211427 -444998
11329 103778 137458 85493 -198797 -97377 118664 -29477 -158689 60057 -59361 48144 189812
11318 189812 40488 -21667 198975 -110951 69808 -87947 -14472 -301712 -135883 87248 158508
11307 158508 -225690 -176131 31086 -59887 -20629 20150 -155242 -9022 282276 10728 -107082
11295 -34505 19882 -18172 -189789 319834 32697 10087 -221668 55191 -2640 35756 109390
11284 109390 -223492 -217528 -86701 188333 -55872 -326323 -234008 52618 -123141 -362338 -97965
11272 -142983 -187649 -399502 -19579 -62349 -88342 -83177 -87565 -185358 227312 -28069 -224801
11261b24801G3462M7812A7092b31180I1318m5097c94294N2892A07032e4200B85633
11249c80443L4882H7530B6327L19651A59176K2653O3258b05470j68448L1933A19776
11237e5705p4319m3187A07982J01107D7688b35176I6737b63063f3804i208j15315
11226a24523C4386b09123D6804K55525j27425a60796a2663k6832H9540a68601
11215B44883a86330j6007h9759J8051B3592K96268b29765J00918d8180l3959A41376
11203e9728A22989C1282a20142B3681b11064P8791J5347o078j4509G3028a9200
11191G3558R4952a18921d442I2112b37290L4587b7471l7665H4791e6701M543a0931
11178E1808a13642A93806k8749B3536O7600F157L00802b63905J29379l6536A74542
$$ plain form
11261 -224801 73462 121274 17092 -231180 91318 46221 -394294 -341402 107032 -54200 285633
11249 -380443 -345561 87530 26327 345978 159176 181829 245087 -205470 -373918 -341985 119776
11237 -55705 -130024 -173211 107982 209089 47688 -235176 96737 -263063 -63804 -9208 -124523
11226 -124523 34386 -209123 46804 302329 174904 -160796 -12663 -39495 89540 -168601
11215 244883 -186330 -202337 -89759 -71708 23592 319860 -229765 -128847 -48180 -82139 141376
11203 -59728 122989 31282 -120142 23681 -211064 -132273 -116926 -123004 -137513 73028 -19200
11191 73558 168510 -118921 -4442 92112 -237290 -202703 -27471 -65136 84791 -56701 -52158 -10931
11178 51808 -113642 193806 165057 23536 91136 6157 306959 -263905 -134526 -171062 174542
11166f0337B97271g2819k35199g0238c0358j46224A55372l5133M3603f0131k09826
11155b69957a3745A77570B7606c07197A49505G0641K6262O4476b67775g3437B21534
11143I6013i6312j48284A7209J22211a91917E0356Q9973j9605a05134M0348B30267
11131C50668a10982A23358J00737N1536A28039a52896N8619i597E54055a52404
11120a4278D9876P9812A2324K67060h0863c6849B70350K0029A09835a46755k3147
11109a69902m7900k26490E0274Q4236O0561K9153j10870Q3832H1913J00887H82
11097a47055E31610A70177p1389B981M61180h5139B12883F1474K49576K00479
11087E11529q094B15756o0470M6918B2212J13166a61962f996A49277J42594o4827
$$ plain form
11166 -60337 297271 -72819 -308018 -70238 -30358 -176582 155372 120239 163842 -60131 -269957
11155 -269957 -13745 177570 27606 -307197 149505 70641 96903 161379 -267775 -73437 221534
11143 96013 -96312 -244596 17209 139420 -191917 50356 140329 120724 -105134 -64786 230267
11131 350668 -110982 123358 224095 275631 128039 -152896 -94277 -9597 554055 -152404
11120 -14278 49876 129688 12324 279384 -80863 -36849 270350 290379 109835 -146755 -169902
11109 -169902 -217802 -444292 50274 134510 195071 224224 113354 197186 81913 182800 882
11097 -147055 531610 170177 98788 2981 464161 -85139 212883 61474 311050 511529
11087 511529 503435 215756 155286 202204 22212 135378 -161962 -6996 149277 291871 227044
11076B27044R9582I3037J35819J13546j66904J21491J75809B18803K8624n2643
11066A94784O3965J67538K94480j29186h5323A92087J53274p5818K91681B31971
11055D49657A6477L76182O4437L52562a00815E82261Q9613k85714L62305K45843
11045I94308j90886C86561L06914K71596k54237C33895Q95851k68557k85449j49695
11035E26045L15926C78197L75600k02251l1167n7420J74646P3160A11313M46792
11025E58105R8149m185J80924j79165J79830j15052k59680L8069J35896B99278
11014E31074J29922L4612j89871J42172k22775B04886L42630J79033k05828j36379
11004C84342K66754C04051J11448O138L31058J97535C58845K59873P4680k20958
$$ plain form
11076 227044 326626 93037 228856 342402 175498 296989 472798 218803 247427 194784
11066 194784 258749 426287 720767 591581 -85323 192087 345361 269543 561224 231971
11055 449657 16477 392659 457096 809658 -100815 582261 671874 386160 748465 994308
11045 994308 803422 386561 693475 965071 710834 333895 1229746 961189 675740 526045
11035 526045 841971 378197 753797 551546 520379 462959 637605 710765 111313 558105
11025 558105 656254 652069 832993 653828 833658 718606 458926 496995 632891 299278
11014 531074 660996 695608 505737 647909 425134 204886 547516 726549 520721 384342
11004 384342 651096 304051 415499 421637 752695 950230 358845 618718 693398 472440
10994D72440K78584l36024J77499N4012J83726j88371R5662O7191n2582K09093
10984I61230j08139k17390J38118M50889j79722o588K23385L4836J50779O19408
10974B066806j25988R7201L97277K16943l48564Q5330O0453p2792l91480J97688
10964B182874n71682m57258M11095l68870j24322K8620K17608j76915J41058j71551
10954A110657K07713l2913j64247n7077m55161Q8436j77709n4756A54249M53602
10944F07851k31802A79381K11244r1741m0343q5620G3190K05311b7686C38424
10933A61716E4411A6241K46116a1661E4291e7519G5719C3623O1556a58483L5990
10922a22493I0214e8444b8443B46211b35624A7758b32744A4420a28382p8366c695
$$ plain form
10994 472440 751024 415000 592499 646511 830237 641866 737528 804719 752137 961230
10984 961230 853091 635701 773819 1224708 1044986 1038398 1261783 1296619 1447398 2066806
10974 2066806 1940818 2038019 2435296 2652239 2303675 2389005 2449458 2376666 1985186 2182874
10964 2182874 1611192 1153934 1565029 1196159 1071837 1100457 1318065 1141150 1282208 1110657
10954 1110657 1318370 1285457 1121210 1064133 608972 697408 519699 464943 154249 607851
10944 607851 376049 179381 390625 298884 258541 172921 73190 278501 -27686 338424
10933 161716 54411 16241 262357 -11661 54291 -57519 75719 33623 95179 -158483 -122493
10922 -122493 90214 -58444 -28443 246211 -235624 17758 -232744 14420 -128382 -206748 -3695
10910B67641J629a9989j4487A93871K2263e7450A39670A7525c5583j12483B1814
10898A06970a76549A05006h9449k44475A77273b0605o6798J2744G2108M613K18202
10887B94923D9290f5487j10964B45676J0137a42139D74380c9080C9359c4271B01956
10875a15656J4440j62502q8522D33814N551C3690a89218k5650B27873e3072D0503
10863b03420C688b9314j64909D7058b42920c8497j91177a13387B01514b52309
10852a04909o4220D7933J20057e7703A20395L6371f7360b1623j04987I1510b93527
10840B10701h1067j04902a7424k84984b6157o5395j3258j68881a34183m8758k54925
10829d37866A46092n6023P7415e9500A79046c6566D7272a4281k21802K9164E2445
$$ plain form
10910 267641 269270 -19989 -34476 193871 216134 -57450 139670 17525 -35583 -148066 21814
10898 106970 -176549 105006 -89449 -333924 177273 -20605 -87403 -74659 72108 76721 294923
10887 294923 49290 -65487 -176451 245676 255813 -142139 474380 -39080 39359 -34271 201956
10875 -115656 -101216 -263718 -352240 433814 439365 33690 -189218 -214868 227873 -53072 40503
10863 -203420 3688 -29314 -194223 47058 -242920 -38497 -229674 -113387 201514 -252309
10852 -104909 -169129 47933 167990 -57703 120395 156766 -67360 -21623 -126610 91510 -293527
10840 210701 -81067 -185969 -17424 -302408 -26157 -91552 -104810 -273691 -134183 -182941 -437866
10829 -437866 146092 90069 167484 -59500 179046 -36566 47272 -14281 -236083 -206919 52445
10817c4870a3928B34600a56484C34114A58839n0083D290J6884O9691O1080a43978
10805i8891A632N4323H96a0000C4828b35559G1327d9441a3954G9112e7823j00286
10793a58109l68875C2566e904E6199i4803d1507k23103A8829b67456L2971h1262
10781b8897G3733d8039l2108m3068j34304m2323B4374a38268D60500H1274a17316
10769a38065C8974K11860j15638a67358k6700k8145H10L8363J21950a38234A0360
10757c81089f2237l31408A47573a52616d2363n3661h36k08971g3122A2082g7242
10745C37182a56862A58801J42582G1425b20951j20414a57542A5037c17493a40112
10734A82817a2739D1469R016a34671c4293r040B05799C4827a05992r9692g938
$$ plain form
10817 -34870 -13928 234600 -156484 334114 158839 108756 4290 21174 90865 151945 -143978
10805 -98891 1632 55955 896 -10000 34828 -235559 71327 -49441 -13954 79112 -57823 -158109
10793 -158109 -526984 32566 -5904 56199 -94803 -41507 -264610 18829 -267456 -234485 -81262
10781 -28897 73733 -48039 -80147 -123215 -257519 -299842 24374 -138268 460500 81274 -117316
10769 -138065 38974 250834 135196 -167358 -194058 -222203 810 39173 161123 -138234 10360
10757 -381089 -62237 -393645 147573 -152616 -42363 -96024 -836 -209807 -73122 12082 -77242
10745 337182 -156862 158801 301383 71425 -220951 -341365 -157542 15037 -317493 -140112
10734 182817 -12739 41469 50485 -134671 -34293 -43333 205799 34827 -105992 -205684 -7938
10722a9972r9j1328j10482F4959a42222H3326a88139A4616J9363b78576C25822
10710H1309K8521a58720G291L6914b46055B17918b13118f3446j79179g7269k5271
10699a02540o9562k363i292B15332q2875a45098e2431J1831A6738f2170j41829
10688b03999B1706f4051B20900b61451d2905j99475R2857b1606C59936d0491m1012
10677h1503H961O2624g1551k64519A10122d1557N419D3504J68303m8625n3376
10666A09806M8620n115i8399M4576l32014B35869D2680K16122b09883d2961n4705
10655i7666A38735g1384m8093A11779a08692M9079j58404M8480D92993E8390g5380
10643b7081L071B14615n9452a25301k53110e4590k08632g3724A96704O496j568
$$ plain form
10722 -19972 -20071 -31399 -141881 64959 -142222 83326 -188139 14616 33979 -278576 325822
10710 81309 109830 -158720 7291 44205 -246055 217918 -213118 -63446 -242625 -77269 -102540
10699 -102540 -172102 -174465 -9292 215332 132457 -145098 -52431 -40600 16738 -62170 -203999
10688 -203999 21706 -64051 220900 -261451 -42905 -242380 -149523 -21606 359936 -40491 -81503
10677 -81503 8961 71585 -71551 -336070 110122 -41557 -36138 43504 211807 163182 109806
10666 109806 158426 153311 -98399 -53823 -385837 235869 42680 258802 -209883 -42961 -97666
10655 -97666 138735 -71384 -119477 111779 -108692 -59613 -218017 -169537 492993 58390 -75380
10643 -27081 -24010 214615 155163 -125301 -378411 -54590 -263222 -73724 196704 203200 201632
10632B01632c6381E9867q744a59178M5331o870m9034f3616a1345l4338A64604
10620E2413f5003q482l2488A89233c32108f3628D3330N7199N2134n6486a77193
10608c5563F6403R5795n7711j3250b31320e6211j72217I4061c18621a1911H7821
10596D5079c97065E5074a44034q639p0669m9175E550b96419J20501k52301J14040
10585c14179L3204A54663B3821J3302c4838m70641a1191k23947C9231a25310A12215
10573a30990M6088j60902g5004j62463d4096A18774b67610a29627k4548O3536
10563i0639P181a1767l2785A95778j7909b3299j2960o2365k0716A4102e0019B94617
10550B88651b16068d6807J2811l3299q6291C1460b190q4852j49781i3511A50830
$$ plain form
10632 201632 -36381 59867 51123 -159178 -113847 -120717 -169751 -63616 -11345 -45683 164604
10620 52413 -65003 -73485 -105973 189233 -332108 -63628 43330 100529 152663 96177 -177193
10608 -35563 66403 162198 104487 91237 -231320 -56211 -228428 94061 -318621 -11911 87821
10596 45079 -397065 55074 -144034 -152673 -223342 -272517 5550 -296419 -175918 -428219 -314179
10585 -314179 -280975 154663 23821 37123 -34838 -505479 -11191 -235138 39231 -125310 112215
10573 -130990 -84902 -245804 -75004 -237467 -44096 118774 -267610 -129627 -154175 -90639
10563 -90639 -83458 -11767 -44552 195778 177869 -23299 -36259 -98624 -119340 14102 -50019 294617
10550 288651 -216068 -46807 -33996 -67295 -153586 31460 -2190 -87042 -236823 -93511 150830
10538b02711A2083b81821l8607A33485a197A75638C0904a38019B52132D9150c07471
10526H9782e1674j66519a04724B76244j14801a93203C3285f7272F7828f2984o2887
10515a25871A13350f2797p9109A80692a00117C3178i5117B0804i6421d340o4834
10504f9174A08317a93827c5172A86450J63e0344E4442a11349K9610l27184a45079
10492a3864A86915g0151A21507a98045r054K3938N4537l3682O601m4520R3803
10481a06422m2501e4953A86587k5846j5791Q900J72214A07475l6036A8913M32287
10470D51200H4518L02409A15798l8874B505L62068f1410i310j28187A6395a38452
10458c232G0685e2007B70754a95030J3228H0299a91933R1889B8908c37732m2965
$$ plain form
10538 -202711 12083 -281821 -320428 133485 -1197 175638 30904 -138019 252132 49150 -307471
10526 89782 -51674 -218193 -104724 276244 161443 -193203 33285 -67272 67828 -62984 -125871
10515 -125871 113350 -62797 -141906 180692 -100117 33178 -95117 20804 -96421 -4340 -69174
10504 -69174 108317 -193827 -35172 186450 186613 -50344 54442 -111349 -81739 -408923 -145079
10492 -13864 186915 -70151 121507 -198045 -207099 -183161 -128624 -162306 -155705 -200225 -106422
10481 -106422 -148923 -54953 186587 160741 144950 153850 326064 107475 71439 18913 451200
10470 451200 84518 386927 115798 76924 2505 364573 -61410 -9310 -137497 16395 -138452
10458 -3232 70685 -52007 270754 -195030 -181802 80299 -191933 -100044 28908 -337732 -380697
10447c80697p7127a5495l79746N5986a30k18686P2094D955a35436A37614a73519
10435a77769A33618o347f9666C46092M7009H7439A9589a05019j12612F1005e211
10423c65610I8523Q7963a40051B31856a01628A19459g1226j12090Q1057c2244
10412c9638j46350m7099N287I61O612g4632B9716K5275b12435R5561p8106B28092
10399E3301J93200j18913E3451d6293A66825a99417r28C10235n7214i8920A90459
10387A50686g3183G9227d2593A29860m6640O1267J69002B6026J4660J87375L30640
10376E58701A78162a47696C17232A31166E8921J63069L16397B16718A08222M14323
10366E22545B31601M17266B50181N3549J32108N5842G7748J87674H1676J93161
$$ plain form
10447 -380697 -457824 -15495 -395241 -339255 -130 -218816 -146722 4955 -135436 137614 -173519
10435 -177769 133618 127271 -69666 346092 393101 87439 19589 -105019 -217631 61005 -5211
10423 -365610 98523 186486 -140051 231856 -101628 119459 -71226 -183316 -102259 -32244
10412 -39638 -185988 -233087 -227800 961 7573 -74632 29716 54991 -212435 -116874 -194980 228092
10399 53301 246501 127588 53451 -46293 166825 -199417 -200345 310235 253021 -98920 190459
10387 150686 -73183 79227 -42593 129860 83220 144487 313489 26026 40686 228061 558701
10376 558701 178162 -147696 317232 131166 58921 221990 538387 216718 108222 522545
10366 522545 231601 648867 250181 303730 435838 491680 77748 265422 81676 274837
10356B74837m6576r5786K08175j7609l4295J9943A16718M06578F1035K83333H3435
10344C96433j35995a885A10046J06025J91173A93162Q4951a73502A18214N20049
10334F38263e2906B58707b88502C7929i5820b1073A99838j7965h0149B91220q1268
10323B09952L4240l4584J7995F2691K85476b21380B53298b16725C48409A38266
10312b8390C4747c415I1022l0586h1457r1086j9021b8750m2746c733k09393B09774
10299B89549a59972B39983a63317b4961B7111a85765N2861K8062B44214j19438
10289A24776Q1044a79012k09396a40155l770c8174A71419a04517D0415D547b47178
10277d8509j10833g579n2455F6517P1038d8472C19802a32240l5367a7811G4910
$$ plain form
10356 274837 228261 132475 340650 323041 288746 308689 116718 523296 61035 344368 83435
10344 396433 260438 -1885 110046 216071 407244 193162 278113 -173502 118214 638263
10334 638263 -52906 258707 -288502 37929 -95820 -21073 199838 181873 -80149 291220 209952
10323 209952 244192 209608 227603 62691 348167 -221380 253298 -216725 348409 138266
10312 -28390 34747 -3415 91022 60436 -81457 -172543 -191564 -28750 -71496 -3733 -213126 209774
10299 289549 -159972 239983 -163317 -24961 27111 -185765 -132904 -104842 244214 124776
10289 124776 205820 -179012 -388408 -140155 -143925 -38174 171419 -104517 40415 4547 -247178
10277 -48509 -159342 -7579 -60034 66517 137555 -48472 319802 -132240 -167607 -17811 74910
10265b53284A22521d65685G1308P5742o2983j9081J9250J07708a21471A97750
10254A47797K01585J18009b45937I4863c97007B54502b9919C33879r1381f1056
10243A71457o8366O7h6998o9081N3267b1426F5100e7504F1920d3676B4155f1744
10230c57442c4719j6540j20362D5967J26043b07921G4676I304b1593A18467a42093
10218a41725G8307A4358c24074a61291J7440J4179f0402C35155b31236L186G6939
10206A51899e5298H781J51746a64353c5996A00298a98953l87726a42001A5803
10195c00596A0904b16777D8936P9882b28701j19860a73809A2512a21634j6519
10185a38153O061k16795B08714a65186B28870a69127k13688A98332c70374F8266
$$ plain form
10265 -253284 122521 -465685 71308 147050 84067 64986 84236 191944 -121471 197750
10254 147797 349382 467391 -245937 94863 -397007 254502 -29919 333879 242498 -61056
10243 171457 103091 103158 -86998 -156079 -102812 -21426 65100 -57504 61920 -43676 24155 -61744
10230 -357442 -34719 -51259 -171621 45967 172010 -207921 74676 9304 -21593 118467 -142093
10218 -141725 78307 14358 -324074 -161291 -143851 -129672 -60402 335155 -231236 -228050 76939
10206 151899 -55298 8781 160527 -164353 -35996 100298 -198953 -586679 -142001 15803
10195 -300596 10904 -216777 48936 128818 -228701 -348561 -173809 12512 -121634 -138153
10185 -138153 -132092 -348887 208714 -165186 228870 -169127 -382815 198332 -370374 68266
10174a62022A56422B7974a63209O8238n1700O6080m5520A19012g302k3812n9256
10163i0370q495A44584K5395b9135k83719e2157I2840Q2833b86016M9504P6200
10152a60312A7787b7405m6062B45485q6437K60068a60335d4033B7076b60288A8883
10140B58013f4000o4826j74875A43537m9203C8806b38449a3655l08506M243J39278
10129a78640a8970I2744d8174m9825E0282f3367K1327A01731b00693I3594K64962
10118C58556a19124j45415b9233j290B40503F9045h3461P055B15319a17589c6588
10106b13141N1176c1604j27897a998j33197C2208K2091F252e7848a5086j35713
10095a50799N1328k77530O0463A39740a58414B203e5963q8990a7603D5405a94292
$$ plain form
10174 -162022 156422 27974 -163209 -94971 -146671 -80591 -126111 119012 -7302 -31114 -90370
10163 -90370 -98865 144584 169979 -29135 -312854 -52157 92840 175673 -286016 -236512 -160312
10152 -160312 17787 -27405 -73467 245485 159048 419116 -160335 -44033 27076 -260288 18883
10140 258013 -64000 -128826 -303701 143537 94334 38806 -238449 -13655 -322161 -317918 -178640
10129 -178640 -18970 92744 -48174 -97999 50282 -63367 -42040 101731 -200693 93594 358556
10118 358556 -119124 -264539 -29233 -30523 240503 69045 -83461 -76406 215319 -117589 -36588
10106 -213141 -161965 -31604 -159501 -1998 -135195 32208 54299 6252 -57848 -15086 -150799
10095 -150799 -99471 -377001 -316538 139740 -158414 2203 -55963 -144953 -17603 45405 -194292
10083a50922D28198A40321m9635b30344I57a38332j44774a24932B02140a54541
10072b03253B12420a37843A89504a20021e6046b42j0607j37038l5567h8798j5964
10061a04762a594C6736a14302A81063F5632l891i8093G5463J66859H3547b41571
10049c14661J26756q6321k5460a28260j22743a3824B4892g4407o0915c5151B8653
10037A38622e4253b033q557k67124j8382O6579J09498e174j82296A43742M3489
10026A87231H7722R6428l754o0475I201a52076A29765e33186K48427B6458a68455
10014E6276e3747F2802a60032O6263G5507J4868a22477K483A00241g3995A83073
10002A15438b50211L3580A42897a60750K8618j31033a08689D1858b03334j07051
$$ plain form
10083 -150922 428198 140321 90686 -230344 957 -138332 -283106 -124932 202140 -154541
10072 -203253 212420 -137843 189504 -120021 -56046 -242 -10849 -147887 -183454 -88798 -104762
10061 -104762 -1594 36736 -114302 181063 65632 61741 -98093 75463 242322 83547 -241571
10049 -314661 -187905 -274226 -299686 -128260 -251003 -13824 24892 -74407 -135322 -35151 28653
10037 138622 -54253 -2033 -10590 -277714 -296096 -229517 -120019 -5174 -187470 143742 187231
10026 187231 87722 184150 180396 119921 9201 -152076 129765 -533186 -284759 26458 -168455
10014 56276 -53747 62802 -160032 -93769 75507 90375 -122477 -119994 100241 -73995 183073
10002 115438 -250211 -216631 142897 -160750 -132132 -263165 -108689 41858 -203334 -310385
9992c10385P3049N5724E2498L2056b79449J16720h191q6773q945A70029b7221
9980f1831k6585b7653A01999L7138c58841i2945A32074B390N3270M28255I0180
9968b16466A05126a48791C22231a44787L9092l9120A32274b20416e4413A96484
9957G6293N42J00664a84681C40995a02726j52258j16405i1618k65974i8772E4437
9945D6917Q5338b48226K450B89498I649J74636a47766H6175j8509k3626j2668
9934C1372a34367O0886C14843a07608J4920A42336c37677N6487H7853m3684b98462
9922a61843L8807E4053h1751j9247j1632A80475a3499j62969h3478j23160j19757
9911c26395A99792o0207c15k31223h5537I4962i0019k52p899A09486J52031b96466
$$ plain form
9992 -310385 -237336 -181612 52498 84554 -279449 -162729 -8191 -94964 -103909 170029 -27221
9980 -61831 -88416 -27653 101999 139137 -358841 -92945 132074 2390 55660 483915 90180
9968 -216466 105126 -148791 322231 -144787 -105695 -144815 132274 -220416 -54413 196484
9957 76293 76835 177499 -184681 340995 -102726 -254984 -371389 -91618 -357592 -98772 54437
9945 46917 132255 -248226 -245776 289498 9649 184285 -147766 86175 67666 44040 31372
9934 31372 -134367 -73481 314843 -107608 -92688 142336 -337677 -281190 87853 44169 -298462
9922 -161843 -123036 54053 -81751 -100998 -112630 180475 -13499 -176468 -83478 -206638 -326395
9911 -326395 199792 139585 -315 -231538 -85537 94962 -90019 -90271 -98170 109486 261517 -296466
9898F6449b11847p1070e4746j50073R8572I9649M3420h82j60090M7922B7259Q2233
9886A09492C567N8765b90292B18726c54075a6006A71190B260M4468J73611e0314
9874a68942B0671g9546l385a3868q6646H8596a89218O8679B93039j41247a16248
9862e0845j48724L0981B3854a28876h07A16540a09129l2259k1803B8189a28881
9850i3415L6911A99846D8279b10020e5256F1328a99512C9932k396a16681e8142
9838c84863J91586h1259j05975F4611r587a62311G3414b46618R0371H992b62636
9826H9979e8774A22283a44948O0471a8592n7961B6273K2324R4470p0384b8816
9814c23913i0664B5162b58126g6911A03979a85826M1247C2057d38085b06913j2301
$$ plain form
9898 66449 -211847 -282917 -54746 -204819 -106247 99649 143069 -882 -160972 -113050 27259 109492
9886 109492 3567 62332 -290292 218726 -354075 -16006 171190 2260 46728 220339 -50314
9874 -168942 20671 -79546 -82931 -13868 -100514 88596 -189218 -120539 293039 151792 -116248
9862 -50845 -199569 -168588 23854 -128876 -807 116540 -109129 -141388 -163191 28189 -128881
9850 -93415 -56504 199846 48279 -210020 -55256 61328 -199512 39932 37536 -116681 -58142
9838 -384863 -193277 -81259 -187234 64611 55024 -162311 73414 -246618 -156247 8992 -262636
9826 89979 -58774 122283 -144948 -84477 -18592 -76553 26273 48597 143067 72683 -28816
9814 -323913 -90664 25162 -258126 -76911 103979 -185826 -144579 32057 -438085 -206913 -219214
9803b19214P5337J3487A59106c30139g1142k00694a02260K3477F3842b39426j6235
9792b55661M9137l2266G6147a34588L08a9813j82853g2018F1978J04150b58347
9780f6917I3905a46612M9880E4989a03080O269B05719a34814H1640H147b48854
9768a83518g6902p0018I9908d3599l62861a14299A43712a7845j05641L503D8634
9756A5484a3548D2705b82324f476B9017b71210a07626A05170J56690g1113B45434
9744D32789b28459k39506G0281a34181D7806J84375C797c26295a7395j27387f649
9732a05118c6896j56534Q3373J1685A02128a23713C73825A36409e49404G3659
9721F4240a02361d2837j56827E0804b97419J29010o1771a11435M6399A37969b789
$$ plain form
9803 -219214 -143877 -130390 159106 -330139 -71142 -271836 -102260 -78783 63842 -239426 -255661
9792 -255661 -206524 -238790 76147 -134588 -134280 -19813 -202666 -72018 61978 166128 -258347
9780 -66917 93905 -146612 -96732 54989 -103080 -96811 205719 -134814 81640 8147 -248854
9768 -183518 -76902 -146920 99908 -43599 -406460 -114299 143712 -17845 -123486 -119983 48634
9756 15484 -13548 42705 -282324 -6476 29017 -271210 -107626 105170 261860 -71113 245434
9744 432789 -228459 -467965 70281 -134181 47806 232181 3797 -326295 -17395 -144782 -6649
9732 -105118 -36896 -193430 -110057 -98372 102128 -123713 373825 136409 -549404 73659
9721 64240 -102361 -42837 -199664 50804 -297419 -168409 -230180 -111435 -65036 137969 -2789
9709b35226G6187i272A29169g4544j5085B69499J23008b29377j51895B1503J35179
9698A56682a1626B8186f6392q5348C69777C8589i4810d4884j47081D1785b38903
9686B6295c6786F5985J9004J86793b32186C17733P6412A60096d6399B60582h4814
9674i8438j70128j42551c3039o4503j29082J5952H9732a21633j32923A32026c09124
9662a17545j16352L6389d702j60041g0052b9091c492O79o9281A3903J36305A0903
9649F1029a75351k1592d0949j84540b3546B7769h2867A84276f18k02664O665E4540
9636g7432D18d4692k21963a26899k4750A43733B5466c37002A59909b00890k93135
9625d94025f7640j13586J1778h0759L2880J520k03506J16603r1530D682P6541
$$ plain form
9709 -235226 76187 -9272 129169 -74544 -89629 269499 392507 -229377 -381272 21503 156682
9698 156682 -11626 28186 -66392 -151740 369777 38589 -94810 -44884 -191965 41785 -238903
9686 26295 -36786 65985 84989 271782 -232186 317733 394145 160096 -46399 260582 -84814
9674 -98438 -268566 -411117 -33039 -97542 -226624 -210672 89732 -121633 -254556 132026 -309124
9662 -117545 -233897 -197508 -4702 -164743 -70052 -29091 -3492 -2813 -72094 13903 150208 10903
9649 61029 -175351 -196943 -40949 -225489 -23546 27769 -82867 184276 -618 -203282 -196617 54540
9636 -77432 418 -44692 -266655 -126899 -151649 143733 25466 -337002 159909 -200890 -494025
9625 -494025 -67640 -181226 -169448 -80759 -47879 -46359 -249865 -133262 -224792 4682 81223
9614H1223d6724A42908d5373j41334g8099L993C35603a12819F5871J9553I122
9602A89237d54228e1895C4796b85376k6553C7450c2917A27660a96377g9482a9756
9590B96420G4694b67628A58382b14319A38688n0649c8155k49482c5625j38109
9580a73734N3277b5547A76630a39196a3795A25007i7117j12863f2165A60992b37204
9568h8310k12074a6831F6088a04205A08288b21739A06283j1420K3089L4485h688
9556a37725A1380b2378C59a03700I4591N8408b24297A4622a70643j11243J37781
9545a44105A6424c04448j74562K02581g9495B32388a48217D9206a77576g4330
9534a45679k76556R3548B2196a48856d1628B72166b99583M8590q8571F499b02452
$$ plain form
9614 81223 -46724 142908 -45373 -186707 -78099 -74106 335603 -112819 65871 85424 9122
9602 189237 -454228 -51895 34796 -285376 -311929 37450 -32917 127660 -196377 -79482 -19756
9590 296420 74694 -267628 158382 -214319 138688 88039 -38155 -287637 -35625 -173734
9580 -173734 -120457 -25547 176630 -139196 -13795 125007 -97117 -209980 -62165 160992 -237204
9568 -88310 -300384 -16831 66088 -104205 108288 -221739 106283 94863 117952 152437 -8688
9556 -137725 11380 -22378 359 -103700 94591 152999 -224297 14622 -170643 -281886 -144105
9545 -144105 16424 -304448 -479010 -276429 -79495 232388 -148217 49206 -177576 -74330
9534 -145679 -422235 -328687 22196 -148856 -41628 272166 -299583 -250993 -339564 6499 -202452
9522i8613q7699c3800j1034k25810l6314D9415a95283A17491a67274l9957H1351
9510a18331m0811A57304J06490A0723i9849A34291C1378J20803k9238D6872b13084
9498A78355b43800P2623D2687g2526l7292b2072A03773c98506h4231L0366l41328
9487c95193J60217l1903g2248j09498j42406J36642b1282r3815c1624B97052A6605
9475e2620D3432c50992A20283h0929r895M102C8622J08099a30154j09834a9725
9463c91244G466K03250a46978m30c4861A9428N8416b16821B18466H108a88271
9451B6787h2634k65889A12717d0302j34036L0735G1299b32631c8564A56155b56758
9439A47053g4012m9016m5599A55192j0498n3870a81327e1126j62785a5037e563
$$ plain form
9522 -98613 -186312 -33800 -44834 -270644 -306958 49415 -195283 117491 -167274 -207231 81351
9510 -118331 -159142 157304 263794 10723 -99849 134291 31378 152181 122943 46872 -213084
9498 178355 -243800 -171177 42687 -72526 -109818 -22072 103773 -398506 -84231 -53865 -395193
9487 -395193 -234976 -266879 -72248 -181746 -324152 -187510 -21282 -115097 -31624 297052 16605
9475 -52620 43432 -350992 120283 -80929 -90824 -86722 38622 146721 -130154 -239988 -19725
9463 -391244 7466 210716 -146978 -147408 -34861 19428 77844 -216821 218466 8108 -188271
9451 26787 -82634 -348523 112717 -40302 -174338 -143603 71299 -232631 -38564 156155 -256758
9439 147053 -74012 -123028 -168627 155192 144694 90824 -181327 -51126 -213911 -15037 -5563
9427A50228l7621K1855a50832C7088J94192b43239E6527c28572A7119a44503k5972
9416a70475A26510b14213J4095J3881h4187A70716j2956b05386I1390i4048D3612
9404c30785c103j63133A02765a50298l7410A96389h8001L2031l50424L2057a3171
9392b42163G4391A6122a18733L8666j36912d1311A5247d407C34285A35974a81803
9380B57430a11464k37103h650m7788j57257k2710k2222J9347L3436P869A76979
9368a03396j09296F8497J8690f0854j04721k0804m386K7176E2661j5220o638a64397
9355a60464H3626a99118a8758D8864b31551A17884g2297l056L6853j88908M7901
9344a79507B581N8552c24349F4669d2303j75397h8976l7904A23368a52900j54693
$$ plain form
9427 150228 112607 134462 -150832 37088 231280 -243239 56527 -328572 17119 -144503 -170475
9416 -170475 126510 -214213 -200118 -186237 -84187 170716 157760 -205386 91390 -94048 43612
9404 -330785 -3103 -166236 102765 -150298 -187708 196389 -88001 -55970 -406394 -374337 -13171
9392 -242163 74391 16122 -118733 -80067 -216979 -41311 15247 -4407 334285 135974 -181803
9380 257430 -111464 -348567 -8650 -56438 -213695 -236405 -258627 -239280 -205844 -197975 176979
9368 -103396 -212692 68497 87187 -60854 -165575 -186379 -190765 -163589 52661 37441 30803 -164397
9355 -160464 83626 -199118 -18758 48864 -231551 117884 -72297 -75353 -38500 -227408 -179507
9344 -179507 2581 61133 -324349 64669 -42303 -217700 -88976 -126880 123368 -152900 -307593
9333c07593i7750A4996L3283h4943k03492A59245a64297j78961l6454F5446c2147
9321A87055o3213a04461A40592e7743j18731a8625j82339a5911m82796a77923
9310B6464b35233k11392K11158j092o3131g8085k2035D64621A12909a60728A52794
9298E2809g8071k05442B29731E023J7803J60863N6671g192k0519A10191a07708
9286I3291i772m1738j69408k02891B3241K08113e2134j94476A77052d4379G0064
9274a26729e9699J5422A04634e3865k0241k4386J4812A56170a65111l23724B2786
9262a06627A72916a555k11847M1844a6746E8881Q7659b57149I699K7052J3453
9251E0204B1731E311J87873b63275B32271h6990A5346J1644J30066b48546A27056
$$ plain form
9333 -307593 -97750 14996 48279 -84943 -288435 159245 -164297 -343258 -379712 65446 -32147
9321 187055 123842 -104461 140592 -57743 -176474 -18625 -200964 -15911 -498707 -177923
9310 26464 -235233 -446625 -235467 -236559 -299690 -78085 -100120 464621 112909 -160728 152794
9298 52809 -78071 -283513 229731 5023 22826 183689 240360 -7192 -27711 110191 -107708
9286 93291 -9772 -51510 -220918 -423809 23241 231354 -52134 -246610 177052 -44379 70064
9274 -126729 -59699 -44277 104634 -53865 -74106 -98492 -83680 156170 -165111 -488835 22786
9262 -106627 172916 -1555 -213402 -171558 -16746 58881 146540 -257149 9699 36751 50204
9251 50204 21731 5311 193184 -263275 232271 -86990 15346 26990 157056 -248546 127056
9239b1190r2406B46336b40636J17870A58935m6792a79064G3022d93099G692K04251
9228B11943C280J3365A639a20988B5941c280D1040J1654M7950f7077B10405b12551
9215i6950k53173A24001a08413B6018a12474l1014k25287h228A67142o7705k3126
9204G6311j3235N7591e6415j23798k2522i5622j36556h6780k10162k0595B28588
9192F3180b25577P2461F0193B9711b51893A71339d44186e5211k3931k91552d4010
9180B60657E1136L094Q6818O0949A0985b37041J0293d3146l8962c4264C0391K1452
9168E1843a95247d7926j96050K5438B7119d91B71746E2391a17935K9159K1588
9157f7188A04743a53330D0481a57819c7689k23139A55951d2018l23190g0785L2951
$$ plain form
9239 -21190 -113596 246336 -240636 -122766 158935 112143 -179064 73022 -493099 7692 211943
9228 211943 3280 16645 1639 -120988 25941 -3280 41040 52694 100644 -67077 210405 -212551
9215 -96950 -350123 124001 -108413 26018 -112474 -143488 -368775 -8228 167142 99437 76311
9204 76311 63076 120667 -56415 -180213 -202735 -95622 -232178 -86780 -296942 -317537 228588
9192 63180 -225577 -153116 60193 29711 -251893 171339 -444186 -55211 -79142 -370694 -44010
9180 260657 51136 54230 141048 201997 10985 -237041 -226748 -43146 -82108 -34264 30391 51843
9168 51843 -195247 -47926 -243976 -218538 27119 -491 271746 52391 -117935 -88776 -67188
9157 -67188 104743 -153330 40481 -157819 -37689 -260828 155951 -42018 -365208 -70785 -37834
9146c7834j79682B7540h2055k0595B10049c06098B20042A03976l5939J77360a81011
9134B34084c04696J3146h8148j507C6399A401a33524M485B76048b0897k00336
9123b21233I1511A7863K19527a86914o1985L2690g3604m4024j76686J34730N450
9112a54134D3690a00825L3818b7634A22490a46741j63411M9602A080K35567c2741
9100g907j28915C50019c74495Q5531B9783b41802h5713p1754j267G6390M7109
9089A23499c53160J65371C3622J55279b26292h4134A64010a03370j8980i822C8988
9077a56707P7011H0381b61842f2573L342j24017H467L5656b51790H7567g4481
9065b19716B24744D1775c13671a5507k77722J04041l82350a21172A4063i8628
$$ plain form
9146 -37834 -217516 27540 -82055 -102650 210049 -306098 220042 103976 68037 245397 -181011
9134 234084 -304696 -291550 -88148 -89655 36399 1401 -133524 -129039 276048 -20897 -221233
9123 -221233 91511 17863 237390 -186914 -248899 -216209 -73604 -117628 -294314 -159584 -154134
9112 -154134 43690 -100825 -67007 -27634 122490 -146741 -310152 -260550 1080 236647 -32741
9100 -7907 -136822 350019 -374495 -288964 29783 -241802 -85713 -157467 -158734 76390 123499
9089 123499 -353160 -187789 33622 188901 -226292 -84134 164010 -103370 -122350 -9822 38988
9077 -156707 -79696 80381 -261842 -62573 -59231 -183248 8467 44123 -251790 87567 -74481
9065 -219716 224744 41775 -313671 -15507 -293229 -189188 -571538 -121172 14063 -98628
9054F9929J96790b42394N6841B17884n9439n9573J56559c44466f5671j84943C5273
9042b10554O0810k43994a3527j18725F1724a52518d3077m0923G4333a01238A13404
9030f7514B26041a14672j57904P0917j26521h86G5778c36099c572k30962D9495
9018A87313A0985J81758k7582b41140J5386E0104A7182b03245k09892h9638B0273
9006B32212D3849b02544A20117D3397K47934b78079a35439A84842f1481A30079
8995e2748r3941M7514a4334j54727h3927b2136l9062l0577C2074b87317Q7851
8984a99466O8868a1422A77775q3270L4501d2907g902k54582h0903K644p2317g4398
8971h772A70539a52194I673M4534f2825l30963f3104C5556a1037r8701j97365
$$ plain form
9054 69929 266719 -242394 -185553 217884 158445 98872 255431 -344466 -65671 -250614 35273
9042 -210554 -149744 -393738 -13527 -132252 61724 -152518 -43077 -84000 74333 -101238 113404
9030 -67514 226041 -114672 -272576 -201659 -328180 -886 75778 -336099 -3572 -234534 49495
9018 187313 10985 192743 165161 -241140 -225754 50104 17182 -203245 -413137 -89638 20273
9006 232212 43849 -202544 120117 43397 291331 -278079 -135439 184842 -61481 130079
8995 -52748 -146689 -99175 -14334 -169061 -83927 -22136 -61198 -91775 32074 -287317 -199466
8984 -199466 -130598 -11422 177775 94505 129006 -42907 -7902 -262484 -80903 -78259 -150576 -74398
8971 -8772 170539 -152194 9673 54207 -62825 -393788 -63104 35556 -11037 -109738 -307103
8960c07103A19563c15688N5184G6982P3268b68523F8316f2172p1077a0557j18079
8949a28636A1453a14664j88269R9317R0218n1657M5630d2528m7690l086I8797
8937B65184m0844j08897P3887o1690o3796B2654b30596B89929d16323a39403F8894
8925A61806N15742L54649K497182L336208J970989J075197C064561A321815C75680
8915G03526C19861j30505m115K55675c50696C1589K95787r8645n9379K46021j0279
8904D05094i5998k14703a0690r4377K4602N5k5515k7378B00046a96272M7418j53061
8892c01915c6018l3494j83889a2882F7026c03741a23734j08873i9842j16993G3269
8880b4974a1799A05865J31628a71709f8268I8338b4282j66817Q2065A57808c24824
$$ plain form
8960 -307103 119563 -315688 -260504 76982 150250 -268523 68316 -62172 -133249 -10557 -128636
8949 -128636 11453 -114664 -302933 -203616 -113398 -165055 -119425 -42528 -90218 -93304 98797
8937 265184 224340 115443 189330 127640 63844 22654 -230596 289929 -416323 -139403 68894
8925 161806 677548 1032197 3529379 6865587 8836576 9911773 3064561 1321815 375680
8915 703526 319861 189356 185241 440916 -350696 31589 327376 228731 169352 415373 405094
8904 405094 -95998 -310701 -10690 -105067 -80465 -80410 -105925 -133303 200046 -196272 -148854 -301915
8892 -301915 -36018 -69512 -253401 -12882 67026 -303741 -123734 -232607 -99842 -216835 73269
8880 -24974 -11799 105865 237493 -171709 -68268 98338 -24282 -191099 -109034 157808 -324824
8868b53118A2837K2198P7410a80586l35066b3614l13135A34175N4334K25271a20080
8856h0885B48956e95688g7635B58799d04926L9899A45452f4981m47893K42561
8846b70313L2859l1160A45360a62386k30144a77619C01130C9181K23624C0595
8835b43048H7789a15596k1993a7533q2285B13482b13344H1912a16038A33274B9901
$$ plain form
8868 -253118 12837 35035 112445 -180586 -515652 -23614 -336749 134175 188509 413780 -120080
8856 -80885 248956 -595688 -77635 258799 -404926 -365027 145452 -64981 -512874 -270313
8846 -270313 -237454 -268614 145360 -162386 -392530 -177619 301130 39181 262805 30595
8835 -243048 87789 -115596 -137589 -17533 -99818 213482 -213344 81912 -116038 133274 29901
$$ [...]
##END NTUPLES=NMR SPECTRUM
##END=
