
##TITLE=UV1225_M6_1234-1212_50_7231073_4BOEm63b0W
##JCAMPDX= 6.0         $$ Bruker NMR JCAMP-DX V2.0
##DATA TYPE= NMR SPECTRUM
##DATA CLASS= NTUPLES
##ORIGIN= BRUKER
##OWNER= Administrator
$$ 1.72 TOPSPIN		Version 2.1
$$ 2013-01-18 00:16:21.909 -0500  Administrator@X
$$ Compression mode = diff/dup
##.OBSERVE FREQUENCY= 400.02188249412
##.OBSERVE NUCLEUS= ^1H
##.ACQUISITION MODE= SIMULTANEOUS (DQD)
##.ACQUISITION SCHEME= undefined
##.AVERAGES= 64
##.DIGITISER RES= 22
##SPECTROMETER/DATA SYSTEM= spect
##.PULSE SEQUENCE= noesygpps1d.comp
##.SOLVENT NAME= COFFEE_meoh
##.SHIFT REFERENCE= INTERNAL, COFFEE_meoh, 1, 14.96147
##AUDIT TRAIL= $$ (NUMBER, WHEN, WHO, WHERE, PROCESS, VERSION, WHAT)
$$ ##TITLE= Audit trail, TOPSPIN		Version 2.1
$$ ##JCAMPDX= 5.01
$$ ##ORIGIN= Bruker BioSpin GmbH
$$ ##OWNER= Administrator
$$ $$ E:\/data/COFFEE/nmr/UV1225_M6_1234-1212_50_7231073_4BOEm63b0W/22/pdata/1/auditp.txt
$$ ##AUDIT TRAIL=  $$ (NUMBER, WHEN, WHO, WHERE, PROCESS, VERSION, WHAT)
(   1,<2013-01-18 00:16:16.237 -0500>,<Administrator>,<X>,<go>,<TOPSPIN 2.1>,
      <created by zg
	started at 2013-01-18 00:04:46.565 -0500,
	POWCHK enabled, PULCHK disabled,
       configuration hash MD5:
       86 BA 57 50 F2 9D 5C 9B 26 00 A9 28 5F 66 2E 89
       data hash MD5: 64K
       AB 4A 98 38 42 10 EF ED 23 C9 6E 4B 3D 8D EC C8>)
(   2,<2013-01-18 00:16:19.268 -0500>,<Administrator>,<X>,<proc1d>,<TOPSPIN 2.1>,
      <Start of raw data processing
       efp LB = 0.3 FT_mod = 6 PKNL = 1 PHC0 = 0 PHC1 = 0 SI = 128K 
       data hash MD5: 128K
       FD BB A0 01 18 BA 2D D1 B8 57 FD 86 68 EC 2F 0D>)
(   3,<2013-01-18 00:16:20.284 -0500>,<Administrator>,<X>,<proc1d>,<TOPSPIN 2.1>,
      <pk PHC0 = -82.0459 PHC1 = 0 
       data hash MD5: 128K
       C9 46 E8 B5 EE 6E 6C F4 F0 B9 B8 DF 34 C8 BF 9B>)
(   4,<2013-01-18 00:16:20.940 -0500>,<Administrator>,<X>,<proc1d>,<TOPSPIN 2.1>,
      <abs ABSG = 1 
       data hash MD5: 128K
       BF 30 64 FA 23 B7 82 26 9C 7A 48 03 7D AD 0A AD>)
(   5,<2013-01-18 00:16:21.128 -0500>,<Administrator>,<X>,<proc1d>,<TOPSPIN 2.1>,
      <abs ABSG = 2 
       data hash MD5: 128K
       DE 4B 9C 28 51 09 CF 59 C6 02 A1 A0 B6 30 36 0F>)
(   6,<2013-01-18 00:16:21.268 -0500>,<Administrator>,<X>,<proc1d>,<TOPSPIN 2.1>,
      <abs ABSG = 3 
       data hash MD5: 128K
       50 E2 35 23 17 DF 54 71 83 93 3E DE B9 27 F0 28>)
(   7,<2013-01-18 00:16:21.409 -0500>,<Administrator>,<X>,<proc1d>,<TOPSPIN 2.1>,
      <abs ABSG = 4 
       data hash MD5: 128K
       5B 26 71 7F C1 5E 43 16 D6 60 D8 4B 13 BA 98 4E>)
(   8,<2013-01-18 00:16:21.581 -0500>,<Administrator>,<X>,<proc1d>,<TOPSPIN 2.1>,
      <abs ABSG = 5 
       data hash MD5: 128K
       72 42 43 C4 0E 59 24 A5 EE 07 D8 32 A8 C3 04 D3>)
$$ ##END=
$$ 
$$ $$ hash MD5
$$ $$ 9D DA 84 EB ED 47 98 C8 16 2C AD 2F 52 62 94 54
##$RELAX= 
##$RELAX= 
##$RELAX= 
##$RELAX= 
##$RELAX= 
##$RELAX= 
##$RELAX= 
##$RELAX= 
$$ Bruker specific parameters
$$ --------------------------
##$DU= <E:\>
##$EXPNO= 22
$$ [...]
150 150 150 150 150 150 150 150
##$TP07= 0
##$TPNAME0= <>
##$TPNAME1= <>
##$TPNAME2= <>
##$TPNAME3= <>
##$TPNAME4= <>
##$TPNAME5= <>
##$TPNAME6= <>
##$TPNAME7= <>
##$TPOAL= (0..7)
0.5 0.5 0.5 0.5 0.5 0.5 0.5 0.5
##$TPOFFS= (0..7)
0 0 0 0 0 0 0 0
##$TUNHIN= 0
##$TUNHOUT= 0
##$TUNXOUT= 0
##$USERA1= <user>
##$USERA2= <user>
##$USERA3= <user>
##$USERA4= <user>
##$USERA5= <user>
##$V9= 5
##$VALIST= <valist>
##$VCLIST= <CCCCCCCCCCCCCCC>
##$VD= 0
##$VDLIST= <DDDDDDDDDDDDDDD>
##$VPLIST= <PPPPPPPPPPPPPPP>
##$VTLIST= <TTTTTTTTTTTTTTT>
##$WBST= 1024
##$WBSW= 4
##$XGAIN= (0..3)
0 0 0 0
##$XL= 0
##$YL= 0
##$YMAX_a= 6499632
##$YMIN_a= -14359417
##$ZGOPTNS= <>
##$ZL1= 120
##$ZL2= 120
##$ZL3= 120
##$ZL4= 120
##$ABSF1= 14.96147
##$ABSF2= -5.596712
##$ABSG= 5
##$ABSL= 3
##$ALPHA= 0
##$AQORDER= 0
##$ASSFAC= 0
##$ASSFACI= 0
##$ASSFACX= 0
##$ASSWID= 0
##$AUNMP= <proc_prof1d_extract.lims>
##$AXLEFT= 0
##$AXNAME= <>
##$AXNUC= <1H>
##$AXRIGHT= 0
##$AXTYPE= 0
##$AXUNIT= <>
##$AZFE= 0.1
##$AZFW= 0.1
##$BCFW= 0
##$BC_mod= 0
##$BYTORDP= 0
##$COROFFS= 0
##$CY= 15
##$DATMOD= 1
##$DC= 0
##$DFILT= <>
##$DTYPP= 0
##$F1P= 0
##$F2P= 0
##$FCOR= 0.5
##$FTSIZE= 131072
##$FT_mod= 6
##$GAMMA= 0
##$GB= 0
##$INTBC= 1
##$INTSCL= 1
##$ISEN= 128
##$LB= 0.3
##$LEV0= 0
##$LPBIN= 0
##$MAXI= 10000
##$MC2= 0
##$MEAN= 0
##$ME_mod= 0
##$MI= 0
##$NCOEF= 0
##$NC_proc= -2
##$NLEV= 6
##$NOISF1= 0
##$NOISF2= 0
##$NSP= 0
##$NTH_PI= 0
##$NZP= 0
##$OFFSET= 14.96147
##$PC= 1
##$PHC0= -82.0459
##$PHC1= 0
##$PH_mod= 1
##$PKNL= yes
##$PPARMOD= 0
##$PPDIAG= 0
##$PPIPTYP= 0
##$PPMPNUM= 2147483647
##$PPRESOL= 1
##$PSCAL= 4
##$PSIGN= 0
##$PYNMP= <proc.py>
##$REVERSE= no
##$SF= 400.020009449489
##$SI= 131072
##$SIGF1= 0
##$SIGF2= 0
##$SINO= 400
##$SIOLD= 131072
##$SPECTYP= <>
##$SREGLST= <1H.CDCl3>
##$SSB= 0
##$STSI= 131072
##$STSR= 0
##$SW_p= 8223.68421052631
##$SYMM= 0
##$S_DEV= 0
##$TDeff= 65536
##$TDoff= 0
##$TI= <>
##$TILT= no
##$TM1= 0
##$TM2= 0
##$TOPLEV= 0
##$USERP1= <user>
##$USERP2= <user>
##$USERP3= <user>
##$USERP4= <user>
##$USERP5= <user>
##$WDW= 1
##$XDIM= 131072
##$YMAX_p= 433429012
##$YMIN_p= -12029
##$CURPLOT= <Network HP LaserJet P1505>
##$CURPRIN= <$Network HP LaserJet P1505>
##$DFORMAT= <normdp>
##$LAYOUT= <+/1D_H.xwp>
##$LFORMAT= <normlp>
##$PFORMAT= <normpl>
##$SURQMSG= 1
$$ End of Bruker specific parameters
$$ ---------------------------------
##NTUPLES= NMR SPECTRUM
##VAR_NAME=  FREQUENCY,     SPECTRUM/REAL,   SPECTRUM/IMAG
##SYMBOL=    X,             R,               I
##VAR_TYPE=  INDEPENDENT,   DEPENDENT,       DEPENDENT
##VAR_FORM=  AFFN,          ASDF,            ASDF
##VAR_DIM=   131072,        131072,          131072
##UNITS=     HZ,            ARBITRARY UNITS, ARBITRARY UNITS
##FACTOR=    0.0627417313425164, 1,          1
##FIRST=     8223.62146879497, 2527,         -65865
##LAST=      0,             4082,            -66082
##MIN=       0,             -12029,          0
##MAX=       8223.62146879497, 433429012,    0
$$ Real data points
##PAGE= N=1
##DATA TABLE= (X++(R..R)), XYDATA
$$ [...]
64969 221280 217259 213655 209684 205579 202329 200349 199072 198020 197616 198485 200303 201844 202139 201260 199980
64954 199980 198888 197958 196780 195083 192986 190896 189256 188405 188421 188957 189342 189086 188250 187154 185852 184127
64938 184127 181991 179907 178469 178057 178731 180168 181699 182768 183425 184120 185009 185845 186563 187450 188503 189169
64922 189169 189066 188566 188153 187594 186356 184682 183541 183465 183962 184290 184338 184503 185066 186005 187281 188983 191207
64905 191207 193933 197038 200418 204131 208433 213580 219668 226685 234534 242830 250927 258497 266014 274199
64891 274199 282969 291389 298787 305502 312333 319642 327269 334932 342218 348390 352711 354972 355395 353970
64877 353970 350193 343566 334312 323633 313294 304708 298140 292815 287921 283387 279612 276761 274637 272993
64863 272993 271584 270019 267972 265456 262536 258870 253956 247819 241014 233961 226820 220076 214625 210940
64849 210940 208540 206572 204615 202697 200933 199480 198570 198231 198234 198503 199215 200216 200749 200275 199220 198383 197796
64832 197796 196828 195353 194177 194108 195071 196351 197421 198332 199515 201347 203828 206582 209235 211773 214431
64817 214431 217340 220379 223305 225941 228472 231616 236166 242159 248860 255848 263593 272379 281155 288247
64803 288247 292994 295924 297451 297374 295673 292809 288927 283662 277174 270549 264627 259130 253576 248458 244791
64788 244791 242899 242369 242856 244212 246054 247957 249965 252277 254486 255815 256111 256039 256223 256738 257572 259020
64772 259020 261377 264562 268292 272394 276829 281646 287061 293387 300793 309163 318108 326988 335078 342025
64758 342025 348112 353855 359465 364925 370369 375986 381667 387231 392910 399047 405286 410592 414254 416321
64744 416321 416840 415182 410547 402861 392803 381238 368954 356690 344987 334075 324178 315814 309430
64731 309430 304847 301383 298547 296330 294821 293851 293146 292568 292063 291590 291318 291822 293824 297647 303003 309368
64715 309368 316490 324414 333096 342102 350721 358220 363971 367554 368953 368530 366509 362500 355780 346191
64701 346191 334656 322699 311537 301625 292845 284884 277518 270699 264467 258770 253487 248701 244835
64688 244835 242306 241017 240363 239800 239286 239166 239788 241394 244165 248049 252544 256977 261227 265938 271791
64673 271791 278730 286152 293740 301694 310114 318459 325812 331427 334882 335933 334528 330949 325728 319397
64659 319397 312348 304923 297599 291081 286122 283044 281466 280676 280281 280314 280794 281580 282748 284635 287258 290044
64643 290044 292511 294924 297966 301987 306962 312956 320157 328553 337971 348388 359776 371665 383262
64630 383262 393973 403425 411043 416174 418776 419549 419107 417295 413477 407211 398527 387898 376156 364172
64616 364172 352335 340539 328909 318287 309687 303306 298378 294022 290074 287050 285347 284575 283705 281974
64602 281974 279510 276924 274411 271622 268442 265419 263217 261924 261178 260704 260457 260529 261328 263647 268021 274040
64586 274040 280772 287963 296360 306654 318517 331038 343797 357118 371421 386710 402555 418096
64574 418096 432060 443290 451520 457292 461001 462410 461342 458322 454004 448253 440432 430476 419069
64561 419069 406748 393515 379477 365259 351456 338206 325681 314550 305527 298688 293597 289782
64549 289782 286736 283799 280608 277496 275069 273544 272872 273192 274587 276571 278432 280109 282215 285183 288843
64534 288843 292759 296331 298527 298263 295425 291137 286716 282684 278918 275268 271694 268121 264555 261188
64520 261188 258191 255637 253788 253126 253779 255114 256175 256498 256345 256323 256952 258431 260608 263228 266301 270080
64504 270080 274571 279336 283983 288664 293831 299641 305857 312256 318879 325760 332497 338194 341893 343213
64490 343213 342634 341105 339307 337285 334728 331520 328117 325493 324546 325357 327064 328741 330304 332308 334981
64475 334981 337842 340205 341580 341490 339420 335337 330038 324721 320305 317187 315291 314167 313347 312870 313266
64460 313266 314825 317127 319556 322032 324899 328218 331479 333948 335084 334718 333129 330991 329024 327585
64446 327585 326654 326192 326382 327480 329500 332115 334904 337694 340648 344089 348404 354077 361528 370712 381129
64431 381129 392523 405405 420682 438989 460731 486431 516456 550571 588512 631156 680553
64420 680553 738702 806859 886082 977479 1081123 1194873 1314623 1435596 1553507 1665343
64410 1665343 1769786 1866711 1955737 2035188 2102430 2154766 2189797 2205630 2201610 2178849 2139624
64399 2139624 2086136 2019787 1941116 1849934 1746038 1630669 1507520 1381965 1259180 1142992
64389 1142992 1035903 939289 853349 777426 710769 652961 603610 561897 526561 496253 469953
64378 469953 447274 428334 413198 401392 392042 384420 378232 373450 369963 367311 364707 361429 357268
64365 357268 352448 347105 341106 334467 327615 321043 314901 309116 303693 298767 294530 291191 288737 286701
64351 286701 284548 282379 280808 280061 279805 280065 281565 284640 288463 291953 294921 297596 299511 299747 298064
64336 298064 294999 291018 286367 281601 277446 274134 271566 269991 269703 270105 270146 269879 270600 273000 276039 278262
64320 278262 279503 280598 281982 283373 284579 285801 287189 288715 290555 293072 296275 299571 302155 303397
64306 303397 302871 300389 296199 290901 285040 278885 272707 266902 261588 256302 250555 244648 239399 234994
64292 234994 230748 226408 223068 221975 222762 223777 224136 224518 225767 227739 230000 232752 236300 240214 243821
64277 243821 247217 251044 255570 260572 265841 271210 276408 281504 287133 293543 299755 304493 307698 310307
64263 310307 312747 314653 315969 317223 318454 318859 317924 316223 314726 313843 313409 313036 312190 310413 307732 304449
64247 304449 300462 295285 288860 281815 274846 268370 262776 258324 254661 251164 247912 245678 244807 244852 245417
64232 245417 246478 247675 248310 248451 249098 250740 252750 254786 257648 261766 265832 268185 268963 269656 270975
64217 270975 272479 274051 276372 279719 283390 286594 289095 290735 291211 290698 290049 289964 290421 291131 291982 292790
64201 292790 293203 293257 293598 294656 295901 296349 295690 294544 293733 293622 294160 295197 296613 298303 300242 302672
64185 302672 306124 311107 317710 325554 334093 342773 350905 357667 362474 365172 365731 363909 359428 352334
64171 352334 343051 332327 321288 311178 302527 294672 286586 278210 270573 264506 259668 255119 250592
64158 250592 246778 244324 242851 241199 238646 235714 233654 233255 234277 235913 237554 239203 241452 245038
64144 245038 250034 255435 259925 263153 265864 268677 271246 272868 273375 272982 271709 269539 266867 264260 261890
64129 261890 259685 257818 256520 255530 254293 252729 251355 250656 250766 251760 253741 256575 259964 263853 268382
64114 268382 273391 278414 283350 288746 295230 302851 311100 319263 326676 332971 338259 342896 346971 350330
64100 350330 353117 355879 358942 362012 364659 366934 369204 371554 373690 375290 376225 376501 376214 375484 374170
64085 374170 371641 367118 360428 352322 343953 336065 328804 322285 317026 313463 311096 308607 305123 301110
64071 301110 297657 295160 293249 291829 291377 291929 292442 291857 290488 289723 290370 291864 293193 294052 294774 295521
64055 295521 296115 296543 297101 297924 298795 299634 300841 302834 305488 308380 311444 314891 318586 322088 325436 329337
64039 329337 334238 339652 344784 349427 353742 357468 360012 361330 362099 362904 363678 364145 364402 364838 365707 366948
64023 366948 368254 369209 369601 369782 370494 372191 374630 377192 379375 380853 381266 380240 377580 373383 368089
64008 368089 362515 357583 353769 350796 347971 344779 341143 337347 333902 331312 329664 328439 326946 324972
63994 324972 322951 321607 321617 323405 326836 331015 334774 337658 340227 343165 346341 349131 351520 354369 358409
63979 358409 363378 368405 372955 377082 381038 385107 389801 395717 402986 411075 419299 427356 435367 443634
63965 443634 452413 461731 471320 481021 491362 503366 517484 533050 549161 565941 584507 605746
63953 605746 629547 655380 683250 713900 748337 787465 832116 883162 941411 1007428 1081605
63942 1081605 1164582 1257735 1363147 1482827 1617751 1767532 1930995 2107030 2294827 2493328
63932 2493328 2700540 2913558 3129254 3344739 3557048 3762605 3957354 4137307 4298546
63923 4298546 4436694 4547001 4625531 4670315 4681321 4659634 4606842 4524768 4415074 4279012
63913 4279012 4117996 3934755 3733868 3521006 3301567 3079843 2859163 2642579 2433229
63904 2433229 2233999 2046911 1873106 1713422 1568715 1439432 1325122 1224680 1137001 1061174
63894 1061174 996138 940430 892384 850441 813362 780300 750766 724451 701068 680313 661780
63883 661780 644891 629109 614304 600681 588227 576601 565807 556567 549557 544475 540411 537068
63871 537068 535115 535307 537767 542312 549033 558250 570155 584728 601853 621274 642599 665539 690065
63858 690065 716223 743836 772447 801484 830438 859083 887639 916629 946423 976908 1007513
63847 1007513 1037504 1066309 1093727 1119827 1144469 1166929 1186123 1201253 1212102 1218668 1220720 1217823
63835 1217823 1209702 1196435 1178356 1155860 1129314 1099130 1065906 1030432 993491 955633 917190
63824 917190 878461 839812 801576 764023 727481 692449 659411 628472 599268 571474 545450
63813 545450 522166 502203 484968 469164 453958 439414 425897 413551 402522 393098 385264 378388
63801 378388 371741 365153 358888 353132 347925 343373 339419 335477 330722 324881 318545 312660 307820 303924
63787 303924 300408 296852 293476 290788 288702 286407 283335 279826 276489 273425 270609 268533 267621 267206 266078
63772 266078 264096 262432 262015 262490 262956 263020 262747 262212 261659 261605 262162 262567 261918 260254 258487 257374 256908 256636
63754 256636 256188 255516 254824 254285 253775 253022 252098 251517 251693 252525 253720 255216 256987 258749 260265 261803 263822
63737 263822 266198 268216 269445 270296 271535 273542 276253 279563 283368 287223 290348 292281 293465 295003
63723 295003 297753 301764 306531 311592 316722 321752 326512 331022 335564 340384 345340 349921 353634 356390
63709 356390 358450 359975 360718 360317 358846 356858 354860 352965 351138 349524 348342 347640 347300 347186 347211 347454
63693 347454 348243 349788 351651 353002 353609 354109 354973 355714 355661 355146 355176 356102 357241 357756 357374 356267 354845
63676 354845 353734 353478 354129 355466 357524 360476 364110 367908 371607 375154 378236 380529 382381 384533 387046
63661 387046 389213 390675 391883 393175 394105 394083 393074 391248 388477 384697 380348 375973 371637 367007 361708
63646 361708 355479 348505 341871 337094 334733 333922 333636 333838 334867 336303 337314 337892 338935 341137 344395
63631 344395 348334 352772 357470 361924 365776 369317 373386 378715 385388 392910 400838 409255 418503 428687
63617 428687 439819 452325 466825 483334 501224 520167 540573 562861 586853 612244 639141
63606 639141 667709 697681 728584 760032 791460 822069 851530 880226 908230 934471 957376
63595 957376 975924 989496 997339 999086 995566 988241 977970 965011 950006 934045 917752 901075
63583 901075 883996 866712 848954 829981 809519 788170 766627 745000 723295 702137 682663
63572 682663 665797 651760 640142 630459 622787 617760 615737 616186 618182 621206 625021 629090 632863 636518
63558 636518 640731 645709 651174 657328 665049 674876 686499 699579 714492 731895 752036 774876 800450
63545 800450 828758 859639 893015 928875 966761 1005720 1045054 1084499 1123019 1157766 1184956
63534 1184956 1201936 1208304 1205461 1195621 1181081 1163651 1144320 1123546 1101889 1080261 1059542 1040020
63522 1040020 1021124 1001580 980055 955917 929391 900910 870505 838138 804519 771185 739565
63511 739565 710132 682601 656794 633030 611689 592664 575479 559848 545838 533479 522498
63500 522498 512555 503507 495260 487631 480579 474363 469097 464358 459655 455231 451866 449778 448176 446118
63486 446118 443597 441486 440562 440746 441232 441256 440778 440448 440932 442405 444799 448209 452655 457604 462195 465992
63470 465992 469111 471586 473109 473526 473143 472218 470517 467704 463935 459724 455382 450898 446317 441974 438271
63455 438271 435247 432419 429153 425388 421899 419573 418510 418200 418581 420335 423919 428832 434349 440611 448471
63440 448471 458320 469608 481579 494152 507961 523774 542012 562723 585828 611242 638757 668047
63428 668047 699124 732616 768878 806431 841757 871330 893796 909967 921179 928600 934100 940609
63416 940609 950666 964837 982150 1001932 1024629 1050743 1079614 1109656 1139508 1168492 1196026
63405 1196026 1221052 1242185 1258122 1267795 1270494 1266258 1256080 1241392 1223260 1202257 1179037 1154653
63393 1154653 1130118 1105784 1081226 1055541 1027770 997382 964727 930921 897121 863984 831944
63382 831944 801757 774330 749994 728249 708434 690553 675306 663374 654747 648780 644849 642858
63370 642858 643050 645392 649379 654581 661188 669813 680808 694008 709145 726192 745199 766044 788618
63357 788618 813166 840175 869840 901795 935370 969954 1004981 1039751 1073628 1106478 1138618
63346 1138618 1170016 1199561 1225405 1246039 1260766 1269026 1269867 1262821 1249234 1231917 1213074 1192948
63334 1192948 1170870 1147076 1122768 1098685 1074414 1049171 1022462 993811 962801 930009 897313
63323 897313 866553 838216 811970 788066 767403 750434 736848 726387 719218 715282 713707 712850
63311 712850 710379 703492 690166 670723 647673 623636 599890 577002 555917 537576 521922 508069
63299 508069 495387 483941 474056 465878 459250 453574 447958 441829 435347 428983 422966 417360 412305 407744
63285 407744 403207 398347 393499 389328 386112 383747 382094 380781 379051 376494 373809 372115 371559 371248 370569
63270 370569 369874 369669 369777 369608 368852 367643 366391 365634 365772 366687 367810 368649 369127 369452 369926 370806 372066
63253 372066 373368 374603 376269 378861 381975 384656 386647 388671 391349 394486 397701 401112 404947 408980
63239 408980 412935 417128 422150 428060 434375 440866 447927 456031 465118 474638 484103 493567 503636 515016
63225 515016 527894 541731 555658 569163 582413 595925 609947 624192 638195 651755 664893
63214 664893 677570 689828 702140 715058 728293 740688 751470 761094 770316 778842 785552 789810
63202 789810 791745 791254 787580 780250 769912 757843 744871 731050 716254 700877 685957 672614
63190 672614 661379 652209 645176 640710 638918 639119 640583 643460 648423 655634 664649 675135 686991 699894
63176 699894 713422 727579 742553 758031 773534 789361 806264 823988 841052 856320 870002
63165 870002 882686 894145 903686 911068 916470 919943 921394 920763 917759 911726 902214 889457 874077
63152 874077 856533 837041 815675 792456 767735 742603 718363 695368 673035 651231 630961
63141 630961 613211 597855 584302 572646 563327 555996 549540 543207 537178 532058 528252 525835 524708
63128 524708 524821 526283 529025 532366 535410 538059 541096 545025 549467 554021 558948 564323 569223 572703
63114 572703 575174 577870 581180 584462 587361 590254 593267 595840 597677 599341 601381 603461 604940 605939
63100 605939 607158 608755 610039 610469 610506 611087 612383 613533 613793 613615 614211 616138 618703 620812 622104 623156
63084 623156 624920 628068 632546 637489 641682 644347 645535 645880 646176 647031 648530 650146 651310 652010 652536
63069 652536 652797 652507 652023 652264 653686 655941 658720 662232 666638 671750 677666 685007 694131 704830 717261
63054 717261 732367 750621 770968 791843 812855 834814 858567 884535 912970 943706 975755
63043 975755 1007938 1039949 1072361 1105786 1140494 1176531 1213512 1250404 1286073 1319988 1352085
63032 1352085 1382345 1410998 1438681 1465624 1490895 1513178 1532107 1548185 1561559 1571562 1577306
63021 1577306 1578035 1573086 1562290 1546357 1526159 1501686 1472430 1438730 1402021 1363750 1324868 1286405
63009 1286405 1249688 1215643 1184522 1156624 1132712 1113438 1098851 1088842 1083699 1083829 1089073 1098537
62997 1098537 1111118 1126195 1143924 1164715 1188311 1213642 1239748 1266575 1294531 1323637 1353480
62986 1353480 1383618 1413542 1442571 1470253 1496504 1520795 1541755 1558322 1570875 1580341 1586448 1587831
62974 1587831 1583629 1574015 1559215 1539080 1513679 1483394 1448337 1408657 1365526 1320819 1275542 1229499
62962 1229499 1182808 1136752 1092705 1051056 1011682 974668 939974 907118 875836 846588 819835
62951 819835 795273 772240 750430 729732 709851 690589 672198 654947 638643 623018 608297
62940 608297 594932 582977 572102 562136 553210 545399 538431 531785 525065 518397 512310 507071 502360
62927 502360 497895 494064 491374 489498 487623 485628 484067 482951 481486 479317 477156 475683 474577 473173
62913 473173 471511 470084 468912 467498 465503 463070 460622 458556 456953 455474 453862 452567 452405 453539
62899 453539 455366 457508 460172 463281 466076 468149 470200 473121 476782 480349 483400 486053 488279 489816
62885 489816 490741 491556 492670 494091 495604 497022 498383 500075 502565 505762 508756 510393 510098 508206 505759
62870 505759 503905 503030 502361 500797 498158 495135 492018 488214 483304 477918 473108 469276 466111 463156 460127
62855 460127 457070 454520 453043 452336 451296 449325 447123 445777 445576 446056 446707 447154 447128 446780 446623 446809 446891
62838 446891 446647 446481 446510 446011 444519 442887 442319 442700 442812 441998 440761 439820 439435 439668 440562 441915 443429
62821 443429 445144 447284 449677 451803 453422 454692 455743 456609 457610 459310 462012 465520 469344 472873
62807 472873 475584 477479 479153 481082 483079 484931 487159 490478 494697 499005 503286 508311 514448 521016
62793 521016 527285 533424 539979 546890 553695 560480 568124 577648 589614 604108 620897 639524 659617
62780 659617 681417 705910 734109 766048 800682 836949 874748 914605 956530 999683 1043179
62769 1043179 1086742 1130350 1173636 1215870 1256200 1293592 1326841 1354956 1377371 1393633 1403171
62758 1403171 1405657 1401235 1390098 1372102 1347189 1315952 1279418 1238481 1193935 1146912 1098841 1050926
62746 1050926 1003878 958108 914016 872126 833027 797037 763904 733057 704272 677813 653910
62735 653910 632504 613565 597176 583105 570767 559841 550391 542167 534468 527086 520722 515888 512048
62722 512048 508487 505413 503369 502125 501159 500903 502424 505936 510622 516030 522613 530626 539371 548081 556991
62707 556991 567043 578900 592666 608294 625845 645407 667021 690727 716618 744835 775494
62696 775494 808658 844501 883481 926088 972215 1020968 1071180 1121960 1172787 1223531 1274471
62685 1274471 1325661 1375959 1423138 1465307 1501680 1531618 1553699 1566523 1569946 1564663 1550892 1528240
62673 1528240 1496694 1457005 1410304 1358097 1302414 1245126 1187147 1128996 1071937 1017643 966709
62662 966709 918447 872351 829007 789325 753639 721771 693332 667624 643886 621985 602364
62651 602364 585043 569251 554391 540822 529202 519468 510985 503447 497108 492071 487743 483214 478147
62638 478147 473210 469448 467175 465752 464572 463856 464137 465230 466311 466834 466837 466383 465280 463430 460988 458083
62622 458083 454770 451308 448116 445387 443090 441328 440298 439859 439530 439004 438453 438364 439277 441465 444500 447337
62606 447337 449319 450988 453453 457104 461467 466151 471334 477316 484236 492314 501810 512579 524080 535964
62592 535964 548375 561734 576568 593380 612176 632232 652768 673686 695135 716624 737298
62581 737298 756912 775645 792933 807315 817668 823936 826523 825633 821428 814179 803985 790780 774748
62568 774748 756279 735625 713207 690245 668203 647489 627466 607921 589641 573221 558197
62557 558197 543909 530550 518781 508809 500388 493295 487335 482123 477239 472431 467620 463079 459586
62544 459586 457772 457163 456470 455001 453172 451542 450180 449299 449600 451367 453900 456391 458777 461137 462926
62529 462926 463572 463477 463687 464860 467088 470413 474854 480151 486124 493191 502016 512668 524592 537369
62515 537369 551135 566261 582942 601227 621325 643731 668931 696808 726530 757339 789294
62504 789294 822745 857236 891603 925232 958375 990956 1021765 1049271 1072716 1092015 1107226
62493 1107226 1118728 1127435 1134185 1139096 1141985 1143236 1143890 1145060 1147583 1152062 1158865 1168103 1179573 1192512
62479 1192512 1205498 1217121 1226913 1235076 1241153 1243458 1240103 1230183 1213851 1191830 1165014 1133931
62467 1133931 1098318 1057818 1013335 967017 920609 874511 828821 784456 742655 704018 668682
62456 668682 636840 608506 583322 561200 542632 527770 515762 505642 497333 491100 486532 482829
62444 482829 479653 476981 474546 472253 470769 470910 472618 475180 478101 481115 483736 485588 486958 488268
62430 488268 489244 489367 488871 488447 488147 487412 486064 484437 482555 479991 476632 472883 469014 464874 460350 455624
62414 455624 450936 446539 442841 440089 437953 435860 433625 431363 429011 426443 423872 421624 419759 418426
62400 418426 418250 419625 421874 423920 425656 427834 430710 433754 436781 440486 445498 451554 457898 464020
62386 464020 469775 475305 481083 487642 495041 502856 510708 518486 526144 533758 541747 550538 559979 569445
62372 569445 578531 587260 595824 604641 614510 626029 638885 652364 666601 682698 701533 723137
62360 723137 747365 774514 805023 839184 877410 920281 967925 1019662 1074491 1131590 1190196
62349 1190196 1249427 1308501 1366813 1423492 1477009 1525396 1566783 1599746 1623472 1637744 1642687
62338 1642687 1638577 1625954 1605716 1578780 1545828 1507578 1465060 1419259 1370751 1320094 1268366
62327 1268366 1216818 1166247 1117195 1070497 1026984 986722 949149 913865 880733 849373 819302
62316 819302 790626 763963 739544 716931 695600 675318 656057 638120 622338 609464 599289
62305 599289 590854 583432 576746 570462 564359 559000 555324 553363 552098 550763 549600 549184 549777 551489 554293
62290 554293 557659 560920 564194 568140 572609 576484 579159 581219 583251 584973 586146 587379 589193 591061
62276 591061 592266 593097 594343 596156 598344 601350 605933 612100 619306 627609 637731 649950 663802 679113
62262 679113 696643 717317 741325 768399 798726 833170 872494 916548 964373 1015186 1069025
62251 1069025 1126193 1186173 1247513 1308785 1369198 1428050 1484001 1535110 1579245 1614277 1638403
62240 1638403 1650810 1651900 1642586 1623557 1595403 1559138 1516243 1468283 1416601 1362081 1305060 1245792
62228 1245792 1185217 1124960 1066521 1010875 958996 911962 870082 832462 798154 767341 740717
62217 740717 717968 697618 678405 660278 644017 630330 619320 610450 602881 596067 589994 584759
62205 584759 580197 576208 573174 571551 571164 571290 571411 571560 572091 573551 576667 581940 589101 597338 606178
62190 606178 615916 627122 639977 654229 669578 685925 703283 721470 740015 758526 777188 796587
62178 796587 816841 837207 856851 875749 894368 912620 929725 945193 959463 973358 987341
62167 987341 1001697 1017162 1034908 1055801 1079944 1106986 1136651 1168784 1203044 1238793 1275232
62156 1275232 1311432 1346246 1378485 1407289 1431980 1451369 1463636 1467410 1462890 1451533 1434732 1413177
62144 1413177 1387257 1357395 1323810 1286514 1245857 1202803 1158614 1114648 1072542 1033885 999220
62133 999220 967725 938373 911246 887341 867303 850754 836809 824815 814521 805778 798299 791794
62121 791794 786316 782313 780054 779107 778739 778934 780543 784242 789565 795235 800256 804556 808786 813610 819067
62106 819067 824558 829622 834587 840118 846315 852870 860024 868456 877912 886720 893265 897325 899473 899920
62092 899920 898911 897817 898628 902171 907503 913133 918173 922178 924713 925663 925703 925978 927377 930348 935344
62077 935344 943139 954506 969627 987966 1008856 1032040 1057419 1084369 1111736 1138620 1164840 1190517
62065 1190517 1215620 1240157 1264479 1289013 1313929 1339331 1365537 1392849 1421169 1450017 1478728
62054 1478728 1506460 1532298 1555459 1575084 1589728 1597684 1598202 1591924 1579726 1561678 1537674 1508367
62042 1508367 1474554 1436010 1392099 1343551 1292678 1241545 1190687 1139909 1089609 1040862 994764
62031 994764 952177 913712 879414 848616 820568 795221 773158 754784 739713 726929 715458
62020 715458 704966 695743 688021 681427 675243 669130 663254 657658 651890 645513 638759 632362 626785 621828
62006 621828 617116 612810 609669 608313 608512 609391 610337 611508 613373 616009 619079 622361 625975 630046 634290
61991 634290 637961 640103 639998 637593 633528 628602 623138 616893 609500 600894 591411 581624 572036 562835
61977 562835 553928 545240 536841 528741 520740 512704 504952 498210 493106 489611 486924 483993 480373 476600
61963 476600 473571 471646 470514 469775 469222 468686 468171 468229 469598 472290 475585 479177 483667 489485 495957 502107
61947 502107 507949 514314 521734 530239 540054 551689 565291 580595 597606 616738 638049 660806
61935 660806 684108 707725 732229 758369 786250 814944 843014 869611 894841 918894 941262
61924 941262 961279 978969 994584 1007515 1016535 1021180 1022105 1019933 1014586 1006183 995948 985642 976454
61911 976454 968809 962940 959135 957621 958602 962426 969379 979315 991610 1005469 1020205 1035320 1050290
61898 1050290 1064166 1075481 1082879 1085827 1084501 1079035 1069414 1056143 1040380 1022951 1003675 982159
61886 982159 959089 936143 914672 894903 876463 859124 842774 827054 811591 796608 782924
61875 782924 771055 760472 750005 739054 728253 718829 711433 705708 700916 696758 693513 691537 690851
61862 690851 691326 693071 696426 701602 708580 717431 728372 741289 755627 771306 789496 811792 838577
61849 838577 868818 901531 936690 974291 1013286 1052181 1090331 1128002 1165292 1201532 1235583
61838 1235583 1266164 1291950 1311887 1325589 1333241 1335276 1332399 1325610 1315724 1303066 1288230 1273081
61826 1273081 1260394 1252212 1248837 1249382 1252909 1258974 1267507 1278368 1290825 1303384 1314296 1322115 1325564
61813 1325564 1323191 1313764 1297082 1274002 1245605 1212716 1176223 1137299 1097052 1056206 1015320 975096
61801 975096 936387 900111 867128 837843 811923 788771 768377 751335 737880 727262 718324 710389
61789 710389 703419 697513 692554 688221 684205 680470 677352 675220 673988 673088 672037 670878 669961 669424 669010
61774 669010 668290 667003 665189 663145 661308 660103 659668 659567 658972 657521 655950 655422 656141 657102 657442 657515 658201
61757 658201 659654 661282 662721 664185 665947 667918 669775 671121 671620 671271 670431 669301 667610 665123 662111
61742 662111 658887 655275 651083 646818 643238 640402 637864 635610 633996 632820 631332 629335 627559 626707
61728 626707 626746 627374 628619 630658 633403 636486 639433 641864 643924 646371 649790 653773 657371 660219 662598
61713 662598 664552 665735 666082 665853 664965 663091 660499 657866 655066 651117 645726 639981 635018 630824 626874
61698 626874 623156 619845 616593 612911 608836 604676 600550 596710 593836 592314 591565 590655 589268 587604 585754
61683 585754 583781 582085 580985 580177 579206 578315 578231 579146 580385 581041 580657 579391 577846 576594 575649 574584
61667 574584 573259 572029 571012 569784 568224 567033 566759 566781 566059 564578 563224 562404 561647 560570 559467 558772
61651 558772 558555 558715 559175 559752 560338 561375 563659 567417 571868 575888 578896 581037 582858 585004 587892
61636 587892 591403 594954 597893 599717 599994 598447 595342 591587 588122 585152 582071 578180 573491 568776
61622 568776 564811 561587 558388 554585 550221 545857 542116 539427 537916 537296 536934 536175 534525 531616 527269
61607 527269 521755 515790 510084 504869 499764 493956 486737 478307 470013 463290 458261 453806 449069 444279
61593 444279 439893 435669 431184 426776 423309 421134 419730 418260 416139 413295 410227 407606 405451 402949
61579 402949 399447 395406 391975 389775 388521 387614 386633 385308 383552 381614 379920 378724 377992 377491 376819
61564 376819 375604 373983 372677 372277 372610 373072 373328 373392 373302 373153 373332 374247 375939 378187 380838 383666 386176
61547 386176 388004 389378 390719 391905 392401 392086 391510 391304 391634 392228 392679 392796 392965 394043 396552 400105
61531 400105 403876 407433 410748 413681 415980 417620 418587 418488 417016 414783 412965 411991 411140 409612 407389
61516 407389 404843 402074 399097 396267 394057 392566 391510 390567 389534 388395 387399 386887 386843 386843 386644 386544 386881
61499 386881 387397 387442 386752 385710 384818 384232 383917 384006 384686 385735 386442 386240 385399 384859 385259 386266 386989 386965 386545
61480 386545 386301 386310 386150 385563 384943 385084 386502 389038 392089 395026 397357 398778 399303 399275 399038 398636 398002 397246
61462 397246 396487 395599 394532 393757 393880 394783 395610 395751 395398 395087 395122 395631 396684 398102 399523 400848 402276
61445 402276 403767 404941 405711 406496 407598 408887 410435 412831 416372 420406 424040 427141 430214 433686 437855
61430 437855 443040 449076 454864 459130 461621 463176 464768 466920 469750 472964 475952 478427 480939 484231
61416 484231 488182 491839 494472 496133 497223 497949 498267 497999 496938 495033 492445 489381 486066 482993 480775
61401 480775 479473 478433 477039 475193 472808 469548 465641 462295 460472 459654 458677 457432 456807 457134 457693
61386 457693 457853 457815 458059 458740 459818 461251 462876 464553 466394 468392 470007 470776 471270 472716 475575 479123
61370 479123 482531 485661 488690 491618 494438 497293 500182 502885 505331 507723 510226 512873 515749 518892
61356 518892 522044 524978 528022 531784 536359 541389 546905 553611 562205 572828 585132 598414 611740
61343 611740 624446 636604 648553 660099 670600 679669 687236 693173 697522 700843 703475 704609 703081
61330 703081 699103 694218 689448 684486 678942 673242 667800 662306 656550 651186 646904 643356 639700 635859
61316 635859 632573 630389 629121 628317 627870 628148 629609 632324 635925 640169 645269 651341 657863 664363 671453
61301 671453 680407 691646 704312 717326 730076 741955 752039 759489 763687 764003 760299 753791 746429
61288 746429 739109 731300 722682 714100 706491 699921 694335 690254 687915 686500 685176 684281 684670 686368 688770
61273 688770 691738 695593 700278 705321 710579 716386 723005 730398 738349 746438 754104 761158 768065 775428
61259 775428 783477 792322 802257 813476 825970 840058 856338 874425 892163 906811 916845 922187
61247 922187 923188 920236 914071 905547 894934 882034 867174 851658 837064 824243 813008 802568
61235 802568 792308 782349 773420 766213 760947 757361 754857 752759 750890 749831 750182 751718 753865 756758
61221 756758 760907 765905 770637 775008 780209 786728 793212 798049 801102 803173 804730 806173 808388 811884
61207 811884 815978 819890 824015 828975 834052 837940 840763 844078 848993 855416 863044 871932 882114 893744
61193 893744 907692 924964 945420 968006 992314 1018824 1047329 1076104 1103050 1126923 1147186
61182 1147186 1163592 1176497 1186901 1195558 1202373 1207030 1209753 1211045 1210989 1209242 1205483 1199572 1191414 1181013
61168 1181013 1168679 1155026 1140594 1125316 1108312 1088489 1065613 1040635 1014836 988921 963151
61157 963151 937930 913823 891257 870629 852426 836742 822974 810538 799745 791437 785938 782893
61145 782893 781974 783112 786004 789835 793580 796327 797403 796522 793731 789103 782819 775730 769231 764146 760254
61130 760254 757376 756247 757627 761220 766453 773770 784066 797180 812181 829016 848659 871525 896865
61117 896865 923967 952898 983710 1015838 1048696 1082165 1116018 1149494 1181864 1212910 1242568
61106 1242568 1270528 1296501 1320451 1342312 1361781 1378500 1392197 1402651 1409823 1413874 1414609 1411112
61094 1411112 1402455 1388605 1370089 1347071 1319508 1288102 1254242 1219013 1182938 1146628 1110902
61083 1110902 1076294 1043184 1012326 984399 959088 935552 913749 894336 877259 861583 846902
61072 846902 833825 822761 813285 805140 798800 794469 791387 788777 786801 786058 786721 788588 791386 794617
61058 794617 797757 801010 805332 811418 819188 828386 838921 850419 862345 874929 889251 906020 924977
61045 924977 945740 968400 993019 1019371 1047459 1077362 1108328 1139118 1169620 1201001 1233755
61034 1233755 1266760 1298940 1330656 1362676 1394837 1426695 1458467 1490341 1521678 1551941 1581791
61023 1581791 1612405 1644309 1677514 1712032 1747564 1783606 1820642 1860406 1904291 1952607 2006081
61012 2006081 2066720 2135981 2213251 2297348 2388504 2487826 2596280 2715826 2850501 3005004
61002 3005004 3183529 3391659 3638239 3933902 4289432 4717469 5233830 5854506 6592613
60993 6592613 7459119 8460456 9587509 10808145 12079239 13370103 14672146 15989219
60985 15989219 17329776 18712641 20171118 21744771 23473790 25400620 27543542 29818851
60977 29818851 31973335 33634410 34491207 34469899 33750905 32633594 31398033 30267804 29417743
60968 29417743 28920438 28650981 28286194 27464829 25996372 23944561 21540567 19035681 16614754
60959 16614754 14388705 12414082 10706441 9252894 8028824 7008186 6163428 5465251
60951 5465251 4887550 4410279 4016037 3687075 3407668 3166982 2957616 2773025 2607765
60942 2607765 2458381 2322264 2196679 2079987 1972487 1874709 1785776 1704349 1630013 1562536
60932 1562536 1500610 1442398 1386681 1332735 1279981 1228761 1180734 1137512 1099320 1065511 1035611
60921 1035611 1009125 985189 963318 943860 926894 911377 896289 881975 869395 858606 848949
60910 848949 840163 832279 824834 817292 809958 803460 797607 791743 785958 780869 776288 771134 764763 757508
60896 757508 749870 741974 733914 725874 717835 709797 702250 695673 689650 683345 676945 671766 668734 667513
60882 667513 667307 667751 668714 669962 671427 673299 675537 677764 679930 682608 686359 691150 696568 702193 707635
60867 707635 712653 717501 722811 729013 736095 743877 752031 759953 767186 774100 781601 790084 799198 808585
60853 808585 818183 827742 836824 845513 854479 864075 874014 884109 894601 905503 916360 927027 937973
60840 937973 949427 960936 972128 983201 994221 1004735 1014631 1024632 1035319 1046357 1057330 1068539
60828 1068539 1080155 1091314 1101165 1110253 1119678 1129082 1136553 1140562 1141092 1138877 1134490 1128392 1121016 1112307
60814 1112307 1101555 1087984 1071399 1052311 1031777 1011028 990900 971542 952799 934647 917062
60803 917062 899879 883235 867830 854209 841953 830078 818050 806020 794328 783336 773521 765082
60791 765082 757543 750196 742831 735626 728591 721666 715171 709557 704785 700401 695985 691053 684861 677046
60777 677046 668312 659798 651848 643958 635754 627330 618736 609900 601076 592711 584860 577255 569904 563064
60763 563064 556769 550908 545588 540823 536134 531177 526483 522761 519787 516902 514285 512585 511520 510217
60749 510217 508926 508900 510334 511900 512854 514117 516425 518649 519084 517564 515271 513140 511400 510115 509198
60734 509198 508255 507136 506278 505902 505415 504370 503418 503479 504377 505211 505604 505681 505121 503361 500663 497939 495358
60717 495358 492066 487506 482244 477126 472253 467239 462017 456932 452290 448151 444419 440850 437141 433245
60703 433245 429595 426752 424745 422932 420694 418286 416680 416405 416803 416794 416184 415705 415794 416009 415861 415614 415811
60686 415811 416372 416705 416511 416116 416126 417001 418884 421561 424676 428135 432177 436935 442160 447535 452984 458477
60670 458477 463788 468721 473428 478244 483314 488541 493749 498796 503649 508397 512933 516627 518736 519326
60656 519326 519481 520362 522329 525112 528448 532186 536015 539540 542601 545297 547698 549628 550702 550477 548645
60641 548645 545102 539877 533248 526014 519217 513138 506932 499862 492645 486796 482782 479661 476604 473726
60627 473726 471226 468763 466230 464274 463331 462806 461953 461035 460861 461527 462353 462852 463063 463050 462639 461684 460259
60610 460259 458608 457077 455992 455474 455560 456435 458095 459809 460618 460604 460905 462157 463637 464428 464676 465091 465909
60593 465909 467052 468731 471016 473242 474700 475675 477027 478990 481131 483318 485947 489259 492993 496676
60579 496676 499812 501983 503308 504582 506472 508793 511079 513515 516687 520726 525437 531106 538410 547577
60565 547577 558283 570318 583686 598011 612494 626593 640418 654390 668848 683871 699122
60554 699122 713980 728136 741752 754602 765383 772489 775308 774292 770040 763041 754185 744790 736048
60541 736048 728842 723938 721759 722072 724522 729549 738159 750702 766320 783728 802126 821260 840970
60528 840970 860927 880764 900461 920325 940104 958075 971755 979898 983223 982856 978903 971265 961046
60515 961046 950073 939497 929788 921636 915645 911291 907259 902885 898436 894216 890476 888213 888954 893414
60501 893414 901089 911330 924113 939718 958508 981140 1008256 1039760 1075121 1114495 1158793 1208474
60489 1208474 1262936 1321238 1382724 1446697 1512050 1577402 1641095 1701015 1754964 1801223 1838268
60478 1838268 1864167 1877051 1876202 1861995 1834877 1795191 1743897 1682611 1612963 1536865 1457310 1377767
60466 1377767 1300514 1226465 1156682 1092859 1035993 985700 941325 902774 869790 841438 816915
60455 816915 796029 778374 762874 748823 736562 726454 717860 709744 701697 693756 685805 677759 669851
60442 669851 662167 654429 646649 639402 633006 627062 621349 616480 613054 610777 609094 608070 607939 608280 608449
60427 608449 608435 608612 608975 609287 609623 610032 609962 608769 606668 604617 603396 603226 604036 605553 607289 608894 610376
60410 610376 611685 612482 612719 613018 613887 614910 615359 615326 615589 616547 617940 619543 621414 623441 625245 626750
60394 626750 628467 630971 634278 637807 640837 643048 644730 646532 648968 652226 656275 660805 665159 668774
60380 668774 671804 674814 677829 680243 681830 683196 684915 686830 688653 690709 693584 697432 702085 707440
60366 707440 713291 719242 725249 731877 739552 747897 756230 764304 772127 779538 786518 793426 800357 806801
60352 806801 812704 819400 828582 840592 854643 870527 889036 910604 934575 960197 987594 1017206
60340 1017206 1048855 1081833 1115469 1148825 1179928 1205989 1224789 1235666 1238928 1234481 1221482 1199485
60328 1199485 1169578 1134199 1096174 1058178 1022499 990389 961630 935392 911578 890758 873015
60317 873015 857804 845050 835271 828242 822652 817677 814011 812547 812929 814348 817072 822140 829999 840510
60303 840510 853968 871008 891611 915198 941685 971504 1004493 1039648 1076282 1114785 1155792
60292 1155792 1198858 1241988 1282103 1316007 1341323 1356714 1361225 1353824 1333948 1302187 1260051 1209521
60280 1209521 1153434 1095800 1040596 989961 944048 902482 865340 832839 804915 781349 761717
60269 761717 745047 730049 715960 702904 691424 682014 674941 669934 665971 661977 657788 654004 650960
60256 650960 648482 646658 646066 646838 648142 649062 649544 650027 650447 650144 648682 646379 643944 641807 639863 637819
60240 637819 635707 633996 633209 633526 634812 636771 638939 640788 642227 643832 646264 649516 653076 656754 660967
60225 660967 666173 672308 678833 685119 690712 695452 699429 702829 705853 708775 711811 714800 717331 719387
60211 719387 721616 724592 728094 731483 734639 738109 742385 747329 752311 756674 760162 763103 766047 769073
60197 769073 771646 773306 774194 774663 774691 774058 772788 771076 768973 766485 763699 760512 756573 751918 747338
60182 747338 743617 740744 738379 736798 736716 738268 740747 743290 745430 747129 748741 750756 753240 755708 757901
60167 757901 760216 762917 765509 767699 770377 774548 779533 783447 785465 786499 787455 788057 787835 787163 786499
60152 786499 785281 782452 777819 772360 767435 764028 762439 762257 762777 763708 765357 768076 771856 776594 782342
60137 782342 789090 796578 804551 812840 821014 828400 834750 840595 846549 852468 857637 861726 865188 868658
60123 868658 872116 874739 875584 874419 871876 868851 865893 863121 860397 857417 854021 850696 848438 847712 847826
60108 847826 847792 847468 847291 847123 846150 843979 841165 838603 836891 836350 837049 838639 840661 843105 846171 849417
60092 849417 851834 852944 853262 853432 853540 853629 854224 855733 857702 859317 860451 861661 863212 864599 865122 864560
60076 864560 863047 860468 856257 849927 841709 832494 823070 813537 803519 792751 781370 769906 759252
60063 759252 750302 743220 737217 731448 725974 721435 717964 715047 712408 710392 709213 708300 706702 703929
60049 703929 700194 696005 691710 687341 682878 678677 675492 673856 673597 674237 675645 677995 681194 684754 688142
60034 688142 690939 692803 693726 694213 694720 694908 693844 690920 686214 680081 672856 664997 657047 649324 641887
60019 641887 634720 627680 620453 613005 605906 599741 594382 589421 585185 582616 582081 582970 584602 586988 590498
60004 590498 595287 601217 607913 614742 621061 626699 631932 637000 641956 646884 651881 656885 661911 667274
59990 667274 673138 678962 683905 687635 690191 691309 690643 688610 686187 683813 681130 677850 674160 670188
59976 670188 665839 661280 656876 652512 647725 642694 638371 635392 633541 632483 632274 632842 633734 634766 636305
59961 636305 638542 641064 643529 646182 649392 653176 657361 661659 665395 667912 669523 671266 673416 675053
59947 675053 675552 675603 676084 676644 676213 674427 671783 668818 665785 662756 659370 654849 648969 642755 637603 633838
59931 633838 630679 627409 623991 620738 618009 616199 615495 615582 615962 616605 617990 620450 623697 627069 630123
59916 630123 633007 636266 640249 644766 649482 654516 660305 666907 673811 680468 686622 692112 696761 700556
59902 700556 703583 705754 706926 707211 706708 705027 701727 697287 693016 689846 687781 686560 686219 686785 688014
59887 688014 689638 691471 693362 695651 699459 705530 712776 719138 724143 729428 736220 743538 749684 754418
59873 754418 758500 761788 763053 761525 757731 752824 747689 742698 737883 733349 729502 726554 723854 720402
59859 720402 716221 712481 709912 707840 705214 701877 698370 695225 692962 692027 692131 692366 692552 693736 696689
59844 696689 700700 704682 708691 713506 719314 725738 732603 739756 746668 753271 760772 770643 782975 796637
59830 796637 810657 824506 837346 848034 855882 860682 862149 860081 854975 847828 839574 831177 823716
59817 823716 817408 810883 802379 791539 779340 766666 753951 741935 731524 722717 714671 706993 700208
59804 700208 694808 690602 687152 684141 681060 677189 672168 666258 659930 653517 647187 640836 634075 626720
59790 626720 619174 611974 605263 599184 594334 591081 588697 585984 582692 579628 577459 576165 575589 575714 576220
59775 576220 576490 576267 575812 575303 574568 573508 572372 571455 570829 570402 570056 569826 570125 571521 573990 576717 578948
59758 578948 580720 582381 583998 585706 588112 591583 595611 599597 603873 609095 614995 620640 625660 630272
59744 630272 634292 637112 638648 639499 640174 640924 642177 644256 646641 648372 649277 650031 651009 651868 652353 652726
59728 652726 653255 653940 654816 655974 657274 658531 659853 661192 661863 661319 660209 659763 660239 660883 661322 661896 662584
59711 662584 662703 661971 660995 660393 660227 660501 661410 662785 664078 665147 666373 667850 669239 670615 672597 675317
59695 675317 678092 680450 682766 685519 688663 692125 696207 700975 705779 709824 712763 714482 714821 713890 712209
59680 712209 710237 708148 706135 704370 702499 699781 696004 691697 687260 682506 677358 672344 667991 664209
59666 664209 660608 657004 653282 649190 644653 640020 635795 632374 630111 629293 629953 631929 635027 638754 642232
59651 642232 644990 647652 651110 655172 658750 661243 662790 663290 662234 659667 656274 652309 647516 642337
59637 642337 638028 635089 632633 629866 627174 625165 623640 622349 621795 622365 623363 623863 623956 624252 624643 624529
59621 624529 623918 623324 622783 621832 620404 618982 617861 616938 616280 616310 617268 618833 620450 621826 623083 624536
59605 624536 626238 627690 628235 627811 627006 626214 625136 623370 621100 618819 616634 614271 611658 609197 607438
59590 607438 606637 606486 606226 605242 603691 602413 602124 602810 603832 604386 603934 602543 600874 599556 598614 597707 596734
59573 596734 595763 594573 592853 590793 588874 587100 585059 582761 580739 579232 577957 576840 576283 576455 576966
59558 576966 577487 578153 579086 580043 580876 581863 583285 585029 586788 588370 589763 591267 593480 596728 600588 604498
59542 604498 608611 613398 618681 624016 629916 637638 647619 659121 671469 684566 698194 712192 727614
59529 727614 746032 766704 785694 798951 805622 807649 807247 805911 804925 805179 806413 807534 807593 805889
59515 805889 801671 794703 785874 776370 766335 755054 742293 728691 714957 701389 688274 676185
59503 676185 665710 657098 650136 644149 638355 632585 627519 623986 622179 621710 622088 622891 623762 624562 625339
59488 625339 625976 626164 625875 625571 625817 627010 629470 633270 637901 642630 647391 652784 659122 666078 673451
59473 673451 681530 690407 699578 708597 717544 726500 735092 742827 749342 754168 756899 757818 757755 757294 756932
59458 756932 757936 761815 768585 776806 785833 796731 810227 825012 839209 852521 865701 878598
59446 878598 890016 899134 905996 910866 913950 915441 915086 911930 905133 894760 881361 865450 848028
59433 848028 830944 815778 802748 791337 781459 773266 766392 760341 755372 752300 751702 753875 759065
59420 759065 767100 777289 789235 803196 819173 836420 854488 873793 894326 914679 933323 949949
59408 949949 964585 976588 985987 994617 1003694 1010622 1010399 1000590 983418 962939 941943 921982 904499
59395 904499 890638 880870 875614 875276 878552 881209 877732 864750 842994 816266 788723 762808 739249
59382 739249 718445 701238 688207 678886 672217 667458 664222 662143 661158 661754 664217 667863 671664 675381
59368 675381 679462 684081 688953 693948 699249 705037 711480 718800 726838 734899 742625 750716 760224 771475
59354 771475 784261 798608 814618 831956 850309 870076 891858 915508 940279 965599 991010
59343 991010 1015769 1039205 1061091 1081003 1097870 1110939 1120598 1127279 1130083 1127615 1119780 1107665
59331 1107665 1092011 1072952 1051103 1027643 1003382 978658 954113 930575 908318 887317 868051
59320 868051 851077 836051 822187 809515 798649 789595 781916 775876 772068 769930 767913 765283 762635
59307 762635 760478 758495 756509 755090 754788 755532 757118 759583 762952 767229 772680 779493 787262 795502 804427
59292 804427 814475 825323 836268 847203 858186 868437 877029 884303 891295 898001 903673 908787 915207
59279 915207 924246 935807 949236 963229 974781 980429 979601 975455 971577 969054 967298 966227 966413 968054
59265 968054 970836 974148 976781 977164 974566 969351 961625 950632 936099 919238 901598 883733 865754
59252 865754 848347 832366 817951 804810 792909 782318 772927 764910 758870 754943 752363 750563 750232
59239 750232 752604 758040 765771 774653 783748 792663 801739 811520 821597 830400 836531 839826 840763 839322
59225 839322 834967 827501 817506 806097 794381 782881 771449 759976 749087 739628 731613 724384 717837
59212 717837 712722 709610 708274 708214 709060 710335 711613 713141 715529 718603 721339 723218 724931 727452 731106
59197 731106 735760 741134 746546 751036 754180 756323 757915 759190 760539 762389 764582 766641 768739 771507
59183 771507 774760 777419 778974 780082 781408 782828 784153 785687 787666 790018 793074 797542 803315 809257
59169 809257 814794 820846 828603 838143 848862 860431 872635 884814 896037 905517 912624 917101 919454
59156 919454 920308 919196 914834 906902 896591 885065 872451 858820 845071 832130 820173 809314
59144 809314 800210 793215 787623 782464 777402 772380 767081 761416 755944 751275 747549 744765 742815 740953
59130 740953 738194 734773 732304 731929 733230 735359 738237 741984 746292 751266 757986 767314 778762 791228
59116 791228 804127 817184 830010 842651 855790 869570 882927 894859 905606 915801 925148 932817
59104 932817 938603 942954 946332 949068 951190 951911 950063 945618 940002 934368 928576 922420 916678 911972
59090 911972 907657 902894 897974 893511 889187 884423 879512 874855 869696 862832 854120 844264 833606 822182
59076 822182 810505 799240 788438 777975 768295 759796 751961 744093 736505 730079 725011 720857 717412
59063 717412 714696 712445 710464 709054 708334 707632 706344 704845 703699 702494 700464 697802 695356 693405 691667
59048 691667 690181 689244 688673 687985 687136 686416 685901 685583 685690 686285 686989 687611 688493 689741 690895 691980 693990
59031 693990 697476 701551 705319 709463 715288 722954 731854 742065 754018 767162 780364 793423 806941
59018 806941 820802 833829 844899 853472 859183 861840 861797 859636 855716 850622 845628 841869 839428 837994
59004 837994 838015 840330 845019 851396 858871 867131 875882 885057 894822 904839 914055 921821 928457 934172
58990 934172 938276 940177 940191 938539 934590 928044 919746 910264 898917 885542 872024 860491 850973 842494
58976 842494 835455 831078 829297 829206 831048 835688 842509 849902 857737 867432 879634 893674 909304 927032
58962 927032 946445 965931 984490 1002295 1019078 1033316 1043388 1048405 1047718 1040905 1028625 1012489
58950 1012489 993907 973853 953464 933608 913963 893837 873890 855856 840635 827897 817361
58939 817361 808967 801886 794988 788585 784324 782994 783566 784542 785015 784344 782108 778655 774625 769837 763705
58924 763705 756634 749725 743196 736516 730101 725287 722394 720260 718024 716058 714868 714406 714850 716785 720253
58909 720253 724671 729904 736280 743459 750604 757863 766354 776441 787391 799014 812270 827834 845273
58896 845273 864064 884257 905823 928528 952772 979389 1008338 1038727 1070276 1103414 1137665
58885 1137665 1171333 1203148 1232874 1259905 1282697 1300185 1312541 1319927 1321718 1317573 1308135 1294056
58873 1294056 1275249 1251695 1224201 1194070 1162889 1132697 1105183 1080368 1057153 1035317 1015851
58862 1015851 999163 984265 970008 955840 941150 925267 908475 891748 875226 858369 841822
58851 841822 827395 815662 805213 794927 785379 777166 769384 760865 751681 742475 733390 724485 716176
58838 716176 708459 700642 692558 685009 678477 672457 666665 661741 658124 655268 652590 650052 647400 644157
58824 644157 640964 639481 640200 641707 642864 644243 646544 649162 651604 654900 660094 666304 671743 675929
58810 675929 679622 683168 686123 688163 689440 690305 691264 692702 694207 694818 694364 693689 693179 692115 690056 687744
58794 687744 685889 684128 681994 679938 678514 677390 676018 674574 673616 673552 674971 678490 683681 689129 694152
58779 694152 699416 705273 710709 714757 717809 720634 723120 724787 725486 724710 721402 715427 708280 701420 694882
58764 694882 688358 682379 677380 672786 668362 665400 665114 666638 668017 668624 669338 670810 672825 675106 677696
58749 677696 680678 684155 688265 692811 697485 702837 710180 719947 730970 741954 752763 763697 774609
58736 774609 785517 797027 809220 821068 831836 842103 852542 862660 871772 880257 888864 897573
58724 897573 906100 914627 923075 930577 936767 942845 950304 959313 969181 979568 990216 1000308 1009120
58711 1009120 1016663 1022819 1026663 1027499 1025675 1021508 1014366 1003795 990552 975374 957602 936211 911423
58698 911423 884284 855527 826034 797560 771606 748122 726402 706711 689910 676072 664458
58687 664458 654434 645517 637089 628879 621173 614006 606900 599979 594265 590180 586820 583541 581042 580024
58673 580024 580029 580636 582545 586330 591424 597590 606125 618095 632450 647293 661968 676462 689858 701033
58659 701033 709994 717024 721410 722511 721155 718428 713985 707179 698940 690757 682535 673308 663517 654780
58645 654780 647815 642183 637706 634514 632082 629777 628124 628142 629758 632131 635050 638658 642290 645036 647123
58630 647123 649392 651736 653289 653768 653446 652328 650550 649071 648726 649162 649845 651425 654840 659824 665723
58615 665723 673016 682474 693429 704388 714853 725030 734298 741510 746382 749116 749124 745714 739741 733112
58601 733112 726808 720575 714160 707659 701029 694488 688964 685098 682301 679798 677891 677273 678027 680470 685870
58586 685870 694897 706286 718433 731325 745562 760609 775605 790785 806342 820982 833384 844052
58574 844052 853868 862017 867551 872017 878213 887046 897817 910900 927785 948845 973193 1000383 1030196
58561 1030196 1061237 1091815 1121766 1151335 1178741 1201009 1216926 1227145 1231926 1230964 1225129 1216120
58549 1216120 1204561 1190472 1175213 1160773 1147314 1133498 1118953 1104273 1088916 1071421 1051689
58538 1051689 1030926 1009429 986498 962446 938749 916280 895272 876725 861781 849988 840150
58527 840150 832524 828112 826234 825102 824485 825490 828017 830809 833821 838100 843442 848516 853142 858027
58513 858027 862408 864485 864216 863268 862141 859711 855651 850915 845858 840268 835159 831969 829907 826615 821542
58498 821542 816211 811259 805861 800135 795324 791424 787324 783516 781908 782664 784027 785534 788578 793406
58484 793406 798619 804239 812325 823659 836613 850129 865113 881882 898797 914407 928578 940576
58472 940576 948488 951557 950942 947388 940318 929958 918073 905836 893053 880110 868533 859113 851615
58459 851615 846714 845855 848852 853969 860619 869471 879750 889301 897665 906117 914246 919563 921108 920311
58445 920311 917611 911510 901938 891368 881458 871689 862362 855698 852558 851160 850426 851573 854997 858773
58431 858773 861902 866094 872547 879844 886912 895297 906491 919481 932834 946809 961469 974987 985658
58418 985658 993645 999163 1001152 999307 995291 990419 984185 976370 968312 960672 952269 942558 932995 924516
58404 924516 915933 906297 896721 888493 881488 875590 871484 868959 866714 864785 864716 866477 867908 868130 868538
58389 868538 869464 869074 866833 864846 864255 863546 862010 861563 863241 865122 865783 866856 870034 874374 878701 884063
58373 884063 891682 900932 911111 922711 935325 947055 957647 969460 983673 998388 1012002 1025418
58361 1025418 1039349 1052652 1065073 1078334 1092681 1105569 1115501 1123823 1131091 1135448 1136645 1137840
58349 1137840 1141037 1144401 1146424 1148910 1153354 1158141 1162118 1167278 1175045 1183514 1191260 1200313 1212346 1225417
58335 1225417 1237584 1250359 1265487 1281566 1296916 1312553 1329311 1345294 1359091 1372251 1385741
58324 1385741 1397396 1405659 1412313 1418795 1423629 1426389 1430114 1436630 1443594 1449419 1456839 1468006 1480378
58311 1480378 1491327 1502661 1516606 1531457 1545363 1560382 1578538 1597714 1615642 1634054 1654689
58300 1654689 1675240 1693566 1711947 1732836 1754402 1774643 1795663 1819341 1843083 1864610 1886709
58289 1886709 1912428 1939906 1966903 1995878 2029282 2064222 2097275 2130347 2166335 2203368 2238946
58278 2238946 2275407 2315552 2357197 2397892 2440556 2488484 2539248 2589621 2641937 2699365 2759554
58267 2759554 2819437 2881637 2949429 3020073 3089954 3161500 3237977 3316266 3392084 3467531 3546043
58256 3546043 3624813 3699943 3774203 3851900 3931056 4008673 4088621 4176078 4269298 4365242 4467789
58245 4467789 4581570 4703215 4827885 4958856 5101341 5252688 5408556 5572825 5751192
58236 5751192 5940899 6137278 6344262 6567611 6804313 7050149 7311047 7594935 7899173
58227 7899173 8218583 8558866 8928956 9327203 9748831 10199803 10689168 11215513 11776137
58218 11776137 12381938 13047869 13777018 14570345 15443102 16414560 17491467 18680511 20007592
58209 20007592 21506341 23199943 25116189 27309543 29847753 32791933 36214504 40220587
58201 40220587 44924109 50419462 56805866 64223764 72849123 82900068 94712519 108810792
58193 108810792 125908081 146910383 172884665 204656235 241907614 282443311 322545440
58186 322545440 358329757 386851616 406062259 414226946 410030745 393500827 366648590
58179 366648590 333003793 296429447 260141681 226335663 196215343 170180732 148101967
58172 148101967 129606823 114260909 101618920 91238097 82716575 75732513 70044106
58165 70044106 65459650 61830767 59098577 57315476 56503794 56377092 56217408 55160731
58157 55160731 52707901 48977421 44490147 39779396 35201054 30966860 27198323 23927679
58149 23927679 21121257 18735277 16731979 15055275 13634615 12419201 11381977 10492497
58141 10492497 9714492 9029520 8435811 7921804 7463306 7046745 6672981 6336997 6024051
58132 6024051 5727169 5449885 5190667 4941823 4704421 4487620 4292177 4109622 3937862
58123 3937862 3782695 3643787 3513779 3391489 3281680 3181222 3079373 2972900 2868178
58114 2868178 2767764 2667619 2568338 2476511 2393498 2314232 2238171 2170214 2109939 2051021 1992375
58103 1992375 1939118 1891513 1843617 1794189 1748547 1708130 1668152 1627210 1589556 1556170 1522799
58092 1522799 1488610 1457918 1431608 1405419 1378373 1354595 1335144 1316091 1296216 1278667 1263449
58081 1263449 1246109 1225485 1205216 1186185 1165017 1141472 1119722 1100688 1080515 1058303 1038005
58070 1038005 1020951 1003756 985574 970198 958778 947380 934096 921957 912486 902826 891722 882099
58058 882099 875066 867189 856364 845010 835056 824989 814051 804238 796025 787056 777027 768916 763601
58045 763601 758262 751829 746839 743996 740121 733667 727386 723253 719402 714219 708932 704010 697458 688780
58031 688780 680411 673285 665142 655056 645325 636942 627569 616099 605115 596704 589716 583088 577949
58018 577949 574412 570137 564153 558551 554575 550578 545613 541422 539097 537249 535149 534133 534340 533711 531854
58003 531854 531275 533109 535237 536233 537483 539761 541442 541980 543396 546406 548687 549007 549515 551772 553903
57988 553903 553876 552460 550834 548379 544924 542175 540830 539021 535445 531292 527505 523085 517703 512953 509400
57973 509400 505428 500534 496588 494243 491487 487473 484334 483250 482175 479604 477263 476795 476973 476569 476826
57958 476826 478597 480024 479640 478999 479784 480994 481472 482449 484989 487525 488578 489563 492292 495964 499156 502599
57942 502599 507410 512650 517101 521550 526967 532386 536793 541175 546545 551958 556622 561871 568748 575689
57928 575689 580861 584852 588785 591852 593096 593665 594802 595379 593852 590934 587960 584284 578752 572190 566000
57913 566000 559660 551916 543155 534512 525979 517383 509815 504063 499066 493753 488878 485218 481699 477293
57899 477293 473018 469925 466959 463082 459787 458972 459867 460539 461016 462402 464158 464852 464622 464552 464571 464205 464363
57882 464363 466077 468374 469511 469443 469067 468125 465994 463498 461712 459839 456407 451751 447258 442987 438075
57867 438075 432669 427422 421892 415433 408917 403624 399223 394752 390751 388400 387331 386301 385386 385534 386638
57852 386638 387909 389540 392132 395138 397705 400419 404493 409846 415717 422341 430155 438050 444375 449160
57838 449160 453596 457831 460964 462676 463274 462721 461097 459319 457986 456410 454267 453000 453721 454932 454504
57823 454504 453015 452862 454759 457394 460035 463197 466928 470506 473715 476721 478976 479935 480418 481518 482683
57808 482683 482650 481684 480938 480033 477374 472649 467094 461453 455552 449717 444734 440395 435751 430700 425775
57793 425775 420597 414277 407196 400696 395121 389777 384701 380842 378571 377535 377815 379633 382063 383712
57779 383712 384736 386679 390330 395149 400694 407092 414057 420903 427680 435153 443559 452323 460762 468172
57765 468172 473766 477661 481278 485500 489095 490347 489437 487568 484496 478934 471002 462209 453129 442879
57751 442879 430913 417726 403894 390060 377756 368612 362657 358776 356580 356389 357702 359348 361002
57738 361002 362932 364524 364805 364252 364325 365244 365835 365531 364797 363711 361894 359894 358899 358948 359008 358925 359598 361168
57720 361168 362702 363881 365357 367267 368909 370029 370951 371350 370487 368750 367427 366782 365863 364262 362468
57705 362468 360511 357928 355220 353575 352926 352031 350730 350357 351547 353345 355007 357018 359723 362390 364246
57690 364246 365232 365382 364712 363986 364213 365121 365440 364911 364661 365511 367429 370720 376069 383219 391370 401195 414694
57673 414694 432719 454528 480287 512002 551082 596621 646968 701396 759353 819617 881111
57662 881111 942923 1002012 1051678 1083461 1090536 1069966 1023892 959578 886779 813457 743943 680724
57650 680724 625966 580481 542901 511303 484886 463361 445839 431300 419339 409655 401561 394580
57638 394580 388757 383929 379578 375801 373363 372254 371255 369459 367300 365636 364801 364879 365799 366778 366788 366000
57622 366000 365560 365636 365038 363195 361029 359213 357105 354261 351644 350307 350003 350068 350668 352219 354542 357392
57606 357392 360940 364955 368442 370937 373272 376227 379255 381316 382290 382803 383304 383846 384246 384074 383134 382066
57590 382066 381636 381466 380577 379152 378269 377851 376588 374326 372631 372264 371939 370544 368897 368074 367587 366554
57574 366554 365363 364757 364352 363348 361790 359990 357745 355270 353854 354295 355527 356014 355704 355503 355625 355607
57558 355607 355305 354867 354397 354404 355764 358443 361192 363236 365153 367320 368884 369438 370334 372908 376503 379731
57542 379731 382696 386397 390741 394702 397891 400598 402881 404872 407324 410585 413689 415643 416821 417885
57528 417885 418223 416970 414729 412674 410663 408009 405505 404827 406205 408441 411035 414498 418604 422134 424701
57513 424701 427356 430976 435249 439597 444043 448791 453831 459216 465039 470919 476113 480162 483046 484987
57499 484987 486692 489314 493405 498128 502179 505084 506981 507873 507949 508025 508526 508627 507532 506117 506050 507634
57483 507634 509756 511658 513523 515505 517486 519729 522629 525854 528735 531354 534221 537085 539208 540700
57469 540700 542447 544787 547349 550054 553116 556138 558403 560156 562507 565964 570049 574338 578886 583585
57455 583585 588194 593031 598662 604782 610399 615222 619940 625099 630623 636486 642850 649474 655858 662015
57441 662015 668241 674226 679385 684015 689022 694500 699715 704489 709368 714325 718645 722456 727026 732968
57427 732968 739286 744906 750170 756069 762761 769649 776379 783104 790059 797346 804852 812092 818536 824253
57413 824253 829866 835801 842121 849119 857276 866379 875370 883524 891306 899729 909203 919231 928855 937280
57399 937280 944517 951564 959520 968446 977489 986151 994845 1004060 1013595 1022998 1032391 1042466 1053754 1066020
57385 1066020 1078333 1089824 1100474 1111023 1122022 1133347 1144860 1156968 1170050 1183763 1197500
57374 1197500 1211153 1224797 1238071 1250575 1262607 1274748 1287019 1299177 1311571 1324793 1338661
57363 1338661 1352407 1365805 1379317 1393209 1407278 1421457 1435974 1450972 1466531 1482851 1499776
57352 1499776 1516472 1532393 1548274 1565296 1583529 1602104 1620620 1639343 1658183 1676660 1694902
57341 1694902 1713585 1732808 1751998 1771008 1790346 1810165 1830020 1849750 1869729 1890087 1910568
57330 1910568 1931257 1952647 1974847 1997462 2020223 2043020 2065509 2087591 2110052 2133714 2158217
57319 2158217 2182792 2207934 2234824 2263239 2291684 2319686 2348236 2377585 2406502 2434433 2462759
57308 2462759 2492840 2524190 2555641 2587131 2619161 2651446 2683370 2715104 2747268 2780036 2813496
57297 2813496 2848255 2884696 2922047 2959109 2995628 3032261 3069511 3107390 3145811 3184684 3223750
57286 3223750 3262758 3301618 3340196 3378348 3416383 3455026 3494658 3535061 3576050 3617712 3659910
57275 3659910 3702312 3745196 3789366 3834897 3880785 3926304 3971818 4017686 4063279 4107838 4151595
57264 4151595 4195194 4238587 4281287 4323262 4364749 4405506 4445001 4483215 4520815 4558721 4597819
57253 4597819 4638718 4681436 4725663 4771486 4819335 4869054 4919813 4971335 5024407 5079667 5136631
57242 5136631 5194467 5252957 5311995 5370847 5428756 5485667 5541574 5595714 5647360 5696939 5745305
57231 5745305 5792168 5836307 5877420 5916839 5956176 5995845 6035269 6074134 6113121 6153467 6195972
57220 6195972 6240601 6287156 6336030 6387835 6442432 6498986 6556965 6616377 6676925 6737836 6798881
57209 6798881 6860706 6923623 6986756 7048972 7110049 7170364 7230004 7288777 7346607 7403364 7458803
57198 7458803 7513196 7567463 7622035 7676000 7728005 7777591 7825086 7870618 7913970 7955107 7994267
57187 7994267 8031726 8067921 8103456 8138589 8173100 8207098 8241419 8276705 8312486 8347794 8382216
57176 8382216 8415771 8448123 8478626 8506921 8532976 8556728 8578102 8597047 8613093 8625230 8632570
57165 8632570 8634753 8631301 8621152 8603383 8577981 8545314 8505364 8458246 8405141 8347948 8288067 8226035
57153 8226035 8162335 8098224 8036056 7979083 7930587 7892678 7865891 7849892 7844056 7847250 7857752 7873667
57141 7873667 7892778 7911747 7926362 7933143 7930075 7915597 7888113 7847440 7795963 7737599 7676367 7616639
57129 7616639 7563552 7521576 7492786 7477194 7473996 7481334 7495441 7511391 7524927 7533346 7535918 7535063
57117 7535063 7536858 7548943 7577519 7626410 7697811 7792534 7910160 8050849 8217488 8415690 8652695
57106 8652695 8937980 9284720 9709291 10229713 10866592 11646249 12602108 13773318 15203595
57097 15203595 16941479 19039936 21554646 24542470 28059291 32153928 36858187 42177398
57089 42177398 48084330 54515249 61366371 68490587 75695821 82751520 89414763 95476149
57081 95476149 100797500 105302991 108921309 111529487 112955351 113040387 111709367 108996636
57073 108996636 105027274 99983479 94077600 87532431 80565818 73382783 66175378 59122263
57065 59122263 52381457 46079768 40306356 35112318 30513476 26495325 23021110 20041366
57057 20041366 17501096 15343509 13512791 11957391 10632410 9499888 8527924 7689955
57049 7689955 6964135 6332535 5780561 5296534 4870904 4495353 4162726 3867384 3604715
57040 3604715 3370068 3158798 2967406 2793906 2636827 2494452 2365134 2247583 2140523
57031 2140523 2042821 1954176 1874979 1805142 1743842 1690681 1646269 1611212 1585335 1568442 1561203
57020 1561203 1564646 1579038 1603303 1634940 1670580 1707511 1744745 1781959 1818073 1852472 1887203
57009 1887203 1926153 1973064 2033546 2117350 2230267 2357552 2459189 2490278 2430341 2292899
56999 2292899 2109439 1908765 1709875 1525077 1362023 1223030 1106420 1009731 930981 867899
56989 867899 818068 780117 753797 738581 732479 732024 733235 732939 729417 721618 708163 687975 661810
56976 661810 632188 601643 571747 543637 518292 495994 476602 460647 449176 442248 438629 437404
56964 437404 439018 444378 453998 468496 488818 514968 544827 574626 600225 617994 625541 622329
56952 622329 609316 587922 559891 527993 495691 465625 438963 416222 397745 383189 371743
56941 371743 363399 359253 360153 365922 376280 391748 413208 441236 475851 515609 556431 592399
56929 592399 618574 632594 633618 621287 596695 563207 524990 485074 445432 408025 374598 345714
56917 345714 320844 299268 280460 263993 249684 237576 227408 218445 210159 202660 196218 190803
56905 190803 186291 182525 179005 175265 171780 169640 168989 168683 168009 167801 169239 172483 177257 183995 193430
56890 193430 205518 219656 235650 253728 273794 295156 316633 336446 352417 362823 366970 364947
56878 364947 357519 346528 334565 323535 313962 305975 300207 297286 297260 300257 307039 318253 333772
56865 333772 353548 378569 410066 447985 490866 536828 583985 629952 671382 703931 722855
56854 722855 724748 709685 681548 645854 607359 569474 534726 504841 480761 463185 452754 449470
56842 449470 452651 462034 478501 503447 538058 583399 640123 707268 781845 860009 937674 1009285
56830 1009285 1066968 1102323 1109473 1086915 1038045 970779 895273 819960 749158 684459 627313
56819 627313 579315 540985 511849 491682 480684 478633 484885 499322 522627 555503 597774 647830
56807 647830 702460 757475 808606 851295 879823 888325 874039 839237 789479 730693 668216 606965
56795 606965 550698 501257 459357 425530 399506 379755 365051 356056 354121 359000 368969 382874
56783 382874 400840 423137 449280 477853 506026 529485 544027 547372 539125 519778 490905 455724
56771 455724 418006 380371 344350 311489 283082 259132 238795 221676 207679 196025 185690
56760 185690 176603 169238 163296 158011 153451 150150 147692 145041 142126 139671 137495 134589 130974 127963
56746 127963 126174 124653 122421 119729 117309 115444 114233 113820 113933 114009 114065 114655 115781 116693 116917 116647 116107
56729 116107 115402 115052 115593 116535 116795 116323 116205 116912 117617 117614 117383 117776 119050 121068 123603 126162 128329 130475
56711 130475 133165 135796 136994 136671 136358 136998 137699 137428 136722 136720 137455 138192 138762 139362 139483 138200 135533 132703
56693 132703 130891 130211 129960 129574 129227 129565 130826 132402 133533 134210 134914 135635 135850 135497 135292 135848 136990
56676 136990 138050 138455 138015 137128 136657 137074 137781 137814 137076 136254 135764 135579 135882 136892 138056 138471 138230 138393
56658 138393 139456 140823 141974 143106 144241 144696 144034 142842 142079 142187 143136 144659 146172 147091 147530 148110
56642 148110 148930 149445 149517 149775 150659 151881 153162 154766 156924 159390 161867 164260 166236 167174 166875 165819
56626 165819 164555 163355 162495 162190 162181 162042 161850 161798 161376 159932 157930 156453 155448 153849 151617 150081 149721
56609 149721 149114 147018 144248 142400 141638 140932 139843 138964 138856 139422 140205 140804 141130 141556 142578 144225 146196
56592 146196 148476 151121 153450 154393 153866 152904 152264 151857 151768 152686 154765 157063 158728 159958 161301 162863
56576 162863 164669 166892 169246 171000 172112 173504 175735 178346 180902 183625 186419 188458 189619 191354
56562 191354 195217 201211 208313 215840 223616 231604 240174 250020 261085 272155 282015 290191 296235 299494
56548 299494 300430 301003 302731 305196 307250 308698 309732 309789 308354 306232 304738 304048 303351 302142 300358 297708
56532 297708 293921 289276 284118 278269 271730 265367 260033 255508 251122 246856 242983 239234 235251 231321
56518 231321 227739 224015 219610 214910 210518 206150 201221 196044 191455 187620 184146 180960 178198 175691
56504 175691 173472 172317 172800 174263 175645 176917 178803 181465 184410 187266 189797 191596 192718 194082
56490 194082 196305 198601 199816 200025 200115 200355 200586 201280 203026 205155 206218 205791 204767 203944 203385 203117 203379
56473 203379 204036 204567 204776 204905 205197 205842 207007 208309 208793 208222 207864 209039 211377 213501 214951 216227
56457 216227 217334 217658 217216 216813 216846 216959 217002 217426 218527 219994 221258 221813 221391 220389 219782 220044 220493 220355
56439 220355 219922 219909 220279 220621 221121 222068 222945 223178 223377 224594 226645 228388 229427 230312 231235 231791 232038 232634
56421 232634 233785 235030 236079 236993 237590 237540 236995 236287 235270 233779 232480 232242 232881 233522 233912 234383 234777
56404 234777 234575 233969 233655 233622 233143 231992 230718 229857 229722 230777 233147 235958 238092 239504 240941 242645
56388 242645 244245 245553 246528 246923 247018 248072 250725 253438 254036 252476 250629 249625 249042 248522 248409 248598
56372 248598 248345 247534 246849 246566 246421 246682 247940 249790 251157 252060 253541 255595 256750 256142 254668 253619
56356 253619 253455 254279 256165 258454 259884 260017 259571 259032 258061 256663 255837 256433 258119 259934 261175 261611
56340 261611 261546 261781 262786 263973 264599 265100 266514 268875 271339 273671 276271 278975 281301 283752 287326
56325 287326 291743 295718 298988 302377 305771 307918 308625 309370 311102 313078 314508 315775 317258 318377 318684
56310 318684 318740 319141 319753 320509 321921 324267 327288 331022 335798 341071 345535 348808 351772 354921 357730
56295 357730 360093 362859 366350 369663 372171 374429 376961 379403 381497 383671 385916 387314 387506 387637 389103
56280 389103 392184 396393 401238 406209 411024 416182 422296 428749 434269 438947 444214 450585 457048 463055
56266 463055 469353 476259 482918 489124 496257 505373 515852 526939 539323 554104 571318 590477 611542
56253 611542 634579 659449 686600 717171 751744 789961 831758 877741 928019 982104 1040366
56242 1040366 1103901 1172282 1243149 1314809 1387538 1461385 1534352 1603897 1668703 1727755 1779218
56231 1779218 1821556 1854569 1878037 1890467 1890471 1878454 1855951 1824181 1784169 1737237 1684513 1626863
56219 1626863 1565916 1503939 1442063 1379961 1317949 1257842 1200906 1146560 1094225 1044950 999987
56208 999987 959084 921373 886750 855207 826016 798713 773876 751918 732196 714178 698309
56197 698309 684819 672904 661930 652248 644054 636815 630525 626042 623371 621186 618894 617436 617159 616728
56183 616728 615279 613895 613654 613949 613966 614140 614804 615040 614264 613378 613106 612762 611957 611808 613089 614857 616234
56166 616234 617859 620182 622160 623156 624440 627324 631508 636593 643195 651039 658074 663362 668889 676678
56152 676678 686020 695474 705584 717426 730411 743826 758847 776672 796267 816270 837679 862448
56140 862448 890915 922813 959315 1001826 1050189 1104239 1165595 1235645 1313349 1397248 1488050
56129 1488050 1586828 1692336 1802732 1918351 2039846 2164526 2286883 2401607 2504128 2590238
56119 2590238 2658413 2711682 2754730 2790015 2818386 2841106 2858006 2865160 2857895 2835544 2800900 2756419
56107 2756419 2703904 2646444 2586853 2524335 2455344 2377424 2290131 2193503 2088728 1979919 1872681
56096 1872681 1771115 1677721 1594723 1523066 1461304 1407914 1363511 1328654 1301158 1278259 1259897
56085 1259897 1247133 1238850 1232844 1228687 1226695 1225688 1224731 1225473 1229670 1235949 1242086 1248728 1257676 1268277
56071 1268277 1279007 1290889 1305662 1322190 1338385 1355107 1374386 1395365 1415926 1436778 1459851
56060 1459851 1484011 1506556 1527676 1549279 1570664 1589656 1606963 1625200 1644576 1663609 1682917
56049 1682917 1704147 1726432 1748206 1771169 1798004 1827468 1856348 1885024 1916393 1950471 1984861
56038 1984861 2019492 2056089 2094022 2131486 2169681 2211113 2255013 2299223 2345062 2395216 2448420
56027 2448420 2501678 2556143 2615091 2677629 2740373 2803898 2871306 2941749 3011718 3081655 3154905
56016 3154905 3231318 3308337 3387181 3471286 3559853 3649740 3742363 3841713 3947023 4054815 4166751
56005 4166751 4287583 4416724 4550010 4688544 4837384 4996649 5162642 5336596 5523261
55996 5523261 5721910 5928114 6143420 6373616 6618572 6873980 7142104 7430204 7739288
55987 7739288 8065538 8411925 8786716 9191124 9620483 10077039 10569229 11099327 11665195
55978 11665195 12273712 12938746 13666786 14459171 15327521 16291502 17362739 18548051 19868007
55969 19868007 21355465 23038470 24945042 27124289 29643587 32569038 35972533 39954628
55961 39954628 44634073 50118377 56513931 63963245 72650505 82798545 94724430 108915750
55953 108915750 126044698 146961895 172696568 204204195 241599256 283272081 325830727
55946 325830727 365189365 397858756 421293275 433429012 432590319 418296060 392103467
55939 392103467 357418391 318339538 278488590 240467437 205836289 175290530 148917154
55932 148917154 126480253 107616075 91894815 78848468 68031778 59064009 51615299
55925 51615299 45391926 40154876 35727381 31966658 28744285 25959391 23544929 21445615
55917 21445615 19604217 17975833 16536081 15264375 14133176 13120311 12215956 11408979
55909 11408979 10679578 10012315 9403706 8850333 8341444 7869351 7435403 7039306 6672998
55900 6672998 6330627 6014370 5724876 5455630 5201910 4966085 4749042 4545257 4351283
55891 4351283 4170710 4005928 3852831 3708089 3574041 3452148 3338986 3232763 3136690 3052015
55881 3052015 2974719 2902814 2839997 2788308 2743896 2703751 2670011 2643760 2621018 2598844 2579404
55870 2579404 2564113 2549343 2531518 2510802 2486250 2453081 2408851 2357322 2302372 2242612 2175423
55859 2175423 2101686 2023381 1941108 1857227 1777008 1703427 1634737 1569627 1510225 1457459 1408302
55848 1408302 1360684 1316611 1277430 1240554 1204038 1170008 1140317 1113006 1086339 1062190 1041959
55837 1041959 1023040 1002923 983197 966041 950195 933901 918544 905854 894380 882140 870118
55826 870118 859909 850383 839691 828292 817229 805736 793121 780725 769597 758556 746851 736247
55814 736247 728166 721225 713859 706965 701736 697433 693565 691802 693387 697003 701330 707331 715934 725923
55800 725923 736182 747378 759188 768586 773298 774509 773806 769978 761388 749079 734900 718759 700327
55787 700327 681354 663677 646851 630153 614952 602669 592348 582703 574747 569906 567305 565219
55775 565219 563490 562178 559714 554930 549382 545297 542700 540689 539812 540735 542099 542154 541218 540231 538224 533467
55759 533467 526011 517042 506878 495490 483718 472109 459834 446537 433751 422723 412420 401590
55747 401590 391186 382686 375563 368450 361297 354346 346697 338167 330934 326880 324649 321782 318475 316711
55733 316711 316860 317704 318889 320761 322430 322407 320726 318470 315743 312024 307835 304176 300937 297590 294610
55718 294610 292494 290298 286990 283404 281032 279758 278595 277746 278031 279148 280425 282469 286149 290635 294275
55703 294275 296746 298613 299619 299169 297682 295634 292161 286438 279640 273655 268678 263898 259631 256713
55689 256713 254558 251886 248832 246454 244870 243731 243703 245451 247938 249793 251677 255077 259466 262903 264931
55674 264931 266552 267823 267870 267051 266621 266268 264334 260698 257251 255195 253854 252531 251630 251454 251572 251924
55658 251924 253252 256011 259963 264925 270785 276836 282328 287572 293227 298710 302626 304571 305135 304326 301459
55643 301459 296513 290230 283007 274992 267020 259974 253376 246094 238393 231850 227236 223810 220615 217252
55629 217252 213546 209731 206779 205226 203937 201428 198122 195769 194781 193740 191571 188700 185985 183834
55615 183834 182509 182017 181605 180470 178924 177858 177328 176802 176451 176853 177712 178215 178385 178740 179052 178847 178721
55598 178721 179500 180465 180147 178669 177548 177284 176942 176071 175210 174401 173018 171305 170318 170050 169316 167832 166817
55581 166817 167037 167821 168432 169106 170238 171803 173834 176259 178184 178726 178654 179690 182165 184923 187648 191350
55565 191350 196250 201114 205341 209880 215238 220242 223732 226024 227749 228581 228106 226753 224865 221927 217669
55550 217669 212880 208220 203196 197280 191188 186067 182065 178568 175325 172560 170369 168638 167228 165953
55536 165953 164754 164064 164418 165570 166637 167157 167295 167052 166201 164984 163847 162476 160227 157573 155798 155008
55520 155008 153841 151564 149124 147530 146492 145387 144339 143510 142289 140073 137065 133623 129680 125507
55506 125507 122189 120566 120366 121078 122937 126219 130149 133369 135201 135960 136301 136653 136941 136669 135643 134617
55490 134617 134616 135583 136490 136829 137091 137640 138116 138248 138273 138205 137577 136310 134962 133751 132245 130357 128703 127594
55472 127594 126635 125739 125530 126208 127029 127421 127757 128497 129509 130673 132115 133356 133377 132275 131668 132620 134177
55455 134177 134922 134990 135406 136271 136880 137126 137492 137924 137788 136921 135862 135062 134479 133905 133210 132322 131377 130772 130877
55436 130877 131828 133617 135913 137755 138077 136793 134839 133019 131531 130702 131162 132819 134542 135444 135825 136345
55420 136345 137019 137596 138268 139402 141060 143217 145880 148627 150726 152113 153523 155305 156892 157897 158805
55405 158805 160014 161083 161549 161629 161441 160444 158424 156166 154288 152284 149588 146754 144512 142428 139711
55390 139711 136725 134462 132954 131447 129912 129110 129160 129190 128549 127508 126560 125749 124893 123885 122663 121289
55374 121289 120193 119941 120717 122196 123802 125009 125702 126473 128186 130967 134029 136641 138736 140302 140876
55359 140876 140224 138994 138070 137670 137520 137424 137181 136494 135496 134852 134790 134575 133573 132257 131467 131248 131172 131295 131877
55340 131877 132483 132369 131575 130863 130654 130705 130708 130549 130112 129470 129166 129668 130604 131097 130785 130034 129192 128211 127014
55321 127014 125820 124986 124716 124905 125214 125525 126283 127998 130304 132101 132810 132912 133002 133082 133139 133605 134616 135471
55303 135471 135514 134985 134370 133488 132010 130386 129471 129522 130236 131401 132842 134073 134656 134727 134655 134577 134614 134987 135432
55284 135432 135156 134014 132997 132887 133201 133308 133733 135180 136962 137803 137799 138199 139382 140388 140481 139966 139257 138262
55266 138262 136989 135892 135286 135032 134923 134818 134494 134021 134114 135298 136806 137258 136437 135479 135189 135146 134724 134117
55248 134117 133891 134177 134731 135305 135636 135473 134890 134278 133898 133698 133602 133654 133937 134640 136035 137969 139576 139999
55230 139999 139266 138021 136687 135495 134978 135589 136825 137506 137019 135740 134329 133281 133063 133994 135797 137858
55214 137858 139909 141913 143389 143601 142485 140737 138964 137371 136257 136051 136693 137617 138481 139342 140072 140315
55198 140315 140168 140204 140601 140880 140695 140280 139910 139503 139033 138766 138761 138630 138098 137401 136881 136569 136411 136487 136720 136733
55178 136733 136303 135731 135433 135360 135044 134173 132993 132088 131812 131990 132275 132659 133284 133876 133936 133639 133795 134604 135166
55159 135166 134774 133983 133679 133782 133767 133838 134524 135563 136310 136972 138205 139704 140424 140225 140054 140359 140550 140269
55141 140269 140097 140592 141628 142958 144496 145661 145504 143964 142185 141124 140634 140218 139759 139072 137742 136019
55125 136019 134990 135181 135791 135997 136207 137202 138724 139906 140608 141400 142501 143534 144119 144058 143210 141850 140849
55108 140849 140778 140974 140277 138617 137189 136971 137773 138856 139907 141006 142063 142768 143095 143512 144496 145926 147118
55091 147118 147556 147415 147272 147504 148169 149216 150402 151187 151149 150477 149655 148808 147866 147208 147408 148262 148837 148692
55073 148692 148410 148594 148990 149060 148877 148893 149153 149279 149050 148602 148212 148160 148599 149274 149559 149032 147909 146713 145663
55054 145663 144607 143465 142463 141861 141536 141001 140022 139191 139419 140701 141867 141961 141404 141236 141744 142639 144101
55037 144101 146509 149266 151094 151655 151742 151682 150809 149009 147575 147616 148556 149053 148716 147994 146998 145533 143975
55020 143975 143100 143068 143308 143371 143303 143152 142719 141922 141015 140388 140353 141061 142370 143912 145441 147024 148762 150598
55002 150598 152500 154481 156290 157492 158117 158822 160087 161644 162978 163989 164806 165366 165659 165991 166563 167035
54986 167035 166973 166508 166109 165895 165593 165063 164447 163929 163561 163212 162505 161090 159244 157866 157526 157783 157813 157471
54968 157471 157328 157817 158774 159810 160785 161873 163249 164728 165778 166109 166144 166541 167259 167610 167331 167053 167501
54951 167501 168740 170417 172150 173385 173551 172764 171867 171350 170761 169641 168369 167530 167089 166905 167458 169136
54935 169136 171153 172196 172049 171737 172066 172857 173761 175056 177285 180531 184346 188214 191932 195710 199958
54920 199958 204932 210717 217510 225570 234661 243890 252298 259183 263688 264776 262211 257145 251065 244497
54906 244497 237253 229462 221627 214028 206914 201033 197067 194534 192140 189276 186465 184286 182639 181233
54892 181233 180068 179137 178256 177498 177275 177641 177969 177737 177368 177960 180302 184253 188956 193605 198237 203762
54876 203762 210946 219389 227831 235489 242673 249909 256809 262022 264150 262644 258064 251641 244466 236990
54862 236990 229340 221955 215554 210385 205846 201085 195915 190949 186895 183891 181555 179478 177404 175022
54848 175022 172047 168781 166186 164848 164135 163010 161514 160579 160398 160021 158885 157724 157304 157185 156595 155812
54832 155812 155625 155985 156220 156308 156824 157814 158763 159575 160552 161367 161194 160073 159143 159104 159336 159017 158317 157848 157569
54813 157569 156999 156199 155824 156247 157141 157960 158522 159017 159559 159955 159973 159777 159839 160294 160726 160828 160954 161586 162534
54794 162534 163161 163253 163153 163215 163609 164470 165634 166375 166198 165830 166685 169173 172225 174609 176029 176806 177273 177868
54776 177868 179156 181263 183735 186307 189335 193159 197526 202028 206678 211679 217091 223105 230219 238613
54762 238613 247615 256246 264080 271148 277201 281481 283216 282119 278535 273289 267178 260429 252794 244262
54748 244262 235411 226958 219328 212785 207535 203416 199929 196901 194738 193679 193215 192726 192316 192469 193165
54733 193165 193974 194859 196238 198248 200555 202998 205913 209597 213834 218154 222378 226712 231524 237155 243787
54718 243787 251241 258896 265782 270854 273419 273521 271788 268672 263994 257483 249643 241609 234121 227061
54704 227061 220187 213892 208869 205199 202176 199065 195747 192573 189814 187392 185069 182781 180772 179374
54690 179374 178619 178113 177385 176344 175274 174415 173752 173238 172959 172893 172753 172352 171999 172202 172994 173792 173962 173289
54672 173289 171956 170431 169421 169534 170698 172085 172789 172500 171457 170068 168687 167516 166487 165366 164138
54657 164138 163144 162727 162904 163467 164177 164817 165289 165737 166320 166916 167426 168360 170389 173128 175066 175204 174217 173458
54639 173458 173295 173074 172321 171276 170393 169944 169981 170215 170112 169593 169329 169820 170556 170721 170370 170142 170095 169752 169103
54620 169103 168586 168133 167277 166283 166113 166966 167886 168245 168705 170067 171971 173445 174263 175017 176150 177468 178458
54603 178458 178715 178247 177611 177522 178122 178909 179556 180360 181666 183270 184673 185644 186226 186510 186625 186695 186637 186281 185740
54584 185740 185309 184956 184360 183500 182679 181913 180973 180167 180243 181237 182210 182594 183030 184314 186235 188099 189701 190991
54566 190991 191451 190753 189641 189185 189318 189003 187658 185613 183319 181003 179130 178318 178594 179321 180051 180910 182079
54549 182079 183496 185199 187347 189650 191287 191694 191129 190266 189575 189215 189106 188902 188226 187192 186456 186573 187537
54532 187537 189057 190996 193368 196114 199090 202067 204628 206274 206815 206547 205917 205161 204410 203942 204054 204621
54516 204621 204998 204535 203220 201751 200875 200706 200832 200985 201308 201858 202206 201828 200725 199360 198058 196787 195520
54499 195520 194524 194174 194575 195384 195961 195828 195143 194567 194525 194691 194478 193881 193507 193795 194527 195219 195755 196502 197890
54480 197890 199981 202350 204336 205511 205963 206183 206687 207745 209274 210870 212064 212761 213413 214652 216777
54465 216777 219615 222762 225771 228223 229817 230446 230130 228937 227118 225254 224099 224120 225182 226637 227747
54450 227747 228055 227457 226016 223912 221634 219948 219288 219192 218730 217543 216092 214807 213451 211666 209856 209061
54434 209061 209921 211933 213695 213893 212277 209882 208179 207879 208587 209538 210265 210582 210435 210043 209767 209558 208947
54417 208947 207938 207400 208028 209306 210211 210642 211320 212314 212679 211881 210847 210908 212160 213511 214116 214084 213759 213020
54399 213020 211783 210743 210940 212521 214414 215508 215828 216244 217330 218908 220530 221844 222542 222513 222209 222346
54383 222346 223064 223808 224198 224513 224999 225272 224901 224186 223800 223845 223783 223226 222396 221856 222075 223099 224389 225164 225193
54364 225193 225014 225052 224841 223623 221538 219616 218677 218773 219659 221209 223111 224615 224947 223932 222143 220539
54348 220539 219871 220150 220618 220407 219253 217520 215652 213839 212133 210702 209947 210324 211880 213930 215491 216233
54332 216233 216662 217213 217610 217459 217007 216768 216733 216567 216366 216531 216943 216874 215836 214085 212195 210510 208996 207402
54314 207402 205588 203958 203287 203785 204607 204798 204427 204146 203950 203255 202086 201229 201015 200870 200389 200068 200423 201027
54296 201027 201031 200278 199406 199041 199301 199891 200344 200308 199838 199328 199018 198786 198485 198224 198230 198642 199499 200620 201488 201613
54276 201613 201120 200646 200573 200782 201121 201582 201859 201385 200197 199275 199533 200788 202149 203112 203851 204622 205385 205927
54258 205927 206019 205492 204460 203424 202928 203112 203730 204481 205189 205789 206317 206839 207271 207388 207088 206481 205651 204547
54240 204547 203192 201785 200505 199398 198573 198210 198263 198376 198251 197848 197169 196182 195160 194757 195409 196830 198242
54223 198242 198980 198787 197921 197145 197256 198298 199532 200377 201019 201730 202072 201388 199824 198282 197406 197153 197280
54206 197280 197689 198144 198273 198088 198098 198541 198872 198422 197426 196895 197435 198599 199542 199974 200116 199948 199029 197238
54188 197238 195234 193927 193650 194104 194903 195870 196971 198307 200001 201753 202680 202130 200628 199473 199282 199465
54172 199465 199303 198967 199121 199905 200787 201186 200908 200092 199034 197986 196941 195743 194508 193703 193587 193806 193753
54155 193753 193206 192386 191583 190953 190621 190689 191140 191810 192467 192889 192964 192680 191988 190810 189424 188584 188853 189870
54137 189870 190785 191414 192384 194015 195683 196589 196664 196379 196114 196043 196259 196636 196945 197341 198283 199648 200497 200232
54119 200232 199459 199164 199468 199810 199931 199895 199447 198279 196893 196434 197492 199563 201717 203298 204024 204045 204022 204648
54101 204648 205941 207355 208548 209586 210442 210864 210777 210277 209183 207252 205031 203795 204159 205213 205480 204482
54085 204482 202961 201854 201463 201533 201727 201906 202159 202690 203629 204904 206185 206986 207018 206582 206424 206983 207967 208907
54067 208907 209847 211114 212654 214136 215569 217193 218787 219731 219908 219885 220040 220124 219996 220175 221187 222810 224476
54050 224476 226060 227772 229581 231286 233018 235157 237835 240950 244582 248923 253864 259145 264989 272087
54036 272087 280767 290526 300666 311168 322646 335510 349298 362754 374391 383067 388282 390123
54024 390123 389057 385762 381057 375766 370445 365176 359739 354138 348927 344839 342075 340100 338259 336408
54010 336408 334740 333181 331352 329135 326908 325049 323425 321496 318799 315270 311305 307576 304513 301806
53996 301806 298673 294793 290765 287424 284915 282737 280509 278287 276202 274180 272122 270106 268213 266330
53982 266330 264275 262082 260023 258332 256929 255468 253721 251905 250540 249985 250232 251053 252075 252674 252242
53967 252242 250878 249502 248883 248687 247944 246332 244521 243250 242613 242420 242725 243624 244878 246193 247682 249667
53951 249667 252097 254513 256619 258602 260839 263461 266285 269060 271723 274489 277647 281252 285122 289148
53937 289148 293440 298005 302584 307086 311991 317903 324696 331471 337384 342229 346180 349361 351911 354134
53923 354134 356303 358391 360161 361453 362403 363526 365651 369459 374892 381204 387724 394432 401679 409648
53909 409648 418258 427315 436416 444836 451848 457144 460874 463433 465312 466849 467821 467508 465543 462569 459658
53894 459658 457170 454509 451005 446680 442133 438001 434577 431674 428758 425356 421412 417247 413323 410136
53880 410136 408027 406795 405797 404799 404469 405568 407844 410293 412381 414355 416393 418205 419731 421676 425010
53865 425010 430082 436108 441002 441870 436616 425599 411299 396138 381065 366255 352207 339547 328378
53852 328378 318534 310081 303047 297033 291664 287093 283514 280525 277583 274798 272664 271247 270245 269624
53838 269624 269521 269646 269473 268949 268392 267720 266451 264578 262849 262001 262169 263072 264278 265147 265073 264029 262566
53821 262566 261088 259525 257824 256349 255484 255148 254934 254629 254437 254830 256171 258331 260726 262949 265235 267977
53805 267977 270891 273151 274347 274882 275414 276409 278305 281479 285720 290204 294345 298337 302590 307005 311239
53790 311239 315390 319889 324812 329714 334132 337928 341078 343453 344978 345916 346757 347702 348300 347765 345834
53775 345834 343251 341189 340232 340040 339850 338961 336851 333342 328975 324819 321628 319220 316841 313954 310553
53760 310553 306970 303700 301248 299774 298826 297589 295547 292849 289996 287233 284352 281129 277901 275391
53746 275391 273848 272559 270607 267982 265571 264034 263148 262435 261954 262078 262679 263101 262961 262660 262876 263702 264557
53729 264557 264964 265149 265680 266643 267542 268098 268729 269981 271746 273426 274684 275591 276187 276408 276442 276623 276865 276663
53711 276663 275867 275043 274846 275411 276627 278546 281124 283809 285918 287355 288599 290041 291708 293617 296006
53696 296006 299029 302483 306034 309628 313462 317506 321211 323865 325295 326053 326743 327261 327033 325973 324848
53681 324848 324479 324811 325066 324729 324052 323499 323027 322201 320934 319786 319325 319425 319462 319085 318470 317822 317094 316315
53663 316315 315785 315676 315874 316491 318002 320294 322082 322083 320657 319469 319508 320200 320534 320211 319360 317983 316256
53646 316256 314839 314252 314215 314069 313599 313089 312820 312953 313621 314732 315828 316534 316994 317564 318300 319093 320071 321420
53628 321420 322971 324430 325954 328035 330759 333624 336200 338626 341214 343828 345982 347580 349269 351810
53614 351810 355098 358105 360046 361373 363238 366141 369576 372958 376246 379431 382117 384112 386003 388644
53600 388644 392306 396715 401584 406561 410947 414093 416093 417590 418945 420037 420765 421253 421504 421329 420722
53585 420722 419906 418932 417617 416045 414789 414397 414855 415631 416108 415896 414933 413497 412021 410831 410068 409790 410030
53568 410030 410778 412010 413656 415454 416950 417795 417957 417563 416772 416025 416138 417673 420272 422956 425117 426963
53552 426963 428997 431340 433529 434745 434343 432552 430633 429935 430603 431533 431743 431466 431726 433113 435301 437683
53536 437683 440137 443072 446815 451186 455794 460673 466331 473071 480565 488304 496239 504681 513813 523709
53522 523709 534624 546778 559869 573261 586742 600711 615599 631530 648614 667054 686728
53511 686728 707109 727875 749253 771503 794403 817628 841305 865827 891308 917578 944547
53500 944547 972097 999729 1026797 1053168 1079290 1105499 1131527 1156838 1181171 1204586 1227231
53489 1227231 1249344 1271366 1293737 1316470 1339033 1360782 1381566 1401848 1422192 1442591 1462401
53478 1462401 1481019 1498529 1515498 1532136 1547945 1562329 1575289 1587204 1598056 1607249 1614247 1619040
53466 1619040 1621826 1622569 1621070 1617222 1610916 1601932 1590312 1576683 1561833 1545992 1528901 1510498 1491117
53453 1491117 1470997 1450102 1428532 1406619 1384411 1361504 1337678 1313311 1288890 1264552 1240502
53442 1240502 1217422 1195905 1175711 1156166 1137213 1119487 1103375 1088583 1074756 1062056 1050932
53431 1050932 1041662 1034348 1028988 1025309 1022748 1020932 1020156 1021184 1024542 1030106 1037427 1046370 1057308 1070562
53417 1070562 1085780 1102183 1119553 1138620 1160216 1184176 1209446 1235208 1261622 1289516 1319655
53406 1319655 1352314 1387266 1424121 1462800 1503656 1546882 1591874 1637546 1683370 1729910 1778203
53395 1778203 1828848 1881793 1936805 1993883 2053112 2114163 2176094 2237883 2299215 2360514 2422036
53384 2422036 2483185 2542995 2601084 2657760 2713283 2767299 2818948 2867220 2911360 2951332 2987866
53373 2987866 3021634 3052346 3078959 3100698 3117411 3128978 3134984 3135201 3129892 3119309 3103303 3081755
53361 3081755 3055086 3023808 2987734 2946054 2898175 2844277 2785148 2721908 2655955 2588806 2521572
53350 2521572 2454540 2387441 2320256 2253697 2188740 2125737 2064276 2004029 1945479 1889484 1836296
53339 1836296 1785382 1736163 1688514 1642402 1597436 1553116 1509534 1467649 1428804 1393862 1362660
53328 1362660 1334327 1308181 1284165 1262330 1242218 1223247 1205598 1190183 1177578 1167392 1158808
53317 1158808 1151342 1144785 1138761 1132792 1126767 1121115 1116558 1113822 1113448 1115554 1119682 1124992 1130770 1136828
53303 1136828 1143500 1151317 1160708 1172003 1185486 1201159 1218436 1236466 1255023 1274834 1296804 1321134
53291 1321134 1347415 1375193 1404005 1433169 1462197 1491358 1521220 1551607 1581527 1610209 1637651
53280 1637651 1664005 1688980 1712099 1733107 1751786 1767710 1780465 1789977 1796545 1800758 1803334 1804540
53268 1804540 1803608 1799120 1790167 1776948 1760333 1741319 1720819 1699193 1675769 1649478 1620306 1589461
53256 1589461 1557804 1524876 1490022 1453766 1417327 1381250 1345313 1309405 1273645 1237846 1201755
53245 1201755 1165824 1131020 1097733 1065483 1033815 1002923 973213 944721 917128 890054 863232
53234 863232 836742 811152 787132 764816 743833 723937 705291 688048 671964 656590 641738
53223 641738 627729 615190 604450 594893 585218 574645 563662 553201 543403 533777 524305 515492 507251
53210 507251 498655 489173 479489 470551 462371 454341 446342 438812 431878 425101 418090 410905 403748 396778
53196 396778 390349 385015 380952 377598 374116 370125 365824 361560 357491 353583 349726 345858 342161 339070
53182 339070 336869 335239 333464 331187 328701 326393 324168 321756 319345 317519 316558 316191 316051 316023 316056 315980
53166 315980 315692 315250 314594 313491 311987 310626 309913 309748 309695 309576 309413 308972 307878 306288 304950 304384 304277
53149 304277 303916 302966 301635 300212 298789 297351 295892 294326 292596 291005 290183 290401 290975 290746 289314 287497
53133 287497 286400 286299 286743 287400 288309 289384 290235 290618 290686 290647 290527 290398 290519 291073 291992 293165 294493 295655
53115 295655 296267 296453 296901 298053 299597 300970 301967 302531 302445 301737 301032 300875 300902 300269 298826 297238 295965
53098 295965 294694 292966 290902 289023 287592 286326 284687 282465 280156 278609 278067 277770 276920 275811 275488
53083 275488 276269 277201 277180 276086 274550 273079 271858 271114 271097 271710 272540 273440 274778 276900 279415 281286 281737
53066 281737 280994 279974 279350 279086 278916 278977 279722 281301 283176 284411 284303 282878 280900 279310 278535 278287 278034
53049 278034 277542 276978 276650 276686 276888 276904 276681 276598 276918 277247 276982 276253 275805 275897 275937 275449 274739 274214 273672 272804
53029 272804 271851 271121 270304 268996 267573 266789 266702 266732 266666 266888 267623 268566 269273 269385 268575 266844 264882 263523
53011 263523 262894 262580 262505 262974 263988 265253 266760 268519 269764 269381 267375 265047 263473 262608 262201 262587
52995 262587 263989 265757 267045 267730 268158 268470 268710 269118 269728 270103 269978 269774 269950 270326 270634 271282 272800
52978 272800 274857 276602 277795 278851 279884 280473 280443 280171 279966 279723 279393 279357 280040 281498 283465 285512 287121
52961 287121 287964 288334 288936 290042 291086 291340 290776 290003 289507 289249 288989 288666 288281 287624 286395 284591 282526
52944 282526 280388 278054 275482 273007 270982 269337 267903 266956 266954 267802 268864 269731 270475 271122 271431 271362 271198
52927 271198 270965 270319 269266 268370 267896 267354 266436 265801 266200 267224 267747 267391 266744 266230 265631 264875 264525 265103
52909 265103 266350 267522 268148 268322 268430 268753 269137 269057 268194 266955 266158 266177 266634 266965 266976 266849 266857 267186 267797
52890 267797 268419 268866 269335 270092 270905 271191 270842 270454 270463 270350 269159 266716 263943 261862 260583 259487 258232
52873 258232 257233 257087 257822 258980 260241 261607 263046 264420 265879 267845 270349 272714 274294 275223 276090
52858 276090 277107 278144 279431 281596 284822 288401 291393 293486 294985 296092 296402 295139 291904 287230
52844 287230 282290 277939 274140 270465 266955 264137 262193 260530 258422 255885 253693 252524 252168 251670 250320
52829 250320 248431 247021 246794 247638 249094 250868 252658 253944 254501 254913 256011 257719 258959 258799 257432
52814 257432 255838 254800 254464 254674 255445 256946 259097 261361 263230 264907 267143 270172 273143 274939 275295
52799 275295 274714 273508 271538 268818 265753 262679 259643 256830 254676 253285 252134 250703 249098 247721
52785 247721 246582 245353 243976 242899 242619 243192 244213 245147 245708 246031 246530 247504 248870 250235 251217 251731
52769 251731 252068 252653 253653 254825 255824 256582 257277 258005 258662 259108 259316 259370 259423 259539 259479 258819 257532 256298
52751 256298 255866 256227 256731 256949 257010 257129 257311 257598 258186 259138 260347 261898 263993 266292 267864 268190 267818
52734 267818 267581 267519 267149 266519 266255 266556 266853 266727 266595 267119 268274 269479 270385 271087 271671 272058 272315 272652
52716 272652 272928 272614 271579 270552 270325 270657 270564 269640 268550 268052 268075 268068 267806 267406 266862 266055 265075 264089 262995
52697 262995 261635 260330 259756 260200 261212 262039 262169 261538 260555 259924 260121 260961 261928 262839 263856 264878 265408
52680 265408 265158 264387 263520 262852 262824 264081 266811 270157 272731 273790 273730 273479 273593 273985 274358 274646 274954 275210
52662 275210 275217 275083 275235 275810 276362 276521 276635 277258 278261 279034 279454 280019 280997 282069 282920 283644 284403 285233 286326
52643 286326 287945 289798 291067 291268 290553 289020 286492 283357 280825 279643 279162 278408 277558 277454 278066 278512
52627 278512 278590 279211 281030 283448 285388 286520 287205 287615 287414 286295 284498 282670 281234 279943 278142 275586
52611 275586 272833 270740 269695 269488 269718 270059 270328 270626 271284 272347 273330 273835 274257 275295 276831 277888
52595 277888 277847 277209 276927 277413 278499 279934 281503 282839 283588 283802 283903 284277 285050 286185 287588 289052 290300
52578 290300 291190 291848 292538 293455 294635 295993 297367 298570 299497 300201 300699 300705 299769 297923 295969 294792 294456
52561 294456 294374 294241 294257 294325 293733 292090 290096 288848 288655 289036 289587 290205 290641 290535 289994 289545 289362 289000 288049
52542 288049 286608 284978 283357 282099 281838 282905 284806 286545 287451 287516 287151 286795 286703 286868 287109 287318 287616
52525 287616 288269 289412 290765 291629 291390 290234 289111 288797 289178 289749 290482 291694 293347 295184 297516 301016
52509 301016 305548 309948 313371 316173 319008 321615 323176 323433 322755 321321 319010 316062 313160 310664 308279
52494 308279 305679 303115 301146 299974 299286 298654 297943 297329 297014 296971 297071 297339 297802 298090 297624 296529 295984
52477 295984 297117 299681 302296 303954 304870 305831 307293 309289 311712 314276 316494 318125 319588 321614 324492
52462 324492 327852 331172 334250 337106 339623 341430 342120 341463 339435 336216 332318 328542 325509 323130 320821
52447 320821 318376 316364 315384 315140 314614 313101 310805 308484 306845 306207 306285 306172 305017 302999 301361 301213
52431 301213 302427 303864 304457 303929 302752 301714 301350 301520 301589 301160 300465 299905 299557 299436 299868 301104 302732
52414 302732 304025 304806 305500 306362 307274 308376 310285 313416 317524 322196 327310 332738 338102 343328 349031
52399 349031 355721 362890 369556 375643 382198 390033 398519 405823 410057 410280 406915 401387 395044 388258
52385 388258 380737 372649 364982 358700 354019 350634 348230 346483 345014 343776 343216 343631 344586 345399 346072
52370 346072 347313 349690 353121 357154 361353 365328 368716 371242 372614 372464 370704 367971 365318 363308
52356 363308 361673 359990 358417 357512 357578 358445 359829 361547 363378 364948 365989 366622 367321 368546 370463 372927
52340 372927 375594 378002 379704 380571 380943 381383 382309 384039 387014 391506 396937 402028 406050 409700 414350
52325 414350 420628 428201 436671 445972 455812 465380 473987 481626 488635 495101 500949 506374 511825 517589
52311 517589 523633 529834 536233 543100 550776 559307 568225 576900 585215 593773 603314 614145 626144 639007
52297 639007 652318 665657 678902 692225 705542 718154 729181 738249 745538 751362 755981 759647
52285 759647 762580 764936 767047 769435 772295 775144 777446 779483 782081 785487 789030 792037 794585 797054
52271 797054 799385 801241 802715 804381 806593 809099 811498 813847 816548 819721 822978 825989 829079 832976
52257 832976 837983 843633 849263 854607 859746 864856 870286 876564 883833 891465 898658 905313 911867 918399
52243 918399 924495 929956 935000 939657 943641 947139 951002 955652 960347 964129 967125 970295 974129 978285
52229 978285 982313 986031 989153 991230 992240 992759 993321 993924 994296 994272 993736 992565 990907 989279 988092 987297
52213 987297 986625 985982 985374 984661 983661 982427 981207 980217 979614 979642 980606 982609 985410 988547 991671 994787
52197 994787 998150 1001884 1005822 1009838 1014159 1019059 1024387 1029782 1035337 1041583 1048653 1055822 1062107 1066990
52183 1066990 1070388 1072270 1072654 1071721 1069689 1066768 1063420 1060275 1057359 1053751 1048499 1041769 1034735 1028529
52169 1028529 1023636 1019977 1016977 1013742 1009882 1006144 1003694 1002687 1002188 1001511 1001022 1001463 1003159 1006103 1010074
52154 1010074 1014231 1017204 1018209 1017764 1016881 1015955 1014938 1014135 1014106 1014970 1016480 1018683 1021809 1025456 1028618 1030758
52138 1030758 1032395 1034337 1036696 1038912 1040429 1041023 1040697 1039672 1038485 1037848 1038267 1039825 1042378 1045981 1051026
52123 1051026 1057920 1066628 1076669 1087571 1099149 1111295 1123716 1136061 1148096 1159523 1169797 1178395
52111 1178395 1185141 1190056 1193125 1194553 1195064 1195521 1196303 1197472 1199485 1203152 1208816 1216111 1224739 1235021
52097 1235021 1247371 1261603 1277116 1293415 1310047 1326207 1340793 1352821 1361583 1366660 1368140 1366758
52085 1366758 1363489 1359050 1354016 1349233 1345515 1342854 1340365 1337315 1333938 1330953 1328504 1325919 1322517 1318361
52071 1318361 1314135 1310526 1307833 1305987 1304668 1303400 1301778 1299733 1297524 1295433 1293565 1291984 1290879 1290468
52057 1290468 1290893 1292346 1295147 1299423 1304750 1310393 1315915 1321356 1326746 1331706 1335640 1338237 1339656 1340282
52043 1340282 1340332 1339655 1337960 1335319 1332322 1329591 1327235 1325076 1323232 1322079 1321590 1321186 1320346 1318971 1316950
52028 1316950 1313909 1309742 1304989 1300240 1295383 1289951 1283941 1277792 1271613 1265026 1257817 1250297 1242912 1235875
52014 1235875 1229293 1223276 1217788 1212717 1208189 1204417 1201119 1197583 1193594 1189759 1186398 1182440 1176048 1166304
52000 1166304 1153719 1139063 1122398 1103579 1083240 1062754 1043333 1025536 1009523 995290 982440
51989 982440 970066 957234 943605 929474 915283 901243 887379 873644 859862 845773 831333
51978 831333 816895 802866 789154 775159 760434 745217 730190 715891 702644 690983 681772 675604
51966 675604 672257 671070 671847 675092 681229 689783 699582 709638 719583 729262 738174 745423 750079 751467
51952 751467 749288 743725 735465 725534 715037 705022 696417 689868 685572 683345 683010 684749 689080 696479
51938 696479 706967 719994 734682 750136 765540 780058 792802 803019 810290 814468 815437 812963
51926 812963 806856 797267 784890 770855 756252 741551 726358 709888 691849 672986 654789 638584
51914 638584 624821 613068 602557 592796 583891 576543 571672 569769 570466 572872 576524 581925 589930 600633
51900 600633 613124 626390 640124 654322 668276 680402 689206 694209 695902 695175 693032 690556 688600
51887 688600 687389 686778 687051 689226 694335 702562 713182 725016 736524 745717 750675 750647 746569 740351
51873 740351 733770 727975 723707 721530 721644 723412 725138 724547 719889 710792 698052 682826 666285 649791
51859 649791 634640 621310 609472 599019 590615 584673 580319 576133 571820 568404 566691 566166 565596 564133
51845 564133 561499 557615 552554 546717 540634 534591 528652 522976 517894 513609 509893 506208 502301 498725
51831 498725 496601 496607 498368 501037 504306 508372 512982 517036 519377 519677 518501 516815 515486 514796 514157 512662
51815 512662 510219 507964 507315 508787 511886 515862 520228 524653 528606 531219 531566 529278 524845 519103 512507
51800 512507 505307 498343 492953 489726 487828 486051 484185 482924 482677 482964 482950 482270 481310 480871 481405 482499
51784 482499 483361 483886 484798 486476 488083 488345 486863 484238 481197 478121 475209 472631 470596 469678 470818
51769 470818 474510 480137 486640 493739 502024 511975 523361 535399 546878 556248 562283 564803 564329 561143
51755 561143 555331 547584 539069 530312 521024 511328 502300 494751 488177 481656 475400 470593 467842 466487
51741 466487 465542 464818 464912 466467 469703 474513 480660 487741 495143 502350 509436 516995 525301 533721 541217
51726 541217 547249 551812 554827 556135 556108 555640 555324 555133 555144 555938 557779 559716 560111 558010 553725 548245
51710 548245 542492 537154 532819 529929 528569 528276 528149 527374 525796 523979 522725 522662 524185 527488 532435
51695 532435 538500 544882 550592 554523 555847 554584 551761 548912 547366 547740 549683 552053 553559 553354 551012
51680 551012 546275 539313 531130 523167 516423 511314 508233 507558 508872 510800 511984 511907 510606 508175 504921
51665 504921 501599 499006 497551 497428 498817 501599 505301 509720 515231 521988 529053 534796 538088 538897 538037
51650 538037 536688 535910 536129 537128 538683 540916 543786 546717 549172 551283 553333 554853 554740 552205 547127
51635 547127 539661 530077 518999 507337 495898 485329 476259 469088 463642 459484 456527 455008 454892
51622 454892 455641 456616 457473 458267 459419 461443 464277 467020 468646 468884 468120 466679 464709 462575 460694 458902
51606 458902 456507 453126 449119 445192 441946 439876 439315 440132 441730 443497 445233 447248 450281 455142 462073
51591 462073 470507 479631 488990 498328 507352 516245 525998 537351 549440 560283 568577 574288 577608
51578 577608 578519 577757 577196 578548 582267 588226 596823 608744 624154 642840 664760 689681 716461
51565 716461 743538 770409 798264 829047 864032 903155 945356 989438 1034780 1081369 1129250
51554 1129250 1178143 1227360 1275641 1320939 1360796 1393046 1415783 1426630 1422881 1402994 1367744
51543 1367744 1319692 1262023 1198170 1131580 1064807 998970 934895 874526 820324 773308 732589
51532 732589 697045 666617 641623 621503 604878 590603 578311 568063 559772 552912 546663 540540
51520 540540 534916 530685 528173 526643 525046 523004 520802 518653 516385 513817 511144 508746 506728 504706
51506 504706 502053 498425 494088 489623 485230 480502 475069 469383 464547 461297 459390 458156 457403 457513 458710
51491 458710 460627 462711 464885 467585 471209 475675 480530 485405 490304 495313 500005 503299 504264 503083
51477 503083 500866 498411 495548 491824 487315 482324 476787 470661 464629 459566 455388 451190 446638 442428
51463 442428 439202 436839 435184 434566 434927 435128 433971 431540 428816 426301 423815 421392 419481 418265 417593
51448 417593 417678 419115 422034 425921 430544 436470 444339 454164 465589 478304 491863 505670 519651
51435 519651 534400 549932 564505 575483 581474 583224 582477 580581 578365 576655 576168 576799 577343 576091
51421 576091 571810 564389 554785 544259 533493 522377 510790 499517 490090 483535 479391 476215 473023
51408 473023 470096 468374 468316 469462 470954 472251 473431 474911 477011 479779 483235 487580 492965 499114 505525
51393 505525 512177 519739 528811 539170 550118 561514 574163 589196 607334 628803 653742 682569
51381 682569 716037 754958 799780 850423 906585 968042 1034478 1105109 1178696 1253750 1328367
51370 1328367 1399825 1464811 1520271 1563862 1593523 1607038 1602513 1579365 1538746 1483142 1415751
51359 1415751 1340033 1259368 1176769 1094797 1015664 941270 873070 811926 758142 711644 672130
51348 672130 639090 611720 588914 569482 552512 537589 524697 513862 504824 497025 489977 483599
51336 483599 478122 473614 469731 466053 462497 459275 456439 453721 450867 447991 445516 443762 442616 441600
51322 441600 440325 438919 437875 437413 437119 436362 434959 433217 431430 429624 427852 426455 425855 426137 426896 427434
51306 427434 427207 426325 425669 426309 428621 432039 435617 438735 441216 443022 443984 443837 442418 439881 436697 433389
51290 433389 430318 427782 426128 425454 425234 424709 423847 423673 425358 429095 433918 438452 441711 443517 444445 445317
51274 445317 446510 447806 448981 450231 451775 453317 454353 454848 455139 455205 454609 453368 452327 452278 453044 453838
51258 453838 454293 454652 455032 455067 454378 453017 451206 449044 446732 444787 443574 442714 441442 439597 437875 436934
51242 436934 436627 436361 435916 435553 435521 435894 436773 438198 439772 440816 441084 440975 440806 440287 439072 437563 436576
51225 436576 436268 435979 435265 434597 434743 435839 437464 439344 441438 443401 444560 444617 444004 443336 442791 442356 442361 443318
51207 443318 445258 447629 449889 451944 453938 455955 458053 460320 462730 465090 467318 469643 472387 475619
51193 475619 479119 482560 485611 488024 489791 491142 492304 493327 494208 494961 495441 495363 494687 493825 493208 492757
51177 492757 491996 490520 488178 484943 480955 476555 472024 467412 462888 459016 456270 454372 452652 450983
51163 450983 449857 449467 449309 448863 448222 447827 447983 448855 450442 452309 453807 454912 456434 458945 461881 464216
51147 464216 465683 466751 467610 467875 467320 466309 465301 464320 463047 461129 458350 454816 451138 448150 446308
51132 446308 445508 445440 445842 446475 447251 448518 450782 453975 457275 459888 461730 463184 464540 465941 467554 469383
51116 469383 471106 472529 474081 476372 479289 481964 483792 485058 486388 487930 489464 491044 493090 495794
51102 495794 498767 501369 503232 504432 505385 506642 508550 510891 512984 514368 515248 516051 516652 516439 515174
51087 515174 513474 512257 511952 512405 513235 513975 514085 513281 511820 510169 508427 506440 504502 503386 503403 503829
51071 503829 503741 503244 503329 504531 506129 506984 506889 506849 508162 511491 516737 523425 530957 538695 546175 553396 560830
51054 560830 569042 578294 588570 599815 611990 624794 637427 648813 658209 665829 672992 681559 692852
51041 692852 706774 721851 736216 748744 759410 768672 776504 782043 784160 782407 777328 769895 760802
51028 760802 750453 739294 727683 715376 701668 686409 670639 655852 642800 631436 621833 614591
51016 614591 610165 608228 607992 608855 610552 612984 616243 620596 626108 632389 638959 645668 652511 659346 666224
51001 666224 673728 682331 691464 699969 707616 715544 724849 735365 746287 757424 769060 780926 792092
50988 792092 801972 810801 819008 826634 833616 840189 846664 852986 858778 863706 867730 871141 874404 877810
50974 877810 881244 884498 887902 892309 898356 905938 914643 924429 935573 948134 961803 976399 992303
50961 992303 1010325 1031209 1055319 1082614 1112841 1145689 1180790 1217614 1255409 1293241 1330196
50950 1330196 1365698 1399681 1432275 1463235 1491913 1517995 1541994 1564641 1585937 1605373 1623077
50939 1623077 1640113 1657379 1674750 1691752 1708596 1725872 1743253 1758990 1770792 1776971 1776928 1771103
50927 1771103 1760672 1746952 1730709 1712013 1690656 1666463 1639190 1608499 1574328 1537166 1497793
50916 1497793 1456795 1414530 1371527 1328663 1286831 1246476 1207610 1170312 1135087 1102604 1073104
50905 1073104 1046244 1021596 999207 979442 962315 947118 932850 918919 905445 892919 881740
50894 881740 872068 863941 857274 851758 846920 842443 838318 834677 831616 829287 827882 827290 826977 826604 826681
50879 826681 828100 831022 834596 837990 841182 844555 848135 851696 855359 859618 864843 871161 878742 887785
50865 887785 898158 909354 920923 932811 945263 958624 973322 989799 1008350 1029018 1051724
50854 1051724 1076521 1103776 1134134 1168174 1206041 1247577 1292943 1342899 1398240 1459064 1524816
50843 1524816 1594960 1669279 1747518 1829010 1912775 1997855 2083495 2169066 2253887 2337037 2417326
50832 2417326 2493358 2563503 2625922 2679073 2722550 2757260 2784565 2805405 2820474 2830947 2838510
50821 2838510 2844744 2850796 2857553 2865655 2875305 2886531 2899707 2915277 2932664 2949702 2963423 2971178
50809 2971178 2970877 2960613 2938713 2904338 2857818 2800306 2733131 2657439 2574350 2485342 2392406 2297749
50797 2297749 2203400 2111240 2023231 1941295 1866727 1799854 1740480 1688692 1645116 1610243 1583530
50786 1583530 1563349 1548061 1537109 1530841 1529313 1531701 1536958 1544469 1553551 1562798 1570658 1576583 1580926
50773 1580926 1583606 1583548 1579739 1572343 1562438 1550953 1538119 1523640 1507039 1488011 1466696 1443570 1418956
50760 1418956 1392776 1364820 1335079 1303886 1272089 1241106 1212323 1186187 1162256 1140258 1120592
50749 1120592 1103514 1088507 1075190 1064419 1057581 1054798 1054647 1055949 1059122 1065299 1074655 1086357 1099996
50736 1099996 1116339 1136369 1160118 1186896 1216501 1249563 1286580 1327003 1369663 1413981 1460500
50725 1460500 1510165 1563140 1618207 1673212 1726231 1776452 1823844 1868057 1908109 1943357 1974169
50714 1974169 2001041 2023340 2039654 2049293 2052743 2050696 2043512 2031948 2017765 2003109 1989625 1978379
50702 1978379 1970213 1965815 1965669 1969997 1978397 1989541 2001923 2014987 2028751 2042008 2051867 2055764 2053190
50689 2053190 2044719 2030098 2008491 1980192 1946932 1910484 1871946 1832466 1793727 1757398 1724701
50678 1724701 1696662 1674111 1657292 1646100 1640841 1642128 1649773 1662444 1678836 1698718 1722604 1750917
50666 1750917 1783878 1821600 1863665 1908811 1955483 2002547 2049116 2093936 2135507 2172921 2206309
50655 2206309 2236423 2263941 2289164 2312183 2333186 2352476 2370119 2385732 2398942 2410125 2420446
50644 2420446 2430999 2442148 2453858 2466493 2481116 2499051 2521246 2547928 2578759 2613315 2651427
50633 2651427 2692985 2737532 2784209 2832009 2879891 2926745 2971562 3013632 3052214 3086006 3113349
50622 3113349 3133210 3145901 3152896 3156054 3156434 3152771 3140758 3114789 3071689 3013318 2945755 2876193
50610 2876193 2810394 2751948 2702615 2662870 2632348 2609973 2593920 2581959 2572229 2563480 2554293 2542390
50598 2542390 2525141 2500687 2468289 2427820 2379430 2323660 2261474 2194151 2123340 2051025 1978892
50587 1978892 1907776 1838195 1771435 1709470 1653589 1603575 1558597 1518464 1483520 1453677 1428275
50576 1428275 1406995 1390302 1378541 1370848 1365380 1360731 1356871 1354572 1354162 1355091 1356682 1358936 1362482 1367927
50562 1367927 1375423 1384705 1395360 1407161 1420332 1435438 1452877 1472633 1494795 1520114 1549641 1583730
50550 1583730 1621743 1662828 1706619 1752973 1801337 1850792 1900602 1950429 2000037 2049087 2097297
50539 2097297 2144630 2191332 2238002 2285671 2335629 2388987 2446438 2508462 2575591 2648354 2727104
50528 2727104 2812038 2903304 3000858 3104321 3213294 3327950 3449008 3576854 3710781 3849270
50518 3849270 3990810 4133933 4276366 4414647 4545056 4664846 4772266 4865475 4941881 4998736
50508 4998736 5034103 5047092 5037438 5005311 4951540 4877704 4785887 4678571 4558938 4431099 4299787
50497 4299787 4169784 4045587 3931270 3830154 3744449 3675357 3623531 3589186 3571612 3568753 3577483
50486 3577483 3594281 3615595 3637749 3656831 3668726 3669263 3654425 3620851 3566579 3491611 3397921 3288858
50474 3288858 3168274 3039859 2906900 2772287 2638445 2507267 2380341 2259299 2145709
50465 2145709 2040471 1943610 1854838 1774139 1701528 1636494 1578164 1526059 1480245 1440670 1406690
50454 1406690 1377444 1352377 1331131 1313177 1297980 1285551 1276466 1271082 1268746 1267949 1267331 1266560 1266234
50441 1266234 1267091 1269477 1273484 1279220 1286713 1295812 1306409 1318597 1332322 1347025 1361939 1376564 1390515
50428 1390515 1403197 1414281 1424546 1435535 1448159 1462136 1477078 1493536 1512519 1534493 1559477
50417 1559477 1587785 1619964 1656078 1695727 1738882 1786254 1838651 1896358 1959135 2026458 2097558
50406 2097558 2171586 2247957 2326355 2406260 2486624 2566041 2643057 2716315 2784709 2847483 2903878
50395 2903878 2952568 2991810 3020415 3038244 3045427 3041297 3024533 2994255 2950713 2895080 2829130 2755195
50383 2755195 2675915 2593693 2510586 2428952 2351851 2282373 2222542 2173031 2133765 2104378 2084136
50372 2084136 2071898 2066466 2066771 2071469 2078543 2085607 2090567 2091794 2087748 2076723 2057078 2027665 1988173
50359 1988173 1939419 1883474 1823248 1761515 1700080 1639698 1580628 1523192 1467887 1415186 1365391
50348 1365391 1318658 1275065 1234492 1196528 1160737 1127105 1096048 1067801 1041985 1018056 996077
50337 996077 976715 960472 947183 936321 927464 920247 914148 908660 903674 899498 896410 894323 892981
50324 892981 892447 893188 895553 899297 903993 909867 917754 927950 939622 951899 965149 980371 997451
50311 997451 1014929 1031630 1047548 1062592 1075323 1083852 1087609 1087503 1084648 1079865 1074377 1070003 1068111
50298 1068111 1068714 1070840 1073556 1076519 1079936 1084220 1089474 1095121 1100285 1104658 1108877 1113922 1120308 1127971
50284 1127971 1136764 1146851 1158404 1170640 1180932 1185211 1180057 1164941 1142510 1116754 1091079 1067803
50272 1067803 1048418 1033538 1022786 1015417 1011147 1010061 1011803 1015395 1020065 1025887 1033356 1042520 1052792
50259 1052792 1063402 1073741 1083356 1091994 1099756 1107018 1114072 1120932 1127516 1133774 1139462 1143931 1146370
50246 1146370 1146364 1144206 1140772 1137109 1133929 1131243 1128537 1125531 1122821 1121625 1122926 1126943 1133362 1141887 1152654
50231 1152654 1166340 1183837 1205555 1231098 1259855 1291816 1327339 1366180 1407390 1450395 1495596
50220 1495596 1543418 1593094 1642835 1690908 1736023 1776963 1812563 1842303 1866516 1885839 1900633
50209 1900633 1910924 1916565 1917181 1912032 1900040 1880098 1851607 1814926 1771204 1721670 1667320 1609474
50197 1609474 1550373 1492715 1438567 1388949 1344267 1304703 1270139 1240081 1213787 1190233 1167941
50186 1167941 1145185 1120661 1093938 1065419 1036083 1007212 979938 954916 932509 913162 897270
50175 897270 884694 874757 866806 860525 855678 851948 849203 847654 847534 848751 850843 853071 854596 854967
50161 854967 854685 855035 857018 860491 864437 867983 871024 874027 877417 881231 885302 889666 894612 900316 906675
50146 906675 913598 921122 928965 936301 942407 947286 951121 953408 953385 951323 948578 946112 943651 940639 937441
50131 937441 935199 934966 937396 942808 951005 961190 972512 984593 997388 1010908 1025373 1041235 1058714
50118 1058714 1077640 1098201 1121431 1148479 1179660 1214851 1254653 1300464 1353309 1412926 1478078
50107 1478078 1547540 1620919 1698898 1782542 1871975 1965674 2061133 2155847 2247401 2333265 2411586
50096 2411586 2482236 2546323 2604453 2655947 2699736 2735106 2761123 2775890 2777011 2762646 2731933
50085 2731933 2684872 2622432 2546702 2460489 2366636 2267752 2166348 2064808 1965096 1868656 1776695
50074 1776695 1690573 1611879 1541959 1481133 1428365 1382024 1341130 1305691 1275798 1250750 1229335
50063 1229335 1210731 1194711 1181036 1168983 1157598 1146324 1135339 1125387 1117195 1110860 1105733 1101005
50051 1101005 1096372 1092012 1087940 1083648 1078546 1072646 1066603 1061064 1056101 1051348 1046592 1042104 1038431 1035975
50037 1035975 1034837 1034971 1036317 1038754 1042032 1045924 1050481 1056069 1063009 1071228 1080385 1090296 1100934 1111890
50023 1111890 1122171 1130941 1138322 1145057 1151389 1156757 1160706 1163650 1166452 1169539 1172717 1175517 1177376 1177696
50009 1177696 1176168 1172951 1168371 1162634 1156216 1150269 1146126 1144418 1145063 1148013 1153468 1161449 1171826 1185008
49995 1185008 1202038 1223667 1249736 1279715 1313396 1350661 1390989 1433672 1478337 1524724 1572183
49984 1572183 1619921 1667679 1715440 1762314 1806236 1845076 1877765 1904137 1924215 1938187 1946895
49973 1946895 1951641 1953299 1951835 1946688 1937259 1922817 1902218 1874024 1836951 1790283 1734318 1670804
49961 1670804 1602811 1533724 1466179 1401973 1342669 1289793 1244359 1206526 1175877 1151743 1133308
49950 1133308 1119799 1110820 1106245 1105598 1107807 1111651 1116056 1119780 1121370 1119962 1115840 1109776 1102079 1092694
49936 1092694 1081807 1069590 1055573 1039099 1020385 1000386 979552 957551 934443 911274 889025
49925 889025 867740 847249 828120 811119 796190 782854 771398 762816 757520 754791 753652 753743 755192
49912 755192 758134 762576 768353 774948 781618 787873 793748 799648 806205 814230 824340 836428 849823
49899 849823 864084 879364 895855 913246 930934 948380 964923 979532 991162 999352 1004227 1006067
49887 1006067 1005063 1001301 994625 984620 971034 954198 934805 913488 891025 868829 848554 830903
49875 830903 815144 800084 785329 771389 758859 747833 738018 729101 721042 714217 709286 706727 706458
49862 706458 708016 711005 715249 720663 727233 735130 744576 755531 767753 781187 796099 812660 830556
49849 830556 849133 867744 885785 902511 917028 928554 936676 941449 943374 943261 941842 939271 934871
49836 934871 927485 916316 901669 884892 867463 850191 833439 817902 804725 794639 787318 781865
49824 781865 777829 775441 774995 776342 779066 782927 788043 794738 803269 813626 825560 838928 853887
49811 853887 870468 887850 904288 918036 928444 936156 942338 947727 952253 955314 956289 954892 951157
49798 951157 945125 936551 925068 910887 895332 880381 867244 855468 843705 831384 819232 808130
49786 808130 797947 787943 777942 768630 760832 755005 751348 749780 749696 750246 751113 752632 754924 757405
49772 757405 759569 761967 765870 772079 780492 790776 802948 817045 832437 847731 861366 872356
49760 872356 880612 886581 890632 892945 894008 894705 895404 895073 891837 884577 873680 860248 845135 828950
49746 828950 812415 796212 780712 766239 753327 742293 732808 724440 717408 712181 708468 705344 702520
49733 702520 700730 700511 701307 702309 703682 706310 710625 716288 722825 729898 737066 743960 750849 758534 767552
49718 767552 777880 789442 802343 816449 831182 845942 860346 873913 886021 896371 905000 911495
49706 911495 914763 914037 909718 902650 893011 880642 866316 851792 838408 826159 814434 803234 793416
49693 793416 785963 781166 778276 775809 772561 768676 765605 764824 766598 770079 774379 779238 784738 790812
49679 790812 797350 804685 813609 824757 838108 853171 869449 886538 904085 922095 941082 961184
49667 961184 980872 997209 1007888 1012856 1013653 1011691 1007704 1002426 996924 992096 988316 985578 983492 981108
49653 981108 977204 970837 961251 947514 929025 906684 882888 859970 838934 819831 802728 787772
49641 787772 774816 763695 754815 748951 746394 746598 748589 751416 754267 756477 757652 757649 756501 754442 751886
49626 751886 749102 745898 741800 736637 730839 725139 720048 715592 711494 707536 703780 700456 697706 695565
49612 695565 694142 693625 694023 695043 696336 697757 699283 700783 702061 703140 704386 706241 708847 711897 714870
49597 714870 717413 719492 721258 722896 724567 726244 727552 728057 727885 727724 727985 728327 728489 729154 731209 734283
49581 734283 736907 738315 739316 741035 743560 746357 749362 752940 757147 761777 766934 772895 779483 786206
49567 786206 793023 800505 809212 819370 831052 844095 857769 871060 883456 894981 905327 913469
49555 913469 918499 920406 919654 916382 910543 902715 894198 886201 879202 873223 868411 865105 863358 862645 862167
49540 862167 861459 860605 859856 859224 858625 858231 858335 858808 859115 859092 859457 861224 864821 870067 876852 885404 895937
49523 895937 908489 923141 939858 957946 976257 994395 1013290 1033896 1055496 1075855 1093038
49512 1093038 1106475 1116344 1122784 1126168 1127533 1128113 1128680 1129590 1131022 1132617 1133193 1131431 1126722 1118935 1107612
49497 1107612 1092222 1073244 1052416 1031724 1012472 995274 980319 967400 956107 946199 937522 929555
49485 929555 921631 913813 907074 902270 899302 897510 896506 896233 896524 897082 897838 899014 900829 903247 905901
49470 905901 908235 909906 911163 912615 914622 917181 920389 924578 929814 935634 941474 947029 952035 956044
49456 956044 958629 959548 958648 956103 952828 950000 947777 945019 940704 935072 928935 922468 915456 908267 901682
49441 901682 895897 890428 884985 879797 875105 871019 867966 866616 867118 868825 870959 873316 876227 880177
49427 880177 885590 892760 901865 913096 926605 942177 959175 976986 995187 1013059 1029621 1044848
49415 1044848 1060227 1076801 1092494 1102551 1103427 1095905 1084214 1072732 1063949 1058750 1057442 1060126 1066638
49402 1066638 1076527 1089147 1103752 1119568 1135937 1152539 1169517 1187163 1205282 1223001 1239406
49391 1239406 1254206 1267548 1279420 1289673 1298495 1306340 1313168 1318038 1319527 1316523 1308764 1297026 1282740
49378 1282740 1267103 1250561 1233368 1216395 1200888 1187520 1176224 1166954 1160017 1155580 1153421 1153391 1155586
49365 1155586 1159777 1165077 1170523 1175737 1180764 1185543 1189705 1192674 1193783 1192620 1189457 1185127 1180302 1175103
49351 1175103 1169438 1163345 1156893 1150166 1143628 1138142 1134301 1131942 1130548 1129882 1129997 1130876 1132339 1134109 1135713
49336 1135713 1136470 1135862 1133857 1130747 1126731 1121785 1115834 1108948 1101475 1093982 1086897 1080257 1074059 1068780
49322 1068780 1065095 1063010 1061725 1060599 1059805 1059780 1060390 1061095 1061698 1062524 1063908 1065807 1067881 1069757 1071298 1072779
49306 1072779 1074773 1077729 1081696 1086431 1091569 1096759 1101950 1107694 1114801 1123457 1132913 1142275 1151436 1161051
49292 1161051 1171784 1183772 1196591 1209475 1221666 1232780 1242910 1252433 1261850 1271710 1282233 1292831
49280 1292831 1302353 1310088 1316442 1322516 1329139 1336259 1342804 1346927 1346780 1341550 1331847 1319134 1305025 1291023
49266 1291023 1278328 1267480 1258478 1251399 1246523 1243585 1241482 1239327 1237569 1237476 1239675 1243801 1249602 1257744
49252 1257744 1269196 1284151 1301858 1321268 1341459 1361446 1380035 1396178 1409283 1418667 1422674 1419049
49240 1419049 1406762 1387245 1363398 1337650 1311550 1286750 1265076 1247211 1232193 1218851 1207290
49229 1207290 1198525 1193140 1190743 1190299 1190472 1190019 1188499 1186556 1185193 1184979 1186122 1188798 1192837 1197401 1201505
49214 1201505 1204804 1207542 1209973 1212167 1214143 1215806 1216958 1217695 1218603 1220357 1223426 1228360 1235746 1245437
49200 1245437 1256420 1268044 1280899 1295800 1312308 1329033 1345043 1360120 1373935 1385988 1396386
49189 1396386 1405787 1414456 1422091 1428567 1434030 1438134 1440165 1440307 1439997 1440537 1441957 1443813 1446605 1451741 1460318
49174 1460318 1472549 1488310 1507820 1531554 1559666 1591653 1626634 1663967 1703480 1744986 1787566
49163 1787566 1829147 1866419 1895145 1911496 1914141 1905293 1889373 1870613 1851879 1834918 1820513 1808275
49151 1808275 1797147 1786558 1776720 1767792 1759391 1751165 1743382 1736686 1731656 1728783 1728393 1730320 1733980 1738967
49137 1738967 1745300 1753002 1761826 1771525 1782042 1793269 1804977 1817065 1829498 1841937 1853967 1865825
49125 1865825 1878310 1891710 1905306 1918345 1930975 1943840 1957194 1970993 1985619 2001954 2020777
49114 2020777 2042400 2066815 2094041 2124445 2158964 2198746 2244369 2295694 2352734 2416398 2488207
49103 2488207 2569654 2662002 2765512 2877203 2989180 3091048 3176355 3247549 3313562 3380568
49093 3380568 3443646 3487453 3496305 3465349 3403505 3326420 3246160 3165864 3082019 2990738 2892559
49082 2892559 2792745 2698026 2613097 2539585 2477259 2425397 2383074 2349006 2321773 2300090 2282665
49071 2282665 2268043 2254941 2242703 2231227 2220490 2210227 2200046 2189825 2180017 2171457 2164623 2159089
49059 2159089 2153984 2148979 2144514 2141045 2138469 2136440 2134895 2134032 2134033 2134997 2136961 2139791 2143237 2147216 2151838
49044 2151838 2157079 2162741 2168869 2175930 2184391 2194367 2205888 2219230 2234688 2252200 2271431 2292095
49032 2292095 2313937 2336390 2358347 2378317 2394946 2407715 2417239 2424679 2430818 2435823 2439741 2442797
49020 2442797 2445183 2446988 2448473 2450077 2452048 2454470 2457636 2461912 2467129 2472747 2478798 2486095 2495189 2505733
49006 2505733 2517246 2529910 2543989 2558909 2573573 2587313 2600062 2611922 2623149 2634321 2645858
48995 2645858 2657467 2668468 2678545 2687760 2696060 2703254 2709284 2714106 2717494 2719399 2720210 2720233 2719260 2717296
48981 2717296 2715352 2714605 2714882 2714781 2713380 2711073 2708644 2706236 2703400 2699435 2693463 2684887 2674157 2662535
48967 2662535 2650763 2638520 2625467 2612210 2599743 2588484 2578494 2570231 2564354 2560889 2559237 2559116 2561044
48954 2561044 2565781 2573586 2584152 2597038 2612002 2629023 2648125 2669207 2692003 2716180 2741402 2767349
48942 2767349 2793753 2820399 2846975 2873041 2898361 2923249 2948366 2974250 3001272 3029982 3060987
48931 3060987 3094371 3129610 3166325 3204788 3245506 3288575 3333686 3380459 3428488 3477372 3527154
48920 3527154 3578498 3631952 3687073 3742753 3798374 3854270 3910962 3968368 4025939 4083212 4139933
48909 4139933 4195894 4250993 4305426 4359546 4413516 4467159 4520074 4571742 4621658 4669634 4716040
48898 4716040 4761438 4805821 4848388 4888245 4925168 4959436 4991034 5019363 5043873 5064727 5082699
48887 5082699 5098577 5112706 5124868 5134279 5139872 5140858 5137062 5128637 5115625 5098115 5076734 5052503
48875 5052503 5025991 4996816 4964197 4927823 4888030 4845320 4799946 4751927 4701201 4647672 4591292
48864 4591292 4532254 4471190 4409126 4347169 4286114 4226376 4168340 4112749 4060524 4012079 3966908
48853 3966908 3923968 3882502 3842502 3804536 3769226 3736749 3706638 3678105 3650725 3624777 3600836
48842 3600836 3579193 3559950 3543570 3530847 3522093 3516608 3513289 3511678 3512189 3515352 3521054 3528560 3537178
48829 3537178 3546917 3558573 3573022 3590317 3609573 3629920 3651380 3674562 3699703 3726415 3754318
48818 3754318 3783330 3813196 3843349 3873627 3904722 3937341 3971127 4004934 4038150 4071229 4104822
48807 4104822 4138877 4172920 4206952 4241625 4277435 4314022 4350548 4386795 4423588 4461882 4501656
48796 4501656 4542096 4582733 4623670 4664534 4703938 4740612 4774641 4806992 4838185 4868143 4897037
48785 4897037 4925280 4952555 4977632 4999344 5017111 5030258 5037582 5038117 5031925 5019745 5002252 4980056
48773 4980056 4954055 4925325 4894762 4863004 4830264 4795879 4758459 4717110 4672472 4626123 4579062
48762 4579062 4531064 4481360 4429530 4375747 4320591 4264783 4208946 4153493 4098713 4044862 3992151
48751 3992151 3940888 3891735 3845480 3802257 3761083 3720472 3679441 3638003 3596984 3557607 3520944
48740 3520944 3487402 3456784 3428976 3404354 3383294 3365536 3350228 3336383 3323062 3309460 3295257
48729 3295257 3280811 3266805 3253883 3242710 3233903 3227458 3222580 3218644 3216093 3215880 3218227 3222488 3228015
48716 3228015 3234463 3241316 3247903 3254125 3260610 3267832 3275503 3283062 3290382 3297753 3305399 3313243 3320936 3328116
48702 3328116 3334918 3342294 3351406 3362540 3374935 3387814 3401204 3415536 3430983 3447565 3465510 3484932
48690 3484932 3505228 3525303 3544377 3562175 3578332 3592129 3603160 3611997 3619870 3627787 3636255 3645736
48678 3645736 3656825 3669598 3682946 3694944 3703996 3709541 3711800 3711210 3708262 3703536 3697542 3690463 3682150
48665 3682150 3672341 3660908 3648007 3633993 3619004 3602544 3583739 3562166 3538279 3512825 3486014
48654 3486014 3457416 3426497 3393040 3357173 3319263 3279794 3239240 3198122 3157229 3117656 3080481
48643 3080481 3046346 3015146 2985823 2956544 2925622 2892630 2858493 2824458 2791278 2759393 2729259
48632 2729259 2701094 2674626 2649405 2625009 2600671 2575258 2548207 2520161 2492135 2464395 2436724
48621 2436724 2409515 2383814 2360296 2338863 2319393 2302365 2288557 2278415 2271818 2268278 2267445 2269548
48609 2269548 2274971 2283085 2291915 2299547 2305552 2310456 2314213 2316088 2315953 2314759 2313588 2312997 2313442 2315528 2319468
48594 2319468 2324746 2330507 2335726 2338889 2338310 2333274 2324585 2313777 2302127 2290408 2278890 2267247 2254943
48581 2254943 2242114 2229710 2218594 2208944 2200649 2193704 2187957 2183120 2179439 2177773 2178513 2180899 2183941
48568 2183941 2187683 2193045 2200798 2211137 2223926 2238719 2254613 2270486 2285294 2297924 2307104 2311892
48556 2311892 2312053 2307671 2298739 2285631 2269645 2252539 2235546 2219174 2203610 2188682 2173559 2157160
48544 2157160 2139010 2119266 2097969 2074815 2049857 2023920 1998033 1972754 1948285 1924993 1903492
48533 1903492 1884285 1867506 1853015 1840629 1830284 1822061 1816106 1812545 1811398 1812420 1815030 1818612 1823045
48520 1823045 1828724 1835859 1843991 1852532 1861548 1871287 1880650 1886589 1885754 1876996 1862255 1845112 1828751
48507 1828751 1815103 1805179 1799462 1797958 1800336 1806292 1815531 1827276 1840130 1852769 1864712 1876186
48495 1876186 1887404 1898331 1909090 1920154 1931726 1942844 1951047 1953095 1946467 1930721 1907649 1880057
48483 1880057 1850341 1820071 1790454 1762688 1737736 1715999 1697294 1681150 1667222 1655561 1646474
48472 1646474 1639990 1635472 1631820 1628116 1624263 1621240 1620580 1623115 1628149 1634193 1640547 1647681 1656190 1666226
48458 1666226 1678136 1692552 1709082 1725697 1740335 1752603 1763059 1771474 1776953 1779417 1779718 1778369
48446 1778369 1775274 1770756 1765715 1760561 1754885 1748332 1740851 1731932 1720587 1706464 1690145 1672125 1652350
48433 1652350 1631114 1609482 1588384 1568070 1548795 1531213 1515553 1501151 1487318 1474040 1461429
48422 1461429 1449250 1437496 1426710 1417021 1407488 1397065 1385809 1374538 1363755 1353457 1343631 1334374
48410 1334374 1325718 1317711 1310311 1303038 1295221 1286855 1278702 1271280 1264417 1258076 1252786 1248692 1244869 1240334
48396 1240334 1235254 1230583 1226900 1224115 1221850 1219581 1216823 1213643 1210557 1207587 1203961 1199161 1193628 1187923
48382 1187923 1181951 1175689 1170000 1165822 1162926 1160240 1157088 1153504 1149679 1145785 1142037 1138342 1134181 1129295
48368 1129295 1124137 1119118 1113870 1107875 1101463 1095539 1090584 1086416 1082688 1079098 1075407 1071693 1068311 1065313
48354 1065313 1062328 1059246 1056466 1054156 1051919 1049510 1047161 1044833 1042025 1038842 1036339 1035144 1034590 1033920
48340 1033920 1033485 1033892 1034856 1035821 1037004 1038792 1040782 1042401 1043898 1045793 1047980 1050289 1053256 1057319 1061893
48325 1061893 1066369 1071457 1078373 1087151 1096904 1107481 1119698 1134038 1149885 1165985 1181243 1195491
48313 1195491 1209786 1225151 1240579 1253242 1261228 1264935 1265380 1262843 1258221 1253992 1252226 1252894 1255566
48300 1255566 1261357 1271568 1285764 1303045 1323980 1349442 1378703 1410622 1445681 1485061 1529012
48289 1529012 1578049 1634345 1699790 1774074 1856936 1951014 2060369 2187992 2337202 2513710
48279 2513710 2723755 2972336 3266076 3615687 4033460 4532518 5132464 5860911 6743027
48270 6743027 7791818 9011448 10401437 11950295 13637656 15456926 17412334 19439075
48262 19439075 21300942 22606335 22993384 22344457 20840197 18825149 16628628 14475123
48254 14475123 12488711 10725203 9196721 7892426 6794935 5884216 5134833 4519019
48246 4519019 4013446 3599849 3261188 2981681 2749750 2557393 2397185 2262374 2148627
48237 2148627 2052908 1971303 1900053 1837699 1784134 1738375 1698979 1665472 1637411 1612934 1590022
48226 1590022 1568285 1548003 1528431 1508729 1489525 1471728 1454587 1436684 1418182 1400425 1383872
48215 1383872 1368055 1353066 1339469 1326999 1314948 1303680 1294399 1287196 1280171 1270502 1255864 1235269
48203 1235269 1209493 1180492 1149823 1117965 1085540 1054316 1026090 1001203 979071 959523 942616
48192 942616 927673 913696 900525 888663 878194 868688 859905 851816 844215 837106 831182 827119 824518
48179 824518 822238 819545 816376 812853 809248 806134 803850 802053 800372 799150 798828 798959 798626 797648 796624
48164 796624 795983 795696 795751 796192 796756 797067 797149 797290 797572 797989 798758 799988 801353 802631 804245 806643 809503
48147 809503 812189 814637 816992 818725 819051 818121 816888 815797 814472 812812 811493 811062 811138 810939 810191 809300
48131 809300 808952 809650 811330 813340 815092 816710 818693 821082 823434 825530 827530 829325 830305 829993 828572
48116 828572 826667 824948 824021 824278 825660 827817 830597 834124 838380 843002 847524 851550 854762 857185 859463
48101 859463 862404 866101 869965 873788 878206 883720 889729 895178 900034 905482 912487 920633 928725 936261
48087 936261 943905 952537 962276 972600 983114 993791 1004546 1014946 1024526 1033230 1041433 1049592 1057894
48074 1057894 1066130 1073979 1081532 1089384 1098023 1107222 1116380 1125310 1134294 1143437 1152528 1161580 1170962 1180758
48060 1180758 1190564 1200134 1209647 1218905 1226771 1232008 1234434 1234839 1234049 1232506 1230372 1227391 1222793 1215980
48046 1215980 1207340 1197953 1188506 1178987 1169313 1159652 1149928 1139520 1127848 1115085 1102130 1089936 1078927
48033 1078927 1068862 1059175 1049514 1039937 1030510 1020820 1010169 998290 985694 973173 961067 949105
48021 949105 936953 924767 912964 901458 889452 876352 862692 849721 838177 827917 818613 810088
48009 810088 801904 793474 784988 777486 771444 765910 759779 753429 748236 744735 742114 739445 736628 734082
47995 734082 732132 730825 729838 728559 726694 724730 723299 722251 721026 719854 719746 721125 723174 724829 725774
47980 725774 726169 726032 725342 724277 722953 721246 719204 717211 715409 713390 710888 708455 706880 706095 705140
47965 705140 703179 700195 696690 693040 689288 685415 681661 678458 675922 673600 671045 668545 666825 665981
47951 665981 665299 664395 663855 664196 664740 664354 663170 662729 664293 667573 671322 674654 677491 680198 683248 687064
47935 687064 691765 697012 702230 707021 711384 715700 720605 726604 733578 740698 747044 752299 756793 760975
47921 760975 765038 768960 772599 775711 778034 779504 780236 780228 779278 777348 774843 772227 769449 766069 762036
47906 762036 758020 754712 751990 749069 745383 741068 736597 732334 728511 725359 722973 721169 719645 718150
47892 718150 716396 714107 711482 709410 708728 709206 709732 709666 709568 710312 711911 713707 715407 717289 719494 721778
47876 721778 724099 726844 730259 734171 738548 743710 749462 754581 757937 759923 762091 765438 769698 774216
47862 774216 778675 782739 785778 787488 788302 788752 788760 787964 786415 784455 782173 779500 776690 774180 771986 769651
47846 769651 766841 763617 760134 756413 752506 748514 744380 739949 735381 731227 727913 725401 723520 722420
47832 722420 722411 723457 725094 726858 728629 730604 733129 736540 740893 745739 750364 754534 758904 764462 771552
47817 771552 779695 788355 797609 807954 819817 833538 849531 868080 889053 912253 937949 966583
47805 966583 997876 1030701 1063983 1097297 1130310 1162028 1190938 1215661 1235223 1248977 1256724 1258745
47793 1258745 1255379 1246645 1232629 1214089 1192239 1167930 1141483 1113456 1085180 1058259 1033685 1011630
47781 1011630 992011 975026 961087 950347 942444 936846 933339 931972 932451 933929 935663 937700 940530
47768 940530 944119 947654 950337 952053 953049 953232 952112 949411 945381 940461 934897 928874 922826 917232 912078
47753 912078 906865 901406 896342 892511 889823 887179 883556 878850 873534 867875 861844 855525 849145 842719
47739 842719 836052 829203 822665 816946 812103 807909 804336 801624 799837 798626 797651 797108 797555 799254 802047
47724 802047 805890 811023 817264 823610 829165 834288 840152 847184 854546 861260 867126 872250 876393 879337
47710 879337 881485 883476 885375 886668 886891 885878 883555 879962 875360 869987 863822 856893 849652 842615
47696 842615 835747 828626 821206 814043 807738 802474 798085 794281 790785 787582 785168 784351 785818 789907
47682 789907 796589 805320 815100 825143 835463 846386 857496 867597 875949 883164 890526 898658 907158
47669 907158 915361 923037 930235 936794 942311 946623 950063 953106 955920 958386 960380 961738 962058 961012
47655 961012 958897 956417 953750 950272 945433 939510 933202 926923 920873 915391 910675 906421 902291 898566
47641 898566 895864 894402 894035 894863 897201 901002 905923 912033 919968 930360 943550 959894 979807 1003418
47627 1003418 1030593 1061407 1096134 1134612 1176013 1219446 1264553 1311383 1359891 1409511 1458906
47616 1458906 1506165 1549479 1587599 1619434 1643591 1658883 1665037 1662134 1649525 1626275 1592820 1551275
47604 1551275 1503768 1451312 1394748 1335826 1276590 1218281 1161649 1107854 1058128 1012711 970947
47593 970947 932433 897474 866365 838866 814543 793186 774703 758977 745887 735185 726243 718207
47581 718207 710522 703126 696072 689301 682959 677631 673880 671517 669614 667424 665183 663772 663653 664442 665642
47566 665642 667419 670195 673715 677027 679487 681270 682779 683977 684605 684764 684988 685869 687730 690382 692999
47551 692999 694512 694483 693465 692356 691553 690907 690186 689248 687875 685818 683078 680006 677109 674762 672926 671097
47535 671097 668724 665827 662968 660536 658326 656026 653801 652053 650824 649717 648309 646393 643915 640995
47521 640995 637943 635083 632608 630700 629538 628942 628199 626558 623840 620418 616824 613600 611200 609581 608038
47506 608038 605907 603394 601318 600071 599304 598640 598179 598102 598198 598039 597358 596002 593818 590929 587960 585687
47490 585687 584419 583890 583577 582948 581530 579155 576254 573699 572256 572243 573628 576067 578766 580734 581607 582101
47474 582101 583304 585581 588506 591710 595194 598703 601484 603156 604411 606308 609088 612219 615415 618928
47460 618928 622858 626750 630112 632845 635043 636818 638514 640665 643397 646225 648710 651023 653643 656846
47446 656846 660833 666061 673008 681718 691925 703550 716824 732013 749250 768524 789553 811752
47434 811752 834642 858219 882701 907858 932791 956450 978195 997882 1015474 1030629 1042646
47423 1042646 1050867 1055177 1055993 1053684 1048123 1038955 1026340 1011357 995621 980398 966001 952066 938403
47410 938403 925414 913576 902874 893084 884330 876830 870203 863641 856817 850046 843385 836211 828037
47397 828037 819220 810456 801914 793265 784231 774737 764802 754718 745158 736780 729779 723998 719197 715073
47383 715073 711396 708353 706371 705346 704514 703459 702759 703185 704711 706905 709830 713783 718405 722839 726779
47368 726779 730696 735036 739709 744398 748773 752415 754965 756444 757052 756763 755513 753596 751294 748220 743706
47353 743706 737808 731307 724647 717462 709259 699960 689722 678909 668383 659141 651306 644002 636502
47340 636502 628968 621794 614883 608011 601426 595572 590554 586273 582756 579905 577279 574617 572322 570952
47326 570952 570410 570061 569509 568829 568187 567683 567473 567604 567776 567683 567571 568064 569333 570834 571957 572580 572809 572573
47308 572573 571836 571050 571003 572104 573985 575857 577149 577741 577747 577337 576703 576005 575220 574249 573240 572589 572398 572144
47290 572144 571256 569890 568800 568429 568600 569070 569885 570937 571678 571768 571727 572487 574385 577063 580235 584012 588348
47273 588348 592719 596732 600719 605303 610547 615959 621300 626907 633026 639217 644727 649242 652935 655954
47259 655954 658305 660170 661885 663485 664668 665414 666216 667456 668822 669688 669899 669860 670057 670737 671866 673032
47243 673032 673575 673255 672773 673232 675113 678109 681915 686724 692783 699902 707656 715897 724801 734400 743996
47228 743996 751948 756263 755874 751525 745270 739028 733708 729483 726357 724339 723419 723640 725045 727482 730644
47213 730644 734346 738560 743165 747934 752804 757817 762757 767157 770793 773801 776151 777386 777131 775599
47199 775599 773387 770970 768582 766241 763601 760020 755161 749441 743636 738214 733315 729160 726012 723710
47185 723710 721655 719478 717593 716907 717959 720357 723055 725260 727126 729548 733331 738629 745166 752718
47171 752718 761229 770622 780695 791247 802185 813495 825119 836796 848063 858571 868436 878094
47159 878094 887734 896983 905262 912323 918350 923620 928195 931871 934316 935216 934367 931727 927493 922170 916368
47144 916368 910387 904058 897088 889414 881123 872343 863517 855534 849060 843830 838996 834205 829822 826247
47130 826247 823574 822024 821972 823222 824802 825914 826683 827605 828704 829753 830924 832624 834838 837190 839495
47115 839495 841711 843398 843797 842609 840311 837541 834472 830935 826833 822256 817281 811834 805764 799052
47101 799052 792035 785364 779549 774461 769349 763446 756626 749474 742695 736405 730119 723517 716964 710965
47087 710965 705348 699533 693602 688394 684252 680323 675662 670641 666651 664589 664141 664369 664482 664121 663496
47072 663496 663274 663974 665431 667195 669278 671957 674880 677121 678349 679340 680920 682795 683852 683390 681676
47057 681676 679511 677652 676554 676243 676310 676269 676070 676143 676826 677848 678524 678545 678481 679364 681679 684893 688024 690589
47039 690589 692862 695384 698460 702079 706087 710376 715037 720276 726003 731628 736548 740848 745179 749922
47025 749922 754821 759498 763901 768054 771787 775069 778334 782047 786113 790153 794213 798683 803522 808152
47011 808152 812310 816466 821006 825390 828695 830774 832246 833406 833771 832980 831510 829997 828225 825421 821535
46996 821535 817661 814947 813459 812329 810748 808575 806142 803844 801985 800731 799952 799160 797896 796404 795781
46981 795781 797085 800271 804263 808181 812149 816721 822015 827842 834267 841382 848681 855451 861785 868505
46967 868505 875946 883494 890588 897412 904186 910474 915829 920606 925459 930378 934917 939092 943299 947516
46953 947516 951335 954774 958374 962358 966276 969627 972242 973917 974279 973382 972055 971298 971520 972519 973897
46938 973897 975306 976630 978154 980369 983414 986953 990756 995051 999990 1005067 1009512 1013217 1016903 1021327
46924 1021327 1026513 1031800 1036475 1040308 1043580 1046664 1049626 1052288 1054622 1056908 1059398 1062035 1064630 1067215
46910 1067215 1069968 1072779 1074991 1075690 1074323 1071140 1067020 1062734 1058331 1053355 1047666 1041842 1036663 1032422
46896 1032422 1028920 1026009 1023875 1022810 1022966 1024378 1027054 1030948 1035953 1042065 1049473 1058354 1068491 1079200
46882 1079200 1089718 1099769 1109720 1120140 1131116 1142039 1152156 1161329 1170110 1178937 1187385 1194476
46870 1194476 1199786 1203973 1208072 1212457 1216712 1220359 1223355 1226000 1228741 1232108 1236396 1241260 1245989 1250402
46856 1250402 1255107 1260644 1266746 1272865 1279100 1286043 1293822 1301856 1309563 1316866 1323879 1330556 1336875 1343001
46842 1343001 1348992 1354521 1359102 1362432 1364495 1365543 1366115 1366710 1367151 1366524 1364137 1360413 1356487 1352944 1349444
46827 1349444 1345641 1342063 1339677 1338818 1339022 1339910 1341782 1345104 1349718 1354999 1360649 1366959 1374251 1382487 1391571
46812 1391571 1401634 1412636 1423942 1434777 1445111 1455732 1467229 1479137 1490217 1499440 1506555 1511806
46800 1511806 1515414 1517490 1518336 1518469 1518211 1517425 1515879 1513697 1511126 1507956 1503699 1498463 1493206 1488802 1485243
46785 1485243 1482031 1478993 1476225 1473553 1470618 1467482 1464702 1462743 1461613 1460953 1460132 1458477 1455956 1453626
46771 1453626 1452808 1453721 1455418 1457136 1459080 1461631 1464431 1466764 1468468 1469945 1471519 1473308 1475590 1478796
46757 1478796 1483076 1488251 1494303 1501528 1510087 1519633 1529611 1539857 1550721 1562637 1575691 1589580 1603830
46744 1603830 1617938 1631430 1644090 1656147 1668028 1679708 1690549 1699986 1708198 1715832 1723142 1729748
46732 1729748 1735197 1739421 1742577 1744829 1746399 1747607 1748714 1749939 1751621 1754036 1756928 1759619 1761775 1763805
46718 1763805 1766277 1769237 1772403 1775787 1779742 1784451 1789677 1794942 1799734 1803529 1805928 1806874 1806616 1805398
46704 1805398 1803196 1799764 1794804 1788127 1779678 1769447 1757399 1743574 1728207 1711616 1693923 1675058
46692 1675058 1655125 1634595 1614001 1593522 1572943 1551976 1530629 1509366 1488899 1469697 1451691
46681 1451691 1434596 1418399 1403260 1388988 1375100 1361547 1348968 1337912 1328091 1318739 1309493 1300557
46669 1300557 1292128 1284074 1276167 1268371 1260891 1254135 1248548 1244275 1240976 1238160 1235691 1233816 1232864 1233101
46655 1233101 1234752 1237780 1241669 1245789 1250030 1254739 1259925 1264915 1269006 1272208 1275011 1277616 1279756 1281201
46641 1281201 1282033 1282314 1281851 1280539 1278778 1277224 1276164 1275436 1274978 1275116 1276155 1277938 1280150 1282988 1287210
46626 1287210 1293450 1301630 1311105 1321241 1331774 1342756 1354295 1366387 1378976 1392062 1405526 1418782
46614 1418782 1430860 1441020 1449154 1455377 1459522 1461400 1461371 1460106 1457716 1453601 1447264 1438908 1429061 1418049
46600 1418049 1406079 1393503 1380684 1367807 1354996 1342396 1329988 1317687 1305812 1295140 1286208
46589 1286208 1278831 1272577 1267320 1262934 1258813 1254209 1248978 1243562 1238334 1233373 1228750 1224613 1220963 1217685
46575 1217685 1214725 1211906 1208726 1204763 1200238 1195792 1191724 1187871 1184185 1180936 1178278 1176031 1173978 1172019
46561 1172019 1169998 1167914 1166377 1166287 1167772 1169937 1171950 1173912 1176252 1178751 1180777 1182275 1183886 1186115
46547 1186115 1188849 1191703 1194460 1197153 1200120 1204000 1209286 1215774 1222772 1230006 1237930 1246914 1256513 1265917
46533 1265917 1274959 1284263 1294472 1305744 1318063 1331585 1346384 1362039 1377842 1393434 1409106 1425521
46521 1425521 1443291 1462761 1483893 1506251 1529220 1552403 1575771 1599392 1623107 1646514 1669185
46510 1669185 1690832 1711326 1730681 1748923 1765850 1780975 1793827 1804351 1812904 1819805 1824949 1827974
46498 1827974 1828847 1828204 1826943 1825485 1823594 1820972 1817820 1814544 1811107 1807079 1802340 1797318 1792399 1787480
46484 1787480 1782324 1776969 1771397 1765018 1756956 1746811 1734830 1721434 1706905 1691417 1674967 1657203
46472 1657203 1637731 1616737 1595010 1573247 1551581 1529875 1508067 1486058 1463702 1441246 1419494
46461 1419494 1399150 1380251 1362658 1346935 1334077 1324335 1316908 1311055 1307015 1305380 1305977 1307968 1310954
46448 1310954 1315345 1321550 1329271 1337882 1347131 1357120 1367870 1379251 1391168 1403395 1415270 1425955
46436 1425955 1435099 1442996 1450011 1456056 1460695 1463624 1465010 1465530 1465995 1466625 1466682 1465131 1461770 1457468 1453230
46421 1453230 1449394 1445826 1442437 1439186 1435938 1432817 1430532 1429950 1431297 1434056 1437666 1442126 1447992 1455970
46407 1455970 1466400 1478920 1492732 1507338 1522894 1539720 1557747 1576753 1596830 1618162 1640490
$$ [...]
##END NTUPLES=NMR SPECTRUM
##END=
