
##TITLE=UV1225_M6_1234-1212_50_7231073_4BOEm63b0W
##JCAMPDX= 6.0         $$ Bruker NMR JCAMP-DX V2.0
##DATA TYPE= NMR SPECTRUM
##DATA CLASS= NTUPLES
##ORIGIN= BRUKER
##OWNER= Administrator
$$ 1.72 TOPSPIN		Version 2.1
$$ 2013-01-24 02:37:02.212 -0500  Administrator@X
$$ Compression mode = diff/dup
##.OBSERVE FREQUENCY= 400.02188249412
##.OBSERVE NUCLEUS= ^1H
##.ACQUISITION MODE= SIMULTANEOUS (DQD)
##.ACQUISITION SCHEME= undefined
##.AVERAGES= 64
##.DIGITISER RES= 22
##SPECTROMETER/DATA SYSTEM= spect
##.PULSE SEQUENCE= noesygpps1d.comp
##.SOLVENT NAME= COFFEE_meoh
##.SHIFT REFERENCE= INTERNAL, COFFEE_meoh, 1, 14.96079
##AUDIT TRAIL= $$ (NUMBER, WHEN, WHO, WHERE, PROCESS, VERSION, WHAT)
$$ ##TITLE= Audit trail, TOPSPIN		Version 2.1
$$ ##JCAMPDX= 5.01
$$ ##ORIGIN= Bruker BioSpin GmbH
$$ ##OWNER= Administrator
$$ $$ E:\/data/COFFEE/nmr/UV1225_M6_1234-1212_50_7231073_4BOEm63b0W/32/pdata/1/auditp.txt
$$ ##AUDIT TRAIL=  $$ (NUMBER, WHEN, WHO, WHERE, PROCESS, VERSION, WHAT)
(   1,<2013-01-24 02:36:56.478 -0500>,<Administrator>,<X>,<go>,<TOPSPIN 2.1>,
      <created by zg
	started at 2013-01-24 02:25:26.440 -0500,
	POWCHK enabled, PULCHK disabled,
       configuration hash MD5:
       86 BA 57 50 F2 9D 5C 9B 26 00 A9 28 5F 66 2E 89
       data hash MD5: 64K
       06 55 E9 42 15 83 54 31 81 AF F6 48 29 E5 60 E5>)
(   2,<2013-01-24 02:36:59.509 -0500>,<Administrator>,<X>,<proc1d>,<TOPSPIN 2.1>,
      <Start of raw data processing
       efp LB = 0.3 FT_mod = 6 PKNL = 1 PHC0 = 0 PHC1 = 0 SI = 128K 
       data hash MD5: 128K
       A2 4B A0 8F D7 21 04 6C 4C 24 F2 96 AD D0 F1 34>)
(   3,<2013-01-24 02:37:00.541 -0500>,<Administrator>,<X>,<proc1d>,<TOPSPIN 2.1>,
      <pk PHC0 = -77.65137 PHC1 = 0 
       data hash MD5: 128K
       D5 41 54 36 43 6C D2 83 2B FE 0F 03 4C AE 02 13>)
(   4,<2013-01-24 02:37:01.244 -0500>,<Administrator>,<X>,<proc1d>,<TOPSPIN 2.1>,
      <abs ABSG = 1 
       data hash MD5: 128K
       EF 0E 89 B3 3D 50 67 E2 31 FF 26 B4 80 51 7A D5>)
(   5,<2013-01-24 02:37:01.416 -0500>,<Administrator>,<X>,<proc1d>,<TOPSPIN 2.1>,
      <abs ABSG = 2 
       data hash MD5: 128K
       7D 8F 7C D7 DE 23 5E DE 65 B9 FF D8 63 99 32 DA>)
(   6,<2013-01-24 02:37:01.587 -0500>,<Administrator>,<X>,<proc1d>,<TOPSPIN 2.1>,
      <abs ABSG = 3 
       data hash MD5: 128K
       4C D9 9C 7D EE 3B DD E0 64 D1 D1 2F 23 C7 5D 21>)
(   7,<2013-01-24 02:37:01.728 -0500>,<Administrator>,<X>,<proc1d>,<TOPSPIN 2.1>,
      <abs ABSG = 4 
       data hash MD5: 128K
       E9 1E 95 40 29 DE 57 FF E4 3D C4 66 F8 85 91 A8>)
(   8,<2013-01-24 02:37:01.869 -0500>,<Administrator>,<X>,<proc1d>,<TOPSPIN 2.1>,
      <abs ABSG = 5 
       data hash MD5: 128K
       6F 9D B8 13 50 19 C6 F1 C1 A0 AD 6C BA 94 A5 49>)
$$ ##END=
$$ 
$$ $$ hash MD5
$$ $$ 44 24 86 A6 6A D5 48 41 5C 6E 52 7E F4 35 8F AF
##$RELAX= 
##$RELAX= 
##$RELAX= 
##$RELAX= 
##$RELAX= 
##$RELAX= 
##$RELAX= 
##$RELAX= 
$$ Bruker specific parameters
$$ --------------------------
##$DU= <E:\>
##$EXPNO= 32
$$ [...]
##$TP07= 0
##$TPNAME0= <>
##$TPNAME1= <>
##$TPNAME2= <>
##$TPNAME3= <>
##$TPNAME4= <>
##$TPNAME5= <>
##$TPNAME6= <>
##$TPNAME7= <>
##$TPOAL= (0..7)
0.5 0.5 0.5 0.5 0.5 0.5 0.5 0.5
##$TPOFFS= (0..7)
0 0 0 0 0 0 0 0
##$TUNHIN= 0
##$TUNHOUT= 0
##$TUNXOUT= 0
##$USERA1= <user>
##$USERA2= <user>
##$USERA3= <user>
##$USERA4= <user>
##$USERA5= <user>
##$V9= 5
##$VALIST= <valist>
##$VCLIST= <CCCCCCCCCCCCCCC>
##$VD= 0
##$VDLIST= <DDDDDDDDDDDDDDD>
##$VPLIST= <PPPPPPPPPPPPPPP>
##$VTLIST= <TTTTTTTTTTTTTTT>
##$WBST= 1024
##$WBSW= 4
##$XGAIN= (0..3)
0 0 0 0
##$XL= 0
##$YL= 0
##$YMAX_a= 6223106
##$YMIN_a= -13762523
##$ZGOPTNS= <>
##$ZL1= 120
##$ZL2= 120
##$ZL3= 120
##$ZL4= 120
##$ABSF1= 14.96079
##$ABSF2= -5.597392
##$ABSG= 5
##$ABSL= 3
##$ALPHA= 0
##$AQORDER= 0
##$ASSFAC= 0
##$ASSFACI= 0
##$ASSFACX= 0
##$ASSWID= 0
##$AUNMP= <proc_prof1d_extract.lims>
##$AXLEFT= 0
##$AXNAME= <>
##$AXNUC= <1H>
##$AXRIGHT= 0
##$AXTYPE= 0
##$AXUNIT= <>
##$AZFE= 0.1
##$AZFW= 0.1
##$BCFW= 0
##$BC_mod= 0
##$BYTORDP= 0
##$COROFFS= 0
##$CY= 15
##$DATMOD= 1
##$DC= 0
##$DFILT= <>
##$DTYPP= 0
##$F1P= 0
##$F2P= 0
##$FCOR= 0.5
##$FTSIZE= 131072
##$FT_mod= 6
##$GAMMA= 0
##$GB= 0
##$INTBC= 1
##$INTSCL= 1
##$ISEN= 128
##$LB= 0.3
##$LEV0= 0
##$LPBIN= 0
##$MAXI= 10000
##$MC2= 0
##$MEAN= 0
##$ME_mod= 0
##$MI= 0
##$NCOEF= 0
##$NC_proc= -2
##$NLEV= 6
##$NOISF1= 0
##$NOISF2= 0
##$NSP= 0
##$NTH_PI= 0
##$NZP= 0
##$OFFSET= 14.96079
##$PC= 1
##$PHC0= -77.65137
##$PHC1= 0
##$PH_mod= 1
##$PKNL= yes
##$PPARMOD= 0
##$PPDIAG= 0
##$PPIPTYP= 0
##$PPMPNUM= 2147483647
##$PPRESOL= 1
##$PSCAL= 4
##$PSIGN= 0
##$PYNMP= <proc.py>
##$REVERSE= no
##$SF= 400.020009721043
##$SI= 131072
##$SIGF1= 0
##$SIGF2= 0
##$SINO= 400
##$SIOLD= 131072
##$SPECTYP= <>
##$SREGLST= <1H.CDCl3>
##$SSB= 0
##$STSI= 131072
##$STSR= 0
##$SW_p= 8223.68421052631
##$SYMM= 0
##$S_DEV= 0
##$TDeff= 65536
##$TDoff= 0
##$TI= <>
##$TILT= no
##$TM1= 0
##$TM2= 0
##$TOPLEV= 0
##$USERP1= <user>
##$USERP2= <user>
##$USERP3= <user>
##$USERP4= <user>
##$USERP5= <user>
##$WDW= 1
##$XDIM= 131072
##$YMAX_p= 348718945
##$YMIN_p= -12137
##$CURPLOT= <Network HP LaserJet P1505>
##$CURPRIN= <$Network HP LaserJet P1505>
##$DFORMAT= <normdp>
##$LAYOUT= <+/1D_H.xwp>
##$LFORMAT= <normlp>
##$PFORMAT= <normpl>
##$SURQMSG= 1
$$ End of Bruker specific parameters
$$ ---------------------------------
##NTUPLES= NMR SPECTRUM
##VAR_NAME=  FREQUENCY,     SPECTRUM/REAL,   SPECTRUM/IMAG
##SYMBOL=    X,             R,               I
##VAR_TYPE=  INDEPENDENT,   DEPENDENT,       DEPENDENT
##VAR_FORM=  AFFN,          ASDF,            ASDF
##VAR_DIM=   131072,        131072,          131072
##UNITS=     HZ,            ARBITRARY UNITS, ARBITRARY UNITS
##FACTOR=    0.0627417313425164, 1,          1
##FIRST=     8223.62146879497, 2131,         -63401
##LAST=      0,             3361,            -63767
##MIN=       0,             -12137,          0
##MAX=       8223.62146879497, 348718945,    0
$$ Real data points
##PAGE= N=1
##DATA TABLE= (X++(R..R)), XYDATA
$$ [...]
67691 233796 235156 236515 238558 241267 243618 244853 245283 245519 245555 245090 244230 243391 242798 242524 242763 243684 245057
67674 245057 246284 246791 246406 245558 245048 245333 246013 246375 246394 246710 247626 248748 249734 250715 251646 252009 251658 251342
67656 251342 251739 252458 252717 252618 252917 253710 254225 253911 253073 252303 251928 252120 252946 253991 254434 253903 253040 252908 253905
67637 253905 255401 256416 256644 256837 258047 260379 262712 263917 264140 264489 265622 267190 268630 269895 271126
67622 271126 272074 272315 271952 271742 272427 273994 275641 276559 276783 277127 278208 279716 280858 281257 281151 280907 280739
67605 280739 280773 280935 280796 280032 279067 278773 279420 280359 280866 280816 280319 279254 277603 275889 274713 273950 272884 271215
67587 271215 269547 268723 268866 269322 269471 269384 269565 270170 270752 270832 270518 270386 270885 271996 273290 274172 274289 273995
67569 273995 274140 275005 275681 275053 273288 271721 271234 271387 271383 271204 271299 271600 271489 270671 269627 269152 269625 270705
67551 270705 271669 272115 272360 273024 274247 275606 276755 277725 278537 278961 278969 278998 279393 279907 280086 279934 279787 279766 279734
67532 279734 279670 279712 279837 279843 279648 279442 279565 280284 281496 282484 282270 280572 278265 276645 276282 276782 277448 277856 277991
67513 277991 278126 278508 278950 278904 278194 277397 277216 277682 278326 278883 279377 279746 279884 279994 280382 280968 281464 281971 282866
67494 282866 284109 285158 285628 285626 285443 285404 285990 287515 289562 291291 292401 293212 293702 293204 291426 289157 287473
67477 287473 286706 286587 286937 287708 288705 289817 291198 292801 294083 294754 295457 296963 298864 299800 299053 297309
67461 297309 295781 295147 295501 296709 298396 299889 300605 300456 299786 299101 298883 299357 300253 300964 301177 301211 301603 302462
67443 302462 303323 303640 303358 303011 303186 303821 304197 303829 303214 303395 304812 306895 308761 309963 310521 310655 310660 310765
67425 310765 310860 310583 309791 308719 307565 306207 304536 302835 301569 301004 301204 302162 303611 304914 305446 305093
67409 305093 304207 303255 302669 302794 303667 304958 306417 308164 310187 311785 312021 310743 308772 307045 305970 305617
67393 305617 306027 307051 308215 309031 309393 309585 310010 310936 312224 313285 313567 313199 312898 313166 313816 314307 314208 313295
67375 313295 311625 309776 308596 308415 308716 308904 309093 309788 311009 312160 312691 312605 312380 312583 313443 314535 315063
67358 315063 314690 313902 313339 313064 312899 313156 314306 315959 316908 316480 315396 314933 315538 316616 317475 318118 319023
67341 319023 320393 321800 322627 322770 322695 322759 322779 322512 322280 322701 323926 325545 327143 328589 329844 330947 332145
67324 332145 333544 334620 334690 334008 333737 334508 335540 335589 334304 332185 329641 326762 323839 321500 320218 320049
67308 320049 320845 322359 324093 325396 325892 325767 325652 326267 328006 330600 333243 335231 336464 337218 337621 337621 337382
67291 337382 337386 338011 339132 340154 340413 339610 337990 336133 334535 333399 332684 332200 331661 330963 330384 330258 330406
67274 330406 330267 329691 329200 329283 329844 330594 331504 332513 333228 333431 333596 334365 335726 337186 338475 339545 340106
67257 340106 339824 338929 338036 337375 336797 336465 336811 337697 338277 337972 337082 336226 335680 335494 335687 335978 335813 335080 334424
67238 334424 334395 334619 334329 333552 333240 334160 336048 337967 339252 339909 340258 340459 340504 340490 340555 340518 339973 338999 338369
67219 338369 338608 339156 339039 338221 337566 337497 337436 336757 335595 334506 333910 334172 335569 337725 339609 340550 340858 341116
67201 341116 341389 341517 341584 341562 341056 340058 339372 339528 339780 339182 338231 338318 339616 340744 340747 340291 340407 340976 341198 340879
67181 340879 340517 340438 340562 340812 341196 341544 341611 341389 340993 340334 339285 338124 337453 337577 338272 339207 340375 341910
67163 341910 343620 344884 345112 344303 343090 342124 341413 340434 338992 337796 337916 339640 342041 343771 344216 343811
67147 343811 343316 343041 342846 342665 342747 343370 344554 346083 347590 348615 348915 348881 349302 350411 351442 351486 350581 349541
67129 349541 348906 348619 348687 349532 351388 353752 355747 356872 357265 357465 358031 359133 360340 361023 361044 360818 360646
67112 360646 360439 360288 360829 362540 364933 366904 367796 367809 367517 367428 367889 368909 369914 370094 369215 367922 367166
67095 367166 367491 368850 370767 372539 373555 373701 373411 373216 373323 373631 373945 374084 373961 373716 373661 373942 374447 375134
67077 375134 376259 378020 380107 381875 382932 383368 383519 383734 384300 385249 386208 386727 386880 387236 388133 389245 390081
67060 390081 390566 390847 390826 390352 389796 389963 391302 393469 395674 397208 397673 397135 396265 396020 396915 398702 400783
67043 400783 402679 404101 404980 405718 407015 409077 411212 412603 413274 413913 414953 416329 417993 420060 422301
67028 422301 424051 424959 425519 426554 428378 430666 432968 435028 436718 437958 438833 439722 441164 443462 446325
67013 446325 448984 450897 452272 453742 455591 457538 459293 460988 463005 465658 469124 473342 477771 481601
66999 481601 484506 487023 489873 493050 495881 497920 499522 501532 504557 508503 512623 516081 518651 520869
66985 520869 523429 526501 529787 533068 536459 540146 544102 548140 552095 555954 559866 563989 568281 572524
66971 572524 576710 581265 586635 592645 598523 603642 608149 612766 618045 623836 629471 634488 639156 644224
66957 644224 650151 656702 663351 669845 676278 682828 689670 696979 704758 712764 720823 729094 737697 746280
66943 746280 754402 762307 770814 780298 790217 799914 809495 819549 830262 841238 852160 863258 875037
66930 875037 887717 901065 914654 928234 941906 956022 970951 986883 1003709 1020987 1038167
66919 1038167 1055025 1071836 1088913 1106087 1122975 1139746 1157179 1175807 1195400 1215530 1236276
66908 1236276 1257954 1280378 1302916 1325334 1348228 1372476 1398435 1425695 1453482 1481286 1509252
66897 1509252 1537980 1567830 1598499 1629363 1660073 1690656 1721227 1751957 1783234 1815522 1848988
66886 1848988 1883493 1918809 1954528 1989832 2023963 2057138 2090607 2125472 2161667 2198252 2234409
66875 2234409 2269859 2304583 2338626 2372124 2405140 2437354 2468117 2496935 2523850 2549391 2574117
66864 2574117 2598107 2620803 2641562 2660464 2678331 2695672 2711768 2725123 2734846 2741348 2745726 2748740
66852 2748740 2750365 2750045 2747235 2741795 2733894 2723567 2710525 2694661 2676580 2657333 2637543 2616998
66840 2616998 2595068 2571278 2545531 2518099 2489443 2459799 2428931 2396581 2363124 2329327 2295380
66829 2295380 2260684 2224890 2188682 2153032 2117982 2082706 2046756 2010709 1975469 1941205 1907210
66818 1907210 1872675 1837519 1802443 1768209 1734920 1702182 1669872 1638350 1607728 1577399 1546743
66807 1546743 1515981 1485775 1456104 1426249 1396049 1366538 1338952 1313370 1288700 1263805 1238410
66796 1238410 1213109 1188822 1166172 1145015 1124451 1103418 1081406 1058688 1035985 1014024 993272
66785 993272 973850 955544 937926 920576 903340 886409 870074 854295 838608 822612 806488
66774 806488 790878 776261 762603 749609 737072 724955 713305 702142 691289 680326 668929
66763 668929 657291 645946 635159 624747 614598 604954 595894 586892 577287 567095 557006 547621
66751 547621 539039 531125 523819 517077 510783 504800 498929 492815 486138 479039 472090 465606 459195 452279
66737 452279 444996 438305 433042 429035 425307 421037 416171 411156 406335 401783 397494 393404 389221 384520
66723 384520 379179 373605 368380 363745 359485 355204 350605 345617 340449 335482 330998 326996 323323 319879
66709 319879 316564 313158 309439 305459 301541 298012 294998 292478 290325 288268 285960 283275 280459 277896
66695 277896 275685 273529 271115 268553 266323 264697 263284 261343 258559 255346 252384 250010 248141 246558
66681 246558 245073 243543 241951 240362 238646 236381 233286 229681 226266 223449 221161 219253 217710 216398
66667 216398 214924 213023 210897 209018 207684 206846 206161 205145 203529 201626 200124 199241 198319 196590 194176
66652 194176 191912 190267 188911 187446 186002 184809 183560 181760 179600 177938 177298 177169 176522 174827 172450
66637 172450 170261 168980 168658 168554 167678 165756 163620 162372 162190 162221 161637 160444 159141 157932 156596 154954
66621 154954 153199 151786 151157 151457 152296 152830 152384 151039 149491 148308 147500 146830 146293 146123 146419 146920 147225
66604 147225 147151 146798 146309 145668 144811 143844 142954 142096 141024 139682 138400 137544 137133 136948 136762 136269 135022 132916
66586 132916 130612 129078 128604 128574 128312 127778 127356 127275 127466 127732 127820 127482 126705 125724 124674 123427 122005 120973
66568 120973 120988 121989 123127 123590 123245 122419 121315 119938 118407 117022 115964 115117 114369 113900 113966 114442 114861
66551 114861 114984 115022 115115 114908 114064 112993 112550 112940 113397 113174 112388 111635 111131 110702 110323 110151 110082 109758 109107
66532 109107 108498 108266 108335 108436 108416 108273 108106 108101 108326 108444 107922 106652 105111 103725 102435 101095 100006 99606
66514 99606 99820 100121 100224 100282 100400 100363 100043 99706 99694 99964 100126 99802 98861 97613 96891 97577 99604 101662 102364
66495 102364 101653 100617 99988 99387 98250 96853 95956 95814 96083 96491 97001 97291 96754 95288 93715 93022 93372
66478 93372 94208 95099 96046 96971 97411 97045 96273 95882 96200 96816 97167 97159 97089 97231 97660 98276 98800 98878 98450 97942
66458 97942 97800 97940 97957 97809 97842 98111 98172 97788 97325 97133 96908 96160 95006 93974 93225 92512 91866 91702 92136
66439 92136 92696 92913 92841 92845 93112 93532 93804 93628 93023 92471 92441 92828 93292 94055 95692 97908 99221 98381 95772
66420 95772 92964 91163 90477 90333 90056 89205 87872 86678 86179 86338 86818 87549 88596 89615 89980 89449 88352
66403 88352 87114 85948 85004 84439 84315 84691 85768 87592 89608 90902 91021 90289 89316 88506 88023 87846 87770
66386 87770 87657 87723 88247 88990 89384 89352 89484 90168 91037 91563 91809 92207 92871 93528 93911 93921 93567 93036 92672 92600
66366 92600 92605 92604 92948 93814 94558 94282 92996 91687 91120 91142 91335 91816 92888 94175 94704 93946 92448 91286 90979
66347 90979 91105 90925 90258 89612 89466 89604 89388 88641 87974 88089 88957 89901 90381 90362 89963 89108 87784 86400 85577
66328 85577 85568 86118 86847 87560 88216 88891 89836 91225 92667 93264 92435 90581 88733 87695 87705 88594 89829 90575
66310 90575 90272 89283 88557 88584 88989 89187 88958 88264 87054 85598 84613 84590 85209 85762 85992 86134 86356 86589 86886
66291 86886 87521 88656 90141 91678 92947 93601 93409 92489 91224 89961 88894 88180 87922 88109 88751 89946
66275 89946 91582 93124 94089 94666 95415 96314 96589 95706 94152 92981 92820 93572 94875 96482 98249 100009
66259 100009 101534 102572 102978 102807 102210 101286 100213 99449 99430 99968 100297 99949 99284 98932 98992 99189 99550 100371
66241 100371 101476 102001 101197 99306 97486 96883 97715 99092 99777 99306 98411 98215 99025 100102 100525 100041 99034
66224 99034 97948 96928 95898 94838 93988 93758 94309 95246 95891 95916 95577 95406 95810 96896 98306 99213 98914
66207 98914 97656 96547 96371 96800 97030 96864 96676 96603 96388 96015 95831 95935 95981 95914 96389 97990 100317 102304
66189 102304 103312 103550 103557 103692 104072 104581 104857 104581 103927 103494 103706 104453 105369 106193 106767 106960 106792 106489 106253
66170 106253 106124 106141 106437 107022 107683 108326 109198 110487 111796 112400 112057 111350 111199 112117 113911 115841 117104
66153 117104 117366 116896 116093 115015 113594 112146 111211 110892 110798 110786 111249 112327 113279 113155 111972 110751 110410
66136 110410 111003 111998 112895 113420 113477 113124 112501 111717 110897 110296 110106 110155 110073 109840 109878 110534 111746 113313 115195
66117 115195 117276 119103 120149 120291 119875 119462 119618 120644 122196 123392 123674 123433 123424 123741 123829 123509 123381 123989
66099 123989 125052 125860 126148 126209 126313 126378 126246 125980 125882 126259 127134 128080 128457 127999 127106 126436 126247 126308 126346 126388
66079 126388 126644 127220 128011 128774 129320 129707 130223 131113 132302 133439 134152 134276 133897 133259 132495 131402 129686
66062 129686 127526 125684 124844 124984 125604 126377 127235 127998 128431 128697 129303 130417 131576 132299 132661 133023 133446
66045 133446 133704 133757 133913 134566 135934 137936 140079 141581 141961 141617 141655 142983 145568 148558 151086 152967
66029 152967 154671 156602 158534 159920 160688 161372 162316 163090 163093 162498 162125 162382 162786 162693 162156 161827 162206 163205
66011 163205 164311 164972 164943 164536 164554 165747 168184 171197 174039 176583 179272 182472 186068 189844 194041 199131
65995 199131 204962 210539 214984 218491 221978 225888 229688 232556 234132 234525 233962 232731 231210 229681 228193
65980 228193 226747 225432 224220 222799 220838 218353 215588 212638 209430 206046 202800 199967 197587 195634
65966 195634 194158 193193 192544 191812 190696 189349 188448 188722 190263 192375 194256 195750 197264 199065 200903
65951 200903 202327 203122 203405 203565 204189 205803 208442 211661 215075 218745 222863 227209 231178 234281 236433
65936 236433 237840 238835 239798 240946 242138 243035 243473 243574 243581 243842 244864 247033 250144 253517 256747 260062
65920 260062 263751 267577 271068 274139 277052 279949 282836 285954 289658 293865 298016 301666 304714 307001
65906 307001 308202 308348 308034 307764 307446 306864 306273 306057 306091 305957 305600 305177 304352 302325 298705 293854 288286
65889 288286 282202 275799 269541 263802 258529 253470 248485 243441 238194 232913 228126 224159 220776 217637
65875 217637 214740 212125 209522 206808 204515 203340 203219 203387 203292 202964 202528 201884 200986 199981 198911 197667
65859 197667 196349 195338 194854 194746 194767 194739 194426 193752 193288 193943 195827 197889 199158 199891 201012 202743 204493
65842 204493 205972 207608 209723 211927 213672 214938 215908 216265 215394 213440 211723 211676 213347 215275 216077 216034
65826 216034 216842 219894 225187 231852 239171 246644 253590 259375 263997 267902 271200 273567 274949 275842 276646
65811 276646 277113 276666 274990 272113 268278 264001 259939 256388 253076 249703 246443 243602 241060 238488 235967
65796 235967 233920 232433 231106 229674 228358 227419 226680 225755 224610 223745 223917 225719 229159 233544 237987
65781 237987 242253 246922 252559 258958 265457 271795 278272 285161 292342 299527 306388 312320 316467 318314
65767 318314 318004 315847 311804 305851 298686 291514 285035 279016 273057 267433 262964 260275 259502 260587 263543
65752 263543 268409 275133 283577 293624 305383 319264 335574 353819 372618 390632 407502 423615
65740 423615 439071 453274 465508 475403 482625 486462 486120 481382 472834 461467 448079 432912 415828
65727 415828 396972 377232 357781 339135 321006 303234 286467 271602 258884 247908 238312 229980
65715 229980 222661 215883 209395 203443 198464 194669 191879 189574 187151 184391 181709 179714 178510 177671
65701 177671 176831 176031 175443 175168 175377 176281 177705 178985 179613 179768 179966 180360 180745 181174 182160 184131 186923
65684 186923 189968 192881 195741 198884 202559 206783 211469 216635 222470 229209 237015 246126 257053 270367
65670 270367 286107 303509 321665 340544 361066 383874 408149 431956 453740 473154 490502
65659 490502 505940 519520 531486 541947 550344 555820 558240 558546 557996 557355 556892 556839 557531 559118 561271
65644 561271 563277 564465 564562 563462 560666 555277 546771 535447 521778 505614 486557 465018 442288
65631 442288 419508 397056 374984 353555 333183 314296 297354 282512 269146 256277 243698
65620 243698 232177 222355 214067 206978 201101 196143 191139 185559 180334 176910 175512 175075 174615 173857 172719
65605 172719 171155 169630 168891 169008 169233 168980 168428 168003 167865 168030 168413 168619 168343 168139 169036 171060 172918
65588 172918 173702 174167 175604 178057 180590 183038 186396 191389 197505 203897 210703 218994 229651 242680
65574 242680 257523 273725 291220 310071 330052 350573 371042 391161 410683 428856 444319
65563 444319 455818 463094 466922 468101 466489 461257 452055 439515 424491 407305 388179 367955 347681
65550 347681 327640 307594 287993 270106 254694 241294 229203 218472 209390 201665 194871 189287
65538 189287 185511 183418 182232 181515 181454 182181 183397 184642 185395 185025 183268 180795 178668 177122 175431 173046
65522 173046 170208 167280 164213 161043 158310 156407 154959 153382 151800 150849 150702 150817 150623 150093 149575 149311
65506 149311 149230 149131 149031 149264 150030 150914 151259 151120 151403 152664 154196 154832 154441 154087 154807 156810 159850 163738
65488 163738 168179 172502 175951 178230 179649 180898 182673 185205 187977 190055 190887 190720 190203 189775 189495
65473 189495 189179 188459 186884 184182 180474 176174 171808 167960 165113 163233 161653 159654 157177 154793 153005
65458 153005 151865 151259 151225 151737 152324 152277 151349 150139 149594 150110 151228 152229 152894 153541 154467 155657 157034
65441 157034 158613 160268 161652 162633 163615 165055 166785 168223 169208 170239 171786 173692 175388 176435 176731
65426 176731 176445 175922 175445 174934 174069 172815 171543 170438 169130 167292 165393 164477 165179 167191 169608 171572
65410 171572 172703 173243 173798 174713 175731 176439 176845 177181 177319 176855 175832 174933 174823 175679 177407 179889 182756
65393 182756 185331 187167 188473 189692 190798 191306 190949 190051 189223 188797 188668 188655 188923 189803 191098 191855 191246
65376 191246 189609 188156 187652 187787 187972 188148 188562 189206 189921 190752 191807 192952 193978 194889 195784 196738 198088
65359 198088 200499 204324 209158 214486 220496 227738 236081 244611 252527 259710 266417 272867 279116 284890
65345 284890 289441 291997 292426 291242 289024 286148 282885 279244 274786 269163 262837 256672 250821 244709
65331 244709 238204 232038 226777 222107 217646 213806 211168 209425 207652 205494 203516 202390 202088 201849 200694
65316 200694 198159 194798 191807 189863 188481 186724 184250 181384 178496 175759 173284 171042 168787 166479
65302 166479 164598 163607 163266 163028 162946 163586 165094 167022 169171 171964 175643 179564 182622 184133 184134 183186 182089
65285 182089 181431 181118 180514 179295 177906 176994 176656 176477 176099 175452 174651 173975 173808 174308 175197 176070 176817 177525
65267 177525 178145 178544 178746 178757 178233 176766 174602 172777 172295 173372 175543 178294 181342 184488 187461 189971
65251 189971 191777 192698 192646 191711 190185 188485 186979 185720 184271 181927 178354 174012 169802 166312 163586
65236 163586 161623 160690 160902 161726 162379 162737 163415 164820 166455 167447 167509 167052 166461 165712 164678 163465 162242
65219 162242 161005 159684 158317 156952 155557 154239 153417 153546 154615 156160 157780 159514 161556 163718 165330
65204 165330 165824 165347 164721 164675 165181 165623 165588 165284 165108 165008 164497 163329 161927 161049 161025 161404 161444 161003 160822
65185 160822 161746 163635 165301 165721 165128 164649 165017 165997 167028 167922 168691 169081 168735 167737 166628 165844 165333
65168 165333 164804 164213 163935 164498 166035 167922 169175 169416 169323 169841 171133 172669 174237 176203 178658 180896
65152 180896 182166 182576 182879 183667 185189 187663 191280 196002 201786 208845 217188 226075 234546 242541 250911
65137 250911 260166 269764 278836 287096 294789 302224 309728 317617 325754 333415 339979 345522 350328 354129
65123 354129 356367 357052 356881 356492 356013 355283 354053 351868 348193 342812 335982 328153 319758 311206 302695
65108 302695 293969 284552 274361 263920 253906 244733 236542 229268 222585 216076 209641 203593 198267
65095 198267 193724 189910 186809 184280 181974 179672 177573 176075 175316 175064 174923 174566 173945 173387 173345 173897
65079 173897 174643 175221 175714 176299 176701 176409 175417 174382 173914 173964 174127 174305 174771 175628 176567 177248 177710 178189 178691
65060 178691 179032 179287 179866 180988 182309 183307 183850 184157 184324 184252 184030 184038 184497 185114 185316 184689 183167 180962
65042 180962 178571 176707 176003 176574 177824 178752 178619 177463 175880 174185 171952 168602 164361 160314 157476
65027 157476 156007 155335 154745 153801 152493 151194 150294 149802 149475 149347 149800 150969 152434 153725 154878 156223
65011 156223 157858 159631 161485 163495 165619 167664 169507 171206 172981 175160 177932 180977 183590 185448
64997 185448 187056 189063 191275 192764 192985 192418 192036 192374 193276 194338 195445 196922 199191 202330 206047
64982 206047 210109 214495 219012 223029 225868 227290 227378 226217 224073 221595 219272 216769 213367 209079 204828
64967 204828 201449 199021 197243 195884 194656 193164 191350 189647 188428 187634 187076 186627 185900 184343 182097
64952 182097 180236 179549 179495 178978 177804 176613 175631 174366 172568 170623 168843 167102 165531 164849 165491 166836
64936 166836 167819 168068 168028 168265 168976 170000 170906 171264 171154 171216 171836 172523 172534 171915 171419 171503 172000 172695 173544 174142
64916 174142 173713 172130 170480 170028 170830 171848 172313 172518 173284 175080 177741 180713 183468 185950 188636 191993
64900 191993 195834 199553 203072 207148 212478 218774 225101 230993 236894 243481 250942 258990 267274 275500
64886 275500 283293 290298 296530 302381 307994 312732 315563 316101 315059 313428 311409 308432 304105 298733
64872 298733 292850 286639 280096 273490 267347 262136 258179 255675 254507 254078 253657 252894 251785 250206 247807
64857 247807 244440 240390 236074 231652 227016 222030 216732 211435 206641 202725 199702 197424 195879 195025
64843 195025 194399 193300 191517 189586 188148 187286 186619 185772 184528 182796 180779 179042 178158 178305 179368 181207
64827 181207 183628 186244 188703 190889 192621 193384 192872 191779 191449 192554 194585 196889 199706 203701 208754
64812 208754 213860 218253 222123 226088 230381 234874 239557 244553 249690 254501 258703 262370 265425 267297
64798 267297 267389 265774 263055 259642 255526 250812 246036 241768 238183 235211 232816 230863 229024 227231 226036
64783 226036 226105 227412 229227 230832 231869 232148 231672 230907 230550 230821 231412 232264 233956 236993 241122 245732
64767 245732 250601 255882 261609 267694 274148 280799 286921 291802 295795 300304 306394 313695 320883 327017
64753 327017 332184 337082 342285 347902 353721 359527 365265 370875 375999 379931 381845 381109 377511 371400
64739 371400 363596 354970 346082 337250 328818 321026 313638 306086 298245 290895 285176 281616 279762 278643
64725 278643 277443 275850 274025 272345 271159 270724 271331 273317 276848 281646 287081 292604 298138 303912 309858
64710 309858 315363 319865 323584 327105 330130 331256 329501 325632 321256 316874 311680 305170 297927 290472
64696 290472 282367 273225 263969 256171 250428 246112 242516 239486 236991 234857 233070 231759 230687 229271
64682 229271 227338 225471 224406 224388 225289 227067 229906 234039 239479 245742 251954 257620 263220 269613 276794
64667 276794 283691 289276 293381 296300 298121 298762 298238 296537 293587 289653 285469 281663 278303 275243 272524
64652 272524 270145 267810 265333 262995 261176 259983 259635 260734 263484 266914 269629 271339 273112 276140
64638 276140 280795 286830 293860 301462 309306 317462 326281 335865 345895 355882 365193 372902 378197 381107
64624 381107 382323 382141 380031 375443 368606 360272 351045 341288 331370 321735 312847 305159 298884 293759
64610 293759 289376 285781 283264 281504 279542 276793 273509 269965 265949 261507 257497 254653 252648 250859
64596 250859 249560 249362 249824 249749 248912 248429 249187 250859 252854 255388 259021 263774 269373 275969 283995 293534
64580 293534 304308 316079 328623 341462 354067 366289 378244 389832 400642 410238 418207 423979
64568 423979 426933 426790 423747 418252 410772 401748 391623 380829 369726 358450 346864 334884 322967
64555 322967 312030 302700 294806 287777 281330 275598 270845 267310 265142 264149 263744 263502 263692 264956 267505
64540 267505 270873 274384 277528 279940 281314 281456 280237 277601 273809 269490 265158 260847 256572 252867
64526 252867 250293 248521 246586 244119 241667 239735 238198 236940 236316 236484 236879 236907 236665 236475 236211 235787
64510 235787 235873 237228 239522 241601 242926 244005 245538 247924 251665 257220 264110 270936 276791 282113 287700
64495 287700 293505 298967 304018 308996 313805 317840 320673 322285 322708 321995 320638 319551 319489 320654 322777
64480 322777 325274 327388 328594 328909 328493 327074 324251 320387 316595 313593 311023 308240 305345 302984 301366
64465 301366 300094 298988 298591 299654 302317 306010 309955 313573 316461 318273 318788 318001 316050 313109 309574
64450 309574 306285 304239 303757 304073 304077 303491 303125 303976 306318 309688 313436 317220 321258 326246 332747 340447
64434 340447 348337 355982 364338 374883 388118 403456 420570 440167 463173 489702 519427 552728
64422 552728 590941 635479 687147 746372 813588 888983 971967 1061110 1154568 1250437 1346852
64411 1346852 1442017 1534176 1621379 1701297 1771524 1830266 1876641 1910131 1929799 1934334 1923032
64400 1923032 1896663 1857207 1806628 1745969 1675634 1596379 1509834 1418089 1323078 1226606 1130864
64389 1130864 1038566 952319 873767 803327 740643 685279 637003 595533 560192 530035 504349
64378 504349 482793 464916 449838 436774 425642 416668 409380 402520 395153 387315 379317 370934 361850
64365 361850 352548 343992 336479 329414 322281 315246 308640 302436 296560 291294 286956 283426 280375 277772
64351 277772 275777 274301 273070 272135 271927 272740 274387 276412 278423 280094 281085 281159 280291 278534 275779 271831
64335 271831 266783 261238 255988 251457 247629 244613 242998 243270 244926 246681 247823 249040 251554 255600
64321 255600 260116 263837 266356 268099 269696 271557 273808 276346 278899 281092 282452 282515 281142 278730 275908
64306 275908 272932 269566 265588 261203 256752 252237 247385 242115 236716 231577 226968 223081 220013 217584
64292 217584 215350 212983 210591 208543 207117 206406 206420 206979 207642 208110 208808 210649 213988 218080 221898 225302
64276 225302 229025 233703 239347 245689 252450 259079 264753 269065 272435 275482 278179 279988 280722 280858 280954
64261 280954 281084 280994 280652 280428 280667 281110 280873 279215 276360 273285 270566 267783 264279 260182 256230 252796
64245 252796 249546 246006 242017 237652 233208 229320 226591 224943 223758 222810 222583 223439 224997 226743 228768
64230 228768 231355 234168 236535 238396 240343 242731 245371 248218 251678 255875 260083 263407 265796 267996
64216 267996 270623 273623 276495 278622 279429 278715 277079 275713 275449 276029 276484 276136 275075 273744 272335 270705
64200 270705 268699 266360 263833 261225 258588 255985 253590 251823 251309 252492 255198 258791 262906 267869
64186 267869 274133 281459 289029 296432 304004 311931 319324 324652 327017 326626 324116 319913 314305 307635
64172 307635 300100 291724 282852 274355 266940 260447 254297 248474 243518 239542 235905 232164 228799 226531
64158 226531 225210 223885 221922 219646 217828 216904 216826 217416 218615 220395 222570 224822 226987 229303 232183
64143 232183 235659 239209 242262 244722 246853 248759 250207 250845 250436 249006 247003 245168 243912 242918 241659
64128 241659 240156 238754 237239 234954 232058 230028 230295 232686 235782 238647 241593 245310 249842 254696
64114 254696 259522 264419 269764 275950 283096 290806 298295 304924 310553 315326 319281 322275 324181 325034
64100 325034 325162 325308 326414 328935 332365 335674 338271 340383 342455 344403 345611 345486 343841 340793 336477
64085 336477 330987 324538 317601 310773 304416 298452 292629 287013 282072 278185 275163 272414 269531 266604
64071 266604 263953 261688 259636 257639 255904 254983 255333 256849 258883 260786 262361 263706 264823 265593 266040
64056 266040 266317 266444 266383 266456 267386 269663 272967 276425 279337 281608 283665 286195 289823 294712 300353 305924
64040 305924 310883 315212 319202 323174 327291 331331 334579 336243 336217 335317 334590 334382 334221 333583 332607 331957
64024 331957 332078 332795 333684 334637 335854 337397 339086 340803 342574 344128 344652 343342 340145 335822 331330
64009 331330 327294 323875 320866 317952 315075 312493 310309 308164 305727 303375 301910 301575 301789 301986 302277
63994 302277 303076 304490 306442 309060 312461 316284 319880 322997 325851 328554 330927 333135 336040 340441
63980 340441 346040 351683 356759 361911 368063 375063 381836 387864 393922 401133 409736 419165 428969 439150
63966 439150 449693 460393 471256 482700 495160 508726 523258 538589 554543 571071 588643
63955 588643 608383 631582 659076 691036 727254 767668 812886 864301 923518 991608 1069123
63944 1069123 1156813 1255939 1367703 1492589 1630348 1780354 1941713 2113262 2293683 2481458
63934 2481458 2674578 2870333 3065369 3255653 3436390 3602621 3750401 3877214 3981108
63925 3981108 4059856 4111412 4134789 4129877 4096611 4035084 3946569 3833843 3700250 3548869 3382799
63914 3382799 3205812 3022191 2835908 2650095 2467239 2289650 2119638 1959211 1809671
63905 1809671 1671628 1545435 1431353 1329143 1237816 1156203 1083744 1020380 965692 918493
63895 918493 877290 840797 807994 778120 750847 726172 703898 683496 664651 647610 632545
63884 632545 618783 605192 591442 578483 567585 559110 552480 547121 543052 540531 539527 539836 541544
63871 541544 545057 550698 558531 568607 581164 596464 614587 635432 658691 683803 710167 737542
63859 737542 765976 795208 824424 852868 880455 907536 934259 960399 985596 1009394 1031214
63848 1031214 1050631 1067563 1081861 1092925 1100072 1103068 1101813 1095730 1084232 1067884 1048339 1026757
63836 1026757 1002792 975507 944875 911986 878094 843971 810011 776426 743263 710548 678581
63825 678581 648006 619493 593307 569079 546047 523778 502716 483797 467376 452721 438716
63814 438716 424863 411438 398896 387441 377130 368097 360475 354111 348371 342463 336132 330006 324942
63801 324942 321015 317426 313459 309136 304807 300575 296502 292954 290149 287465 283836 279029 274161 270626
63787 270626 268638 267057 264614 261133 257484 254506 252214 250131 248098 246410 245241 244362 243521 242762 242199
63772 242199 241743 241269 240807 240410 240086 240010 240470 241340 241961 241887 241462 241229 241041 240320 239023 237807 237214 237179 237370
63753 237370 237508 237265 236388 235215 234625 235202 236682 238418 240025 241340 242197 242713 243592 245654 248975 252780
63737 252780 256181 258830 260898 262686 264340 265771 266828 267611 268626 270469 273314 276823 280575 284491
63723 284491 288810 293759 299267 304942 310279 315017 319265 323168 326439 328401 328659 327607 326078 324566
63709 324566 322977 321129 319181 317425 315839 314119 312095 309956 308044 306540 305332 304124 302815 301903
63695 301903 302293 304429 307697 311032 314066 317234 320741 324038 326656 329043 331966 335297 337972 339172
63681 339172 339108 338584 338237 338274 338588 338880 338897 338773 338982 339915 341678 344292 347742 351655 355261 357983 359864
63664 359864 361213 362052 362266 362052 361730 361090 359352 355978 351268 346039 340917 336067 331375 326750 322413
63649 322413 319023 317252 316960 317035 316423 315272 314648 315154 316267 317159 317739 318594 320236 322759 326009 329682
63633 329682 333392 337013 340892 345411 350436 355613 361087 367415 374707 382448 390381 399043 409059 420360
63619 420360 432541 445628 459995 475713 492541 510522 530152 551966 576291 603327 633018
63608 633018 664753 697556 730624 763361 794844 823724 848874 869875 886686 899167 907162 910811
63596 910811 910481 906547 899519 890273 879841 868816 857054 843922 828850 811712 792837 772635
63584 772635 751265 728799 705794 683448 662920 644526 627773 612178 597888 585522 575591 568169
63572 568169 562963 559546 557548 556788 557319 559339 562944 567904 573653 579575 585368 591209 597564 604812 613017
63557 613017 622076 632095 643514 656769 671914 688776 707520 728901 753885 783123 816767 854469
63545 854469 895239 937333 978458 1016173 1048160 1072496 1088089 1095001 1094257 1087379 1076123 1062311
63533 1062311 1047449 1032293 1016921 1001266 985513 969945 954483 938341 920131 898597 873563
63522 873563 846156 817878 789527 761073 732380 703687 675573 648830 624283 602261 582308
63511 582308 563878 547284 533348 521951 511623 501009 490239 480330 471655 463677 456052 449201
63499 449201 443577 438838 434135 429081 424187 420304 417704 415761 413531 410608 407356 404415 402225 400974
63485 400974 400671 401094 402001 403589 406379 410347 414478 417644 419765 421614 423578 425211 426086 426489 426901 427144
63469 427144 426525 424734 422247 419731 417252 414255 410318 405859 401904 399094 397039 394838 392154 389529
63455 389529 387655 386628 386055 385646 385549 386219 388161 391693 396724 402746 409203 415979 423498 432395 443092
63440 443092 455654 469934 485829 503476 523322 546063 572406 602573 635769 670082 703168
63429 703168 733249 759506 781623 799290 812492 822179 830183 838269 847471 858585 872992 892364
63417 892364 917385 947065 979437 1012656 1045232 1075711 1102770 1125552 1143448 1155591 1161208 1160721
63405 1160721 1155927 1148616 1139279 1127545 1113519 1098042 1081610 1063622 1042978 1019147 992483 963754
63393 963754 933643 902594 870998 839504 809197 781214 755982 732887 710920 689725 669915
63382 669915 652398 637594 625410 615791 608907 604685 602440 601365 601326 602848 606182 610799 616133 622568
63368 622568 631106 642049 654525 667617 681615 697722 716684 738256 762052 788422 818063 850990
63356 850990 886281 922781 959679 996235 1031299 1063387 1091136 1113570 1130076 1140499 1145249 1145119
63344 1145119 1140888 1133182 1122681 1110258 1096790 1082745 1067794 1050789 1030463 1006552 980156 952695
63332 952695 924606 895487 865400 835373 806448 778891 752784 728882 708239 691233 677615
63321 677615 667406 661013 658154 657127 655543 651711 645141 635930 623996 609113 591570 572560 553668
63308 553668 535995 519899 505470 492772 481513 470926 460418 450148 440618 431924 423802 416242
63296 416242 409597 404076 399478 395363 391221 386584 381387 376116 371238 366602 361891 357476 354129 351880
63282 351880 349919 347853 346272 345661 345429 344600 342961 340932 338758 336575 334955 334501 334895 335067 334451 333477
63266 333477 332723 332210 331837 331918 332768 334099 335316 336262 337235 338319 339216 339856 340727 342234 343944 344879 344693
63249 344693 344262 344936 347361 351229 355934 361053 366161 370683 374341 377660 381711 387313 394513 402735 411286
63234 411286 419831 428621 438245 449034 460752 472930 485373 498068 510682 522530 533233 543234
63222 543234 553488 564639 576584 588774 600836 612833 624965 637114 648857 659883 670184
63211 670184 679680 687867 694069 697966 699668 699327 696906 692300 685445 676367 665389 653278 640900 628677
63197 628677 616656 605106 594657 585718 578266 572422 568799 567799 568919 571297 574782 579891 586817
63184 586817 595064 604201 614398 626000 638936 652796 667107 681381 695246 708822 722602 736709
63172 736709 750607 763872 776791 789737 802245 813315 822377 829355 833963 835670 834363 830353 823563
63159 823563 813435 799851 783512 765092 744719 722722 700210 678179 656554 634870 613610
63148 613610 594052 576888 561769 548132 535663 523855 512034 500323 490014 482393 477424 473980
63136 473980 471099 468609 466654 465084 463472 461616 459910 459156 459863 461807 464477 467828 472133 477118 481820
63121 481820 485594 488817 492172 495655 498798 501592 504537 507857 511276 514669 518321 522302 526130 529451
63107 529451 532630 536165 539777 542720 544966 547435 550770 554370 557122 558817 560338 562538 565415 568410
63093 568410 570999 572864 573996 575007 576884 579923 583157 585348 586405 587303 588690 590163 590978 590889 590081
63078 590081 588790 587247 585665 584050 582372 581033 580666 581212 581733 581600 581484 582637 585462 589364 593768
63063 593768 598659 604215 610576 618059 627085 637691 649529 662512 677040 693478 711836 732154
63051 732154 754694 779356 805298 831690 858684 887095 917141 947983 978665 1009036 1039453
63040 1039453 1069889 1099852 1129114 1158035 1186996 1215896 1244445 1272684 1300751 1328185 1353853
63029 1353853 1376587 1395589 1410220 1419846 1424071 1422765 1415650 1402282 1382827 1358506 1330772 1300252
63017 1300252 1267044 1231932 1196645 1162756 1130880 1101202 1074306 1050967 1031431 1015433 1002853
63006 1002853 993960 988985 987844 990441 996833 1006834 1019690 1034588 1051469 1070948 1093259 1117622
62994 1117622 1142872 1168417 1194201 1219984 1245296 1270034 1294494 1318559 1341406 1362335 1381339
62983 1381339 1398307 1412090 1421064 1424524 1422865 1416448 1404938 1387899 1365417 1337861 1305562 1269149
62971 1269149 1229863 1189130 1147916 1106767 1066244 1026957 989261 953222 918925 886643 856740
62960 856740 829528 805158 783495 764107 746443 729908 713750 697229 680260 663736 648733
62949 648733 635218 621903 607625 592691 578556 566268 555478 545015 534135 523012 512229
62938 512229 502208 493202 485546 479536 475011 471273 467573 463710 460076 457056 454456 451575 447839 443282
62924 443282 438432 433919 430278 427868 426655 426146 425825 425592 425526 425344 424571 423272 422083 421306 420485 419218
62908 419218 417880 417038 416561 415917 415146 414893 415461 416446 417343 418072 418786 419644 420876 422696 425005 427534 430375
62891 430375 433953 438331 442907 446985 450269 452633 453821 453793 453160 452806 453002 453056 451920 449237 445867 443309
62875 443309 442416 442675 442849 442103 440224 437119 432810 427979 423800 420826 418451 415722 412327 408582 404897
62860 404897 401649 399241 397843 397220 396989 396845 396362 395071 393100 391384 390752 390986 391172 390767 389948 389103 388453
62843 388453 388091 388018 388137 388472 389279 390662 392241 393452 394009 393857 392922 391388 389963 389350 389476 389693 389699 389798
62825 389798 390267 390947 391558 392035 392468 393080 394349 396739 400078 403480 406093 407762 408878 409830 410796 411858
62809 411858 413086 414544 416339 418680 421764 425608 429994 434687 439761 445623 452468 459759 466539 472399
62795 472399 477870 483705 490166 497210 504977 513681 523310 533849 545558 558679 573182 589290 607934
62782 607934 630055 655661 684211 715729 750754 789226 830240 873026 917345 962707 1007970
62771 1007970 1052091 1094515 1134399 1170200 1200711 1225988 1246444 1261310 1268759 1267544 1257983 1241310
62759 1241310 1218644 1190788 1158671 1123584 1086823 1049088 1010329 970413 929943 890190 852176
62748 852176 816134 781934 749632 719399 691271 665275 641542 620048 600482 582596 566404
62737 566404 551836 538501 526115 514885 505155 496924 490016 484398 479956 476230 472814 469835 467605
62724 467605 466024 464778 463964 463984 464939 466607 468975 472217 476182 480478 485176 490913 498064 506320 515384
62709 515384 525755 538409 553830 571683 591366 612711 636094 661930 690132 720200 751947
62698 751947 786010 823386 864486 908808 955488 1003904 1053699 1104418 1155199 1204744 1251595
62687 1251595 1294506 1332443 1364186 1388256 1403554 1409920 1407726 1397137 1378186 1351439 1318038 1279091
62675 1279091 1235545 1188672 1140065 1090852 1041372 991918 943419 897090 853757 813808 777383
62664 777383 744178 713328 684030 656285 630730 607811 587414 569238 553150 539074 526714
62653 526714 515489 504748 494167 483980 474680 466384 458655 451064 443727 437124 431603 427256 424033
62640 424033 421672 419689 417771 416106 415013 414380 413805 413227 412923 412844 412362 410947 408807 406603 404667 402732
62624 402732 400400 397666 394938 392661 391036 390113 389949 390469 391223 391732 392184 393429 395889 398822 401131 402695
62608 402695 404309 406444 408826 411361 414651 419118 424269 429494 435189 442380 451420 461812 473284 486293
62594 486293 501225 517722 535179 553557 573215 594135 615662 636941 657347 676470 693933
62583 693933 709270 721938 731456 737510 739834 737980 731458 720360 705752 689245 672114 654831
62571 654831 637263 619143 600485 581813 563942 547372 531922 517175 503234 490740 480074
62560 480074 470815 462240 454159 447025 441243 436629 432606 428796 425214 421921 418690 415217 411612 408454
62546 408454 406253 405002 404396 404346 405039 406571 408767 411392 414280 417187 419689 421366 422001 421586 420297 418571
62530 418571 417081 416511 417330 419724 423576 428563 434467 441408 449581 458805 468688 479320 491463 505864
62516 505864 522633 541464 562099 584323 607876 632793 659550 688341 718306 748003 776671
62505 776671 804526 831700 857394 880287 899395 914225 924439 929868 930816 927957 921824 912571 900422
62492 900422 886268 871650 858053 846264 836448 828710 823361 820630 820502 823019 828456 836954 848226
62479 848226 861910 877934 896074 915323 934236 951794 967352 979798 987574 989825 986990 979856
62467 979856 968552 952846 932885 909075 881578 850681 817494 783641 750214 717502 685717
62456 685717 655407 626998 600524 576107 554308 535617 519833 506301 494621 484778 476680 469963
62444 469963 464393 460118 457271 455487 454084 452699 451463 450542 449842 449313 449177 449474 449614 448931 447603 446440
62428 446440 445607 444158 441158 436866 432400 428570 425467 422870 420492 417916 414797 411179 407359 403533
62414 403533 399911 396970 395071 393834 392404 390383 388141 386149 384536 383333 382602 382066 381119 379618 378348
62399 378348 378331 379845 382363 385228 388087 390891 393872 397426 401722 406392 410837 414789 418466 422245 426396
62384 426396 431067 436354 442366 449292 457286 466177 475467 484793 494311 504460 515416 526935 538687
62371 538687 550586 562859 575956 590336 606260 623833 643235 664691 688206 713705 741696
62360 741696 773427 809926 851077 896108 944803 997539 1053994 1112448 1170686 1227110 1280563
62349 1280563 1329480 1371909 1406358 1432176 1449111 1457018 1456142 1447288 1431408 1409197 1381321 1348759
62337 1348759 1312612 1273681 1232561 1190107 1147441 1105481 1064768 1025807 989207 955316 924023
62326 924023 895231 869238 846288 825809 806453 786900 766476 745225 723790 703167 684100
62315 684100 666565 650064 634387 619714 605966 592582 579198 566247 554601 544852 537010 530561
62303 530561 524679 518737 512923 508046 504506 501798 499342 497366 496526 496967 498244 499945 501845 503647 505232
62288 505232 507097 509981 513965 518358 522498 526243 529725 533210 537296 542650 549239 556196 562663 568431
62274 568431 573668 578531 583390 588983 595920 604230 613727 624656 637668 653258 671511 692377 716018
62261 716018 742922 773737 808936 848608 892611 940829 993094 1048966 1107795 1168707 1230030
62250 1230030 1288887 1342114 1387826 1425606 1455174 1475721 1486806 1488981 1482853 1468174 1444685 1413400
62238 1413400 1376194 1334319 1288092 1237887 1184699 1129867 1074963 1021875 972154 926084 882970
62227 882970 842494 805193 771600 741608 714877 691226 670349 651777 635423 621604 610139
62216 610139 599934 589934 580093 570986 562822 555300 548175 541489 535361 529909 525260 521377 518036 515161
62202 515161 512933 511399 510367 509988 510965 513691 517522 521542 525777 530994 537410 544430 551834 560489 571375
62187 571375 584324 598173 611988 625774 640062 655186 671082 687584 704624 722005 739137
62176 739137 755355 770645 785869 802062 819686 838802 859722 883120 909545 939146 971866
62165 971866 1007582 1046053 1086971 1129945 1174035 1217330 1257465 1292638 1321848 1344193 1358572
62154 1358572 1364394 1362126 1352905 1337880 1318120 1294562 1267546 1236741 1202059 1164431 1125235 1085242
62142 1085242 1044692 1004257 965280 928978 895891 866164 839822 816636 796218 778515 763794
62131 763794 751938 742166 733751 726612 720830 715991 711504 707297 703659 700574 697874 696057 696243 699039
62117 699039 703926 710106 717570 726877 738135 750666 763583 776223 787915 797835 805418 810743 814207
62104 814207 815867 815426 813006 809709 806983 805282 803571 800457 795747 790545 785752 780966 775327 769153
62090 769153 764117 761674 761834 763819 767424 773126 780969 790074 799603 809776 821561 835542 851545
62077 851545 869266 888700 909722 931670 953840 976274 999689 1024628 1051049 1078834 1108255
62066 1108255 1139578 1172423 1205919 1239498 1273164 1306834 1339625 1369946 1396291 1417890 1434605
62055 1434605 1446304 1452421 1452335 1446226 1435295 1420797 1402946 1381116 1355062 1325503 1293333 1258783
62043 1258783 1221779 1182906 1143469 1104590 1066638 1029629 993849 959811 927743 897352 868144
62032 868144 839959 813279 789018 767896 749854 734038 719383 705311 691998 680019 669728
62021 669728 660900 652961 645473 638258 631110 623730 616128 608824 602299 596352 590360 584084 577874 572138
62007 572138 567100 563245 561395 561883 563913 566232 568352 570735 573839 577432 580901 583777 585744 586463 585728
61992 585728 583664 580548 576549 571843 566823 561792 556473 550160 542529 534083 525617 517453 509414 501387
61978 501387 493624 486505 480269 474978 470511 466527 462649 458774 455023 451445 448041 445163 443420 442937
61964 442937 443052 443115 443228 443660 443853 442873 440922 439601 440241 442575 445515 448691 452520 457161 462222 467524
61948 467524 473363 479878 486848 494495 503934 516255 531411 548413 566474 585512 605636 626649
61936 626649 648215 670227 692762 715832 739256 762706 785744 807841 828446 847083 863437
61925 863437 877351 888576 896521 900438 900147 896448 890582 883326 874943 865943 857447 850582 845858 843349
61911 843349 843093 845030 848889 854663 863014 874619 889053 904757 920167 934399 946806 956520 962880
61898 962880 965864 965587 961677 953675 941935 927547 911378 893709 874878 855680 836825 818423
61886 818423 800377 783085 767276 753236 740531 728599 717334 706990 697642 688909 680251 671493
61874 671493 663041 655517 649165 643670 638596 633942 630164 627684 626461 626092 626398 627866 631380 637361 645236
61859 645236 653940 663031 673147 685345 700231 717873 738283 761575 787620 815966 846295 878711
61847 878711 913228 949017 984499 1018356 1050236 1080213 1107677 1131157 1149310 1161805 1169020 1171173
61835 1171173 1168156 1160199 1148343 1134223 1119622 1106264 1095634 1088718 1085894 1087151 1092232 1100589 1111428
61822 1111428 1123929 1137219 1150071 1160926 1168384 1171471 1169330 1161077 1146324 1125607 1099908 1070000
61810 1070000 1036707 1001559 966477 932601 899899 868135 837746 809449 783383 759183 736767
61799 736767 716618 699175 684265 671286 659743 649481 640472 632641 625907 620259 615595 611531 607508
61786 607508 603184 598656 594298 590486 587444 585143 583243 581356 579569 578477 578391 578685 578322 577020 575523
61771 575523 574595 574123 573400 572084 570648 569971 570608 572330 574291 575729 576543 577129 577759 578412 579188 580470 582480
61754 582480 584922 587234 589008 590066 590398 590212 589786 589084 587735 585578 582994 580510 578361 576617 575390
61739 575390 574555 573597 572148 570451 568934 567650 566590 566160 566636 567373 567431 567013 567380 569122 571327 572920
61723 572920 574051 575568 577685 579907 581878 583594 584980 585981 586974 588427 590125 591278 591464 590890 589639
61708 589639 587323 583820 579838 576287 573320 570371 566947 563009 558703 554137 549511 545222 541672 539007
61694 539007 537058 535470 533918 532270 530586 528974 527500 526161 524838 523283 521372 519466 518263 518074
61680 518074 518329 518063 516931 515567 514906 515265 516131 516723 516662 516173 515765 515790 516302 517209 518360 519505 520301 520549
61662 520549 520349 519937 519453 518950 518527 518229 517900 517399 516989 517225 518333 519867 521209 522256 523431 525088 527196
61645 527196 529584 532198 534967 537634 539949 541980 543955 545754 546815 546749 545925 545173 544843 544347 542781 539822
61629 539822 535850 531362 526640 521992 517925 514738 512162 509742 507518 505984 505330 504994 504186 502589 500397
61614 500397 497850 495041 492052 488919 485415 481178 476188 470884 465689 460608 455506 450547 446065 442084
61600 442084 438298 434524 430864 427361 423827 420172 416594 413221 409822 406204 402692 399750 397227 394426
61586 394426 391008 387361 383894 380466 376908 373723 371662 370660 369776 368307 366513 364987 363704 362092
61572 362092 359886 357491 355485 354033 352894 351781 350570 349262 347915 346638 345597 344963 344807 345009 345292
61557 345292 345351 345032 344419 343807 343498 343520 343551 343280 342910 343126 344420 346500 348535 349896 350577 350955 351385 352051
61539 352051 353038 354431 356355 358900 361946 365092 367923 370332 372465 374411 376082 377362 378137 378218 377516
61524 377516 376331 375111 373793 371745 368615 364958 361701 359240 357436 356259 355874 356059 356096 355471 354415
61509 354415 353555 353258 353431 353712 353686 353114 352158 351222 350500 349823 349077 348502 348390 348686 349108 349546 350062 350567 350725
61490 350725 350252 349232 348157 347641 347935 348629 348969 348585 347717 346730 345713 344741 344188 344428 345373 346639 348007
61473 348007 349420 350650 351419 351782 352069 352475 352993 353630 354301 354639 354405 354052 354335 355249 355920 355649 354553 353022
61455 353022 351255 349713 349349 350693 353062 355301 357056 358725 360421 361821 362996 364570 366735 368760
61441 368760 369931 370629 371960 374509 377850 381264 384585 388186 392316 396610 400302 402932 404832 406850
61427 406850 409519 412497 414920 416350 417288 418556 420240 421645 422487 423672 426246 429840 432939 434808 436255
61412 436255 438136 439997 440949 441129 441214 440920 439241 436236 433399 431839 431000 429715 427803 426023 424933 424416
61396 424416 424008 423224 421771 419883 418247 417308 416863 416534 416215 415836 415250 414815 415482 417586 419983 421217 421319
61379 421319 421606 422841 424551 426186 427948 430108 432383 434550 437015 440097 443142 445115 445932 446597 447975
61364 447975 449845 451331 451985 452308 453270 455382 458299 461343 464273 467333 470647 474055 477595 481692 486624
61349 486624 492225 498493 506079 515643 526878 538628 549860 560164 569478 577888 585676 593022 599582
61336 599582 604831 608855 612287 615268 617113 617350 616591 615748 614690 612345 608120 602709 597342 592667 588550
61321 588550 584663 580958 577687 575133 573352 572098 571064 570223 569870 570260 571289 572566 573813 575179 577221
61306 577221 580558 585435 591643 598859 606978 616027 625833 635958 645877 655051 662824 668545 671876 672858
61292 672858 671661 668495 663796 658200 652155 645755 639113 632627 626666 621231 616263 612087 609175 607518
61278 607518 606619 606128 606196 607152 609148 612153 616071 620821 626485 633307 641184 649253 656492 662861 669298
61263 669298 676389 683559 690005 695923 702264 709630 718024 727427 737873 748978 760127 771236 782640
61250 782640 793954 803714 810577 814433 815866 814983 811404 805171 797018 787721 777675 767179 756621
61237 756621 746198 735838 725715 716579 709244 703854 699882 696787 694383 692593 691191 690101 689774 690885
61223 690885 693464 696617 699394 701815 704634 708104 711490 714012 715835 717684 719809 721923 724012 726519
61209 726519 729563 732583 735092 737346 739819 742379 744530 746363 748713 752293 757094 762816 769523 777578
61195 777578 787078 797672 809049 821466 835700 852356 871202 891222 911333 930946 949709 966951
61183 966951 981764 993778 1003593 1012259 1020383 1027837 1034182 1039136 1042658 1044770 1045450 1044691 1042620 1039466
61169 1039466 1035367 1030200 1023640 1015375 1005253 993310 979772 964991 949245 932594 915013 896665
61157 896665 877926 859202 840888 823524 807739 793897 781855 771188 761608 753192 746396 741886
61145 741886 740114 740811 742961 745396 747342 748332 747828 745273 740584 734425 727882 721819 716518 711802 707485
61130 707485 703735 701069 700087 701160 704201 708629 713826 719947 728169 739696 754534 771637 790302
61117 790302 810832 833621 858177 883546 909297 935509 962060 988549 1014841 1041075 1067086
61106 1067086 1092280 1116155 1138572 1159479 1178732 1196240 1211907 1225393 1236211 1244010 1248445 1248860
61094 1248860 1244684 1236221 1224526 1210322 1193444 1173601 1151242 1127433 1103198 1079166 1055509 1031950
61082 1031950 1008166 984483 961960 941537 923296 906678 891197 876729 863445 851684 841683
61071 841683 833256 825936 819500 814079 809654 805941 802959 801253 801161 802281 804002 806193 809034 812578 816913
61056 816913 822397 829197 836867 844924 853624 863680 875432 888810 903888 920820 939339 958929
61044 958929 979521 1001543 1025280 1050729 1078070 1107670 1139504 1172993 1207555 1242886 1278687
61033 1278687 1314674 1351102 1388803 1428394 1469705 1512224 1555806 1600716 1647287 1695889 1747132
61022 1747132 1801636 1859392 1919465 1980669 2042804 2107197 2175819 2249971 2330289 2418038 2515666
61011 2515666 2625619 2749072 2886441 3038896 3209078 3400990 3620227 3874382 4172878
61002 4172878 4526851 4949879 5458527 6071772 6811140 7703368 8782822 10089246 11660440
60993 11660440 13521288 15666260 18034286 20491173 22845947 24907759 26550793 27742759
60985 27742759 28527679 28994762 29260723 29453564 29671681 29928636 30131755 30124424 29762841 28968750
60975 28968750 27733154 26096109 24134969 21961469 19708135 17500079 15430185 13552518
60967 13552518 11889859 10443564 9201218 8143340 7248461 6494933 5861139 5326697 4873946
60958 4873946 4487889 4155471 3865936 3611331 3385656 3183804 3001957 2838181 2691354
60949 2691354 2559688 2441124 2334514 2239074 2152787 2072581 1996191 1922782 1851696 1781762 1712244
60938 1712244 1643577 1576712 1512364 1451208 1394019 1341001 1291374 1244068 1198646 1155356 1114692
60927 1114692 1077145 1043098 1012584 985233 960483 937741 916442 896291 877461 860298 844828
60916 844828 830809 818081 806526 795840 785806 776613 768364 760439 752048 743353 735360 728576 722468
60903 722468 716436 710587 705250 700416 696082 692523 689668 686633 682546 677632 672913 668862 664778 659608
60889 659608 653116 646199 640152 635694 632593 630149 627811 625287 622374 619090 615828 612988 610539 608324
60875 608324 606659 606091 606647 607876 609641 612224 615584 619235 623114 627809 633586 639795 645725 651505 657636
60860 657636 664115 670608 677082 683715 690443 697164 704087 711373 718677 725583 732280 739242 746492 753781
60846 753781 761274 769260 777215 783979 789188 793884 799318 805542 811542 816506 820597 824680 829639 835960
60832 835960 843693 852592 862258 872300 882614 893617 906024 920160 935520 951097 965959 979414
60820 979414 990947 1000380 1007943 1013721 1017138 1017469 1014914 1010573 1005095 997812 987700 974917 960871
60807 960871 946726 932341 916865 900093 882851 866157 850329 835103 820348 806420 793784
60796 793784 782518 772260 762526 753024 743746 734818 726280 718072 710279 703178 696810 690639 684026 677019
60782 677019 670242 663910 657471 650540 643705 637859 632950 627998 622331 616216 610140 604004 597372 590239
60768 590239 583154 576656 570831 565368 559859 554092 548272 542931 538445 534507 530269 525153 519462 514049
60754 514049 509465 505565 501923 498342 494890 491643 488613 485831 483386 481467 480419 480480 481303 481971 481815
60739 481815 481009 480107 479244 478226 477116 476088 474810 472775 470385 468952 469226 470528 471741 472595 473393 473945
60723 473945 473595 472223 470520 469161 468147 467058 465619 463915 462202 460538 458524 455554 451500 446967
60709 446967 442655 438683 434791 430880 426965 422885 418605 414683 411787 409732 407569 404776 401835 399461
60695 399461 397744 396377 395290 394611 394254 393963 393730 393820 394394 395363 396605 398068 399557 400650 401070 401118 401560
60678 401560 403014 405504 408641 412063 415554 418879 421841 424509 427143 429764 432034 433696 434946 436261
60664 436261 437981 440136 442450 444459 445943 447354 449467 452386 455370 457952 460819 465018 470493 476032
60650 476032 480613 484311 487847 491720 495818 499517 502081 503278 503632 503820 503886 503382 502129 500313 497774
60635 497774 493853 488248 481642 475204 469667 465112 461330 458139 455442 453172 451148 448994 446475 443952
60621 443952 442249 441926 442791 444105 445039 444985 443862 442250 440932 440189 439785 439599 439727 439854 439182 437492 435838
60604 435838 435547 436702 438142 438910 439247 440125 442218 445392 448822 451484 452903 453651 454887 457154 459822
60589 459822 461882 463108 464090 465294 466565 467671 468850 470447 472279 473814 474926 476072 477704 479887
60575 479887 482561 485803 489722 494465 500427 508060 517299 527638 539003 551981 566797 582669 598740
60562 598740 615133 632265 649480 665211 678329 688474 695218 698004 697079 693510 687927 680139 670366
60549 670366 659982 650598 643134 638297 636972 639261 643846 649372 656170 665707 678660 694510 712855
60536 712855 733946 757634 782653 807366 830597 851435 868776 881631 889662 893166 892781 889425
60524 889425 884095 877334 869056 859261 848767 838899 830504 823499 817311 811503 806048 801373 798253 797337
60510 797337 798520 800935 803811 807252 811917 818076 825440 834090 845168 860239 880108 904598 933442
60497 933442 967070 1006494 1052671 1105927 1165702 1230724 1299517 1370612 1442044 1510857 1573661
60486 1573661 1627773 1671456 1703065 1720602 1722498 1708503 1679529 1636993 1582745 1519366 1450008
60475 1450008 1377791 1305320 1234553 1166801 1102979 1044040 991031 944521 904085 868547 836753
60464 836753 808114 782668 760754 742471 727359 714711 704058 695003 686683 678093 669123 660608
60452 660608 652951 645334 636856 627890 619536 612058 604745 597171 589777 583098 577173 571977 567803 564876
60438 564876 562993 561805 561103 560539 559484 557598 555488 554371 554953 556750 558547 559439 559292 558228 556042
60423 556042 552567 548490 545180 543422 542765 542391 542143 542255 542592 542856 543299 544477 546426 548715 551181 553880
60407 553880 556346 557774 558183 558646 560011 561934 563551 564603 565504 566711 568444 570743 573430 576190 578894
60392 578894 581648 584402 586894 589103 591338 593642 595574 596914 598182 600027 602419 604866 607159 609492
60378 609492 612078 615049 618534 622410 626183 629539 632844 636643 640836 644889 648799 653291 658967 665661
60364 665661 672706 679468 685577 691050 696328 701847 707472 712755 717868 723827 731547 741110 752326 765691
60350 765691 782341 803187 828429 857694 890209 924863 960525 996256 1030761 1061622 1085731
60339 1085731 1100913 1106930 1104713 1095047 1078444 1055911 1029081 999494 968283 936789 906842 879944
60327 879944 856350 835393 816646 800401 786990 776060 766727 758363 751058 745292 741204 738262 735759
60314 735759 733594 732399 732791 734722 737805 742144 748579 758105 771308 788416 809667 835413 865880
60301 865880 900889 939835 981840 1025827 1070258 1112864 1150831 1181388 1202212 1211519 1208402 1193453
60289 1193453 1168669 1136271 1097777 1054602 1009164 964517 922709 884067 848343 815952 787662
60278 787662 763531 742798 724720 709014 695441 683461 672534 662608 653999 646791 640442 634114
60266 634114 627392 620637 614595 609756 606173 603703 602078 600686 598684 595638 592011 588801 586732 585830
60252 585830 585695 585935 586237 586213 585464 583940 582188 580972 580584 580660 580766 580908 581290 581787 582090 582343 583224 585234
60234 585234 588182 591488 594848 598429 602517 607125 611877 616259 620007 623206 625907 627833 628678 628588 628043
60219 628043 627335 626534 625911 625882 626378 626779 626814 627128 628567 631130 634100 637047 640266 644208 648908 654067 659365
60202 659365 664477 668989 672606 675455 678002 680581 683078 685221 687102 689206 691833 694630 696899 698236
60188 698236 698733 698752 698774 699342 700692 702363 703518 703733 703200 702194 700807 699366 698556 698688 699168 699142 698512 697943
60170 697943 698035 698987 700950 704141 708384 712899 716816 719714 721548 722245 721628 719605 716256 711776 706556
60155 706556 701303 696729 692966 689442 685638 681880 679101 677840 677862 678868 681109 684882 689702 694527 698850
60140 698850 703182 708386 714804 722103 729668 737018 744061 750931 757464 762943 766723 769004 770575 771703
60126 771703 771772 770142 766987 763101 759257 755937 753326 751329 749900 749460 750548 752835 755034 756215 756853
60111 756853 758081 760321 763213 766539 770399 774421 777553 779043 779282 779323 779763 780308 780321 779528 778092 776143
60095 776143 773479 769845 765421 760819 756644 753215 750758 749531 749618 750777 752627 754822 756998 758796 760084
60080 760084 761057 762055 763403 765284 767380 768639 767894 764885 760337 754964 748790 741621 733626 725170 716570
60065 716570 708293 700960 694786 689413 684554 680282 676341 671831 666194 660016 654142 648457 642304 635769
60051 635769 629719 624682 620500 616991 614184 611871 609724 607984 607411 608311 610086 611887 613319 614486 615779
60036 615779 617667 620298 623265 626086 628774 631457 633663 634631 634274 633112 631246 628121 623504 618048 612640
60021 612640 607676 603068 598396 592894 585959 578042 570592 564891 561238 559246 558351 557971 557897 558803 561670
60006 561670 566398 571598 576142 580338 585125 590729 596607 602217 607200 611172 613933 615716 616838 617264
59992 617264 616801 615445 613271 610332 606939 603660 600724 597850 594962 592564 591012 589975 589109 588729 589107
59977 589107 589615 589354 588334 587241 586308 585299 584437 584335 584878 585110 584585 584153 584950 587108 589894 592683 595350
59960 595350 597961 600550 603203 606072 609237 612634 616091 619437 622648 625824 628839 631076 631726 630427
59946 630427 627520 623728 619819 616421 613758 611415 608616 604984 600916 597121 593860 590762 587368 583748
59932 583748 580475 577950 575833 573377 570384 567615 566136 566421 568165 570671 573165 575046 576273 577424
59918 577424 579041 580958 582649 584183 586388 589948 594648 599677 604428 608818 613126 617696 622674 627785
59904 627785 632420 636112 638909 641192 643127 644448 644823 644348 643490 642532 641288 639535 637591 636143 635544
59889 635544 635627 636237 637454 639130 640661 641655 642563 644254 647146 651098 655919 661434 667112 672225 676484
59874 676484 680190 683599 686479 688396 689177 688959 687997 686515 684525 681758 678043 673826 670054 667340 665416
59859 665416 663512 661110 658285 655499 653234 651721 650914 650747 651354 652914 655344 658446 662371 667592 674279
59844 674279 681981 690184 699006 709036 720515 732780 744499 754350 761597 766278 768989 770498 771471
59831 771471 772412 773583 774831 775513 774791 772062 767187 760319 751616 741250 729701 717861 706550 695890
59817 695890 685383 674756 664521 655545 648276 642645 638511 635779 634092 632814 631510 630202 629022
59804 629022 627798 626175 624079 621879 620043 618597 616914 614158 610070 605284 600743 596843 593199 589108
59790 589108 584152 578519 572987 568401 564838 561404 557219 552540 548548 546062 544880 544346 543986 543404 542184
59775 542184 540304 538355 536978 536293 536172 536680 537845 539234 540279 540903 541434 541963 542272 542312 542324 542436 542662
59758 542662 543346 545074 547868 550936 553595 556067 558933 562107 564967 567331 569676 572257 574656 576535
59744 576535 578370 580955 584419 588187 591729 594871 597414 599032 599714 599914 600063 600209 600301 600504 600945 601449
59728 601449 601894 602641 604230 606683 609347 611391 612285 612035 611275 610973 611634 612798 613676 614132 614639 615286 615451
59711 615451 614655 613251 611917 610836 609740 608595 607847 608054 609441 611681 613958 615486 616223 616940 618342
59696 618342 620337 622436 624577 627104 630039 632923 635394 637415 638752 638793 637271 634901 632890 631950 632034
59681 632034 632867 634269 635915 637189 637502 636665 634927 632800 630796 629045 627034 623951 619514 614348 609443
59666 609443 605412 602371 600247 598827 597704 596573 595553 594859 594215 593093 591659 591014 592120 594731 597644
59651 597644 599794 600890 601303 601752 602928 604969 607265 609002 609871 609981 609272 607446 604545 601174 598004
59636 598004 595272 592889 590792 589059 587883 587483 587885 588737 589574 590288 591080 591919 592349 592018 591071 589830 588382
59619 588382 586777 585367 584491 583894 582887 581203 579356 577946 576907 575772 574613 574242 575255 577138 578721
59604 578721 579468 579937 580796 581842 582329 581995 581247 580449 579537 578430 577310 576282 575161 573911 573029 573128 574231
59587 574231 575707 576799 577061 576442 575212 573774 572350 570889 569294 567603 565788 563584 560819 557805 555162
59572 555162 553251 551940 550887 549855 548827 548028 547793 548203 548877 549360 549672 550211 551088 551841 551945 551409 550660
59555 550660 550055 549702 549722 550391 551894 554028 556316 558487 560799 563736 567374 571242 575014 579203 584844
59540 584844 592465 601775 612517 625258 640697 658169 675234 689042 698029 702306 702851 700775 697215
59527 697215 693327 690017 687795 686959 687726 689991 693175 696637 700234 704243 708664 712804 715614 716376 715029
59512 715029 711978 707670 702328 696011 688872 681247 673409 665352 656945 648298 639824 631967 625041 619291
59498 619291 614850 611499 608641 605703 602501 599173 595926 593057 591028 590191 590291 590481 590040 589074 588400 588760
59482 588760 590307 592797 596013 599858 604249 609258 615243 622431 630269 637523 643229 647361 650453 652981
59468 652981 655363 658119 661410 664580 666771 668093 669696 672538 676516 680959 685534 690408 695846 702046
59454 702046 709198 717481 727031 737967 750218 763225 776156 788527 800221 810678 818610 823018
59442 823018 824120 822703 818787 811730 801643 789926 778141 766891 756176 746241 737440 729542 721840
59429 721840 714073 706855 701067 697076 694710 693767 694450 697375 703221 712222 723940 737608 752724 769271
59415 769271 787497 807746 830434 855619 882127 907327 928232 942939 950898 952173 947100 936697
59403 936697 922788 907385 892400 879995 872323 869868 870178 869138 863854 854080 840932 824968 805946
59390 805946 784020 760484 737259 715898 697160 681258 668212 657879 649766 643099 637252 632094
59378 632094 627914 625146 624132 624802 626422 627945 628950 630071 632215 635605 639901 644904 650547 656343
59364 656343 661548 665940 669920 673809 677678 681934 687303 693920 701086 708274 715842 724337 733777 744218
59350 744218 756475 771430 788809 807372 826142 844871 863444 881676 899844 918638 938135
59339 938135 957172 974112 988006 998783 1006539 1011050 1011998 1009485 1004155 996733 987435 975911 961827
59326 961827 945472 927765 909790 892322 875582 859299 843189 827516 813066 800425 789548
59315 789548 780175 772368 766232 761327 756879 752609 748970 746440 744937 744081 743808 744455 746249 748907 751893
59300 751893 755137 759390 765612 774067 784332 796276 810586 827973 848054 869310 889798 907546
59288 907546 920676 927858 928823 924077 914261 900269 883816 867089 851524 837366 824664 814157
59276 814157 806789 802702 801226 801732 804142 808695 815529 824459 834895 845917 856684 866812 876270
59263 876270 884869 892005 896930 899174 898690 895712 890541 883367 874181 862934 849968 836286 823100
59250 823100 810969 799552 788435 777971 768891 761257 754384 747941 742532 738842 736717 735571 735363
59237 735363 736579 739398 743504 748641 754766 761516 768090 773903 778994 783513 787125 789219 789507 788103
59223 788103 785099 780364 773831 765868 757249 748745 740736 733237 726237 719905 714436 709885 706229 703421
59209 703421 701201 699084 696822 694787 693654 693718 694702 696135 697652 699075 700476 702139 704209 706421 708428
59194 708428 710326 712531 715248 718363 721740 725190 728210 730327 731911 734137 737857 742781 747998 752899
59180 752899 757239 760681 762915 764245 765589 767670 770404 773179 775544 777470 779169 781008 783641 787853
59166 787853 793935 801332 809181 817203 825793 835164 844730 853401 860285 865039 867888 869425 870003 869102 865736
59151 865736 859824 852709 845844 839307 832143 823852 814814 805493 796091 787120 779481 773572 768746 764018
59137 764018 759046 754256 750291 747481 745615 744110 742599 741298 740556 740245 740040 740195 741375 743704 746654
59122 746654 750057 754543 760616 767857 775470 783235 791484 800462 810080 819989 829606 838405 846511 854675
59108 854675 863225 871327 877740 882127 885234 887925 890461 892671 894417 895755 896784 897373 897061 895423 892596
59093 892596 889221 885770 882213 878468 874823 871633 868892 866365 863854 861056 857474 852890 847703 842416
59079 842416 836943 830836 824050 816997 809908 802615 795065 787613 780592 773860 767035 760083 753487 747896
59065 747896 743660 740652 738395 736350 734171 731860 729670 727763 725916 723727 721180 718795 717053 715875
59051 715875 714908 714002 713031 711587 709438 707179 705769 705395 705413 705417 705636 706120 706346 706090 706001 706749 708132 709542
59033 709542 710900 712519 714446 716565 719100 722401 726388 730776 735745 741857 749356 757950 767237 776945
59019 776945 786849 796805 806848 816922 826566 835123 842108 847175 849997 850604 849686 848194 846725 845479
59005 845479 844551 843971 843770 844336 846344 849924 854387 859240 864932 871861 879123 885278 890169 894883 899896
58990 899896 904347 907456 909646 911665 913323 913695 912114 908471 902970 896118 888643 880965 873049 865132
58976 865132 858283 853695 851586 851262 852161 854418 858398 864043 870834 878210 885999 894481 904040 914662
58962 914662 925833 937008 948020 958909 969377 978607 985715 990367 992861 993473 991752 986751 978116
58949 978116 966709 953814 939991 925203 909947 895557 883102 872502 863101 854736 847724 842002
58937 842002 836800 831256 825100 818773 813084 808692 805602 803057 800149 796620 792912 789399 785870 781983
58923 781983 777942 774288 771036 767597 763863 760876 759765 760127 760196 758866 756980 756244 757336 759569 762062
58908 762062 764602 767466 771137 776309 783588 792890 803400 814367 825643 837312 849198 861029 872857
58895 872857 884907 897135 909301 921519 934460 948898 965229 983548 1004010 1026831 1051876
58884 1051876 1078430 1105470 1132015 1157042 1179249 1197328 1210635 1219426 1224337 1225794 1223947 1218748
58872 1218748 1209858 1196812 1179778 1160105 1139728 1119930 1100866 1082245 1064162 1047183 1031837
58861 1031837 1018170 1005704 993691 981449 968507 954591 939754 924577 909954 896373 883473
58850 883473 870621 857917 846344 836850 829400 823017 816686 810140 803819 798155 793042 788031 782882
58837 782882 777661 772383 766917 761285 755714 750303 744939 739695 734967 731062 727970 725713 724474 724067
58823 724067 723677 722586 720966 719582 718960 719229 720569 723279 727334 732142 736807 740600 743420 745927 748892
58808 748892 752270 755255 757382 758997 760344 760861 760016 758300 756632 755222 753734 752189 750787 749131 746643
58793 746643 743689 741264 739509 737566 735135 733174 732651 733417 734812 736671 739160 742172 745483 749174 753420
58778 753420 758130 763161 768516 773931 778544 781447 782460 782042 780607 778313 775379 772231 769181 766129
58764 766129 762703 758706 754370 750133 746251 742839 740313 739344 740063 741601 742863 743599 744406 745917 748458
58749 748458 752203 757031 762313 767451 772630 778518 785279 792403 799432 806327 813191 820327 828458 838043
58735 838043 848305 857748 865928 874008 883262 893675 904315 914420 923748 932380 940597 948583 956008
58722 956008 962327 967641 972743 978200 984004 990325 997812 1006750 1016534 1026377 1035955 1044926 1052438 1057692
58708 1057692 1060664 1061843 1061613 1060097 1057006 1051383 1042167 1029485 1014731 998913 981672 962531 942313
58695 942313 922324 902753 883007 863389 845284 829635 816152 804253 793940 785328 777871 770618
58683 770618 763123 755834 749574 744671 740621 736680 732749 729432 727156 725617 724322 723360 723320 724618 727191
58668 727191 730741 735076 740280 746659 754416 763422 773454 784470 796147 807231 816013 821679 824706
58655 824706 825895 825691 824604 823370 822167 820357 817595 814549 811919 809261 805573 800624 795044 789422
58641 789422 784056 779360 775768 773322 771846 771410 772079 773430 774869 776340 778180 780380 782496 784272 785855
58626 785855 787333 788397 788594 787793 786492 785707 786403 788952 793341 799754 808359 818516 828947 839066
58612 839066 849398 860291 870901 880060 887524 893706 898669 902090 903826 903907 902355 899565 896399 893305
58598 893305 889781 885328 880350 875476 870630 865674 861427 858947 858217 858543 860010 863414 868936 875957 884106
58583 884106 893441 903561 913666 923666 934246 945511 956414 965832 973584 980234 986585 993513 1001486
58570 1001486 1009982 1018055 1025847 1034972 1047120 1062714 1081025 1100994 1121690 1142660 1164179 1186780
58558 1186780 1210166 1232992 1253917 1272477 1288636 1301955 1311700 1317695 1320653 1321510 1320518 1317198 1311304
58545 1311304 1303610 1295269 1286464 1276373 1264650 1252102 1239431 1226097 1211223 1194936 1177957 1160469
58533 1160469 1142487 1124864 1108661 1093773 1079518 1066504 1056486 1050117 1046115 1043084 1040972 1040129
58521 1040129 1040093 1040292 1041207 1043870 1048436 1053895 1059054 1063393 1067162 1070950 1075003 1078802 1081502 1082855 1083348
58506 1083348 1083406 1082898 1081570 1079454 1076629 1072978 1068473 1063461 1058502 1054099 1050620 1048134 1046247 1044335 1042027
58491 1042027 1039355 1036606 1034287 1033044 1033196 1034470 1036525 1039495 1043650 1048864 1054972 1062402 1071819 1083253
58477 1083253 1096128 1109920 1124144 1137970 1150584 1161809 1171698 1179686 1184897 1187121 1186725 1183875 1178748
58464 1178748 1172356 1166102 1160545 1155466 1151078 1148042 1146320 1145235 1144912 1146493 1150537 1156293 1163022 1170959
58450 1170959 1180271 1189894 1198152 1204046 1207431 1208481 1207521 1204980 1201085 1195911 1189901 1183899 1178522 1173944
58436 1173944 1170347 1168022 1167031 1167373 1169430 1173447 1178551 1183296 1187350 1191775 1197452 1204256 1212133 1221866
58422 1221866 1234023 1247822 1261688 1274460 1285597 1294813 1302075 1307588 1311430 1313478 1313822 1312762 1310315
58409 1310315 1306307 1301077 1295440 1289851 1284230 1278695 1273670 1269124 1264538 1259833 1255639 1252456 1250262 1249077
58395 1249077 1249109 1250181 1251820 1254006 1257000 1260409 1263445 1266205 1269563 1273614 1277408 1280550 1283872 1288107
58381 1288107 1293054 1298512 1304869 1312194 1319855 1327622 1336097 1345482 1354999 1364150 1373457 1383341 1393323 1403067
58367 1403067 1413138 1423984 1435184 1446448 1458338 1471210 1484444 1497552 1511067 1525443 1540034
58356 1540034 1554060 1567683 1581175 1593846 1604790 1613978 1621775 1628145 1633260 1638123 1643690 1649963 1656724
58343 1656724 1664397 1673338 1683065 1693067 1703753 1715666 1728446 1741475 1755024 1769883 1786268 1803788
58331 1803788 1822045 1840719 1859528 1878528 1897813 1916600 1933469 1947980 1961232 1974320 1987145
58320 1987145 1999094 2009870 2019238 2027107 2034402 2042719 2052545 2063019 2073887 2086257 2100822 2116877
58308 2116877 2133882 2152405 2172628 2193459 2214193 2235523 2257818 2280039 2301590 2323687 2347464
58297 2347464 2372145 2396531 2420914 2446045 2471592 2497151 2523518 2551476 2580463 2609863 2640322
58286 2640322 2672424 2705482 2739079 2774319 2811970 2850871 2889922 2930103 2972719 3017151 3062311
58275 3062311 3108853 3157870 3208709 3260183 3312674 3366955 3422278 3477864 3535079 3595823 3659877
58264 3659877 3726017 3794583 3866692 3942042 4019786 4100449 4184551 4270441 4355946 4441210 4527691
58253 4527691 4615441 4703797 4793584 4886176 4981399 5078811 5179897 5286556 5398626 5515347
58243 5515347 5637823 5767515 5903895 6046455 6197418 6359307 6531337 6711464 6900505
58234 6900505 7100920 7313061 7536282 7772179 8022937 8287824 8565346 8857701 9169194
58225 9169194 9501553 9854963 10232443 10638786 11076298 11546001 12051940 12599825 13192622
58216 13192622 13832101 14523626 15274943 16091983 16981104 17953939 19024960 20206437 21511912
58207 21511912 22962989 24587071 26411589 28468625 30804249 33477430 36554872 40118577
58199 40118577 44279110 49175158 54966260 61840086 70026866 79798591 91464480 105388135
58191 105388135 121999188 141736243 164908152 191513171 221028199 252177024 282814902
58184 282814902 310162906 331441299 344597493 348718945 344014113 331578308 313161926
58177 313161926 290927653 267090181 243482650 221250407 200827633 182164041 165024155
58170 165024155 149186819 134497049 120847187 108177590 96498737 85876282 76367504
58163 76367504 67969069 60619967 54232415 48707565 43937960 39818092 36256730 33174392
58155 33174392 30495126 28150141 26085917 24260385 22633779 21170052 19843580 18636291
58147 18636291 17529719 16506161 15555289 14672572 13852017 13085940 12370172 11703516 11082766
58138 11082766 10503301 9963479 9463434 9000276 8568952 8166774 7792521 7442061 7109600
58129 7109600 6792724 6492031 6206460 5933308 5672341 5425628 5193390 4973805 4766679
58120 4766679 4573497 4393834 4225226 4066610 3918600 3780491 3650297 3527800 3414382
58111 3414382 3309718 3211588 3118991 3032605 2952118 2875893 2803298 2734689 2669149 2605031 2542739
58100 2542739 2484248 2429730 2377317 2326421 2278558 2234558 2193437 2154511 2118222 2084407 2051999
58089 2051999 2021009 1992794 1967869 1945233 1924164 1904864 1887031 1869521 1851700 1833636 1814960
58078 1814960 1795129 1774725 1754836 1735318 1715388 1695580 1677103 1659528 1641270 1622299 1604233
58067 1604233 1587639 1571486 1555507 1540914 1528285 1516696 1505529 1495367 1486615 1478813 1471701 1465373
58055 1465373 1459163 1451949 1443810 1435752 1427702 1418534 1408275 1398405 1389666 1381440 1373631 1367177 1362181 1357436
58041 1357436 1352477 1348261 1345079 1341606 1336968 1332078 1327900 1323842 1318932 1313367 1307888 1302633 1297456 1292391
58027 1292391 1287098 1280856 1273789 1267080 1261361 1255890 1249970 1244181 1239499 1236074 1233507 1231534 1229873 1228112
58013 1228112 1226203 1224430 1222695 1220623 1218450 1216880 1215975 1215282 1215069 1216117 1218090 1219537 1219951 1220480 1222134
57998 1222134 1224588 1227339 1230628 1234478 1238028 1240766 1243401 1246751 1250617 1254424 1258054 1261483 1264453 1267082
57984 1267082 1269899 1272790 1274926 1276203 1277586 1279484 1280986 1281393 1281253 1281051 1280196 1278379 1276799 1276761 1277922
57969 1277922 1279150 1280292 1281808 1283273 1283724 1283287 1283305 1284855 1287949 1292004 1296243 1299788 1302177 1303884 1305856
57954 1305856 1308562 1311815 1315245 1318578 1321760 1325117 1329101 1333611 1337971 1341854 1345677 1349862 1354357 1359282
57940 1359282 1365374 1373205 1382418 1392231 1402231 1412287 1422280 1432468 1443541 1455715 1468086 1479363
57928 1479363 1488876 1496503 1502182 1506031 1508564 1510208 1510816 1509909 1507124 1502319 1495787 1488561 1481837 1475828
57914 1475828 1469814 1463561 1457896 1453518 1450101 1447069 1444458 1442396 1440571 1438947 1438317 1439362 1441675 1444391
57900 1444391 1447209 1450132 1452818 1455015 1457156 1459706 1462329 1464457 1466312 1468615 1471615 1475079 1478930 1483153
57886 1483153 1487361 1491150 1494739 1498657 1502980 1507367 1511582 1515542 1519098 1522196 1524897 1526844 1527267 1526037
57872 1526037 1524231 1522994 1522238 1521099 1519203 1516843 1514346 1512015 1510342 1509527 1509038 1508406 1508157 1509268 1511926
57857 1511926 1515588 1519974 1525181 1530970 1536800 1542631 1548974 1556075 1563630 1571345 1579244 1587362 1595557 1603696
57843 1603696 1611685 1619319 1626364 1632684 1638127 1642568 1646274 1649836 1653426 1656550 1658921 1661096 1663762 1666856
57829 1666856 1669912 1672872 1676015 1679536 1683745 1689204 1696078 1703793 1711915 1720707 1730133 1739084 1746673 1753704
57815 1753704 1761624 1770412 1778829 1786483 1794129 1801838 1808287 1812399 1814522 1815511 1815598 1814757 1813351 1811741 1809788
57800 1809788 1807308 1804634 1802324 1800704 1799977 1800353 1801742 1803664 1805723 1807851 1810012 1812083 1814217 1816921
57786 1816921 1820570 1825179 1830765 1837443 1845011 1852873 1860639 1868474 1876723 1885521 1894973 1905348 1916816
57773 1916816 1929208 1942141 1955175 1967838 1979804 1991111 2001948 2012236 2021734 2030455 2038529 2045577
57761 2045577 2050757 2053633 2054699 2054817 2054481 2053760 2052721 2051665 2051032 2051076 2051635 2052387 2053507 2055772 2059652 2064543
57745 2064543 2069361 2073716 2077913 2081968 2085363 2087926 2090290 2093156 2096464 2099572 2101951 2103629 2105196 2107445
57731 2107445 2110703 2114470 2118014 2121370 2125397 2130797 2137410 2144463 2151260 2157669 2164188 2171443 2179323 2186852
57717 2186852 2193259 2198915 2204713 2210841 2216831 2222534 2228147 2233471 2238192 2242982 2249189 2257009 2264943 2271671
57703 2271671 2277714 2284524 2292576 2301062 2309083 2316418 2323351 2330360 2337886 2345947 2354036 2361692 2369026 2376469
57689 2376469 2384238 2392305 2400639 2409266 2418323 2428261 2439627 2452398 2465879 2479568 2493851 2509564
57677 2509564 2527274 2547396 2570638 2597837 2629575 2666407 2709282 2759178 2816288 2879750 2947804
57666 2947804 3017507 3084182 3141813 3184676 3209129 3214359 3202020 3175341 3138369 3095477 3050879
57655 3050879 3007922 2968594 2933772 2903874 2879037 2858881 2842774 2830540 2822437 2818163 2816439 2816062
57643 2816062 2817011 2819970 2824979 2831142 2837600 2844273 2851526 2859567 2868283 2877373 2886436 2895122 2903374 2911486
57629 2911486 2919840 2928592 2937571 2946433 2954896 2962946 2970834 2978893 2987356 2996239 3005244 3013871 3021858 3029591
57615 3029591 3037877 3047190 3057288 3067572 3077641 3087407 3096951 3106492 3116414 3127084 3138608 3150758
57603 3150758 3163052 3174946 3186141 3196739 3207022 3217115 3227002 3236773 3246567 3256345 3265968 3275501
57591 3275501 3285098 3294665 3303979 3313147 3322536 3332196 3341838 3351459 3361466 3371936 3382296 3392131 3401938
57578 3401938 3412596 3424282 3436255 3447564 3457753 3467079 3476302 3486109 3496542 3507131 3517683 3528573
57566 3528573 3540076 3551791 3563108 3573948 3584731 3595867 3607665 3620471 3634442 3649200 3664048
57555 3664048 3678443 3692132 3705102 3717767 3730925 3745084 3759894 3774599 3788953 3803319 3817950
57544 3817950 3832561 3846666 3860065 3873001 3885972 3899304 3912746 3925711 3938137 3950884 3964839
57533 3964839 3979776 3994491 4007982 4020138 4031428 4042441 4053836 4066208 4079704 4093896 4108145
57522 4108145 4122121 4136055 4150606 4166338 4183113 4200161 4216966 4233858 4251446 4269717 4288138
57511 4288138 4306441 4324772 4343122 4361246 4379210 4397443 4416043 4434522 4452478 4470045 4487358
57500 4487358 4504021 4519565 4534146 4548296 4562207 4575768 4589235 4603269 4618147 4633395 4648493
57489 4648493 4663555 4678866 4694022 4708207 4721464 4735078 4750270 4766807 4783456 4799587 4815684
57478 4815684 4832327 4849441 4866827 4884720 4903170 4921284 4937842 4952654 4966794 4981436 4996879
57467 4996879 5012726 5028601 5044481 5060605 5077265 5094588 5112469 5130744 5149375 5168345 5187512
57456 5187512 5206729 5225983 5245224 5264236 5282913 5301540 5320459 5339592 5358654 5377703 5397063
57445 5397063 5416661 5435911 5454404 5472411 5490500 5508896 5527387 5545736 5564021 5582564 5601527
57434 5601527 5620626 5639432 5658093 5677457 5698078 5719271 5739605 5758348 5776114 5794088 5812992
57423 5812992 5832808 5853052 5873127 5892694 5911823 5930637 5948920 5966511 5983981 6002364 6022049
57412 6022049 6042440 6062939 6083670 6104888 6126196 6146917 6167021 6187093 6207518 6228110 6248571
57401 6248571 6268865 6289040 6308966 6328444 6347532 6366719 6386711 6407823 6429539 6450888 6471417
57390 6471417 6491556 6511907 6532507 6553103 6573828 6595106 6616911 6638578 6659472 6679568 6699361
57379 6699361 6719393 6739890 6760626 6781084 6801026 6820886 6841332 6862395 6883367 6903692 6923630
57368 6923630 6943777 6964260 6984765 7005189 7025732 7046361 7066646 7086370 7105949 7125994 7146633
57357 7146633 7167627 7188953 7210862 7233408 7256356 7279614 7303313 7327256 7350712 7373142 7394825
57346 7394825 7416430 7438173 7459871 7481566 7503495 7525472 7546927 7567743 7588503 7609701 7631192
57335 7631192 7652780 7674860 7697867 7721381 7744361 7766265 7787501 7808746 7830228 7851758 7873019
57324 7873019 7893614 7913196 7931870 7950382 7969572 7989624 8009997 8030086 8049737 8069037 8087813
57313 8087813 8105695 8122773 8139823 8157496 8175286 8191693 8205581 8217200 8227772 8238385 8249528
57302 8249528 8261381 8274036 8287348 8300983 8314770 8328791 8342987 8356904 8370092 8382666 8395251
57291 8395251 8408361 8421944 8435590 8449031 8462334 8475644 8488919 8502051 8515175 8528622 8542481
57280 8542481 8556356 8569761 8582693 8595598 8608773 8621986 8634744 8646795 8658265 8669414 8680358
57269 8680358 8691082 8701663 8712515 8724276 8737246 8750874 8764013 8775820 8786345 8796192 8805850 8815542
57257 8815542 8825459 8835694 8845919 8855592 8864677 8873835 8883632 8893805 8903714 8913335 8923294 8933802 8944070
57244 8944070 8953110 8960798 8967728 8974162 8979645 8983819 8987184 8990727 8994928 8999523 9004223 9009310 9015287 9022181
57230 9022181 9029567 9037253 9045684 9055574 9067423 9081516 9098083 9117082 9137869 9159447 9181107 9202638
57218 9202638 9223875 9244316 9263258 9280067 9294209 9305284 9313364 9319145 9323527 9327075 9330050 9332809
57206 9332809 9335834 9339304 9342938 9346420 9349821 9353465 9357467 9361610 9365704 9369927 9374619 9379739 9384713 9388940
57192 9388940 9392280 9394782 9396048 9395284 9392124 9387078 9380918 9373878 9365677 9356083 9345100 9332780 9319222
57179 9319222 9304674 9289329 9273081 9255790 9237643 9218830 9199053 9177931 9155948 9134263 9113275
57168 9113275 9091903 9068760 9043619 9017210 8989873 8961039 8929849 8895605 8857473 8814387 8765609
57157 8765609 8711095 8651088 8585665 8514993 8439827 8361266 8280002 8196077 8109448 8020619 7930656
57146 7930656 7840808 7752201 7665691 7581768 7500544 7421878 7345490 7270954 7197752 7125497 7053969
57135 7053969 6982763 6910950 6837383 6761547 6684052 6606244 6529417 6454375 6381563 6311401 6244401
57124 6244401 6180931 6120827 6063386 6007885 5954088 5902135 5852059 5803793 5757732 5714896 5676351
57113 5676351 5642784 5614882 5593841 5581183 5578418 5587520 5611729 5655335 5722463 5816393 5940273
57102 5940273 6098256 6295978 6540625 6841441 7210511 7663034 8217075 8893386 9715102
57093 9715102 10706171 11888244 13277752 14884723 16712578 18757307 21006822 23441568
57085 23441568 26032014 28724870 31419592 33955151 36130868 37761492 38735767 39042878
57077 39042878 38757224 37999970 36900603 35569466 34083190 32483748 30789276 29009200
57069 29009200 27155638 25249229 23321578 21414275 19572624 17836102 16231633 14773387
57061 14773387 13466645 12310880 11300342 10423919 9666319 9010667 8441303 7945575 7514153
57052 7514153 7140157 6817743 6540916 6303130 6097601 5917795 5757657 5611887 5476505
57043 5476505 5349123 5228226 5112060 4998512 4886068 4774472 4664194 4555395 4447436
57034 4447436 4339108 4229245 4117385 4003981 3889840 3775465 3661375 3549008 3440759
57025 3440759 3338899 3244904 3159973 3085702 3023866 2975604 2940367 2914456 2890032 2856526 2804439
57014 2804439 2728491 2627833 2504608 2363268 2210426 2053717 1899895 1753825 1618521 1495280
57004 1495280 1383980 1284078 1195480 1118081 1050859 992128 940556 895221 854913 818298 784872
56993 784872 754875 728114 703658 680902 660175 641984 626443 613788 604604 598800 594902 591049
56981 591049 586369 580834 574130 565441 554322 541143 526607 511224 495353 479396 463807 449105
56969 449105 435867 424508 415004 407055 400574 395889 393452 393455 395807 400424 407373 416642 427742 439649
56955 439649 451194 461394 469200 473116 471569 464011 451587 436593 421212 406618 392953 379939
56943 379939 367544 356260 346780 339530 334632 332270 332834 336599 343435 353013 365187 379976 397117
56930 397117 415717 434360 451419 465177 473782 475565 469877 457649 440795 421007 399349 376979
56918 376979 355585 336652 320613 307069 295544 285626 276757 268618 261629 256414 252794 249922 247439
56905 247439 245809 245286 245237 244867 244116 243421 243073 243233 244298 246671 250317 254962 260678 267938 277146 288360
56889 288360 301430 316211 332616 350535 369488 388216 404866 417908 426809 431607 432039 427586
56877 427586 418457 406149 392766 379905 368346 358585 351271 347036 346215 348999 355685 366524 381485
56864 381485 400671 424961 455683 493303 536686 583693 631848 677953 717740 746984 763227
56853 763227 766177 756826 736963 709281 677045 643253 610517 581480 558376 542009 532002 528359
56841 528359 532042 543733 563116 590039 625674 671627 728252 794390 867946 945519 1021429 1088114
56829 1088114 1138098 1165916 1169118 1148629 1108362 1053815 990531 923616 857901 797399 744304
56818 744304 698999 661301 631466 610057 597435 593714 599007 613531 637539 671035 713284 762416
56806 762416 815425 868207 915498 951409 971066 972238 955479 923107 878518 826086 770483 715365
56794 715365 662866 614477 571829 536162 507425 484615 467105 455288 449886 451050 458321 471223
56782 471223 489454 512410 538592 565484 589831 608141 617489 616428 605270 585419 558520 526379
56770 526379 491314 455838 421736 389708 359943 332686 308179 286517 267768 251922 238615
56759 238615 227266 217627 209793 203587 198413 193870 189881 185953 181126 175231 169541 165375 162460 159535
56745 159535 156209 153382 151856 151392 151179 150578 149301 147465 145660 144496 144011 143851 143931 144424 145109 145310 144549
56728 144549 142930 140914 139151 138340 138619 139101 138701 137535 136856 137420 138575 139216 139100 138869 139176 140171 141548
56711 141548 142783 143480 143608 143302 142603 141701 141294 142125 144119 146472 148628 150643 152541 153961 154687 154993
56695 154993 155216 155400 155529 155600 155389 154700 153940 153742 153830 153124 151350 149702 149314 149813 150148 150189 150572 151382 151986
56676 151986 152074 151997 152059 152204 152488 153229 154520 156041 157452 158586 159299 159608 160040 161309 163489 165861 167716
56659 167716 168984 170010 171109 172530 174513 177078 179855 182288 183951 184739 184944 185155 185836 186915 188026
56644 188026 189160 190688 192584 193935 193643 191555 188673 186234 184769 183956 183110 181724 179751 177557 175533
56629 175533 173651 171506 168879 166098 163596 161276 158671 155715 152921 150623 148500 146184 143967 142427
56615 142427 141571 140903 140288 140218 141071 142498 143761 144466 144822 145338 146313 147500 148281 148328 147980 147788 147859 147869 147528
56596 147528 146685 145276 143702 143036 144170 146708 149299 151105 152381 153670 155166 156987 159247 161538 163047
56581 163047 163602 163991 164884 166056 167096 168172 169533 170842 171736 172572 173926 175714 177514 179428 181875
56566 181875 184748 187536 190256 193613 198230 204198 211298 219138 227126 234838 242472 250475 258687 266230
56552 266230 272244 276480 279267 281281 283249 285482 287655 289252 290094 290206 289490 287969 286140 284582 283311
56537 283311 281892 279955 277245 273555 269209 265279 262523 260288 257253 253160 248976 245356 241966 238499
56523 238499 235370 232860 230452 227668 225001 223247 222266 221072 219000 216287 213597 211433 209900 208656
56509 208656 207155 205264 203562 202746 202771 202880 202444 201485 200432 199644 199257 199219 199306 199244 198980 198740 198703 198652 198151
56490 198151 197097 195983 195475 195784 196567 197349 197881 198181 198476 199075 199968 200512 199940 198390 197067 197070 198322 199952
56472 199952 201378 202594 203697 204715 205813 207132 208381 209086 209263 209465 210058 210906 211800 212735 213576 213893
56456 213893 213463 212694 212245 212357 212821 213476 214451 215858 217445 218791 219862 221233 223428 226025 227787 227935
56440 227935 227132 226901 228181 230642 233241 235068 235745 235444 234699 234069 233813 233875 234110 234468 235101 236328 238292
56423 238292 240604 242621 244163 245600 247092 248276 248990 249669 250510 250797 249788 247927 246368 245576 245242 245341
56407 245341 246254 247750 248915 249416 250010 251342 252922 253842 253956 253804 253771 253887 254232 254935 255768 256094 255390 253728
56389 253728 251734 250052 248835 247872 247242 247550 249182 251558 253569 254653 255123 255665 256947 259447 262965
56374 262965 266366 268494 269385 270007 270938 272023 273278 275124 277489 279605 281118 282631 284597 286396 287160
56359 287160 286953 286537 286358 286397 286605 286899 286967 286670 286439 286825 287768 288754 289517 290240 291146 292200 293064 293264 292682
56340 292682 292070 292607 294597 296982 298588 299527 300900 303398 306681 309909 312418 314004 315032 316281 318335
56325 318335 321183 324568 328472 332839 337096 340513 343016 345168 347257 348819 349275 348791 348252 348411 349192
56310 349192 349941 350370 351079 352940 356053 359624 362902 365902 369160 373087 377715 382673 387237 390664 392734
56295 392734 393789 394240 394383 394698 395807 397805 400055 401985 403722 405679 407905 410247 412848 416001 419650
56280 419650 423431 427119 430767 434554 438766 443750 449572 455829 462061 468231 474646 481532 488891 496653
56266 496653 504771 513225 522053 531297 540969 551250 562639 575585 590042 605819 623320 643380
56254 643380 666257 691378 718354 747709 780388 817050 858080 903675 953440 1006351 1061561
56243 1061561 1118831 1177858 1237686 1297265 1356050 1413486 1468231 1518488 1562796 1600011 1628894
56232 1628894 1648436 1658450 1659350 1651489 1635215 1611384 1581255 1545905 1506101 1462621 1416338 1368175
56220 1368175 1319372 1271549 1225914 1182458 1140363 1099280 1059873 1023185 989752 959332 931211
56209 931211 904791 880028 857224 836400 817152 799289 783212 769326 757363 746644 736843 728143
56197 728143 720789 714776 709913 705953 702708 700109 698104 696548 695356 694667 694543 694631 694516 694263 694129 693942
56181 693942 693403 692817 692657 692534 691621 690184 689477 689870 690322 690233 690600 692523 695693 699279 703306 708046 712841
56164 712841 716799 720215 724221 729324 735211 741648 748641 755964 763404 771306 780193 790062 800646 812076
56150 812076 824703 838628 853947 871010 889975 910621 933198 958791 988237 1021391 1058184
56139 1058184 1099686 1147416 1202403 1265759 1339112 1423090 1515952 1614786 1717312 1821256 1922831
56128 1922831 2017722 2103580 2180346 2248466 2308236 2360602 2406832 2446984 2479828 2504507 2521314
56117 2521314 2530829 2533392 2529600 2520244 2505440 2484431 2456229 2419828 2374083 2318253 2252751 2178877
56105 2178877 2098318 2013630 1928608 1846941 1770642 1700534 1637672 1583160 1537044 1498564 1467159
56094 1467159 1442165 1422066 1405429 1392207 1382883 1376777 1372578 1370011 1369436 1370191 1371073 1372313 1375291 1380246
56080 1380246 1385861 1391227 1396747 1403043 1410468 1419730 1431424 1444760 1458125 1471053 1484344 1498360
56068 1498360 1512841 1528355 1546158 1566261 1587185 1607993 1629173 1651266 1674075 1697513 1721823
56057 1721823 1746607 1770843 1794100 1816655 1838562 1859869 1881550 1904638 1928551 1951832 1974440
56046 1974440 1997710 2022251 2047683 2074304 2103073 2133965 2166222 2200198 2236892 2275765 2315184
56035 2315184 2355128 2397148 2441499 2486636 2531852 2578082 2625734 2674177 2723810 2776224 2831644
56024 2831644 2888514 2946178 3005721 3067667 3131332 3196958 3265958 3338315 3412336 3487652 3565877
56013 3565877 3647582 3731504 3817684 3908532 4005464 4107115 4212103 4321059 4434721 4552610
56003 4552610 4674918 4803272 4938468 5079785 5227462 5383308 5548050 5720824 5902008
55994 5902008 6093516 6295533 6506348 6726496 6959605 7208011 7471116 7749146 8044711
55985 8044711 8359363 8692772 9046924 9427046 9836745 10276534 10748768 11259353 11812610
55976 11812610 12409475 13053196 13751945 14513580 15343294 16249306 17245629 18346532 19564246
55967 19564246 20915597 22425631 24122386 26035494 28204535 30683623 33536822 36839655
55959 36839655 40692037 45224695 50592830 56976942 64596878 73716689 84636942 97704148
55951 97704148 113333203 131977951 154006405 179512689 208102629 238658224 269174040
55944 269174040 296899623 318921241 332941596 337791739 333456616 320821764 301434531
55937 301434531 277307183 250625207 223371807 197052660 172634403 150629034 131211450
55930 131211450 114331715 99817200 87439944 76941579 68049026 60503026 54079579
55923 54079579 48587966 43863829 39773476 36215592 33109039 30382149 27975714 25846049
55915 25846049 23956587 22270374 20754633 19386229 18146922 17017621 15981379 15027048
55907 15027048 14145314 13325197 12558324 11842392 11176156 10554399 9971248 9424621 8913522
55898 8913522 8434173 7982512 7557767 7160240 6788068 6438978 6112655 5808597 5524162
55889 5524162 5257328 5008824 4779135 4566036 4367535 4184575 4018317 3867488 3731147
55880 3731147 3611370 3510048 3424987 3351874 3287923 3230696 3175187 3115297 3047244 2969376 2880353
55869 2880353 2780167 2671791 2559355 2445473 2332051 2222134 2118534 2021633 1930517 1845330
55859 1845330 1766772 1694417 1627444 1566006 1510172 1458644 1410274 1365667 1325537 1288683 1253506
55848 1253506 1220381 1190451 1162949 1135831 1108464 1081785 1056194 1031126 1006422 982560 959628
55837 959628 937370 916064 896305 878173 861389 845729 830553 814760 798183 782208 768065
55826 768065 755307 742900 730897 719834 709345 698607 687605 676868 666507 656380 646552 636809
55814 636809 626509 615691 605477 596596 588448 580482 573427 568166 564415 561552 559760 559325 559878 561425
55800 561425 565056 571391 579274 587158 594697 601688 606699 608435 607655 606068 603899 600040 594054 586552
55786 586552 578012 568618 558910 549325 539436 528729 517604 506600 495330 483446 471928 462150 454330
55773 454330 448302 444993 445453 448847 453036 456796 459917 461556 460349 456155 450063 442568 433247 422347
55759 422347 411177 400623 390502 380650 371421 362820 354242 345433 336789 328510 320370 312485 305463
55746 305463 299572 294541 290248 286830 284067 281537 279355 277987 277305 276624 275668 274639 273425 271663 269602
55731 269602 267948 266740 265333 263560 261984 260807 259440 257410 254846 251802 247904 243088 238033 233480
55717 233480 229653 226643 224863 224759 226364 229310 233048 237089 241262 245670 250085 253672 255717 256339 256005
55702 256005 254733 252382 249348 246182 242742 238492 233430 227944 222049 215678 209536 204599 200802 197218
55688 197218 193539 190392 188132 186435 185294 185272 186382 187776 189072 191036 194247 197889 200610 201994 202478
55673 202478 202310 201413 199931 198155 196004 193203 189971 187000 184703 182909 181410 180469 180499 181377 182355 182805
55657 182805 182964 183754 185838 189035 192735 196640 200891 205609 210603 215449 219697 223060 225473 226904 227117
55642 227117 225872 223372 220081 216013 210700 204105 197086 190571 184674 179062 173737 168924 164525 160321
55628 160321 156580 153936 152633 152172 151598 150019 147201 143898 141219 139414 137709 135572 133483 132067 131191
55613 131191 130511 130160 130142 129721 128434 127142 127002 127689 127776 126672 125100 123722 122423 121062 119910 119100 118391
55596 118391 117703 117212 116805 116178 115578 115693 116614 117611 118101 118221 118294 118413 118715 119390 120148 120270 119490 118334 117403
55577 117403 116768 116266 115852 115436 114820 114069 113615 113815 114613 115752 116976 117986 118477 118347 117710 116810 116065 115865
55559 115865 116013 115654 114230 112246 110670 109878 109691 109986 110524 110511 109240 107119 105292 104324 103917 103783 103953
55542 103953 104266 104351 104193 104101 104184 104447 105181 106459 107498 107424 106546 105902 105689 105209 104271 103438 102762 101563 99760
55523 99760 98204 97272 96240 94595 92889 91702 90754 89777 89351 90070 91529 92948 94221 95668 97257 98741
55507 98741 100145 101519 102594 103140 103292 103080 102165 100462 98537 96901 95417 93904 92804 92606 92967 92991
55491 92991 92163 90585 88653 86960 86192 86561 87483 88198 88540 88889 89609 90692 91682 91788 90522 88438 86775
55474 86775 86085 85684 84693 83155 81780 81101 81194 81789 82298 82145 81473 81084 81390 81870 81933 81779 81956 82498 83005
55455 83005 83234 83191 82961 82829 83160 83804 83962 83129 81871 81268 81751 82779 83401 82955 81543 80077 79582 80315
55437 80315 81857 83937 86484 88829 89827 89220 88116 87647 87807 88081 88390 88747 88702 87989 87252 87295 87912 88175
55419 88175 87590 86363 84880 83653 83451 84740 87061 89479 91433 92699 92973 92176 90929 90004 89463 88910
55403 88910 88376 88317 88866 89621 90098 89948 89053 87907 87541 88366 89390 89347 88390 87799 88067 88216 87203 85211
55385 85211 83187 81750 80999 81005 81955 83834 86206 88366 89767 90380 90610 90767 90737 90303 89582 88952 88668 88749
55367 88749 89132 89768 90680 91980 93585 94918 95237 94432 93149 91985 90948 89806 88509 87074 85565 84450
55351 84450 84402 85455 86862 88014 88887 89352 88923 87764 87082 87699 88818 89039 88123 86966 86300 86220 86621 87240
55333 87240 87557 87396 87300 87607 87606 86476 84643 83213 82448 81780 81065 80666 80482 80101 79883 80676 82302 83535
55315 83535 83875 84243 85510 87322 88887 89969 90499 89984 88135 85640 83647 82696 82560 82878 83523 84484 85734
55298 85734 87181 88678 90078 91230 91807 91429 90268 89186 88804 88738 88344 87842 87943 88591 89048 89172 89626
55281 89626 90681 91722 92228 92392 92494 92430 92208 92134 92177 91860 91168 90839 91283 91943 92186 92192 92409 92760 93034 93475
55261 93475 94311 95134 95387 95169 94916 94627 94003 93138 92441 92059 91892 92049 92705 93578 94063 93910 93415 92996 92904
55242 92904 93228 93806 94144 93842 93121 92614 92613 92806 92742 92288 91588 90862 90365 90279 90482 90566 90297 90018 90392 91642
55222 91642 93141 93931 93649 92782 92042 91732 91771 91997 92182 92050 91626 91316 91338 91290 90751 90087 90019 90448 90349 89023
55202 89023 86936 85114 84165 84125 84835 86071 87538 89047 90615 92263 93848 95161 96030 96357 96234 96004
55186 96004 95932 95860 95454 94689 93806 92856 91771 90838 90602 91225 92330 93484 94430 94913 94883 94918 95809 97523 99124
55167 99124 99942 100234 100455 100540 100351 100310 100948 102099 103033 103291 103068 102890 103133 103681 103916 103256 101828 100403 99537
55148 99537 99082 98634 98136 97847 97983 98500 99008 98990 98473 98355 99457 101244 102206 101582 100023 98437 97073 96072
55130 96072 95876 96453 96939 96782 96617 97222 98282 99051 99662 100732 102072 102925 103320 104061 105350 106438 106832
55113 106832 106898 106939 106538 105291 103572 102020 100742 99470 98165 97009 96027 95149 94564 94679 95691 97360
55097 97360 99147 100450 100813 100172 99041 98352 98877 100596 102652 104127 104877 105447 106209 106946 107357 107537 107677
55080 107677 107697 107563 107649 108236 108867 108753 107829 106882 106568 106747 106919 106874 106625 106090 105176 104139 103541 103798 104858
55061 104858 106304 107708 108833 109523 109568 108834 107533 106182 105245 104942 105367 106498 107978 109203 109826 110033
55045 110033 110126 110049 109503 108406 107010 105675 104662 104062 103840 104049 104938 106553 108311 109448 110014 110815 112095
55028 112095 112909 112330 110745 109312 108486 107890 107417 107550 108467 109559 110095 109937 109390 108802 108495 108764 109703 111178
55010 111178 112961 114652 115626 115551 114927 114665 115043 115566 115904 116372 117218 117997 118085 117484 116717 116196 116009 116106 116296
54991 116296 116195 115562 114649 113993 113959 114637 115965 117559 118550 118125 116382 114401 113261 113146 113507 113911 114466
54974 114466 115502 117046 118718 120072 120905 121286 121368 121251 121039 120952 121261 122033 122978 123689 124052 124310 124644 124839
54956 124839 124533 123696 122661 121691 120806 120076 119785 120129 120906 121661 122058 122015 121636 121196 121056 121382 121988 122606 123245
54937 123245 124130 125333 126604 127599 128154 128342 128370 128468 128893 129988 132090 135160 138572 141564 144064 146938
54921 146938 151203 157096 163981 171009 177686 183910 189638 194553 198014 199433 198760 196538 193436 189800
54907 189800 185674 181017 175774 169867 163399 156847 150977 146454 143446 141499 139899 138309 137030 136512
54893 136512 136694 137051 137174 136998 136608 136208 136285 137311 139169 141248 143213 145303 147801 150675 153900 157616
54877 157616 161778 166192 171121 177208 184396 191443 197051 201032 203813 205260 204686 201844 197361 192264
54863 192264 187422 183162 178990 174005 168026 161986 156840 152527 148588 145181 142612 140311 137386 134064
54849 134064 131500 130079 128935 127346 125652 124486 123932 123826 124120 124455 124090 122796 121272 120168 119211 117856
54833 117856 116333 115441 115557 116415 117653 119061 120377 121329 121861 122053 121894 121448 121120 121371 122164 122942 123208
54816 123208 122955 122519 122180 122036 122211 123007 124527 126105 126553 125397 123652 122782 122989 123165 122581 121815 121671
54799 121671 121954 121925 121507 121284 121566 122097 122609 123074 123435 123607 123836 124572 125845 127163 128161 128979 129872 130789
54781 130789 131646 132704 134319 136457 138718 140754 142365 143278 143296 142879 143204 145305 149269 154526 160716 167817
54765 167817 175495 182973 189838 196464 203199 209478 214244 217044 218142 217687 215461 211601 206942 202268
54751 202268 197584 192486 186963 181433 176162 171118 166455 162754 160469 159294 158400 157417 156910 157623 159363
54736 159363 161015 161734 161681 161423 161101 160645 160423 161029 162488 164285 166210 168685 172140 176507 181533 187138
54720 187138 193195 199233 204651 209079 212335 214164 214175 212124 208283 203513 198752 194256 189562 184401 179287
54705 179287 174834 170901 167065 163631 161311 159954 158521 156451 154197 152187 150211 148251 146950 146503
54691 146503 145900 144173 141866 140262 139504 138515 136652 134488 132822 131776 131145 130898 130947 130934 130644 130287 130064
54674 130064 129778 129221 128686 128680 129227 129798 129969 129851 129774 129780 129661 129407 129306 129570 130120 130931 132281 134257 136180
54655 136180 137092 136849 136207 135642 134730 133141 131659 131465 132616 133925 134390 134088 133560 132988 132341 131869 131881 132235
54637 132235 132444 132325 132169 132240 132422 132492 132475 132490 132357 131683 130413 129050 128198 128114 128815 130315 132404 134349 135347
54618 135347 135369 135180 135391 135754 135601 134702 133489 132630 132609 133571 135281 137285 139225 140946 142227 142630 141892
54601 141892 140411 139099 138672 139118 139854 140340 140504 140593 140695 140616 140334 140286 140856 141702 142019 141487 140621 140069 139962
54582 139962 140011 139867 139211 137896 136300 135172 134835 134825 134625 134432 134845 135976 137303 138289 138859 139316 140061 141285
54564 141285 142742 143875 144390 144553 144791 145169 145469 145558 145416 144989 144322 143708 143434 143471 143630 143882 144318 144968 145774
54545 145774 146594 147094 146985 146589 146741 147811 149241 150484 151942 154355 157583 160727 163251 165175 166266
54530 166266 165988 164515 162986 162344 162447 162680 162844 163010 162963 162433 161617 160992 160713 160562 160334 159861 158845 157169
54512 157169 155392 154459 154708 155452 155763 155443 155042 155077 155512 155940 156018 155619 154841 154063 153840 154441 155469 156226 156500
54493 156500 156735 157313 158021 158551 159207 160613 162721 164630 165531 165508 165190 164939 164784 164990 166149 168477 171241
54476 171241 173231 173857 173613 173450 173883 174867 176281 178143 180250 181998 182812 182718 182329 182332 183014 184164 185305
54459 185305 186058 186352 186255 185705 184629 183340 182451 182216 182224 181951 181359 180704 180018 179150 178131 177102 175967 174520
54441 174520 172953 171820 171354 171156 170689 169952 169424 169482 169981 170390 170232 169454 168379 167356 166499 165848 165615 166077
54423 166077 167202 168506 169351 169399 168856 168359 168530 169489 170757 171661 171852 171523 171268 171681 172877 174283 175062
54406 175062 174851 174028 173237 172796 172616 172410 171942 171288 171014 171846 173941 176622 178996 180619 181507 181797 181716 181673
54388 181673 182077 183071 184543 186199 187531 188028 187615 186680 185569 184354 183193 182398 181852 180884 179230 177749
54372 177749 177571 178799 180572 182167 183442 184378 184868 184989 184929 184594 183776 182648 181647 180894 180258 179904 180148
54355 180148 180750 180967 180519 179894 179499 179046 178088 176734 175451 174479 173741 173117 172579 172201 172169 172584 173277 174074
54337 174074 175198 176965 179024 180461 180847 180698 180623 180532 180015 179083 178016 176807 175291 173707 172575 172007
54321 172007 171551 170765 169588 168052 166007 163400 160657 158469 157192 156634 156526 156943 158069 159655 161079
54306 161079 162016 162693 163305 163579 163245 162635 162317 162255 161896 161135 160662 161125 162339 163571 164386 164933 165526 166182
54288 166182 166551 166263 165310 164110 163143 162601 162435 162540 162684 162447 161550 160178 158729 157268 155586 153805 152619
54271 152619 152735 154197 156309 158154 159208 159586 159743 160012 160546 161573 163271 165355 167235 168735 170159
54256 170159 171500 172230 172198 171996 171890 171231 169680 168217 167825 167774 166607 164485 163064 163077 163530 163505 163280 163174
54238 163174 162691 161613 160784 160928 161544 161806 161792 162013 162450 162937 163789 165128 166125 165881 164688 163547 162821 162238
54220 162238 161866 162042 162480 162427 161757 161105 160794 160402 159596 158709 158152 157710 156838 155447 154134 153604 153907 154305
54202 154305 154055 153328 153067 153842 155227 156444 157208 157675 158001 158357 158977 159784 160287 160280 160291 160880 161799 162327 162228
54183 162228 161936 162005 162720 163953 165017 164994 163649 161731 160022 158522 157012 155862 155588 156035 156720 157655 159052
54166 159052 160478 161135 160853 160082 159135 158194 157834 158517 159555 159484 157701 155000 152481 150702 149987 150567 151988
54149 151988 153157 153465 153387 153653 154368 155319 156537 158120 159824 161255 162242 162812 163084 163325 163727 163997 163610
54132 163610 162675 162016 162126 162480 162277 161494 160762 160497 160604 160898 161399 162159 162988 163469 163282 162620 162166 162446 163262
54113 163262 164072 164819 165927 167462 168808 169427 169527 169701 170179 170684 170836 170536 170108 170116 170788 171599 171738 171053
54095 171053 170176 169682 169539 169501 169535 169630 169589 169375 169286 169534 169934 170302 170801 171467 171682 170658 168433 166060 164771
54076 164771 165079 166573 168378 169815 170823 171754 172848 174066 175367 176803 178226 179279 179909 180574 181617
54061 181617 182675 183061 182668 182158 182277 183196 184504 185668 186481 187159 188042 189230 190631 192362 194785 197924
54045 197924 201029 203101 203977 204709 206734 210669 216065 222313 229609 238723 249937 262582 275740 288861
54031 288861 301329 311951 319605 324277 326835 327768 326842 324045 320120 315812 311173 306095 301106 297129
54017 297129 294506 292623 290397 287070 282790 278559 275376 273270 271438 269312 267005 264558 261420 257127
54003 257127 252071 247059 242442 238210 234634 232174 230786 229858 228861 227645 226077 223929 221276 218661 216648
53988 216648 215394 214755 214558 214592 214447 213609 211783 209162 206330 203891 202155 201204 201104 201814 202877 203524 203246
53971 203246 202155 200693 199200 197872 196919 196582 197054 198399 200352 202226 203385 203904 204431 205263 206006 206384
53955 206384 206886 208168 210140 212132 213773 215282 217055 219351 222202 225298 228131 230634 233430 237014
53941 237014 240986 244696 248391 252946 258489 264164 269455 274880 280915 286898 291658 294831 296906 298259
53927 298259 298860 298934 299219 300291 302002 303842 305550 307120 308444 309399 310301 311930 314875 319042 324023 329794
53911 329794 336673 344549 352553 359798 366256 372597 379247 385916 392019 397171 401146 403708 404809 404763 403868
53896 403868 401904 398380 393379 387807 382512 377383 371712 365390 359309 354427 350763 347598 344428 341365
53882 341365 338802 337073 336491 337383 339992 344528 351194 359780 369160 377548 383511 386602 386929 384417 378686
53867 378686 369583 357690 344376 331245 319217 308111 297339 286999 277910 270530 264407 258877
53855 258877 253848 249538 245816 242269 238727 235364 232413 230049 228337 227082 225990 225239 225452 226704 227985
53840 227985 228223 227561 226958 226741 226364 225532 224710 224267 223870 223130 222256 221584 220852 219563 217857 216532 216133 216375
53822 216375 216576 216401 216078 215941 215969 215877 215588 215338 215198 214812 213959 213222 213558 215163 217188 218735 219784 220941
53804 220941 222642 224941 227783 231095 234628 238068 241408 245040 249399 254490 259760 264469 268268 271393
53790 271393 274239 276784 278679 279824 280597 281466 282651 284205 286085 287909 288945 288663 287169 284968 282479
53775 282479 279972 277695 275713 273748 271508 269067 266620 264004 260916 257582 254765 252946 251850 250939
53761 250939 249959 248789 247120 244699 241774 238902 236337 233929 231570 229462 227902 227042 226892 227340 228086
53746 228086 228787 229293 229542 229267 228227 226849 226152 226611 227396 227245 225957 224570 224081 224495 225231 225941 226597
53729 226597 227139 227443 227603 227979 228906 230412 232181 233769 234923 235657 235896 235263 233593 231632 230676 231311 232854
53712 232854 234278 235250 235990 236631 237247 238221 239911 242047 244030 245822 247964 250693 253579 256146 258358
53697 258358 260313 262015 263700 265854 268530 271051 272891 274516 276810 279843 282786 284938 286253 286850
53683 286850 286633 285678 284430 283176 281726 280058 278857 278742 279154 278726 276895 274521 272627 271163 269471
53668 269471 267535 266049 265404 265246 265086 264792 264417 264049 264064 264964 266621 268013 268128 266958 265315 263905 262983
53651 262983 262638 262927 263656 264404 264883 265104 265241 265549 266312 267552 268813 269532 269689 269790 270213 270868 271569 272385
53633 272385 273424 274550 275572 276557 277674 278857 279874 280747 281884 283735 286413 289658 293077 296343 299314
53618 299314 302035 304651 307309 310142 313271 316632 319751 321952 323102 324055 325971 329058 332377 335124
53604 335124 337722 341219 345851 350770 355131 358785 361777 363769 364420 363976 363086 362123 361005 359589 358052
53589 358052 356947 356815 357551 358205 357886 356901 356470 357145 358138 358504 358294 357951 357296 355937 354279 353142 352602
53572 352602 352139 351839 352462 354231 356459 358615 360949 363662 366221 367972 368875 369210 369045 368425 367658 366992
53556 366992 366375 365858 365782 366212 366622 366560 366206 365850 365342 364634 364397 365325 367123 368990 370875 373450 376888 380565
53538 380565 384183 388363 393719 399928 406206 412333 418803 426248 435063 445306 456531 467811 478290
53525 478290 487808 496914 506443 517147 529402 542985 557306 572116 587790 604677 622446 640549
53513 640549 659111 678789 699790 721682 744288 768014 792906 817958 842043 865194 888293
53502 888293 911705 934928 957529 979575 1000958 1021085 1039818 1058174 1077475 1097989 1118925
53491 1118925 1139516 1159566 1179003 1197555 1215103 1232022 1248930 1266174 1283565 1300465 1316137
53480 1316137 1330241 1343048 1355098 1366717 1377990 1388933 1399362 1408668 1416075 1421126 1423675 1423522
53468 1423522 1420436 1414571 1406469 1396634 1385404 1373252 1360681 1347670 1333606 1318078 1301430 1284281
53456 1284281 1266775 1248572 1229312 1208844 1187268 1165109 1143261 1122315 1101995 1081628 1061176
53445 1061176 1041491 1023396 1006767 990707 974577 958820 944793 933751 925848 920098 915288 910911
53433 910911 907213 904594 903194 903038 904275 907118 911668 917863 925553 934592 944954 956832 970501 985952
53419 985952 1002763 1020545 1039457 1059955 1081988 1104823 1127974 1151980 1177807 1205663 1235001
53408 1235001 1265629 1298129 1332925 1369619 1407717 1447460 1489290 1532866 1577357 1622604 1669345
53397 1669345 1718246 1769168 1821421 1874275 1927227 1980200 2033489 2087158 2140569 2192965 2244394
53386 2244394 2295371 2345639 2394001 2439582 2482556 2523297 2561431 2596207 2627301 2654754 2678502
53375 2678502 2698479 2714890 2727963 2737564 2743331 2744873 2741518 2732249 2716420 2694304 2666460 2632796
53363 2632796 2592803 2546719 2495960 2442368 2387310 2331452 2274947 2217738 2159959 2102184 2045186
53352 2045186 1989490 1935323 1882865 1832254 1783319 1735655 1689062 1643778 1600121 1557949 1516588
53341 1516588 1475383 1434391 1394475 1356603 1321118 1287868 1256941 1228843 1203851 1181505 1160961
53330 1160961 1141634 1123435 1106681 1091903 1079385 1068620 1058486 1048212 1037975 1028424 1019972 1012810
53318 1012810 1007145 1002973 999838 997257 995216 993990 993701 994447 996603 1000520 1006052 1012751 1020443 1029258
53304 1029258 1039286 1050580 1063298 1077440 1092639 1108774 1126589 1147039 1169976 1194055 1218099
53293 1218099 1242028 1266330 1291169 1316365 1341874 1367844 1394247 1420557 1445773 1468814 1489170
53282 1489170 1507203 1523557 1538275 1550740 1560441 1567394 1571747 1573429 1572397 1568938 1563434 1556031 1546680
53269 1546680 1535370 1522088 1506674 1488884 1468622 1446107 1421904 1396678 1370671 1343400 1314168
53258 1314168 1282994 1250857 1218848 1187236 1155552 1123459 1091351 1060113 1030425 1002347 975509
53247 975509 949499 923972 898535 872821 846833 820995 795745 771186 747225 723857 701151
53236 701151 679258 658608 639844 623234 608314 594465 581668 570355 560642 552102 544240 536738
53224 536738 529288 521578 513541 505281 496742 487776 478580 469661 461217 452865 444150 435132 426325 418274
53210 418274 411255 405147 399376 393143 385948 377991 370078 363070 357270 352282 347510 342756 338107 333385
53196 333385 328246 322992 318670 315886 313970 311819 309140 306235 303005 299092 294844 291225 288633 286528
53182 286528 284299 281871 279405 277153 275650 275249 275341 274870 273790 273079 273076 272896 272028 271344 271618 271952 270912
53165 270912 268667 266758 266009 265830 265570 265381 265435 265203 264039 262006 259725 257766 256405 255602 254974 254050 252783
53148 252783 251609 250887 250491 250052 249408 248697 248194 248177 248778 249807 250753 251054 250443 249141 247762 246892 246609 246479
53130 246479 246134 245697 245536 245816 246482 247504 248806 250086 251054 251852 252935 254502 256277 257888 259222 260326
53114 260326 261107 261320 260828 259834 258755 257792 256727 255375 254092 253402 253075 252179 250356 248505 247622 247368 246520
53097 246520 244638 242491 240853 239713 238880 238569 238883 239247 238966 238084 237197 236609 236200 235998 236339 237253 238076
53080 238076 238011 236981 235772 235258 235567 236060 236128 235888 235990 236819 238065 239067 239318 238587 236941 234940 233608
53063 233608 233715 234951 236102 236230 235558 235081 235431 236360 237233 237733 237910 237755 237098 235971 234805 234003 233428
53046 233428 232592 231408 230444 230249 230596 230735 230309 229673 229155 228411 226891 224788 223065 222422 222599 222897 223112
53029 223112 223592 224506 225403 225679 225325 225050 225542 226632 227299 226679 225011 223355 222412 221938 221422 220867 220580 220595
53011 220595 220774 221282 222437 224131 225809 226986 227427 227019 226024 225350 225839 227129 227904 227494 226601 226135 226062
52994 226062 225941 225938 226443 227009 226610 225028 223254 222263 221909 221385 220513 220192 221544 224723 228624 231814 233763
52977 233763 235043 236357 237691 238571 238766 238420 237768 237163 237241 238528 240782 243027 244386 244666 244246 243709 243619
52960 243619 244238 245244 245921 245808 245118 244419 244001 243602 242736 241278 239727 238791 238629 238676 238304 237476 236577 235817
52942 235817 235101 234330 233495 232504 231273 230023 229215 229087 229444 229913 230213 230171 229694 228778 227418 225547 223260
52925 223260 221027 219402 218530 218179 218280 219093 220673 222429 223474 223426 222783 222494 223024 223824 223829 222625 220973
52908 220973 219969 219901 220212 220408 220496 220582 220510 220159 219709 219391 219204 219069 219063 219359 220118 221514 223595 225893 227440
52889 227440 227538 226513 225499 225426 226258 227176 227376 226680 225433 223966 222397 220995 220366 220889 222093 223045 223344
52872 223344 223377 223547 223794 223996 224422 225408 226875 228495 230151 231902 233666 235237 236588 237938 239599 241852
52856 241852 244716 247659 249770 250565 250444 250009 249086 246947 243503 239751 236723 234348 231732 228482 225392
52841 225392 223584 223130 222794 221320 218837 216696 215937 216291 216871 217404 218227 219283 219852 219501 218792 218603 219003
52824 219003 219241 218750 217776 216966 216679 216805 217021 217032 216711 216206 215902 216144 216960 218056 218989 219378 219150 218780 219114
52805 219114 220671 223060 225223 226300 226093 224807 222712 220193 217807 215939 214549 213484 212858 212790 212876 212381
52789 212381 211045 209379 208068 207386 207303 207736 208393 208666 208179 207367 207103 207687 208547 209087 209430 210097 211234 212527
52771 212527 213716 214774 215584 215917 215883 216001 216497 216850 216451 215560 215114 215540 216269 216544 216362 216360 217068 218517 220319
52752 220319 221818 222331 221614 220089 218488 217293 216644 216502 216682 216895 217096 217688 219044 220902 222535 223522
52736 223522 224071 224592 225298 226255 227451 228743 230003 231420 233387 235959 238650 240874 242351 242960 242526 241000
52720 241000 238676 235982 233156 230355 227932 226327 225655 225533 225371 224788 223822 222875 222457 222833 223768 224605 224660
52703 224660 223724 222261 221049 220503 220376 220178 219753 219367 219359 219958 221283 223222 225254 226686 227176 226915 226329
52686 226329 225802 225660 226107 227029 227980 228450 228083 226804 225031 223646 223355 223996 224846 225593 226540 227733 228507
52669 228507 228329 227650 227410 227900 228586 228886 228669 228126 227657 227868 229106 230908 232295 232878 233312 234421 236175
52652 236175 237871 239151 240420 242201 244406 246402 247656 248078 247798 246906 245524 243937 242398 240867 239191
52637 239191 237529 236333 235821 235736 235735 235806 236083 236438 236629 236815 237572 239197 241160 242460 242583 241961 241427 241348 241480
52618 241480 241596 241877 242467 242942 242694 241789 240975 240751 240798 240515 239766 238819 237884 237072 236610 236654 236932 236955 236633 236434
52598 236434 236849 237855 238939 239480 239115 237966 236656 236014 236588 238326 240641 242767 244221 245050 245640 246245
52582 246245 246771 247075 247305 247832 248922 250538 252385 254063 255283 256055 256537 256656 256100 254876 253629 253126
52566 253126 253443 253873 253563 252140 249900 247666 246321 246098 246291 245960 244925 243832 243269 243178 243198 243235 243473 244077
52548 244077 245022 246071 246777 246767 246199 245732 245790 246000 245683 244782 243955 243682 243665 243281 242420 241596 241333 241721 242533
52529 242533 243518 244438 245062 245328 245430 245640 246088 246821 247888 249172 250297 250993 251463 252067 252744 253184 253610 254807
52511 254807 257130 259955 262451 264521 266546 268537 270076 270889 270937 270125 268484 266664 265530 265126 264566 263118
52495 263118 260861 258127 255011 251887 249765 249347 250064 250725 250984 251447 252402 253316 253836 254493 255910 257766
52479 257766 259157 259690 259703 259656 259841 260613 262222 264305 266070 267167 268019 269096 270304 271352 272312 273449
52463 273449 274791 276253 277946 279972 282127 284161 286077 287703 288287 287171 284795 282276 280005 277378
52449 277378 274098 270870 268417 266553 264864 263642 263402 263789 263847 263191 262233 261319 260404 259639 259461 259835 259995
52432 259995 259364 258370 257968 258606 259940 261313 262131 262005 260955 259553 258616 258582 259207 259917 260401 260869 261749 263220
52414 263220 265093 267071 268916 270414 271510 272686 274901 278794 284159 290462 297656 305995 315152 324119
52400 324119 332031 338573 343463 346120 346162 343886 339922 334718 328658 322367 316468 311194 306499 302418 299008
52385 299008 296154 293743 291968 291156 291318 292047 292783 293053 292685 292093 292151 293402 295494 297729 300029 302924
52369 302924 306607 310504 313952 316849 319392 321452 322529 322244 320726 318631 316851 316030 316200 316981 318120
52354 318120 319614 321295 322638 323199 323005 322347 321517 320991 321459 323184 325449 327190 328154 328962 330061 331197
52338 331197 332161 333536 336202 340249 344760 348676 351664 354272 357440 361891 367785 374915 383126 392400
52324 392400 402532 412964 423075 432468 440997 448802 456401 464265 472078 478918 484607 490354 497418
52311 497418 505459 513162 520366 528578 539094 551468 564267 576610 588344 599366 609640 619649
52299 619649 629985 640448 650120 658389 665525 672196 678860 685564 691883 696910 699784 700462 699760 698528
52285 698528 697059 695412 693899 692926 692487 692115 691382 690294 689239 688648 688712 689312 690211 691295 692674 694575
52269 694575 697152 700335 703832 707410 711229 715786 721354 727562 733674 739284 744616 750251 756757 764458
52255 764458 773215 782311 790807 798290 805276 812733 821171 830165 838784 846421 853143 859223 864499 868421
52241 868421 870691 871642 871932 872075 872284 872437 872086 870823 868854 866917 865405 863930 862084 860202 858806 857620
52225 857620 855840 853308 850644 848158 845416 842170 839005 836535 834546 832626 831299 831712 834113 837271
52211 837271 839726 841271 842895 845478 848863 852210 855000 857499 860326 863766 867574 871314 874724 877853
52197 877853 881015 884572 888555 892550 896177 899724 903975 909297 915139 920605 925290 929237 932291 933967
52183 933967 934129 933400 932547 931546 929637 926329 922004 917343 912417 906776 900340 893801 888047 883453 879805
52168 879805 876588 873308 869938 867215 866103 866732 868210 869774 871611 874115 876879 879134 880903 882857
52154 882857 885110 887003 888178 889059 889966 890504 890306 889887 890192 891616 893812 896238 898464 900165 901234 901821
52138 901821 902010 901568 900251 898279 896336 895178 895283 896637 898704 900855 903076 906097 910686 917049 925089
52123 925089 934923 946735 960245 974673 989235 1003489 1017269 1030528 1043276 1055580 1067575 1079373
52111 1079373 1090748 1100997 1109449 1116257 1122377 1128553 1134639 1140229 1145618 1151770 1159396 1168368 1178004
52098 1178004 1187672 1197112 1206292 1214968 1222409 1227774 1230815 1231929 1231368 1228804 1223911 1217054 1209019 1200299
52084 1200299 1191054 1181540 1172131 1163026 1154481 1147214 1142018 1138816 1136551 1134211 1131648 1129220 1127036 1124879
52070 1124879 1122684 1120776 1119634 1119575 1120637 1122647 1125418 1128929 1133265 1138285 1143450 1148189 1152489 1156957
52056 1156957 1162196 1168193 1174494 1180763 1186858 1192387 1196715 1199675 1201815 1203541 1204324 1203309 1200445 1196370
52042 1196370 1191357 1185222 1178316 1171689 1165875 1160270 1154172 1147779 1141544 1135257 1128555 1121897 1116088 1111019
52028 1111019 1105762 1099882 1093853 1088043 1082058 1075343 1067893 1060018 1051816 1043221 1034346 1025539 1017261 1009952
52014 1009952 1003782 998429 993360 988279 983117 977625 971442 964639 957725 950858 943380 934393 923552 911094
52000 911094 897353 882627 867385 852218 837496 823269 809618 796932 785626 775576 766061 756433
51988 756433 746763 737551 728889 720274 711339 702306 693410 684228 674098 663026 651768 640977 630596
51975 630596 620074 608939 597256 585785 575658 567602 561570 557289 554947 554936 557179 561219 566826
51962 566826 573975 582293 591104 600010 608862 617028 623356 627074 628237 627076 623521 617774 610845 603965
51948 603965 597658 591821 586474 582070 579245 578566 580381 584633 590943 599061 608986 620405 632338 643742
51934 643742 654202 663582 671289 676546 679358 680526 680454 678475 673754 666493 657729 648074 637124 624194
51920 624194 609308 593347 577498 562738 549592 537988 527369 517248 507840 499962 494256 490665
51908 490665 488710 488073 488728 490727 494147 499168 505952 514400 524100 534457 544843 554717 563759 571826
51894 571826 578763 584472 589245 593723 598392 603417 609180 616368 624882 632977 638266 639642 637732 633565
51880 633565 627567 620044 611857 604056 597210 591530 587377 585185 584916 585887 587117 587779 587417 585874 583024
51865 583024 578601 572411 564605 555539 545502 534855 524300 514611 506086 498698 492762 488859 486988
51852 486988 486319 486043 486009 486212 486160 485158 482917 479512 475015 469557 463596 457716 452235 447206 442678 438756
51836 438756 435562 433270 432053 431900 432691 434438 437039 439817 441868 443125 444487 446539 448626 449641 449241
51821 449241 447757 445405 442321 439096 436561 435060 434523 435087 436956 439687 442278 444134 445474 446649 447530
51806 447530 447748 447116 445662 443496 440795 437690 434155 430266 426550 423773 422270 421709 421449 420951 419955 418606
51790 418606 417324 416246 414936 413078 411245 410351 410386 410393 409811 409152 409055 409313 409234 408499 407124 405063 402466 400141
51772 400141 399156 399929 402156 405551 410239 416332 423493 431134 438852 446478 453829 460551 466200 470357 472630
51757 472630 472653 470279 465919 460475 454652 448334 440961 432636 424542 418013 413386 409962 406905 403930 401270
51742 401270 399405 398854 399946 402589 406358 410907 416209 422407 429547 437462 445764 453888 461274 467599
51728 467599 472750 476581 478904 479922 480485 481564 483315 484826 484958 483313 480352 476791 473187 470015 467684
51713 467684 466215 465048 463425 460997 457995 454902 452104 449876 448505 448271 449247 451207 453850 457109 460991
51698 460991 464918 467502 467511 465254 462636 461594 462576 464687 466927 468900 470536 471663 471952 470998 468370 463846
51682 463846 457812 451302 445459 440911 437644 435400 434143 433995 434710 435418 435324 434688 434653 435845 437579 438876
51666 438876 439850 441468 444151 447361 450533 453633 456520 458497 458988 458189 456624 454423 451645 448996 447610
51651 447610 448113 450373 454163 459510 466172 473165 479173 483344 485472 485490 483078 478002 470750 462517 454314
51636 454314 446192 437651 428789 420589 413895 408528 403826 399761 396959 395666 395243 394862 394367 394271 395184 397334
51620 397334 400340 403272 405132 405521 404762 403318 401364 399009 396553 394185 391646 388593 385203 382059 379487
51605 379487 377330 375373 373694 372548 372205 373014 375311 379128 384196 390341 397673 406295 416025 426484
51591 426484 437151 447199 455594 461779 466126 469442 472103 473875 474512 474263 473862 474210 475996 479409 484234
51576 484234 490422 498453 508885 521653 536114 551787 568684 586851 605833 624796 643168 661133
51564 661133 679611 699676 721858 746101 772490 801777 834858 871920 912337 955120 998819
51553 998819 1041008 1078575 1108860 1130299 1142037 1143542 1134894 1116995 1091083 1058302 1019864 977222
51541 977222 931767 884684 837408 791842 749715 711866 678388 649087 623498 600910 580911
51530 580911 563775 549815 538488 528586 519273 510590 503009 496842 492014 488047 484228 480008 475290
51517 475290 470332 465538 461403 458218 455603 452657 448938 444913 441125 437387 433295 429095 425248 421423
51503 421423 416799 411397 406358 402709 400400 398664 396836 394713 392649 391412 391563 392891 394860 397476
51489 397476 401165 405829 410727 415386 419917 424257 427831 430262 431744 432308 431407 428716 424858 420764 416782
51474 416782 412869 409191 405885 402561 398703 394356 389885 385285 380365 375534 371673 369177 367574 366226
51460 366226 364856 363307 361298 358814 356421 354806 354108 353991 354321 355483 357925 361548 365764 370115 374696
51445 374696 379976 386432 394459 404334 415955 428712 441867 454933 467394 478298 486732 492715 497078
51432 497078 500383 502478 503213 502857 501410 498125 492395 484787 476594 468510 460298 451640 442784 434310 426713
51417 426713 420280 415078 410968 407851 405889 405231 405543 406070 406206 405895 405579 405948 407564 410346 413451 416001
51401 416001 417967 420085 422969 426629 430870 435715 441195 447063 453099 459557 466956 475446 484772 495063
51387 495063 507283 522464 540551 560589 582245 606701 635659 669835 708946 752849 801853
51376 801853 855832 913678 973743 1034191 1092751 1146791 1194056 1232919 1261703 1278498 1282145 1272967
51364 1272967 1252114 1220744 1180261 1132657 1079875 1023299 964484 905783 849323 795849 745527
51353 745527 699405 658866 623812 592767 564894 540666 520338 503073 488111 475641 465734 457422
51341 457422 449739 442946 437773 433954 430424 426570 422444 418090 413542 409316 405956 403074 399636 395345
51327 395345 391115 388032 386322 385413 384484 382856 380393 377712 375589 374097 372674 371046 369496 368140 366620
51312 366620 364883 363644 363519 364064 364281 363855 363337 363178 363186 363084 363075 363574 364657 366071 367571 368943 369790 369659
51294 369659 368458 366596 364598 362739 361155 360186 360313 361688 363903 366403 369104 372398 376526 381094 385352
51279 385352 388883 391801 394290 396193 397221 397365 396828 395665 393877 391922 390671 390509 390756 390440 389489 388724
51263 388724 388624 388663 388085 386905 385798 385208 384976 384681 383993 382687 380685 378222 375799 373897 372814 372616
51247 372616 373026 373440 373400 373142 373338 374245 375391 376310 377221 378640 380525 382197 383091 383276 383215 383258 383450 383638
51229 383638 383601 383174 382356 381384 380707 380855 382044 383751 384916 384893 384099 383453 383313 383376 383529 384158 385403 386674
51211 386674 387328 387474 387666 388081 388481 388849 389563 390927 392872 395106 397282 399074 400414 401583 402805 403893
51195 403893 404634 405346 406514 408007 409252 410160 411203 412449 413307 413508 413665 414397 415490 416464 417394 418468
51179 418468 419169 418741 417283 415679 414466 413451 412349 411085 409337 406536 402655 398574 395330 393284 392162
51164 392162 391544 391134 390916 391241 392470 394343 396066 397203 398167 399587 401547 403727 405952 408132 409850
51149 409850 410502 409907 408524 407031 405842 405009 404386 403816 403241 402591 401538 399631 396845 393895 391739 390760
51133 390760 390567 390536 390383 390311 390791 392168 394333 396817 399286 401865 404791 407923 410859 413444 415768 417640
51117 417640 418529 418294 417680 417752 418909 420729 422673 424570 426369 427787 428548 428852 429334 430459 432107 433809
51101 433809 435303 436762 438510 440625 442867 444892 446479 447589 448308 448778 449150 449514 449863 450191 450555 450953
51085 450953 451159 450823 449869 448666 447678 446991 446334 445498 444564 443726 443057 442476 441801 440873 439878 439489 440323 442149
51067 442149 443998 445373 447040 450210 455106 460803 466516 472555 479778 488360 497402 505711 512754 518841
51053 518841 524534 530097 535636 541627 548938 558191 569272 581668 595030 609061 623020 635825 646738
51040 646738 655636 662574 667432 670173 671110 670614 668700 665134 659801 652737 643891 633100 620389 606224
51026 606224 591518 577472 565194 555185 547107 540187 533938 528484 524307 521854 521401 523046 526614
51013 526614 531570 537138 542620 547626 552094 556180 560127 564199 568688 574034 580809 589386 599493 610239
50999 610239 620726 630600 639909 648696 657046 665404 674326 683788 693117 701833 710196 718656 727126 735231
50985 735231 743051 751076 759429 767618 775156 782085 788716 795151 801286 807090 812609 817684 821830 824513
50971 824513 825714 826333 827990 832260 840048 851589 866803 885436 907007 930906 956616 983784 1012200
50958 1012200 1041798 1072420 1103424 1133790 1162978 1191463 1219974 1248310 1275335 1300058 1322253
50947 1322253 1342074 1359659 1375364 1390037 1404795 1420652 1438218 1457296 1476703 1494888 1510826
50936 1510826 1524022 1533806 1539358 1540630 1538542 1533842 1526310 1515534 1501914 1486193 1468307 1447399
50924 1447399 1422943 1395243 1364804 1331834 1296613 1259965 1222952 1186205 1149855 1114157 1080004
50913 1080004 1048551 1020254 994505 970387 947653 926670 907585 890045 873733 858573 844243
50902 844243 830131 816172 803287 792465 783634 775872 768522 761629 755444 749951 744949 740246 735740
50889 735740 731499 727728 724589 722166 720686 720451 721356 722781 724238 725875 728069 730847 734043 737732 742069
50874 742069 746927 752096 757691 763979 770990 778674 787190 796628 806700 817237 828776 842063 857073
50861 857073 873073 889581 906810 925344 945930 969410 996174 1025791 1057881 1093273 1133473
50850 1133473 1178928 1228700 1281945 1338896 1400085 1465490 1534782 1607538 1682725 1758797 1834945
50839 1834945 1911446 1988015 2062414 2131605 2193839 2248855 2296533 2336489 2368878 2394506 2414006
50828 2414006 2427699 2436500 2442272 2446964 2451915 2458090 2466430 2477688 2492282 2510443 2531905 2555139
50816 2555139 2577349 2595632 2608031 2613386 2610637 2598628 2576252 2542550 2497081 2440661 2375464 2303960
50804 2303960 2227849 2148330 2067088 1986318 1907757 1832191 1760115 1692476 1630627 1575794 1528674
50793 1528674 1489235 1456708 1430083 1408813 1392817 1381671 1374215 1369261 1366377 1365511 1366126 1367236 1368248
50780 1368248 1369135 1369772 1369699 1368724 1367101 1364757 1360886 1354796 1346683 1336943 1325115 1310313 1292567 1272913
50766 1272913 1252068 1229759 1205566 1179794 1153160 1126175 1099260 1073076 1048265 1025140 1003878
50755 1003878 984751 967845 952924 939982 929584 922224 917559 914736 913255 913161 914670 918163 924312
50742 924312 933506 945235 958687 973960 992051 1013603 1038373 1065990 1096478 1129739 1165291 1202950
50730 1202950 1243134 1285924 1330347 1375213 1420172 1465237 1509658 1552164 1592232 1630252 1666256
50719 1666256 1699141 1727352 1749826 1766084 1775933 1779529 1777545 1771096 1761573 1750546 1739459 1729308
50707 1729308 1720853 1715175 1713587 1716747 1724103 1734403 1746572 1760041 1774463 1789236 1803109 1814243
50695 1814243 1820977 1822571 1818881 1809363 1793060 1769865 1741250 1709389 1675972 1642181 1609237 1578277
50683 1578277 1549953 1524657 1503002 1485583 1472495 1463629 1459275 1459914 1465556 1475825 1490632 1510217
50671 1510217 1534570 1563318 1596090 1632404 1671148 1710742 1749874 1787619 1822999 1855245 1884654
50660 1884654 1912427 1939274 1964711 1987995 2009193 2028859 2047161 2063787 2078403 2090844 2101119
50649 2101119 2109639 2117303 2125216 2134521 2146467 2162107 2181733 2205097 2232329 2263984 2299957 2339121
50637 2339121 2380460 2423742 2468360 2512329 2553485 2591339 2626701 2659683 2689176 2714408 2736058
50626 2736058 2755309 2772197 2784986 2790805 2786865 2771653 2745249 2708501 2662356 2608597 2550940 2494452
50614 2494452 2443496 2400535 2366607 2341979 2326019 2317208 2313810 2314208 2316400 2317668 2315124 2306398 2289837
50601 2289837 2264648 2231141 2190276 2142639 2088359 2028316 1964828 1900505 1836709 1773630 1711590
50590 1711590 1651649 1595019 1542393 1493920 1449513 1409152 1373126 1341936 1315743 1294003 1275920
50579 1275920 1261190 1250001 1242265 1237212 1233891 1231873 1231258 1232061 1233875 1236236 1239163 1243093 1248260 1254413
50565 1254413 1261244 1268795 1277198 1286279 1295858 1306409 1319056 1334860 1354307 1377416 1404058 1434153
50553 1434153 1467809 1505167 1545861 1588778 1632753 1677249 1721861 1765449 1806659 1845445 1883313
50542 1883313 1921848 1961683 2003122 2046896 2093706 2143709 2197175 2255196 2318974 2388668 2463558
50531 2463558 2543247 2628176 2719159 2816920 2921935 3034165 3152862 3276987 3405682 3538062
50521 3538062 3672572 3806857 3938048 4062916 4178057 4280425 4367644 4437560 4487808 4516261
50511 4516261 4521685 4503639 4462238 4398755 4316172 4218357 4108635 3989816 3865492 3740512 3620015
50500 3620015 3508533 3409902 3327084 3261591 3213710 3183594 3171590 3177050 3197266 3227956 3264370
50489 3264370 3301630 3334615 3358314 3368389 3361326 3334693 3287929 3222727 3142025 3048581 2944781
50478 2944781 2833409 2717713 2600503 2483693 2368917 2258002 2152430 2052642 1958371 1869640
50468 1869640 1787108 1711474 1642826 1580643 1524196 1472834 1426159 1384159 1347101 1314986 1287096
50457 1287096 1262282 1239830 1219934 1203228 1189998 1179905 1172241 1166267 1161468 1157776 1155542 1155000 1155753
50444 1155753 1157091 1158890 1161893 1166822 1173429 1180732 1188163 1196110 1205145 1214971 1224497 1232990 1240899 1249393
50430 1249393 1259246 1270300 1281842 1293244 1304411 1316070 1329723 1346895 1368051 1392398 1418994
50419 1418994 1447899 1480076 1516363 1556960 1601923 1651691 1706770 1766964 1831224 1898475 1968552
50408 1968552 2042051 2119028 2197999 2276461 2352341 2424580 2492389 2554554 2609713 2656886 2695257
50397 2695257 2723692 2740908 2745864 2737614 2715069 2677635 2626204 2563190 2491543 2414118 2333926 2254318
50385 2254318 2178435 2108496 2045705 1990698 1944024 1906400 1878576 1860794 1852410 1852143 1858547 1869960
50373 1869960 1884102 1898171 1909451 1915625 1914700 1905210 1886674 1859535 1824539 1782575 1735143 1684329
50361 1684329 1631856 1578400 1524171 1469870 1416768 1366049 1318415 1274064 1232640 1193354 1155684
50350 1155684 1119977 1087029 1057027 1029251 1002941 978157 955586 935741 918594 903852 891232
50339 891232 880397 870782 861754 852977 844600 837089 830898 826201 822752 819985 817432 815178 813766 813614
50325 813614 814677 816785 820065 824811 831135 839097 849074 861613 876729 893500 910351 925625 938070
50312 938070 947158 953087 956271 956890 955120 951734 948037 945061 943034 941724 941075 941379 942990 945882 949355
50297 949355 952320 954248 955809 958196 961705 965391 968207 970040 971453 972897 974596 976943 980584 986128
50283 986128 993811 1003141 1012645 1020279 1024532 1025101 1022455 1017089 1009531 1000770 992104 984515 978378 973709
50269 973709 970412 968351 967469 967820 969293 971328 973142 974263 974792 975212 976038 977550 979673 982141 984715
50254 984715 987115 988844 989486 989274 988926 988660 987842 986014 983870 982648 982753 983600 984767 986712 990211 995609
50238 995609 1002799 1011586 1021893 1033920 1048353 1066140 1087800 1113006 1141016 1171405 1204206 1239447
50226 1239447 1276771 1315583 1355323 1395291 1434201 1470294 1502293 1530228 1555046 1577545 1597954
50215 1597954 1616298 1632349 1645026 1652566 1653799 1648717 1637344 1618638 1591376 1555847 1514003 1468109
50203 1468109 1419969 1371201 1323373 1277659 1234995 1196563 1163363 1135191 1110831 1089388 1070631
50192 1070631 1053700 1036547 1017422 996363 974471 952207 929229 905604 882274 860227 839904
50181 839904 821590 805846 793178 783454 775842 769312 763257 757755 753179 749564 746546 744018 742394
50168 742394 741887 741827 741264 740153 739391 739607 740431 741187 741964 743642 747008 752020 757928 763949 769828 775780
50152 775780 782030 788558 795318 802373 809539 816123 821434 825482 828772 831373 832754 832707 832033 831853 832487
50137 832487 833417 834299 835628 838334 842992 849494 857288 865816 874840 884455 894734 905399 916064 926844
50123 926844 938520 951902 967282 984755 1004961 1029037 1057712 1090804 1127865 1169168 1215820
50112 1215820 1269021 1329401 1396818 1470322 1548204 1628376 1708955 1788461 1865557 1938992 2008052
50101 2008052 2072995 2134793 2194226 2250960 2303259 2348647 2385018 2411089 2425727 2427185 2413657
50090 2413657 2384746 2341963 2287577 2223425 2151048 2072487 1990282 1906821 1824068 1743732 1667179
50079 1667179 1595193 1528233 1466924 1411938 1363406 1320891 1283949 1252275 1225230 1201733 1180891
50068 1180891 1162321 1145630 1129959 1114504 1099281 1084943 1071896 1059935 1048714 1038126 1028018
50057 1028018 1017820 1006857 995113 983468 972978 963914 955684 947667 939872 932603 925872 919571 914089
50044 914089 910161 907968 906866 906241 906239 907353 909651 912872 917019 922283 928440 934904 941512 948869 957615
50029 957615 967574 977840 987550 996369 1004292 1011211 1016822 1020874 1023428 1024802 1025255 1024811 1023329 1020624
50015 1020624 1016506 1010934 1004331 997572 991425 986023 981004 976078 971284 966837 963011 960216 958993 959923
50001 959923 963658 970946 982378 998177 1018416 1043261 1072661 1105967 1142372 1181755 1224485 1270242
49989 1270242 1317600 1365101 1412171 1458401 1502392 1542143 1576555 1605994 1631305 1652869 1670785
49978 1670785 1685410 1697176 1706038 1711311 1711910 1706581 1694077 1673383 1643871 1605334 1558215 1504035
49966 1504035 1445317 1384684 1323942 1264164 1206545 1152776 1104443 1062254 1026094 995686 970960
49955 970960 951786 937609 927555 920864 917100 916021 917391 920923 926146 932165 937683 941498 943048
49942 943048 942489 940311 936989 932764 927434 920300 910633 898376 884170 868500 851049 831307 809795
49929 809795 788263 768412 750628 734228 718764 704672 692641 682802 674829 668564 664089 661290
49917 661290 659743 659128 659437 660597 662227 663997 666031 668694 672154 676449 681878 688887 697505 707209 717485
49902 717485 728353 740197 753248 767327 781936 796437 810188 822614 833212 841596 847653 851555
49890 851555 853367 852688 848988 842333 833396 822621 809864 795158 779403 763714 748288 732560 716449
49877 716449 700776 686288 672956 660562 649431 640015 632174 625510 620160 616547 614415 612897 611684
49864 611684 611410 612556 614681 617267 620791 626208 633696 642672 652970 665188 679668 695755 712354
49851 712354 728684 744161 758016 769585 778864 786378 792530 797264 800229 801040 799484 795649 789756
49838 789756 781811 771668 759642 746799 734350 722970 712850 704094 696651 690130 684206 679088 675220
49825 675220 672617 670999 670467 671561 674628 679619 686454 694999 704639 714564 724743 735952 748443 761149
49811 761149 772771 783169 792993 802235 809929 815318 818632 820449 820777 819085 815035 808892 801258 792544
49797 792544 782704 771533 759386 747528 737358 729080 721329 712477 702262 691927 682787 675121 668589
49784 668589 663258 659583 657460 655973 654350 652729 651642 651165 651068 651455 652679 654786 657718 661985 668375
49769 668375 676861 686435 696220 706070 715807 724615 731816 737667 742756 747004 749984 751867 753196 753796
49755 753796 752702 749272 743691 736251 726861 715604 703285 690964 679229 668247 658201 649285 641460
49742 641460 634594 628797 624352 621344 619535 618529 617881 617150 616143 615195 614977 615887 617695 619847 622091
49727 622091 624715 628198 632782 638419 645005 652504 660855 669959 679828 690594 702251 714456 726661
49714 726661 738338 748971 757965 764785 769200 771299 771257 769113 764776 758238 749905 740663 731389 722342
49700 722342 713278 704267 696083 689508 684467 680246 676330 672666 669193 665720 662432 660076 659312 660108 662044
49685 662044 665034 669323 674789 680703 686499 692663 700458 710689 723005 736585 751168 766933 783479
49672 783479 799527 813824 825890 835621 842597 846332 847042 845835 844113 842938 842711 843091 843385 843231 842709
49657 842709 841557 838596 832451 822700 809914 794810 777955 760143 742431 725641 710306 697050
49645 697050 686376 677978 670901 664665 659677 656286 654074 652498 651714 652111 653315 654359 654803 655136 655884
49630 655884 656683 656451 654357 650458 645446 639945 634214 628441 623027 618321 614320 610923 608300 606534 605059
49615 605059 603107 600844 599485 599959 601855 603985 605589 606658 607528 608576 610075 611940 613780 615468 617374
49600 617374 619665 621720 622780 623068 623701 625493 628166 630758 632448 633055 633113 633543 634941 637089 639331 641322
49584 641322 643192 645086 646928 648601 650057 651270 652404 653959 656344 659306 662232 665111 668710 673606
49570 673606 679565 686206 693809 702914 713363 724277 734960 745268 755027 763636 770526 775663 779226
49557 779226 780995 780445 777453 772597 766730 760520 754488 749201 745134 742356 740462 738886 737323 736020
49543 736020 735591 736343 737730 738762 739046 739129 739597 740241 740592 740960 742333 745222 749214 753833 759314 766222
49527 766222 774690 784478 795554 808246 822797 838945 855899 872568 887870 901014 911605 919640
49515 919640 925558 930177 934278 938178 941906 945717 950007 954631 958737 961494 962637 962077 959399 954127
49501 954127 946312 936445 924933 911999 898066 883943 870509 858300 847351 837368 828117 819684
49489 819684 812267 805850 800348 795983 793065 791370 790196 789186 788581 788483 788453 788183 787971 788101 788288 788303 788613
49472 788613 789694 791136 792306 793574 795956 799569 803407 806757 809992 813674 817659 821447 824774 827393
49458 827393 828807 828760 827711 826338 824733 822430 819015 814449 808924 802779 796462 790320 784432 778779 773500
49443 773500 768806 764668 760738 756648 752403 748534 745814 744702 745044 746312 748040 750044 752543 756249
49429 756249 762056 770216 779983 790406 801332 813244 826337 840359 855283 871345 888038 903531
49417 903531 915530 922606 924681 922715 918257 913001 908312 905000 903508 904065 906645 910995 916881 924204
49403 924204 932866 942757 953844 966096 979355 993525 1008696 1024657 1040467 1055087 1068453 1081272
49391 1081272 1093622 1104401 1112426 1117457 1119758 1119286 1115893 1109979 1102338 1093500 1083564 1072555 1060654
49378 1060654 1048345 1036523 1026152 1017540 1010270 1004121 999603 997299 997176 999021 1003047 1009304 1016708
49365 1016708 1023445 1028319 1031248 1032607 1032697 1031851 1030401 1028351 1025447 1021596 1016895 1011319 1004903 998256 992438
49350 992438 988169 985450 983943 983337 983370 983923 985150 987145 989422 991131 991829 991665 990744 988849 985923 982374
49334 982374 978582 974430 969582 963979 957826 951400 945066 939288 934361 930303 927098 924881 923743 923540
49320 923540 923979 924733 925488 926225 927487 929883 933131 936009 937649 938512 939702 941599 943725 945832 948470
49305 948470 952228 956832 961375 965340 969079 973249 978067 983402 989463 996907 1006036 1016214 1026440 1036297
49291 1036297 1045921 1055317 1064412 1073668 1083820 1094713 1105136 1114227 1122398 1130369 1137946 1144478 1149960
49278 1149960 1154708 1158213 1159280 1157356 1152938 1146659 1138851 1130128 1121463 1113306 1105372 1097733 1091341 1086852
49264 1086852 1083653 1080835 1078649 1078087 1079350 1081707 1084864 1089576 1096675 1106180 1117621 1130619 1144819
49251 1144819 1159676 1174638 1189145 1202163 1212121 1217671 1218270 1213791 1204133 1189764 1172340 1154058
49239 1154058 1136295 1119288 1103096 1088330 1075745 1065585 1057643 1051763 1047927 1045946 1045240 1044998 1044541
49226 1044541 1043640 1042643 1042185 1042704 1044198 1046406 1049076 1051968 1054692 1056780 1058046 1058818 1059648 1060754 1061843
49211 1061843 1062629 1063374 1064705 1066959 1070083 1074235 1080029 1087860 1097329 1107810 1119302 1132119 1145815
49198 1145815 1159114 1171143 1182199 1192923 1203190 1212285 1219979 1226931 1233980 1241356 1248572 1254847 1259614
49185 1259614 1262863 1265106 1266992 1268997 1271496 1274971 1279958 1286888 1296098 1307918 1322580 1340238 1361346
49172 1361346 1386864 1417618 1453131 1491245 1528982 1563672 1593250 1615902 1630107 1635450 1633288 1626272
49160 1626272 1616956 1606830 1596598 1587005 1578988 1572986 1568486 1564449 1560108 1555368 1550715 1546839 1544073
49147 1544073 1541997 1539869 1537698 1536640 1537921 1541494 1546142 1550828 1555569 1561021 1567750 1576067 1586067 1597363
49133 1597363 1608935 1619747 1629637 1639436 1650105 1661824 1673949 1685791 1697299 1708962 1721216 1734187
49121 1734187 1747968 1762783 1778687 1795402 1812808 1831419 1851977 1874728 1899619 1927206 1958861
49110 1958861 1995947 2039336 2089921 2148816 2216177 2290011 2366922 2444334 2521719 2599518 2676901
49099 2676901 2750385 2814292 2862792 2892296 2902494 2895223 2872505 2835855 2787100 2728934 2664180
49088 2664180 2594935 2522848 2449907 2378495 2310948 2249465 2196108 2152033 2116549 2087560 2063231
49077 2063231 2042933 2026460 2012946 2001056 1989915 1979359 1969400 1959914 1950842 1942279 1934239 1926582
49065 1926582 1919206 1912150 1905497 1899421 1894334 1890676 1888492 1887391 1886976 1887124 1887829 1889061 1890912 1893599 1897132
49050 1897132 1901220 1905739 1911079 1917687 1925319 1933095 1940396 1947438 1954843 1962864 1971427 1980987 1992888 2008365
49036 2008365 2027064 2046979 2066104 2083902 2100836 2116819 2130817 2141972 2150495 2157149 2162409 2166505
49024 2166505 2169797 2172550 2174490 2175139 2174545 2173353 2172257 2171802 2172596 2175171 2179517 2185209 2192162 2200836 2211412
49009 2211412 2223088 2234615 2245470 2256220 2267729 2280204 2292998 2305136 2315975 2325545 2334451 2343416
48997 2343416 2352696 2361701 2369217 2374269 2376979 2378558 2380280 2382458 2384441 2385455 2385297 2384310 2382933 2381345
48983 2381345 2379437 2377073 2374386 2371705 2369095 2366162 2362589 2358794 2355684 2353716 2352471 2351217 2349476 2346943
48969 2346943 2343343 2338872 2334523 2331393 2329574 2328160 2326479 2324929 2324399 2325193 2326945 2329449 2333091 2338449
48955 2338449 2345752 2354916 2365827 2378421 2392676 2408661 2426435 2445735 2465959 2486738 2508344 2531239
48943 2531239 2555331 2580028 2604975 2630340 2656355 2683002 2710348 2738846 2769042 2801178 2835202
48932 2835202 2870926 2908059 2946397 2986156 3027827 3071496 3116634 3162836 3210414 3259818 3310747
48921 3310747 3362329 3414104 3466351 3519415 3573042 3626479 3678986 3730227 3780309 3829363 3877009
48910 3877009 3922490 3965545 4006902 4047477 4087330 4125847 4162731 4198232 4232463 4265095 4295785
48899 4295785 4324402 4350782 4374872 4397242 4418763 4439410 4457893 4472959 4484786 4494663 4503548 4511223
48887 4511223 4516604 4518452 4515894 4508709 4497235 4481915 4462968 4440582 4415250 4387721 4358573 4327830
48875 4327830 4294950 4259265 4220624 4179505 4136295 4090661 4042090 3990920 3938269 3884977 3831302
48864 3831302 3777789 3725578 3675372 3626773 3579273 3533366 3489969 3449196 3410527 3373951 3340114
48853 3340114 3309391 3281539 3256276 3233455 3212561 3192830 3174240 3157786 3144381 3133925 3125852
48842 3125852 3120135 3117182 3116892 3118462 3121268 3125653 3132572 3142521 3154947 3168777 3183497 3199528 3217482
48829 3217482 3237207 3257749 3278140 3298039 3317769 3338061 3359760 3383358 3408642 3434910 3461502
$$ [...]
##END NTUPLES=NMR SPECTRUM
##END=
