
##TITLE=UV1225_M6_1234-1212_50_7231073_4BOEm63b0W
##JCAMPDX= 6.0         $$ Bruker NMR JCAMP-DX V2.0
##DATA TYPE= NMR SPECTRUM
##DATA CLASS= NTUPLES
##ORIGIN= BRUKER
##OWNER= Administrator
$$ 1.72 TOPSPIN		Version 2.1
$$ 2013-01-26 02:20:15.201 -0500  Administrator@X
$$ Compression mode = diff/dup
##.OBSERVE FREQUENCY= 400.02188249412
##.OBSERVE NUCLEUS= ^1H
##.ACQUISITION MODE= SIMULTANEOUS (DQD)
##.ACQUISITION SCHEME= undefined
##.AVERAGES= 64
##.DIGITISER RES= 22
##SPECTROMETER/DATA SYSTEM= spect
##.PULSE SEQUENCE= noesygpps1d.comp
##.SOLVENT NAME= COFFEE_meoh
##.SHIFT REFERENCE= INTERNAL, COFFEE_meoh, 1, 14.96113
##AUDIT TRAIL= $$ (NUMBER, WHEN, WHO, WHERE, PROCESS, VERSION, WHAT)
$$ ##TITLE= Audit trail, TOPSPIN		Version 2.1
$$ ##JCAMPDX= 5.01
$$ ##ORIGIN= Bruker BioSpin GmbH
$$ ##OWNER= Administrator
$$ $$ E:\/data/COFFEE/nmr/UV1225_M6_1234-1212_50_7231073_4BOEm63b0W/42/pdata/1/auditp.txt
$$ ##AUDIT TRAIL=  $$ (NUMBER, WHEN, WHO, WHERE, PROCESS, VERSION, WHAT)
(   1,<2013-01-26 02:20:09.451 -0500>,<Administrator>,<X>,<go>,<TOPSPIN 2.1>,
      <created by zg
	started at 2013-01-26 02:08:39.045 -0500,
	POWCHK enabled, PULCHK disabled,
       configuration hash MD5:
       86 BA 57 50 F2 9D 5C 9B 26 00 A9 28 5F 66 2E 89
       data hash MD5: 64K
       46 EE 87 DD 0E 71 5C FA CB BB A4 28 F2 1A 67 1E>)
(   2,<2013-01-26 02:20:12.467 -0500>,<Administrator>,<X>,<proc1d>,<TOPSPIN 2.1>,
      <Start of raw data processing
       efp LB = 0.3 FT_mod = 6 PKNL = 1 PHC0 = 0 PHC1 = 0 SI = 128K 
       data hash MD5: 128K
       72 7C 19 A0 AF 6D 13 28 3B 57 BE 43 CE C4 9C 9A>)
(   3,<2013-01-26 02:20:13.514 -0500>,<Administrator>,<X>,<proc1d>,<TOPSPIN 2.1>,
      <pk PHC0 = -79.04663 PHC1 = 0 
       data hash MD5: 128K
       A6 84 71 8B 88 CA 29 1E AB 94 DC 3E D5 F3 F1 02>)
(   4,<2013-01-26 02:20:14.139 -0500>,<Administrator>,<X>,<proc1d>,<TOPSPIN 2.1>,
      <abs ABSG = 1 
       data hash MD5: 128K
       46 63 F6 41 CF 15 6A EE EB 29 60 63 C8 D6 68 67>)
(   5,<2013-01-26 02:20:14.311 -0500>,<Administrator>,<X>,<proc1d>,<TOPSPIN 2.1>,
      <abs ABSG = 2 
       data hash MD5: 128K
       11 16 63 2E A2 7E 8B 64 1F 1D CC E1 81 B2 65 58>)
(   6,<2013-01-26 02:20:14.498 -0500>,<Administrator>,<X>,<proc1d>,<TOPSPIN 2.1>,
      <abs ABSG = 3 
       data hash MD5: 128K
       55 B1 60 FA FA 31 B4 55 C8 42 3D A5 2E 2D D5 90>)
(   7,<2013-01-26 02:20:14.686 -0500>,<Administrator>,<X>,<proc1d>,<TOPSPIN 2.1>,
      <abs ABSG = 4 
       data hash MD5: 128K
       8D 2E 79 FE 30 A3 5D 5B 67 A5 E4 C1 83 63 28 6A>)
(   8,<2013-01-26 02:20:14.873 -0500>,<Administrator>,<X>,<proc1d>,<TOPSPIN 2.1>,
      <abs ABSG = 5 
       data hash MD5: 128K
       DD DC E6 62 1C 33 F9 C9 C3 21 AF F3 0E F7 DA 10>)
$$ ##END=
$$ 
$$ $$ hash MD5
$$ $$ 7E 79 4E 97 EA 73 FF A4 A5 5D F5 A3 CD 94 21 C8
##$RELAX= 
##$RELAX= 
##$RELAX= 
##$RELAX= 
##$RELAX= 
##$RELAX= 
##$RELAX= 
##$RELAX= 
$$ Bruker specific parameters
$$ --------------------------
##$DU= <E:\>
##$EXPNO= 42
$$ [...]
##$TP07= 0
##$TPNAME0= <>
##$TPNAME1= <>
##$TPNAME2= <>
##$TPNAME3= <>
##$TPNAME4= <>
##$TPNAME5= <>
##$TPNAME6= <>
##$TPNAME7= <>
##$TPOAL= (0..7)
0.5 0.5 0.5 0.5 0.5 0.5 0.5 0.5
##$TPOFFS= (0..7)
0 0 0 0 0 0 0 0
##$TUNHIN= 0
##$TUNHOUT= 0
##$TUNXOUT= 0
##$USERA1= <user>
##$USERA2= <user>
##$USERA3= <user>
##$USERA4= <user>
##$USERA5= <user>
##$V9= 5
##$VALIST= <valist>
##$VCLIST= <CCCCCCCCCCCCCCC>
##$VD= 0
##$VDLIST= <DDDDDDDDDDDDDDD>
##$VPLIST= <PPPPPPPPPPPPPPP>
##$VTLIST= <TTTTTTTTTTTTTTT>
##$WBST= 2048
##$WBSW= 25
##$XGAIN= (0..3)
0 0 0 0
##$XL= 0
##$YL= 0
##$YMAX_a= 6114375
##$YMIN_a= -12850976
##$ZGOPTNS= <>
##$ZL1= 120
##$ZL2= 120
##$ZL3= 120
##$ZL4= 120
##$ABSF1= 14.96113
##$ABSF2= -5.597052
##$ABSG= 5
##$ABSL= 3
##$ALPHA= 0
##$AQORDER= 0
##$ASSFAC= 0
##$ASSFACI= 0
##$ASSFACX= 0
##$ASSWID= 0
##$AUNMP= <proc_prof1d_extract.lims>
##$AXLEFT= 0
##$AXNAME= <>
##$AXNUC= <1H>
##$AXRIGHT= 0
##$AXTYPE= 0
##$AXUNIT= <>
##$AZFE= 0.1
##$AZFW= 0.1
##$BCFW= 0
##$BC_mod= 0
##$BYTORDP= 0
##$COROFFS= 0
##$CY= 15
##$DATMOD= 1
##$DC= 0
##$DFILT= <>
##$DTYPP= 0
##$F1P= 0
##$F2P= 0
##$FCOR= 0.5
##$FTSIZE= 131072
##$FT_mod= 6
##$GAMMA= 0
##$GB= 0
##$INTBC= 1
##$INTSCL= 1
##$ISEN= 128
##$LB= 0.3
##$LEV0= 0
##$LPBIN= 0
##$MAXI= 10000
##$MC2= 0
##$MEAN= 0
##$ME_mod= 0
##$MI= 0
##$NCOEF= 0
##$NC_proc= -2
##$NLEV= 6
##$NOISF1= 0
##$NOISF2= 0
##$NSP= 0
##$NTH_PI= 0
##$NZP= 0
##$OFFSET= 14.96113
##$PC= 1
##$PHC0= -79.04663
##$PHC1= 0
##$PH_mod= 1
##$PKNL= yes
##$PPARMOD= 0
##$PPDIAG= 0
##$PPIPTYP= 0
##$PPMPNUM= 2147483647
##$PPRESOL= 1
##$PSCAL= 4
##$PSIGN= 0
##$PYNMP= <proc.py>
##$REVERSE= no
##$SF= 400.020009583305
##$SI= 131072
##$SIGF1= 0
##$SIGF2= 0
##$SINO= 400
##$SIOLD= 131072
##$SPECTYP= <>
##$SREGLST= <1H.CDCl3>
##$SSB= 0
##$STSI= 131072
##$STSR= 0
##$SW_p= 8223.68421052631
##$SYMM= 0
##$S_DEV= 0
##$TDeff= 65536
##$TDoff= 0
##$TI= <>
##$TILT= no
##$TM1= 0
##$TM2= 0
##$TOPLEV= 0
##$USERP1= <user>
##$USERP2= <user>
##$USERP3= <user>
##$USERP4= <user>
##$USERP5= <user>
##$WDW= 1
##$XDIM= 131072
##$YMAX_p= 414972733
##$YMIN_p= -13081
##$CURPLOT= <Network HP LaserJet P1505>
##$CURPRIN= <$Network HP LaserJet P1505>
##$DFORMAT= <normdp>
##$LAYOUT= <+/1D_H.xwp>
##$LFORMAT= <normlp>
##$PFORMAT= <normpl>
##$SURQMSG= 1
$$ End of Bruker specific parameters
$$ ---------------------------------
##NTUPLES= NMR SPECTRUM
##VAR_NAME=  FREQUENCY,     SPECTRUM/REAL,   SPECTRUM/IMAG
##SYMBOL=    X,             R,               I
##VAR_TYPE=  INDEPENDENT,   DEPENDENT,       DEPENDENT
##VAR_FORM=  AFFN,          ASDF,            ASDF
##VAR_DIM=   131072,        131072,          131072
##UNITS=     HZ,            ARBITRARY UNITS, ARBITRARY UNITS
##FACTOR=    0.0627417313425164, 1,          1
##FIRST=     8223.62146879497, -3009,        -60771
##LAST=      0,             -362,            -61219
##MIN=       0,             -13081,          0
##MAX=       8223.62146879497, 414972733,    0
$$ Real data points
##PAGE= N=1
##DATA TABLE= (X++(R..R)), XYDATA
$$ [...]
63868D88395J0423J2980J5458J7627J9832K2510K5634K8646L0912L2148L2493
63857G37058L2341L1977L1338L0121K8410K6910K6204K5787K4442K1712J8401
63846A034701J5330J2246Q550M461O47k948p074j1992j7127k1870k6069k9613
63834I59242l2207l3731l4360l4298l3857l3670l4109l4559l4007l2455l0837
63823E91152k9449k7450k4402k1356j9572j8880j8104j6698j5096j3676j2290
63812C74179j0890r863r400r018q059o542n164m516m452m335l846l272l006l079
63798B88737l354l862m562n001m739m011l469l305l141k775k437k226j893j378
63784B42584j067j236j632j864j815j481q22q3J96j78o47n58l0J86l77j350j925
$$ plain form
63868 488395 498818 511798 527256 544883 564715 587225 612859 641505 672417 704565 737058
63857 737058 769399 801376 832714 862835 891245 918155 944359 970146 994588 1016300 1034701
63846 1034701 1050031 1062277 1070827 1075288 1075935 1072987 1065913 1053921 1036794 1014924 988855 959242
63834 959242 927035 893304 858944 824646 790789 757119 723010 688451 654444 621989 591152
63823 591152 561703 534253 509851 488495 468923 450043 431939 415241 400145 386469 374179
63812 374179 363289 353426 344026 335008 326949 320407 315243 310727 306275 301940 298094 294822 291816 288737
63798 288737 285383 281521 276959 271958 267219 263208 259739 256434 253293 250518 248081 245855 243962 242584
63784 242584 241517 240281 238649 236785 234970 233489 232667 232584 232780 232602 231955 231397 231367 231553 231176 229826 227901
63767B27901j716j164j021j406j686j390q71o69o67m49j59k87o84o67j15L31K26
63750B15507j73m90n93l03N03J312J374Q78Q81J709K380K118J597J866K743L131
63734B34440K556J625J146J331J796J963J670J532K351L911N024N022M646M873
63720B73886N542N798N481N170N098M803L863K467J156L42l1m99j607l156m252
63705C04061m322l715l086k591k093j651j300p59J18Q79J060R04R85J388J801
63690B91679K169K637L033L040K798K725K820K680K201J757J606J549J342R97
63676C23033O31K62r3l01j79L86J317K220K638K531K375K529K762K623K123J649
63660C46506J307O63p28k673m344n029m929m993n664o128n300l493k313k693l723
$$ plain form
63767 227901 226185 225021 224000 222594 220908 219518 218647 217978 217311 216862 216703 216416 215732 215065 214950 215281 215507
63750 215507 215334 214844 214251 213948 214451 215763 217137 218015 218896 220605 222985 225103 226700 228566 231309 234440
63734 234440 236996 238621 239767 241098 242894 244857 246527 248059 250410 254321 259345 264367 269013 273886
63720 273886 279428 285226 290707 295877 300975 305778 309641 312108 313264 313606 313575 313076 311469 308313 304061
63705 304061 299739 296024 292938 290347 288254 286603 285303 284544 284662 285541 286601 287505 288490 289878 291679
63690 291679 293848 296485 299518 302558 305356 308081 310901 313581 315782 317539 319145 320694 322036 323033
63676 323033 323664 323926 323833 323532 323353 323739 325056 327276 329914 332445 334820 337349 340111 342734 344857 346506
63660 346506 347813 348476 347748 345075 340731 335702 330773 325780 320116 313988 308688 305195 302882 300189 296466
63645B96466l833k622r98P1L61K53K72P10J404J941K202K459K866L243L461L675
63629C11931L974M303M869O047P615Q653Q667Q308Q568R678J1189J2697J4055
63616D20554J5248J6488J8087J9988K1817K3635K5977K8886L1565L3539L5313
63605F91097L7227L8327L7312L4129K9765K4777J8915J2018M576k499q182j1655
63593I05807j2944j2968j2606j2099j1765j2470j4573j7100j8995k0626k2942
63582G36719k5463k6522k5453k3271k1049j8768j6135j3402j0995r011p499o490
63570E32661n450l484n49K151L537L971M641N995P306P737P331O922P223Q183
63556E88175R245J0082J0895J2000J3563J5807J9045K3168K7549L1833L6319M1128
$$ plain form
63645 296466 292633 290011 289013 289084 289445 289698 289970 290680 292084 294025 296227 298686 301552 304795 308256 311931
63629 311931 315905 320208 325077 331124 338739 347392 356059 364367 372935 382613 393802 406499 420554
63616 420554 435802 452290 470377 490365 512182 535817 561794 590680 622245 655784 691097
63605 691097 728324 766651 803963 838092 867857 892634 911549 923567 928143 925644 917462 905807
63593 905807 892863 879895 867289 855190 843425 830955 816382 799282 780287 759661 736719
63582 736719 711256 684734 659281 636010 614961 596193 580058 566656 555661 546650 539151 532661
63570 532661 527211 523727 523178 525329 528866 532837 537478 543473 550779 558516 565847 572769 579992 588175
63556 588175 597420 607502 618397 630397 643960 659767 678812 701980 729529 761362 797681 838809
63544H38809M5447M8226M9065M7635M2688L2995J9332M649q052j7374k3117k5322
63532A054981k4290k0995j6858j3154j0804j0320j1713j4598j8558k3186k7809
63521H62696l1537l3786l4555l4175l3019l1455k9747k7891k5697k3125k0441
63510E37268j7967j5801j3767j1700r831q751q652q781q132o707n500n125n181
63497D11373n111m883m458l516k275j754k366l082k782j788j125q99n00R7N06
63482C77437R76K069L366L862L593L704M650N475N250M233L193K323J361K25q79
63467D20838j792k560l433m614n818o399o193n806n651n242m125k878k342k348
63453C61637k113j489p49L53K083L652L997L566L939N637P608Q942R846J0678
$$ plain form
63544 838809 884256 932482 981547 1029182 1071870 1104865 1124197 1128846 1120794 1103420 1080303 1054981
63532 1054981 1030691 1009696 992838 979684 968880 958560 946847 932249 913691 890505 862696
63521 862696 831159 797373 762818 728643 695624 664169 634422 606531 580834 557709 537268
63510 537268 519301 503500 489733 478033 468202 459451 450799 442018 433886 427179 421679 416554 411373
63497 411373 406262 401379 396921 393405 391130 389376 387010 383928 381146 379358 378233 377334 376834 376931 377437
63482 377437 378413 380482 383848 387710 391303 395007 399657 405132 410382 414615 417808 420131 421492 421717 420838
63467 420838 419046 416486 413053 408439 402621 396222 390029 384223 378572 373330 369205 366327 363985 361637
63453 361637 359524 358035 357286 357639 359722 363374 367371 370937 374876 380513 388121 397063 406909 417587
63439D17587J1408J2374J4328J7290K0471K3672K7632L2477L6939L9552L9666
63428F93396L6867L0726K1934J2741N435R14q10K83L904R075J4907K1249K7953
63415H78574L4089L8587M1196M2223M1627L8797L3039K4229J3470L052m976j0370
63403A173537j4174j6786j7677j7040j6401j6948j8467k0453k3195k6894l0729
63392I54773l3726l5777l7029l7062l5541l3046l0343k7464k4227k1086j8561
63381F20911j6391j4067j1738r784p933n633l012o51J266K954M472N767P078Q671
63367E81910J0441J2147J3726J5109J6243J7580J9903K3145K6158K8266L0281
63356G94909L3255L6849L9878M1897M3194M3477M1604L6689K8943J9498R868J352
$$ plain form
63439 417587 428995 441369 455697 472987 493458 517130 544762 577239 614178 653730 693396
63428 693396 730263 760989 782923 795664 801099 802013 801203 801486 805390 814465 829372 850621 878574
63415 878574 912663 951250 992446 1034669 1076296 1115093 1148132 1172361 1185831 1188883 1183907 1173537
63403 1173537 1159363 1142577 1124900 1107860 1091459 1074511 1056044 1035591 1012396 985502 954773
63392 954773 921047 885270 848241 811179 775638 742592 712249 684785 660558 639472 620911
63381 620911 604520 590453 578715 568931 560998 555365 552353 551702 552968 555922 560394 566161 573239 581910
63367 581910 592351 604498 618224 633333 649576 667156 687059 710204 736362 764628 794909
63356 794909 828164 865013 904891 946788 989982 1033459 1075063 1111752 1140695 1160193 1170061 1171413
63344A171413n507j0771j4356j5994j6161j6191j6946j8012j8882k0084k2363
63333I96146k5465k8592l1500l4127l5660l5166l2881l0008k7359k4909k2347
63322F68132j9215j4938r633m535q07J756L747M293J558m842j2944k0097k4628
63309E67847k5997k4506k1322j7910j5035j2684j0920r959r389q317o667n426
63297C99715n229n412n107m478m231m319m101l560l482m217m899m507l327k708
63283C40138l347m383m537l626k450j582r90o40o15p02n60l83n89r02o64p0j1
63266C14087m69l41O65J303O75l67o25k40J08N66J411J971J594R55J015J415J364
63249C25087J332K175L203L027K022J909K946L593L268L327M662O186O749O929
$$ plain form
63344 1171413 1165906 1155135 1140779 1124785 1108624 1092433 1075487 1057475 1038593 1018509 996146
63333 996146 970681 942089 910589 876462 840802 805636 772755 742747 715388 690479 668132
63322 668132 648917 633979 624346 619811 619004 620760 624507 628800 630358 625516 612572 592475 567847
63309 567847 541850 517344 496022 478112 463077 450393 439473 429514 420125 411808 405141 399715
63297 399715 394486 389074 383967 379489 375258 370939 366838 363278 359796 355579 350680 346173 342846 340138
63283 340138 336791 332408 327871 324245 321795 320213 319223 318583 317968 317266 316706 316323 315734 314832 314168 314098 314087
63266 314087 313618 313277 313942 315245 315920 315553 314928 314688 314796 315362 316773 318744 320338 321293 322308 323723 325087
63249 325087 326419 328594 331797 334824 336846 338755 341701 345294 348562 351889 356551 362737 369486 376415
63235C76415P742Q872R447R623J0142J0968J1522J1798J2177J2521J2393J1991
63223E05611J1991J2545J3084J3074J2569J2091J2301J3487J5019J5620J4621
63212F52013J2725J1181J0390R776Q662O849M405J434j858n133q063j0381j1969
63199F80031j3030j3985j4956j5549j5351j4470j3268j1741r552o710l811j424
63187E46184N55K630M960P186R006J0501J1791J2700J3246J4013J5486J7151J7888
63174F83297J7400J6547J6126J5994J5636J4963J4128J3157J2228J1643J1098
63163H42217R483O138J770k420o077r572j3090j6567j9992k3063k5033k5707k6054
63150F92033k6811k7098k5630k2869k0583j9363j8095j5996j3708j1906j0159
$$ plain form
63235 376415 384157 393029 402476 412099 422241 433209 444731 456529 468706 481227 493620 505611
63223 505611 517602 530147 543231 556305 568874 580965 593266 606753 621772 637392 652013
63212 652013 664738 675919 686309 696085 704747 711596 716001 717435 715577 710444 702381 692000 680031
63199 680031 667001 653016 638060 622511 607160 592690 579422 567681 558129 551419 547608 546184
63187 546184 546739 549369 554329 561515 570521 581022 592813 605513 618759 632772 648258 665409 683297
63174 683297 700697 717244 733370 749364 765000 779963 794091 807248 819476 831119 842217
63163 842217 851700 857838 859608 857188 851111 841539 828449 811882 791890 768827 743794 718087 692033
63150 692033 665222 638124 612494 589625 569042 549679 531584 515588 501880 489974 479815
63139D79815p928n702m319l863l838l879l714k977j662l33N34J057J505J824J941
63124D48461K086K460K957L496M104M537M354L719L498M105M779M552L528K654
63110D99290K524K901L243L229K861K430K262K356K344K006J558J330J376J562
63096E31272J781J883J729J455J501K105K994L689L919L669L085K471K128K072
63082E65753K074J967J647R05k75j291j400q18o77j504k398k282j422r57j113
63067E58209q66N02K288L336L565L912M936O202P187Q153R695J1872J4281J6679
63053F49951J8964K0802K1983K3063K4823K7060K8810K9896L1215L3131L4646
63042I44344L4891L4430L4161L3830L2733L1265L0455L0410L0422L0387L0738
$$ plain form
63139 479815 471887 466185 461866 458003 454165 450286 446572 443595 441933 441600 442134 443191 444696 446520 448461
63124 448461 450547 453007 455964 459460 463564 468101 472455 476174 479672 483777 488556 493108 496636 499290
63110 499290 501814 504715 507958 511187 514048 516478 518740 521096 523440 525446 527004 528334 529710 531272
63096 531272 533053 534936 536665 538120 539621 541726 544720 548409 552328 555997 559082 561553 563681 565753
63082 565753 567827 569794 571441 572346 572071 570780 569380 568562 567885 566381 563983 561701 560279 559322 558209
63067 558209 557343 557845 560133 563469 567034 570946 575882 582084 589271 597424 607119 618991 633272 649951
63053 649951 668915 689717 711700 734763 759586 786646 815456 845352 876567 909698 944344
63042 944344 979235 1013665 1047826 1081656 1114389 1145654 1176109 1206519 1236941 1267328 1298066
63031A298066L1102L0377K8366K6105K4083K1255J6378R557J922n657j2972k0053
63019A448529k6792l2858l7791m1306m3461m4245m3322m0627l6926l3134k9291
63008A038776k4942k0269j5966j2040p724k669K554P309J1515J5269J8527K1305
62996A031645K3689K5603K7047K8413K9884L0832L0628K9770K9193K8763K7634
62985A343101K5952K4808K4344K3246K0513J6556J2079P029J113n566j2844k0615
62973A459716k8213l4631l9622m3751m7146m9306n0236n0488m9854m7510m3886
62962I75073m0773l8847l6643l2909k8544k5069k2585k0487j9011j8561j8479
62951F73165j7898j7136j6894j6768j5964j4834j4322j4291j3790j2590j1237
$$ plain form
63031 1298066 1329168 1359545 1387911 1414016 1438099 1459354 1475732 1485289 1487211 1481554 1468582 1448529
63019 1448529 1421737 1388879 1351088 1309782 1266321 1222076 1178754 1138127 1101201 1068067 1038776
63008 1038776 1013834 993565 977599 965559 957835 955166 957720 965029 976544 991813 1010340 1031645
62996 1031645 1055334 1080937 1107984 1136397 1166281 1197113 1227741 1257511 1286704 1315467 1343101
62985 1343101 1369053 1393861 1418205 1441451 1461964 1478520 1490599 1497628 1498741 1493175 1480331 1459716
62973 1459716 1431503 1396872 1357250 1313499 1266353 1217047 1166811 1116323 1066469 1018959 975073
62962 975073 934300 895453 858810 825901 797357 772288 749703 729216 710205 691644 673165
62951 673165 655267 638131 621237 604469 588505 573671 559349 545058 531268 518678 507441
62940E07441r875q368p228p142p616p400o229n065m582m500m462m501m496m071
62926D21906l249k497j980j453r26p32q77r38p09m05k58l52p34j230j364j030
62910D03172r01j505k231k066j078l04k32l77l04j39P7O76J679K525K837K915
62894D04744L163L487L606L542L482L361K931K160J407J063J033P86R7m40j10
62879D34312P87J144M55p05j730k685l553l748l053k269k179k513k730l070l863
62864D04600m477m124l313l269m094m649m182l061j854p62j7Q4k30l43j32o3l21
62847C69793n33m43j73K22Q08J280J145M85j2j0P6k35q91j499j703j315m46M40
62829C66989R22R86Q17M63R7J48O79R92N64jL02J432K322K261J502P54P02J744
$$ plain form
62940 507441 497566 489198 481970 474828 467212 459812 453583 448518 443936 439436 434974 430473 425977 421906
62926 421906 418657 416160 414180 412727 411801 411069 410192 409254 408545 408140 407882 407530 406796 405566 404202 403172
62910 403172 402271 400766 398535 396469 395391 395087 394855 394478 394174 394035 394112 394788 396467 398992 401829 404744
62894 404744 407907 411394 415000 418542 422024 425385 428316 430476 431883 432946 433979 434765 434862 434422 434312
62879 434312 435099 436243 436698 435993 434263 431578 428025 424277 421224 418955 416776 414263 411533 408463 404600
62864 404600 400123 395999 392686 389417 385323 380674 376492 373431 371577 370815 370798 370882 370652 370309 370177 370114 369793
62847 369793 369260 368817 368644 368866 369674 370954 372099 372584 372572 372562 372638 372403 371512 370013 368310 366995 366549 366989
62829 366989 367911 368897 369714 370177 370274 370422 371101 372093 372657 372656 372958 374390 376712 378973 380475 381229 381931 383675
62811C83675L456M555M249L342L074L334L092K389K364L393M489M912N033N216
62797D36573N091M585M535N492O715P165O870O649P029Q029R564J1486J3610J6046
62783E49439J9090K2498K5505K7897L0449L3801L7486M0657M3278M5838M8325
62772I24263N0192N1209N1603N1368M9874M6400M0802L3608K5600J7362R078P11
62760A352070p745j6190k4348l1655l7457m1623m4759m7450m9495n0319m9884
62749I51145m8663m6844m4278m1099l7830l4705l1497k8152k5072k2616k0681
62738E69708j8881j6884j4598j2330j0608r545q663p708p165p269p087n608l415
62725D39947k074j983j980j206q2Q06J594K400K884L093L821N411P090Q085Q633
$$ plain form
62811 383675 387131 391686 395935 399277 402351 405685 408777 411166 413530 416923 421412 426324 431357 436573
62797 436573 441664 446249 450784 456276 462991 470156 477026 483675 490704 498733 508297 519783 533393 549439
62783 549439 568529 591027 616532 644429 674878 708679 746165 786822 830100 875938 924263
62772 924263 974455 1025664 1077267 1128635 1178509 1224909 1265711 1299319 1324919 1342281 1351359 1352070
62760 1352070 1344325 1328135 1303787 1272132 1234675 1193052 1148293 1100843 1051348 1001029 951145
62749 951145 902482 855638 811360 770261 732431 697726 666229 638077 613005 590389 569708
62738 569708 550827 533943 519345 507015 496407 486862 478199 470491 463326 456057 448970 443362 439947
62725 439947 437873 435890 433910 432704 432622 433428 435022 437422 440306 443399 447220 452631 459721 467806 476439
62710D76439R254R923J0631J1939J4098J6380J8131J9926K2697K6201K9416L2077
62698F97112L4813L7872M0812M3463M6378M9977N3891N7362N9838O0949O0370
62687A242837N8035N4305M9571M3695L5962K5859J3950J784r371j9518k9374l8991
62675A428744m7494n4112n8840o1856o3028o2330o0280n7529n4361n0868m7220
62664H10826m3501l9651l5838l2456k9560k6735k3755k0956j8625j6560j4544
62653E08645j2794j1587j0835j0275r717q868p532o154n556n769n866n317m683
62640D03692m455m031k749j163k82l0M15J028Q82l53j820k574k487j938j333j072
62624C81730j422k105k492k371k060j763j234k62R15J798J956J250J06n02J08
$$ plain form
62710 476439 485693 495616 506247 518186 532284 548664 566795 586721 609418 635619 665035 697112
62698 697112 731925 769797 810609 854072 900450 950427 1004318 1061680 1121518 1182467 1242837
62687 1242837 1300872 1355177 1404748 1448443 1484405 1510264 1524214 1525998 1516627 1497109 1467735 1428744
62675 1428744 1381250 1327138 1268298 1206442 1143414 1081084 1020804 963275 908914 858046 810826
62664 810826 767325 727674 691836 659380 629820 603085 579330 558374 539749 523189 508645
62653 508645 495851 484264 473429 463154 453437 444569 437037 430883 425327 419558 413692 408375 403692
62640 403692 399237 395206 392457 391294 391012 390982 391397 392425 393307 392954 391134 388560 386073 384135 382802 381730
62624 381730 380308 378203 375711 373340 371280 369517 368283 368021 368936 370734 372690 373940 374046 373544 373652
62609C73652J474K400K299J687J398J801K910M598O390P533P799P943Q976J1027
62595D41887J3209J4621J5234J5802J7119J9340K1939K4187K5672K6338K6147
62584F61495K4921K2592J9434J5857J2000P635K650k579p410j1564j5247j8578
62572G11206k1137k2386k2372k1792k1334k1257k1429k1443k0683j8794j6202
62561D82377j3849j2266j1186j0134r058q127p302o380n265m038k931k303k365
62548C87173k737k658j853q30j44K73O95R94Q80N47N06Q76J312J599J825J957
62532C90415J682Q79j0l08K87J507K792L734M283M714N396O573Q243J0188J2132
62517D52507J3887J5405J6708J7968J9658K2278K5693K8989L1324L2784L4037
$$ plain form
62609 373652 375126 377526 379825 381512 382910 384711 387621 392219 398609 406142 413941 421884 430860 441887
62595 441887 455096 469717 484951 500753 517872 537212 559151 583338 609010 635348 661495
62584 661495 686416 709008 728442 744299 756299 763934 766584 764005 756595 745031 729784 711206
62572 711206 690069 667683 645311 623519 602185 580928 559499 538056 517373 498579 482377
62561 482377 468528 456262 445076 434942 425884 417757 410455 404075 398810 394772 391841 389538 387173
62548 387173 384436 381778 379925 379095 378951 379224 379919 380913 381793 382340 382846 383722 385034 386633 388458 390415
62532 390415 392097 392976 392966 392658 392945 394452 397244 400978 405261 409975 415371 421944 430187 440375 452507
62517 452507 466394 481799 498507 516475 536133 558411 584104 613093 644417 677201 711238
62506G11238L5324L6250L6441L5769L3934L0466K5402J9495J3497P612J838l616
62494I83650q454j2461j5335j6798j7056j6674j5704j3534r934n789k171Q73M051
62481H54664P548J0741J3124J4857J6261J7137J6816J4690J0700N440j54n366
62469I76458j0061j4588j9377k4582k9800l4104l6620l7240l6650l5604l4396
62458F63436l2994l1306k9209k6629k3738k0818j7870j4760j1760r436p796o184
62446D30936m332k908k471k407j681l45N14L32j30J89J385K725L625L988L671
62431D33091K305n2k432l710l809l683l969m285m139l934m327n053n245m751m220
62416C81787l906l336k317j437j191j299j321j322j522j790j887j825j657j315
$$ plain form
62506 711238 746562 782812 819253 855022 888956 919422 944824 964319 977816 985428 987266 983650
62494 983650 975196 962735 947400 930602 913546 896872 881168 867634 857700 851911 849740 850613 854664
62481 854664 862212 872953 886077 900934 917195 934332 951148 965838 976538 981978 981824 976458
62469 976458 966397 951809 932432 907850 878050 843946 807326 770086 733436 697832 663436
62458 663436 630442 599136 569927 543298 519560 498742 480872 466112 454352 444916 437120 430936
62446 430936 426604 423696 421225 418818 417137 416792 417306 417638 417508 417697 419082 421807 425432 429420 433091
62431 433091 435396 435344 432912 429202 425393 421710 417741 413456 409317 405383 401056 396003 390758 386007 381787
62416 381787 377881 374545 372228 370791 369600 368301 366980 365658 364136 362346 360459 358634 356977 355662
62402C55662r36q13p79j89J157K536L157K970K438K017K176L253M788N651N324
62387C88412M549M220M249M198M364N341O818P760P757P524P947R110J0299J0731
62373D83279J0297R743R874J0591J1097J1212J1765J3409J5686J7857K0011K2705
62361F47526K5888K9055L2236L6131M1209M7115N2964N7916O1670O4512O6689
62350A162911O7600O5997O1159N3451M3632L2320K0363Q912j371j0608j8830k5642
62338A459894l1172l6369m1664m6106m8681m9682m9892m9204m7163m4236m1359
62327I74366l8605l5476l2141k9337k7216k5411k3968k3205k2823k2156k1222
62316F72806k0548k0130j9426j8314j7142j5980j4688j3505j2665j1653r822p603
$$ plain form
62402 355662 354726 353913 353134 352945 354102 356638 359795 362765 365203 367220 369396 372649 377437 383088 388412
62387 388412 392961 397181 401430 405628 409992 415333 422151 429911 437668 445192 453139 462249 472548 483279
62373 483279 493576 503319 513193 523784 534881 546093 557858 571267 586953 604810 624821 647526
62361 647526 673414 702469 734705 770836 812045 859160 912124 970040 1031710 1096222 1162911
62350 1162911 1230511 1296508 1357667 1411118 1454750 1487070 1507433 1516345 1514974 1504366 1485536 1459894
62338 1459894 1428722 1392353 1350689 1304583 1255902 1206220 1156328 1107124 1059961 1015725 974366
62327 974366 935761 900285 868144 838807 811591 786180 762212 739007 716184 694028 672806
62316 672806 652258 632128 612702 594388 577246 561266 546578 533073 520408 508755 498933 491330
62304D91330o056n414n014m460l811k881j589p24j032j659r81R63K402K421K048
62289D65543K295K703K597K428K842L480L710L738M072M506M481M003L491L202
62275E13091L307M039N205O093O331O388O799P530Q527J0174J2566J5042J7147
62262F22239J9512K2996K7424L1945L6354M1263M7029N3151N8759O3279O6620
62251A090571O8942P0121O9330O5495N8324M8602L7304K5026J2505R24q964j7597
62239A520583k5854l3835m1023m7289n2930n7778o1085o2460o2369o1339n9162
62228I55459n5338n0103m4646m0080l6439l2941k9123k5374k2204j9459j6691
62217E83061j4017j2049j1023j0422r616q485p330o517o207o205o013n357m523
$$ plain form
62304 491330 485274 479860 474846 470386 466575 463694 462105 461381 460349 458690 457709 458672 461074 463495 465543
62289 465543 467838 470541 473138 475566 478408 481888 485598 489336 493408 497914 502395 506398 509889 513091
62275 513091 516398 520437 525642 531735 538066 544454 551253 558783 567310 577484 590050 605092 622239
62262 622239 641751 664747 692171 724116 760470 801733 848762 901913 960672 1023951 1090571
62251 1090571 1159513 1229634 1298964 1364459 1422783 1471385 1508689 1533715 1546220 1547144 1538180 1520583
62239 1520583 1494729 1460894 1419871 1372582 1319652 1261874 1200789 1138329 1075960 1014621 955459
62228 955459 900121 850018 805372 765292 728853 695912 666789 641415 619211 599752 583061
62217 583061 569044 556995 545972 535550 525934 517449 510119 503602 497395 491190 485177 479820 475297
62204D75297l856l146j964n11N13Q78J063J526K250L159M379N833P136Q102Q946
62189E09605R905J0963J2101J3330J4389J4882J4850J4774J4890J4981J4916J4922
62177F74508J5134J5307J5229J5006J4865J4985J5619J6985J9089K1910K5633
62166H64270L0215L4961L9233M3278M7535N1203N2651N1321M8218M4094L8255
62155A345234K9829J9392Q665j004r270j6369k2626k8159l2812l6594m0055m3665
62143A172566m6823m8255m7548m5538m3014l9976l6379l2646k8933k4862k0521
62132G58071j6886j4504j2608j0299p845o058n035m400m153m384m496l698k017
62119F61688q6J810L772N635P079Q300R864J1898J3841J5015J5066J3994J2029
$$ plain form
62204 475297 471441 468295 466331 465820 466333 467211 468274 469800 472050 475209 479588 485421 492557 500659 509605
62189 509605 519510 530473 542574 555904 570293 585175 600025 614799 629689 644670 659586 674508
62177 674508 689642 704949 720178 735184 750049 765034 780653 797638 816727 838637 864270
62166 864270 894485 929446 968679 1011957 1059492 1110695 1163346 1214667 1262885 1306979 1345234
62155 1345234 1375063 1394455 1403120 1402116 1392846 1376477 1353851 1325692 1292880 1256286 1216231 1172566
62143 1172566 1125743 1077488 1029940 984402 941388 901412 865033 832387 803454 778592 758071
62132 758071 741185 726681 714073 703774 695929 689871 684836 680436 676283 671899 667403 663705 661688
62119 661688 661602 663412 667184 672819 679898 688198 698062 709960 723801 738816 753882 767876 779905
62106G79905R354N874J700k062l840l249j590j98Q50J743J646m10l788o660p991
62091G71284q166p706o506m496k101L25K878N579P939R464J0333J1260J2778J4810
62077H17675J6896J8794K0690K2677K4321K5133K5452K6172K7512K8739K9341
62066A083402K9765L0591L1675L2640L3550L4495L5057L4773L3620L1504K7879
62055A438951K2500J6084R502K935l598r531j4371j8502k2515k6302k9741l3531
62043A331881l8191m2743m5668m6887m7466m7615m6426m3655m0355l7446l4785
62032H60644l2028k9307k6676k3852k0922j8435j6487j4583j2660j1332j0729
62021F43633j0057q851p771p493p666p645p571p859q168p767o681n613m942m423
$$ plain form
62106 779905 789259 795133 796833 794771 790931 787682 786092 785894 786744 788487 790133 789723 785935 779275 771284
62091 771284 763118 755412 748906 744410 742309 742634 745512 751091 759030 768494 778827 790087 802865 817675
62077 817675 834571 853365 874055 896732 921053 946186 971638 997810 1025322 1054061 1083402
62066 1083402 1113167 1143758 1175433 1208073 1241623 1276118 1311175 1345948 1379568 1411072 1438951
62055 1438951 1461451 1477535 1487037 1489972 1486374 1476843 1462472 1443970 1421455 1395153 1365412 1331881
62043 1331881 1293690 1250947 1205279 1158392 1110926 1063311 1016885 973230 932875 895429 860644
62032 860644 828616 799309 772633 748781 727859 709424 692937 678354 665694 654362 643633
62021 643633 633576 624725 616954 609461 601795 594150 586579 578720 570552 562785 556104 550491 545549 541126
62007E41126l793l020j984m55J465L300M649N438N685N332M414L195J972Q56j56
61992E68024r61j350j346j442k176l509m914o193p741r622j0957j0889r877r222
61978D87825r292r072p692n672m258m013m546n139n220m549l410k461k006j681
61964D18814j166q32j132j581j124L93J772J843Q47KM5P47J679K752L853M639
61948D31551N100N887P513R534J1120J2229J3542J5311J7052J8457J9795K1202
61936E88293K2363K3310K4653K6483K7742K7535K6377K5307K4222K2215J9311
61925H57811J6605J4565J2276Q816M492K37l559p037j0148j2514j3749j3512j1568
61912H42715q204m400j087J775M946Q819J2852J6155J8343J9578J9987J9329J7268
$$ plain form
62007 541126 537333 534313 532329 531874 533339 536639 541288 546726 552411 557743 562157 565352 567324 568180 568024
61992 568024 567063 565713 564367 562925 560749 557240 552326 546133 538392 528770 517813 506924 497047 487825
61978 487825 478533 469461 461769 456097 451839 447826 443280 438141 432921 428372 424962 422501 420495 418814
61964 418814 417648 416816 415684 414103 412979 413372 415144 416987 417834 417836 417881 418628 420307 423059 426912 431551
61948 431551 436651 442538 450051 459585 470705 482934 496476 511787 528839 547296 567091 588293
61936 588293 610656 633966 658619 685102 712844 740379 766756 792063 816285 838500 857811
61925 857811 874416 888981 901257 910073 914565 914802 911243 904206 894058 881544 867795 854283 842715
61912 842715 834511 830111 829024 830799 835745 844564 857416 873571 891914 911492 931479 950808 968076
61899I68076J3792R191L835j861p367j2211j6284j9707k2390k4063k4674k4436
61887H41901k3427k1594j9345j7558j6638j5996j4920j3598j2741j2508j2331
61876F61245j1749j0835r846q892q007p209o387n357m010k372n95R56J937K502
61862E91381L289M640O216P644R098J0882J2800J4575J6501J9044K2063K5099
61850G43232K8228L1807L5467L8256L9869M0928M1777M1712L9890L6441L2157
61839A149764K7437K2009J5520Q030k4p942j4777j9528k1622k1256j9107j5684
61827A102820j1095n624j24M658Q959J3428J7661K0126J9887J7513J3727Q106
61815A210042R7r287j7996k4989l0694l5521l9037m0875m1483m1529m1091l9819
$$ plain form
61899 968076 981868 991059 994894 993033 985666 973455 957171 937464 915074 891011 866337 841901
61887 841901 818474 796880 777535 759977 743339 727343 712423 698825 686084 673576 661245
61876 661245 649496 638661 628815 619923 611916 604707 598320 592963 588953 586581 585986 586942 588879 591381
61862 591381 594670 599310 605526 613170 622268 633150 645950 660525 677026 696070 718133 743232
61850 743232 771460 803267 838734 876990 916859 957787 999564 1041276 1081166 1117607 1149764
61839 1149764 1177201 1199210 1214730 1222760 1222736 1214794 1200017 1180489 1158867 1137611 1118504 1102820
61827 1102820 1091725 1086101 1085977 1090635 1099594 1113022 1130683 1150809 1170696 1188209 1201936 1210042
61815 1210042 1210139 1200852 1182856 1157867 1127173 1091652 1052615 1011740 970257 928728 887637 847818
61803H47818l7480l4194l0463k7014k4275k1998j9690j7312j5073j2818j0325
61792E97176q085o923o693o171m572k562j445j729k844l804l895l086k009j371
61778E41987j276j339j315j234j035n81o7J47Q3P4J26j11o73j160j323j222p83
61761E30298J82J446K429K952L322L639L668L488L471L403K490O30j073j629j327
61746E57389j110j303j565j624j485j214j040j352k136k733k578j901j255o86
61732E35407R9R77J482J505J439J552J606J260O09K06N70J625K667L001K660K256
61716E58921K147K112J913J732J754J698J127M0j169k211l077l803m341m660m829
61701E47354m980n193n328n049m195l139k498k443k585k558k471k553k688k518
$$ plain form
61803 847818 810338 776144 745681 718667 694392 672394 652704 635392 620319 607501 597176
61792 597176 589091 582168 575475 569304 564732 562170 560725 558996 556152 552348 548453 545367 543358 541987
61778 541987 540711 539372 538057 536823 535788 535207 535140 535287 535370 535444 535570 535459 534786 533626 532303 531081 530298
61761 530298 530480 531926 534355 537307 540629 544268 547936 551424 554895 558298 560788 561418 560345 558716 557389
61746 557389 556279 554976 553411 551787 550302 549088 548048 546696 544560 541827 539249 537348 536093 535407
61732 535407 535506 536483 537965 539470 540909 542461 544067 545327 545936 546142 546712 548337 551004 554005 556665 558921
61716 558921 561068 563180 565093 566825 568579 570277 571404 571444 570275 568064 564987 561184 556843 552183 547354
61701 547354 542374 537181 531853 526804 522609 519470 516972 514529 511944 509386 506915 504362 501674 499156
61687D99156j947j306j002j070j107p30j25J18k06o15o64o16r03j239q84K40J277
61670D88377J357M00r78j877j586k28J082J254M61k17k67j33j02J91P95R96M56
61653D89981O3P86K163K794K167J213J045J807K803L315L100K504K222K678L504
61638E22145L840L176J780K45j057k047k683l051l494m257m978m975m247l738
61624D96659m109m674m267k927j835j534j338p29l27o77j140r02m19p04j697k472
61608D66908k800l313m230n046n550o110o780p084o866o485o073n400m637m275
61594C92259m163l557k464j938k575l544l705l015k254j929k039k431k872k966
61580C52807k462j492m58P5m63k030l525l665k448j149p61j070j400j532j608
$$ plain form
61687 499156 497209 495903 494901 493831 492724 491994 491869 491987 491781 491166 490502 489886 488983 487744 486860 487100 488377
61670 488377 489734 490134 489156 487279 485693 485465 486547 487801 488262 488045 487778 487645 487543 487734 488529 489525 489981
61653 489981 490044 490830 492993 495787 497954 499167 500212 502019 504822 508137 511237 513741 515963 518641 522145
61638 522145 525985 529161 530941 531186 530129 528082 525399 522348 518854 514597 509619 504644 500397 496659
61624 496659 492550 487876 483609 480682 478847 477313 475975 475246 474919 474242 473102 472200 471781 471077 469380 466908
61608 466908 464108 460795 456565 451519 445969 439859 433079 425995 419129 412644 406571 401171 396534 392259
61594 392259 388096 384539 382075 380137 377562 374018 370313 367298 365044 363115 361076 358645 355773 352807
61580 352807 350345 348853 348395 348470 348007 345977 342452 338787 336339 335190 334429 333359 331959 330427 328819
61565C28819j760k062k335j983o80P86J169L51n86r36r85q98j81J194K224K110
61549C24247J262M93Jk64m3O84J241J051L71k03m62l30L71J458K317K807L465
61532C38466M354M578L548J994R83O51N84O47O74P4j345k746l290l294l523l898
61516C38457l797l195k571k048j423q00m13j14L66Q83J171J305J373J083L21m05
61500C30193o60p51j064j297j029n50l84m47l95l17l60j88M17Q59N13k46n41k17
61482C23536K60O66J014J111R15Q83J204J208L98m65l57L89O05R7k26J53P90J153
61464C33334J103N87k20o44k74J58l21j335j559o25M89J021J246J556J764J731
61448C38011J763J989K048J767J461J306R73L11j42K64J457K665L163K963K784
$$ plain form
61565 328819 327059 324997 322662 320679 319999 320785 321954 322305 321719 320783 319798 318900 318719 319913 322137 324247
61549 324247 325509 326002 326003 325739 325696 326380 327621 328672 329043 328840 328378 328048 328419 329877 332194 335001 338466
61532 338466 342820 347398 350946 352940 353923 354574 355158 355805 356479 356553 355208 352462 349172 345878 342355 338457
61516 338457 334660 331465 328894 326846 325423 324623 324210 324096 324462 325345 326516 327821 329194 330277 330598 330193
61500 330193 329533 328782 327718 326421 325392 324842 324458 324011 323616 323299 322939 322751 323168 324027 324540 324294 323753 323536
61482 323536 323796 324462 325476 326587 327502 328385 329589 330797 331195 330730 330373 330762 331367 331464 331238 331391 332181 333334
61464 333334 334437 335024 334804 334160 333886 334044 333723 332388 330829 330204 330693 331714 332960 334516 336280 338011
61448 338011 339774 341763 343811 345578 347039 348345 349318 349629 349487 349751 351208 353873 357036 359999 362783
61433C62783L261M115M532M334M170M196L545J806J97J66J328K053J743J302J437
61418D00968J766J828J924K439L114L324K731J505K46m37o38j095k034k589k127
61403D10925j471j816k826l145k489j929k102k394k172j659j290j080r98j092
61389C84462j078n47K17N16L38L84Q26J032P22M52O72J123J437J596J607J460
61373C95219J544K249L097L191K659K587L293L798L364K472J821J400J139J423
61359D29256K226K692K378K114K780L918M517M592N039O204P529Q488R140R713
61345E00586J0225J0587J0713J0514R977R190Q178O890N434M115L148K536K093
61332E94186J447J75j577k848k873k336k775m669o726p426o562n022l678k842
$$ plain form
61433 362783 366044 370159 374691 379025 383195 387391 390936 392742 392939 393105 394433 396486 398229 399531 400968
61418 400968 402734 404562 406486 408925 412039 415363 418094 419599 419845 419408 418770 417675 415641 413052 410925
61403 410925 409454 407638 404812 401667 399178 397249 395147 392753 390581 388922 387632 386552 385554 384462
61389 384462 383384 382837 383054 383570 383908 384292 385118 386150 386872 387324 387996 389119 390556 392152 393759 395219
61373 395219 396763 399012 402109 405300 407959 410546 413839 417637 421001 423473 425294 426694 427833 429256
61359 429256 431482 434174 436552 438666 441446 445364 449881 454473 459512 465716 473245 481733 490873 500586
61345 500586 510811 521398 532111 542625 552602 561792 569970 576860 582294 586409 589557 592093 594186
61332 594186 595633 595808 594231 591383 588510 586174 583399 578730 572004 564578 558016 552994 549316 546474
61318E46474k389j984j414q47m99j37O13J580K230K514K821L189L378L698M829
61303E64056O655Q257R288J0315J1464J1802J0719Q863O980M715J518j982m588
61290F48062o066p118q108q704q646q062p099n857m658l770k944j747l15P29J137
61275E76834J342J886K912M258N615O522O605O076N688N939O486O621O283O205
61261F49272O903P897Q337Q244Q547R784J1400J2633J3389J3748J3173J1059P824
61248G82210M659K180l2k582n564q617j1156j2564j2724j2286j1858j1175r686
61235F90805p781o586o491o681o245n044l443j851p03j96N4N83J347K022K809
61220F52599M075N301N458M596L891L878L699K665J528J451K413L402L707L408
$$ plain form
61318 546474 544085 542101 540687 539840 539341 539204 539817 541397 543627 546141 548962 552151 555529 559227 564056
61303 564056 570711 578968 588256 598571 610035 621837 632556 641419 648399 653114 654632 652650 648062
61290 648062 641996 634878 626770 618066 609420 601358 594259 588402 583744 579974 577030 575283 574968 575697 576834
61275 576834 578176 580062 582974 587232 592847 599369 605974 612050 617738 623677 630163 636784 643067 649272
61261 649272 656175 664072 672409 680653 689200 698984 710384 723017 736406 750154 763327 774386 782210
61248 782210 786869 789049 789017 786435 780871 772254 761098 748534 735810 723524 711666 700491 690805
61235 690805 683024 676438 669947 663266 657021 651977 648534 646683 645980 645784 645838 646421 647768 649790 652599
61220 652599 656674 661975 667433 672029 675920 679798 683497 686162 687690 689141 691554 694956 698663 702071
61206G02071K917K579K490K355J838J135Q98J474K733M655P378J0482J2995J4517
61192G70517J5740J7485J9677K1598K2673K2738K1911K0472J8541J5905J2599
61181I79856R489P515O440N217L618K482K144J742M73j409l312n169p017q597
61167I93472r970j1681j3795j5508j6389j7195j8649k0181k0740k0349j9879j9683
61155G89453j9231j8000j6030j3694j1424r508p855o090m132k369j045O9J155
61142F81299J832J545J39k098m592o574p479p485p189o728n810m587l603k709
61128F25961j001J789M704O918Q784J0905J3046J4712J6175J7999K0036K1713
61116G61741K3001K4290K5605K6621K7347K8100K8875K9243K8898K7942K6611
$$ plain form
61206 702071 704988 707567 710057 712412 714250 715385 716283 717757 720490 725145 732523 743005 756000 770517
61192 770517 786257 803742 823419 845017 867690 890428 912339 932811 951352 967257 979856
61181 979856 989345 996860 1003300 1008517 1012135 1014617 1016761 1018503 1018976 1017567 1014255 1009086 1002069 993472
61167 993472 983502 971821 958026 942518 926129 908934 890285 870104 849364 829015 809136 789453
61155 789453 770222 752222 736192 722498 711074 701566 693711 687621 683489 681120 680075 680144 681299
61142 681299 683131 684676 684815 682717 678125 671551 664072 656587 649398 642670 636860 632273 628670 625961
61128 625961 624960 626749 631453 638371 647155 658060 671106 685818 701993 719992 740028 761741
61116 761741 784742 809032 834637 861258 888605 916705 945580 974823 1003721 1031663 1058274
61105A058274K5001K3065K0740J8107J5471J3115J0995Q768O096K730j455o227
61093A194680j1016j5498j9820k3892k7009k8737k9678l0480l0647k9419k7301
61082I21183k5508k4168k2472k0463j9091j8414j7281j5212j3143j1908j1179
61071G22344j0341r240p667n385l099k116k509k816k071q66Q7J061K330L413M139
61056F87264N228O939Q319Q705Q950J0115J1889J3268J4105J5046J6522J8523
61044H24873K0886K3223K5068K6381K7417K8072K8179K8316K9274L0682L1446
61033A123817L1534L1972L2987L3795L4297L5306L6792L7743L8173L9424M1988
61022A517828M4819M7278M9967N3110N5929N8080N9933O1388O2635O5991P4112
$$ plain form
61105 1058274 1083275 1106340 1127080 1145187 1160658 1173773 1184768 1193536 1199632 1202362 1200907 1194680
61093 1194680 1183664 1168166 1148346 1124454 1097445 1068708 1039030 1008550 977903 948484 921183
61082 921183 895675 871507 849035 828572 809481 791067 773786 758574 745431 733523 722344
61071 722344 712003 702763 695096 689711 686612 684496 681987 679171 677100 676234 676321 677382 679712 683125 687264
61056 687264 692492 699431 707750 716455 725405 735520 747409 760677 774782 789828 806350 824873
61044 824873 845759 868982 894050 920431 947848 975920 1004099 1032415 1061689 1092371 1123817
61033 1123817 1155351 1187323 1220310 1254105 1288402 1323708 1360500 1398243 1436416 1475840 1517828
61022 1517828 1562647 1609925 1659892 1713002 1768931 1827011 1886944 1948332 2010967 2076958 2151070
61011B151070Q6098R8436J10122J23353J38686J53831J68634J87006K12382K45599
61001C675217K89183L48656M27364N25739O48626Q06548J005672J244544J525933
60992A0497482J858794K232460K594388K870336L003300K953002K663885K082703
60984C0756350J252067L74817k68064n02682l71077o1288K42096M20561L76656
60975C2219436J1227o97306j604159k439557k970738l129917k999255k705806
60967A5683925k346198j980208j645862j360322j120669r18262p50123o14591
60959D947690n05162m15293l43903k90758k50865k18200j91273j70585j53815
60950B407836j37870j22996j10663r9598q7662p5882o6937o1052n6644n3663n3106
$$ plain form
61011 2151070 2237168 2335604 2445726 2569079 2707765 2861596 3030230 3217236 3429618 3675217
61001 3675217 3964400 4313056 4740420 5266159 5914785 6721333 7727005 8971549 10497482
60992 10497482 12356276 14588736 17183124 20053460 23056760 26009762 28673647 30756350
60984 30756350 32008417 32383234 32115170 31612488 31241411 31180123 31422219 31842780 32219436
60975 32219436 32230663 31533357 29929198 27489641 24518903 21388986 18389731 15683925
60967 15683925 13337727 11357519 9711657 8351335 7230666 6312404 5562281 4947690
60959 4947690 4442528 4027235 3683332 3392574 3141709 2923509 2732236 2561651 2407836
60950 2407836 2269966 2146970 2036307 1936709 1849047 1773165 1706228 1645176 1588532 1534869 1481763
60939A481763n4121n4552n3842n2922n1909m9986m7124m3999m0790l7485l4595
60928I60438l2217k9360k5539k1941j9684j8161j6418j4766j3585j2062r741p944
60916G39020p810q228p575o231n592n625n360m822m612m366l444k404k170k482
60902F68299k640k987m048n103n227m942n246n844n972o051o751p265o396m796
60888E95031m159m675n075m834m504m132l124j664p31o15p19p71r82j091m46R07
60872E58416K230L064L391L125K385J927K396L423M262M831N449O024O400O828
60858F14151P304P196O432O147P074Q198Q180P260O382N433L905K551K564L519
60844F96296L904L523L636M707N569N075L404J502K40J90J321K746L560L904M585
$$ plain form
60939 1481763 1427642 1373090 1319248 1266326 1214417 1164431 1117307 1073308 1032518 995033 960438
60928 960438 928221 898861 873322 851381 831697 813536 797118 782352 768767 756705 746964 739020
60916 739020 731210 722982 715407 709176 703584 697959 692599 687777 683165 678799 675355 672951 670781 668299
60902 668299 665659 662672 658624 653521 648294 643352 638106 632262 626290 620239 613488 606223 599827 595031
60888 595031 590872 586197 581122 576288 571784 567652 564528 562864 562133 561518 560799 560028 559046 557955 557509 558416
60872 558416 560646 563710 567101 570226 572611 574538 576934 580357 584619 589450 594899 600923 607323 614151
60858 614151 621455 628651 635083 641230 648304 656502 664682 671942 678324 683757 687662 690213 692777 696296
60844 696296 700200 703723 707359 712066 717635 722710 726114 727616 727856 728046 729367 732113 735673 739577 744162
60829G44162N920P605R393J1153J2606J3760J5130J6873J8196J8408J7922J7404
60817I08532J6640J5163J3256J1325Q939N659K165n96k827n245p684r526j1006
60804I44795j2764j4572j5757j6408j6984j7204j6568j5521j4791j4105j2898
60793G77223j1745j1655j2294j2448j1887j1347j0913j0030q852q120p793p234
60781F52905o686o999p936q249p552o733o465o555o801p224p359o679n757n707
60767E56203o489o994o809o487o154n366m455m421n205n612n229m933n114n013
60753D77922m359m042m407m377l287k243k447l194k915j509l38k45o51o76k73
60738D42959n3m36j146j497j111l78rk08m97k62P18K075K900K377P37p36j140
$$ plain form
60829 744162 750082 757687 767080 778233 790839 804599 819729 836602 854798 873206 891128 908532
60817 908532 925172 940335 953591 964916 973855 979514 981679 981083 978256 973011 965327 955801 944795
60804 944795 932031 917459 901702 885294 868310 851106 834538 819017 804226 790121 777223
60793 777223 765478 753823 741529 729081 717194 705847 694934 684904 676052 667932 660139 652905
60781 652905 646219 639220 631284 623035 615483 608750 602285 595730 588929 581705 574346 567667 561910 556203
60767 556203 549714 542720 535911 529424 523270 517904 513449 509028 503823 498211 492982 488049 482935 477922
60753 477922 473563 469521 465114 460737 457450 455207 452760 449566 446651 445142 444804 444559 443908 443232 442959
60738 442959 442906 442470 441324 439827 438716 438338 438329 438121 437624 437362 438080 440155 443055 445432 446169 445433 444293
60721D44293r88j244j859k080j859j893k425k927l079l227l689m280m662m713
60707D05368m489m181l995l846l409k783k593l023l335k933k228j844j643j332
60693C63734j177j269r11K22J096P67K9K35J099J308Q19Q69J852K816L076K892
60677C77457K553K115K024K646L273K954K197K392L625M526M374L766L136K188
60663D19226J031L33Q1l45o69J85K093L542L884M187N248O251O229N515M876M385
60647D66052L913L764L995L999L325K154N86j583l959n545o124o572p324p678
60633D49003p139o293n685m955l786k749k400k427k342k202k035j405k48O77P02
60618D06716J8q41j466j393m19N81L57q52j356m04P85J024P78R11J124P75K01
$$ plain form
60721 444293 443305 442061 440202 438122 436263 434370 431945 429018 425939 422712 419023 414743 410081 405368
60707 405368 400879 396698 392703 388857 385448 382665 380072 377049 373714 370781 368553 366709 365066 363734
60693 363734 362557 361288 360377 360599 361695 362462 362491 362726 363825 365133 365952 366821 368673 371489 374565 377457
60677 377457 380010 382125 384149 386795 390068 393022 395219 397611 401236 405762 410136 413902 417038 419226
60663 419226 420257 420590 420671 420326 419657 419842 421935 425477 429361 433548 438796 445047 451276 456791 461667 466052
60647 466052 469965 473729 477724 481723 485048 487202 487788 486205 482246 476701 470577 464005 456681 449003
60633 449003 441864 435571 429886 424931 421145 418396 415996 413569 411227 409025 406990 405585 405337 406014 406716
60618 406716 406734 405893 404427 403034 402615 403196 403553 402701 401345 400941 401726 402750 403528 404439 405563 406338 406539
60601D06539l6k38q42j276p50M00J184J367J463J748K126K568K950K833K039J129
60585D23204P16P43Q78J075J261J161R41J327K476L476L591L294L326L578L745
60570D54792M343O015Q262R960J0842J1689J3175J5282J7672J9950K1605K2187
60558F15774K1484J9373J5819J1279O547J898l091q431j2961j5291j5127j3350
60546F23923j1086q983o911m135k79L867P093R445J2185J5908J9753K2802K5189
60533G08771K7200K8397K8341K7222K4943K0663J4229P150J061l980q554j2099
60521H63344j3467j2844j1675j0848j0111r214q451p957p435o762o079n178l560
60508G49763j274R69K655L976N342O919Q826J1282J4291J7483K0662K4410K9815
$$ plain form
60601 406539 406503 406265 405423 404147 403397 403797 404981 406348 407811 409559 411685 414253 417203 420036 422075 423204
60585 423204 423920 424663 425541 426616 427877 429038 429979 431306 433782 437258 440849 444143 447469 451047 454792
60570 454792 459135 465150 473412 483372 494214 505903 519078 534360 552032 571982 593587 615774
60558 615774 637258 656631 672450 683729 690276 692174 689083 680652 667691 652400 637273 623923
60546 623923 612837 603854 596943 592808 592529 596396 603489 612934 625119 641027 660780 683582 708771
60533 708771 735971 764368 792709 819931 844874 865537 879766 886916 887977 883997 875443 863344
60521 863344 849877 837033 825358 814510 804399 795185 786734 778777 771342 764580 758501 753323 749763
60508 749763 748489 749458 752113 756089 761431 768350 777176 788458 802749 820232 840894 865304 895119
60495H95119L7395M6334N5056O2664O9484P6005Q1704Q5313Q5867Q2904P6085
60484A653930O5370N1387L4759J5369o651k9371m9725o5820p7673q5683q9722
60473A416170q9999q7402q2496p5351o6842n8784n2101m5981l9598l3570k8886
60462G55160k5394k2267j9137j6010j2878j0188q752q492q146p024o120o587q054
60449E96111r352j0032j0174r552q042o248m798l670k894k941l568l431j936m74
60435E18999m36j022n33R75K016K046J875J923J686R03j19j277k583l409l051
60420E17993k026j565j847j851r57L76J555K431K812K430J558Q16K96k76n85P7
60404E21237J513K495K288J498J159J489J910J848J324R35J264K107K586K284
$$ plain form
60495 895119 932514 978848 1033904 1096568 1166052 1242057 1323761 1409074 1494941 1577845 1653930
60484 1653930 1719300 1770687 1805446 1820815 1814164 1784793 1735068 1669248 1591575 1505892 1416170
60473 1416170 1326171 1238769 1156273 1080922 1014080 955296 903195 857214 817616 784046 755160
60462 755160 729766 707499 688362 672352 659474 649286 640534 632042 623896 616872 610752 604165 596111
60449 596111 586759 576727 566553 557001 548959 542711 537913 534243 531349 528408 524840 521409 519473 518999
60435 518999 518563 517541 517008 517983 519999 522045 523920 525843 527529 528432 528313 527036 524453 521044 517993
60420 517993 515967 514402 512555 510704 509747 510123 511678 514109 516921 519351 520909 521725 522021 521745 521160 521237
60404 521237 522750 525245 527533 529031 530190 531679 533589 535437 536761 537696 538960 541067 543653 545937
60390E45937J817J841K076J934J614J754K373K885L006K844K443J877J591J860
60376E75852K185K009J694K086L234M351M904N070N248N694O500P445P973P818
60362F42063P301O684N722M376L299L012L148L280L820N301P371R457J1822J5101
60348G31757J9251K3856K8908L4331L9226M2636M4513M4893M2705L6701K7196
60337A115973J5775L672q434j9544k8632l5506m0212m1986m0252l6295l2398k9330
60325H22831k6138k2285j8462j5237j2379r819p972o809n774m769m114l550k482
60312F83041j230o70n47M62K789N518Q123J1200J5091J9322K3868K9527L6375
60299H32869M3233M9355N5124O0106O1870N8134M9228L7161K3014O701j1053k7895
$$ plain form
60390 545937 547754 549595 551671 553605 555219 556973 559346 562231 565237 568081 570524 572401 573992 575852
60376 575852 578037 580046 581740 583826 587060 591411 596315 601385 606633 612327 618827 626272 634245 642063
60362 642063 649364 656048 661770 666146 669445 672457 675605 678885 682705 688006 695377 704834 716656 731757
60348 731757 751008 774864 803772 838103 877329 919965 964478 1009371 1052076 1088777 1115973
60337 1115973 1131748 1135420 1126986 1107442 1078810 1043304 1003092 961106 920854 884559 852161 822831
60325 822831 796693 774408 755946 740709 728330 718511 710539 703730 697956 693187 689073 685523 683041
60312 683041 681811 681141 680594 681056 683845 689363 697486 708686 723777 743099 766967 796494 832869
60299 832869 876102 925457 980581 1040687 1102557 1160691 1209919 1247080 1270094 1276795 1265742 1237847
60287A237847m1366n0570n6154n9113n9748n7659n2726m5891l8737l2349k7031
60276G16503k2872j9907j7734j5694j3604j1738j0132q594p373o911o874o344
60264E68726n209m383m294m148l198j863r23l76J30L40k22j222j686j206m52k83
60248E39731p76j248j135n69m0K72M96N23P2n38n17J91O17L00J92J194K641L399
60230E44805L695M532N835O645O796O794O270M395J818L72M39M23n66j266m42
60215E90545J014J426O74J4L15J490L039M284M539L894L355L631M249M412M059
60200F30940L535K863K033J477J537J851J925J865J893J618N34j012k007j922
60186F47130j168m29O0M85R46J151P78J57R8P89J299P84k26n92k13J01J82P60
$$ plain form
60287 1237847 1196481 1145911 1089757 1030644 970896 913237 860511 814620 775883 743534 716503
60276 716503 693631 673724 655990 640296 626692 614954 604822 596228 588855 581944 575070 568726
60264 568726 563517 559134 554840 550692 547494 545631 544708 544332 544462 544802 544580 543358 541672 540466 540014 539731
60248 539731 538955 537707 536572 536003 535963 536235 536731 537254 537326 536788 536271 536462 537079 537379 537571 538765 541406 544805
60230 544805 548500 553032 558867 565512 572308 579102 585372 589767 591585 591957 592396 592819 592253 590987 590545
60215 590545 591559 592985 593659 593673 593988 595478 598517 602801 607340 611234 614589 618220 622469 626881 630940
60200 630940 634475 637338 639371 640848 642385 644236 646161 648026 649919 651537 652071 651059 649052 647130
60186 647130 645962 645533 645593 646078 647024 648175 648953 649110 649208 649997 651296 652080 651854 651262 651049 651150 651332 652092
60168F52092K027L230L875M299M676M546L770K923K232J084q44k888m363n413
60154F71246o305o754o562o164n849n133l639j894n99L94J642L191M697O007P007
60139F51285P384P139O977P521Q412Q751Q240P490P214P440P362O030L411O47
60125G45303j161k217l424m754n232m544l599l193l087k797k316j668o86L64P87
60110G07776N63N73J244J944K197K488L170L566K997J895J102P22M09P9l37j262
60094G29126k786m190m789m720m364l634k442j190j81Q56K013K804L041L332L999
60079G16875M313L653K554J740Q53q76l276n576p481q939r478q872p959p701p836
60064F61994p476o630n987n529m616l355k734l222m208m938n290n515n797o208
$$ plain form
60168 652092 654119 657349 661224 665523 670199 674745 678515 681438 683670 684754 683910 681022 676659 671246
60154 671246 664941 658187 651625 645461 639612 634479 630840 628946 628347 628741 630383 633574 638271 644278 651285
60139 651285 658669 665808 672785 680306 688718 697469 705709 713199 720413 727853 735215 741245 744656 745303
60125 745303 744142 741925 738501 733747 728515 723971 720372 717179 714092 711295 708979 707311 706625 706989 707776
60110 707776 708339 708912 710156 712100 714297 716785 719955 723521 726518 728413 729515 730237 730646 730725 730388 729126
60094 729126 726340 722150 717361 712641 708277 704643 702201 701011 700830 701686 703699 706503 709544 712876 716875
60079 716875 721188 724841 727395 729135 729988 729112 725836 720260 712779 703840 694362 685490 677531 669830 661994
60064 661994 654518 647888 641901 636372 631756 628401 625667 622445 618237 613299 608009 602494 596697 590489
60050E90489o568o426n635m710m113l413j885K92K140L074L347L355L193K902
60036E76042K586K226J776J396J269J204Q05q5j285k452l134l052k628k852m259
60021E67557o278p862q420p983o999o172n911n666m524k690j501j463j383j82
60007E00523J553K815L977N915Q075R016Q636Q285Q610Q684P599N719L843K095
59993E85345K34j547k794l396l652l791l740l302k559j945j832j982j817j325
59979E51897j186j809k756l422l695l598k933j856j108j036r61j93Q97J580J993
59964E31814K755L721M146L839L325L019L030L537M502N172M752L548K634K418
59950E82212K261J563M63n91j337j627j452j253j661k784m052m869n190n389n767
$$ plain form
60050 590489 583921 577495 571860 567150 563037 559624 557739 558031 560171 563245 566592 569947 573140 576042
60036 576042 578628 580854 582630 584026 585295 586499 587304 587219 585934 583482 580348 577296 574668 571816 567557
60021 567557 561279 553417 544997 537014 530015 523843 517932 512266 507742 505052 503551 502088 500705 500523
60007 500523 502076 504891 508868 514783 522858 531874 540510 548795 557405 566089 573688 579407 583250 585345
59993 585345 585579 584032 581238 577842 574190 570399 566659 563357 560798 558853 557021 555039 553222 551897
59979 551897 550711 548902 546146 542724 539029 535431 532498 530642 529534 528498 527537 527344 528241 529821 531814
59964 531814 534569 538290 542436 546275 549600 552619 555649 559186 563688 568860 573612 577160 579794 582212
59950 582212 584473 586036 586499 585908 584571 582944 581492 580239 578578 575794 571742 566873 561683 556294 550527
59935E50527o193o104n109l588k392j873j669j531j646j901j605n12O40J165J395
59920E19604J964K725L134L161L068K821K434K396K984L676L973M200M711M994
59906E65845M562M109M550N357N170L772K281J402O80m48j836l000l483k928j516
59891E84517j89L50N99J371K356K619K271K345L058L509L265K997L255L703M013
59876F20039M482N240N666N209M124K895J497l50k504m364n346n300m760m590
59862F21938n020n195m274k714j723j621j636j235p24l63J01P11R56O36M53J200
59846F01490K855M809O649Q336R890J1284J2503J3541J4312J4569J3810J1566
59834G25614Q031M268J439j8l06K55J209J787J279n26l531p499j1646j4664j5870
$$ plain form
59935 550527 544334 538230 533121 529533 527141 525268 523599 522068 520422 518521 516916 516404 517044 518209 519604
59920 519604 521568 524293 527427 530588 533656 536477 538911 541307 544291 547967 551940 556140 560851 565845
59906 565845 570407 574516 579066 584423 589593 593365 595646 597048 597728 597280 595444 592444 588961 586033 584517
59891 584517 584328 584678 585277 586648 589004 591623 593894 596239 599297 602806 606071 609068 612323 616026 620039
59876 620039 624521 629761 635427 640636 644760 647655 649152 648802 646298 641934 636588 631288 626528 621938
59862 621938 616918 611723 607449 604735 603012 601391 599755 598520 597796 597433 597534 598245 599201 599837 600290 601490
59846 601490 604345 609154 615803 624139 634029 645313 657816 671357 685669 700238 714048 725614
59834 725614 733645 737913 739352 739334 739028 739283 740492 742279 743558 743032 739501 732002 720356 705692 689822
59819F89822j5911j5703j5163j3779j1880j0302r050p449n502m022l275k516j148
59806E74122M14J339J234K59j080k184k830l350l998m389m152l820m213n148n641
59791E36563n335m878m817m941m906m762m603m228l373k027m49Q18J160N44l27
59776D94439q70j276j817k036j344o0R71J452J578J348P95N13R14J355R68J48
59760D97078j4N82J046J121J425K046K201J648J279J840K925L673L760L445L160
59745E27215L220L423L056J876P90Q06J593K036J929J961K159J683L23r88j472
59730E49610j336j032o01MP09J577K521K807J776M5r72q11k72KJ33K03l9m58n91
59711E53275n69q90j206n13J175K593K948K729K460J950J219R60J391J723J453
$$ plain form
59819 689822 673911 658208 643045 629266 617386 607084 598034 590585 585083 581061 577786 575270 574122
59806 574122 574536 575875 577109 577368 576288 574104 571274 567924 563926 559537 555385 551565 547352 542204 536563
59791 536563 531228 526350 521533 516592 511686 506924 502321 498093 494720 492693 492244 493062 494222 494766 494439
59776 494439 493569 492293 490476 488440 487096 487036 488007 489459 491037 492385 493180 493693 494607 495962 496930 497078
59760 497078 497064 497646 498692 499813 501238 503284 505485 507133 508412 510252 513177 516850 520610 524055 527215
59745 527215 530435 533858 536914 538790 539580 540386 541979 544015 545944 547905 550064 551747 552070 551082 549610
59730 549610 548274 547242 546641 546645 547354 548931 551452 554259 556035 556080 555108 554297 554025 554027 554160 554363 554324 553866 553275
59711 553275 552706 551816 550610 550097 551272 553865 556813 559542 562002 563952 565171 566131 567522 569245 570698
59696E70698J235J763K667L247L585M140M729M636L471J566k79j339j604j816
59682E96699k385k644j879p60o22j533k304k367k340k610k746k590k702l252l651
59667E62314l656l723l923l664k902k397k307j824p18J6j89m65N4Q66J101R64
59651E39547J206J895K530K842K812K381J669R75K70o99j641j921j717j960k813
59636E45376l348l083k700k648k223p98R76K019K088J517M99o70j342j197o84
59621E33782l26k03l12p38j184j179r51j203j856k102j878k001k547k446j226
59606E13630J80R44J393J897K045J677J467J653J387K11r72j302j165j174j064
59591E20807n41j30j68n7N82R71M25m80r60j261j845k297k134j844k023k351k315
$$ plain form
59696 570698 571933 573696 576363 579610 583195 587335 592064 596700 600171 601737 601458 600119 598515 596699
59682 596699 594314 591670 589791 589031 588409 586876 584572 582205 579865 577255 574509 571919 569217 565965 562314
59667 562314 558658 554935 551012 547348 544446 542049 539742 537918 537200 537216 537027 536562 536616 537482 538583 539547
59651 539547 540753 542648 545178 548020 550832 553213 554882 555857 556127 555428 553787 551866 550149 548189 545376
59636 545376 542028 538945 536245 533597 531374 530576 531552 533571 535659 537176 537675 537005 535663 534466 533782
59621 533782 533456 533253 532941 532203 531019 529840 528889 527686 525830 523728 521850 519849 517302 514856 513630
59606 513630 513810 514754 516147 518044 520089 521766 523233 524886 526273 526484 525512 524210 523045 521871 520807
59591 520807 520266 520136 519968 519911 520493 521464 521889 521409 520449 519188 517343 515046 512912 511068 509045 506694 504379
59574E04379k216k423k535k209j967k195k204j366l10L9q9P1M57M91J97O3K45
59557D88428O35J169J514J168L71J04O56J212J352J740K680L288K981K536K803
59542E12637L546M419N815P846R831J1612J3977J6859J8828J9314J9268J8371
59530F62323J3965M991m937j0914j1873j0173p475l901k00K184L242M140N006
59517F46378M924L871K672J231j199m143o229p294q332r527j0057r820r540r276
59503E83659q500p480o964o622n555m157l665l961l679k535j704j665j524p99
59489E24849j88j92l62k86o3L85J221J910J853J769K945N051O324O126N781O498
59473E63621P858Q818Q970Q307O853M942L097J428j12j081j055n10j36L68J604
$$ plain form
59574 504379 502163 499740 497205 494996 493029 490834 488630 487264 486954 486993 486904 486975 487432 487923 488120 488183 488428
59557 488428 489063 490232 491746 492914 493285 493389 494045 495257 496609 498349 501029 504317 507298 509834 512637
59542 512637 516183 520602 526417 534263 544094 555706 569683 586542 605370 624684 643952 662323
59530 662323 676288 681279 676342 665428 653555 643382 635907 632006 631806 633990 637232 641372 646378
59517 646378 651302 655173 657845 659076 657877 653734 647505 640211 631879 622352 612295 602475 592935 583659
59503 583659 575159 567679 560715 554093 548538 544381 540716 536755 533076 530541 528837 527172 525648 524849
59489 524849 524661 524469 524107 523821 523758 524143 525364 527274 529127 530896 533841 538892 545216 551342 557123 563621
59473 563621 571479 580297 589267 597574 604427 609369 612466 613894 613782 612701 611646 611136 611000 611368 612972
59458F12972L082L930M609O281Q702J0458J1221J2031J3249J4004J3935J3731
59446G28205J3612J2765J0781Q180N176J308l255p452j0721j3417j5517j6239
59434G13426j5365j3686j1806r698p765o947p247p416o571n109l547j576J193
59421F17886M391P336R770J1883J4117J6784J9485K1308K2192K3245K4812K5386
59409H18595K3803K1103J8184J2947K730j0705k1715k6457k5518k0925j3881o219
59397G71942p80J514K512L116R69o137j6291k5017k9536k9907k7279k2996j8646
59384F03464j5224j2419r717p450n918m458k496o86P0P0K16P01J204J708K265
59369E51330K619K814L495M870O113O514O436O445O317N710N046M985N581O527
$$ plain form
59458 612972 616054 619984 624593 630874 639576 650034 661255 673286 686535 700539 714474 728205
59446 728205 741817 754582 765363 773543 778719 780027 776772 769320 758599 745182 729665 713426
59434 713426 698061 684375 672569 662871 655106 648159 640912 633496 626925 621816 618269 616693 617886
59421 617886 622277 629613 639383 651266 665383 682167 701652 722960 745152 768397 793209 818595
59409 818595 842398 863501 881685 894632 897362 886657 864942 838485 812967 792042 778161 771942
59397 771942 771162 772676 775188 778304 779273 773136 756845 731828 702292 672385 645106 622110 603464
59384 603464 588240 575821 566104 558654 552736 548278 545782 545096 545166 545236 545452 546153 547357 549065 551330
59369 551330 553949 556763 560258 565128 571241 577755 584191 590636 596953 602663 607709 612694 618275 624802
59355F24802P565Q267Q306Q419R990J3148J6225J7808J8296J8789J9554K0318
59343G91487K0984K1232K0460J8884J7684J7104J5666J2249P823L943N64l293
59331I44787p537j1125j3722j5858j7749j9059j9637j9553j8692j7179j5808j5226
59319G53642j4951j4040j2445j0957r995r167p993o440m829l602l095l215l439
59306F49474l195k116j62K050L367L311K947L658N341O929Q448J0907J4156J6741
59292G21856J8305K0289K3364K5925K6176K4094K0004J2917K215r908j9591k4623
59280H41023k5465k3540j9977j5783j1822q310m963j649J514M372O672Q176R137
59267G59385J0115J0996J1002R948Q504O846M245O54k570m559o354r213j2459
$$ plain form
59355 624802 632367 640634 648940 657359 667349 680497 696722 714530 732826 751615 771169 791487
59343 791487 812471 833703 854163 873047 890731 907835 923501 935750 943573 947516 948080 944787
59331 944787 937250 926125 912403 896545 878796 859737 840100 820547 801855 784676 768868 753642
59319 753642 738691 724651 712206 701249 691254 682087 674094 667654 662825 659223 656128 652913 649474
59306 649474 646279 644163 644001 646051 649418 652729 655676 659334 664675 671604 680052 690959 705115 721856
59292 721856 740161 760450 783814 809739 835915 860009 880013 892930 895145 885237 865646 841023
59280 841023 815558 792018 772041 756258 744436 736126 731163 729514 731028 735400 742072 750248 759385
59267 759385 769500 780496 791498 801446 809950 816796 821041 821695 819125 814566 808212 798999 786540
59254G86540j4376j4583j4201j4031j3797j2995j1546r731q096p155o704n881
59242F53444m378k867j721k51K033M295N486N854O405P385Q215Q357P501N509
59228G05267K910P88n44k030m255o313p246p602q389r247r137q220p627p666p512
59213F23177o595n229l980l254l252l521k970j179P30J412J107J130J986L006
59199F02568L581L716L527L141K930L117L254K855K290K259K725L080L150L243
59185F45436L500L883M491N159N171M160K978K714L192L302K651J967J919K386
59171F92909K961L522M141M852N610O283O810P402Q270Q981Q737P509O262N641
59157G79890N102L801J664q85l526n894p494q407r345j0532j1196j0835j0079
$$ plain form
59254 786540 772164 757581 743380 729349 715552 702557 691011 681280 673184 666029 659325 653444
59242 653444 649066 646199 644478 644227 646260 650555 656041 661895 668300 675685 683900 692257 699758 705267
59228 705267 708177 708965 708421 706391 702136 695823 688577 680975 672586 663339 654202 645982 638355 630689 623177
59213 623177 616582 611353 607373 604119 600867 597346 594376 593197 593927 595339 596446 597576 599562 602568
59199 602568 606149 609865 613392 616533 619463 622580 625834 628689 630979 633238 635963 639043 642193 645436
59185 645436 648936 652819 657310 662469 667640 671800 674778 677492 680684 683986 686637 688604 690523 692909
59171 692909 695870 699392 703533 708385 713995 720278 727088 734490 742760 751741 760478 767987 774249 779890
59157 779890 784992 788793 790457 789572 786046 780152 772658 764251 754906 744374 733178 722343 712264
59144G12264r656r264q287o888n589m414l309k676k655k493j513k23L94J66l52
59129F55505p28o97k0J044J636J434J228J805K941M142N469O916P904Q226Q658
59114G05463R729J0748J0939J0647J0452J0047R105Q261Q074P811O606N012M080
59101H16974L548K405O97o08j260j920k918l925m716n273n385m904m118l286k280
59086G83031j282j080j947l093l973n103o716p845p889p947r106j0565j0928j0464
59072F95093j0317j0318r408p692o254n358m475l727l685l966l642k819k369k291
59058F18772j833j053p52r95j146j187j640k280k358j984j908k000j339P4J055
59043E99426Q35o8p33o70J19J067J240M50j69M08J568J980J485J039J245K096
$$ plain form
59144 712264 702608 693344 685057 678169 672580 668166 664857 662181 659526 657033 655520 655297 655691 655857 655505
59129 655505 654777 654080 654060 655104 656740 658174 659402 661207 664148 668290 673759 680675 688579 696805 705463
59114 705463 715192 725940 736879 747526 757978 768025 777130 785391 793465 801276 807882 812894 816974
59101 816974 820522 822927 823624 823016 821756 819836 816918 812993 808277 803004 797619 792715 788597 785311 783031
59086 783031 781749 780669 778722 775629 771656 766553 759837 751992 744103 736156 727050 716485 705557 695093
59072 695093 684776 674458 665050 657358 651104 645746 641271 637544 633859 629893 626251 623432 621063 618772
59058 618772 616939 615886 615134 614139 612993 611806 610166 607886 605528 603544 601636 599636 598297 598371 599426
59043 599426 600261 600193 599460 598790 598909 599976 601216 601666 601497 601905 603473 605453 606938 607977 609222 611318
59027F11318L686N898P816Q624Q824R487J0726J1919J2843J3476J3340J2132J0441
59014G40530Q716O380L184M04p62j079j964l216l748l596l344k409J2K995M961
58999G47064O062P426Q671Q553P485O999O944N819L778K667K846K471M65k082
58985H15168m042n720p536r041r960j0571j0644r538p641o087m930l218r97O23
58971G25866J554K981N177O985P940R100J1141J3278J4545J4850J4422J3580J3063
58958H54482J3040J2019Q483L495m06k819n635r503j2678j4020j4665j5758j6743
58945G99292j6864j6448j5621j3599j0356p392n766m842l794k899k537k350k227
58932F94597k708l776m515m641m887n484n666n158m627m235l417k402k194k634
$$ plain form
59027 611318 615004 620902 628718 637342 646166 655653 666379 678298 691141 704617 717957 730089 740530
59014 740530 749246 755626 758810 759214 758452 757373 755409 752193 748445 744849 741505 739096 739108 742103 747064
58999 747064 753126 760552 769223 777776 785261 792260 799204 805023 808801 811468 814314 816785 817250 815168
58985 815168 811126 805406 797870 788829 778869 768298 757654 748116 740475 734388 729458 726240 725243 725866
58971 725866 727420 730401 735578 742563 750503 759603 770744 784022 798567 813417 827839 841419 854482
58958 854482 867522 879541 888024 891519 891113 888294 882659 873156 860478 846458 831793 816035 799292
58945 799292 782428 765980 750359 736760 726404 719012 713246 708404 704610 701711 699174 696824 694597
58932 694597 691889 688113 683598 678957 674070 668586 662920 657762 653135 648900 645483 643081 640887 638253
58918F38253k415j419j029j567j600m85N88R28J526K837L680L545L823N336O697
58903F58698O803O980Q824J1482J2987J3004J2611J2448J2647J3534J4915J5666
58891H00599J5371J5421J7216K0253K3159K5501K7384K8344K8050K7156K6145
58880A054599K4181K0295J4924R176L362k626q262j2847j6417j9309k1395k2497
58868A023184k2911k2843k1994k0314j8379j6611j4965j3691j3352j3632j3413
58857H31079j2507j2082j2769j3674j3874j3617j3331j2745j1716j0787j0129
58846F93848r111p538o208n661n514n495n889o537o733o510o573o708n906m426
58832F05039l799m275m231k913j683j670k102k094k105k418k081o51O60R07R30
$$ plain form
58918 638253 635838 634419 633390 631823 630223 629738 630326 631254 632780 635617 639297 642842 646665 652001 658698
58903 658698 665501 672481 681305 692787 705774 718778 731389 743837 756484 770018 784933 800599
58891 800599 815970 831391 848607 868860 892019 917520 944904 973248 1001298 1028454 1054599
58880 1054599 1078780 1099075 1113999 1123175 1126537 1123911 1115649 1102802 1086385 1067076 1045681 1023184
58868 1023184 1000273 977430 955436 935122 916743 900132 885167 871476 858124 844492 831079
58857 831079 818572 806490 793721 780047 766173 752556 739225 726480 714764 703977 693848
58846 693848 684737 677199 670991 665330 659816 654321 648432 641895 635162 628652 622079 615371 609465 605039
58832 605039 601240 596965 592734 589821 588138 586468 584366 582272 580167 577749 575668 575017 575677 576584 577514
58817E77514J714K792L456M036M753M868M096L383L248K889J930J335J570J629
58803F19213R33K87n5j203l249m304l480k590l253m331m211l532l579l815l162
58788E79669k163j716j144M34K242L293M233N754O716O027M869M849N249M466
58774F22778K932K240K301J743L34j083k407l968n210n498n596o538p780q134
58760E86114p614o776n230k588P9J549K233L037L560L149K581K857L402L342L374
58745E93069M431N675N916N842O774Q225Q881Q990R539J0038R445Q458Q590R579
58731G03452R999R760R851J0114R573Q442P781P550O920O046N644N380M598M056
58717H09166M965O822Q079Q481Q891R378R312Q770Q059O495L473M7k451m649q000
$$ plain form
58817 577514 579228 582020 585476 589512 594265 599133 603229 606612 609860 612749 614679 616014 617584 619213
58803 619213 620146 620433 620378 619175 615926 611622 608142 605552 602299 597968 593757 590225 586646 582831 579669
58788 579669 577506 575790 574646 575080 577322 580615 584848 590602 597318 603345 608214 613063 618312 622778
58774 622778 625710 627950 630251 631994 632328 631245 628838 624870 619660 614162 608566 602028 594248 586114
58760 586114 578500 571724 566494 563906 563985 565534 567767 570804 574364 577513 580094 582951 586353 589695 593069
58745 593069 597500 603175 609091 614933 621707 629932 638813 647803 657342 667380 676825 685283 693873 703452
58731 703452 713451 723211 733062 743176 752749 761191 768972 776522 783442 789488 795132 800512 805110 809166
58717 809166 814131 820953 829032 837513 846404 855782 865094 873864 881923 888418 891891 891938 889487 884838 876838
58702H76838j2131j5318j7108j8478j9890k1060k2154k3370k3814k2526k0148
58691F60841j7953j5946j3541j1238r836q771p144n547n105n478n586n389n211
58678E44096m435k748j557k008k754j908j5J164J694K824M310N003N273O354P981
58663E63274R123J0188J2033J3588J3026J0611P909N042J335k230l991m407n185
58650F30316o257o373n867n966o072m791l064l072m436m699l431k606k884k681
58636E68117j220M01J583K944M317M530L515K424J567M13n44l23M15K02n20j6
58620E87805J698L076L906N230O715P055O825P893R966J0689R402P861O975N618
58606F80714L132L92k026m356o089o306n608n479n802n374m531m624n257m801
$$ plain form
58702 876838 864707 849389 832281 813803 793913 772853 750699 727329 703515 680989 660841
58691 660841 642888 626942 613401 602163 592327 583556 576412 570865 565760 560282 554696 549307 544096
58678 544096 539661 536913 535356 533348 530594 528686 528671 529835 531529 534353 538663 543666 548939 555293 563274
58663 563274 572397 582585 594618 608206 621232 631843 639752 644794 646129 643899 639908 635501 630316
58650 630316 624059 617686 611819 605853 599781 594990 591926 588854 584418 579719 576288 573682 570798 568117
58636 568117 566897 567298 568881 571825 576142 580672 584187 586611 588178 588591 588047 587724 588139 588341 587821 587805
58620 587805 589503 592579 596485 601715 608430 615485 622310 630203 640169 650858 660260 668121 675096 680714
58606 680714 683846 684238 682212 677856 671767 665461 659853 654374 648572 643198 638667 634043 628786 623985
58592F23985l412k595k141m93J991L429L949N575Q418J0378J0852J1512J2858
58579F84306J3280J2085J0543R327P731N927N175N378N250N100O560R334J1284
58566G91280J2089J3735J6954K0161K2357K4161K5537K5477K4249K3156K1870
58555A021026J8944J4861J1401Q147L150k863o787p921q660j0021j0442r741j0138
58542A010956j2227j3709j3455j3400j5016j7185j8670j9712k0203j9255j7430
58531H30694j6403j5848j3803j0456q127p135n420k740j250j241m01J806L060
58518G52736K574K437L487L877K953K534L130K835J312O95J325Q07j325k392j544
58503G75441j509l555n135m511l536l731l761k883k839m163m624l453k995m127
$$ plain form
58592 623985 620573 617978 615837 615344 617335 620764 624713 630288 638706 649084 659936 671448 684306
58579 684306 697586 709671 720214 729541 737272 743199 748374 753752 759002 764102 770662 779996 791280
58566 791280 803369 817104 834058 854219 876576 900737 926274 951751 976000 999156 1021026
58555 1021026 1039970 1054831 1066232 1074379 1077529 1074666 1067879 1059958 1051298 1041277 1030835 1021094 1010956
58542 1010956 998729 985020 971565 958165 943149 925964 907294 887582 867379 848124 830694
58531 830694 814291 798443 784640 774184 766057 758922 753502 750762 749512 748271 747870 749676 752736
58518 752736 755310 757747 761234 765111 768064 770598 773728 776563 777875 778570 779895 780702 779377 776985 775441
58503 775441 773932 770377 765242 760731 757195 753464 749703 746820 743981 739818 735194 731741 728746 724619
58489G24619m249k103k45l50k72J581L299L581M621P913J1144J2270J2899J4696
58475G89404J6084J5534J4427J3769J1616O821J824j196l541o690r326j0359j1234
58462H27133j2469j1714q094m666l575k620K78L218M175M834O986Q786Q177O600
58448H27049N857M656J652j420k932m334o787q325p522o351o284n353k332J88
58434G87762L54N66K842M823M271L463M917O753O615O356Q356J0859J1380J1237
58420H70554J2217J2346R554O147N025M706K613k8j086k012m812p749q508q523
58406H90444r761j0621r444q497r825j0788q545n348m359l963j493J099Q76j87
58392H09588J222L429K898P48L41J006K6j625j246J43r9r65Q3J967K202J870L296
$$ plain form
58489 724619 720370 718267 718022 717672 717400 718981 722280 725861 730482 738395 749539 761809 774708 789404
58475 789404 805488 821022 835449 849218 860834 867655 869479 868283 864742 858052 848726 838367 827133
58462 827133 814664 802950 794856 790190 786615 783995 784273 787491 791666 796500 803486 812272 820449 827049
58448 827049 832906 837562 839214 837794 834862 830528 823741 815416 807894 801543 795259 789906 787574 787762
58434 787762 788116 788682 791524 796347 800618 804081 808998 815751 822366 828722 837078 847937 859317 870554
58420 870554 882771 895117 904671 910818 915843 920549 923162 923134 922048 920036 915224 907475 898967 890444
58406 890444 880683 870062 860618 852121 842296 831508 822963 817615 813256 809293 807800 808899 809775 809588
58392 809588 810810 814239 817137 817885 818226 819232 819258 817633 816387 816530 816431 815466 815549 817516 819718 821588 824884
58375H24884N229N448N519P818J0478J0558R454R995J1074J0471R920J1795J3812
58362I46455J2876J1063J2007J4268J4267J2852J2789J2833J0441P523P142P382
58350A081898M895J555J156K385J722M20J779M308M465L572N092P704Q052P656
58336A136659J0031J3467J3942J2694J3770J6443J7112J6238J6415J6276J3363
58325A296410J0169J0050J0337O995K830K997N704N723M014N053P564O950M478
58312A379274N041P994R050Q970J1511J5052J5206J3435J4234J6247J5241J3160
58300A524415J4819J8293J8267J6212J7314K0050J9087J6006J6585J9809K0244
58289A721101J8904K0952K4940K5437K4051K6512L1098L1525K9100L0168L3692
$$ plain form
58375 824884 830113 835561 841080 848898 859376 869934 879388 889383 900457 910928 920848 932643 946455
58362 946455 959331 970394 982401 996669 1010936 1023788 1036577 1049410 1059851 1067374 1074516 1081898
58350 1081898 1086793 1088348 1089504 1091889 1093611 1094031 1095810 1100118 1104583 1108155 1113247 1120951 1129003 1136659
58336 1136659 1146690 1160157 1174099 1186793 1200563 1217006 1234118 1250356 1266771 1283047 1296410
58325 1296410 1306579 1316629 1326966 1333961 1336791 1339788 1345492 1351215 1355229 1360282 1367846 1374796 1379274
58312 1379274 1384315 1392309 1401359 1410329 1421840 1436892 1452098 1465533 1479767 1496014 1511255 1524415
58300 1524415 1539234 1557527 1575794 1592006 1609320 1629370 1648457 1664463 1681048 1700857 1721101
58289 1721101 1740005 1760957 1785897 1811334 1835385 1861897 1892995 1924520 1953620 1983788 2017480
58278B017480L3508L0882L2329L6876L8076L6826L9308M4091M4465M1898M3680
58267B439419M8922N0600M9777N3643O0916O3689O2535O5105P1035P3060P1733
58256C110434P3856P7778P5959P0654P0967P5756P6112P3191P6335Q4862Q9605
58245C955509R1168R8297J09442J14988J16588J24606J37653J45044J48298J58770
58235E200363J75085J85246J90282K02547K21222K33774K41306K57324K81341
58226G188490K99819L13334L35688L66047L90379M10743M43221M86517N24020
58217A0758258N57480O05429O67519P25733P81933Q56959R51270J046243J145943
58208A8096767J275186J434460J602487J785715K016730K302089K625355L004269
$$ plain form
58278 2017480 2050988 2081870 2114199 2151075 2189151 2225977 2265285 2309376 2353841 2395739 2439419
58267 2439419 2488341 2538941 2588718 2642361 2703277 2766966 2829501 2894606 2965641 3038701 3110434
58256 3110434 3184290 3262068 3338027 3408681 3479648 3555404 3631516 3704707 3781042 3865904 3955509
58245 3955509 4046677 4144974 4254416 4369404 4485992 4610598 4748251 4893295 5041593 5200363
58235 5200363 5375448 5560694 5750976 5953523 6174745 6408519 6649825 6907149 7188490
58226 7188490 7488309 7801643 8137331 8503378 8893757 9304500 9747721 10234238 10758258
58217 10758258 11315738 11921167 12588686 13314419 14096352 14953311 15904581 16950824 18096767
58208 18096767 19371953 20806413 22408900 24194615 26211345 28513434 31138789 34143058
58200C4143058L487424M093907M822531N723885O892687Q389640J0251282J2567548
58192I0371962J5441980J8870892K2762875K7017727L1351109L5011304L6961798
58185B77789647L6501156L3453473K7592958J8332448N608389q929393k2173087
58178C68175591l1349197l5514357l5428389l2484115k8006072k3115632j8624879
58171A63652950j4920399j2149919j0497509j0059295j0485656j1031059j1077537
58164H3431576j0499340r509409q337002p132175o016069n062982m263615l580828
58156B9030156l012694k562718k198003j883576j620868j415882j245603j088548
58148A4002264r54942q57010p79586p05939o43454n99934n61845n17833m78011
$$ plain form
58200 34143058 37630482 41724389 46546920 52270805 59163492 67553132 77804414 90371962
58192 90371962 105813942 124684834 147447709 174465436 205816545 240827849 277789647
58185 277789647 314290803 347744276 375337234 393669682 399278071 390348678 368175591
58178 368175591 336826394 301312037 265883648 233399533 205393461 182277829 163652950
58171 163652950 148732551 136582632 126085123 116025828 105540172 94509113 83431576
58164 83431576 72932236 63422827 55085825 47953650 41937581 36874599 32610984 29030156
58156 29030156 26017462 23454744 21256741 19373165 17752297 16336415 15090812 14002264
58148 14002264 13047322 12190312 11410726 10704787 10061333 9461399 8899554 8381721 7903710
58139G903710m50006m20786l80819l42184l15109k89591k57070k27979k11316
58130E008850j98059j80497j67773j66976j68154j62597j57447j58383j56081
58121C492883j43717j30590j24894j19491j07581r6354r2346q8733p9589p1901
58111B437687p1357p0576o3353n6741n7329n8831n4708n0287n1210n2177m8089
58100A803029m4536m6529m8223m4077l9268l9161l9186l4794l0834l1615l2055
58089A372751k7889k4383k5860k6761k2183j7368j7653j8815j6344j4665j8080
58078A142750k1785k0873j9346k1450k2981j9940j6992j8605k0354j7819j5502
58067I27103j7955k0390j7350j2848j2590j3660j1212q219r238j1074q994o002
$$ plain form
58139 7903710 7453704 7032918 6652099 6309915 5994806 5705215 5448145 5220166 5008850
58130 5008850 4810791 4630294 4462521 4295545 4127391 3964794 3807347 3648964 3492883
58121 3492883 3349166 3218576 3093682 2974191 2866610 2770256 2677910 2589177 2509588 2437687
58111 2437687 2366330 2295754 2232401 2175660 2118331 2059500 2004792 1954505 1903295 1851118 1803029
58100 1803029 1758493 1711964 1663741 1619664 1580396 1541235 1502049 1467255 1436421 1404806 1372751
58089 1372751 1344862 1320479 1294619 1267858 1245675 1228307 1210654 1191839 1175495 1160830 1142750
58078 1142750 1120965 1100092 1080746 1059296 1036315 1016375 999383 980778 960424 942605 927103
58067 927103 909148 888758 871408 858560 845970 832310 821098 812879 803641 792567 783573 777571
58055G77571o977r423q770p252q882j1077r696p254p911r269p264m390m992o981
58041F67433o081m029m843p004o819n683o824q645q068o798p686q745p231n705
58027E73272p543j0300r956q014q083r108q258o865p388q029o347m522n292o362
58013D67205m682k439l004m658m234l119l760m150j794O90j6j629n62J279K82
57998D35409j874j494K23k2j055J36K134J840O79J820L891L645K263K817L998
57983D54410K578j33n39O47R3j876k533k377l683n336m730l046l129l988k910
57968D23448j062j407k891k345n13m51j553q08J297J717N39M38J436J300J93J34
57952D19472Q03M78j28O34J540O29n11P57L045L172J738J665K847L161L147M691
$$ plain form
58055 777571 770594 761171 752401 745149 736267 725190 715494 708240 700329 691060 683796 679406 674414 667433
58041 667433 661352 657323 652480 645476 638657 632974 626150 617505 609437 602639 594953 586208 578977 573272
58027 573272 565729 555429 545473 537459 529376 520268 512010 505145 497757 489728 483381 478859 473567 467205
58013 467205 462523 460084 457080 452422 448188 445069 441309 437159 435365 436055 436039 434410 433848 435127 435409
57998 435409 433535 432041 432264 432242 431187 431323 433457 435297 435976 437796 441687 445332 447595 450412 454410
57983 454410 456988 456855 456316 456963 457056 455180 452647 450270 446587 441251 436521 433475 430346 426358 423448
57968 423448 422386 420979 418088 415743 415230 414779 413226 412418 413715 415432 415971 416409 417845 419145 419338 419472
57952 419472 420275 420753 420625 421259 422799 423428 422917 423674 426719 429891 431629 433294 436141 439302 442449 447140
57936D47140O576O341N114N642P040O555N019N336O876O620M692L589L043Q55
57922E20438k186l496l737n549q197q830q009q685j0415j0126q054p411q412q098
57908D19233n999m706m699l692j412j70m43m15m9j043k792k914j706j605k399
57893C85189j654K93N96p78r09P62J703J201J211J954J375m81j142l23m12j744
57877C86841j948n99k19j770l423m430o002p702p292m960l581l913l776k613k563
57862C32050l990m389k941j989k617k755j193L84Q77J683L580N046N213N328O016
57847C40303O065N076M361M241L481K098J663K072J374m98j252l20O0j124k059
57832C65541j624j154j435j233p0N93K37L55J463J984J304J045K121L231L454
$$ plain form
57936 447140 453716 460057 465171 470813 477853 484408 489427 494763 501639 508259 512951 516540 519583 520438
57922 520438 518252 514756 511019 505470 497273 488443 480434 471749 461334 451208 443154 435743 427331 419233
57908 419233 413234 408528 403829 400137 398725 398555 398112 397697 397648 396605 393813 390899 389193 387588 385189
57893 385189 383535 383828 384424 383646 382737 383499 385202 386403 387614 389568 390943 390462 389320 388997 388585 386841
57877 386841 384893 384294 384075 382305 378882 374452 368450 360748 353456 348496 344915 341002 337226 334613 332050
57862 332050 328060 323671 320730 318741 316124 313369 312176 312560 313437 315120 318700 323746 328959 334287 340303
57847 340303 346368 351444 355805 360046 363527 365625 367288 369360 370734 370236 368984 368664 368724 367600 365541
57832 365541 363917 362763 361328 360095 360025 360618 360855 361210 362673 364657 365961 367006 369127 372358 375812
57817C75812L541L748L072J616R38J268J070N8l16j0q99l237m826m697m555n542
57801C67041o568o926p503q353p980o206m822m424l575k019j532k466k673j212
57787C00782L7k37p45m07j76n33o4J859L633M129M346N069N509N495O345Q305
57771C43347R711R779R558R192P242L875J555J224Q63p83k232k518l154n045o584
57756C76030o723o937q155q696p402n997o054o245m899k940j982j791j706k394
57742C04109m015m827l664j933j244j105o75o27j379j692r16n22j545k563k178
57727B75224j343j299j258j83J075J402J354J625J441L24m28J40Q31L86m98q68
57711B77925j373k600l466l055k283k141k071j571j399j772j520m93m52j910k657
$$ plain form
57817 375812 379353 383101 386173 387789 388727 389995 391065 391123 390807 390797 389898 386661 381835 377138 372583 367041
57801 367041 360473 353547 346044 337691 329711 323505 318683 314259 310684 308665 307133 304667 301994 300782
57787 300782 300819 300582 299837 299430 299254 298721 298657 300516 304149 308278 312624 317693 323202 328697 335042 343347
57771 343347 353058 362837 372395 381587 388829 392704 394259 395483 396346 395563 393331 390813 387659 382614 376030
57756 376030 369307 362370 354215 345519 338117 332120 326066 319821 314922 311982 310000 308209 306503 304109
57742 304109 300094 295267 291603 289670 288426 287321 286646 286019 284640 282948 282032 281510 279965 277402 275224
57727 275224 273881 272582 271324 271141 272216 273618 274972 276597 278038 278362 277934 278074 278905 279291 278793 277925
57711 277925 276552 273952 270486 267431 265148 263007 260936 259365 257966 256194 254674 254181 253729 251819 249162
57696B49162j310K89K82j48O59J705J392M94M49O03j59q58j99Q53Q99Q48K220
57679B57181M288N533O503Q523J1042J2932J5179J9548K5648L1971L8774M7258
57667D84380N6608O4336O8951O9980O6019N4996L6313J1417j6777m3619o3486
57656G89118p3097p3668o8580o0254n0493m1639l4943k9107k2722j6829j3081
57645C04705j0831q441o113n000m646l729k402j616j136l07K47j40m04M93J290
57630B61970L08j500j894q03P7K68N07N46m59j860k270j947k163k706k266r69
57614B44839k34m21o28n39n47m63O6L70k86j161j197r45j424j998j396j12L63
57597B34287mj83k32r31j824j796j137j039j531j802j916k330k455j668r44j394
$$ plain form
57696 249162 247852 248141 248423 248275 248934 250639 252031 252525 252974 253577 253418 252560 252361 253214 254113 254961 257181
57679 257181 261469 267002 273505 282028 293070 306002 321181 340729 366377 398348 437122 484380
57667 484380 540988 605324 674275 744255 810274 865270 901583 913000 896223 852604 789118
57656 789118 716021 642353 573773 513519 463026 421387 386444 357337 334615 317786 304705
57645 304705 293874 285433 279320 274320 269674 265945 263543 261927 260791 260484 260731 260591 260187 260680 261970
57630 261970 262278 260778 258884 258081 258158 258426 258933 259479 259020 257160 254890 252943 250780 248074 245808 244839
57614 244839 244605 244184 243556 243017 242470 242007 242073 242443 242157 240996 239799 238854 237430 235432 234036 233924 234287
57597 234287 234283 234100 233868 232937 231113 229317 228180 227141 225610 223808 221892 219562 217107 215439 214495 213101
57581B13101k038j314P4K01q76j477j279j418k013k108j841k217k919k652j548
57566A89676r76j150j116q77j282j960j674o73l59p15l78P38J219O76K79N26O69
57549A82623N67J063K135K652K304K011K156K115J694J420J300R24P18J505K848
57534B08035L534L463L394L150K005N62J49N20K03q92j366q25m04n83n84j50l3
57517B20178l83m35o5L9j43N7M76L08k27k17Q8m36j654k271k019j837j872j380
57499B08207o07o91j571k021j908k280l108l060j890q57m71Q0Q36O41n72j213
57483A89515n20K96J85l14m66m66l79L26J445J771R59K45O04J495K097K418K573
57466B01784K214J272L34k17m93m51L2M98M33K97P68J294Q68j30m48q7o8l98j83
$$ plain form
57581 213101 211063 209749 209823 210024 209148 207671 206392 204974 202961 200853 199012 196795 193876 191224 189676
57566 189676 188700 187550 186434 185557 184275 182315 180641 179968 179609 178894 178516 179254 180473 181149 181428 181954 182623
57549 182623 183190 184253 186388 189040 191344 193355 195511 197626 199320 200740 202040 202964 203682 205187 208035
57534 208035 211569 215032 218426 221576 223581 224143 224292 224812 225015 224123 222757 221932 221528 220945 220361 220211 220178
57517 220178 219795 219360 219295 219334 219191 219248 219724 220032 219805 219588 219676 219240 217586 215315 213296 211459 209587 208207
57499 208207 207600 206909 205338 203317 201409 199129 196021 192961 191071 190214 189743 189823 190659 191300 190728 189515
57483 189515 188995 189291 189476 189162 188696 188230 187851 188177 189622 191393 192352 192597 193201 194696 196793 199211 201784
57466 201784 203998 205270 205604 205387 204894 204443 204475 204973 205406 205703 206471 207765 208633 208503 208055 207968 207900 207502 207319
57447B07319L76J27q54j258p85m02k61M55J501J496L05n83m37q0N4N71J422J580
57429B10546R64P78J369J676J268R98J149Q45j08o54l56n0j81k23j15m22q08l07
57411B16369O72O82j62k43O63R72L03K14J180J536M88l76J31Q77O69K64O32J201
57393B26072J287J481K147K299J335L38L69R82J498K147K925K979K217J799K042
57378B51917J656J76q14j50J086J573J721K179K155R38l90n02J93N33M79N81P06
57361B64037N14K97L15L22M10J077J840J384k08j103m46M58N93Q07J816K619K373
57344B77105K032K547L126K777K034J663J186K11l18K84J076J101R37J253J408
57329B98422Q94O22J269J924J861J976K896L392K509J542J953K858K663J852J943
$$ plain form
57447 207319 207695 207822 206968 205710 204925 204523 204262 204717 206218 207714 208019 207436 206999 206919 206973 207544 208966 210546
57429 210546 211510 212288 213657 215333 216601 217599 218748 219593 219485 218831 218475 218425 218244 218021 217906 217484 216676 216369
57411 216369 217041 217723 217561 217318 217981 218953 219256 219470 220650 222186 222674 222298 222429 223306 223975 224239 224871 226072
57393 226072 227359 228840 230987 233286 234621 234959 235328 236310 237808 239955 242880 245859 248076 249875 251917
57378 251917 253573 253749 252935 252785 253871 255444 257165 259344 261499 262437 262047 261545 261738 262271 262750 263331 264037
57361 264037 264551 264848 265163 265485 265895 266972 268812 270196 269988 268885 268439 268897 269490 270297 272113 274732 277105
57344 277105 279137 281684 284810 287587 289621 291284 292470 292681 292363 292647 293723 294824 295761 297014 298422
57329 298422 299316 299938 301207 303131 304992 306968 309864 313256 315765 317307 319260 322118 324781 326633 328576
57314C28576K775L004K422J848J504J229J448K272K579J588M18M65J284J741K132
57299C55285L302M666M975M385L957L832L491L139L279L603L670L890M479M497
57285D10450L404K488L132M644N420N290N076M759L936L224L521M509N402O383
57271D71638P835R108R649J0388J2318J4600J5775J6004J6401J7020J7173J6996
57259F34905J6957J6640J5636J4800J4985J5440J5128J4636J4984J5552J5182
57248H04845J4450J4812J6190J7319J7866J8241J8087J6951J5848J6151J7403
57237I88163J8060J7852J7589J7313J6589J6065J6643J7594J7509J6708J6747
57226A176832J7814J8595J8504J8179J7931J7468J7025J7164J7594J7635J7482
$$ plain form
57314 328576 331351 334355 336777 338625 340129 341358 342806 345078 347657 349245 349663 350128 351412 353153 355285
57299 355285 358587 363253 368228 372613 376570 380402 383893 387032 390311 393914 397584 401474 405953 410450
57285 410450 413854 416342 419474 424118 429538 434828 439904 444663 448599 451823 455344 459853 465255 471638
57271 471638 479473 488581 498230 508618 520936 535536 551311 567315 583716 600736 617909 634905
57259 634905 651862 668502 684138 698938 713923 729363 744491 759127 774111 789663 804845
57248 804845 819295 834107 850297 867616 885482 903723 921810 938761 954609 970760 988163
57237 988163 1006223 1024075 1041664 1058977 1075566 1091631 1108274 1125868 1143377 1160085 1176832
57226 1176832 1194646 1213241 1231745 1249924 1267855 1285323 1302348 1319512 1337106 1354741 1372223
57215A372223J7679J7924J7811J8044J9335K0939K1902K2890K4811K6682K6992
57204A607232K6428K6915K8497K9542K9607K9692K9925K9412K8294K7796K8167
57193A921507K8595K9071L0285L1819L2562L2824L4027L6272L8254L9563M1025
57182B295804M2726M3675M3564M3046M2366M1455M1093M2036M3226M2985M1775
57171B763751M1518M2339M2426M1215M0191M0216M0435M0362M0725M1577M1693
57160C216448M0572L9287L8681L8455L8511L9478M1242M2625M3099M3335M3682
57149C665415M3670M3312M3436M4273M5170M5863M6632M7192M7038M6798M7513
57138D166312M8616M8564M7437M6834M7034M6532M4741M2916M1813M0608L8931
$$ plain form
57215 1372223 1389902 1407826 1425637 1443681 1463016 1483955 1505857 1528747 1553558 1580240 1607232
57204 1607232 1633660 1660575 1689072 1718614 1748221 1777913 1807838 1837250 1865544 1893340 1921507
57193 1921507 1950102 1979173 2009458 2041277 2073839 2106663 2140690 2176962 2215216 2254779 2295804
57182 2295804 2338530 2382205 2425769 2468815 2511181 2552636 2593729 2635765 2678991 2721976 2763751
57171 2763751 2805269 2847608 2890034 2931249 2971440 3011656 3052091 3092453 3133178 3174755 3216448
57160 3216448 3257020 3296307 3334988 3373443 3411954 3451432 3492674 3535299 3578398 3621733 3665415
57149 3665415 3709085 3752397 3795833 3840106 3885276 3931139 3977771 4024963 4072001 4118799 4166312
57138 4166312 4214928 4263492 4310929 4357763 4404797 4451329 4496070 4538986 4580799 4621407 4660338
57127D660338L8029L9013M1546M5136N0124N6653O4082P2071Q0945R0500R9716
57116E338153J07982J15265J21082J25045J28672J34891J45322J59565J77204
57107F553181J98707K24270K53936K89426L33890L89460M56954N38437O38009
57098I876270P59668R06689J083826J297816J554244J855251K200329K586160
57090B2120253L003346L434536L857273M247831M582052M835226M984305N010628
57082E6075450M899814M639637M219781L635838K896672K030372J081860J00640
57074G9580064q71932j804635k668913l433993m070518m556684m880568n040268
57066E2252553n044772m913461m672488m350734l977464l579866l180028k794146
$$ plain form
57127 4660338 4698367 4737380 4778926 4824062 4874186 4930839 4994921 5066992 5147937 5238437 5338153
57116 5338153 5446135 5561400 5682482 5807527 5936199 6071090 6216412 6375977 6553181
57107 6553181 6751888 6976158 7230094 7519520 7853410 8242870 8699824 9238261 9876270
57098 9876270 10635938 11542627 12626453 13924269 15478513 17333764 19534093 22120253
57090 22120253 25123599 28558135 32415408 36663239 41245291 46080517 51064822 56075450
57082 56075450 60975264 65614901 69834682 73470520 76367192 78397564 79479424 79580064
57074 79580064 78708132 76903497 74234584 70800591 66730073 62173389 57292821 52252553
57066 52252553 47207781 42294320 37621832 33271098 29293634 25713768 22533740 19739594
57058A9739594k434238k108634j820566j568749j350664j164007j005139q68913
57050G418684p51484o51453n67330m95953m34454l81761l37005k98248k64075
57041C236921k34597k09712j88053j68653j51842j37550j24529j12246j01555
57032A808184r2507q3611p4246o5549n7764m9100l8543k7307j6018k959J3287
57021A313867L2132N3667P9743J09574J36790J53853J56907J43134J06909M4936
57011B331512l4282j10953j66316j93345j96395j84270j64926j43606j22772j03229
57001I11418q5689p0983n9142m9399m1154l4248k8450k3480j9374j6128j3274
56990D70097j0468p999o156m573k750o62J706M578P469Q894P728M119j348q213
$$ plain form
57058 19739594 17305356 15196722 13376156 11807407 10456743 9292736 8287597 7418684
57050 7418684 6667200 6015747 5448417 4952464 4518010 4136249 3799244 3500996 3236921
57041 3236921 3002324 2792612 2604559 2435906 2284064 2146514 2021985 1909739 1808184
57032 1808184 1715677 1632066 1557820 1492271 1434507 1385407 1346864 1319557 1303539 1300580 1313867
57021 1313867 1345999 1399666 1479409 1588983 1725773 1879626 2036533 2179667 2286576 2331512
57011 2331512 2297230 2186277 2019961 1826616 1630221 1445951 1281025 1137419 1014647 911418
57001 911418 825729 754746 695604 646205 605051 570803 542353 518873 499499 483371 470097
56990 470097 459629 451630 445474 440901 438151 437489 439195 443773 451242 460136 467864 471983 470635 462422
56976D62422j5261k0396k2540k2700k2235k1147j8919j5859j2571r106n669l044
56964B72975j314P47L966P562J0643J3612J6968J9895K1391K1554K0438J6727
56952D25164R240r82j1343j9778k5222k7171k6134k3743k1156j8021j3918r761
56940B37175o609m124j350J925N625J0157J5560K0891K5415K9360L2404L2826
56928C99255K9326K2521J3448K135j0880k3009l1383l5313l5724l3413k9315k5178
56916B42470k2138j9497j6335j3238j1020r120o909n328n340n941n613m689m393
56903A12909m471l781k437j488j027m08L36Q74J646L018M254M861N878Q209J0876
56888A39249J2690J4444J7351K0428K1692K0963J9165J5759R512J377n881j0718
$$ plain form
56976 462422 447161 426765 404225 381525 359290 338143 319224 303365 290794 281688 276019 272975
56964 272975 271661 272408 276374 283936 294579 308191 325159 345054 366445 387999 408437 425164
56952 425164 434404 433422 422079 402301 377079 349908 323774 300031 278875 260854 246936 237175
56940 237175 230566 226442 225092 227017 232642 242799 258359 279250 304665 334025 366429 399255
56928 399255 428581 451102 464550 466685 455805 432796 401413 366100 330376 296963 267648 242470
56916 242470 220332 200835 184500 171262 160242 151122 144213 138885 133545 127604 121991 117302 112909
56903 112909 108438 104657 102220 100732 99705 99297 99633 100507 102153 105171 109425 114286 120164 128373 139249
56888 139249 151939 166383 183734 204162 225854 246817 265982 281741 291253 292630 286749 276031
56876B76031j3399j4014j2281r144o249l739m90L525P106J0047J3531J8265K4020
56863B93209L0980L9534M8473N5198N8256N8212N5669M9666L8550K1771R61k0051
56851G30428l6724m6391m9371m7353m1726l4016k6199j9076j1489k589O533J4929
56839D36956K3781L4414M5894N6876O8122Q0338R0729R4874R1238Q0841O3189
56828A167252L6411J977l3741o3605q3591r2752r2193q4927p4571o3115n1024
56817E66121l9207k8922j9839j0290K74J0980K1629L3033M4952N5528O3054O6744
56805G64057O5775N9146M6521K7915L435k4614n0216o7106p3921p3946p0171o3262
56793E43613n4028m4554l6022k7916k0107j3437p690j320O034J2951J8753K4324
$$ plain form
56876 276031 262632 248618 236337 227193 220944 217205 216715 220240 227346 237393 250924 269189 293209
56863 293209 324189 363723 412196 467394 525650 583862 639531 689197 727747 749518 750479 730428
56851 730428 693704 647313 597942 550589 508863 474847 448648 429572 418083 415494 422027 436956
56839 436956 460737 495151 541045 597921 666043 746381 837110 931984 1023222 1104063 1167252
56828 1167252 1203663 1205640 1171899 1108294 1024703 931951 839758 754831 680260 617145 566121
56817 566121 526914 497992 478153 467863 468137 479117 500746 533779 578731 634259 697313 764057
56805 764057 829832 888978 935499 963414 966849 942235 892019 824913 750992 677046 606875 543613
56793 543613 489585 445031 409009 381093 360986 347549 339859 338539 344573 357524 376277 400601
56781D00601K9676L3008L3088L0443K5201J5972K319j3289k7262l7465m3287m4776
56769D04229m2823l9064l4647k9863k5220k1585j9013j6671j4220j2041j0034
56758A39048p708n513m529m639m619m088l701l474k715j757j725k441k521j741
56744H7877j361j790k049j839k039k614k311r82j86o96j402j359j025p95k56M39
56728F7612L79k65j07J046J688J142N84P51P27k1m19L13J331J759J891J944J337
56711H1692J99j65P17J654J797J762J972J766J079J072J985K308J223L9o2R7n43
56694I8592j314j168n38l80n49n06m90q18r20k69P09J427J911K170J850J103N47
56677A01357J3j220k544k212q5J626J343J02l99n2M27R41J440J301M58o7L28Q74
$$ plain form
56781 400601 430277 463285 496373 526816 552017 567989 570308 557019 529757 492292 449005 404229
56769 404229 361406 322342 287695 257832 232612 211027 192014 175343 161123 149082 139048
56758 139048 131340 125827 121298 116659 112040 107952 104251 100777 98062 96305 94580 92139 89618 87877
56744 87877 86516 84726 82677 80838 78799 76185 73874 72892 72706 72010 70608 69249 68224 67429 67173 67612
56728 67612 67991 67726 67619 68665 70353 71495 72079 72830 73557 73536 73117 73430 74761 76520 78411 80355 81692
56711 81692 81891 81726 82443 84097 85894 87656 89628 91394 92473 93545 95530 97838 99061 99100 99038 99135 98592
56694 98592 97278 96110 95572 95192 94643 94137 93647 92829 91909 91640 92349 93776 95687 97857 99707 100810 101357
56677 101357 101370 100150 97606 95394 95309 96935 98278 98380 97981 97929 98356 99297 100737 102038 102496 102429 102757 103631
56659A03631Q55O93Q93J213J529K159K820K655J860J623K046J884R08M62J026
56644A26257J370R99J225K649L765L354K288J590P55n59j185m34L99J76q1R02
56628A43470K324K682K098J564J073J26r30j575k079k663k767k277k116k579k508
56613A33843j368n20j102k130k210j700j611j700j223m54k9K09M69K30n73q55
56597A19276n7P16M62j26n5L16K97K98R06J673K035K267K502K113J045M40Q29
56580A34937J256J090J139J814J907O14q95j243o90M9J180K672L405K929K564
56565A52728L358M453M816M931N443N860N988O817Q526R444Q571P322P056O797
56551B42110N251L226K116J670J175J187K111K663J784N22J37j17j312k595k736
$$ plain form
56659 103631 104486 105179 106072 107285 108814 110973 113793 116448 118308 119931 121977 123861 124769 125231 126257
56644 126257 127627 128626 129851 132500 136265 139619 141907 143497 144252 143693 142508 142074 142473 142649 142568 143470
56628 143470 145794 148476 150574 152138 153211 153337 152407 150832 148753 146090 143323 141046 138930 136351 133843
56613 133843 132475 131955 130853 128723 126513 124813 123202 121502 120279 119825 119796 120005 120474 120704 120131 119276
56597 119276 119219 119935 120397 120271 120216 120532 120829 121127 122033 123706 125741 128008 130510 132623 133668 134108 134937
56580 134937 136193 137283 138422 140236 142143 142757 141862 140619 139929 139978 141158 143830 147235 150164 152728
56565 152728 156086 160539 165355 170286 175729 181589 187577 194394 202920 212364 220935 228257 235313 242110
56551 242110 247361 250587 252703 254373 255548 256735 258846 261509 263293 263815 263952 263835 262523 259928 257192
56536B57192k404k798l447l395l217l767m340m050l620l907m147l640l503m618
56522B06339n584m955l826l788m046l104j802j824k582k405j708k086l213l405
56508A62011k536j853j608j202r74j458j729p89L12J0j003r56k3L33J83P28J747
56491A51193J869J000J93l08q27p87M21J740J763J007Q89J270J074M98M70P30
56475A62195N09K72P55J236P93J61L27N16j98o93L76J870J917J071J073J590J113
56458A74883P0J09R64J000K82K87J102J458J141R22O39k44r36m48L25P6l76M61
56440A81715J854K060J473J697K504K464J813J795K074J571R71J454J900N23j591
56425B04277j790m7J357J591J553J140l78j888j715q21j380k694k162R4J280N37
$$ plain form
56536 257192 254788 251990 248543 245148 241931 238164 233824 229774 226154 222247 218100 214460 210957 206339
56522 206339 200755 195800 191974 188186 184140 181036 179234 177410 174828 172423 170715 168629 165416 162011
56508 162011 159475 157622 156014 154812 153838 152380 150651 149862 150174 150184 149181 148225 148202 148535 148718 149446 151193
56491 151193 153062 154062 154255 153947 153120 152333 152754 154494 156257 157264 158153 159423 160497 160995 161465 162195
56475 162195 162704 162976 163731 164967 165760 165921 166248 166764 166566 165873 166249 168119 170036 171107 172180 173770 174883
56458 174883 174953 175062 176026 177026 177308 177595 178697 180155 181296 182218 182857 182613 181677 181229 181554 181630 181254 181715
56440 181715 183569 185629 187102 188799 191303 193767 195580 197375 199449 201020 201991 203445 205345 205868 204277
56425 204277 202487 202440 203797 205388 206941 208081 207703 205815 204100 203279 201899 199205 197043 197137 198417 198954
56409A98954k39j90n16j376j214K09J220J116Q83Q48L47k21K46J148Q88j76k56
56392B01671O70J072R09J386K116J685O82Q92J860J612N26Q49K558L414L057L266
56376B28225M096L568J601M64Q06P84l05j028r18j154j643q99P21J094N0l88J72
56359B35246n9j274j482k62M45j1q8N96N40l35k82P07N81p88j045L91J260O52
56341B34792M63J578K233J506R45J397J578J037J224K401K733J687J140J973K706
56326B59393K582K768L502L297K036J565K260K279J175P91J555J437k49j407p44
56311B82240M67J283K344L322K574M20o60l5L88J54J099L308M316L529L359M693
56295C12801N257L900K483K084J355Q7K74K061K853J981J996L678M318K869K189
$$ plain form
56409 198954 198715 198525 198009 196633 195419 195628 196848 197964 198847 199695 200042 199821 200067 201215 202103 201927 201671
56392 201671 202341 203413 204322 205708 207824 209509 210191 211083 212943 214555 215081 215930 218488 221902 224959 228225
56376 228225 232321 235889 237490 237954 238760 239544 239239 238211 237293 236139 234496 233597 234318 235412 235462 235074 235246
56359 235246 235187 233913 232431 232169 232614 232603 232515 233111 233651 233316 233034 233741 234322 233534 232489 232880 234140 234792
56341 234792 235255 236833 239066 240572 241517 242914 244492 245529 246753 249154 251887 253574 254714 256687 259393
56326 259393 261975 264743 268245 271542 273578 275143 277403 279682 280857 281648 283203 284640 284391 282984 282240
56311 282240 282707 283990 286334 289656 292230 292650 291990 291955 292343 292497 293596 296904 301220 304749 308108 312801
56295 312801 318058 321958 324441 326525 327880 327967 328241 330302 333155 335136 337132 340810 345128 347997 350186
56280C50186L854N182M110K746L262M267M073L909N013N955N589N324O105O503
56266D16078O018O673R057J0561R921R626J1338J2933J2820J3256J6262J9979
56254E54522K2265K4402K8125L2259L5455L9048M4190M9155N2496N5835O0733
56243I98485O5777O9355P2266P5044P5888P3845P0778O7687O2448N3712M3447
56232A728732L3098K1013O538p206j7810k7160l7347m6590n2621n6660o0574o3244
56220A420169o3226o2019o1409o0305n7281n3480n0211m6566m1988l8126l5764
56209H49794l3113k9476k6928k6076k4188k0084j6644j5660j4653j1778r402r354
56197F12438r203o900m774n033n574m211k809l219l314j240N13m45j929j328l11
$$ plain form
56280 350186 354040 359222 363332 366078 369340 373607 377680 381589 386602 392557 398146 403470 409575 416078
56266 416078 422096 428769 437826 448387 458308 467934 479272 492205 505025 518281 534543 554522
56254 554522 576787 601189 629314 661573 697028 736076 780266 829421 881917 937752 998485
56243 998485 1064262 1133617 1205883 1280927 1356815 1430660 1501438 1569125 1631573 1685285 1728732
56232 1728732 1761830 1782843 1789381 1782175 1764365 1737205 1699858 1653268 1600647 1543987 1483413 1420169
56220 1420169 1356943 1294924 1233515 1173210 1115929 1062449 1012238 965672 923684 885558 849794
56209 849794 816681 787205 760277 734201 710013 689929 673285 657625 642972 631194 621792 612438
56197 612438 603235 596335 591561 586528 580954 576743 573934 570715 567401 566161 566674 566229 564300 562972 562661
56182E62661j055j791n25P74nr02J07R54l90j586k83J249M09r01k25P54R6j27
56164E59214J825L208J916J217M104P467P460O169P143Q687P786O514Q206J0998
56150F41914J1555J1474J3689J6163J5745J4761J7204K1609K4298K6555L1831
56139H46798L8916M4566N0139N9025P0158Q0455R0865J03453J15161J20937J20609
56128A741082J16659J08266R3967P7406O3895N3823M5272L9634L8125L6194K8546
56117B442869J6903O244l273j3821k2993k7084k8472l2547m0031m9075o1397p8613
56105B108710r5640j05564j08456j08249j04341r4182q0794o9384n9265m7179
56095A235656l5507k8807k5188j9676j3312j0427r705o781k982k528l673j604
$$ plain form
56182 562661 561606 559815 559290 560064 560059 559157 559264 560218 559828 558242 557959 559208 559617 558716 558491 559245 559341 559214
56164 559214 561039 564247 566163 567380 571484 578951 586411 592580 599723 608410 616196 622710 630916 641914
56150 641914 653469 664943 678632 694795 710540 725301 742505 764114 788412 814967 846798
56139 846798 885714 930280 980419 1039444 1109602 1190057 1280922 1384375 1499536 1620473 1741082
56128 1741082 1857741 1966007 2059974 2137380 2201275 2255098 2300370 2340004 2378129 2414323 2442869
56117 2442869 2459772 2466016 2462743 2448922 2425929 2398845 2370373 2337826 2297795 2248720 2187323 2108710
56105 2108710 2013070 1907506 1799050 1690801 1586460 1492278 1411484 1342100 1282835 1235656
56095 1235656 1200149 1171342 1146154 1126478 1113166 1102739 1093034 1086253 1083271 1080743 1077070 1075466
56083A075466K332L254K121L392N937N429L406M625P810Q279P276R305J2708J2570
56069A163910J0389J1201J3758J3408J1994J4495J8738J8988J7024J8720K2333
56058A334958K1584J7828J7525J9905J9005J5820J6315J9236J8252J4562J5036
56047A530026J9231K0675J9601K1824K6348K6793K4055K4801K8601K9302K7765
56036A799022L0165L5109L5810L3564L5403M0006M0108L7262L9453M5518M7054
56025B218474M4617M6472N2318N4091N2110N4295O0059O1397N9319O2460O9947
56014B835559P2805P1696P5668Q3882Q6884Q5473Q9513R8402J02094J01290J06495
56003C809761J17148J22389J22741J29585J42716J50448J52624J60884J75427
$$ plain form
56083 1075466 1077798 1081052 1083173 1086565 1092502 1097931 1101337 1105962 1113772 1122051 1129327 1138632 1151340 1163910
56069 1163910 1174299 1185500 1199258 1212666 1224660 1239155 1257893 1276881 1293905 1312625 1334958
56058 1334958 1356542 1374370 1391895 1411800 1430805 1446625 1462940 1482176 1500428 1514990 1530026
56047 1530026 1549257 1569932 1589533 1611357 1637705 1664498 1688553 1713354 1741955 1771257 1799022
56036 1799022 1829187 1864296 1900106 1933670 1969073 2009079 2049187 2086449 2125902 2171420 2218474
56025 2218474 2263091 2309563 2361881 2415972 2468082 2522377 2582436 2643833 2703152 2765612 2835559
56014 2835559 2908364 2980060 3055728 3139610 3226494 3311967 3401480 3499882 3601976 3703266 3809761
56003 3809761 3926909 4049298 4172039 4301624 4444340 4594788 4747412 4908296 5083723
55994E083723J84845J89808K02587K22143K34953K41618K56413K79370K96259
55985G191719L07578L28622L59199L83592M02578M33644M77082N15296N48399
55976A0947709N95252O56244P12611P66163Q39956R35346J030775J127833J253290
55967A8865179J410132J575461J753458J978270K257919K572920K938662L407220
55959C6759221M000079M710759N585707O725940Q199160J0039300J2338510J5222247
55951A03580923J8708987K2710064K7143125L1795729L5980583L8599567L8776772
55944C17295750L6225159L0754421K1767779Q929624o496516k1471145l2794592
55937C54210480l8944972m0398984l8593816l4923071l0449220k5932252k1795872
$$ plain form
55994 5083723 5268568 5458376 5660963 5883106 6118059 6359677 6616090 6895460 7191719
55985 7191719 7499297 7827919 8187118 8570710 8973288 9406932 9884014 10399310 10947709
55976 10947709 11542961 12199205 12911816 13677979 14517935 15453281 16484056 17611889 18865179
55967 18865179 20275311 21850772 23604230 25582500 27840419 30413339 33352001 36759221
55959 36759221 40759300 45470059 51055766 57781706 65980866 76020166 88358676 103580923
55951 103580923 122289910 144999974 172143099 203938828 239919411 278518978 317295750
55944 317295750 353520909 384275330 406043109 414972733 408476217 387005072 354210480
55937 354210480 315265508 274866524 236272708 201349637 170900417 144968165 123172293
55930A23172293j8162057j5038504j2437229j0326001q601550p175491o019763
55923D5411698n101991m350763l714599l191705k774815k422638k108268j843366
55915A9903553j632254j448525j276375j131108j019809r21654q24405p42832
55907A0906591o84286o30910n71765n20119m84031m50145m10575l76994l54836
55898F422930l30853k98851k71822k56619k41360k19291k01096j92519j82803
55889D227716j66194j52832j47771j40482j25421j12512j07102r9362q3445o8203
55879C024392n9149m8180l0837j6048r443m052L402L599q949k6431m3012o3597
55867B721695q8946j07951j13936j14181j14889j11095r9856q9008q3856p8518
$$ plain form
55930 123172293 105010236 89971732 77534503 67208502 58606952 51431461 45411698
55923 45411698 40309707 35958944 32244345 29052640 26277825 23855187 21746919 19903553
55915 19903553 18271299 16822774 15546399 14415291 13395482 12473828 11649423 10906591
55907 10906591 10222305 9591395 9019630 8499511 8015480 7565335 7154760 6777766 6422930
55898 6422930 6092077 5793226 5521404 5264785 5023425 4804134 4603038 4410519 4227716
55889 4227716 4061522 3908690 3760919 3620437 3495016 3382504 3275402 3176040 3092595 3024392
55879 3024392 2965243 2917063 2886226 2870178 2860735 2856683 2860085 2863684 2854735 2828304 2785292 2721695
55867 2721695 2632749 2524798 2410862 2296681 2181792 2070697 1970841 1881833 1797977 1719459
55857A719459o8915o1242n9310n6389m8112m0983l9881l9147l4344l0916l2905
55846A207315l4519l1216k8167k9532l0141k6001k2568k4359k6218k3093j9046
55835I12455j8664j8655j5624j3393j5035j6262j3816j2012j3966j4963j1466
55824G48599q268r659j1757j0633r815j2615j4897j2854j0415j1731j3477j1593
55812F10885q795q510q146n063k637l761m772k175R19J255J819N545R060R038
55798E94662Q521J0554J1694Q360L737J905O41l526q406j0552j1457j3423j4251
55785E78459j1884r393r687j0125p904n879p491j0691j2191j2967j4305j3463
55773D52479q622l305o32J923O905J1245J1639J0352J0006P727N39q050j2918
$$ plain form
55857 1719459 1650544 1589302 1529992 1473603 1425491 1384508 1344627 1305480 1271136 1240220 1207315
55846 1207315 1172796 1141580 1113413 1083881 1053740 1027739 1005171 980812 954594 931501 912455
55835 912455 893791 875136 859512 846119 831084 814822 801006 788994 775028 760065 748599
55824 748599 740331 730672 718915 708282 698467 685852 670955 658101 647686 635955 622478 610885
55812 610885 602090 593580 585434 580371 577734 573973 569201 567026 567945 569200 571019 576564 585624 594662
55798 594662 603183 613737 625431 633791 637528 639433 640074 636548 628142 617590 606133 592710 578459
55785 578459 566575 557182 547495 537370 529466 523587 516096 505405 493214 480247 465942 452479
55773 452479 443857 440552 439920 441843 448748 459993 471632 481984 491990 499717 500256 492206 479288
55760D79288j4598j6111j6818j5198j3495j3805j3448r800n783n075n784m488
55748C44885k648l243m763m309l253m171n524m830l814m908n906l684j76Q63J18
55733B94637L69Q33p48l009l259k447k972m018l738l426m836o133n178l927m783
55718B47365n642l569m72Q3j020o72P04Q85Q58K798N205N254L954L966M298K297
55702B66292r49k273j932k616m395n272n401o362p559p371o522o434o033l937
55688A99236j871j947k689j681M3L19J72J557L085K495J211J917L590L535K295
55673B11267J955J545j019m246n079m088l995m561l695k018j664j829l22J824
55659A84075J948Q22J361L369M198L736M097N200N101M078M053M585L596J364
$$ plain form
55760 479288 464690 448579 431761 416563 403068 389263 375815 366015 360232 355157 349373 344885
55748 344885 342237 338994 334231 329922 326669 322498 316974 312144 308330 303422 297516 293832 293656 294519 294637
55733 294637 295006 295839 295091 292082 288823 286376 283404 279386 275648 272222 267386 261253 256075 252148 247365
55718 247365 241723 238154 237682 237765 236745 236073 236777 237662 238520 241318 246523 251777 255731 259697 263995 266292
55702 266292 265343 263070 261138 258522 254127 248855 243454 237092 229533 222162 215640 209206 203173 199236
55688 199236 197365 195418 192729 191048 191091 191410 191582 193139 196224 198719 199930 201847 205437 208972 211267
55673 211267 213222 214767 213748 209502 204423 200335 196340 191779 188084 186066 184402 182573 182251 184075
55659 184075 186023 186845 188206 191575 195773 199509 203606 208806 213907 217985 222038 226623 230219 231583
55645B31583j00q36k230l593l483l246n075p650p983o576o330p268o895n072m046
55630A61200m075l379k117k128l069k816j403p62j036q45o22j724l008k321o52
55615A31243p25k141k177p87m50j438j666r09r08j463p35P15N20j016j273j57
55599A16633j38j431j572j00O38r2l84L13K20j072j715j138q75j259r35n8l60
55582A06675j558j387K51Q42l93j322p56k4M7L68J068J015L94O47J422Q76p02
55565A07463j040R4N98J62P76K551K958J233k46j24rr76j600r57l69o89p65K4
55547A09084M92Q9m7M53L55o06r89l80j55p47r18m12m51r38k11J570K049O29m33
55528A08434L8L66m79r09N6O81m83k105k447j940j645j362q38q43j538j758j099
$$ plain form
55645 231583 231483 230647 228417 224824 221341 218095 213020 205370 197387 190811 184481 177213 170318 165246 161200
55630 161200 157125 153746 151629 149501 146432 143616 142213 141451 140415 139570 138948 137224 134216 131895 131243
55615 131243 130518 128377 126200 125413 124963 123525 121859 120950 120042 118579 117844 118559 119079 118063 116790 116633
55599 116633 116495 115064 113492 113392 114030 113938 113554 113867 114087 113015 111300 110162 109287 108028 107093 107035 106675
55582 106675 105117 103730 103981 104823 104430 103108 102352 102328 102375 102743 103811 104826 105220 105867 107289 108165 107463
55565 107463 106423 106517 107115 107277 108053 110604 113562 114795 114549 114425 114416 113440 111840 110883 110514 109825 109060 109084
55547 109084 109576 109665 109618 110071 110426 109820 108831 108451 108296 107549 106631 106219 105768 104830 104619 106189 108238 108867 108434
55528 108434 108472 108838 108359 107450 107506 108187 107704 105599 103152 101212 99567 98205 97367 96524 94986 93228 92129
55511I2129q41j656k427k368k242k501k308j377o22j47J122K902L155J295o12
55496H3502j022r28j422j659p76K76M10J54K78L79L7j65K14P47J255K009K384
55479H5673J231q83j917j346p75r98q62J61P58J86m07j47J73p1k15P8Q1l26k81
55460H0113R2l78j361r77R44K148J526P16J001J284N39k53j65ll70k31J044K241
55442H7910K315J930J692R90k69r03o53q95j981k248r64J76m0m40kK37m65p81
55424H5609J87R70L02n65j99M79J51m60k00K64kj66O90J548J244O27Q68J164L58
55405I2869p01o50q9l92j217j309p67n23n91n42o70j050o98O48J355K76j080p62
55387H4107O21J135N55N7r2l80m56K81J136J070N47P27J497J889J738J440Q13
$$ plain form
55511 92129 91288 89632 87205 84837 82595 80094 77786 76409 75787 75640 76762 79664 82819 84114 83502
55496 83502 82480 81552 80130 78471 77695 77971 78381 78535 78813 79192 79229 79064 79278 80025 81280 83289 85673
55479 85673 86904 86021 84104 82758 81983 80985 80123 80284 81042 81228 80821 80674 80847 80776 80561 80639 80720 80394 80113
55460 80113 80205 79827 78466 77489 78433 80581 82107 82823 83824 85108 85647 85394 85229 85226 84856 84625 85669 87910
55442 87910 90225 92155 93847 94837 94568 93665 93012 92117 90136 87888 86924 87100 87060 86620 86618 86855 86390 85609
55424 85609 85796 86766 87068 86503 86304 86783 86934 86474 86274 86538 86536 86370 87060 88608 89852 90479 91347 92511 92869
55405 92869 92168 91518 91429 91037 89820 88511 87744 87221 86630 86088 85418 84368 83670 84318 85673 85949 84869 84107
55387 84107 84728 85863 86418 86475 86383 86003 85547 85828 86964 88034 88581 89308 90805 92694 94432 95872 96685
55370I6685k57r07m94Q9k38j021j325j471k114k596k003r89q43j367j354o01Q6
55353G9280L47L48k9p62j075m51L56M53K17M31R19J131J204J371J209N75K37N00
55335H6261M13n52j276q40k10o48j589j725j067m65p2K73J65m63o48L6M73o8l96
55316G7602O01J801J580L80l07l60n25n76j0M44J4m09K43J055N76n08m81L97L90
55297H1907o88j343j040p35q34o33O3N95P78J034J263R69M28L39N46L43k62p73
55279H1957j172j493j092L36J723J968J490J099L83j140k328j796j66R43J379
55264H2091J908K139J198j43l16M66P50M60O74J201P95l14n94P7K12n38p94K5
55246H9297P80P15M82N27L33j60j80K56R8q05j191m10N73Q33P07O53L35m85j241
$$ plain form
55370 96685 96428 95521 95027 95116 94878 93857 92532 91061 88947 86351 84348 83359 82516 81149 79795 79194 79280
55353 79280 79627 79975 79946 79184 78109 77658 78014 78467 78684 79115 80034 81165 82369 83740 84949 85524 85761 86261
55335 86261 86674 86122 84846 84006 83796 83148 81559 79834 78767 78302 78230 78503 78668 78205 77557 77593 78066 77998 77602
55316 77602 78203 80004 81584 81964 81657 81297 80772 80196 80186 80630 80644 80235 80478 81533 82109 81601 81120 81517 81907
55297 81907 81219 79876 78836 78101 77267 76634 76697 77292 78070 79104 80367 81336 81764 82103 82649 82992 82730 81957
55279 81957 80785 79292 78200 78536 80259 82227 83717 84816 85199 84059 81731 79935 79769 80712 82091
55264 82091 83999 86138 87336 87193 86877 87343 88093 88553 89227 90428 91223 90909 90315 90392 90604 90066 89272 89297
55246 89297 90077 90792 91274 91801 92134 91974 91794 92050 92148 91343 90152 89742 90315 91148 91855 92508 92843 92358 91117
55227I1117j395j024k42Q92J712J355J27p13p05n76p30o81k78j33m74o58l50m8
55209H7196j20k64k64k84k35J69N77K79n14p87k80J66M9j42J9K53K95K80J62l09
55189H6246p94m90O31J590J678J191P23M74M25M94M05k1m67n40m05l62k30Q4J5
55170I0647p16j164m02Q60J255Q46P27R10L41r93j717j107k9N19M80J67k33k94
55152I0097L52J178J266O98L85N49N41J72m9o7l86r40j010m17K83P89J135R95
55134I5571J79m43L5Q69N99n20q07Q1O53O7p28q96q47r08n92R2K13m15o62L8O88
55113I2267M66k5j03j87o46p66LR17J081P93P32P43M07J7K2K04K44L68P04P23
55093I7964J23m55l44J66M44M47L87J08m27o75k42M04N76K57j36l43k17L75J132
$$ plain form
55227 91117 89722 88698 88456 89348 91060 92415 92542 91829 91124 90548 89818 89137 88859 88726 88252 87594 87244 87196
55209 87196 87076 86812 86548 86264 86029 86198 86775 87054 86540 85753 85473 85639 85688 85546 85565 85818 86113 86393 86555 86246
55189 86246 85452 84962 85593 87183 88861 90052 90775 91249 91674 92168 92573 92552 92085 91545 91140 90778 90548 90632 90647
55170 90647 89931 88767 88365 89225 90480 91326 92053 92963 93304 92311 90594 89487 89458 89977 90457 90624 90391 90097
55152 90097 90449 91627 92893 93591 93976 94525 95066 95238 95189 95122 94736 93796 92786 92369 92652 93441 94576 95571
55134 95571 95750 95307 95342 96211 96810 96290 95483 95564 96217 96284 95556 94660 93813 92905 92313 92405 92618 92203 91541 91579 92267
55113 92267 92733 92708 92605 92418 91772 91006 91009 91926 93007 93800 94532 95275 95682 95699 95721 95925 96169 96537 97241 97964
55093 97964 98087 97632 97288 97454 97898 98345 98732 98840 98413 97738 97496 97900 98476 98733 98597 98254 98037 98412 99544
55074I9544J392R81N13M20L54j25q43j377j590j423p93N5O26Q77J220J651J567
55057A03049P27l24r86j174r69m36P0J27n4J39P22J151J314J561J713J133o2r40
55039A06761j073q53m11M52J109M20j315k206j338r4o3q61j109m74L63R10J025
55022A01243M95m95j058o79j2Q2k10j75K43N47N45L95J52p5P8P16J311J309P88
55003A05200J86k02j73L95J199J628J538J325J080M29n57j133r64n90m90l78P8
54986A08571O32R12Q23K25r40j954j789o52M2k98n86Q0R72J052O81Q54J528J871
54968A12024J648J264R07M85J71J75L08L63N23Q59R17M15j84l77l29k94J6P47
54950A19638J214P23l25r59r34q16r88j261j232o60L17J039Q97K20J1N72J145
$$ plain form
55074 99544 100936 101917 102430 102850 103204 103079 102236 100859 99269 97846 97053 97108 97734 98611 99831 101482 103049
55057 103049 103776 103452 102466 101292 100323 99887 99957 100084 100030 100169 100891 102042 103356 104917 106630 107763 107701 106761
55039 106761 105688 104835 104424 104876 105985 106405 105090 102884 101546 101452 101389 100528 99419 98945 99308 100218 101243
55022 101243 101738 101243 100185 99506 99494 99576 99366 99191 99434 99981 100526 100921 101073 100998 101076 101792 103103 104412 105200
55003 105200 105386 105184 105011 105406 106605 108233 109771 111096 112176 112605 112048 110915 109951 109361 108871 108493 108571
54986 108571 109203 110115 110938 111163 110223 108269 106480 105828 105870 105572 104986 105066 106038 107090 107771 108625 110153 112024
54968 112024 113672 114936 115843 116328 116499 116674 116982 117345 117868 118727 119644 120059 119875 119498 119169 118875 118891 119638
54950 119638 120852 121575 121250 120291 119357 118541 117553 116292 115060 114400 114717 115756 116653 116873 116884 117456 118601
54933A18601J284J528K183K486J902J287J589K168J810R22J261L434N917O953
54919A53325O543O121O748Q056Q725P761N347K461r8k135l711m923o043p229q071
54904A72877p947o998o009n289m389l156k162j774j631j450j489j726j492n05
54890A26860N28R32R47J006R21M77J07K50O55J026J717L047M588N786O750P699
54874A63296Q223P864O894N838M647L027J127p52k643m526n977o751p253p803
54860A65211q030p520o469n234l819k367j430j212j189j105j428k298k877k551
54846A17682j918j735j751j492j334j706j964j264k0N77J35o95j118n79J074K973
54830A06865L495K135M08j07K32J40m34o52m79n11n29J12R21P11m66j306j202
$$ plain form
54933 118601 119885 121413 123596 126082 127984 129271 130860 133028 134838 135760 137021 140455 146372 153325
54919 153325 159868 165989 172737 180793 189518 197279 202626 205087 204989 202854 199143 194220 188177 180948 172877
54904 172877 164930 157932 151923 146634 142245 139089 136927 135153 133522 132072 130583 128857 127365 126860
54890 126860 127388 128320 129267 130273 131194 131671 131778 132028 132683 133709 135426 138473 143061 148847 155597 163296
54874 163296 171519 179383 186277 192115 196762 199789 200916 200164 197521 192995 187018 180267 173014 165211
54860 165211 157181 149661 143192 137958 134139 131772 130342 129130 127941 126836 125408 123110 120233 117682
54846 117682 115764 114029 112278 110786 109452 107746 105782 104518 104498 105075 105210 104515 103397 102818 103892 106865
54830 106865 110360 112495 112903 112796 113028 113168 112734 112082 111603 111092 110563 110675 111596 112307 111841 110535 109333
54813A09333q02n40n2P55J254J135Q43O64M19K06N36J325J678J007k02j040j012
54796A15507j77R36J541J319Q83R22J130O75l66j036q79m36k69l00k05K24J134
54779A20603K352L100K707J593Q37Q05R97J126J439J985K506L210M670O718Q296
54764A62944Q840Q932R202R180P966N576L053J260m4j780m254o561p550p329p077
54749A82358p311p191o018m518l768l583l065k193j671j476q51K74J043R69M72
54734A43471j0m62o88j68J042K105K413K262K281K704L437M336N252O140P114
54719A81229Q048Q303P345N481L455J515n11k490m061n273o456p509q001p827
54705A73248p109n873m427l671l983m268l302j699j152j790j887n21J047J310
$$ plain form
54813 109333 108531 107991 107939 108694 109948 111083 111926 112590 113009 113215 113751 115076 116754 117761 117559 116519 115507
54796 115507 115330 116266 117807 119126 120009 120931 122061 122736 122370 121334 120455 120019 119750 119450 119245 119469 120603
54779 120603 122955 126055 128762 130355 131192 131997 132994 134120 135559 137544 140050 143260 147930 154648 162944
54764 162944 171784 180716 189918 199098 207064 212640 215693 216953 216909 215129 210875 204314 196764 189435 182358
54749 182358 175047 167856 161838 157320 153552 149969 146904 144711 143040 141564 140713 140987 142030 142999 143471
54734 143471 143461 142999 142311 142143 143185 145290 147703 149965 152246 154950 158387 162723 167975 174115 181229
54719 181229 189277 197580 204925 210406 213861 215376 214865 212375 208314 203041 196585 189076 181075 173248
54705 173248 166139 160266 155839 152168 148185 143917 140615 138916 137764 135974 134087 133566 134613 135923
54691A35923N39q0k88o97j476k090k152j786j245o29l7L22J86n20j400j756j352
54674A21462p61n75n61k29J90J01l06k70K61N49L48K35M46L85k47p84n73O8L82
54655A20121J47l25o71n98L2R17J524J747J933K065J637N84k75k24M18P69M94
54638A30295l5l96n30o07o64m87J61J075J585J281M97k15q05j416j706j206k23
54621A26604L58J71l94r24j285j195m09O49J181J039Q08P23L86k90o50j73Q15
54604A27414J624J842J363L52n81p35j10O22R97J078R01L12m80q53n62MM79R04
54586A34571J241J186O76M3m96j011j427j482j193p80j17J035K201K472J701O74
54570A39294j6m86p80o87n05j002k107k589j656k8J140J597J633J227M40RN32
$$ plain form
54691 135923 136462 136382 136094 135397 133921 131831 129679 127893 126648 126019 125982 126304 126490 125970 124570 122814 121462
54674 121462 120701 120126 119565 119336 119526 119627 119321 119051 119312 119861 120209 120444 120890 121275 121028 120244 119671 119739 120121
54655 120121 120268 119943 119272 118674 118706 119623 121147 122894 124827 126892 128529 129113 128838 128614 129032 129801 130295
54638 130295 130260 129864 129334 128727 128063 127576 127737 128812 130397 131678 132175 131960 131155 129739 128033 126827 126604
54621 126604 126962 127133 126739 125815 124530 123335 122926 123575 124756 125795 126603 127326 127712 127422 126772 126599 127414
54604 127414 129038 130880 132243 132595 132014 131279 131169 131791 132788 133866 134767 135079 134599 133746 133184 133188 133667 134571
54586 134571 135812 136998 137674 137717 137221 136210 134783 133301 132108 131328 131211 132246 134447 136919 138620 139294
54570 139294 139278 138792 138012 137325 136820 135818 133711 131122 129466 129438 130578 132175 133808 135035 135475 135484 136016
54553A36016J436J607R18K53J82L03O6l71l83K65J091J446J226Q58N89K09k37
54536A45474p1J107K445K651J666O53L74M26K93J74L45N04K24l87q83r85o53j05
54518A53252J63j17m55j77M07K54q25j649j122L76J506J408L47o32o03K72P35
54501A53140r7j428j749q56P9L70M97Q28R84Q34Q58R99M54p82j402o25N67R73
54483A53644Q78J214J886K142J870J413O79m55j316j164m18j14l50k91M02J156
54467A61176J531J799K250K609K421J717J027Q61J158J256O45l65j004j024p95
54452A75262n56k45j54p64j698j822q26K17L82O6j9m0m32q85q73o34o68q52p67
54433A64692n41n13o11o96r73j388j297n03R1j72n06R4J106J264N82K21N41O97
$$ plain form
54553 136016 137452 139059 139977 140230 140412 140715 140781 140410 140027 140292 141383 142829 144055 144913 145502 145711 145474
54536 145474 145403 146510 148955 151606 153272 153925 154299 154725 155018 155192 155537 156041 156265 155878 154995 154010 153357 153252
54518 153252 153415 153298 152843 152666 153073 153327 152502 150853 149731 150107 151613 153021 153368 152736 152133 152405 153140
54501 153140 153043 151615 149866 149010 149089 149459 149956 150784 151768 152602 153460 154459 154913 154131 152729 152104 152671 153644
54483 153644 154522 155736 157622 159764 161634 163047 163726 163271 161955 160791 160373 160259 159909 159618 160020 161176
54467 161176 162707 164506 166756 169365 171786 173503 174530 175391 176549 177805 178450 178085 177081 176057 175262
54452 175262 174706 174461 174307 173543 171845 170023 169197 169414 169796 169862 169843 169803 169371 168486 167613 166979 166311 165459 164692
54433 164692 164151 163638 163027 162331 161358 159970 158673 158170 158261 158089 157583 157677 158783 160047 160629 160850 161391 162088
54415A62088J93m08n35l22o8K01L87K84O4J41N43Q98J035J008P43K84J62O80J127
54396A68505O09m31o28L31J258J296J063J452K172K218J325J74n57q54j066j310
54380A75557j244n43M64Q69K41o96q89k21N24Q17P90N86M8o91j069p54r3M58Q41
54361A74995J102R52Q8j199k097k006j069l8L68Qo66j044q55k30M92R75R85N27
54343A71288j91q79j265j203q60o45o35l04P52J965K278J577Q65Q82J161Q52j16
54326A75522j120j654j676j486j534k030k506k277j440p83n58j60O02R10K30o45
54310A59395o28J47O97O17K88M8j23k85n04r01j263j017q3O86M71n14j457j878
54292A53696j616n41J021K077J914Q73k49j102j529j213k65M89N45L85M04J28
$$ plain form
54415 162088 162281 161873 161338 161016 160948 161149 161536 161820 161884 162025 162568 163466 164501 165509 166252 166536 166698 167378 168505
54396 168505 169114 168683 168055 168386 169644 170940 172003 173455 175627 177845 179170 179344 178787 177933 176867 175557
54380 175557 174313 173770 174234 175103 175344 174648 173759 173538 174062 174879 175669 176255 176303 175612 174543 173789 173696 174154 174995
54361 174995 176097 177049 177137 175938 173841 171835 170766 170728 171096 171104 170438 169394 168539 168309 168801 169776 170761 171288
54343 171288 171097 170218 168953 167750 166890 166245 165610 165306 166058 168023 170301 171878 172743 173625 174786 175638 175522
54326 175522 174402 172748 171072 169586 168052 166022 163516 161239 159799 159016 158458 158298 158900 159810 160040 159395
54310 159395 158767 158914 159611 160228 160516 160564 160441 160156 159652 158751 157488 156471 156388 157074 157545 157031 155574 153696
54292 153696 152080 151539 152560 154637 156551 157424 157175 156073 154544 153331 153066 153555 154100 154485 154889 155017
54276A55017o67j036k80O39M67l11l24M04O82L03K03O32P58K47k17j67J60O14
54258A57124J216J476R10K05M73J426J685R18J22k68q62j598j428k72L83l18j334
54241A59858j545j348j458j444o98K16M40K20L08O35O44L79K52K56K15L14N73
54224A57817M14m08j058o91J81M11j27n56m23j43j25l05n67q81j015o71k5L06
54206A52134qo12q35l82K81K44q43k033j927l22J467K161J786J116O10L97O74
54189A53908J405K033K023J430N84l23r39o71M32J261Q29m33j327j438j306j320
54173A56148j273j010p41n96m45j92J22N03Q63Q44K14o03r34p11m34l43k26n1
54155A51135r7l26k35L38P25K79o26r45k89N44N36l43j095q30K69J174J138M01
$$ plain form
54276 155017 154350 153314 153034 153673 154140 153829 153505 153909 154591 154894 155097 155729 156487 156734 156517 156350 156510 157124
54258 157124 158340 159816 160726 160931 161404 162830 164515 165433 165555 165287 164425 162827 161399 161127 161510 161192 159858
54241 159858 158313 156965 155507 154063 153365 153581 154021 154241 154549 155184 155828 156207 156459 156715 156930 157244 157817
54224 157817 158231 157823 156765 156074 156255 156666 156539 155983 155560 155417 155292 154987 154420 153539 152524 151853 151828 152134
54206 152134 152126 151514 150679 150297 150578 150822 149979 147946 146019 145697 147164 149325 151111 152227 152837 153234 153908
54189 153908 155313 157346 159369 160799 161383 161060 160121 159450 159882 161143 161972 161539 160212 158774 157468 156148
54173 156148 154875 153865 153124 152528 152083 151891 152013 152516 153379 154223 154437 153834 152900 152189 151755 151412 151186 151135
54155 151135 151038 150712 150477 150815 151540 151819 151193 150248 149959 150503 151039 150696 149601 148771 149040 150214 151352 151753
54137A51753j67j1N86Q95N30j29l60J56R81J348Q05m29j543j585k83J430K047
54120A56024J006o21j290o49L38O90M04K22P52J838K594K223R65q3k78j63m42
54103A63530q54p68l35k02l34k46j23n76j269j075J34J060Q37J53o4k7k90n07
54085A59044o8O83Q40K74l31n19l21K66J185J831J488L99k94J06J089J713J658
54068A69043J289R44N59n1p44j027n92K47Q35Q77N72J51l82q22o31M45J823K579
54050A75115K368J655J127J085J356J599J727K030K736L557L993M173M883O585
54036B13989Q653R977J0146R839J0092J1319J2965J4034J3986J2955J1112Q161
54024C47228L964o75m416o629p671p986p615o661n578m646l703k679j965j949
$$ plain form
54137 151753 151586 151575 152161 153056 153586 153457 153097 153253 154234 155582 156387 155958 154415 152830 152547 153977 156024
54120 156024 157030 156409 155119 154470 154808 155498 155902 156124 156876 158714 161308 163531 164496 164413 164135 163972 163530
54103 163530 162676 161908 161573 161371 161037 160791 160668 160092 158823 157748 157882 158942 159779 159932 159868 159841 159551 159044
54085 159044 158976 159659 160499 160773 160442 159923 159602 159868 161053 162884 164372 164771 164477 164583 165672 167385 169043
54068 169043 170332 171276 171835 171784 171040 170013 169421 169668 170503 171380 171952 172103 171721 170899 170268 170713 172536 175115
54050 175115 177483 179138 180265 181350 182706 184305 186032 188062 190798 194355 198348 202521 207404 213989
54036 213989 222642 232619 242765 252604 262696 274015 286980 301014 315000 327955 339067 347228
54024 347228 351192 350517 346101 339472 331801 323815 316200 309539 303961 299315 295612 292933 290968 289019
54010B89019k544l385m099m313l825l005k554k709l129l591m214m816m847m276
53996B37712l857l984l974l135j949j461j823k222k120j815j765j882j760j243
53982B04722n80j19L7%k26p95j555j860j272k73K39J9m18o48o12k62L24N60l5
53963A97246q40p09L82J222J117O28L60K15K18Q19J714J673L99o22j76Q86J136
53946B05668Q60J339K615L495L572L685M449N481O182O312N819N012M755N592
53932B64836O769P041O311N455M739L502J522m07j501j699j134J44J676K636K785
53917C02675K773L207L935M534M874N006N008N229O138P631Q837Q959Q091P033
53903C83930O529O676O944O700N833M684L357J565n86k334l277m067n406o887
$$ plain form
54010 289019 286475 283090 278991 274678 270853 267848 265294 262585 259456 255865 251651 246835 241988 237712
53996 237712 233855 229871 225897 222762 220813 219352 217529 215307 213187 211372 209607 207725 205965 204722
53982 204722 204142 204023 204060 204060 203834 203039 201484 199624 198352 198079 198318 198337 197919 197271 196659 196397 196721 197281 197246
53963 197246 196406 195697 196079 197301 198418 199046 199406 199621 199839 200658 202372 204045 204444 203822 203646 204532 205668
53946 205668 206528 207867 210482 213977 217549 221234 225683 231164 237346 243658 249477 254489 259244 264836
53932 264836 271605 278646 284957 290412 295151 298653 300175 299768 298267 296568 295434 295578 297254 299890 302675
53917 302675 305448 308655 312590 317124 321998 327004 332012 337241 343379 351010 359847 368806 376897 383930
53903 383930 390459 397135 404079 410779 416612 421296 424653 426218 425632 423298 420021 415954 410548 403661
53889D03661p722q058q531q909q399p105n937n099l966k576j832j834j306O46
53875C33033L339N685P640R618J1274J1747J0534P506K537l980j0617j5601j8008
53862C54707j8024j6514j4555j2895j1392r477p409o297o454o619n636m115l377
53849B31943l419l118k171j449j403j402r49n11o11r29r08o48o20q03o99o2P97
53832B13038J275R50q7j149j586j536j673k084j943p25P97J408R58L38J68K14
53816B08363J21JQ2L44P09J104J221P68K05N21J850K999K923K154J998K707L332
53799B31402L268L003L191L793M389M756M833M574M107L715L502L338L123K778
53785B83772K089J106N18R51J837J855O58o31j023r45j376k415l391l868l927
$$ plain form
53889 403661 395939 387881 379350 370441 362042 354937 349000 343901 339935 337359 335527 333693 332387 333033
53875 333033 336372 342057 349697 359315 370589 382336 392870 400376 402913 398933 388316 372715 354707
53862 354707 336683 320169 305614 292719 281327 271850 264441 258144 251690 245071 239435 235320 231943
53849 231943 228524 225406 223235 221786 220383 218981 218032 217521 216910 215981 215073 214425 213805 213002 212303 212241 213038
53832 213038 214313 215263 215176 214027 212441 210905 209232 207148 205205 204480 205277 206685 207643 207981 208149 208363
53816 208363 208484 208485 208567 208911 209620 210724 211945 212713 212918 213439 215289 218288 221211 223365 225363 228070 231402
53799 231402 234670 237673 240864 244657 249046 253802 258635 263209 267316 271031 274533 277871 280994 283772
53785 283772 285861 286967 287485 288436 290273 292128 292786 292155 291132 290187 288811 286396 283005 279137 275210
53770B75210l745l487l326l176k709k013j707k060k495k529k557l036l438k923
53756B36009j743j059j416k142k316j711p81j82l72j140j631j259m89l27j084
53741B18357k036k257j429K7J324J920K012K126K129J224o57k209k209j107l06
53726B16909k59k35K96J027J556J815J735J178M10m6q9k6N0L20O77P82O05M22
53708B27127L60N28J265K564L501L185K098J572K015K660L029L427L838L540K310
53693B63019J044O21R01J332J725J978J781J173P08O20M38o4l18N7M19Jr13j459
53675B73063j405j084n33M39J437J588O10p81j673j793j461j118r95j044j042
53660B64208q42n58m25n47q19r97q24k34M56O78O0j204k355k473j167R03K434
$$ plain form
53770 275210 271465 267978 264652 261476 258767 256754 255047 252987 250492 247963 245406 242370 238932 236009
53756 236009 234266 233207 231791 229649 227333 225622 224841 224659 224287 223147 221516 220257 219768 219441 218357
53741 218357 216321 214064 212635 212662 213986 215906 217918 220044 222173 223397 222740 220531 218322 217215 216909
53726 216909 216650 216415 216711 217738 219294 221109 222844 224022 224432 224386 224297 224271 224321 224641 225318 226100 226705 227127
53708 227127 227487 228015 229280 231844 235345 238530 240628 242200 244215 246875 249904 253331 257169 260709 263019
53693 263019 264063 264684 265585 266917 268642 270620 272401 273574 274282 274902 275340 275276 274958 275015 275434 275435 274522 273063
53675 273063 271658 270574 270041 270480 271917 273505 274115 273334 271661 269868 268407 267289 266294 265250 264208
53660 264208 263366 262808 262383 261836 261017 260020 259196 258962 259418 260096 260156 258952 256597 254124 252957 253860 256294
53643B56294K630J863R62K59l10n46j67N91J184J495J713J693J185O11O95J218
53627B71370J153K35n17k64N47J089J351J723K055K028J978K517L473M018L792
53612B96548L322L224L553L990M252M103L393K358J692J973K916L462K840J467
53598C39093N30O62J373J858J937J864J655J106L24k86m66k75K7L8m92j149j127
53581C46672m09n6o91j449j298o71n67o55J85J677K287J626J090J592K272K129
53565C53734J572J416J505J327R99P66L11n16j096j031r99j638k247j708k28Q71
53549C53038Q36J21m60m35L19J481K309K255J510O94L32Q63K493M605N946O024
53533C81931N746O036O527O388N889O092P307Q757R739J0260J0661J1221J2127
$$ plain form
53643 256294 258924 260787 261749 262008 261698 261152 260985 261576 262760 264255 265968 267661 268846 269457 270152 271370
53627 271370 272523 272758 272241 271977 272524 273613 274964 276687 278742 280770 282748 285265 288738 292756 296548
53612 296548 299870 303094 306647 310637 314889 318992 322385 324743 326435 328408 331324 334786 337626 339093
53598 339093 339623 340285 341658 343516 345453 347317 348972 350078 350402 350116 349650 349375 349402 349440 348948 347799 346672
53581 346672 346263 346207 345516 344067 342769 342098 341531 340876 341061 342738 345025 346651 347741 349333 351605 353734
53565 353734 355306 356722 358227 359554 360553 361319 361630 361114 360018 358987 357988 356350 354103 352395 352167 353038
53549 353038 353874 353995 353535 353100 353419 354900 357209 359464 360974 361668 362000 362863 365356 369961 375907 381931
53533 381931 387677 393713 400240 406628 412517 418609 425916 434673 444412 454672 465333 476554 488681
53520D88681J3259J4148J4525J4711J5108J5658J6271J7210J8575J9875K0831
53509F68852K2017K3922K5867K6750K6583K6310K6384K6422K6111K5539K4658
53498I49415K3342K1954K1083K0661K0165J9662J9870K1035K2382K2990K2612
53487A185171K1598K0513J9861J9708J9497J8658J7404J6447J6108J6190J6526
53476A387681J7016J7166J6347J4528J2215R682O872M011J601l26k294m595o977
53463A472927r249j1616j4190j6598j8350j9273j9483j9213j8833j8773j9327
53452A288022k0589k2419k4292k5501k5801k5546k4877k3382k1101j9264j9064
53441A036186j9935k0086j8665j6481j4547j2868j0986q884o876n111l588k324
$$ plain form
53520 488681 501940 516088 530613 545324 560432 576090 592361 609571 628146 648021 668852
53509 668852 690869 714791 740658 767408 793991 820301 846685 873107 899218 924757 949415
53498 949415 972757 994711 1015794 1036455 1056620 1076282 1096152 1117187 1139569 1162559 1185171
53487 1185171 1206769 1227282 1247143 1266851 1286348 1305006 1322410 1338857 1354965 1371155 1387681
53476 1387681 1404697 1421863 1438210 1452738 1464953 1474635 1481507 1485518 1487119 1486793 1484499 1479904 1472927
53463 1472927 1463678 1452062 1437872 1421274 1402924 1383651 1364168 1344955 1326122 1307349 1288022
53452 1288022 1267433 1245014 1220722 1195221 1169420 1143874 1118997 1095615 1074514 1055250 1036186
53441 1036186 1016251 996165 977500 961019 946472 933604 922618 913734 906858 901747 898159 895835
53429H95835j300m35L73J412L143N575P924R442J0403J1601J3212J4898J6719
53416I88802J8953K1078K2178K2483K3340K5363K7617K9150L0258L1626L3188
53405A274036L4584L6011L7757L9453M0627M1655M3384M6029M9043N1871N4258
53394A748708N6037N7153N7887N8627N9421O0024O0230N9945N9131N7922N6623
53383B391708N5322N3744N1626M9020M6036M2633L8897L5155L1558K7884K3985
53372B847568K0097J6361J2457Q052L278j632o856j2702j9149k6156l4073m3044
53360B764201n2054n9208o3229o4390o3997o3326o3034o3106o3049o2410o1247
53349B085151o0013n8875n7398n5147n2399n0052m8788m8513m8601m8452m7701
$$ plain form
53429 895835 894535 894100 894473 895885 899028 904603 912527 921969 932372 943973 957185 972083 988802
53416 988802 1007755 1028833 1051011 1073494 1096834 1122197 1149814 1178964 1209222 1240848 1274036
53405 1274036 1308620 1344631 1382388 1421841 1462468 1504123 1547507 1593536 1642579 1694450 1748708
53394 1748708 1804745 1861898 1919785 1978412 2037833 2097857 2158087 2218032 2277163 2335085 2391708
53383 2391708 2447030 2500774 2552400 2601420 2647456 2690089 2728986 2764141 2795699 2823583 2847568
53372 2847568 2867665 2884026 2896483 2904535 2907813 2906181 2899325 2886623 2867474 2841318 2807245 2764201
53360 2764201 2712147 2652939 2589710 2525320 2461323 2397997 2334963 2271857 2208808 2146398 2085151
53349 2085151 2025138 1966263 1908865 1853718 1801319 1751267 1702479 1653966 1605365 1556913 1509212
53338A509212m6105m3652m0732l7885l5259l2590k9857k7491k5668k3806k1299
53327A144868j8411j5890j3860j1868r967q931r081r584r407q519p657p212o842
53314A007639o012m509k514m95J056K061L040M580O656Q639R946J0502J0671J0952
53300A062212J1754J3233J5251J7500J9738K1851K3787K5458K6835K8029K9267
53289A294915L0651L1931L2551L2051L0454K8293K6276K4773K3501K1734J9066
53278A596196J5962J3316J1380R463O855L641M27k424m917p202r573j2367j5409
53265A605348j7877j9257k0221k1932k4645k7610l0204l2419l4200l5155l5266
53254A306562l5158l5365l5698l5745l5468l4940l3910l2123k9877k7861k6512
$$ plain form
53338 1509212 1463107 1419455 1378723 1340838 1305579 1272989 1243132 1215641 1189973 1166167 1144868
53327 1144868 1126457 1110567 1096707 1084839 1074872 1065941 1056860 1047276 1037869 1029350 1021693 1014481 1007639
53314 1007639 1001627 997118 994604 994109 995165 997226 1000266 1004846 1011502 1020141 1030087 1040589 1051260 1062212
53300 1062212 1073966 1087199 1102450 1119950 1139688 1161539 1185326 1210784 1237619 1265648 1294915
53289 1294915 1325566 1357497 1390048 1422099 1452553 1480846 1507122 1531895 1555396 1577130 1596196
53278 1596196 1612158 1625474 1636854 1646317 1653172 1656813 1657240 1654816 1649899 1642697 1633124 1620757 1605348
53265 1605348 1587471 1568214 1547993 1526061 1501416 1473806 1443602 1411183 1376983 1341828 1306562
53254 1306562 1271404 1236039 1200341 1164596 1129128 1094188 1060278 1028155 998278 970417 943905
53243I43905k5801k5561k5716k6170k6613k6621k6040k5243k4764k4533k3703
53232F63140k1599j8641j5964j4226j3173j2235j1047r482p773o629o665p498
53220E18208p996p662p222p602q749r873j0465j0664j0746j0668j0112q912p465
53207D00072o548o507o721o325n379m785n022n566n748n541n215m776m194l800
53193C23945l923m397m761m754m363l678k949k478k169j599q31o71j655l096l776
53178B78845l357k572k135j973j599p57L33J125J116L76m22p49q24j073j315j031
53162B63988m47m82j393k165j850r47p26j393j868j412o47m76p84q50o02n86q59
53145B46501q89n66m83q60j075o46j00j75p65j252j388j269p30L23J422K050K375
$$ plain form
53243 943905 918104 892543 866827 840657 814044 787423 761383 736140 711376 686843 663140
53232 663140 641541 622900 606936 592710 579537 567302 556255 546773 539000 532371 525706 518208
53220 518208 510212 502550 495328 487726 478977 469104 458639 447975 437229 426561 416449 407537 400072
53207 400072 393524 387017 380296 373971 368592 363807 358785 353219 347471 341930 336715 331939 327745 323945
53193 323945 320022 315625 310864 306110 301747 298069 295120 292642 290473 288874 288043 287372 285717 282621 278845
53178 278845 275488 272916 270781 268808 267209 266452 266785 267910 269026 269402 268980 268231 267407 266334 265019 263988
53162 263988 263541 263059 261666 259501 257651 256704 255978 254585 252717 251305 250658 250182 249398 248548 247946 247360 246501
53145 246501 245612 245046 244563 243703 242628 241982 241882 241707 240942 239690 238302 237033 236303 236626 238048 240098 242473
53128B42473K712K605J470q4p18k45J40k43n46J28J246J603R66J54j21J97P53
53111B52490J053O80k40r77r85n24k22k95o15j239k307l471l961l404k277j416
53095B32290j203j368j467j356j090n34M45J393J416K92j040j565j353j024n25
53080B23311N88J943K480J948J204Q62N62m1n16m15m1J25J62L09M06K43M1O3J62
53061B33396R1r6l09o62j139j402j301r99m95M44J477J632N52q43j445j139m09
53044B27353N67J607J960R55r44k485k933k524j878j429j222r11j63O47O03n15
53028B18688j699j926j323n79J61J030J600J257J87q36j460j886k091j727p23
53013B08673N56J693K334K154J292N14M22O97P00M62L94L74j6n22l92M65J254
$$ plain form
53128 242473 245185 247790 249260 249176 248458 248213 248353 248110 247564 247692 248938 250541 251507 251661 251540 251737 252490
53111 252490 253543 254223 253983 253006 252021 251497 251275 250980 250365 249126 246819 243348 239387 235983 233706 232290
53095 232290 231087 229719 228252 226896 225806 225272 225717 227110 228526 228818 227778 226213 224860 223836 223311
53080 223311 223899 225842 228322 230270 231474 232336 232898 232857 232341 231926 231885 232010 232172 232481 232887 233130 233171 233234 233396
53061 233396 233487 233391 233082 232420 231281 229879 228578 227579 227084 227528 229005 230637 231189 230346 228901 227762 227353
53044 227353 227920 229527 231487 232442 231498 229013 226080 223556 221678 220249 219027 218116 217953 218600 219203 218688
53028 218688 216989 215063 213740 213161 213322 214352 215952 217209 217396 216560 215100 213214 211123 209396 208673
53013 208673 209229 210922 213256 215410 216702 217216 217638 218335 219035 219497 219891 220265 220249 219727 219335 219800 221054
52996B21054J367R41K87n57j399j703j177k81J60j83p78o81M78J877K274J457
52980B23136N09L61P08Q09O37N73N33K39l4J20M86O91J084K145L324L550K787
52963B41658J951J382N73m70q61l10J81k77j191j525j161q27j079j909k955l576
52947B29604l039j340L84P98j87j334j525r25n21o99p80q4R87J465J194R43J067
52930B26008R54J83o28q06p36j105j641j602j144j101j580j783j260m04K99P13
52914B14367O82J37l97k03O00J201J236R61L53q79k268k655j729n41q6j38m7J55
52896B10749J5n12j061j285r83j83O01Q16P21J131K104K639K110J199P91O38j00
52879B19390j397k330k282j550p13m8M48P53P37L23k83o02l42K31O33Q19J171
$$ plain form
52996 221054 222421 223362 223649 223092 221693 219990 218813 218532 218692 218509 217731 217050 217528 219405 221679 223136
52980 223136 223645 224006 224714 225523 226160 226733 227266 227505 227471 227591 228077 228768 229852 231997 235321 238871 241658
52963 241658 243609 244991 245564 245094 244233 243923 244104 243827 242636 241111 239950 239123 238044 236135 233180 229604
52947 229604 226565 225225 225609 226407 226220 224886 223361 222436 221915 221216 220436 220352 221339 222804 223998 224941 226008
52930 226008 226962 227145 226517 225711 224975 223870 222229 220627 219483 218382 216802 215019 213759 213355 213654 214367
52914 214367 215049 215186 214789 214586 215186 216387 217623 218584 218937 218058 215790 213135 211406 210865 210779 210641 210594 210749
52896 210749 210764 210252 209191 207906 206923 206740 207341 208157 208878 210009 212113 214752 216862 218061 218852 219490 219390
52879 219390 217993 215663 213381 211831 211118 211070 211518 212271 213008 213331 213048 212446 212104 212335 212968 213787 214958
52862B14958J880K733L481M013M179L897L385K883K219J122j66j145j797k397
52848B39245k788k614k159k102k423k548k507k878l437l153j912j025j358k084
52834B06257k035j391j026j021p67q2P21J473K078K179J564O44n3n24r45j148
52818B05924j006q46r30r60o28j56K75J034K287L280L243K548K136K151K009J516
52802B21877J015N23l70j670k771l170k915k367j927j894k119j981j128k2O57
52787B01738Q11O79K12n84j078o45L00P05K70l00m04j71P0L11O25R00R66O73m1
52768B05037q50j050l89L56K80l79n94o2M76M69K06M7j82o03p61k48N57R02O07
52749B03819J55JM8j24o79j194r89J73J729K824L070K691K070J465J033Q54R26
$$ plain form
52862 214958 216838 219571 223052 227065 231244 235141 238526 241409 243628 244750 244584 243439 241642 239245
52848 239245 236457 233843 231684 229582 227159 224611 222104 219226 215789 212636 210724 209699 208341 206257
52834 206257 204222 202831 201805 200784 200017 199935 200656 202129 204207 206386 207950 208594 208541 208017 207072 205924
52818 205924 204918 204072 203142 202182 201554 201398 201673 202707 204994 208274 211517 214065 216201 218352 220361 221877
52802 221877 222892 223415 223045 221375 218604 215434 212519 210152 208225 206331 204212 202231 201103 201081 201738
52787 201738 202549 203228 203440 202856 201778 201133 201433 202138 202408 202108 201704 201533 201603 201914 202539 203439 204405 205078 205037
52768 205037 204187 203137 202748 203104 203384 203005 202411 202349 202825 203294 203500 203547 203365 202762 202001 201753 202310 203212 203819
52749 203819 203974 203975 204023 203899 203220 202026 201037 201210 202939 205763 208833 211524 213594 215059 216092 216946 217872
52732B17872J237J672J837J305K98l22j10L35K56j67k70r6k61p95j025o66k60
52715B20840k57m11m01l97n97p33n02j60k40q69j674k271k452k100j203p1P45
52698B07247Q73N18K93N34R12R03N54M05N84N83J50j10M41J434J933J642J080
52681B19976O93M68L84N72R43J158J060P37K08m83r54q46m65m15n71j86Q64J712
52663B24855J708J254R78P75K50l57m63p3K38K15K33O53J315J829K041K063J985
52646B39499J712J047n5j329k274k559k253j713j245r24o45l16J2K12L22N80J077
52629B31148J491J394Q19L50N25J250J848J644N10j058k357k918k582j472j07
52614B30485N72p5j499k290j691l93M49N27K57r9m97o50k57L30M73J93R5L12L19
$$ plain form
52732 217872 219109 220781 222618 223923 224221 223899 223789 224124 224380 224213 223943 223847 223586 222791 221766 221100 220840
52715 220840 220583 220172 219771 219374 218777 218044 217542 217382 217142 216273 214599 212328 209876 207776 206573 206502 207247
52698 207247 208120 208638 208931 209465 210377 211280 211834 212239 212823 213406 213556 213446 213887 215321 217254 218896 219976
52681 219976 220669 221137 221521 222093 223036 224194 225254 225991 226199 225716 224762 223916 223451 223036 222465 222279 223143 224855
52663 224855 226563 227817 228795 229570 229820 229463 229000 228927 229165 229380 229613 230266 231581 233410 235451 237514 239499
52646 239499 241211 242258 242203 240874 238600 236041 233788 232075 230830 229906 229261 228945 228957 229169 229491 230071 231148
52629 231148 232639 234033 234852 235202 235727 236977 238825 240469 240979 239921 237564 234646 232064 230592 230485
52614 230485 231057 230982 229483 227193 225502 225109 225558 226085 226342 226243 225746 225096 224839 225169 225642 225835 225930 226242 226561
52595B26561q4l20M5O54J000J151J347J338P64j4j42O43J592J797J225P22R87
52578B39266J741K036J415M63O8L62P62Q76Q50Q35O50J85l16n98p70j014j203
52561B45608j088p62o22q22j052r43n55l11m18n90n09l47m99q63r17n69m08p34
52543B33599r71m89M11R39Q92O49M05J06KM19J017J088N83J90K20K49lj46J19
52524B39279M42M38L11L75M52K37q1j11R4J46L8K89J287K718L738L776L142K656
52506B59226K655K631K091J380J100J024L46j064k435l188l531l767l746l346
52492B49376k844k427j845r40m8M73P49J016J171J015O53L87L80N97Q31P55L66
52475B49665K48Q67J710J815J179P06P14N58O2J46J385K882L365K692J550N13
$$ plain form
52595 226561 226477 226157 226202 226856 227856 229007 230354 231692 232456 232442 232300 232943 234535 236332 237557 238279 239266
52578 239266 241007 243043 244458 244921 244989 245351 246113 246989 247839 248674 249324 249509 249193 248595 247825 246811 245608
52561 245608 244520 243758 243136 242314 241262 240319 239764 239453 239035 238445 237936 237589 237090 236227 235310 234741 234333 233599
52543 233599 232628 232139 232550 233489 234381 235030 235435 235541 235543 235962 236979 238067 238650 238840 239060 239309 239306 239160 239279
52524 239279 239721 240159 240470 240845 241297 241534 241453 241342 241436 241582 241620 241909 243196 245914 249652 253428 256570 259226
52506 259226 261881 264512 266603 267983 269083 270107 270453 269389 266954 263766 260235 256468 252722 249376
52492 249376 246532 244105 242260 241320 241272 241745 242494 243510 244681 245696 246349 246736 247116 247713 248544 249299 249665
52475 249665 249913 250780 252490 254305 255484 256190 256904 257462 257524 257670 259055 261937 265302 267994 269544 270057
52459B70057J09R25K605L489K428L90q91j274j915l047l600l110k544k724l139
52444B57759k805j622l38K89j6q83j464j202n42l82q35j119p02J09P63J039Q69
52427B48918K90l08m41k07r3r5L14J167J725J522R75O14L33j04m16j90M75J175
52409B55654J807K553L477M524N682O909Q056R085J0140J1168J1677J1027Q907
52396C50666N485J312k834o340q955j0472j0535r191p409o246n594m539k983j906
52382B80459j765j684q34K88P55O51P48J259J814K332L062L857M241M169M013
52367C03365L841L321K330J146J1r69j570j625j476j691k282k583k081r31L02
52352B99108J105J257R91R04J293J752J792J612J709J917J661J104J083J745K165
$$ plain form
52459 270057 270166 271091 273696 277185 279613 280003 279112 277838 275923 272876 269276 266166 263622 260898 257759
52444 257759 254954 253332 252994 253283 253267 252384 250920 249718 249176 248794 247959 246840 246138 246247 247010 248049 248918
52427 248918 249208 248900 248459 248252 248159 248064 248378 249545 251270 252792 253767 254381 254714 254610 254194 254004 254479 255654
52409 255654 257461 260014 263491 268015 273697 280606 288662 297747 307887 319055 330732 341759 350666
52396 350666 356151 357463 354629 348289 339334 328862 318327 309136 301727 295481 289887 285348 282365 280459
52382 280459 278694 277010 276176 276464 277219 277870 278618 279877 281691 284023 287085 290942 295183 299352 303365
52367 303365 307206 310527 312857 314003 314014 313045 311475 309850 308374 306683 304401 301818 299737 298806 299108
52352 299108 300213 301470 302461 303365 304658 306410 308202 309814 311523 313440 315101 316205 317288 319033 321198
52337C21198J813J435J831K547K634K291K622L925N220N689N741O247P319Q363
52323C78875Q980R315R598R764R584Q974Q112P406P227P530P791P538O928O652
52309D94274P163Q253R445J0553J1559J2245J2340J2009J1787J1915J2100J1998
52297F25641J1601J1023J0307R651R352R262Q754P533O026M524K598R6j905k206
52283G12257j267p01j053j346r31m64m85m29J79O46L06j57K26J085J412J356J897
52266G12531L089M035M507N104N796N757M919M261M185M007L645M288O447Q711
52252G81282R673R967J0921J2133J1998J0297Q497P510O736N560M406L721L072
52239H85773J986R08O12J118J763J995J655Q82P4l11l14n25j294k233k744k814
$$ plain form
52337 321198 323011 324446 326277 328824 331458 333749 336371 340296 345516 351205 356946 363193 370512 378875
52323 378875 387855 397170 406768 416532 426116 435090 443202 450608 457835 465365 473156 480694 487622 494274
52309 494274 501437 509690 519135 529688 541247 553492 565832 577841 589628 601543 613643 625641
52297 625641 637242 648265 658572 668223 677575 686837 695591 703124 709150 713674 716272 716368 714463 712257
52283 712257 710990 710289 709236 707890 706959 706495 706010 705581 705760 706406 706712 706555 706781 707866 709278 710634 712531
52266 712531 715620 719655 724162 729266 735062 740819 745738 749999 754184 758191 761836 766124 772571 781282
52252 781282 790955 800922 811843 823976 835974 846271 854768 862278 869014 874574 878980 882701 885773
52239 885773 887759 888667 889279 890397 892160 894155 895810 896692 896766 896455 896141 895616 894322 892089 889345 886531
52223H86531k859l068l237l160k922k727k599k250j381k31M19J93j54M49J853
52208H64857K806K743K615L410M631N032M395L628L356L352L301L353L607L743
52194I14829L563L447L939N036O156O657O276N299M300L588K834J607J56p39r06
52179I66042j230k588m734o693p945q613q681p849o358n158m751m458l460k133
52165H91391j509j572j145L42J877K220J543R86J100J520J893K144J959R03o56
52150I02996j581j245j96P33J444K257L172L885M178L855K700R48n60j203j240
52135I20143j274j406j452j598k095k501k051o73J076K963N222P656R537J0652
52121I44199J1663J2995J4120J4505J4555J4843J4920J3797J1542R459Q614Q808
$$ plain form
52223 886531 883672 880604 877367 874207 871285 868558 865959 863709 862328 862097 862516 862709 862555 863004 864857
52208 864857 867663 870406 873021 876431 881062 886094 890489 894117 897473 900825 904126 907479 911086 914829
52194 914829 918392 921839 925778 930814 936970 943627 949903 955202 959502 963090 965924 967531 967687 966948 966042
52179 966042 964812 962224 957490 950797 942852 934239 925558 917709 911351 906193 901442 896984 893524 891391
52165 891391 889882 888310 887165 887507 889384 891604 893147 894133 895233 896753 898646 900790 902749 903652 902996
52150 902996 901415 900170 899974 900707 902151 904408 907580 911465 915643 919498 922198 923146 922586 921383 920143
52135 920143 918869 917463 916011 914413 912318 909817 907766 907093 908169 911132 916354 924010 933547 944199
52121 944199 955862 968857 982977 997482 1012037 1026880 1041800 1055597 1067139 1076598 1085212 1094020
52109A094020R167R126Q582P677O887O917P993R470J0514J1047J1645J2603J3544
52096A219192J3990J3785J2896J1214Q848O216L500K73l777p903j0700j1588j1403
52083A244543j1254j1181j0408q680o785n653n319n092m535l943l765l891l761
52070A160276l111k250j505p51K44J257J849K110K646L685M686N054M994N210
52056A184394O003O955P462P290O608N779N112M669M195L318J923K77j183k227
52042A240575l037l999n181o109o227n551m685m217m317m832n381n430m789m099
52028A172721m312n519o790p449p829q412q910q878q658q876r288r125q335p625
$$ plain form
52109 1094020 1103187 1112313 1120895 1128572 1135459 1142376 1150369 1159839 1170353 1181400 1193045 1205648 1219192
52096 1219192 1233182 1246967 1259863 1271077 1279925 1286141 1289641 1289914 1286137 1278234 1267534 1255946 1244543
52083 1244543 1233289 1222108 1211700 1203020 1196235 1190582 1185263 1180171 1175636 1171693 1167928 1164037 1160276
52070 1160276 1157165 1154915 1153410 1152659 1152903 1154160 1156009 1158119 1160765 1164450 1169136 1174190 1179184 1184394
52056 1184394 1190397 1197352 1204814 1212104 1218712 1224491 1229603 1234272 1238467 1241785 1243708 1243985 1242802 1240575
52042 1240575 1237538 1233539 1228358 1222249 1216022 1210471 1205786 1201569 1197252 1192420 1187039 1181609 1176820 1172721
52028 1172721 1168409 1162890 1156100 1148651 1140822 1132410 1123500 1114622 1105964 1097088 1087800 1078675 1070340 1062715
$$ [...]
##END NTUPLES=NMR SPECTRUM
##END=
