
##TITLE=UV1226_M6_1234-1212_70_7240115_p97Uzr14WF
##JCAMPDX= 6.0         $$ Bruker NMR JCAMP-DX V2.0
##DATA TYPE= NMR SPECTRUM
##DATA CLASS= NTUPLES
##ORIGIN= BRUKER
##OWNER= Administrator
$$ 1.72 TOPSPIN		Version 2.1
$$ 2013-01-23 23:19:34.058 -0500  Administrator@X
$$ Compression mode = diff/dup
##.OBSERVE FREQUENCY= 400.02188249412
##.OBSERVE NUCLEUS= ^1H
##.ACQUISITION MODE= SIMULTANEOUS (DQD)
##.ACQUISITION SCHEME= undefined
##.AVERAGES= 8
##.DIGITISER RES= 22
##SPECTROMETER/DATA SYSTEM= spect
##.PULSE SEQUENCE= zg30
##.SOLVENT NAME= COFFEE_meoh
##.SHIFT REFERENCE= INTERNAL, COFFEE_meoh, 1, 14.98509
##AUDIT TRAIL= $$ (NUMBER, WHEN, WHO, WHERE, PROCESS, VERSION, WHAT)
$$ ##TITLE= Audit trail, TOPSPIN		Version 2.1
$$ ##JCAMPDX= 5.01
$$ ##ORIGIN= Bruker BioSpin GmbH
$$ ##OWNER= Administrator
$$ $$ E:\/data/COFFEE/nmr/UV1226_M6_1234-1212_70_7240115_p97Uzr14WF/30/pdata/1/auditp.txt
$$ ##AUDIT TRAIL=  $$ (NUMBER, WHEN, WHO, WHERE, PROCESS, VERSION, WHAT)
(   1,<2013-01-23 23:19:25.933 -0500>,<Administrator>,<X>,<go>,<TOPSPIN 2.1>,
      <created by zg
	started at 2013-01-23 23:18:19.948 -0500,
	POWCHK enabled, PULCHK disabled,
       configuration hash MD5:
       86 BA 57 50 F2 9D 5C 9B 26 00 A9 28 5F 66 2E 89
       data hash MD5: 64K
       DD 13 7E 38 B5 14 F5 49 82 76 23 BD 63 2B A9 3E>)
(   2,<2013-01-23 23:19:28.964 -0500>,<Administrator>,<X>,<proc1d>,<TOPSPIN 2.1>,
      <Start of raw data processing
       efp LB = 0 FT_mod = 6 PKNL = 1 PHC0 = 0 PHC1 = 0 SI = 32K 
       data hash MD5: 32K
       4F 9B A1 33 EA D8 22 0D 27 83 16 36 AB EE B9 39>)
(   3,<2013-01-23 23:19:29.433 -0500>,<Administrator>,<X>,<proc1d>,<TOPSPIN 2.1>,
      <pk PHC0 = 102.7441 PHC1 = 0 
       data hash MD5: 32K
       48 8B 78 B7 87 AA 12 CE 00 14 15 B8 84 E6 96 CA>)
(   4,<2013-01-23 23:19:29.651 -0500>,<Administrator>,<X>,<proc1d>,<TOPSPIN 2.1>,
      <abs ABSG = 1 
       data hash MD5: 32K
       4E CC 50 DB D2 88 5C DA AC FE 42 56 6C 30 FD 8D>)
(   5,<2013-01-23 23:19:29.792 -0500>,<Administrator>,<X>,<proc1d>,<TOPSPIN 2.1>,
      <abs ABSG = 2 
       data hash MD5: 32K
       97 A3 3E 42 60 76 D8 5B 27 97 EE F2 69 10 CB A0>)
(   6,<2013-01-23 23:19:29.933 -0500>,<Administrator>,<X>,<proc1d>,<TOPSPIN 2.1>,
      <abs ABSG = 3 
       data hash MD5: 32K
       D5 AC 04 31 57 19 C6 14 6D 2A 83 FA E3 9F 75 E2>)
(   7,<2013-01-23 23:19:30.089 -0500>,<Administrator>,<X>,<proc1d>,<TOPSPIN 2.1>,
      <abs ABSG = 4 
       data hash MD5: 32K
       68 55 2D 8C 36 56 9E 8D 58 26 78 EF 1F 28 06 F4>)
(   8,<2013-01-23 23:19:30.230 -0500>,<Administrator>,<X>,<proc1d>,<TOPSPIN 2.1>,
      <abs ABSG = 5 
       data hash MD5: 32K
       9E EF 50 14 54 D2 FB 69 1D BE 30 AA 0A 64 8F 61>)
$$ ##END=
$$ 
$$ $$ hash MD5
$$ $$ 36 42 DF D5 18 C9 91 1D 0A 4E 0F 95 66 C3 0F 38
##$RELAX= 
##$RELAX= 
##$RELAX= 
##$RELAX= 
##$RELAX= 
##$RELAX= 
##$RELAX= 
$$ Bruker specific parameters
$$ --------------------------
##$DU= <E:\>
##$EXPNO= 30
$$ [...]
##$TP= (0..7)
150 150 150 150 150 150 150 150
##$TP07= 0
##$TPNAME0= <>
##$TPNAME1= <>
##$TPNAME2= <>
##$TPNAME3= <>
##$TPNAME4= <>
##$TPNAME5= <>
##$TPNAME6= <>
##$TPNAME7= <>
##$TPOAL= (0..7)
0.5 0.5 0.5 0.5 0.5 0.5 0.5 0.5
##$TPOFFS= (0..7)
0 0 0 0 0 0 0 0
##$TUNHIN= 0
##$TUNHOUT= 0
##$TUNXOUT= 0
##$USERA1= <user>
##$USERA2= <user>
##$USERA3= <user>
##$USERA4= <user>
##$USERA5= <user>
##$V9= 5
##$VALIST= <valist>
##$VCLIST= <CCCCCCCCCCCCCCC>
##$VD= 0
##$VDLIST= <DDDDDDDDDDDDDDD>
##$VPLIST= <PPPPPPPPPPPPPPP>
##$VTLIST= <TTTTTTTTTTTTTTT>
##$WBST= 1024
##$WBSW= 4
##$XGAIN= (0..3)
0 0 0 0
##$XL= 0
##$YL= 0
##$YMAX_a= 632034
##$YMIN_a= -540879
##$ZGOPTNS= <>
##$ZL1= 120
##$ZL2= 120
##$ZL3= 120
##$ZL4= 120
##$ABSF1= 14.98509
##$ABSF2= -5.573092
##$ABSG= 5
##$ABSL= 3
##$ALPHA= 0
##$AQORDER= 0
##$ASSFAC= 0
##$ASSFACI= 0
##$ASSFACX= 0
##$ASSWID= 0
##$AUNMP= <proc_prof1d_extract_pilot.lims>
##$AXLEFT= 0
##$AXNAME= <>
##$AXNUC= <1H>
##$AXRIGHT= 0
##$AXTYPE= 0
##$AXUNIT= <>
##$AZFE= 0.1
##$AZFW= 0.1
##$BCFW= 0
##$BC_mod= 0
##$BYTORDP= 0
##$COROFFS= 0
##$CY= 15
##$DATMOD= 1
##$DC= 0
##$DFILT= <>
##$DTYPP= 0
##$F1P= 0
##$F2P= 0
##$FCOR= 0.5
##$FTSIZE= 32768
##$FT_mod= 6
##$GAMMA= 0
##$GB= 0
##$INTBC= 1
##$INTSCL= 1
##$ISEN= 128
##$LB= 0
##$LEV0= 0
##$LPBIN= 0
##$MAXI= 10000
##$MC2= 0
##$MEAN= 0
##$ME_mod= 0
##$MI= 0
##$NCOEF= 0
##$NC_proc= -8
##$NLEV= 6
##$NOISF1= 0
##$NOISF2= 0
##$NSP= 0
##$NTH_PI= 0
##$NZP= 0
##$OFFSET= 14.98509
##$PC= 1
##$PHC0= 102.7441
##$PHC1= 0
##$PH_mod= 1
##$PKNL= yes
##$PPARMOD= 0
##$PPDIAG= 0
##$PPIPTYP= 0
##$PPMPNUM= 2147483647
##$PPRESOL= 1
##$PSCAL= 4
##$PSIGN= 0
##$PYNMP= <proc.py>
##$REVERSE= no
##$SF= 400.02
##$SI= 32768
##$SIGF1= 0
##$SIGF2= 0
##$SINO= 400
##$SIOLD= 32768
##$SPECTYP= <>
##$SREGLST= <1H.CDCl3>
##$SSB= 0
##$STSI= 32768
##$STSR= 0
##$SW_p= 8223.68421052631
##$SYMM= 0
##$S_DEV= 0
##$TDeff= 65536
##$TDoff= 0
##$TI= <>
##$TILT= no
##$TM1= 0
##$TM2= 0
##$TOPLEV= 0
##$USERP1= <user>
##$USERP2= <user>
##$USERP3= <user>
##$USERP4= <user>
##$USERP5= <user>
##$WDW= 1
##$XDIM= 32768
##$YMAX_p= 438893631
##$YMIN_p= -821439
##$CURPLOT= <Network HP LaserJet P1505>
##$CURPRIN= <$Network HP LaserJet P1505>
##$DFORMAT= <normdp>
##$LAYOUT= <+/1D_H.xwp>
##$LFORMAT= <normlp>
##$PFORMAT= <normpl>
##$SURQMSG= 1
$$ End of Bruker specific parameters
$$ ---------------------------------
##NTUPLES= NMR SPECTRUM
##VAR_NAME=  FREQUENCY,     SPECTRUM/REAL,   SPECTRUM/IMAG
##SYMBOL=    X,             R,               I
##VAR_TYPE=  INDEPENDENT,   DEPENDENT,       DEPENDENT
##VAR_FORM=  AFFN,          ASDF,            ASDF
##VAR_DIM=   32768,         32768,           32768
##UNITS=     HZ,            ARBITRARY UNITS, ARBITRARY UNITS
##FACTOR=    0.250966925370066, 1,           1
##FIRST=     8223.43324360094, -108537,      -221512
##LAST=      0,             -66747,          82740
##MIN=       0,             -821439,         0
##MAX=       8223.43324360094, 438893631,    0
$$ Real data points
##PAGE= N=1
##DATA TABLE= (X++(R..R)), XYDATA
$$ [...]
19531A1412a8363p5721B36278a23512k63558J58628f0205I7141a92808G0777g2142
19519A96514J77124a27027d2523A39581c22805C61096F9977J52642F6552J25584
19509A92136n3583e1296H756c63550c0910C8680a27676a1948B71679a82787p9334
19498b62121A83908a21450A62097B4597J90327i7926H6113c3846j08628E7746
19487a60211C01312A2207a8990j09058M6035j3446k73921B6672a02295j79815
19477b82110j73008A4297L67324I0633c7093D0205a67481H6215a01246I51a47047
19465a37706A75256D8481P2882i3828k7636H436g3638p1347j67680o1234J77701
19454a96198H891g6301n087C317O9672J30320D6187b28626E7142a32796H977K06553
$$ plain form
19531 11412 -18363 -94084 236278 -123512 -387070 -228442 -60205 97141 -192808 70777 -72142
19519 196514 373638 -127027 -42523 139581 -322805 361096 69977 222619 66552 192136
19509 192136 138553 -51296 8756 -363550 -30910 38680 -127676 -11948 271679 -182787 -262121
19498 -262121 183908 -121450 162097 24597 214924 -97926 86113 -33846 -142474 57746
19487 -160211 301312 12207 -18990 -128048 -82013 -95459 -369380 26672 -102295 -282110
19477 -282110 -455118 14297 381621 90633 -37093 40205 -167481 86215 -101246 951 -147047
19465 -137706 175256 48481 121363 -93828 -121464 8436 -73638 -144985 -312665 -373899 -196198
19454 -196198 8891 -76301 -81388 3317 72989 203309 46187 -228626 57142 -132796 8977 215530
19442B15530a43378N9166A13004h2852A39214c00669O1839H9751b4784m1459C3270
19430H2438b6958B13860I6084j3601e6574j05692A85587D5809c92345A18866b2432
19418i8894k48245L0976a8923L015l89332b8976k77347A2376L76331b34826B94905
19406A25207g2942K1357j21700P4661j13730N6170B07899J7129a91140P3249A26750
19394a18209B04860h3686j25367F7754j4777c91978D2587j1237b12138f552j27922
19383a34474F187e7445k99398f2330D4304O3411C2042J16422o2979b06197k6519
19372b32716h6308D9531a28939g591l31967J15061F9462A934J00157b26195g012
19360b44440c5963I8444f9767j27568g919m29991c194j79958I7978c32506M1509
$$ plain form
19442 215530 -143378 -84212 113004 -82852 139214 -300669 -238830 89751 -24784 -66243 33270
19430 82438 -26958 213860 96084 82483 -56574 -162266 185587 45809 -392345 118866 -22432
19418 -98894 -347139 -316163 -18923 -15908 -405240 -28976 -306323 12376 388707 -234826 294905
19406 125207 -72942 -51585 -173285 -98624 -212354 -156184 207899 225028 -191140 -117891 126750
19394 -118209 204860 -83686 -209053 67754 52977 -391978 42587 31350 -212138 -6552 -134474
19383 -134474 6187 -57445 -356843 -62330 44304 107715 32042 148464 85485 -206197 -232716
19372 -232716 -86308 49531 -128939 -7591 -339558 -224497 69462 1934 102091 -226195 -7012
19360 -244440 -35963 98444 -69767 -197335 -7919 -437910 -3194 -183152 97978 -332506 -290997
19349b90997c3054A66656a23658N7262A82819K0955a86919K022H3739A0200b54596
19337C29690a38878N0683J0385L5906I3665a54249B7162f4518G7526a90665i2473
19325b09331a5262k36512N6559K3588A98688f031B45942a05386A17323a63895
19314G9539l4347c2282j8794E3114a30705A38369f8218l5874H8375a09904j9016
19303a28920j9601O319N5236p2322d4244J3642A68588b02159K1232A20267g1894
19291a8136C22087H4611b06743C0853b59438i5680k74611d4036B19435a88291
19280A75995b8450B78968d0305N795k25263J18256L9367A52188m6925g1641C48815
19268B08290h4890C4813E759d12913B99396e1846q0974K7223j121p2607B16954
$$ plain form
19349 -290997 -33054 166656 -123658 -66396 182819 203774 -186919 -184897 83739 10200 -254596
19337 329690 -138878 -88195 -77810 -41904 93665 -154249 27162 -64518 77526 -190665 -92473
19325 -209331 -15262 -251774 -195215 -171627 198688 -6031 245942 -105386 117323 -163895
19314 79539 45192 -32282 -51076 53114 -130705 138369 -68218 -104092 88375 -109904 -128920
19303 -128920 -148521 -142202 -86966 -159288 -44244 -30602 168588 -202159 -180927 120267 -71894
19291 -18136 322087 84611 -206743 30853 -259438 -95680 -370291 -44036 219435 -188291
19280 175995 -28450 278968 -40305 -34510 -259773 -141517 -102150 152188 105263 -71641 348815
19268 208290 -84890 34813 5759 -412913 299396 -51846 -132820 -105597 -106718 -179325 216954
19256G5034A3287c48494A16896b05332B01758A6929J96614b20983C21148c5348
19245b48635j1819J02015k58885M7504I5482j6372a08434B7754m590b17173f8944
19233h391m07168C1485P8079g6724a052j7228B4021D653a18838j89491A68906
19221d0457G5895a85330K1778c496j87608e0868j27280I5310b36983O0589c0602
19209h4130J5439k1002A42846b14148b0967m40187b12496C9788K3472b08334B21650
19197b50205b3117j27855q2172h8898B47590A7739g8746B03200e0555F4794c09054
19185d5580A69701e3760j41423C2890P1574a2073o3542B0149b77088a24708d1437
19173A56468f4335C49735h7291A51239C1303a5943o6971k76684B02913D7995f1065
$$ plain form
19256 75034 13287 -348494 116896 -205332 201758 16929 213543 -220983 321148 -35348
19245 -248635 -260454 -158439 -417324 -369820 95482 79110 -108434 27754 23164 -217173 -68944
19233 -8391 -415559 31485 109564 -76724 -1052 -18280 24021 4653 -118838 -308329 168906
19221 -40457 75895 -185330 -163552 -3496 -191104 -50868 -178148 95310 -236983 -176394 -30602
19209 -84130 -68691 -89693 142846 -214148 -20967 -461154 -212496 39788 63260 -208334 221650
19197 -250205 -23117 -150972 -233144 -88898 247590 17739 -78746 203200 -50555 64794 -309054
19185 -45580 169701 -53760 -195183 32890 104464 -12073 -75615 20149 -277088 -124708 -41437
19173 156468 -64335 349735 -87291 151239 31303 -15943 -82914 -359598 202913 47995 -61065
19161D0107h7089k02190d0191C91790H9844j3235C5189c56909h5587A80531J56432
19150C36963a73718B47588c58636a32576L9100A2248J0537K08917c4462C7592
19139a3468D3724a25764N1022j71489c4066l17617A32840R8846b35093G0226a65356
19127F8490a42488F1400a06778B08101a45444E6872B707a91858E074b4414F750
19115e7573A63356b20161B53172b78603A61304g7282B5821a84252H5182a74146
19104c118C8828L869Q7744i4175b1861r7118B19662e6262j86338d2913B33130
19092a67633j31839a47154A47005a39390k04456A33204b37263C1584c03060A99543
19081b09763F7581c1293I4861a98102l8984D4934c38780O6821a33858M3937E2743
$$ plain form
19161 40107 -87089 -289279 -40191 391790 89844 76609 35189 -356909 -85587 180531 336963
19150 336963 -173718 247588 -358636 -132576 -93476 12248 22785 231702 -34462 37592
19139 -13468 43724 -125764 -74742 -246231 -34066 -351683 132840 231686 -235093 70226 -165356
19127 68490 -142488 61400 -106778 208101 -145444 56872 2707 -191858 5074 -24414 6750
19115 -57573 163356 -220161 253172 -278603 161304 -77282 25821 -184252 85182 -174146
19104 -3118 38828 42697 130441 -94175 -21861 -118979 219662 -56262 -242600 -42913 233130
19092 -167633 -299472 -147154 147005 -139390 -343846 133204 -237263 31584 -303060 199543
19081 -209763 67581 -31293 94861 -198102 -237086 44934 -338780 -271959 -133858 -89921 52743
19069b61923C13085m4940e2254j26396A22033a93941p7945a17139A0406b93906
19058a01348A1419f870d57B20951b31214l9189a10589A15712J16679E9066J16364
19047A75430q3492m1691h8449G1728g1674F6368c15634b815k48123Q1689a6384
19035A79467a05967k67027A04944a07144K8988B32487f6588q692j95244b1683
19024B3216L4394M2685e9410B5228b49387B21926a64484A43271c62048A68347
19013c30077f7721k53134G6941A3791h8953G2961J12314f4347G8648h515j11899
19002a20414k48171N9922a25625f858j71044g7727f628j26638c9392A06285A9764
18990E4242J6010Q6119b27693A01188a91264p302A82919E0126a51952D3137a81115
$$ plain form
19069 -261923 313085 268145 -52254 -178650 122033 -193941 -271886 -117139 10406 -293906
19058 -101348 11419 -6870 -457 220951 -231214 -270403 -110589 115712 232391 59066 175430
19047 175430 91938 50247 -88449 71728 -71674 66368 -315634 -2815 -250938 -169249 -16384
19035 179467 -105967 -372994 104944 -107144 -78156 232487 -66588 -75280 -270524 -21683
19024 23216 57610 100295 -59410 25228 -249387 221926 -164484 143271 -362048 168347
19013 -330077 -67721 -320855 76941 13791 -88953 72961 185275 -64347 78648 -8515 -120414
19002 -120414 -368585 -308663 -125625 -6858 -177902 -77727 -6628 -133266 -39392 106285 19764
18990 54242 70252 156371 -227693 101188 -191264 -198566 182919 50126 -151952 43137 -181115
18978G7341h638j15250p6457G4179e8996q5215C2850K708N7755a97078C3793d3359
18965a42287N7932a7915k76415a19903B95097h1199G4841b22305h4175l6274C04775
18953a28987p815A24779a18490B0062a61540j90751J45011j74634c738A69314
18942H9274J12428A1827M3786a70873N1450k10049J29898d0919B53245J32458
18932C85703b8412A17844J207k8526b67566B797b80693C14726A19143g8367a3045
18920b3781j51024b2610q7010j52174C4222J6312J6866c80493a79510B41478b47719
18908A54378d66270c2451I5557b41696A16448b88716K6125L2008Q2987f4944J3577
18897e1367b1812j89386H1844i676j73700D5431c9006j73793E0866a31274B5273
$$ plain form
18978 77341 -8638 -123888 -200345 74179 -58996 -144211 32850 35558 93313 -197078 33793 -43359
18965 -142287 -84355 -17915 -294330 -119903 295097 -81199 74841 -222305 -84175 -120449 304775
18953 -128987 -136802 124779 -118490 20062 -161540 -352291 -207280 -381914 -3738 169314
18942 89274 201702 11827 55613 -170873 -119423 -329472 -199574 -40919 253245 385703
18932 385703 -28412 117844 119051 90525 -267566 2797 -280693 314726 119143 -78367 -13045
18920 -23781 -174805 -22610 -109620 -261794 34222 50534 67400 -380493 -179510 241478 -247719
18908 154378 -466270 -32451 95557 -241696 116448 -288716 -262591 -230583 -147596 -64944 -51367
18897 -51367 -21812 -211198 81844 -9676 -183376 45431 -39006 -212799 50866 -131274 25273
18885E6315b38715A22587b29081a01418j51407A24842a47157N2038p9828B8822
18874A94325h1535k22971d1063B84400a21449E1697a23305A64410m6388D1933
18863E2693R6741a90777f8633b5855D2604K86650A35355i4314j65943F2645K37917
18852C00562A08965a36118d9275q6823K1089C87473d60043A87521B4407d2189
18841b6981A37858c5017B19555A1098a81806e0778B7354b34199A83111Q6518o5404
18830B04225a05541I6439i0308B46636A20976a13110d9311A09199a13812l7553
18820a51365A370a83804H784L0638a42006k0569E8690a11900n6815C41989b18919
18808B3727N929d0246j56010L9361d3208D2531a50440F860b0293A02163a90135
$$ plain form
18885 56315 -238715 122587 -229081 -101418 -252825 124842 -147157 -95119 -174947 28822
18874 194325 -81535 -304506 -41063 284400 -121449 51697 -123305 164410 118022 41933
18863 52693 149434 -190777 -68633 -25855 42604 329254 135355 -94314 -260257 62645 300562
18852 300562 108965 -136118 -49275 -136098 -115009 387473 -460043 187521 24407 -42189
18841 -26981 137858 -35017 219555 11098 -181806 -50778 27354 -234199 183111 269629 204225
18830 204225 -105541 96439 -90308 246636 120976 -113110 -49311 109199 -113812 -151365
18820 -151365 1370 -183804 8784 39422 -142006 -162575 58690 -111900 -168715 341989 -218919
18808 23727 29656 -40246 -196256 -156895 -43208 42531 -150440 6860 -20293 102163 -190135
18796d5256A56561n3514K16287H8047B0838d21198i2601j19066A52840a7880r6605
18785a14485C34680G237C413b45713Q7054M8535l01160a13102n6475l4091I272
18773d68049B24320a70349K8295B915Q8647j6377P7797c12938a20490r7116N7544
18762a60062A39289a0166q0819m8016A70457a96763D3483b34891B7082b89718
18751b8064B54293A23527l5030g960K022A49323b1173A38345J37163G6610e0041
18739a66824c4253m7309F6788b1225j30407C3808b15928C2646c12189I5660c2240
18727d29k79452A02663b55354b3511l2267A17964J1323a76581d1288F2455b63008
18715b42548R1663l954D9693b4915j13685O4783A74263c43824B51345e50315b08052
$$ plain form
18796 -45256 156561 103047 319334 88047 20838 -421198 -92601 -211667 152840 -17880 -114485
18785 -114485 334680 7237 3413 -245713 -158659 -110124 -411284 -113102 -169577 -203668 9272
18773 -468049 224320 -170349 -142054 2915 91562 75185 152982 -312938 -120490 -217606 -160062
18762 -160062 139289 -10166 -90985 -139001 170457 -196763 43483 -234891 27082 -289718
18751 -28064 254293 123527 88497 -7960 -5938 149323 -21173 138345 275508 76610 -50041
18739 -166824 -34253 -81562 66788 -21225 -151632 33808 -215928 32646 -312189 95660 -32240
18727 -429 -279881 102663 -255354 -23511 -55778 117964 129287 -176581 -41288 62455 -263008
18715 -242548 -150885 -154839 49693 -24915 -138600 -73817 174263 -343824 251345 -550315 -208052
18703b13684B23647d5914F6165b985l9720B62463A918O6206P7173g0119a3241
18691C4002a31960B0889a68693C388a81382A22806a30193j04574G2045b84868
18680c28291j1057B41726M2322b53052a21455r924j40425Q9421b7887j16026k3185
18669a67098L4769H9923L9184b22078a05212A00051f8329m9823l1578a4777j45801
18658a60578j69385a02952H3070J42796A2385b48685h5836F9691B2095J22781
18648A44876a31015A13363l1655a52186j87557A0957J28962a6069j59814L8207
18638a37676d7275l84113A34197b64740B34569q7023h6446A18575b88357B1926
18627C8545M2558l2911J69340e11288b42269R0981A72966c35945a30578D19968
$$ plain form
18703 -213684 223647 -45914 66165 -2985 -42705 262463 1918 68124 145297 -70119 -13241
18691 34002 -131960 20889 -168693 3388 -181382 122806 -130193 -234767 72045 -284868
18680 -328291 -339348 241726 284048 -253052 -121455 -131379 -271804 -182383 -27887 -143913 -167098
18669 -167098 -132329 89923 129107 -222078 -105212 100051 -68329 -118152 -149730 -14777 -160578
18658 -160578 -329963 -102952 83070 225866 12385 -248685 -85836 69691 22095 144876
18648 144876 -131015 113363 81708 -152186 -339743 10957 139919 -16069 -175883 -137676
18638 -137676 -47275 -431388 134197 -264740 234569 147546 -86446 118575 -288357 21926
18627 38545 81103 48192 217532 -511288 -242269 -151288 172966 -335945 -130578 419968
18616D3431J12944a05320g000k3930q7069F2725M279J88632a12703l46214a60171
18604a35138F1626b44360b4838o1012k68768a43870n1741B97812A08195D2066
18593b45806A7653h7001n075c2210c661B89895D5830a11326n427B44125N1144
18582B95269b14319Q5951C2988B440h1487j34796q6206a7535A81489b01100B85349
18570b30281R1069j58959D457d9776B53290a39078R514B17627J94274G9869O577
18559H6446b56386i1705F9707a74475h5043H7483J00420a35570K2521G0426R7815
18548A68241a02006q9919C9052b08186A40818b14362A30608L3608b9267j22125
18538a51392H5594J92800l8806i877j98472H291Q7561b09659J306J2652E05265
$$ plain form
18616 43431 156375 -105320 -7000 -30930 -117999 62725 67004 255636 -112703 -458917 -160171
18604 -135138 61626 -244360 -24838 -85850 -354618 -143870 -195611 297812 108195 42066
18593 -245806 17653 -87001 -92076 -32210 -3661 289895 45830 -111326 -116753 244125 295269
18582 295269 -214319 -128368 32988 2440 -81487 -216283 -302489 -17535 181489 -201100 285349
18570 -230281 -139212 -298171 4457 -49776 253290 -139078 -129564 217627 411901 79869 86446
18559 86446 -256386 -91705 69707 -174475 -85043 87483 187903 -135570 -113049 70426 168241
18548 168241 -102006 -191925 39052 -208186 140818 -214362 130608 164216 -29267 -151392
18538 -151392 85594 278394 239588 -9877 -208349 8291 95852 -209659 -208353 -195701 505265
18526g5186n0858K5139D85868b02382a2985l14659G5019g8479I6112e7748A0173
18514B2267a99218h2204l09177A42893a60155k95393a25323B657M3934r129b0336
18502c10860j65780A28349l6835B2260J32157a25355d4809G127J12580f8628B09467
18490a71940F8881b59689r2869g8001j03701C1428b20769A72609B0375L6495c59769
18478b8821B66044e16153A53549c60735J51567L9844C4982b48397k2446g3840
18467A62442a70956b4614m3053A02026c5936r5269j16527I4632b2378q4933B28893
18455a52412A84494a47588A56371d5485k6147b7817A72402c5567j77226j91050
18445d03843C42938o5734a77456A08565c11178m6239E6090a56241A364a27999
$$ plain form
18526 -75186 -126044 -100905 485868 -202382 -12985 -327644 75019 -78479 96112 -57748 10173
18514 22267 -199218 -82204 -391381 142893 -160155 -455548 -125323 2657 46591 37462 -20336
18502 -310860 -476640 128349 91514 22260 154417 -125355 -44809 7127 119707 -68628 209467
18490 -171940 68881 -259689 -352558 -78001 -181702 31428 -220769 172609 20375 56870 -359769
18478 -28821 266044 -516153 153549 -360735 -209168 -169324 34982 -248397 -270843 -73840
18467 162442 -170956 -24614 -67667 102026 -35936 -131205 -247732 94632 -22378 -107311 228893
18455 -152412 184494 -147588 156371 -45485 -71632 -27817 172402 -35567 -212793 -403843
18445 -403843 342938 277204 -177456 108565 -311178 -357417 56090 -156241 1364 -127999
18434F1868a58545d8147k04229J11708A54077l079b22961d3168J2410j33843L9601
18423a25000b0383j58945A778N9884L43636g957j01379E1302d3203k02988a3492
18411h1963A33485A3672a66803A20514l7658a63956P5302k22816i8379b6704o1909
18400h8613A30196a20775A54765C9680M2845b8495H8463a09307F0219a94454K7501
18389a66953B7146J33018b96278A74025d90130G4329a46600G0733e3490E6330
18378b9083e939k6167A20855I182a67212I6984b08428b5313K219A333N681c9491
18365a39273j48585C03576H9148m0251k2586c5810k50479m48016C29790j21896
18355B07894j1403b71763b1275o039k0454R00G1480J46159A7598J49054e7638
$$ plain form
18434 61868 -158545 -48147 -252376 -140668 154077 150998 -222961 -43168 -30758 -164601 -125000
18423 -125000 -20383 -179328 1778 61662 405298 -7957 -109336 51302 -43203 -246191 -13492
18411 -81963 133485 13672 -166803 120514 82856 -163956 -88654 -311470 -98379 -26704 -88613
18400 -88613 130196 -120775 154765 39680 82525 -28495 88463 -109307 60219 -194454 -166953
18389 -166953 27146 160164 -296278 174025 -490130 74329 -146600 70733 -53490 56330
18378 -29083 -5939 -32106 120855 9182 -167212 96984 -208428 -25313 -23094 1333 7014 -39491
18365 -139273 -287858 303576 89148 48897 26311 -35810 -286289 -734305 329790 207894
18355 207894 196491 -271763 -21275 -27314 -47768 -46868 71480 217639 17598 166652 -57638
18343a10988G2577o658a06028j26172j00719A0950a89367B50183a90694F6653
18332a12010J8214k65915i2383j73564a09926B817J09358a60498j6876N7072j32286
18321b52588F6509O7507a60120P2614j44591d4076A3718d44449E1894e722C9772
18309C33655a59387B83792e79396b48685d5104I4470g4785I1608a77697r4046
18299b71743P1784R5736L5950j87120D53628a0780k34902R1111j7649O6496c7865
18287b0638C7445P6606e9442b1002B48141E3339a88199b2113l38766A73708l4106
18276A39602d40452a81950B095J880A928a99878A76886a59146c1876k1236j12651
18265a65763d2572j58488B9623P3576d43409c5773m608j08786a3449l26557B0629
$$ plain form
18343 -110988 72577 65919 -106028 -232200 -332919 10950 -189367 250183 -190694 66653
18332 -112010 -93796 -359711 -92383 -265947 -109926 2817 112175 -160498 -177374 -120302 -252588
18321 -252588 66509 134016 -160120 -87506 -232097 -44076 13718 -444449 51894 -5722 39772
18309 333655 -159387 283792 -579396 -248685 -45104 94470 -74785 91608 -177697 -271743
18299 -271743 -199959 -104223 -68273 -255393 453628 -10780 -245682 -154571 -172220 -105724 -37865
18287 -20638 37445 114051 -59442 -21002 248141 53339 -188199 -22113 -360879 173708 139602
18276 139602 -440452 -181950 2095 3975 1928 -199878 176886 -159146 -31876 -53112 -165763
18265 -165763 -42572 -201060 29623 103199 -443409 -35773 -40381 -149167 -13449 -340006 20629
18253a53949k3614q055I455N8060R14J5458O5335B0617a68070B2314b47689a07094
18240b16084A75436K1030E3804b8617j75712r9255A9584a67944N0044E8770R6603
18229A55373d0524m7142L3242p9854F0232f0035j9682j28374I3983K07770r5140
18218B06613f7792j57912m3474B18112b12260n6637N528f5202A45366Q6584b6613
18206B05506D6819a80593l1207j48C150a88330m8420l07561A41627a52703m9024
18195b01727j42727A72391q6032L4093Q9277J0213a14504A21726e1943q658J8577
18184d2024G1387a20214A12247a87419A54248a52483J8260p7206a603G8722J48344
18173B27066a22518A72162a61091A40067b881B30504A631J62917c00544I3814
$$ plain form
18253 -153949 -177563 -185618 9455 67515 68429 83887 149222 20617 -168070 22314 -247689 -107094
18240 -216084 175436 196466 53804 -28617 -204329 -303584 19584 -167944 -117900 58770 155373
18229 155373 -40524 -87666 -54424 -134278 60232 -60035 -79717 -208091 93983 301753 206613
18218 206613 -67792 -225704 -269178 218112 -212260 -268897 -263369 -65202 145366 231950 -26613
18206 205506 46819 -180593 -211800 -211948 3150 -188330 -236750 -544311 141627 -152703 -201727
18195 -201727 -344454 172391 86359 120452 209729 219942 -114504 121726 -51943 -60601 -42024
18184 -42024 71387 -120214 112247 -187419 154248 -152483 -134223 -211429 -1603 78722 227066
18173 227066 -122518 172162 -161091 140067 -2881 230504 1631 164548 -300544 93814
18162B8856a58411G9644J43082b37759B16706a05672d5641I9430d5698A38044
18151F5587L13516a31660H0790g6045K1721l97449a07687b5644Q887A40601L8437
18140A79038C0539J6954J06205a10584H0189a7566E8314b17315N2028A82430e8751
18128D15145e7475O81B19509B2349f3636k21971R3107D72904k12493i8047I3153
18116a77010b9133B46799a39037l68880I4558b8945p6284G5413c5651j24740C36640
18104B4995d75545I1542J13610b58607R5251l3009j948E1981J6478a06434A49334
18092a40305L4793l10381a92372b3660E5579K54282c57791a58252j09466K032
18082b65686a498l268o8845c4294B3235L17349G4498b17710N4522B40285i0087
$$ plain form
18162 28856 -158411 79644 222726 -237759 216706 -105672 -45641 99430 -45698 138044
18151 65587 379103 -131660 80790 -76045 -54324 -451773 -107687 -25644 -16757 140601 179038
18140 179038 30539 47493 153698 -110584 80189 -17566 58314 -217315 -165287 182430 -58751
18128 415145 -57475 -56794 219509 22349 -63636 -285607 -192500 472904 260411 -98047 93153
18116 -177010 -29133 246799 -139037 -507917 94558 -28945 -105229 75413 -35651 -160391 336640
18104 24995 -475545 91542 205152 -258607 -163356 -196365 -198313 51981 68459 -106434 149334
18092 -140305 -105512 -415893 -192372 -23660 55579 309861 -357791 -158252 -267718 -265686
18082 -265686 -1498 -4766 -73611 -34294 23235 340584 74498 -217710 -163188 240285 -90087
18070a95218C8765b14289K9224j80492I9981b30491A71110i4864j03657K3190
18060a75331R548B22981A4212a86974B79874r4085H8425a46006B04101b32920
18049C32230K89969B0089a1738j17345p726J1402b211q7943q6923c6253j91001
18038b27254N7333A04753I32K51941a85284A09953l4712a27547m9817M8197A31859
18026a13503D2374K87535b69780A72390b4344m0273l98792A07830A0953J30368
18016A41321f4650H101M42818a79488c5997j29961a491A13694f4411G6645e0035
18004a01930C20363j44763D1241b23525B18313A2694c76573A10814B2388J49450
17994A71838a20503l58950C3886N9019P0531a66900j22029C55243A48787m3948
$$ plain form
18070 -195218 38765 -214289 -185065 -365557 99981 -230491 171110 -94864 -198521 -175331
18060 -175331 -165783 222981 14212 -186974 279874 185789 88425 -146006 204101 -232920
18049 332230 622199 20089 -11738 -129083 -136809 -125407 -2211 -90154 -177077 -36253 -227254
18038 -227254 -169921 104753 932 252873 -185284 109953 75241 -127547 -177364 -129167 131859
18026 -113503 42374 329909 -269780 172390 -24344 -64617 -463409 107830 10953 141321
18016 141321 -64650 8101 450919 -179488 -35997 -165958 -1491 113694 -64411 76645 -50035
18004 -101930 320363 175600 41241 -223525 218313 12694 -376573 110814 22388 171838
17994 171838 -120503 -479453 33886 92905 163436 -166900 -288929 355243 148787 104839
17984A04839f2671r3328A682a65064B9242K75584j44683J13592D9797P0584L7536
17973A57917m7918l433a20658A84987l1462q84b54214J13416F4650J84290L4113
17962B83053c54052J56059c7684E0939b36000E9590a25986c8118l64985c1583
17951I3573P9203a11505e082B70129d9880F4320a88707A6956h9799o1320K5082
17940a26037d8572J1588j04749H2355J18737m0218b47447L0821A82644a31772
17929a0873I9441a67843F8490l0237R6812i8481A93257D3716J4515J04229b78646
17917a05557q1182h0156j43134I200c8314k54645J8676I9956b77351J02620a3466
17905B8155c32807A20165J82232j16314A6276K99551a26341A85192d0080l01772
$$ plain form
17984 104839 -62671 -155999 1682 -165064 29242 304826 160143 273735 49797 120381 157917
17973 157917 109999 106566 -120658 184987 153525 152641 -254214 -140798 64650 248940 283053
17962 283053 -354052 -197993 -37684 50939 -236000 59590 -125986 -38118 -403103 -31583
17951 93573 172776 -111505 -5082 270129 -49880 64320 -188707 16956 -89799 -151119 -126037
17940 -126037 -48572 -36984 -141733 82355 201092 160874 -247447 -216626 182644 -131772
17929 -10873 99441 -167843 68490 38253 135065 -98481 193257 43716 58231 162460 -278646
17917 -105557 -186739 -80156 -223290 9200 -38314 -292959 -274283 99956 -277351 -174731 -13466
17905 28155 -332807 120165 302397 186083 16276 315827 -126341 185192 -40080 -341852
17895c41852d8597o6573N3203k78526E5942K2568k2563K53779h8317I2670b7883
17883a24027b0861j74224c2161j49835A2747M00167b2896C8556I619M827O6761
17872H1207e3522D3388J6067b29662B581i1172k9309A91275q6189K37428g7852
17860b16037R9445A40047J65180g8467b4150J0236B33484J1957o8747a29875b9906
17848B59921a09167C2329J81676b55775R0790B98265b53381C8661a31625b7732
17837a3721j05734C264a04732C2341k234g4884A0713a5921A9067J3237a37988
17825D7687d2664E7711c19083B17836a75345H3018i4242C03482a61600P4233j92605
17814b79972A25580k6830i7302c4969E1686L5250b66723A44423A9145b44408d6631
$$ plain form
17895 -341852 -48597 -115170 -61967 -340493 55942 78510 55947 309726 -88317 92670 -27883
17883 -124027 -20861 -195085 -32161 -181996 12747 412914 -22896 38556 9619 14446 81207
17872 81207 -53522 43388 59455 -229662 2581 -91172 -120481 191275 105086 342514 -77852
17860 -216037 -116592 140047 305227 -78467 -24150 -13914 233484 245441 176694 -129875 -29906
17848 259921 -109167 32329 214005 -255775 -164985 298265 -253381 38661 -131625 -27732
17837 -13721 -119455 3264 -104732 32341 30107 -74884 10713 -15921 19067 32304 -137988
17825 47687 -42664 57711 -319083 217836 -175345 83018 -94242 303482 -161600 -87367 -279972
17814 -279972 125580 98750 -97302 -34969 51686 86936 -266723 144423 19145 -244408 -46631
17802B1298J32491K1763f0130j4019E2595h0706B01254E5106b63359A79348G1409
17790A23220m8278C3953d4320G9987d9122E4333J30461b77217A01882D3545K01643
17779B45188G1548k595K78607b70370N9388q7059J21609e7671B19083b8928D34215
17767a2663A87871o102L2620n3729d0317H0525a41784H369a17143j14118A36587
17755H3371a91311F6223J54753b99034a13617I2273m2263f7719B58727a00282
17744A41607J51279A3508J20601o4247j8061J26111P2790j11555o8567L32342
17734D02922b14861J00198A8916d7812E032c02908b0897j71465e6369C43795a20944
17722a51275j47424B52231h8271o0185A11446a36052m8530K207I5741h893r7500
$$ plain form
17802 21298 153789 175552 -60130 -74149 52595 -80706 201254 55106 -263359 179348 71409
17790 123220 74942 33953 -44320 79987 -49122 54333 184794 -277217 101882 43545 245188
17779 245188 71548 68953 347560 -270370 -210982 -298041 -176432 -57671 219083 -28928 434215
17767 -12663 187871 181769 214389 160660 -40317 80525 -141784 8369 -117143 -231261 136587
17755 83371 -191311 66223 220976 -299034 -113617 92273 50010 -67719 258727 -100282
17744 141607 292886 13508 134109 69862 51801 177912 250702 139147 70580 402922
17734 402922 -214861 -114663 18916 -47812 5032 -302908 -20897 -192362 -56369 343795 -120944
17722 -151275 -298699 252231 -88271 -148456 111446 -136052 -184582 -182375 95741 -8893 -106393
17711a06393A26806C4422j0695b24131E3983c68121J24257A79856l4163l5107
17701A10586c59867a73332a9154r323C7167a92740N0566j79758R1670Q1701A96726
17689a56291B66290l4474B2552a13954k28513a01367G2697L52060F8667a99656
17678A4703L26028A7569a00141A2824D017c55209i7354A81126M0384H8366f208
17666A52682L45436h9288C82091a80792F4698g6114o9673D29584k10901a55296
17655D05269h2141A48275n7050N8220c7066n9692C80707b77397H1554g2570C2374
17643a16669A25114J34701m2860L9186c87835D90259B06951A5064b40j01330B83761
17631a9989B39846b80054b0685A29580c7596B2848f2100n7457A29451g030F5027
$$ plain form
17711 -106393 126806 34422 23727 -224131 53983 -368121 -243864 179856 145693 110586
17701 110586 -359867 -173332 -19154 -28477 37167 -192740 -142174 -321932 -230262 -148561 196726
17689 -156291 266290 231816 22552 -113954 -342467 -101367 72697 424757 68667 -199656
17678 14703 340731 17569 -100141 12824 4017 -355209 -97354 181126 221510 88366 -6208
17666 152682 498118 -89288 382091 -180792 64698 -76114 -145787 429584 218683 -155296
17655 405269 -82141 148275 91225 149445 -37066 -96758 380707 -277397 81554 -72570 32374
17643 -116669 125114 259815 216955 256141 -387835 490259 206951 15064 -240 -101570 283761
17631 -19989 239846 -280054 -20685 129580 -37596 22848 -62100 -119557 129451 -7030 65027
17619b86647B24288A8878K70725r6790J93313b23307E7988A9397L79193l433F1016
17607B4070J73519a08910A5243a79319k8956G5337b54267H164L4342P2766a1336
17595a28364H287L6444J71792R4542a7919H4264J06093f4373P46C6059b00082
17583B7239a03133E30472h8011A40769a32480B34758J11967b82365p8586A91696
17572A60350o0415m6250L49665n0926f9098A32193a42789M4682H7583a65637A306
17560A79276B7392O9849h1071A38117b41601M013B3210J15412L8831j4086K03394
17549C66761A00064D6855K5233J5857a27003b431A43462Q7585a01410A04996a33504
17537B58265b68200O0808P1625O6140F8106L2521C5328a09476E61751a08511A36935
$$ plain form
17619 -286647 224288 18878 289603 192813 386126 -223307 57988 19397 398590 395157 61016
17607 24070 197589 -108910 15243 -179319 -208275 75337 -254267 8164 42506 115272 -11336
17595 -128364 8287 44731 216523 311065 -17919 84264 190357 -64373 -63627 36059 -200082
17583 27239 -103133 530472 -88011 140769 -132480 234758 346725 -282365 -360951 191696
17572 160350 99935 53685 403350 352424 -69098 132193 -142789 -98107 87583 -165637 1306
17560 179276 27392 97241 -81071 138117 -241601 -237588 23210 138622 177453 163367 366761
17549 366761 100064 46855 72088 87945 -127003 -2431 143462 231047 -101410 104996 -133504
17537 258265 -268200 -207392 -135767 -69627 68106 100627 35328 -109476 561751 -108511 136935
17525c6207a5979B46804A11542K07144a34962D0358J66980b10901B80856q9732
17515A91124G5946K00358D0801R3077h5820k2202I4334J5742h3341A88331K0861
17504B09192a51405B10368a86392B81128d8202a7039k28052A81127m3454M5347
17494A83020e0233B31055A10905A7895K75627j27586b14246D52796A09721a17509
17483A74078J3865k7226o3793a64939A6280J4815j3514L202K65183n7986a2171
17471F27466D1682K18418q9400k4588J35651H2784b08648h0830c320A27027i5826
17459B49624m3340J7319G5562M13927C1228M18967j39674K02213h6385B7435K05123
17448B32558R6745L6961A78709b4534C69251j81924j7618n0493k9766N80888j81048
$$ plain form
17525 -36207 -15979 246804 111542 318686 -134962 40358 207338 -210901 280856 191124
17515 191124 75946 276304 40801 133878 -85820 -108022 94334 110076 -83341 188331 209192
17504 209192 -151405 210368 -186392 281128 -48202 -17039 -245091 181127 137673 183020
17494 183020 -50233 231055 110905 17895 293522 165936 -214246 452796 109721 -117509
17483 174078 187943 160717 96924 -164939 16280 31095 17581 20783 285966 227980 -12171
17471 627466 41682 260100 170700 146112 281763 82784 -208648 -80830 -3320 127027 -95826
17459 249624 206284 223603 75562 489489 31228 450195 310521 512734 -86385 27435 232558
17448 232558 329303 366264 178709 -24534 369251 187327 169709 119216 89450 670338 489290
17437D89290A14329J68703I2790N7091J92346F0261K04959J05328J63003k25170
17427C08381A21222b7771C55M18808A80471J91494A47007j0808K64964B5478K98303
17416C23781A16159K50417A57738K45666m8651j52356A7927J27014o7918J44379
17406B21402K5255K15111H4901J62505N7631r0966r857n8015i440j13416d0171
17394H8343Q3830J40472i3562q7574A10520b03067B88154F790M20323A50128o1697
17383H8431R0445K9636N5176d0974j14248B4318J57640E0426e7765A39939L57674
17372D97613A47037J49352A1617k975L51997C1620L21871g9753F8274P0330a58169
17360C2632K65836g8A7195a52788g2227r932C2516b96416D03190j88385J31709
$$ plain form
17437 489290 114329 283032 92790 149881 342227 60261 265220 370548 533551 308381
17427 308381 121222 -27771 355 419163 180471 371965 147007 136199 401163 25478 323781
17416 323781 116159 366576 157738 403404 354753 202397 17927 144941 77023 221402
17406 221402 246657 461768 84901 247406 305037 214071 204214 146199 -9440 -122856 -40171
17394 88343 172173 312645 -93562 -181136 110520 -203067 288154 6790 427113 150128 88431
17383 88431 178876 208512 263688 -40974 -155222 24318 181958 50426 -57765 139939 497613
17372 497613 147037 296389 11617 8642 360639 31620 353491 -79753 68274 138604 -158169
17360 32632 298468 -78 17195 -152788 -72227 -82159 32516 -296416 403190 214805 346514
17349C46514H5111f1028J999K380q1545B04810K6123J84849A75804N344k277H8452
17336A50259a39282L0376G0698j766M9294J42146J02670k1329H3198C527J97068
17325B00595K8317G2124P9028r367C5486K39084a20474b8886E87173A29991j3792
17314A16199l729a44711C72024j73014K40842F9510K33465F6039L40705F6591
17303A42613j7644J68842l4347b31381b7828g994B77894q3022n6400a75245C12952
17291C91475j28287O5613K1643F3304A9428K08567K70432a8300A83458N0782m8965
17280A85275N2864J70120d4148A21397c1136H22124B15191j7245K3285B7670K34911
17269B62581j31003J44246G4172K86670r9271n6872N4879B6988K25735N9212a0798
$$ plain form
17349 346514 85111 -61028 -59029 -56649 -138194 204810 230933 415782 175804 181148 178871 88452
17336 150259 -139282 -108906 70698 68932 118226 260372 363042 341713 83198 3527 200595
17325 200595 228912 72124 151152 141785 35486 274570 -120474 -28886 587173 129991 116199
17314 116199 112470 -144711 372024 199010 439852 69510 302975 66039 406744 66591
17303 142613 124969 293811 259464 -231381 -27828 -7994 277894 194872 138472 -175245 312952
17291 391475 263188 328801 350444 63304 19428 227995 498427 -18300 183458 234240 185275
17280 185275 238139 408259 -44148 121397 -31136 822124 215191 197946 221231 27670 262581
17269 262581 131578 275824 74172 360842 261571 204699 259578 26988 252723 311935 -10798
17257C66191b75617C58410j53681A5796K35798H3123f0846A72655n3632K51731
17247C70754I8527K23596K90771A38195J84929A24021J90853A12226a5374E07345
17236B49242l8694a11556A52143O0462r9626b34130C2580J31665K80952j71E2141
17224a55702f285E37583B30398m0179p757K81077b35709C68090A5707J34723k8270
17213A22160K65400K2900M307f8081A01677J44181D3253N4992K68193J7890j66509
17202B17819p5857O0927M9948d7220l7376C07643j20775K51758A77773J96508
17192C74281A49882d08026A84004K16550A96258K31508j3508j18819n5388N02897
17182G42948A54323B1874L6956M86479G9502K09014Q1570J52989j46894j01804
$$ plain form
17257 366191 -275617 358410 204729 15796 251594 83123 -60846 172655 119023 370754
17247 370754 98527 322123 612894 138195 323124 124021 314874 112226 -15374 507345
17236 249242 210548 -111556 152143 212605 112979 -234130 32580 164245 445197 445026 52141
17224 -155702 -6285 537583 230398 190219 182462 463539 -235709 368090 15707 150430 122160
17213 122160 387560 410460 414767 -68081 101677 245858 43253 98245 366438 384328 217819
17202 217819 141962 202889 252837 -47220 -84596 307643 186868 438626 177773 374281
17192 374281 149882 -408026 184004 400554 196258 427766 414258 295439 240051 742948
17182 742948 154323 21874 58830 545309 79502 288516 370086 523075 376181 274377
17172B74377j18003A8549J99922L86992B37392b3771D57017j44010c7791a1875
17161A23926m2944J51694J06569q653Q5049B1323K63562K04964j43745J49194
17151D95298A77008L12859k16694K61960A90904K07458B236K11054J00865N9763
17141C73918R0043j53057E6304K6896A4981K93610K27069A66940K01616j46780
17131B21776H9616L11780j07825K32856G6877J21632c7515D95679B6693J14637
17121A41330L31081j60349p5328a62186D39128J34365j35502L2082n9674j81575
17111B28824C9559L24376j16870J70082p6154N71599C23905L27836k85322J7471
17101C83890B3038N34299j83765J32354k49374K2592R2932L7041J00181j77917
$$ plain form
17172 274377 156374 18549 218471 605463 237392 -23771 457017 313007 -37791 -11875
17161 123926 80982 232676 339245 330592 415641 21323 284885 489849 346104 495298
17151 495298 177008 489867 273173 535133 190904 398362 2236 213290 314155 373918
17141 373918 463961 310904 56304 83200 14981 308591 535660 166940 368556 221776
17131 221776 89616 401396 293571 526427 76877 198509 -37515 495679 26693 141330
17121 141330 472411 312062 236734 -162186 439128 573493 437991 470073 410399 228824
17111 228824 39559 363935 247065 417147 340993 912592 323905 651741 366419 383890
17101 383890 23038 557337 373572 505926 256552 279144 372076 409117 509298 331381
17091C31381j15887J6719J05497M64517B99127I0137M81899j43968K5831j48305
17081C05594A14878K39433K19242j53477q2849k1477O3708p7696A25360J7257
17071A42617J63927J61101M80310D03474J38031n0905A22966M38403r523k64172
17061B87674J40403J06639q732J42982P3662k74063k22578J68813J86438j00348
17051E00890j37462J81557B43788N40464k49625j1328q6625r8065L33862B63886
17040D05269j18168J85556J77958M9409k42350j8772L72564k41430k10312m6455
17030C13269O9391K18497m1673L08666l02362M3617k63969J42076K6637K91964
17020H06113C66354L11993L7214j37693l1382J07890J71999J12623k37603j20667
$$ plain form
17091 331381 215494 232213 337710 802227 299127 90137 572036 428068 453899 305594
17081 305594 114878 354311 573553 420076 337227 315750 379458 301762 125360 142617
17071 142617 306544 467645 947955 403474 541505 490600 122966 561369 551846 287674
17061 287674 428077 534716 525984 668966 742628 468565 245987 414800 601238 500890
17051 500890 363428 544985 243788 784252 534627 523299 436674 338609 672471 263886
17040 405269 287101 472657 650615 700024 457674 438902 811466 570036 359724 313269
17030 313269 382660 601157 559484 868150 565788 609405 345436 487512 514149 806113
17020 806113 366354 678347 715561 577868 546486 654376 826375 938998 701395 580728
17010E80728K96100k84124Q9381o5102K86596l17717K13499l02131L24382j27646
17000F93966K73146l97179J53440J25475q8252m099J24188J17148O1933m42451
16990F17315j92349M52953l70297K10893j67402j21793N43128n1209m58531P31965
16980A194673l22078j69116J67240r4971j99091O46678l26263k25337K48412j47760
16970G72387J67357j83076j38183M47263P5557k66452k23512J53053M79401k70938
16960A012857j14093J48345n3745K2681J70473J0935j28989J63623j75764O7344
16950A123667k72346M29828j42388k88060L44122j8892M7539N3847j27380l5215
16940A114722R5887k07065L3056J09224J93445o8630r8002P7121j38450K63800
$$ plain form
17010 580728 876828 592704 682085 616983 903579 585862 799361 497230 821612 693966
17000 693966 967112 569933 723373 848848 760596 756497 880685 997833 1059766 617315
16990 617315 424966 877919 507622 718515 551113 429320 972448 921239 462708 1194673
16980 1194673 872595 703479 870719 775748 576657 1223335 897072 671735 920147 772387
16970 772387 939744 756668 618485 1065748 1141305 874853 651341 804394 1283795 1012857
16960 1012857 898764 1047109 993364 1016045 1186518 1197453 1068464 1232087 1056323 1123667
16950 1123667 851321 1281149 1138761 850701 1194823 1175931 1223470 1277317 1149937 1114722
16940 1114722 1210609 1003544 1036600 1145824 1339269 1270639 1172637 1249758 1111308 1375108
16930A375108J94325o10079L43238j3315K37677j16653m8329m4610J07306j09474
16920A315194n6917K14660k43693j46976N51972j88482j42279K45074q1567O9073
16910A536059k66850N00163j8420k75682q3230L58604j44502J47299j89397J07431
16900A671475L21846k50647P2390j13923J32703J3109L39175m13570j59833L77105
16890A989830K5701j7215m5373l51193K74520K31055j72823J2166K36599o545
16880B176722k93979M69384k37976J60471j24896j00349J98420L30656J87317
16871B765770l97596J33012J32387O601j20629J10770J53627j404j97467J69165
16861B754236K88902K17153k74415K17395l40109M6662L5894L78092J55961m70980
$$ plain form
16930 1375108 1569433 959354 1302592 1289277 1526954 1410301 1361972 1317362 1424668 1315194
16920 1315194 1258277 1472937 1229244 1082268 1634240 1445758 1303479 1548553 1466986 1536059
16910 1536059 1269209 1769372 1750952 1475270 1392040 1750644 1606142 1753441 1564044 1671475
16900 1671475 1993321 1742674 1815064 1701141 1833844 1846953 2186128 1772558 1612725 1989830
16890 1989830 2015531 1998316 1952943 1601750 1876270 2107325 1934502 1946668 2183267 2176722
16880 2176722 1882743 2352127 2114151 2274622 2149726 2049377 2247797 2578453 2765770
16871 2765770 2368174 2501186 2633573 2640174 2519545 2630315 2783942 2782538 2585071 2754236
16861 2754236 3043138 3260291 2985876 3203271 2863162 2909824 2945718 3323810 3479771 3008791
16851C008791J95522M28256l05692j51899J94436n566j23427M42405j78780K77681
16841C781727k61180J50926J26300L4664K09887L2406K89383j50919R6870K37736
16831D547800k16372L29995j77583N5839K1244L41373p0732J38670m0031R2158
16821E022361L51316l57580P99744m61972K68499r1082J13317L91533J60184K80967
16811F477287l10947j29342Q53842k06541J57650L34991R9324K5626J82223K02213
16801G686326J2880N30619j06105J72559L95389J20399L87939L05407K83673j8976
16791I770110J94092J89292M18240m6461O74504O3941N56746J71450L96264N9709
16781A2447887N57833K53812P78102m3149J076592J80943M07382P15199L07568
$$ plain form
16851 3008791 3204313 3632569 3326877 3174978 3369414 3363848 3240421 3682826 3504046 3781727
16841 3781727 3520547 3671473 3797773 3832437 4042324 4074730 4364113 4213194 4310064 4547800
16831 4547800 4331428 4661423 4483840 4539679 4560923 4902296 4831564 4970234 4930203 5022361
16821 5022361 5373677 5016097 5815841 5353869 5622368 5531286 5644603 6036136 6196320 6477287
16811 6477287 6166340 6036998 6890840 6684299 6841949 7176940 7276264 7301890 7484113 7686326
16801 7686326 7699206 8229825 8123720 8296279 8691668 8812067 9200006 9505413 9789086 9770110
16791 9770110 9964202 10153494 10571734 10525273 11199777 11263718 11820464 11991914 12388178 12447887
16781 12447887 13005720 13259532 14037634 13994485 15071077 15252020 15659402 16374601 16682169
16772A6682169P26799L57489P45585N82053N61348Q96381N11559Q84327J304726
16763B3252436M53609J025294R78377R80763J586412L93070J106113K069891J104950
16754C2950915J348941J943845J594130J548243K180878J734589K258409K507598
16746D8067548K546382K486566K874042L070067L230344L320969M062437L490545
16738G3148900M187572M321348M981167N167787N189045N954934N992511N526587
16730A14469851O890500O171579O754281O315496P059402O415789N779119N423017
16722A65279034N167557M220296L024875K383499P14012K20430j185673j961327
16714A77862703l488061m142537m839626n682408o260390o418550o488110p140628
$$ plain form
16772 16682169 17408968 17766457 18512042 19094095 19655443 20551824 21063383 21947710 23252436
16763 23252436 23706045 24731339 25709716 26690479 28276891 28669961 29776074 31845965 32950915
16754 32950915 34299856 36243701 37837831 39386074 41566952 43301541 45559950 48067548
16746 48067548 50613930 53100496 55974538 59044605 62274949 65595918 69658355 73148900
16738 73148900 77336472 81657820 86638987 91806774 96995819 102950753 108943264 114469851
16730 114469851 121360351 127531930 134286211 140601707 147661109 154076898 159856017 165279034
16722 165279034 170446591 174666887 177691762 180075261 180789273 181009703 179824030 177862703
16714 177862703 174374642 170232105 165392479 159710071 153449681 147031131 140543021 133402393
16706A33402393o779182o466689o584947o414415n971984n573582n468740m938909
16698H5203945n221649m504854l987853m409419l147058l506470l374358k981633
16690E4070651k657810k437605l205246k204729j633354k341556j504751k121313
16682C5964287j136104k051984j166642j739248j268081j259803r31369j322296
16674B5088760o51108j027222r54119o55014q63949j149302p28043p19091q17035
16665A7523877n62395j96978p24662k01712j086381l46627k20189k43925n78224
16656A3362784p62061l29576j19593o99038O8624n82478l27098N9266m32098j96883
16646A0041849o65475k56191Q0346p37534J08378k382m13234j56036m0939j70836
$$ plain form
16706 133402393 126623211 120156522 113571575 107157160 101185176 95611594 90142854 85203945
16698 85203945 79982296 75477442 71489589 67080170 63933112 60426642 57052284 54070651
16690 54070651 51412841 48975236 45769990 43565261 41931907 39590351 38085600 35964287
16682 35964287 34828183 32776199 31609557 29870309 28602228 27342425 26411056 25088760
16674 25088760 24437652 23410430 22456311 21801297 20937348 19788046 19060003 18340912 17523877
16665 17523877 16961482 16764504 16039842 15838130 14751749 14405122 14184933 13941008 13362784
16656 13362784 12600723 12271147 12151554 11452516 11521140 10938662 10611564 10670830 10238732 10041849
16646 10041849 9376374 9120183 9200529 8462995 8571373 8568991 8155757 7999721 7958782 7787946
16636G787946l67494k5948l24551j25583k52060m8416k95222j04908J87753l77938
16626F053579j4292n74734L41772l2726m76169k92967J26548l46632J50943L73731
16616E309053l40144m44429k40963K5576K32044l02757J59773j37912k11403j94571
16606C854267K08065l76836M11360k06360r1302j37588k69788J83858j47917L116
16596C430875L4075l27259o1783K92017k62061p775l96862L6251L38245l18711
16586B757012j9115l33856L24163j05214R4640J6665L8870k0693p919J08297m59383
16575B393467j69220m1718J8302J57374j02149p1397k37618K79006n6328j84371
16565A985348K8762P0569k26109r8857R4736O4262k80013J97756p1489q2314L4313
$$ plain form
16636 7787946 7420452 7394504 7069953 6944370 6692310 6643894 6348672 6243764 6431517 6053579
16626 6053579 6039287 5464553 5806325 5773599 5297430 5004463 5131011 4784379 4935322 5309053
16616 5309053 4968909 4524480 4283517 4309093 4541137 4238380 4398153 4260241 4048838 3854267
16606 3854267 4062332 3685496 4096856 3890496 3799194 3661606 3391818 3575676 3427759 3430875
16596 3430875 3464950 3137691 3075908 3367925 3105864 3098089 2701227 2737478 3075723 2757012
16586 2757012 2737897 2404041 2728204 2622990 2717630 2734295 2773165 2752472 2744553 2852850 2393467
16575 2393467 2224247 2182529 2200831 2358205 2256056 2184659 1947041 2226047 2169719 1985348
16565 1985348 2014110 2084679 1858570 1759713 1854449 1918711 1638698 1836454 1764965 1682651 1716964
16554A716964k6828p7974p7268K06266l80k03875p8318O7958M00863q04117K72870
16543A396161j14505K06581J40543k5355j99424K6193J17113k22757K148J44499
16533A471197k13756l56447O93259k29656j82963L32999j76807O705j21897j83429
16523A039205K22227M1675m74515M08801j96606O1640Q659k6828l8367K78990
16513A324881q3039j92293l6052Q7507o880m16553M67230o6092j24235K63212
16503A217686k62680k4311K69094n70970J96281J54265m00889M76153j38656J4599
16493I30572q6758j24130L04277l32488M54618m60336J67371k3352k78002K24109
16483G75881J55007m44567L08553K47520l03053J71095k30494J16076j12293J40345
$$ plain form
16554 1716964 1690136 1612162 1534894 1741160 1740780 1536905 1458587 1526545 1927408 1123291 1396161
16543 1396161 1281656 1488237 1628780 1603425 1404001 1430194 1547307 1324550 1326698 1471197
16533 1471197 1257441 900994 1594253 1364597 1181634 1514633 1337826 1344531 1222634 1039205
16523 1039205 1261432 1303107 828592 1237393 1040787 1102427 1111086 1084258 1045891 1324881
16513 1324881 1241842 1049549 1013497 1101004 1094124 677571 1144801 1078709 954474 1217686
16503 1217686 955006 930695 1199789 628819 825100 979365 578476 1054629 915973 930572
16493 930572 843814 719684 1023961 691473 1146091 685755 853126 829774 551772 775881
16483 775881 930888 486321 794874 1042394 739341 910436 679942 796018 683725 824070
16473H24070Q4203D36135L28043M9780L80790p6242D16341K07465j06622J28595
16463F45779k28543M86495l15273K46983l00418p9461J93187J25271k64442J07007
16453F16585l06441K26898p8207L09021j08483L4657N4151C06191N99319l09010
16443E96500n3327K1065J30871L16466m58226A58664L91656o1131j34561M72239
16433H26867N3365m19572J7087R353j95698M01860j58850J83533C11731J7580
16423C29311O6890J17497r06R9458k65054j42598M25103B80684K60192K19376
16413G60252k95217B11695N08751j57364j71236p7665J45023Q5681J13528k80028
16403C78385P7392R5679j2808r1345K69972B48566M14527j53248k48092K03561
$$ plain form
16473 824070 908273 436135 764178 813958 1194748 1118506 416341 623806 517184 645779
16463 645779 417236 903731 588458 835441 535023 455562 648749 774020 509578 616585
16453 616585 310144 537042 458835 767856 659373 694030 748181 306191 905510 596500
16443 596500 543173 564238 695109 1011575 553349 158664 550320 489189 354628 826867
16433 826867 880232 460660 477747 487100 291402 693262 534412 717945 311731 329311
16423 329311 396201 513698 512792 612250 347196 204598 629701 280684 540876 760252
16413 760252 465035 211695 720446 563082 391846 314181 459204 544885 658413 378385
16403 378385 455777 551456 538648 447303 717275 248566 663093 509845 261753 465314
16393D65314K78536B98877O3075o2388J23285L498K2680j98098K28364B36344
16382A70352K5467L52944B33194O0749A7440M98239j75708L18474k88951A39965
16371H0970M42758j07748o3171c7868E71509q1127A65614J61803n0630q0875J22802
16360C18714A36224K83115A6550L81151R2925B35148K37345l2618Q595C4249K31381
16349B65630M3389K51877j57813A24970a22010C65331k203R2549A42019O9890
16339B11909p2477m709J77181A33113L32710p0518j85564K25837p4034F6826M3859
16328A10685J95607j04011q1183C9218J05321O7968O4887J7059G5929K52504A41491
16316b04259e9249m4063A4776J70500J70499h535A63101J09754K34375f001D94040
$$ plain form
16393 465314 743850 298877 361952 299564 422849 426347 449027 250929 479293 236344
16382 170352 195819 548763 233194 293943 17440 515679 339971 658445 369494 139965
16371 80970 523728 415980 352809 -37868 571509 490382 165614 327417 276787 195912 318714
16360 318714 136224 419339 16550 397701 490626 235148 472493 439875 448470 34249 265630
16349 265630 309019 560896 403083 124970 -122010 365331 363128 455677 142019 211909
16339 211909 139432 134723 311904 133113 465823 395305 209741 435578 361544 66826 110685
16328 110685 306292 202281 121098 39218 144539 212507 277394 294453 75929 328433 141491
16316 -204259 -59249 -103312 14776 185276 355775 -8535 163101 272855 507230 -6001 494040
16304B26184g2622D62772j10653A25349O0552K46583a58105D15098I5917b225
16293B68610J4758R5752g4860A73427K74509A80234B2662J31524b3405B81111
16282C62194k5492M6451N8135Q7150a26839B52255l166D7242m232J02585L621
16271A49216n5882J84185J18331j78720A1809L29695l2297I8727d6448D85033
16260A00363L23073a84957g0302B47078J77716d18579A87590r0671B7901K27992
16250B55893a7944C00719F1070B5181a11920B27297h505D2491J89043a00459A72833
16238B3070k293J96715q8945n4931J51844a12451H3833J75242l6398P5218l0942
16227B66953n2919b3757A98415e2200l473C02041j34941b27304D3178a82751A48992
$$ plain form
16304 226184 -72622 462772 352119 125349 185901 432484 -158105 415098 95917 -2225
16293 268610 283368 379120 -74860 173427 447936 180234 22662 154186 -23405 281111
16282 362194 336702 383153 441288 528438 -126839 252255 249089 47242 43010 145595 149216
16271 149216 93334 277519 395850 217130 11809 341504 309207 98727 -46448 485033
16260 100363 423436 -184957 -70302 247078 424794 -418579 187590 96919 27901 255893
16250 255893 -17944 300719 61070 25181 -111920 227297 -8505 42491 231534 -100459 172833
16238 23070 20777 217492 128547 73616 225460 -112451 83833 259075 222677 297895 266953
16227 266953 214034 -23757 198415 -52200 -55673 302041 167100 -227304 43178 -182751 148992
16215A45425h5916C92490b39193O9472g37r2753m9910j39872A66028Q1214a85669
16203C41212J70682a86B64619f2193A46041C946a32276a8201B49476b95492B90640
16191B19453j1615r8784c0912j95695B41613j05041J09733L87114C5077R4038
16181A29115a6218D1872c06295A74081l3036J50629b77786A21143a01049A92820
16170A6795K99905L1235e9705D2061J67562a98711j9318A61968b06822A03926
16159a85865A70601a26970A82777a42610B27272d66509A80954a8329A47757h4753
16148C07629m8684l6560r0542D4435K83779a72437N4081C36507d8910C14011b08820
16136B70333j28810J04149a05142E9996J31995G295J76113c0673k04949b375B09337
$$ plain form
16215 145425 -85916 392490 -239193 -169721 -737 -93490 -143400 -283272 166028 247242 -185669
16203 341212 511894 -186 264619 -62193 146041 3946 -132276 -18201 249476 -295492 290640
16191 219453 207838 109054 -30912 -226607 241613 136572 246305 633419 35077 129115
16181 129115 -16218 41872 -306295 174081 141045 291674 -277786 121143 -101049 192820
16170 16795 316700 347935 -59705 42061 209623 -198711 -218029 161968 -206822 103926
16159 -185865 170601 -126970 182777 -142610 227272 -466509 180954 -18329 147757 -84753
16148 307629 258945 222385 131843 44435 328214 -172437 -118356 336507 -48910 314011 -208820
16136 270333 141523 245672 -105142 59996 191991 7295 183408 -30673 -235622 -2375 209337
16124G9480C3534c4570B87768j11506J7818P899P3366F1030K21961C3027i1321
16112A52304n6043b77932f7543A07737c0172A6172J79368g25A42860a15887C02366
16100i792B35440b13616E1393c2850B8316J06669a36847L3928k76892B44753H800
16088C32316G9856q770i3553B4714R3999J3244B4368O1421i3036L0635B9752K79016
16076C08768j33655c77974h9615C1400J5634a59779e6579G7688l8092i0229A84518
16064a84233j6757B68850h6624E2275i4151b4629L08f436n7413a299A94032h4543
16051a0329l7132j03807a7053P797B3751J0452a64582A37417d5373A26631m6344
16040H0287O7011K19381H6856B7117b1369A9115b4969m4899a2074A37690h0035
$$ plain form
16124 79480 33534 -34570 287768 176262 194080 201979 275345 61030 282991 33027 -91321
16112 152304 96261 -277932 -67543 107737 -30172 16172 195540 -725 142860 -115887 302366
16100 -9792 235440 -213616 51393 -32850 28316 134985 -136847 -102919 -379811 244753 8800
16088 332316 79856 71086 -93553 24714 118713 131957 24368 85789 -93036 -62401 29752 308768
16076 308768 175113 -377974 -89615 31400 47034 -159779 -56579 77688 39596 -90229 184518
16064 -184233 -200990 268850 -86624 52275 -94151 -24629 -24321 -6436 -63849 -1299 194032 -84543
16051 -10329 -47461 -151268 -17053 -9256 23751 34203 -164582 137417 -45373 126631 80287
16040 80287 147298 366679 86856 27117 -21369 19115 -24969 -69868 -12074 137690 -80035
16028E1815J8526K4400f6771A54109E6901c45637E9013a40797A46158D8090a01530
16016a60312N0705A40886c9583l58666C75787j52448i5092A88985l0164b39353
16005G764a10953n8739o417A2168K3278b35056H4182B3224m211K85014B4243a48829
15992B41541b0189H3722K68130C596g69371b23043A77659k6074c7912l744k55558
15981b97214D63573k19613J01979j24887E8917h4667D79297k32521a3983A99659
15970G4332c49476a66028A88959a21690c6522C481J8473O8787J24493D7562k864
15959D4698j1902M5424b07814H2303C6046K7424b29640B96022A30006a38448f8149
15947A36091b45924P1277K2900B9557c92891A18484k8132J00133a0626j16888
$$ plain form
16028 51815 70341 94741 -66771 154109 56901 -345637 59013 -140797 146158 48090 -101530
16016 -160312 -109607 140886 -39583 -398249 375787 223339 -95092 188985 158821 -239353
16005 7764 -110953 -169692 -176109 12168 35446 -235056 84182 23224 19013 304027 24243 -148829
15992 241541 -20189 83722 351852 3596 -769371 -223043 177659 151585 -37912 -41656 -297214
15981 -297214 463573 243960 345939 221052 58917 -84667 479297 246776 -13983 199659
15970 74332 -349476 -166028 188959 -121690 -36522 3481 21954 90741 215234 47562 44698
15959 44698 32796 78220 -207814 82303 36046 63470 -229640 296022 130006 -138448 -68149
15947 136091 -245924 -174647 -151747 29557 -392891 118484 90352 190485 -10626 -127514
15937a27514A9018a66434B84066d12641a15042j51010B13272b0139j37231A06608
15926d36053e1112a5326B73157D7878a28841C00092a08466C6028e8780a7293j45820
15915a63113G8961c26878N9997B29380c6949l84978a36481j09176g3528j35645
15905b09173e6390j79501D009K14748b22080b013p8457A5392b55234n6789D4855
15893A42742g1160A70600h6464m2686A23018k2599b29465c0329j79541d7517q4984
15882a32501n5968q6947a15606e6772k69392a2519m083j96342M6529a6670G6549
15870f830l1335j87003A29807b963B1048i7529l5966a6975C57462c61154R1313
15859b69841H9653a17770a8600G1610b25264A37577j2390J68624a23855C92442
$$ plain form
15937 -127514 19018 -166434 284066 -412641 -115042 -266052 213272 -20139 -157370 106608
15926 -436053 -51112 -15326 273157 47878 -128841 300092 -108466 36028 -58780 -17293 -163113
15915 -163113 78961 -326878 -266881 229380 -36949 -421927 -136481 -245657 -73528 -209173
15905 -209173 -56390 -235891 4009 218757 -222080 -2013 -80470 15392 -255234 -312023 44855
15893 142742 -71160 170600 -86464 -129150 123018 100419 -229465 -30329 -209870 -47517 -132501
15882 -132501 -188469 -275416 -115606 -56772 -326164 -12519 -16602 -212944 -166415 -16670 76549
15870 -6830 -38165 -225168 129807 -2963 21048 -97529 -133495 -16975 357462 -361154 -269841
15859 -269841 89653 -117770 -18600 71610 -225264 137577 125187 293811 -123855 392442
15848a21275a4439e975A02723b95963d4085D0178j376b0577j23031e2794B35667
15836A84902F1572L06324c84363M3458J32225M7781A29098a44595h473r0374j14907
15825b13754a02768k96395H7070h6271B31187a76813F0197N0104a18154k0080
15815a38234j21054K957r7504a62526B57187H0481b98717e8288p5483Q095L7856
15804h7820A47328D1757b5218C9950a99913k7771b6946j97663B10751F3882a04493
15792A78829K14262j79573m148R8139I766a29907I3500a7041B79654l8784c23064
15780B07880J81508j72041n1928B2689b12134A88709c2422F7853c07196R8740
15770b08456A25297N1444b06336M0420D3892c7737D4155L16386b2464C4648a6898
$$ plain form
15848 -121275 -14439 -5975 102723 -295963 -44085 40178 38802 -20577 -143608 -52794 235667
15836 184902 61572 367896 -384363 -340905 -208680 -160899 129098 -144595 -8473 -98847 -213754
15825 -213754 -102768 -399163 87070 -86271 231187 -176813 60197 110301 -118154 -138234
15815 -138234 -259288 -256331 -353835 -162526 257187 80481 -298717 -58288 -133771 -125676 -87820
15804 -87820 147328 41757 -25218 39950 -199913 -227684 -26946 -224609 210751 63882 -104493
15792 178829 393091 213518 209370 307509 9766 -129907 93500 -17041 279654 240870 -323064
15780 207880 389388 217347 165419 22689 -212134 188709 -32422 67853 -307196 -208456
15770 -208456 125297 176741 -206336 -165916 43892 -37737 44155 360541 -22464 34648 -16898
15758a86393A27673h354A8337J7382O7047D4332a6012A65070k4196c0722j5965
15747d6687G7162L28899a22698D9032a46270k32431a61545A96554a19403E7225
15736b13838j1565l430J03235O0198c0274j10325M6305k4612F560c4794m0229
15725g5023j07565I193c29073Q4031B98384i4423o6928A79025d34134I7420b98137
15713D6379J33453a41534l43805a99603d5780l6606G2723B2549K0911g1788n9880
15702a31668j34105i2347G4735a03491E6117B1673h4368j58353i5217j23891A0396
15690h5380A94832G4466a47023F4664c2200A13085h0237A45346b18767q9466k3393
15679c31626B79289A7178J60717a39529H8047J37814A03746c50408A76619b06981
$$ plain form
15758 -186393 127673 -8354 18337 35719 102766 44332 -16012 165070 140874 -30722 -46687
15747 -46687 77162 406061 -122698 49032 -146270 -378701 -161545 196554 -119403 57225
15736 -213838 -225403 -228833 -125598 -65400 -30274 -140599 -94294 -118906 6560 -34794 -75023
15725 -75023 -182588 9193 -329073 -245042 298384 -94423 -161351 179025 -434134 97420 -298137
15713 46379 179832 -141534 -485339 -199603 -45780 -82386 72723 22549 43460 -71788 -131668
15702 -131668 -265773 -92347 74735 -103491 56117 21673 -84368 -242721 -95217 -219108 10396
15690 -85380 194832 74466 -147023 64664 -32200 113085 -80237 145346 -218767 -308233 -331626
15679 -331626 279289 17178 177895 -139529 88047 225861 103746 -350408 176619 -206981
15668F4485K1482b73042N7061j44468A83031H9342a54284A52613D7030J65030
15658B12060r4418f8839K8928m34146A41093I670M0565a44480A08365h7510m8386
15647a35896J9599B14235p3437J1251a1554k29631g7449l3556j47599B36273a44723
15635e3363j03776C403N1676J24563g8603L0972j78973G9333l067g0952B41364
15623B14927b9549j43186H9708b43418D3431d5420J4884A09893b00818o7208A20006
15611g3879J1569k81964G9480R8334a78922Q8759G725L8322a95174I5077o406
15600H8671e1445l11340I4242J41322b39594h4738C49768g0434F3073J51258I3375
15588a90554K3779B72794J29779j97251O3045I933g1949J274B46147h1859G6255
$$ plain form
15668 64485 85967 -273042 -215981 -360449 183031 89342 -154284 152613 47030 212060
15658 212060 117642 -68839 -39911 -474057 141093 9670 50235 -144480 108365 -87510 -135896
15647 -135896 -116297 214235 140798 152049 -11554 -241185 -77449 -111005 -258604 236273 -144723
15635 -53363 -157139 3403 55079 179642 -78603 -47631 -226604 79333 76266 -70952 241364
15623 214927 -29549 -172735 89708 -243418 43431 -45420 -30536 109893 -200818 -268026 120006
15611 -73879 -62310 -344274 79480 177814 -178922 -90163 7725 46047 -195174 95077 88671
15600 88671 -51445 -362785 94242 235564 -239594 -84738 349768 -70434 63073 214331 93375
15588 -190554 -166775 272794 402573 205322 268367 9933 -71949 -70675 246147 -81859 76255
15576a54108M2125F8791J2699c6744p8808D51620a06423N0403j02170k9477N4465
15565a33202C30616A42761b50844P1053A45082a74458r1406a07564H4221C3708
15554B8466J98444A2852a24692J3850j33264A23128c00020C2052J07201L4519
15544A73772j5498b46490G0471N7042a92107G7849d13578A99045L9434a59826
15533H2581J56537H1418e2444o720B79226J55239a52541A04561r528Q6132a15023
15521a13764A04615e1866A24118J87251a852A56125N2375m602Q3904b15614C011
15509B67825h9996F2193K15627l5045a23406A4691M8430e8953k90953B8183J2264
15498D0447K2191P7585c01962a14677J8475G668J65767a14483P219L374A51269
$$ plain form
15576 -154108 -111983 68791 81490 -36744 -115552 451620 -106423 -56020 -158190 -187667 -133202
15565 -133202 330616 142761 -250844 -179791 145082 -174458 -265864 -107564 84221 33708
15554 28466 226910 12852 -124692 -110842 -244106 123128 -300020 32052 139253 173772
15544 173772 158274 -246490 70471 127513 -192107 77849 -413578 199045 238479 -159826
15533 82581 239118 81418 -52444 -59164 279226 434465 -152541 104561 95033 181165 -115023
15521 -113764 104615 -51866 124118 311369 -1852 156125 208500 203898 287802 -215614 3011
15509 267825 -89996 62193 277820 242775 -123406 14691 63121 -58953 -349906 28183 40447
15498 40447 62638 140223 -301962 -114677 -96202 7668 173435 -114483 -107264 -103890 151269
15486i2609B09675G708J85578m9128b32003c7119r413j52380b0555j78734L8469
15475a60820A69951f5266F354K58650g9202H7192a32445G4005L9333a28012d9374
15463D38359I4198b5167J377j60160B96339K641c69625J22775a09914B08529c45284
15451a42278f3995p9738A88558a38950m78627h6007C26308j02383a3669l56275
15441c69944c6013j59371m6746G1822J31535c73775g2869j2002B28730b70623
15430b36685E37281B2544a96355A59827Q90f967J34G5289c63441C57953a88825
15418G4811M2513d9880j89014e4140A97278f4978q6642G4969a42878A59576b52874
15406a50327A4703N9120d1979A19319c3512D6810c42301J23374O9573A62086Q7371
$$ plain form
15486 -92609 209675 7708 193286 144158 -232003 -37119 -46532 -198912 -20555 -199289 -160820
15475 -160820 169951 -65266 6354 265004 -79202 87192 -132445 74005 113338 -128012 -49374
15463 438359 94198 -25167 -23790 -183950 296339 298980 -369625 -246850 -109914 208529 -345284
15451 -142278 -63995 -143733 188558 -138950 -617577 -86007 326308 223925 -13669 -369944
15441 -369944 -36013 -195384 -242130 71822 203357 -373775 -72869 -84871 228730 -270623
15430 -236685 537281 22544 -196355 159827 160717 -6967 -6833 75289 -363441 357953 -188825
15418 74811 117324 -49880 -238894 -54140 197278 -64978 -151620 74969 -142878 159576 -252874
15406 -150327 14703 73823 -41979 119319 -33512 46810 -342301 -218927 -149354 162086 249457
15395B49457a48384P0807j05093L6889A65185a75697C4024e8428r8610D1688e5980
15383A26454c50430D8185b93806B19114J44935b08184d6641l1696G8708c5948
15372b94074D545J2816L0246L9657J8668J02030B3644c35405B42159A20361D8575
15360G6323h2593B22607D432J78375h6251F17494a21461C39541a26866B9833A2371
15348H24Q3100C012J70370D5226i6073d1650E2380K36833i176j49596R059j24417
15336b74130j01986c7958C01531a25859A88993q436K04492A51994D8028a63705
15325C2916Q4231a3402o591E925L09898a63867d2754o8033D19406A78660q0191
15314I8469a57454O6969B50621q4274a36272A02927L68496j90888h1126C29190
$$ plain form
15395 249457 -148384 -77577 -182670 -145781 165185 -175697 34024 -58428 -157038 41688 -55980
15383 126454 -350430 48185 -293806 219114 364049 -208184 -46641 -78337 78708 -35948
15372 -294074 4545 17361 47607 87264 105932 207962 23644 -335405 242159 120361 48575
15360 76323 -82593 222607 4432 182807 -86251 617494 -121461 339541 -126866 29833 12371
15348 824 83924 3012 173382 45226 -96073 -41650 52380 289213 -9176 -158772 -149713 -274130
15336 -274130 -376116 -37958 301531 -125859 188993 180557 385049 151994 48028 -163705
15325 32916 117147 -13402 -19993 5925 315823 -163867 -42754 -110787 419406 178660 98469
15314 98469 -157454 -90485 250621 166347 -136272 102927 471423 280535 -81126 329190
15303a3261B04759P658a52896A24366b36842B23715j0297n3354K8582J42854I536
15291A6049a83103A77918h2878c6962A97277J71596c90666B37003A07077e1858
15280d4667L798B0613J72046G9769K10653a8049B29369q3006C9026i1801D14087
15268C27621i1137A21319O6310f8592b683h70l5686J2524A17215b26935a13015
15256F9051K47448A47186c1500C08907r2550O623J04152A21201J82618M73317
15246G77136N97924J200772p41957n3847Q9209F27880b9470A67350C4328J64475
15236A98803b47307I6705J2912d8956D6821A4117M82078b8369C08375a65617m1548
15225b07165D6354J11735i1550K5813F077K16921G5323M9468N7750j5075q814
$$ plain form
15303 -13261 204759 212417 -152896 124366 -236842 223715 213418 160064 188646 331500 9536
15291 16049 -183103 177918 -82878 -36962 197277 368873 -390666 237003 107077 -51858
15280 -44667 -40869 20613 192659 79769 290422 -18049 229369 146363 39026 -91801 414087
15268 327621 -91137 121319 187629 -68592 -2683 -870 -36556 -24032 117215 -226935 -113015
15256 69051 316499 147186 -31500 308907 216357 222980 327132 121201 303819 777136
15246 777136 1375060 2575832 1833875 1780028 1869237 627880 -29470 167350 34328 198803
15236 198803 -247307 96705 109617 -48956 46821 14117 496195 -28369 308375 -165617 -207165
15225 -207165 46354 158089 -91550 -65737 6077 222998 75323 124791 182541 167466 158652
15214A58652a0090G4656J93598b7597B90928P3004b34609B2923J62240P3832E8518
15202a07338A63861l7368J27477O3656q9082b58786B19868a820m6948A57760B4966
15190g8137F3484B1468e6818C20561b8336k21604P5233F499f4895G2089O122J24571
15178B02782n9342g4108j33570A41961b47144A83454A5722K32144d6962K2257
15168b4705J0894D56597B04485j7812B5081r951O9739J60348B9820J12389J10690
15157B52899D7570J70188n8184J05481f6329H6039c4071G1913J2015J21740O4959
15146B70627m802a26336B47603J34002a62766H682J45707O2478M9824M2503b2155
15134A81246e3015D24842j03794F5675J7548m0474J93833E066e3693g419n3544
$$ plain form
15214 158652 -10090 74656 268254 -27597 290928 363932 -234609 22923 185163 258995 58518
15202 -107338 163861 126493 253970 317626 228544 -258786 219868 -1820 -48768 157760 24966
15190 -78137 63484 21468 -56818 320561 -28336 -249940 -174707 6499 -64895 72089 78211 202782
15178 202782 143440 -74108 -207678 141961 -247144 183454 15722 247866 -46962 -24705
15168 -24705 -13811 456597 204485 186673 25081 15130 84869 245217 29820 142209 252899
15157 252899 47570 217758 159574 265055 -66329 86039 -34071 71913 83928 205668 270627
15146 270627 265825 -126336 247603 381605 -162766 8682 154389 216867 266691 309194 -22155
15134 181246 -53015 424842 321048 65675 83223 42749 236582 5066 -53693 -7419 -60963
15123f0963A80170C8751K80126j49790h448A99224M5080q7037N9346b8425j57768
15112a86193A48303J40054A1054N8857g8752A25343L2544O2598L3487n6946Q0240
15101B77266k9364R2424c9895A75490B5106N11617j84261A15998K2984M18718
15091E57700A08162K07J31051n3356n6814l6202J50368r7987L20304K887j88973
15080B79647H0812Q0976N3914J9508C2535K14671a36021C8301L14583j3965j21295
15069B17624B2719J11224n0723J36073d5548B77303K50814j90574a40056B93659
15058a77320C52736q8546p6442q714q8585R9825m3053A82L09910O8333m5619j0191
15046C22615l4236r8759N2561N9424K56924e0354B65372p9409J34328A41496L9569
$$ plain form
15123 -60963 180170 38751 318877 169087 -8448 199224 244304 157267 216613 -28425 -186193
15112 -186193 148303 288357 11054 69911 -78752 125343 157887 220485 253972 197026 277266
15101 277266 247902 340326 -39895 175490 25106 536723 352462 115998 138982 557700
15091 557700 108162 108369 239420 186064 129250 93048 243416 145429 465733 468620 279647
15080 279647 80812 161788 215702 235210 32535 247206 -136021 38301 352884 338919 217624
15069 217624 22719 133943 83220 219293 -45548 277303 528117 337543 -140056 293659
15058 -177320 352736 264190 187748 179034 90449 190274 147221 182 310092 378425 332806 322615
15046 322615 288379 189620 242181 301605 558529 -50354 265372 185963 320291 141496 181065
15035A81065a04430C15425a76630B06829i4064G8273f2874H0762K5018e1802C59500
15023B0324i596B45697p3233J39268j24605p7574J63063j24615L59795B00469
15012a37460C15344q8192a6106k9796D23145A69430p2441L3692Q4946o3866a51578
15000I2872J56048j9248m7994N3535D4809L18815j26857M9250l6498E7386J37926
14989A95312K15115o6962F0864i4150A13730f3753C11126A43147N0008l473K78058
14978D67740M5996F3567K21309J66243A92568L61161B16392o9837J640R6222K62134
14967E06551B02419o005F4923K19862J28890r9352B5265K18020F1665K89348j20106
14956B30907J0568k473I7111o987a11064C91319k7543j25194J80069L3977j00129
$$ plain form
15035 181065 -104430 315425 -176630 206829 -94064 78273 -62874 80762 105780 -51802 359500
15023 20324 -9596 245697 172464 311732 187127 109553 272616 148001 507796 200469
15012 -137460 315344 227152 -16106 -45902 423145 169430 96989 130681 215627 151761 -151578
15000 92872 248920 229672 181678 235213 44809 363624 236767 286017 249519 57386 195312
14989 195312 410427 343465 60864 -94150 113730 -63753 311126 143147 193155 189682 467740
14978 467740 513736 63567 284876 451119 192568 553729 216392 146555 148195 244417 506551
14967 506551 202419 196414 64923 284785 413675 314323 25265 243285 61665 351013 230907
14956 230907 241475 239002 97111 90124 -111064 391319 363776 238582 418651 452628 352499
14945C52499q9565Q1692j68451K1329l8474J63131P5169o4080k1027J23097j41030
14934B94290J6166J67154j32406A47233E5119J73617r59K2162K30089B11899q8911
14923A22988C0488K52064M6430F4530N13150g7022C59831j28929o8817L23147
14913D85232H0243L58091j09040R0067I0453L51391A95539L08843k10322M8065
14903C42125r1204N5308J34267J0598B7788L52112j8548G8616e469A61339p351
14892A53988K42671K31750l9936p5198k07133o48Q7432A24349L67578n0202l0995
14881D10730M1390j47977K48109k3602A70813K94721j6562j52716P253L61427
14871F64936B71209Q1833A37541J082K15621k6238K74113j04089l1274K5936H0228
$$ plain form
14945 352499 262934 344626 176175 197504 159030 322161 397330 333250 312223 435320 294290
14934 294290 310456 477610 345204 147233 55119 228736 227777 249939 480028 211899 122988
14923 122988 30488 282552 328982 64530 577680 -77022 359831 230902 162085 485232
14913 485232 80243 438334 329294 419361 90453 441844 195539 504382 294060 342125
14903 342125 250921 306229 440496 451094 27788 379900 361352 78616 -5469 161339 153988
14892 153988 396659 628409 588473 513275 306142 305494 392926 124349 491927 441725 410730
14881 410730 452120 304143 552252 528650 170813 465534 448972 296256 303509 664936
14871 664936 271209 353042 137541 138623 354244 328006 602119 498030 466756 492692 80228
14859G44828k83585J78163m4563j59848A29190Q2703J54482L06713C06297L3072
14849C39369P9860n1916A52238J73678r1010L73867n4150J51801C08184n5466
14839B52718J34098P1616B11357L11836j24820o1654N13825A00641K56138M14892
14829G71671A67470N56687B59525K11639k19762K55082r9028A26327P96289H3199
14818E90011j37435K63894m613j27161l4109B14988L96688j55068K39806k02711
14808D93703j93815L86520l38068M68824C93827K57167K32641l66539B29240O57028
14798H86268k69373j63555L08572C55635K17845L8537k95410l7518N80110l51410
14788E07789K07785k55206K44589l210j81649j04012j11895j41291N66999C57952
$$ plain form
14859 744828 461243 639406 594843 434995 129190 211893 366375 673088 306297 339369
14849 339369 419229 367313 152238 325916 234906 608773 554623 706424 308184 252718
14839 252718 386816 458432 211357 523193 398373 336719 850544 100641 356779 771671
14829 771671 167470 724157 259525 471164 251402 506484 407456 126327 922616 83199
14818 590011 452576 716470 711857 584696 550587 214988 611676 456608 696414 493703
14808 493703 299888 686408 348340 817164 393827 650994 883635 517096 229240 886268
14798 886268 616895 453340 761912 355635 573480 612017 316607 279089 859199 507789
14788 507789 715574 460368 704957 701747 520098 416086 304191 162900 729899 357952
14777G68363p0192A72460M69916j93556K25299J99088C06375R6716L62230k67167
14767D98154L43483l53843K30630q7759j69672L16410k10920K4973p5714q8169
14757D27573K92065q721j16688q8272p0792J85716L47681k31555j33915J07850
14747G10942J06462k12830J59985P6778r9217j34737J70658l17385Q8029K32373
14737G81058J42536j78543J60051j25842R983L5822k1023m85l10566J60299K77067
14726I30357k40124K16169J22485E05834J57627O4424J36395j0100K59996l97581
14716G16595L07245j17162N781j73242K33316O5852k76934Q8604J40181n6207
14706I34029J55389l15271L68055n24135K64345r2964J87992L3521k90627J00470
$$ plain form
14777 768363 698171 172460 642376 448820 674119 873207 306375 403091 765321 498154
14767 498154 841637 487794 718424 630665 460993 777403 566483 591456 515742 427573
14757 427573 719638 710917 594229 505957 435165 620881 968562 737007 603092 710942
14747 710942 817404 604574 764559 841337 742120 607383 778041 460656 548685 781058
14737 781058 923594 745051 905102 779260 789243 825065 804042 803557 492991 653290 930357
14726 930357 690233 906402 1028887 505834 663461 727885 864280 854180 1114176 716595
14716 716595 1023840 906678 912459 739217 972533 1038385 761451 850055 990236 934029
14706 934029 1089418 774147 1142202 618067 882412 789448 977440 1010961 720334 820804
14696H20804R4670k17298J19520j3802K08127k18862O9418L13954m29921K65212
14686A011822r1621m1370J65471R3521K69431m87644j62179K44656k00088K64185
14676A066184R7515j07446l19552M1354J7258M92081l60077J2391K9430J23866
14666A093004k75449M1701M31957k97283j9465J28978j34040K53488k45242L42005
14656A319654L7213k82724r7501n7036R3546K46980J7668l47619K68247j66864
14646A031564J76016j22891L89363k62488K38423j924j43314j58349K87286j36484
14636A297202j69998j49478O00662l80890L1128K885K70363m29075M13308k97211
14626A188896P1051N8315L11878l58016J98743j10500L9144O7031m7147J53114
$$ plain form
14696 820804 915474 698176 817696 803894 1012021 793159 862577 1176531 746610 1011822
14686 1011822 920201 878831 1044302 1137823 1407254 919610 757431 1002087 801999 1066184
14676 1066184 1163699 1056253 736701 778055 795313 1287394 927317 939708 969138 1093004
14666 1093004 817555 859256 1291213 993930 974465 1103443 969403 1222891 977649 1319654
14656 1319654 1356867 1074143 976642 919606 1013152 1260132 1277800 930181 1198428 1031564
14646 1031564 1207580 1084689 1474052 1211564 1449987 1448063 1304749 1146400 1433686 1297202
14636 1297202 1127204 977726 1578388 1197498 1228626 1231511 1501874 1072799 1486107 1188896
14626 1188896 1259947 1318262 1630140 1272124 1470867 1360367 1399511 1466542 1419395 1572509
14616A572509l08144K03446m25026L47652n0030l948K40124P3609m6861m7881
14606A555450R7784K39373n72507L33701J00783k44866K77170l56368K05230J53135
14596A788885n9868L00223m69508M57837k73652q6584K3886K27713L8057k12903
14586A734086j5277Q0343K26911j91072j5929L26974m64016J80602k69804K74638
14576A867456P0738L94452M2108l61107J39585K9485m0481p3896M10749p7121
14566B401968k14693J12635O5069L65369l99431j20256K89927K71573j39004N31042
14556C164199K91015K5793q0128K55475M83390O57250J335625J611310L715771
14547A1459700P527069J4960925Q161095B0973479H883210k571547N46600k219890
$$ plain form
14616 1572509 1264365 1467811 1042785 1390437 1340407 1336459 1576583 1650192 1603331 1555450
14606 1555450 1653234 1892607 1320100 1653801 1754584 1509718 1786888 1430520 1635750 1788885
14596 1788885 1729017 2029240 1559732 2017569 1743917 1657333 1681219 1908932 1946989 1734086
14586 1734086 1718809 1799152 2026063 1834991 1819062 2146036 1682020 1862622 1592818 1867456
14576 1867456 1938194 2332646 2374754 2013647 2153232 2182717 2142236 2068340 2479089 2401968
14566 2401968 2187275 2299910 2364979 2730348 2330917 2210661 2500588 2772161 2633157 3164199
14556 3164199 3455214 3481007 3400879 3656354 4139744 4796994 6132619 7743929 11459700
14547 11459700 18986769 33947694 42108789 20973479 8883210 6311663 6858263 4638373
14539D638373k017561k55657l6643k74012M6813J67450M0615k04968k54542Q7272
14529A937140K80645k0088Q8871j41822L62038o7376R9539j33192M5993o802o2612
14518B382334J40553J50606j96263J81718j09283N9611j57762K55504J63200M0308
14508B910526k94752J04014k51019L65958J39234P2550j22632K93802p4471j63476
14498B979734K58341j67098N6948K12588j00241L6926K09066q0764K04804j91787
14488C418517L91765M769l71680k20185O66281j27838J59846j90458q0975R9144
14478C749186O39891k41039r6891P7596l35568M27067J6099L64439o09971K14287
14468D205096n9855L57995L0024J18514j79900K68050r0552O36057j97125n29342
$$ plain form
14539 4638373 2620812 2365155 2328512 2054500 2101313 2268763 2309378 2104410 1849868 1937140
14529 1937140 2217785 2197697 2286568 2144746 2506784 2439408 2538947 2405755 2451748 2444946 2382334
14518 2382334 2522887 2673493 2477230 2658948 2549665 2609276 2451514 2707018 2870218 2910526
14508 2910526 2615774 2719788 2468769 2834727 2973961 3046511 2923879 3217681 3143210 2979734
14498 2979734 3238075 3070977 3127925 3340513 3240272 3277198 3486264 3405500 3610304 3418517
14488 3418517 3810282 3815051 3443371 3223186 3889467 3761629 3921475 3731017 3650042 3749186
14478 3749186 4389077 4148038 4051147 4128743 3793175 4220242 4236341 4600780 3990809 4205096
14468 4205096 4145241 4503236 4533260 4651774 4471874 4739924 4649372 5285429 5088304 4558962
14458D558962L87016K36618N6514j25699K49007j03358J05655j08465J44062L4953
14448E435265j05811j12860R1400O32399j32136J77503m68175N48972m04386L95169
14438F057340j5030L24130L18771k19074P9825J60550O71n0458K43158M2787K50703
14427G193373m88866N13888L8611J44180L1475j26308O26905J8152J46477J94651
14417H292538L16637k73766q8599J02409K04463n913Q83908m30765k08083N22769
14407I315598N5838J58207P0715M5026M29871k4459L72498L21816k11571J54361
14397A0687900M0447L20321P1786K7027J61335M27213K93067L52836j78339J70684
14387A2374277O18180J38844q0738J84117L80916J56132N05616K22227J02239
$$ plain form
14458 4558962 4945978 5182596 5239110 5113411 5362418 5259060 5364715 5256250 5400312 5435265
14448 5435265 5329454 5216594 5307994 5940393 5808257 5985760 5517585 6066557 5662171 6057340
14438 6057340 6042310 6366440 6685211 6466137 6545962 6706512 6707183 6656725 6899883 6942670 7193373
14427 7193373 6704507 7218395 7257006 7401186 7432661 7306353 7933258 7951410 8097887 8292538
14417 8292538 8609175 8335409 8246810 8349219 8553682 8547769 9431677 9000912 8792829 9315598
14407 9315598 9371436 9529643 9600358 9645384 10075255 10050796 10423294 10745110 10533539 10687900
14397 10687900 10728347 11048668 11120454 11147481 11308816 11736029 12029096 12381932 12203593 12374277
14387 12374277 12992457 13131301 13050563 13234680 13615596 13771728 14277344 14499571 14601810
14378A4601810L03226O14469q4520L11927J90138L72780O80713n4806M12728O24804
14368A7973269K14173L79227M68890J29527M41186K43203N67759P45606j30344
14359B1032496J057835L69251L74667Q01588N00949M28949L70911Q12134N54136
14350B6302916O52391N47997P51356R65919L88779O48307Q27804R11172Q63788
14341C2860429R18437O10278R31971R73153J245305R67926J082679J241595J013210
14332D1844983J414464J045292J223567J842487J284955J297479J911782J789320
14324E3654329J356706J799420J894614K318869J942765K412875K424688K275047
14316G0079313K458051K478239L244623K850796L162128L569609L232041L979273
$$ plain form
14378 14601810 14905036 15519505 15434985 15746912 15937050 16309830 16990543 16935737 17348465 17973269
14368 17973269 18187442 18566669 19035559 19165086 19606272 19849475 20417234 21162840 21032496
14359 21032496 22090331 22459582 22834249 23635837 24136786 24565735 24936646 25748780 26302916
14350 26302916 26955307 27503304 28254660 29220579 29609358 30257665 31085469 31996641 32860429
14341 32860429 33778866 34389144 35321115 36294268 37539573 38507499 39590178 40831773 41844983
14332 41844983 43259447 44304739 45528306 47370793 48655748 49953227 51865009 53654329
14324 53654329 55011035 56810455 58705069 61023938 62966703 65379578 67804266 70079313
14316 70079313 72537364 75015603 78260226 81111022 84273150 87842759 91074800 95054073
14308I5054073M157925L788519M707279M324805M843719N572809N399226O029614
14300A33877969O323989O283579O732142P570634P673306Q607635Q751393R039308
14292A94859955R658548J0023054J1058391J1040823J1706730J2215981J2500814
14285B73064296J2925301J3620381J3471306J3754018J4026840J3352204J3414014
14278C67628360J2966712J2165650J1244634J0639104Q386621O410206L399030
14271D32840317K142532J092112K818670l33727k604950n147132p202539q685414
14263D14919869j0573355j2139990j3059091j4014178j4141392j4581070j4483984
14256C21926809j4122297j4251683j3871299j3464474j2028076j1328491j1685624
$$ plain form
14308 95054073 99211998 103000517 107707796 112032601 116876320 122449129 127848355 133877969
14300 133877969 140201958 146485537 153217679 160788313 168461619 177069254 185820647 194859955
14292 194859955 204518503 214541557 225599948 236640771 248347501 260563482 273064296
14285 273064296 285989597 299609978 313081284 326835302 340862142 354214346 367628360
14278 367628360 380595072 392760722 404005356 414644460 423031081 429441287 432840317
14271 432840317 434982849 436074961 438893631 438559904 435954954 430807822 423605283 414919869
14263 414919869 404346514 392206524 379147433 365133255 350991863 336410793 321926809
14256 321926809 307804512 293552829 279681530 266217056 254188980 242860489 231174865
14249B31174865j1768537j0602386r990431r734390r037588q084786q170162p512250
14241A56274335p548520o719366n978630o009783n110210n773922n154831m792796
14233A09186277m446674m432542l414770m159675l757393l662000l130235k925139
14225G9257849k806256l163741k623340k364468k200385k327634k081788k280437
14217E9409800k373284j242699k043016j854635p11808k019725j916624j076331
14209D6171678j640821p73628j049846r90449j730223j293358j037571j049423
14201C6606359j002822j49220j087064j391775r71883o35643j050006l66906p13212
14192B9237828o80143o77282j013605n32595k65563j145946m22464m39891l83407
$$ plain form
14249 231174865 219406328 208803942 198813511 189079121 180041533 171956747 163786585 156274335
14241 156274335 148725815 142006449 136027819 130018036 124907826 119133904 113979073 109186277
14233 109186277 104739603 100307061 96892291 92732616 88975223 85313223 82182988 79257849
14225 79257849 76451593 73287852 70664512 68300044 66099659 63772025 61690237 59409800
14217 59409800 57036516 55793817 53750801 51896166 51184358 49164633 47248009 46171678
14209 46171678 44530857 43757229 42707383 41716934 39986711 38693353 37655782 36606359
14201 36606359 35603537 35454317 34367253 32975478 32003595 31367952 30317946 29951040 29237828
14192 29237828 28557685 27880403 26866798 26334203 26068640 24922694 24500230 24060339 23676932
14183B3676932n86137o23110o53021o35439J61209o06890n32713p39590K59283
14174A9720524p25518j6507m87365o97899o4884m41080j63287m22953o89251j34197
14164A5877583l75953j54361k76748j76232l5576n69647j35127k87030p5802o63143
14154A3127964j28569Q8122l08185l90746k7193k71741m16200M7854j00828n17492
14144A1102986J76291j63189j17280l12532j4106k26803k12123q211n62916P4039
14134I736156n03512K7827n1451M1226j52797l0562k66040k91724o0955j40624
14124H307544o3154j40764J80388m61783r6001k98503J75406J77304m51536J29269
14114G458170j86326k34937N0944k51855O5894P6708k38301k3560j31501N6464
$$ plain form
14183 23676932 23090795 22467685 21814664 21179225 21340434 20733544 20200831 19461241 19720524
14174 19720524 18995006 18978499 18491134 17793235 17728351 17287271 17123984 16701031 16011780 15877583
14164 15877583 15501630 15347269 15070521 14894289 14858713 14289066 14153939 13866909 13791107 13127964
14154 13127964 12999395 13087517 12779332 12388586 12361393 12089652 11673452 11721306 11620478 11102986
14144 11102986 11279277 11116088 10998808 10686276 10672170 10445367 10233244 10225033 9662117 9736156
14134 9736156 9232644 9260471 9209020 9250246 9097449 9066887 8800847 8509123 8448168 8307544
14124 8307544 8244390 8103626 8284014 7822231 7726230 7427727 7603133 7780437 7328901 7458170
14114 7458170 7271844 7036907 7087851 6835996 6901890 6978598 6740297 6716737 6585236 6641700
14104F641700m50619J54103p3291k05716m02883L90521k01065J00162j92480j45500
14094E614932k4756k41754K02041Q5113j12231r2256J74071m11098J03062L87469
14084E684593o26835n0259k79294K99517j5378k55722J8789l32037J00056P9080
14074D622510L6920J50451k76473l07889J75076M5734j27563K19009m41166Q0169
14064D176778j09895J8628P736l41884K77168o0502J36880k36379J23468k09617
14054C782381j32649J64774k0539l50173L2171K17178J70710n26223J77732M339
14044C519701j03214o7290J58871m66681K56582K5681j33883j90494L47524j58142
14034C188655k74020J7441L50656l35875K60590R474k09276k17811J31180L8809
$$ plain form
14104 6641700 6191081 6345184 6271893 6066177 5663294 6053815 5852750 5952912 5760432 5614932
14094 5614932 5590176 5348422 5550463 5635576 5523345 5431089 5605160 5194062 5297124 5684593
14084 5684593 5057758 5007499 4728205 5027722 5012344 4756622 4775411 4443374 4543430 4622510
14074 4622510 4659430 4809881 4533408 4225519 4400595 4446329 4318766 4537775 4096609 4176778
14064 4176778 4066883 4085511 4093247 3751363 4028531 3968029 4104909 3868530 3991998 3782381
14054 3782381 3649732 3814506 3793967 3443794 3475965 3693143 3863853 3337630 3515362 3519701
14044 3519701 3416487 3349197 3508068 3041387 3297969 3323650 3189767 2999273 3346797 3188655
14034 3188655 2914635 2932076 3282732 2946857 3207447 3216921 3007645 2789834 2921014 2959823
14024B959823K06134l62101k79690K418R1156j70677K83534q6535J34552K89105
14014C067719o48335L90247l84267J09057r1540J8695j24886p5325L56389q0354
14004B537400k61096J19395l71609L38979j68327j77740m0251J12014Q988J12236
13994B209989o4832J08194K09513l5748M67561J383735K402394O324242J4974681
13985B7979729J5623744j6179800A3402931n183623k260418j143767o61534m27008
13977C726581m22806J92621l70775l34233P6087K15039j87866m82688K80774p1370
13967B621364j30723N3511j87790p72181Q18238r5324k16383L47217L6152l60838
13957B113243R9009n78554J31875L62294J24187j04792m78009K76906p4255J6452
$$ plain form
14024 2959823 3165957 2803856 2524166 2526584 2617740 2447063 2730597 2644062 2778614 3067719
14014 3067719 2419384 2809631 2425364 2534421 2442881 2461576 2336690 2261365 2617754 2537400
14004 2537400 2276304 2395699 2024090 2363069 2194742 2017002 1976751 2088765 2097753 2209989
13994 2209989 2145157 2253351 2462864 2427116 2894677 4278412 6680806 13005048 27979729
13985 27979729 43603473 27423673 13402931 8219308 5958890 4815123 4153589 3726581
13977 3726581 3303775 3496396 3125621 2791388 2867475 3082514 2894648 2411960 2692734 2621364
13967 2621364 2490641 2544152 2356362 1584181 2402419 2307095 2090712 2437929 2474081 2113243
13957 2113243 2212252 1633698 1765573 2127867 2252054 2147262 1669253 1946159 1871904 1888356
13947A888356M6635k80716J43492M4658j45682J30383M40825n05882R7869j08041
13937A751897m2532M5716m3180j49788L2223P3944j64694J56908j98188j15705
13927A346601L58114J11478j00005q4155N0761K18037m14700L5675m56958O26612
13917A691460l43228M1364J89749k23564J61137J5973R233J19572l90810K15235
13907A486121R0838k86700J39383n0958r5618J97986j67521K5505k25596M27637
13897A541077k41717k34825L18725j12892K70259O4514j56905k26987k5472J41
13887A195918J09328R6660j99277k38565K28003m02505K70715L88438k20934k29338
13877I98443r0297M60059j16953J8403j59749o1508J97633q7161j29786J79451
$$ plain form
13947 1888356 1934991 1654275 1797767 1842425 1696743 1827126 2267951 1762069 1859938 1751897
13937 1751897 1709365 1755081 1711901 1562113 1594336 1668280 1503586 1660494 1462306 1346601
13927 1346601 1704715 1816193 1716188 1632033 1682794 1900831 1486131 1521806 1064848 1691460
13917 1691460 1348232 1389596 1579345 1355781 1516918 1532891 1542124 1661696 1270886 1486121
13907 1486121 1576959 1290259 1429642 1378684 1283066 1481052 1313531 1339036 1113440 1541077
13897 1541077 1299360 1064535 1383260 1270368 1540627 1605141 1448236 1221249 1195777 1195918
13887 1195918 1305246 1401906 1202629 964064 1192067 789562 1060277 1448715 1227781 998443
13877 998443 908146 1368205 1251252 1269655 1109906 1048398 1246031 1158870 1029084 1208535
13867A208535m6338J26599p3727m42711M16128j58381K14410k93679M37718k75428
13857A113126n7608r7722J77727k85139K75557r2751r8468N6215k19429j3423
13847G58085j511P4226K69379q5720J97637l93915N5423m4255K24631k77312M07496
13836A184164j97888J62781j94875l8952J4849L5080k34907J0229K8806L00776
13826A070063l15136L00805k18430M3451k7029k7441p331M3446J28496j16956
13816H73938L3260j13603K49802k45658j44008J71283J74843l14378P653K74438
13806I67570m5165Q687l07354L35497l17539K11640q3352K44671l65502K38042
13796H87195o5037M24783D62190Q3272K8616M8767K35137j33636j22264j3424
$$ plain form
13867 1208535 1162197 1288796 1215069 772358 1188486 1030105 1244515 950836 1388554 1113126
13857 1113126 1055518 957796 1135523 850384 1125941 1033190 934722 990937 771508 758085
13847 758085 756574 830800 1100179 1014459 1212096 818181 873604 829349 1053980 776668 1184164
13836 1184164 986276 1149057 954182 915230 930079 965159 730252 740481 769287 1070063
13826 1070063 754927 1055732 837302 880753 853724 826283 818952 862398 990894 873938
13816 873938 907198 793595 1043397 797739 653731 825014 999857 685479 693132 967570
13806 967570 922405 931092 623738 959235 641696 853336 769984 1014655 649153 887195
13796 887195 822158 1246941 462190 545462 574078 622845 857982 724346 602082 588658
13786E88658L11046j13452j12206K88706O0833j9241j94246l09002j6364J20588
13776F05320q8515L28481k05640R9082q5465j63993J26754J21712m6282l5886
13766F55568J1758j01677M24828m14143p6442J68787j92866J03918K9450o884
13756F02297K78529m03260l1587L82830n5488A56804K14638J38562Q7840P8886
13746F76730j10011q7215J28233J35427k45757n8772B14452M79303K6030j34823
13736E84962L4118J02638J02390o7287q255j56008k62766n3032L04236N4818J0598
13725F46412L906k07750J30211m7798L64758l61162P820q2154L14947k73199J45099
13714F41090Q1915k40793J16830A45193N20741j73048K64075k94513R8040o9157
$$ plain form
13786 588658 899704 786252 674046 962752 1023585 1004344 810098 501096 484732 605320
13776 605320 516805 845286 639646 738728 653263 489270 616024 737736 691454 655568
13766 655568 667326 565649 990477 576334 499892 668679 475813 579731 609181 602297
13756 602297 880826 477566 445979 828809 773321 156804 371442 510004 597844 676730
13746 676730 566719 479504 607737 743164 497407 438635 214452 693755 719785 584962
13736 584962 619080 721718 824108 756821 748566 592558 329792 276760 580996 635814 646412
13725 646412 650318 442568 572779 524981 889739 528577 536397 454243 769190 495991 641090
13714 641090 723005 482212 599042 145193 665934 492886 756961 462448 560488 491331
13704D91331J93699k49590K47051j47251l0268K0325L98060D41540j57818L49791
13694F33513j13748J8693k13080j12926K09540Q1687M0613N4265j76516K51709
13684F73750j42403J08868p9420k05102M79479k64273Q3921p9016j28379j81986
13674B65439M67129B75250J65687Q9872O2011k60460r757L45340j10937J62263
13664G19269k40021j63277K10165j15471k626K18361J92622C90631K26647B02565
13653C63400j78336O8226B7005K31433I3811M94127B34376K99507j30153j34145
13643B69585M60994B75521J14034p8891J45234j51633j5638J99258M042G3725
13632C64121J02649J15964j91549o502j82917M99836B95477L55222j8865k95386
$$ plain form
13704 491331 685030 435440 682491 535240 504972 525297 923357 441540 283722 633513
13694 633513 519765 538458 325378 212452 421992 503679 544292 598557 422041 673750
13684 673750 531347 640215 560795 355693 835172 570899 654820 575804 447425 265439
13674 265439 732568 275250 440937 530809 592820 332360 322603 667943 557006 719269
13664 719269 479248 315971 526136 410665 408039 626400 819022 390631 617278 202565
13653 363400 185064 253290 27005 258438 93811 587938 234376 533883 403730 269585
13643 269585 730579 275521 389555 310664 455898 304265 288627 487885 491927 73725
13632 364121 466770 582734 391185 384683 201766 701602 295477 650699 631834 336448
13622C36448A12095L04471j65319J8216j10129k4477N00787B62417K15347P2956
13612E50720J00701j54824B38001K98285K0770M5830j59008a20188A92570K08372
13602D00942j4011O4423k09572P18J09385p4562J09919L28581H4145J73682A19218
13590C18234L80314A93745K33325Q8402j72223j00583O8495g0585F16175B49954
13579C28838K70860B91327O5898O2794I7327J844N7919J36967K0303O4490O749
13568C85599q9496J71910p3255J74217j05621j23800A37498J97841O0344E7793
13557F06751B57901J5975K05620j08236J03972j53035K12509o499L3634K78958
13547H40799A90207N19263A79911K92691A09604J70034k2406J37136K31230B9589
$$ plain form
13622 336448 112095 416566 251247 269463 159334 134857 635644 262417 477764 550720
13612 550720 651421 496597 238001 536286 557056 602886 443878 -120188 192570 400942
13602 400942 386931 451354 241782 242500 351885 277323 387242 715823 84145 257827 119218
13590 318234 698548 193745 427070 515472 343249 242666 311161 -70585 616175 249954
13579 328838 599698 291327 357225 420019 97327 99171 157090 294057 314360 378850 385599
13568 385599 296103 468013 394758 568975 463354 339554 137498 335339 395683 57793
13557 606751 257901 273876 479496 371260 475232 322197 534706 528207 561841 840799
13547 840799 190207 709470 179911 472602 109604 279638 257232 394368 625598 29589
13536I9854J87835J05474j65774Q942R6340Q2807n4396K44650k15553r8760M12910
13525G04329l20809K0243A14705Q9870K78898a94130a8781A66482K20371I5123
13514b72112D78518j71075N2840h9997B02847P8421o2747Q5894K35429j64942
13504C74902O3397j45509A29768L08847b00814L4328A00454N5577L54603j53817
13494C56817A59614R4183K96879j78027l3152K15260G9287K4267J09950L57912
13484E71416r8771k27117J18334a1301B48375K12111j38609Q4001l3396o4438
13474C08044K71117B56637l6735m2114m2065R4585K23925A96255L79487D1065
13463G4237K6942K7981K36181j5926j9452A53066C3164R3791D2135K21174J16892
$$ plain form
13536 99854 287689 393163 227389 236331 332671 415478 361082 605732 390179 291419 704329
13525 704329 383520 403763 114705 204575 483473 -194130 -18781 166482 386853 95123
13514 -272112 478518 307443 360283 -89997 202847 281268 218521 304415 539844 374902
13504 374902 438299 292790 129768 438615 -200814 -166486 100454 156031 510634 356817
13494 356817 159614 253797 550676 372649 339497 554757 79287 103554 213504 571416
13484 571416 472645 245528 363862 -11301 248375 460486 321877 405878 372482 308044
13474 308044 579161 256637 219902 177788 135723 230308 454233 196255 575742 41065
13463 74237 101179 129160 365341 349415 329963 153066 33164 126955 42135 263309 380201
13452C80201K31310A42981L80240k51395n2973B0293L94135n306A60332K62404
13442D22736Q090p6442m2047l8861j4254A21215K1000A5228J6880K34461E8915
13430C09873Q5520H7784G465a49615A94268K677a40083D37935A14922M11003q6348
13419D39577A80718N0652N4313N8991j52409e9879C91152j61021J02415A28351
13408C07191A43563j9296a13154A47375g6391C8189b5080C12167n0432K8453J32091
13397D22279b9811D92606k3065F8847f1872A869c5005A00612J21382O1373a13
13385A11155n770c3457B35878E9827J2266f475C27774H7296J6457J23447Q7943
13374C15143e2906A65044Q1699l8821m644p3258E4436K03820o5572e8536A56304
$$ plain form
13452 380201 611511 142981 523221 271826 218853 20293 414428 409122 160332 422736
13442 422736 430826 354384 312337 273476 259222 121215 142215 15228 32108 266569 58915
13430 309873 395393 87784 7465 -149615 194268 196945 -140083 437935 114922 525925 439577
13419 439577 180718 231370 285683 344674 192265 -59879 391152 230131 332546 128351
13408 307191 143563 124267 -113154 147375 -76391 38189 -25080 312167 261735 290188 422279
13397 422279 -29811 492606 469541 68847 -61872 1869 -35005 100612 221994 283367 -113
13385 111155 105385 -33457 235878 59827 72093 -6475 327774 87296 103753 227200 315143
13374 315143 -52906 165044 246743 207922 203278 130020 54436 258256 192684 -58536 156304
13362A17421M5859M3281A02876J72708N9712a8343A32718b2739B58817B5841K15053
13351B40894k9839L7470j4138a6577B88333G0257M66475A04265M23563B51074
13340D91440P7760B7549K26442L3266J26527d5440F6318k5771c0591C00597P9293
13329C79890n3206b670m7982B04887d6173B14831j1787I7278K17898Q7129A41194
13317B34063k8088p3171J47233E6379K37934a77614k6420B81676Q396j27590L72018
13306E34500A45287R6610P3062n8787q3576J43095i8401A06205L04354a9939B40712
13294F9290J08452K04155A01318K78135P657d9038E27064I3952P3901a51178B79635
13282A16263K36828a44596D50108E1183A0659N1250K26700b9240j3897A05476
$$ plain form
13362 117421 163280 206561 102876 275584 335296 -18343 132718 -22739 258817 25841 240894
13351 240894 211055 248525 234387 -16577 288333 70257 536732 104265 527828 251074
13340 491440 569200 27549 253991 287257 413784 -45440 66318 40547 -30591 300597 379890
13329 379890 326684 -2670 -50652 204887 -46173 214831 203044 97278 315176 402305 141194
13317 234063 205975 132804 280037 56379 294313 -177614 -204034 281676 290072 162482 534500
13306 534500 145287 241897 314959 256172 172596 315691 -98401 106205 410559 -19939 240712
13294 69290 177742 381897 101318 379453 387110 -49038 527064 93952 167853 -151178 279635
13282 116263 353091 -144596 450108 51183 10659 61909 288609 -29240 -43137 105476
13271a35355B63374j20975g4567D2601Q6624j8751J71283b8114M123A84100H0886
13259A90376D2502K28002k2512j17327n9176L56597j49091J32883A62643a38036
13248i6952A71596c2024A46933m8486J44607p1753c1496p7177C47084A07337b15871
13236B5137L2155L23272A2240L38416C7154e9452l6479M0222C06872j03536J15629
13225C18965B5280f0040b1547B02260O6748j07933J03247r4199a74224A39434
13214B12236J90150a34004A72066G8421a00058B84193a70004A47284C3708J97646
13204B31354D8098Q801M6959K35646a56082a5548g083B46520E9113K0278a15399
13192b1470D08585a952F843K69982H3773l1214J00512A9211i8409o8084A52548
$$ plain form
13271 -135355 263374 142399 -74567 42601 129225 110474 281757 -28114 -23991 184100 80886
13259 190376 42502 270504 247992 130665 71489 428086 278995 411878 162643 -138036
13248 -96952 171596 -32024 146933 98447 243054 171301 -31496 -108673 347084 107337 -215871
13236 25137 57292 380564 12240 350656 37154 -59452 -95931 -55709 306872 203336 318965
13225 318965 25280 -60040 -21547 202260 269008 161075 264322 170123 -174224 139434
13214 212236 402386 -134004 172066 78421 -100058 284193 -170004 147284 33708 231354
13204 231354 48098 56899 103858 339504 -156082 -15548 -7083 246520 59113 79391 -115399
13192 -21470 408585 -1952 6843 276825 83773 52559 153071 19211 -98409 -166493 152548
13180c3180k36119i0779B2604a99525B23534b6245j26903Q842j11500B82655b17099
13168g9799k92497F6908k2673L0314b70104J24180A88594J34736b19334F6653
13157i2963p6794c2299A12878B4940b15425E2949b4500o6761A94551a4791B74417
13145B6999h8275q2547G0049Q2425i7334C14935E4349b14738B53792j19148i925
13133A54130a13382A19535a09442d3063A13008O3410D2668a1719C78081a8252
13122A41505A69K16867J70397h7433A97852k5859D8907j6967J18087E8178L79643
13111D37821E9770R8270G3394e1566B9375J64427p4174K9326P3375K9721e149
13099B42154J200a2921j04334A05064Q7795b2019H5151J37404k4037l5641E9499
$$ plain form
13180 -33180 -269299 -90779 22604 -199525 223534 -26245 -153148 -144306 -255806 282655 -217099
13168 -79799 -372296 66908 44235 74549 -270104 -145924 188594 323330 -219334 66653
13157 -92963 -169757 -32299 112878 24940 -215425 52949 -24500 -91261 194551 -14791 274417
13145 26999 -88275 -170822 70049 152474 -97334 314935 54349 -214738 253792 134644 -9925
13133 154130 -113382 119535 -109442 -43063 113008 176418 42668 -11719 378081 -18252
13122 141505 169 217036 387433 -87433 197852 171993 48907 31940 150027 58178 437821
13111 437821 59770 158040 73394 -51566 29375 193802 119628 148954 222329 252050 -5149
13099 242154 243354 -12921 -117255 105064 192859 -22019 85151 222555 198518 162877 59499
13087B8124L52295a19672K1444B7941J77783a75014M1083B20090a1911B22600
13076A1983L30193a052m011A80782H5337e2573B67333j10254a51588b3118B73636
13064A31255a06038A57166l616b5380m6625B33229K71749a01790M5370C0166N6123
13053H6289e6273J9111q7983B12a01387A68696K75513A84697c6492B16328A560
13041c44555a54034d06C9511Q1110Q3054G8622j9603J94765b08623B32720j2129
13030B20591G1658k3044J9372a68922B9303b20518b2117j3757C12785B8497M3273
13019G1770R2776f0834k3220A44459Q2414B2777h8653B47404q9640b3671F7790
13007f2715k6383B1143K46774k6342D9620a27619A29911f3503C43181A20464J40721
$$ plain form
13087 28124 380419 -119672 -98228 27941 205724 -175014 -133931 220090 -11911 222600
13076 11983 342176 -1052 -5063 180782 85337 -52573 267333 157079 -151588 -23118 273636
13064 131255 -106038 157166 153550 -25380 -72005 233229 504978 -101790 -56420 30166 86289
13053 86289 -56273 -37162 -125145 212 -101387 168696 444209 184697 -36492 216328 1560
13041 -344555 -154034 -406 39511 120621 203675 78622 59019 253784 -208623 232720 220591
13030 220591 71658 48614 67986 -168922 29303 -220518 -22117 -35874 312785 28497 71770
13019 71770 164546 -60834 -84054 144459 226873 22777 -88653 247404 157764 -23671 67790
13007 -62715 -89098 21143 267917 241575 49620 -127619 129911 -63503 343181 120464 261185
12996B61185r8662J08457P4129d6482A72344a13745G243l94P670d4099G6819J51104
12984B27923H8366c7572C07453a95684b675l25737B51394A01897e8252C83273
12973C15540j20893n8468k0600d36437c1029A32026O6867q6127J39752j23236
12963A29282K28039g96A50920C5845K71965J3078A53010a04353A39850f0353j54017
12952b14370A04120J33478a38090B21975l0142a23767b8203C05418j33491c0748
12941b3163k7652F861P9239a98477R4870K5365A56101j3146i3463F7749a79549
12929H5206e2781j50055A08847n3428i5472M6177B92910N4413i5374b0107k53042
12918b73149B58369I9357b28388g1390I8048a57962M5622D6953h9379J4396N486
$$ plain form
12996 261185 162523 270980 345109 -46482 172344 -113745 7243 6849 14519 -44099 76819 227923
12984 227923 88366 -37572 307453 -195684 -2675 -328412 251394 101897 -58252 383273
12973 315540 194647 136179 115579 -436437 -31029 132026 198893 112766 252518 129282
12963 129282 357321 -796 150920 35845 307810 320888 153010 -104353 139850 -60353 -214370
12952 -214370 104120 237598 -138090 221975 191833 -123767 -28203 305418 171927 -30748
12941 -23163 -50815 6861 86100 -198477 -103607 -78242 156101 142955 -93463 67749 -179549
12929 85206 -52781 -202836 108847 55419 -95472 -49295 292910 347323 -95374 -20107 -273149
12918 -273149 258369 99357 -228388 -71390 98048 -157962 -112340 46953 -89379 -74983 -69497
12907f9497j35246B86937e1869m070j96481E8115k081L37356b70548A60352b5164
12895a96088C42276j03751a40371G3432b46946A52158a31991C68959j8012c696
12884B28851k0161D0613J37124e4602H1149a00831A88369P7502D0906Q9513b71464
12872e6300B13721A6263K4121Q663L9832c27928A10803K0338o679l61i9334I2900
12859D9349A777P599J37025j3548m2079J63226i3053m9378A2104P0039B7934L4430
12847F2364K9034M0630c49983A14762L0470i52j95512H5093C7626K43040a32379
12835B83136E6762M2510a0429j04745A17441J69354b4301o7000A51265O3677b941
12823a04707d2469k4398j5757A08408a4733o6727j94745B00241m120b31211i3149
$$ plain form
12907 -69497 -204743 286937 -51869 -55939 -252420 58115 56034 393390 -270548 160352 -25164
12895 -196088 342276 238525 -140371 73432 -246946 152158 -131991 368959 350947 -3696
12884 228851 208690 40613 177737 -54602 81149 -100831 188369 265871 40906 130419 -271464
12872 -56300 213721 16263 40384 49047 88879 -327928 110803 131141 124462 124101 -99334 92900
12859 49349 1777 9376 146401 132853 90774 254000 -93053 -142431 12104 82143 27934 62364
12847 62364 91398 132028 -349983 114762 145232 -952 -196464 85093 37626 280666 -132379
12835 283136 56762 99272 -10429 -115174 117441 286795 -24301 -91301 151265 214942 -2941
12823 -104707 -42469 -66867 -82624 108408 -14733 -81460 -276205 200241 196121 -231211 -93149
12811a87288R0385k26383A53984b43937C9073b00774B7771P0758a17256H34L64847
12800C65681j38692h1264B33395n0665a67865A8863K8800j4191e1558B49456b94926
12788I5610k8935B443a25891e8649C01124E5724R2961J59864b28939R4881f724
12776A8406c13724f4747B3183a05230B20768H7048J3271g9593B41517k9386a16197
12764a39404a6599J691k46979D21306c74769f0616E6930a23968C14317B2096N9703
12753H1799a4004A12096c02018C51776j51160n2340b2294A47349b84995A64966
12742b10210e6770C80078A50784j35d1482N066D6520J52371H3871i0631f868p4564
12730h1432m5951A52169Q254B0314b8832I8783m1924c65174a11369k104p689C8845
$$ plain form
12811 -187288 -96903 -323286 153984 -243937 39073 -200774 27771 98529 -117256 834 365681
12800 365681 226989 -81264 233395 182730 -167865 18863 47663 33472 -51558 249456 -294926
12788 95610 66675 2443 -125891 -58649 301124 55724 148685 308549 -228939 -134058 -6724
12776 18406 -313724 -64747 23183 -105230 220768 87048 100319 -79593 241517 212131 -116197
12764 -139404 -16599 -14908 -261887 421306 -374769 -60616 56930 -123968 314317 22096 81799
12753 81799 -14004 112096 -302018 351776 200616 148276 -22294 147349 -284995 164966
12742 -210210 -56770 380078 150784 150649 -41482 -36416 46520 198891 83871 -90631 -6868 -81432
12730 -81432 -127383 152169 160423 20314 -28832 98783 56859 -365174 -111369 -113473 -121162 38845
12717d1323A8523K5589A7357C556a73013B38724D9879J10260a42421j2766A01917
12705a24731B23760i6583A76035L7320b6775A1518K84697l416b21288A643P3625
12694G5268K8886f8988A54248d3564k2529q0730E6459L38550J27876a98204J4338
12683a83866A96530A6149J34921a66879I3064a60787a1765C01180H2295d4427
12672B30321e2622F275M0195O8285c88649G0964a74847C46532j16850Q643A12437
12660H9054a63827H4638J87481I9470K73809j52476P1487j45318R9335f0187g531
12648h3014c939D66730A70425c41101D1191c7723F7553E657P0401K51777j455
12637C26380I133L92007A25246C7488L96373B9156J25121J31982k0624J23761
$$ plain form
12717 -41323 18523 44112 17357 3556 -173013 238724 49879 160139 -142421 -155187 101917
12705 -124731 223760 -96583 176035 213355 -26775 11518 296215 292799 -221288 1643 75268
12694 75268 104154 -68988 154248 -43564 -66093 -146823 56459 395009 522885 -198204 -183866
12683 -183866 196530 16149 151070 -166879 93064 -160787 -11765 301180 82295 -44427
12672 230321 -52622 6275 46470 114755 -388649 70964 -174847 346532 229682 238325 112437
12660 89054 -163827 84638 272119 99470 373279 220803 292290 146972 246307 -60187 -7531
12648 -83014 -3939 466730 170425 -341101 41191 -37723 67553 5657 76058 327835 326380
12637 326380 9133 401140 125246 37488 433861 29156 154277 286259 265635 389396
12627C89396p7107a44190E9371a77923A16349m8728J60138A2292K67368p5557
12617B04103c30378C61850c69983I1765m423J14362a77259C5859J22608n275C0778
12605a18791A50588a96029E1398b06624A45321K36344G3076K5491l4108a19666
12594A56891J96735r3095b32988B12572J85735A68860m1174b71176A1212N8872
12584G0084a25877A26560l0677N7121d13519F5214f8j10354G1168L7527m1748
12573F6947g3197A53262c47809R5210B18348J03754C7899a60700E6074h8451p0705
12562a59156B09143e0734F9968K05377b89949A12001K21893j25009d33389n8028
12552d91417e7575j15453B99498a2504A0043e5624p8205n3303E7097P0767k2112
$$ plain form
12627 389396 312289 -144190 59371 -177923 116349 67621 227759 12292 279660 204103
12617 204103 -330378 361850 -369983 91765 87342 201704 -177259 35859 158467 153192 30778
12605 -118791 150588 -196029 51398 -206624 145321 381665 73076 98567 64459 -119666
12594 156891 353626 260531 -232988 212572 398307 168860 127686 -271176 11212 70084
12584 70084 -125877 126560 95883 153004 -413519 65214 -68 -110422 71168 108695 66947
12573 66947 -73197 153262 -347809 -252599 218348 322102 37899 -160700 56074 -88451 -159156
12562 -159156 209143 -50734 69968 275345 -289949 112001 333894 208885 -433389 -491417
12552 -491417 -57575 -173028 299498 -12504 10043 -55624 -133829 -187132 57097 127864 105752
12541A05752c9241l3806n3768d6752A74848L9020a5772j82044E6281g2774b0294
12529A9118K2515b12077E6464J17652q5201J58141e7119I2486a07532J4268C53311
12517A2659K36429n9181a9098B78446m1837h0082C46511A13117b29297d3401A13259
12505A83873g9885L5463E2968N9247g4148E9705J09321k1126E9329L9278b0470
12493C7431d5877A82230H3816a03917h959C59822b3897j76113A88537f6775B11229
12481B3350c51750A02884d2132A24425b33124B2018e5308C1395a33537K2842c8510
12469d6354I5903b44582h0092j01134F6189c13258G3086a45758l367n2360J00719
12458a00766A76830E2140c1041C59701g5616H5745i139l27850A16142O3188a52191
$$ plain form
12541 105752 -39241 -73047 -126815 -46752 174848 213868 -15772 -197816 56281 -72774 -20294
12529 19118 41633 -212077 56464 174116 88915 247056 -57119 92486 -107532 -93264 353311
12517 12659 249088 189907 -19098 278446 236609 -80082 346511 113117 -229297 -43401 113259
12505 183873 -79885 -44422 52968 112215 -74148 59705 169026 147900 59329 98607 -20470
12493 37431 -45877 182230 83816 -103917 -8959 359822 -23897 -200010 188537 -66775 211229
12481 23350 -351750 102884 -42132 124425 -233124 22018 -55308 31395 -133537 -110695 -38510
12469 -46354 95903 -244582 -80092 -181226 66189 -313258 73086 -145758 -149125 -201485 -100766
12458 -100766 176830 52140 -31041 359701 -75616 85745 -9139 -336989 116142 179330 -152191
12446a31540A72456a86919b2110o3749k31170a34819h931C01090j47897N5713
12436B08906b9169o7231p572D7644N9155a6535I4968a80879A48131l321c56513
12424a17898d8854j09167E5773R1438i1397F3497b12713A10000g0610A3148f9194
12412F1597b61811A78693b66766f223j94898g7130H9600k3954J24976b45971A40691
12400a27907B20092a23752j6266A11686J1622E3719Q4476h1985o845o5664N3228
12389a01266c2753A68173O674J13169A07533k861c94266J46550d5874m1469j69404
12378b56747B87698A20135M9131K16714C7263b8947C1304M8790k2335b08310n7437
12367b65747C4632g4155D12722D821J43269i652A75086e3952a3102A6530a00643
$$ plain form
12446 -131540 172456 -186919 -22110 -85859 -317029 -134819 -8931 301090 153193 208906
12436 208906 -29169 -96400 -103972 47644 106799 -16535 94968 -180879 148131 144810 -356513
12424 -117898 -48854 -158021 55773 147211 -91397 63497 -212713 110000 -70610 13148 -69194
12412 61597 -261811 178693 -266766 -6223 -201121 -77130 89600 65646 190622 -245971 140691
12400 -127907 220092 -123752 -140018 111686 123308 53719 138195 -81985 -88830 -154494 -101266
12389 -101266 -32753 168173 174847 288016 107533 104672 -394266 -247716 -45874 -87343 -256747
12378 -256747 287698 120135 169266 385980 37263 -28947 31304 80094 57759 -208310 -265747
12367 -265747 34632 -74155 412722 4821 148090 -9652 175086 -53952 -13102 16530 -100643
12355D0306J04834a54469C78216A13261a28805G2918J9606a04630A21132f259
12344b2111A14202c19744A08373J15942C7674c1861k06656B5970h0197D68621
12333A601J17989k8101K9461a87226N0476K8635K4070B18975b47133l7790G2148
12321A9500P7771e1380B09084b53253a03914j53065r7045a68038n0470A95863
12310c78518A59602l1667a52277m6596J097P2079j22170a15220M0063A01842a83973
12298A32948d7335k4873j27052A89777k1798b70189C88107c4238o3953A97209
12287b1652A68758a00308d1002j37255B87465a17858i794k06145A92214B3665
12276b88893C570J31245R8261A09342l4229d4301D70327k31773b88797A2021a87972
$$ plain form
12355 40306 145140 -154469 378216 113261 -128805 72918 92524 -104630 121132 -6259
12344 -22111 114202 -319744 108373 224315 37674 -31861 -238517 25970 -80197 468621
12333 1601 119590 91489 120950 -187226 -136750 -108115 -84045 218975 -247133 -284923 72148
12321 19500 97271 -51380 209084 -253253 -103914 -256979 -354024 -168038 -218508 195863
12310 -378518 159602 127935 -152277 -198873 -197776 -125697 -247867 -115220 -75157 101842 -183973
12298 132948 -47335 -72208 -199260 189777 167979 -270189 388107 -34238 -98191 197209
12287 -21652 168758 -100308 -41002 -178257 287465 -117858 -9794 -215939 192214 23665
12276 -288893 3570 134815 233076 109342 75113 -44301 470327 238554 -288797 12021 -187972
12264a27005B19335i0994B14089a42299A5290J18444a09053l8039g0737C27021
12253E2390K29753d2010B4833A0183K76433o3681a1807C425m31J81780O9578O4360
12241C18712a49772B20685A06375A9075K08631k0955a6517B69254Q2916C9361
12230a21618B26177n5797b30305A12976a59013B16963I2635J78548H6031N2000
12220A38031L9635e3918d773B38509C5255K25603c06887C19454k7191C7891b60176
12208G5772j9456g6261B37522c23742A39914J96825b01726e8243r0095A97507
12197b0524B64225j24755J77711A21224e9951E90117r7112A37394J6135J63388
12187C16917j11347C4028a1753A75568J33605A05706k5099K37677l3646r8822
$$ plain form
12264 -127005 219335 -90994 214089 -142299 15290 133734 -109053 -147092 -70737 327021
12253 52390 282143 -42010 24833 10183 286616 222935 -11807 3425 2994 184774 254352 318712
12241 318712 -149772 220685 106375 19075 227706 206751 -16517 269254 352170 39361
12230 -121618 226177 170380 -230305 112976 -159013 216963 92635 271183 86031 138031
12220 138031 177666 -53918 -4773 238509 35255 260858 -306887 319454 292263 37891 -260176
12208 75772 56316 -76261 237522 -323742 139914 336739 -201726 -58243 -148338 197507
12197 -20524 264225 139470 317181 121224 -59951 590117 493005 137394 153529 316917
12187 316917 205570 34028 -11753 175568 309173 105706 80607 318284 284638 185816
12177A85816D196a6774N737D59686j55659I1618a09171c8967p0761L0712j0254
12166h9270A30701C1739h12B47105a78674B60644f0073A28747a561j17985B6559
12154e7171K4110o0057G4164b44670A0581f0616A18444J56751A21140a66009E2462
12142a68838k8163l1397A63170B9158e933I9368a94053c9969B15613g9174A61410
12130A03857a33809B02240a10994G627b75719n746E2078a23582M9082B89483E929
12118D40882a42023k29049i7589E3952K53631E9833e38A64237R9153G389K4567
12107C1956f6088B18556e4263A47457b1059q5633c2706A83783b34541B37664a6003
12095C09775A40282c0048I2680N9966b69432A84924a50690O5090j27669O4529
$$ plain form
12177 185816 4196 -16774 -11037 459686 304027 91618 -109171 -38967 -109728 -79016 -89270
12166 -89270 130701 31739 -812 247105 -178674 260644 -60073 128747 -1561 -119546 26559
12154 -57171 -33061 -93118 74164 -244670 10581 -60616 118444 275195 121140 -166009 52462
12142 -168838 -197001 -228398 163170 29158 -5933 99368 -194053 -39969 215613 -79174 161410
12130 103857 -133809 202240 -110994 7627 -275719 -281465 52078 -123582 -74500 289483 5929
12118 440882 -142023 -371072 -97589 53952 307583 59833 -538 164237 263390 7389 31956
12107 31956 -66088 218556 -54263 147457 -21059 -106692 -32706 183783 -234541 237664 -16003
12095 309775 140282 -30048 92680 152646 -269432 184924 -150690 -85600 -213269 -148740
12085a48740A35808O0823F8902K09903C9203J48459A686b36324A89143F701K2122
12074B8823f6306B14038a7939C9779J92803b2292o4560B2741M0042c63645A67110
12062F05330N76368l88879B63761a14557C86325H0139O2565g1489b8227k14751
12052b42978L3827j33696B61822G9039a41692J8322e3937r9035j86837C89103
12041a21050J2378I6675j2790b93416B22300i3394A18940c18912a0042k7473F7319
12029B10927f6630A83319a0590j225j22567B91505H160J45996b23018G7257h8153
12017B27770k1142j5090p7476j2248a34585A67068N7888B3113e4649A81751P827
12006A89578J14020B9128K07143n7114K3029j4123a79949g9013r1064C9721K30067
$$ plain form
12085 -148740 135808 196631 68902 278805 39203 187662 1686 -236324 189143 6701 28823
12074 28823 -66306 214038 -17939 39779 232582 -22292 -86852 22741 62783 -363645 167110
12062 605330 1181698 792819 263761 -114557 386325 80139 142704 -71489 -28227 -242978
12052 -242978 -209151 -342847 261822 79039 -141692 -123370 -53937 -152972 -339809 389103
12041 -121050 -108672 96675 83885 -293416 222300 -93394 118940 -318912 -10042 -37515 67319
12029 210927 -66630 183319 -10590 -11815 -134382 291505 8160 154156 -223018 77257 -88153
12017 227770 206628 191538 114062 101814 -134585 167068 224956 23113 -54649 181751 189578
12006 189578 303598 29128 236271 179157 202186 188063 -179949 -79013 -170077 39721 269788
11995B69788C8203e0240m77084a86320m0280C51587p7125E1723a20970c2056j12111
11984a44167r5013J7184e7396k61262j36017a42916C7528d36228f7312A02005
11973I2640c2073j26813e5012q0205k33895J69393g6463G8379K18038A20711c6466
11961a71414f4534j29623h5656a166B22221a85765O3848e9385j03343N6654Q553
11950i7521j79509a28032c8510p0442A58961b18199j60469J72762J0875n369M283
11939a96117F46b27410C85613i527j98035G2766B8537a70332B11045B4133O4991
11928H9124a21641p3458R4165D8459J4624Q7669k7000B8356A0540J84959A0129
11916b44205N9229O6813B42324b93310a4878j35240q7397a863j11750C84220H48
$$ plain form
11995 269788 38203 -50240 -527324 -186320 -226600 351587 274462 51723 -120970 -32056 -144167
11984 -144167 -239180 -221996 -57396 -318658 -454675 -142916 37528 -436228 -67312 102005
11973 92640 -32073 -158886 -55012 -135217 -369112 -199719 -76463 78379 296417 120711 -36466
11961 -171414 -64534 -194157 -85656 -1166 222221 -185765 -121917 -59385 -162728 -106074 -97521
11950 -97521 -277030 -128032 -38510 -108952 158961 -218199 -378668 -205906 -195031 -200400 -196117
11939 -196117 646 -227410 385613 -9527 -207562 72766 28537 -170332 211045 24133 89124
11928 89124 -121641 -195099 -100934 48459 63083 150752 123752 28356 10540 195499 10129
11916 -244205 -184976 -118163 242324 -293310 -14878 -150118 -237515 -1863 -113613 384220 848
11904a40898m6099g8953d970l38525A49702a47775d0345q5794A38370a18714k9555
11893a48269B32639d6405I6174B4446a06474J4420F3896f1419B9906J52613G9215
11881d3534B44646g664l8033m1963A70643E4104a58903k6439A25338j0433P3289
11870A88194b3820N381C5200J0390A3983a56373A02078k9178a70943a7289B78476
11858g0431j247B59888H778a91390B18705a81921L9206j3161D8171J7550f3910
11846c84268A35569b56818Q9670A35048b88749J13678q8057A27564D3694b61002
11835I1662L722K8112a96421o3006b8563A58798o1721b26995g8397k63683d220
11823B25400b05052R9516A95983a47333j59029L2163C78718a4474l0884a9437
$$ plain form
11904 -140898 -186997 -78953 -4970 -343495 149702 -147775 -40345 -126139 138370 -118714 -148269
11893 -148269 232639 -46405 96174 24446 -106474 -92054 63896 -61419 29906 182519 79215
11881 -43534 244646 -7664 -45697 -87660 170643 54104 -158903 -185342 125338 114905 188194
11870 188194 -23820 -18439 35200 45590 13983 -156373 102078 72900 -170943 -17289 278476
11858 -70431 -71678 259888 8778 -191390 218705 -181921 -142715 -155876 48171 65721 -63910
11846 -384268 135569 -256818 -167148 135048 -288749 -175071 -263128 127564 43694 -261002
11835 91662 95384 123496 -196421 -259427 -28563 158798 97077 -226995 -78397 -342080 -4220
11823 225400 -205052 -105536 195983 -147333 -306362 -274199 378718 -14474 -45358 -19437
11812D900c5190A46062a07404A99142h2961M0486I9143A1473K3540j2890c75985
11800a5046j31173a7483A25825c03398C0136a62020n1005n3989E4854A0395J27255
11789A37650b05308i3491o2149e4764I5150c6656k06747A2541c6208j80736a06511
11777a54421j32445q0336a77457p2591B1201M1181N1000n4034a32366C15708A28351
11765A96760n4001c32778B87374r7820a69425j57858l4714B44414a48834I6421
11754B39469r1666M7981H3204b42213D3166K2893R6995D4432a51447d2369I1418
11742a91850I066b88700D8656J5352a23444f321k3941L953G9395f1705j483H2536
11729i4116j63637g7280b7772j44570j59726Q3710E6097a08867B63636f6055j1865
$$ plain form
11812 4900 -35190 146062 -107404 199142 -82961 -42475 99143 11473 35013 22123 -375985
11800 -15046 -146219 -17483 125825 -303398 30136 -162020 -213025 -267014 54854 10395 137650
11789 137650 -205308 -93491 -155640 -54764 95150 -36656 -243403 12541 -36208 -216944 -106511
11777 -154421 -286866 -367202 -177457 -250048 21201 62382 113382 59348 -132366 315708 128351
11765 196760 142759 -332778 287374 189554 -169425 -327283 -361997 244414 -148834 96421
11754 239469 147803 195784 83204 -242213 43166 66059 163054 44432 -151447 -42369 91418
11742 -191850 9066 -288700 48656 64008 -123444 -6321 -30262 -26309 79395 -61705 -63188 82536
11729 -94116 -257753 -77280 -27772 -172342 -332068 -248358 56097 -108867 263636 -66055 -77920
11718g7920j3380K8091A26441b8298k5460C6341P7879a52514f3763A20238g4328
11706g6880B81992a07796m5768L1296l30614C2600a46082C03198g3518A16126
11695C63927A37174c4067H4184O4281J00481f3110A00633m2063a73434B75460
11684A19335J06535n3508C0337b24842J10402r4456Q7511L2009J8502A93889J99585
11673C93474A82475C4919c19724B35661j07228O073e8150F2141J1184b23006C7283
11661a36894E8652e4785B6072h0797L4766A10796a56004I1409A4670a1925A13575
11649c81210e0297k00489P8543B81147a77849A71052a22016d0652B24289J4408
11639B38697e322A4855b43754C24063d23944E4776f8325C22494n9395a23677j8421
$$ plain form
11718 -77920 -91300 -63209 126441 -28298 -53758 36341 114220 -152514 -63763 120238 -74328
11706 -76880 281992 -107796 -153564 -122268 -452882 32600 -146082 303198 -73518 116126
11695 363927 137174 -34067 84184 148465 248946 -63110 100633 58570 -173434 275460
11684 119335 225870 172362 30337 -224842 -114440 -208896 -121385 -89376 -70874 193889 393474
11673 393474 182475 34919 -319724 235661 128433 134506 -58150 62141 73325 -223006 37283
11661 -136894 58652 -54785 26072 -80797 -46031 110796 -156004 91409 14670 -11925 113575
11649 -381210 -50297 -250786 -172243 281147 -177849 171052 -122016 -40652 224289 238697
11639 238697 -5322 14855 -243754 324063 -423944 54776 -68325 322494 263099 -123677 -142098
11628a42098O0717C03786b41048J07823e6257j49220A72288G2442Q4671e9017
11617C57626a0142A2895b4226j40668r4530A62081K25611a15533e2398B36442
11606a51472E3071J9401J52977a0301l04482H1074A3594a28943l3405C8389b06126
11594C6451f6154l05304h6389c1872r4186a9476A03496c2409C3907K9800b60424
11582h6479A03929a80554k5581B17424b82637H6921J6983a80649P1351A3126J57618
11571A70744J52157d6066j25169f9681j89976g6925j41512h1602K6885B56489
11560I4522b65667e9013m62951a45823B7324J82902f1070k45236g1012H7524b02587
11548H8472a44353L8855C408a40995j20399E1240a86982C15041J9579g4576a4747
$$ plain form
11628 -142098 -81381 303786 -241048 -133225 -56257 -205477 172288 72442 157113 -59017
11617 357626 -10142 12895 -24226 -164894 -259424 162081 387692 -115533 -52398 236442
11606 -151472 53071 72472 225449 -10301 -314783 81074 13594 -128943 -162348 38389 -206126
11594 36451 -66154 -371458 -86389 -31872 -126058 -19476 103496 -32409 33907 63707 -260424
11582 -86479 103929 -180554 -206135 217424 -282637 86921 103904 -180649 -109298 13126 170744
11571 170744 322901 -46066 -171235 -69681 -259657 -76925 -218437 -81602 -54717 256489
11560 94522 -265667 -59013 -521964 -145823 27324 210226 -61070 -306306 -71012 87524 -202587
11548 88472 -144353 -105498 3408 -140995 -261394 51240 -186982 315041 334620 -74576 -14747
11536C1859a14073C8994a495I41J35962L3409H1583a57761n5965a2039F4351a2
11523D4543a49482k79989c3855G8201K18597F3727L925b4454n021B11904f8467
11511G1988i4620A50017j0324c04535C54172f4886p7237F0726R3756o8658J76609
11500B62433j20010C2443a85618i0473B9349a74078D72625a79968H3306M2573
11490A25879a19850c8011A58299J28276O515k3209h9777o070F3757N35681b7317
11478A38588J83944o6968H3982h7907c0987C02148a16513B58872b3901A88191
11467I8706a93231B97996a16767A6227a01863E3895c52435A91185k0135J4211
11457A85261a22916A60041K42432J9269A20233j6382d8139o363C96404A0538J47787
$$ plain form
11536 31859 -114073 38994 -1495 941 136903 170312 81583 -157761 -213726 -12039 64351 -12
11523 44543 -149482 -429471 -33855 78201 296798 63727 67652 -24454 -29475 211904 -68467
11511 71988 -94620 150017 139693 -304535 354172 -64886 -142123 60726 154482 85824 262433
11500 262433 142423 32443 -185618 -90473 29349 -174078 472625 -179968 83306 125879
11490 125879 -119850 -38011 158299 286575 293090 269881 -89777 -95847 63757 599438 -27317
11478 138588 322532 255564 83982 -87907 -30987 302148 -116513 258872 -23901 188191
11467 98706 -193231 297996 -116767 16227 -101863 53895 -352435 191185 171050 185261
11457 185261 -122916 160041 402473 421742 120233 103851 -48139 -54502 396404 10538 158325
11446A58325b8634F8142G814a39723G6121K47562a39510F1047J05630n2560a74223
11434B16969C5837h9399A41917b93710F6821g7056C0906J25723D6236L50116c4370
11422a30372A33279b08861A76858b19915c0174A26927a41340H9706a12645C65184
11411G4527f3018C0302i2698A37429P4493o2763i1471A85722q9639J2393e8640
11399A09698f4580H7455B2709h5144j61923C1763J12797n7626c02351A33990B3691
11387A66618l4792h4004D33032A96700o8496B7167b30017c5740p9992a1358j77566
11376a88924D8505b09212G8249b58316B77919c35462J22176i4392m7337l4806
11366a76535D08425I4220M2280b2030j6049a6195I3861L3861c46639A01073m194
$$ plain form
11446 158325 -28634 68142 7814 -139723 76121 323683 -139510 61047 166677 114117 -174223
11434 216969 35837 -89399 141917 -293710 66821 -77056 30906 156629 46236 396352 -34370
11422 -130372 133279 -208861 176858 -219915 -30174 126927 -141340 89706 -112645 365184
11411 74527 -63018 30302 -92698 137429 211922 149159 -91471 185722 96083 108476 -58640
11399 109698 -64580 87455 22709 -85144 -247067 31763 144560 86934 -302351 133990 23691
11387 166618 131826 -84004 433032 196700 128204 27167 -230017 -35740 -115732 -11358 -188924
11376 -188924 48505 -209212 78249 -258316 277919 -335462 -213286 -94392 -141729 -176535
11366 -176535 408425 94220 136500 -22030 -38079 -16195 93861 127722 -346639 101073 96879
11355I6879M6656a77002P487o934P1084A32886h0434r4021j46565J16503p3087
11344b77604m0040J27890A14560D1946p849J44741e9322A33648b07930j114F2364
11332a63764k46831D2829c4167o4817A8722L97153D6635J32574b8834A23376b43817
11320a0406j88894D4157b13977A97037a51280D9236K08879a20858c1353B46172
11309E2966q678g4755k01521C4586q02b81134C8980J30069F3325h6455j69157
11298b55612P9483f7198j58874Q4591A75307f2649j58074a04967B38619a10444
11287d4668k26183B91700m745a55970J9031F7752a33834A39393e0365o7676r5639
11276b13680k0600a11528A778a68807j8657A02876a2404l4645r0304a0382k45118
$$ plain form
11355 96879 143535 -177002 -169515 -176449 -105365 132886 -80434 -174455 -321020 -204517 -277604
11344 -277604 -317644 -189754 114560 41946 34097 178838 -59322 133648 -207930 -209044 62364
11332 -163764 -410595 42829 -34167 -98984 18722 415875 46635 179209 -28834 123376 -243817
11320 -10406 -199300 44157 -213977 197037 -151280 49236 258115 -120858 -31353 246172
11309 52966 44288 -74755 -276276 34586 33784 -281134 38980 169049 63325 -86455 -255612
11298 -255612 -176129 -67198 -226072 -141481 175307 -62649 -220723 -104967 238619 -110444
11287 -44668 -270851 291700 286955 -155970 -136939 67752 -133834 139393 -50365 -118041 -213680
11276 -213680 -234280 -111528 1778 -168807 -187464 102876 -12404 -47049 -137353 -10382 -255500
11265b55500B47452J73286H5010B3924p053J97552j2631e3096k58559h1169j26728
11254b07897i2800F4132c1887l94294g8366i692k27952a658j22366M5178B44645
11242d2217B12332k9294c58657b4744r7093K8264i823B3284a64083k101K7007
11231a39177N873D1066d05763B1608N8422a62725A41148D4958b26222c82k41219
11220b41601o3604A02789a0834q089j17530N6107j60203j0453e1057A46415b04631
11208e93128K81811b8585j77596B00643e0486j9481k43238J1332A2801O8041h2068
11196h6854l3644M3174l4807A26910e17409g5163k22517i0181c082B84655c4848
11184G5877K00650g1485E9664b26268d3833l99159B8067c5436A7997J04256c45921
$$ plain form
11265 -255500 247452 420738 85010 23924 16871 214423 201792 -53096 -311655 -81169 -207897
11254 -207897 -92800 64132 -31887 -426181 -78366 -9692 -237644 -1658 -124024 -78846 244645
11242 -42217 212332 183038 -358657 -24744 -121837 -93573 -9823 23284 -164083 -166184 -139177
11231 -139177 -133304 41066 -405763 21608 80030 -162725 141148 44958 -226222 -382 -241601
11220 -241601 -305205 102789 -10834 -18923 -136453 -80346 -240549 -251002 -51057 146415 -204631
11208 -593128 -311317 -28585 -206181 200643 -50486 -69967 -313205 -301873 12801 80842 -82068
11196 -86854 -120498 -77324 -112131 126910 -517409 -75163 -297680 -90181 -3082 284655 -34848
11184 75877 276527 -71485 59664 -226268 -43833 -442992 28067 -35436 17997 122253 -345921
11172B96906I8656N539c0133A6667d673m4661G3165L1332c32312H9826b72272
11160f1118j58337A61071a67037c8308q5688d2996j87066H0272A404a83679p4231
11149b57910j98222A72909F3787d0225a4809E8793d3185A66336o3798L0545g9436
11137A96715o7215C7864a37301r5130A42115R0799a8925b673A21484b26152E93005
11125g7864O438F27699a03578B3419C874J77863H1454b4964C46816a66978e807
11113B25112c2706A15037J6859J0414N92A3456L24845b48137A04532M41751H380
11101B20020n0984K59540a0887C59394a68152A3085d3123C33379F8170J22674
11091A90844O3327o1771K0605f3420B5574Q8037J24157K60417c5512E63637A15798
$$ plain form
11172 296906 98656 104195 -30133 16667 -4673 -49334 73165 104497 -332312 89826 -272272
11160 -61118 -219455 161071 -167037 -38308 -123996 -42996 -230062 80272 1404 -183679 -257910
11149 -257910 -456132 172909 63787 -40225 -14809 58793 -43185 166336 102538 133083 -79436
11137 196715 129500 37864 -137301 -232431 142115 232914 -18925 -2673 121484 -226152 593005
11125 -77864 -71426 627699 -103578 23419 3874 181737 81454 -24964 346816 -166978 -5807
11113 225112 -32706 115037 131896 142310 142902 13456 338301 -248137 104532 546283 8380
11101 220020 169036 428576 -10887 359394 -168152 13085 -43123 333379 68170 190844
11091 190844 254171 192400 213005 -63420 25574 113611 237768 498185 -35512 563637 115798
11079C83157q8019D6167K58547k7045r7148E9950J36171l5714b01600B32126K96545
11068E28671n2675k10801J36043j05703M652P1177J817J10234m6980P2431B15348
11056F90373k62887L38671q3771J03770C49073J18998m8988M25293C12421K97574
11046F09995n933Q114l5176N667k10380o9722M69235j72780n0939K11137K03055
11035I62273m37343Q5560J56728J062j17484J7843K13347j16500J01707l83465
11025D83728K01927j53095L23129A83779L83058o7373J93788j7675j90211J48242
11015F33608m7667k54951p316l798l0018K74641J46067j61294J7430N1923O9956
11004F88581j14590l6925P3993j31982M6151O1133j50370K18458J07089A82030
$$ plain form
11079 383157 295138 46167 304714 277669 180521 59950 196121 160407 -201600 232126 528671
11068 528671 475996 265195 401238 295535 300187 371364 373181 483415 436435 508866 215348
11056 690373 427486 766157 682386 786156 349073 468071 419083 844376 312421 609995
11046 609995 604062 612176 577000 582667 372287 302565 771800 599020 548081 759218 962273
11035 962273 524930 610490 767218 768280 650796 668639 881986 765486 867193 483728
11025 483728 685655 532560 855689 183779 566837 499464 693252 675577 485366 633608
11015 633608 585941 330990 323674 319876 289858 564499 710566 549272 566702 618625 688581
11004 688581 573991 537066 611059 479077 525228 586361 435991 654449 761538 182030
10993F67433j43783J61808l42411K50820j8276K92057j02225m4783J43247J69949
10983A033836l28780J58329K85755J10934j28264l1318M77143M8397n202P02095
10973B322925J12684k06177L56641l43047O21687n94136L6141m0754q20407j56957
10963A288600R4585m08642M8282m50M8217N5181j45945L90793m89897J37475k97932
10952G20267k42185j24516L86780C66752j24629a42116E23408A99975J87188q5829
10942C01334e2507C14330A43896J51146c6313k4293A4202P4362k3661b0988C1364
10930B29603C2169L86727a98212N2068A96035F3900a10945A62587j0429P0923
10920B23081i6816j89199C8729N7495a49263G991J51763c32926R9186A05221P5792
$$ plain form
10993 667433 523650 685458 343047 593867 575591 867648 765423 720640 863887 1033836
10983 1033836 705056 863385 1149140 1260074 1131810 1100492 1577635 1626032 1620830 2322925
10973 2322925 2435609 2229432 2586073 2243026 2864713 2270577 2306718 2265964 1445557 1288600
10963 1288600 1383185 974543 1022825 1022375 1070592 1125773 979828 1370621 880724 1018199 720267
10952 720267 478082 353566 740346 366752 242123 -142116 523408 199975 387163 301334
10942 301334 -52507 314330 143896 295042 -36313 -60606 14202 88564 64903 -20988 31364
10930 229603 32169 418896 -198212 -146144 196035 63900 -110945 162587 152158 223081
10920 223081 -96816 -286015 38729 96224 -149263 7991 159754 -332926 -233740 105221 181013
10909A81013G3088K74351b00126O1635I4221J77329I7294g9426A59707B113L5567
10898C7680g1194B2671a90725k7343A66678a48536A49017D048Q7537G307a44100
10886c23882B1433a90677n6203B6849c28524F0078A462a86800g50p8510m40691
10875e19951K46677A00250a25543M6201B1654Q4202K5614A705d9458A15062e9859
10863E7256c44153c2756j99927j9210K7997o0637a8262l6870B41247j08809D9627
10851b56446B30414G1370A7337i3976A01289D3086J08275a65770A36907m624b91108
10839H1022b11291R4759j60911f3337L0572A17006c1951n0458m1991D2281f35
10827e6129I6165b53423D18188A67794a06482j71828D7659d39078a2558l6453
$$ plain form
10909 181013 73088 347439 -200126 -138491 94221 271550 97294 -79426 159707 2113 37680
10898 37680 -71194 22671 -190725 -218068 166678 -148536 149017 4048 91585 7307 -144100
10886 -323882 21433 -190677 -246880 26849 -328524 60078 1462 -186800 -750 -79260 -519951
10875 -519951 -273274 100250 -125543 -79342 21654 105856 131470 1705 -49458 115062 -59859
10863 57256 -344153 -32756 -232683 -251893 -223896 -284533 -18262 -55132 241247 132438 49627
10851 -256446 230414 71370 17337 -93976 101289 43086 151361 -165770 136907 132283 -291108
10839 81022 -211291 -116532 -277443 -63337 -32765 117006 -31951 -82409 -124400 42281 -635
10827 -56129 96165 -253423 418188 167794 -106482 -278310 47659 -439078 -12558 -49011
10817d9011B46083r1769a79841j99938O7982a28914N0250I9267M4060e8622A63002
10805a19340k01344G0620b54461a724j45507A38123b3934I6627l7507b69671A2700
10793A58221a82943E137N4625K3211C8857K32450N0852I8912B3345c2129C7247
10781a49294j79942i2866M2978k97336a46205D14491g6622A18284m6017a83286
10770a84523f4236B0974e1191H7406M3924a33996H5659O1055O3075E5188d9192
10758b71771J02088e4705B42989d10616a62891O5457A02049c733F861K87406c5224
10746a70896a1818A7604P949c19978A82949a03207j41913R3905JM2344j63440
10735b72310b8234K669r4005j7372K474k7196n436a8653j7734F4839Q9665j2846
$$ plain form
10817 -49011 246083 154314 -179841 -379779 -311797 -128914 -78664 99267 143327 -58622 163002
10805 -119340 -320684 70620 -254461 -1724 -147231 138123 -23934 96627 59120 -269671 12700
10793 158221 -182943 5137 59762 82973 38857 271307 322159 98912 23345 -32129 37247
10781 -149294 -329236 -92866 -49888 -347224 -146205 414491 -76622 118284 72267 -183286
10770 -184523 -64236 20974 -51191 87406 131330 -133996 85659 146714 209789 55188 -49192
10758 -271771 -169683 -54705 242989 -410616 -162891 -97434 102049 -3733 6861 294267 -35224
10746 -170896 -11818 17604 25553 -319978 182949 -103207 -245120 -151215 -151214 -108870 -272310
10735 -272310 -28234 -25565 -119570 -136942 -134468 -161664 -167100 -18653 -36387 64839 154504 141658
10723A41658a51599O7732D4375a15329k05411Q6952B36982f2216A3804J6161J33668
10712A63633A4511d40787a71485k7612k3276a4661p9412C47712G4418b76884l2036
10701c08920B05207b07271A82142n2765a92622d0658j6566j49398j20121I1558
10690c85041C23531a13221L7072A72442f2306j81274F3399B3726b05263c9835
10679G5448a04175M7093K4359j2158A81322E0723c3153A77655g0966B46603B2701
10667c12002L1850H2907b01331j62987g0113e657l54338B1748j715c92800C4567
10655e7318l19197a15874J2226D0140a17634j74693I9517e2099H8248j1638j882
10644G4728a05434A1941b0592A76776M7770a31902L0232L3942j04669R190M6966
$$ plain form
10723 141658 -151599 -83867 44375 -115329 -320740 -233788 236982 -62216 13804 29965 163633
10712 163633 14511 -440787 -171485 -199097 -222373 -14661 -94073 347712 74418 -276884 -308920
10701 -308920 205207 -207271 182142 129377 -192622 -40658 -57224 -206622 -326743 91558
10690 -385041 323531 -113221 -76149 172442 -62306 -243580 63399 23726 -205263 -39835
10679 75448 -104175 -57082 -32723 -44881 181322 50723 -33153 177655 -70966 246603 22701
10667 -312002 -280152 82907 -201331 -364318 -70113 -5657 -359995 21748 20033 -392800 34567
10655 -57318 -376515 -115874 -103648 40140 -117634 -292327 99517 -52099 88248 76610 74728
10644 74728 -105434 11941 -20592 176776 224546 -131902 -101670 -67728 -172397 -163207 -116241
10633a16241B58101b70926A34522N3231d40386e6804A21666E0240Q420a3184j98302
10622b11486N5713F8086M0333j7763a1308B16695B0858h2094l60833g0008A44689
10610i9611j16891a1198m35746a16301A2208J49955l8132b061l01419A93132H9514
10598a90498j65555D66792b35248e7838B05338c26938B32833q6358q119N7973
10588A96329o8253E7978b39126M1268A21732b95523g2386o955N348l3635j24306
10577b31934B32432a68319O6752b0545j74741D2970b10976B8891a53544A63650
10566B0965L65250b8893j34619A28482a05824C6484b09098K3481N2537K3331H6124
10554b39642B09460i4739k35072n9830K5101A56968f7145I1205J9852D5352J86835
$$ plain form
10633 -116241 258101 -270926 134522 187753 -440386 -56804 121666 50240 58660 -13184 -211486
10622 -211486 -155773 68086 108419 90656 -11308 216695 20858 -82094 -442927 -70008 144689
10610 -99611 -216502 -11198 -446944 -116301 12208 162163 124031 -2061 -303480 193132 89514
10598 -190498 -356053 466792 -235248 -57838 205338 -326938 232833 146475 138356 196329
10588 196329 128076 57978 -239126 -197858 121732 -295523 -72386 -79341 -73993 -107628 -231934
10577 -231934 232432 -168319 -101567 -20545 -195286 42970 -210976 28891 -153544 163650
10566 20965 386215 -28893 -163512 128482 -105824 36484 -209098 -185617 -133080 -109749 86124
10554 -239642 209460 -94739 -329811 -389641 -364540 156968 -67145 91205 111057 45352 232187
10543B32187b4921n5622C8672f0105j42227A12501A1502a942C16872A40422F6277
10531a95580j30581B49698K38193c05339a03070A52263b9723A79360a58727A31376
10520c08296N5932A02446h1418A34442c08084J27282n2107A69792J88539b36166
10509H0916h6802k09823C1600e9475q3367D0514c83494A33749b51177a1000k90730
10498c01730E5231O3313a50567N4854b1679l5660k4102j58155h9808q5280q6228
10487b61316k58513A89285d7201a3629j67696B357K95663b44576E95355A01571
10476B15025a76435L2817q1386M4484A65370K20224H3756J52784k148r3005A8027
10464b63256B31385a74947j12888f2696A99473a29152C44852a60705o9409a01352
$$ plain form
10543 232187 -24921 -80543 38672 -60105 -202332 112501 11502 -1942 316872 140422 66277
10531 -195580 -326161 249698 487891 -305339 -103070 152263 -29723 179360 -158727 131376
10520 -308296 -252364 102446 -81418 134442 -308084 -180802 -232909 169792 358331 -236166
10509 80916 -86802 -296625 31600 -59475 -142842 40514 -383494 133749 -251177 -11000 -301730
10498 -301730 55231 118544 -150567 -95713 -21679 -57339 -81441 -239596 -89808 -175088 -261316
10487 -261316 -519829 189285 -47201 -13629 -181325 2357 298020 -244576 595355 101571
10476 215025 -176435 -143618 -225004 -180520 165370 385594 83756 236540 234392 141387 18027
10464 -263256 231385 -174947 -287835 -62696 199473 -129152 344852 -160705 -230114 -101352
10453H8834a02234j79096B282b03804O4538l1847A20535l1465D3384b90295A61727
10441a40087d2778E656L15826c38863J30953A72835k0659i1513B1543i7861k2420
10430a20281j42758D4122M5760h1822A82782b6024p3535C2607i7961a7438k41118
10419b58556A0298K43993K41610a14106n9960A36065b3807p6851q298I8721c6028
10407e21827D7159j4173b08874d7496K3231D9405J6171f9368E9278c48303g5284
10395a30228B20721g8804A08024K14630j22044F6523P0113j7327m5797B3582K77628
10384C01210j2195K2495r5842e7463A88669N0975n9306q8941M5442J79655B447
10372B35146J01960L32156B69475D4729K74977K18959L5384B66987C8634J88872
$$ plain form
10453 88834 -102234 -281330 2282 -203804 -139266 -171113 120535 89070 43384 -290295 161727
10441 -140087 -42778 5656 321482 -338863 -207910 172835 152176 -91513 21543 -97861 -120281
10430 -120281 -263039 44122 89882 -81822 182782 -26024 -99559 32607 -97961 -17438 -258556
10419 -258556 10298 254291 495901 -114106 -174066 136065 -23807 -100658 -108956 98721 -36028
10407 -521827 47159 32986 -208874 -47496 -24265 49405 65576 -69368 59278 -348303 -75284
10395 -130228 220721 -78804 108024 322654 200610 66523 136636 119309 73512 23582 301210
10384 301210 289015 311510 215668 -57463 188669 239644 180338 91397 136839 316494 2447
10372 235146 337106 669262 269475 44729 319706 538665 574049 266987 38634 227506
10362B27506L2493j7305F3013J30356K01871j91178n5356K79878E0718L46586
10352C97304j8639j40638L82861k64679A31749b40867B96528j23840R9979A06550
10341B6287J28691L96522a44974C47273j13321L555l8634q7403J81348A07683
10330i0305J5588D43201h4175A0233M77329B23939I7947a35257B61312L5668a29016
10318C2983N804a80745A98237q7872L044m5467b3368l5659A11510a27857B17626
10306A9627a84382A18055J29052b23270E2704A8062K9926a04054b3196E8648c9883
10294a1411q9569m9604A5337c63851D1316J3966f575k147n51536A64422G2706
10282a58976B48156b65092A69666m437b86485D292c51002e8995l0285j23787C54798
$$ plain form
10362 227506 259999 242694 63013 193369 395240 204062 148706 428584 50718 397304
10352 397304 378665 238027 620888 356209 131749 -240867 296528 172688 272667 106550
10341 26287 154978 551500 -144974 347273 233952 237507 198873 111470 292818 107683
10330 -90305 -74717 443201 -84175 10233 487562 223939 97947 -135257 261312 296980 -129016
10318 32983 38787 -180745 198237 110365 113409 67942 -23368 -59027 111510 -127857 217626
10306 19627 -184382 118055 247107 -223270 52704 18062 47988 -104054 -23196 58648 -39883
10294 -11411 -100980 -150584 15337 -363851 41316 55282 -6575 -8722 -560258 164422 72706
10282 -158976 248156 -265092 169666 165229 -286485 4292 -351002 -58995 -89280 -213067 354798
10270i2221A1756J13797C522J09426J0907a69251q3677O3067A5354b08205A76637
10258B63759a45833D52652d6937l8277G6914J79905a40785p0804h6566l9946G2183
10246a20819A53967E5641J7474a2714j33519B43539o5292b0378l42499h0520k8283
10235a08803M8357G136J60318b34076D12501C4084g6128C6489i2975D65331A2775
10223I0411a6771A15520a10739j13207g0919A21408b43019L0418A60474F8126
10212c8590m0891o8890L3521c5275j33710m9914h0928E4425a41242c0424k56045
10201b86469k8299d8438j67566B50687a65408j8234j05849N3403B73894b27574
10190i3541K6386p2945a3872D9059b3344l00064A56345e8880j8951F9613N5405
$$ plain form
10270 -92221 11756 125553 3522 112948 123855 -169251 -252928 -189861 15354 -208205 176637
10258 263759 -145833 452652 -46937 -85214 76914 256819 -140785 -211589 -86566 -126512 72183
10246 -120819 153967 55641 73115 -12714 -146233 243539 178247 -20378 -362877 -80520 -108803
10235 -108803 -60446 7136 167454 -234076 412501 34084 -76128 36489 -92975 465331 12775
10223 90411 -16771 115520 -110739 -223946 -70919 121408 -243019 -212601 160474 68126
10212 -38590 -79481 -148371 -114850 -35275 -168985 -218899 -80928 54425 -141242 -30424 -286469
10201 -286469 -314768 -48438 -216004 250687 -165408 -183642 -289491 -236088 273894 -227574
10190 -93541 -67155 -140100 -13872 49059 -23344 -323408 156345 -58880 -77831 69613 125018
10179A25018a20541F8258J48172c06902J26991j39410C87640j46864a91569C4691
10168a44073B66839B3012o304a16091r6464A83247F3063a977C81922E4292J9658
10157G3950c27128B15282i1261j24904g5876j13924m1983B96415f6318k85712
10147c52030B7927b88917n0794A58057E6186b06390G4067d5703o5522l25610J69381
10136b67454f0764J6758A16288c835A07557J08167a25887A87001a39263n1623
10126a90886P8098J3802M4567J0597c018l9196m8527j347g041E9684R4781i5255
10113e2339G5123R0084a41906f8693q3325M106F6205a57975P3583F101b20297
10101c03255Q2709B88274I620b03792d6165j74016h6394d1454o4033r1624O4981
$$ plain form
10179 125018 -120541 68258 216430 -306902 -179911 -319321 387640 240776 -191569 34691
10168 -144073 266839 23012 16708 -116091 -212555 183247 63063 -1977 381922 54292 73950
10157 73950 -327128 215282 -91261 -216165 -75876 -189800 -231783 296415 -66318 -352030
10147 -352030 27927 -288917 -339711 158057 56186 -206390 74067 -45703 -111225 -436835 -267454
10136 -267454 -60764 -44006 116288 -3835 107557 215724 -125887 187001 -139263 -190886
10126 -190886 -112788 -98986 -54419 -43822 -3018 -42214 -90741 -92088 -7041 59684 154465 -95255
10113 -52339 75123 165207 -141906 -68693 -152018 -147912 66205 -157975 -84392 6101 -220297
10101 -303255 -220546 288274 9620 -203792 -46165 -220181 -86394 -41454 -105487 -197111 -132130
10090a32130o5041G0780i939k37501i9986c906r328j38272l1366E0755g2045f450
10077A54627l7153i6159j43118r5515i1174L5862j2216r4676k9442m9560j34620
10066c75826A23517h8686l0230j02886A61126h6706c065B67737A05644i743r8009
10055a07752A06392j7134Q3005a81600A9606b02701O9924A85897F9264Q3527c9438
10043a26373r553O7044F5879a30408A29195a97421D07978d8609k47497A7872g9574
10031A51561G3145C4884c1837j08116M3027A84677f4331R472A8748b47423Q3776
10020a63647B83149j31607J01514a31224k0883j2271D03066E5762c75702F0195
10009d40211B79808a59627A38689K116A9186b85026Q4325C2788f980j33446n00
$$ plain form
10090 -132130 -197171 70780 -9939 -247440 -99986 -3906 -13234 -151506 -182872 50755 -72045 -6450
10077 154627 117474 -96159 -239277 -334792 -91174 -55312 -67528 -162204 -191646 -241206 -375826
10066 -375826 123517 -88686 -118916 -221802 161126 -86706 -3065 267737 105644 -9743 -107752
10055 -107752 106392 89258 172263 -181600 19606 -202701 -132777 185897 69264 152791 -39438
10043 -126373 -135926 -68882 65879 -130408 129195 -197421 407978 -48609 -296106 17872 -79574
10031 151561 73145 34884 -31837 -139953 -96926 184677 -64331 -54859 18748 -247423 -163647
10020 -163647 283149 151542 253056 -131224 -152107 -164378 403066 55762 -375702 60195
10009 -440211 279808 -159627 138689 140805 19186 -285026 -200701 32788 -6980 -140426 -140926
9998a40926E4308a63899d8172j32718g6060q7510G1731j6846f5511A07597a82353
9986A45780a00209A36538c27428j07092J60533A7659c59963j5588c5144k02574
9976b37718H6679J01163c87345A40553L96d3549A74759h5775G3796K358d7031
9964b07581F4106c36970a47774H3330J64201n6267a3200j57807j46644a12686
9953f0801D634g2554B43279H0571f511A1618b13597m2169I4487c72421B03863
9941c20893a08363j31977h7239B78776a23276l869n5095j17707A4418c15196J53113
9930a62083m3021A84124A5234J06201b21706C2614a88367A69617a66545I9022
9919a69235A4981d407j52164G2142D296J31451j1865a46168K6223H7896M49753
$$ plain form
9998 -140926 54308 -163899 -48172 -180890 -76060 -163570 71731 54885 -65511 107597 -182353
9986 145780 -100209 136538 -327428 -434520 -273987 17659 -359963 -375551 -35144 -237718
9976 -237718 86679 187842 -387345 140553 140949 -43549 174759 -85775 73796 76154 -47031
9964 -207581 64106 -336970 -147774 83330 247531 191264 -13200 -171007 -317651 -112686
9953 -60801 4634 -72554 243279 80571 -6511 11618 -213597 -255766 94487 -372421 203863
9941 -320893 -108363 -240340 -87239 278776 -123276 -127145 -182240 -299947 14418 -315196 -162083
9930 -162083 -205104 184124 15234 121435 -221706 32614 -188367 169617 -166545 99022
9919 -169235 14981 -4407 -156571 72142 4296 135747 123882 -146168 -119945 87896 537649
9908E37649a10698B42947a05570A49789g4074H7361g3393j789J4338A9469R4085
9897A13554a54799Q474p6725A95710o0845c9701k62145F8564c01600a49003l2368
9886a81371O6244r9355B1963a19720d2472k0889j61485k54630A64290d5995B04983
9874b62922F898J42126a64901A80415a22860e2047o2215M7999j02460P7251j16376
9863b07848A32183a2033A72276J45558e01092a17429j58779f9436j81297E2650
9852a82394A84173e6479l08490a75466p8672L2509N70A80797a01709d4651o2617
9841a07268C27132b96510C51190A27820g0396A39098i3476A17057e3647H3417
9830A07731c97600l6183F5307a36573j30026d2737n1784k09226k0306J39761j72047
$$ plain form
9908 537649 -110698 242947 -105570 149789 -74074 87361 -73393 -75182 -60844 19469 113554
9897 113554 -154799 -146325 -223050 195710 134865 -39701 -301846 68564 -301600 -149003 -181371
9886 -181371 -115127 -214482 21963 -119720 -42472 -63361 -224846 -479476 164290 -45995 204983
9874 -262922 6898 149024 -164901 180415 -122860 -52047 -114262 -66263 -168723 -91472 -207848
9863 -207848 132183 -12033 172276 317834 -501092 -117429 -276208 -69436 -250733 52650
9852 -182394 184173 -56479 -364969 -175466 -254138 -221629 -221059 180797 -101709 -44651 -107268
9841 -107268 327132 -296510 351190 127820 -70396 139098 -93476 117057 -53647 83417
9830 107731 -397600 -433783 65307 -136573 -266599 -42737 -94521 -303747 -324053 -184292 -356339
9819c56339d558n7739m13655A58157p689a98921A4782b39559K2980k07021B70150
9807f5137E3149f1219B67312a20873A29562b34084k69061c8392A19479i1186j08835
9796b00021e0697l1618C70111c08379J25365M7652l2834N4996k08491M6642b2563
9784a66901j29370A00719L7190n7358a87057A17216K2384a34883A54042D7032
9773A90061G127a29224N1430j59788D8130c15214R1808D6700b38851K2110h7050
9761a16006A11574C9827a48713A47171D6065A8427c31515L6696h6685o7786D1830
9749a16297I3590h3367l3935M5098r0532d5826j21694O2998H633h6646k44513
9738c31159A67766C3543a40295C5426i9304e184C52142j38534a18909b0190j0958
$$ plain form
9819 -356339 -4558 -62297 -475952 158157 150468 -198921 14782 -239559 -216579 -423600 270150
9807 -65137 53149 -61219 267312 -120873 129562 -234084 -503145 -38392 119479 -91186 -200021
9796 -200021 -50697 -82315 370111 -308379 -183014 -135362 -168196 -113200 -321691 -275049 -22563
9784 -166901 -296271 100719 137909 80551 -187057 117216 139600 -134883 154042 47032
9773 190061 7127 -129224 -77794 -237582 48130 -315214 -223406 46700 -238851 -216741 -87050
9761 -116006 111574 39827 -148713 147171 46065 18427 -331515 -294819 -86685 -154471 41830
9749 -116297 93590 -83367 -117302 -72204 -162736 -45826 -167520 -104522 8633 -86646 -331159
9738 -331159 167766 33543 -140295 35426 -99304 -5184 352142 213608 -118909 -20190 -31148
9727c1148k91556A4328c67099a47616j39473g4209A47993a4653k12895A50968
9716b2897k52517a20362A55775b94632a34015j22367r888A62397h8955N066k0866
9705a04755b6233m14879f6015A65418a24027A43562E4054a11597B29596c33469
9694G036d0755j23689c3039D4604P7246a62487K5855f1002C43622A53107E260
9682h4077A72587b47552a14006B31687A10846A93c4287j59110l4756r3116B48454
9670A41822c05854c1329A08604a60611O0546n8993R985l10127K24123R2366f2961
9658a95985o1220c5529A22401m0451a35304F1210o219J52684b93216c0607A00291
9646A05059b68864J02048A22751d132B0333a77928k1381m4513A05174a76687M9898
$$ plain form
9727 -31148 -322704 14328 -367099 -147616 -287089 -74209 147993 -14653 -227548 150968
9716 -22897 -275414 -120362 155775 -294632 -134015 -256382 -266270 162397 -88955 -83889 -104755
9705 -104755 -26233 -441112 -66015 165418 -124027 143562 54054 -111597 229596 -333469
9694 7036 -40755 -164444 -33039 44604 121850 -162487 -136632 -61002 343622 153107 5260
9682 -84077 172587 -247552 -114006 231687 110846 193 -34287 -193397 -228153 -321269 248454
9670 141822 -305854 -31329 108604 -160611 -100065 -159058 -149073 -459200 -235077 -142711 -62961
9658 -195985 -257205 -35529 122401 81950 -135304 61210 54991 207675 -293216 -30607 100291
9646 105059 -268864 -166816 122751 -4132 20333 -177928 -199309 -243822 105174 -176687 -126789
9635a26789k1288m4328n0173A19341B5676j737a64901q9844P5020C2895K84101
9624C16996b09617p3059e8631B07998h3437G1748a0536r1535j8070N6243D7608
9612D5219i9805H8431D612J01816b02376M0674F5760a98441O391h8653k13077
9601c01730f9330r5640a9189C8697c7848j01804B2371b28794f1187n0951M3818
9590f8320A58031l341f9242k45011n9995A44009c45531f6931A72417J16408a50423
9578a14694a9089j88498I9771b268j1752n3091C247f948C9746i6462m8888a0485
9565A60980G2331c9833r5430D951b48541A6828a05771E9958b01248E2599R1598
9554A44197d0290F1738P0895m9951J8299b80992I0080e9758F1888j8909a34797
$$ plain form
9635 -126789 -148077 -192405 -242578 119341 25676 23939 -164901 -254745 -179725 32895 316996
9624 316996 -209617 -282676 -58631 207998 -83437 71748 -10536 -102071 -120141 -63898 47608
9612 45219 -99805 88431 4612 106428 -202376 -161702 65760 -198441 -192050 -88653 -301730
9601 -301730 -69330 -164970 -19189 38697 -37848 -139652 22371 -228794 -61187 -112138 -68320
9590 -68320 158031 154690 -69242 -314253 -374248 144009 -345531 -66931 172417 288825 -150423
9578 -114694 -19089 -207587 99771 -2268 -14020 -67111 3247 -6948 39746 -96462 -145350 -10485
9565 160980 72331 -39833 -135263 4951 -248541 16828 -105771 59958 -201248 52599 144197
9554 144197 -40290 61738 132633 82682 100981 -280992 90080 -59758 61888 42979 -134797
9542E2120c6113A00582c7519j64494O9184j20084o4894J26155f2362A91066r1922
9531I9144b54912a7506j10817a8469k60710o2146J14634D5983d3839j57213p8524
9520b79576c8356A66962a32952n450o7410A5157P0209a68734D7324a49200a2943
9508a40537I249h6844k73383B42585F1445b63248j30218a29029A90306a42544
9497a22959c5962B29106K01013a0196A66074b13756C2407b75376A10516C4043
9486f8028B92323A287J72979H5550c19411A01914g4601r2429k30379C0093b11549
9474B79811a63324j04137i6601B63978a15882k37546a00310p1901c8615C35114
9463c11999A29392c8446B9509a49301a6138j35164I3537M6006e1903q6364o6468
$$ plain form
9542 52120 -36113 100582 -37519 -202013 -132829 -252913 -317807 -191652 -62362 191066 99144
9531 99144 -254912 -17506 -128323 -18469 -279179 -341325 -226691 45983 -43839 -201052 -279576
9520 -279576 -38356 166962 -132952 -138402 -205812 15157 85366 -168734 47324 -149200 -12943
9508 -140537 9249 -86844 -360227 242585 61445 -263248 -393466 -129029 190306 -142544
9497 -122959 -35962 229106 430119 -10196 166074 -213756 32407 -275376 110516 34043
9486 -68028 292323 1287 174266 85550 -319411 101914 -74601 -167030 -397409 30093 -211549
9474 279811 -163324 -267461 -96601 263978 -115882 -353428 -100310 -172211 -38615 335114
9463 -311999 129392 -38446 29509 -149301 -16138 -151302 93537 139543 -51903 -138267 -204735
9452b04735D69802c31286f8847j94031a380r5927b5222A47102I947J6763a06033
9440a33770d129p8086j56479c7106j01406j1529j54385C05046g7777B6240b55390
9428H4428M4803a62619q9141A16809c86787a19204j37528O9275A14518a63336
9417F6844a30846A98778g0318l06053a43516E7694b92537J19626N8293A16917
9406c57271C515b50491B8908J10422P6711b07475R1046a0306C3321a19172D8844
9394a08822D9523a08952A24034b15063B13347I3690a49531F2977i2906I2383a70512
9382b25734R1925n0143k15020g1739B91441a56862o8768B09772a47321q4516I5747
9370a1771B01453c25391a16289j25347h2415k88426I3248h8224D5945a24486J7424
$$ plain form
9452 -204735 469802 -331286 -68847 -262878 -1380 -97307 -25222 147102 9947 26710 -106033
9440 -133770 -4129 -82215 -238694 -37106 -138512 -150041 -304426 305046 -77777 26240 -255390
9428 84428 129231 -162619 -251760 116809 -386787 -119204 -256732 -187457 114518 -163336
9417 66844 -130846 198778 -70318 -376371 -143516 57694 -292537 -172911 -114618 116917
9406 -357271 3515 -250491 28908 139330 216041 -207475 -116429 -10306 33321 -119172 48844
9394 -108822 49523 -108952 124034 -215063 213347 93690 -149531 62977 -92906 92383 -170512
9382 -225734 -133809 -183952 -398972 -71739 291441 -156862 -225630 209772 -147321 -231837 95747
9370 -11771 201453 -325391 -116289 -241636 -82415 -370841 93248 -88224 45945 -124486 -107062
9359a07062j39657C78810A06547P552L1284C1803L5060c86425P5226Q3363A962
9347b56701A56752E4676e708o942A643b60775J12761p4772J03796j70718E02R1352
9335I1854i1206j43610a9523B40223H6004b17385J4699C4257J87571a72265d4697
9323A40282a92972H0025J92966i3354A02814J2141K06033e36669D3785a54442
9312b44662A64552f7234B0925M12028a17108A28557J54254b14814J56p8542M3436
9301b49764A77585b78877O0837f5526A91352a15434d1357A18849g0096k75484
9291c45580J49614D7a7388n7954l74085d8682B21297q7746D0139i757A05508j314
9279A04194M069H575f1289B38023m5692q8779B1497c5400j65834l8147A00259
$$ plain form
9359 -107062 -246719 378810 106547 114099 145383 31803 66863 -386425 -311199 -227836 1962
9347 -256701 156752 54676 -5708 -12650 1643 -260775 -148014 -222786 -118990 -289708 502 91854
9335 91854 -91206 -234816 -19523 240223 86004 -217385 -202686 34257 221828 -172265 -44697
9323 140282 -192972 80025 272991 -93354 102814 114955 320988 -536669 43785 -154442
9312 -244662 164552 -67234 20925 432953 -117108 128557 282811 -214814 -214658 -293200 -249764
9301 -249764 177585 -278877 -218040 -65526 191352 -115434 -41357 118849 -70096 -345580
9291 -345580 -195966 47 -17388 -75342 -449427 -48682 221297 133551 40139 -9757 105508 104194
9279 104194 108263 8575 -61289 238023 192331 103552 21497 -35400 -201234 -239381 100259
9267A9837d21430D5973A1896c36962j3882b2920j79095G2484K29669a77423d6481
9255c63816R2664A48420b2844j58027B33144I3780a06130A55074B1647c7549j37808
9244a75357H9108C4207b20295e2101A48360C0706J51652e65252A32097h9117j84916
9233b74033h5830m9692A99606F2888K02840b70010B87438g1550k57962a30270
9222A06613c79884C6249O7033J87784c58254Q8142E849f8317F327M5968B4025
9210b2755p2292k81870Q934k2295a67366B9425a07957K8595A1182d88162J06188
9199c81974F726a64795B0905P4504j8191J56280b38785k66330B20354C9124f5279
9187B4049K84996b76239A54a76113A0870Q4242a11543q7606e5484j05160A4254
$$ plain form
9267 19837 -421430 45973 11896 -336962 -350844 -22920 -202015 72484 302153 -177423 -46481
9255 -363816 -271152 148420 -22844 -180871 233144 93780 -106130 155074 21647 -37549 -175357
9244 -175357 89108 34207 -220295 -52101 148360 30706 182358 -565252 132097 -89117 -274033
9233 -274033 -85830 -135522 199606 62888 265728 -270010 287438 -71550 -329512 -130270
9222 106613 -379884 36249 103282 291066 -358254 -270112 5849 -68317 6327 52295 24025
9210 -22755 -95047 -376917 -367983 -390278 -167366 29425 -107957 -79362 11182 -488162 -381974
9199 -381974 6726 -164795 20905 95409 77218 233498 -238785 -505115 220354 39124 -65279
9187 24049 309045 -276239 154 -176113 10870 95112 -111543 -199149 -55484 -160644 14254
9175a8911l8843J7624B21494a5083j0049I7580a2227A41526a05562b8981B22849
9163b52264C24468B2452e8306b6459I6431R4705k2141D957h5139j19222i1455
9151G5805a7219j43577O4409k66275j7080E2545b00002B8412R9470E2574K49923
9140C02497j10982K33693a98752R2745d4409m7486E8980a45340J4597j42836E0108
9128A55157b24772A66835a87405E9454J467a58949G1557l1954a3195n8692j12963
9117a84850B71905H9105c30942h5538K7277A71548a0515A35674b65318c9077n8522
9106i7599B24842o1520a91710C66990b88268A6234b63137g5085j25245g7111p1136
9095a48247I3331j4947b6745k43029a02722B63199h3638H8622b15611J0524G6791
$$ plain form
9175 -18911 -57754 -40130 221494 -15083 -25132 97580 -12227 141526 -105562 -28981 222849
9163 -252264 324468 22452 -58306 -26459 96431 191136 168995 4957 -85139 -204361 -91455
9151 75805 -17219 -160796 -96387 -362662 -379742 52545 -200002 28412 127882 52574 302497
9140 302497 191515 425208 -198752 -106007 -44409 -91895 58980 -145340 -130743 -273579 50108
9128 155157 -224772 166835 -187405 59454 60921 -158949 71557 39603 -13195 -71887 -184850
9117 -184850 271905 89105 -330942 -85538 -58261 171548 -10515 135674 -265318 -39077 -97599
9106 -97599 224842 163322 -191710 366990 -288268 16234 -263137 -75085 -200330 -77111 -148247
9095 -148247 93331 78384 -26745 -269774 -102722 263199 -83638 88622 -215611 -205087 76791
9083g4290a5246B005a06634j5285C9286b5122k11408c7684f125A60155a8259j33877
9071a52136n0561q4232F3718a94804F9004a67308b9016B04046a33085j21121a10140
9059D3086g7589C7168a48752N4639Q436j8596G3692h5808F2695N9945E1883B4403
9046d5127A62024a91781A31214o1445e3524l91963I9233l364b78175K1019m8382
9035c05538a32051B39154b08558c3893F9565i8858j47294R4339B94969b54072
9024B36002b67363N69r4618M7986a30371e0901e437G8236a37055D65403j37516
9013C27887e5388k03196a01410j19898g2580A02714a33590C4557c33578a06763
9002a5669k48876G507a94865N4343m3695a3835j04019c0716C7646a68515A06777
$$ plain form
9083 -74290 -15246 2005 -106634 -121919 39286 -25122 -236530 -37684 -6125 160155 -18259 -152136
9071 -152136 -202697 -286929 63718 -194804 69004 -167308 -29016 204046 -133085 -254206 -110140
9059 43086 -77589 37168 -148752 -94113 -85677 -104273 73692 -85808 62695 122640 51883 24403
9046 -45127 162024 -191781 131214 69769 -53524 -445487 99233 95869 -278175 -257156 -305538
9035 -305538 -132051 239154 -208558 -33893 69565 -98858 -246152 -151813 294969 -254072
9024 236002 -267363 -266794 -361412 -313426 -130371 -50901 -5437 78236 -137055 465403 327887
9013 327887 -55388 -258584 -101410 -221308 -72580 102714 -133590 34557 -333578 -106763
9002 -15669 -264545 7507 -194865 -140522 -184217 -13835 -117854 -30716 37646 -168515 106777
8990a07348B72243a29833N7373p1004D8616M496d03064C5851J6949k5187N5292
8979H2905b11432H1612a84685c9582A8339O3899b25868D27749a00193A3874c14227
8967A73647q3301l3495b54915h6760b1374C58748C0036E634N6042b25601A47026
8955A08291g3179j26296C3705L0119B2988a42775j63971e8711i999j78075a2861
8943a43710D3487b31651C04951q3413a92997B0561J91375J18513j62782K29764
8933C97431A74488b19992f7514F2917K65074q5208R6336K52951J6557R62180J895854
8922C466661N658227Q238713E740256A463678G28738C27125j55352J83340A9886
8912H7689d4941m09317e8074K8000A73663J1837c76712a47342C2807a55632B17983
$$ plain form
8990 -107348 272243 -129833 -72460 -143464 48616 53112 -403064 35851 52800 27613 82905
8979 82905 -211432 81612 -184685 -39582 18339 82238 -225868 427749 -100193 13874 -314227
8967 173647 90346 56851 -254915 -86760 -21374 358748 30036 5634 61676 -225601 147026
8955 108291 -73179 -199475 33705 63824 22988 -142775 -306746 -58711 -9999 -188074 -12861
8943 -143710 43487 -231651 304951 221538 -192997 20561 211936 330449 167667 397431
8933 397431 174488 -219992 -67514 62917 327991 242783 339119 592070 608627 1570807 3466661
8922 3466661 9124888 17363601 5740256 1463678 728738 327125 171773 355113 19886
8912 87689 -44941 -454258 -58074 -30074 173663 185500 -376712 -147342 32807 -155632 217983
8900a32750B47403a77612K7403A04727a08699F1371J43871E124M3615J56487a78713
8888B43883C2582k795a92334E21103I5699Q6286E1117c17190a48275B25354c6700
8876A05001a57849j4081A16224N2225b86358G6564j7492O8336b69764L3292A9802
8864c06344e1412k59224a5478I3737f0834k19624J04075O6161Q139i521l95364
$$ plain form
8900 -132750 247403 -177612 -150209 104727 -108699 61371 205242 5124 48739 205226 -178713
8888 243883 32582 29787 -192334 521103 95699 181985 51117 -317190 -148275 225354 -36700
8876 105001 -157849 -171930 116224 168449 -286358 76564 59072 127408 -269764 -236472 19802
8864 -306344 -51412 -310636 -15478 93737 -60834 -280458 -176383 -110222 -102083 -9521 -404885
$$ [...]
##END NTUPLES=NMR SPECTRUM
##END=
