
##TITLE=UV1226_M6_1234-1212_70_7240115_p97Uzr14WF
##JCAMPDX= 6.0         $$ Bruker NMR JCAMP-DX V2.0
##DATA TYPE= NMR SPECTRUM
##DATA CLASS= NTUPLES
##ORIGIN= BRUKER
##OWNER= Administrator
$$ 1.72 TOPSPIN		Version 2.1
$$ 2013-01-23 23:32:36.151 -0500  Administrator@X
$$ Compression mode = diff/dup
##.OBSERVE FREQUENCY= 400.02188249412
##.OBSERVE NUCLEUS= ^1H
##.ACQUISITION MODE= SIMULTANEOUS (DQD)
##.ACQUISITION SCHEME= undefined
##.AVERAGES= 64
##.DIGITISER RES= 22
##SPECTROMETER/DATA SYSTEM= spect
##.PULSE SEQUENCE= noesygpps1d.comp
##.SOLVENT NAME= COFFEE_meoh
##.SHIFT REFERENCE= INTERNAL, COFFEE_meoh, 1, 14.96119
##AUDIT TRAIL= $$ (NUMBER, WHEN, WHO, WHERE, PROCESS, VERSION, WHAT)
$$ ##TITLE= Audit trail, TOPSPIN		Version 2.1
$$ ##JCAMPDX= 5.01
$$ ##ORIGIN= Bruker BioSpin GmbH
$$ ##OWNER= Administrator
$$ $$ E:\/data/COFFEE/nmr/UV1226_M6_1234-1212_70_7240115_p97Uzr14WF/32/pdata/1/auditp.txt
$$ ##AUDIT TRAIL=  $$ (NUMBER, WHEN, WHO, WHERE, PROCESS, VERSION, WHAT)
(   1,<2013-01-23 23:32:30.401 -0500>,<Administrator>,<X>,<go>,<TOPSPIN 2.1>,
      <created by zg
	started at 2013-01-23 23:21:00.480 -0500,
	POWCHK enabled, PULCHK disabled,
       configuration hash MD5:
       86 BA 57 50 F2 9D 5C 9B 26 00 A9 28 5F 66 2E 89
       data hash MD5: 64K
       60 9D B7 1F E7 2F 75 EF 24 E5 5D E3 1A 62 D1 DA>)
(   2,<2013-01-23 23:32:33.417 -0500>,<Administrator>,<X>,<proc1d>,<TOPSPIN 2.1>,
      <Start of raw data processing
       efp LB = 0.3 FT_mod = 6 PKNL = 1 PHC0 = 0 PHC1 = 0 SI = 128K 
       data hash MD5: 128K
       5B 83 4E 22 22 85 0F F8 D7 7A 77 9D 78 70 95 B9>)
(   3,<2013-01-23 23:32:34.433 -0500>,<Administrator>,<X>,<proc1d>,<TOPSPIN 2.1>,
      <pk PHC0 = -75.70679 PHC1 = 0 
       data hash MD5: 128K
       03 AA 47 FF 10 70 CE D8 4B 04 13 DC F6 72 F3 32>)
(   4,<2013-01-23 23:32:35.105 -0500>,<Administrator>,<X>,<proc1d>,<TOPSPIN 2.1>,
      <abs ABSG = 1 
       data hash MD5: 128K
       E2 1E 58 B4 FC 74 09 90 4E 9D DB 76 71 53 11 3A>)
(   5,<2013-01-23 23:32:35.276 -0500>,<Administrator>,<X>,<proc1d>,<TOPSPIN 2.1>,
      <abs ABSG = 2 
       data hash MD5: 128K
       7B CE 37 E9 E6 41 90 CC FF FD E5 78 8E 4A 8E 0D>)
(   6,<2013-01-23 23:32:35.448 -0500>,<Administrator>,<X>,<proc1d>,<TOPSPIN 2.1>,
      <abs ABSG = 3 
       data hash MD5: 128K
       B0 E3 7D B2 3E 68 18 72 26 9A 4C 1C 82 07 C5 AD>)
(   7,<2013-01-23 23:32:35.636 -0500>,<Administrator>,<X>,<proc1d>,<TOPSPIN 2.1>,
      <abs ABSG = 4 
       data hash MD5: 128K
       3C 24 52 35 E0 70 60 99 E6 74 B0 1B B4 BC D1 D8>)
(   8,<2013-01-23 23:32:35.808 -0500>,<Administrator>,<X>,<proc1d>,<TOPSPIN 2.1>,
      <abs ABSG = 5 
       data hash MD5: 128K
       95 BB C1 D0 E5 AD C4 07 98 EB BE 7C E8 86 4A 6D>)
$$ ##END=
$$ 
$$ $$ hash MD5
$$ $$ E6 86 81 85 25 94 AF DD 65 86 F5 16 88 90 1A 12
##$RELAX= 
##$RELAX= 
##$RELAX= 
##$RELAX= 
##$RELAX= 
##$RELAX= 
##$RELAX= 
##$RELAX= 
$$ Bruker specific parameters
$$ --------------------------
##$DU= <E:\>
##$EXPNO= 32
$$ [...]
##$TP07= 0
##$TPNAME0= <>
##$TPNAME1= <>
##$TPNAME2= <>
##$TPNAME3= <>
##$TPNAME4= <>
##$TPNAME5= <>
##$TPNAME6= <>
##$TPNAME7= <>
##$TPOAL= (0..7)
0.5 0.5 0.5 0.5 0.5 0.5 0.5 0.5
##$TPOFFS= (0..7)
0 0 0 0 0 0 0 0
##$TUNHIN= 0
##$TUNHOUT= 0
##$TUNXOUT= 0
##$USERA1= <user>
##$USERA2= <user>
##$USERA3= <user>
##$USERA4= <user>
##$USERA5= <user>
##$V9= 5
##$VALIST= <valist>
##$VCLIST= <CCCCCCCCCCCCCCC>
##$VD= 0
##$VDLIST= <DDDDDDDDDDDDDDD>
##$VPLIST= <PPPPPPPPPPPPPPP>
##$VTLIST= <TTTTTTTTTTTTTTT>
##$WBST= 1024
##$WBSW= 4
##$XGAIN= (0..3)
0 0 0 0
##$XL= 0
##$YL= 0
##$YMAX_a= 6441955
##$YMIN_a= -13058234
##$ZGOPTNS= <>
##$ZL1= 120
##$ZL2= 120
##$ZL3= 120
##$ZL4= 120
##$ABSF1= 14.96119
##$ABSF2= -5.596992
##$ABSG= 5
##$ABSL= 3
##$ALPHA= 0
##$AQORDER= 0
##$ASSFAC= 0
##$ASSFACI= 0
##$ASSFACX= 0
##$ASSWID= 0
##$AUNMP= <proc_prof1d_extract.lims>
##$AXLEFT= 0
##$AXNAME= <>
##$AXNUC= <1H>
##$AXRIGHT= 0
##$AXTYPE= 0
##$AXUNIT= <>
##$AZFE= 0.1
##$AZFW= 0.1
##$BCFW= 0
##$BC_mod= 0
##$BYTORDP= 0
##$COROFFS= 0
##$CY= 15
##$DATMOD= 1
##$DC= 0
##$DFILT= <>
##$DTYPP= 0
##$F1P= 0
##$F2P= 0
##$FCOR= 0.5
##$FTSIZE= 131072
##$FT_mod= 6
##$GAMMA= 0
##$GB= 0
##$INTBC= 1
##$INTSCL= 1
##$ISEN= 128
##$LB= 0.3
##$LEV0= 0
##$LPBIN= 0
##$MAXI= 10000
##$MC2= 0
##$MEAN= 0
##$ME_mod= 0
##$MI= 0
##$NCOEF= 0
##$NC_proc= -2
##$NLEV= 6
##$NOISF1= 0
##$NOISF2= 0
##$NSP= 0
##$NTH_PI= 0
##$NZP= 0
##$OFFSET= 14.96119
##$PC= 1
##$PHC0= -75.70679
##$PHC1= 0
##$PH_mod= 1
##$PKNL= yes
##$PPARMOD= 0
##$PPDIAG= 0
##$PPIPTYP= 0
##$PPMPNUM= 2147483647
##$PPRESOL= 1
##$PSCAL= 4
##$PSIGN= 0
##$PYNMP= <proc.py>
##$REVERSE= no
##$SF= 400.020009558797
##$SI= 131072
##$SIGF1= 0
##$SIGF2= 0
##$SINO= 400
##$SIOLD= 131072
##$SPECTYP= <>
##$SREGLST= <1H.CDCl3>
##$SSB= 0
##$STSI= 131072
##$STSR= 0
##$SW_p= 8223.68421052631
##$SYMM= 0
##$S_DEV= 0
##$TDeff= 65536
##$TDoff= 0
##$TI= <>
##$TILT= no
##$TM1= 0
##$TM2= 0
##$TOPLEV= 0
##$USERP1= <user>
##$USERP2= <user>
##$USERP3= <user>
##$USERP4= <user>
##$USERP5= <user>
##$WDW= 1
##$XDIM= 131072
##$YMAX_p= 414888492
##$YMIN_p= -11620
##$CURPLOT= <Network HP LaserJet P1505>
##$CURPRIN= <$Network HP LaserJet P1505>
##$DFORMAT= <normdp>
##$LAYOUT= <+/1D_H.xwp>
##$LFORMAT= <normlp>
##$PFORMAT= <normpl>
##$SURQMSG= 1
$$ End of Bruker specific parameters
$$ ---------------------------------
##NTUPLES= NMR SPECTRUM
##VAR_NAME=  FREQUENCY,     SPECTRUM/REAL,   SPECTRUM/IMAG
##SYMBOL=    X,             R,               I
##VAR_TYPE=  INDEPENDENT,   DEPENDENT,       DEPENDENT
##VAR_FORM=  AFFN,          ASDF,            ASDF
##VAR_DIM=   131072,        131072,          131072
##UNITS=     HZ,            ARBITRARY UNITS, ARBITRARY UNITS
##FACTOR=    0.0627417313425164, 1,          1
##FIRST=     8223.62146879497, 2965,         -62395
##LAST=      0,             5356,            -62609
##MIN=       0,             -11620,          0
##MAX=       8223.62146879497, 414888492,    0
$$ Real data points
##PAGE= N=1
##DATA TABLE= (X++(R..R)), XYDATA
$$ [...]
$$ plain form
63811 480100 462522 446039 430426 416286 404036 393324 383678 375072 367588 361058 355357 350489 346070
63798 346070 341292 335849 330398 325601 321179 316489 311577 306880 302180 296759 290672 285036 280775 277666
63784 277666 274994 272631 270980 270118 269486 268430 266710 264498 262137 260013 258440 257466 256808 256033 254856
63769 254856 253219 251161 248806 246538 244938 244292 244207 243985 243346 242511 241646 240598 239310 238100 237311 236986
63753 236986 237064 237511 238007 237918 237028 235983 235542 235710 236097 236828 238327 240346 242058 243251 244676 246875 249354
63736 249354 251325 252751 254212 256109 258469 261211 264193 267167 270116 273374 277128 281036 284744 288486
63722 288486 292727 297401 302062 306627 311474 316747 322056 326938 331201 334736 337349 338917 339432 338812 336979
63707 336979 334203 331107 328211 325602 323047 320226 316963 313581 310930 309649 309358 309046 308308 307712 307843
$$ packed form
63811D80100j7578j6483j5613j4140j2250j0712r646q606p484o530n701m868m419
63798C46070m778n443n451m797m422m690m912m697m700n421o087n636m261l109
63784B77666k672k363j651q62o32j056j720k212k361k124j573r74o58p75j177
63769B54856j637k058k355k268j600o46q5k22o39q35q65j048j288j210p89l25
63753B36986P8M47M96q9q90j045m41J68L87P31J499K019J712J193J425K199K479
63736B49354J971J426J461J897K360K742K982K974K949L258L754L908L708L742
63722B88486M241M674M661M565M847N273N309M882M263L535K613J568N15o20j833
63707C36979k776l096k896k609k555k821l263l382k651j281k91l12p38n96J31
$$ plain form
63692 307843 308562 309468 310517 311748 312902 313868 315170 317383 320274 323087 325542 327923 330241 331990 332922
63677 332922 333440 333982 334457 334656 334851 335598 337189 339651 343072 347499 352569 357621 362309 366821 371399 375832
63661 375832 379521 381894 382629 381681 379306 375995 372091 367457 361797 355391 349209 344019 339613 335272 330813
63646 330813 326670 323018 319470 315962 313293 312243 312491 313058 313648 314904 317312 320487 323713 326707 329541
63631 329541 332234 334779 337417 340607 344841 350511 357688 365876 374321 382784 391745 401624 412212 423246
63617 423246 435246 449147 465219 482910 501874 522561 545509 570469 596735 624130 653257
63606 653257 684704 718362 753637 790014 827017 863540 897546 926767 949761 966129 975777 978401
63594 978401 974114 964444 952151 939652 927624 915241 901611 886660 870675 853434 834270 812930
$$ packed form
63692C07843P19R06J049J231J154R66J302K213K891K813K455K381K318J749R32
63677C32922N18N42M75J99J95P47J591K462L421M427N070N052M688M512M578M433
63661C75832L689K373P35r48k375l311l904m634n660o406o182n190m406m341m459
63646C30813m143l652l548l508k669j050K48N67N90J256K408L175L226K994K834
63631C29541K693K545K638L190M234N670P177Q188Q445Q463Q961R879J0588J1034
63617D23246J2000J3901J6072J7691J8964K0687K2948K4960K6266K7395K9127
63606F53257L1447L3658L5275L6377L7003L6523L4006K9221K2994J6368R648K624
63594I78401m287r670j2293j2499j2028j2383j3630j4951j5985j7241j9164k1340
$$ plain form
63582 812930 790019 766379 742300 717738 693250 670278 650204 633334 619069 606953 597138 589762
63570 589762 584267 579834 576450 575118 576753 581067 586785 592848 599023 605409 611889 618389 625267 632994
63556 632994 641598 650889 661153 673087 687030 702745 720149 739806 762466 788509 818157 851852
63544 851852 889973 932311 978035 1025854 1073698 1118364 1156000 1183249 1198096 1200190 1191013 1173632
63532 1173632 1151671 1128109 1104899 1083233 1063527 1045225 1027271 1009031 990344 970661 948753
63521 948753 923610 895244 864332 831478 797241 762608 728959 697605 669441 644694 622691
63510 622691 602245 582770 564902 549619 536962 526073 516377 508063 501300 495507 489732 483448 476757
63497 476757 470091 463926 458571 453948 449636 445280 440907 436780 433129 430145 427962 426430 424999 423184
$$ packed form
63582H12930k2911k3640k4079k4562k4488k2972k0074j6870j4265j2116r815p376
63570E89762n495m433l384j332J635M314N718O063O175O386O480O500O878P727
63556F32994Q604R291J0264J1934J3943J5715J7404J9657K2660K6043K9648L3695
63544H51852L8121M2338M5724M7819M7844M4666L7636K7249J4847K094r177j7381
63532A173632k1961k3562k3210k1666j9706j8302j7954j8240j8687j9683k1908
63521I48753k5143k8366l0912l2854l4237l4633l3649l1354k8164k4747k2003
63510F22691k0446j9475j7868j5283j2657j0889r696q314o763n793n775o284o691
63497D76757o666o165n355m623m312m356m373m127l651k984k183j532j431j815
$$ plain form
63483 423184 421160 419731 419567 420604 422273 424254 426850 430525 435150 439903 443968 447234 450165 453069
63469 453069 455685 457404 457691 456302 453376 449429 445028 440344 435188 429591 424117 419404 415561 412196
63455 412196 408920 405646 402545 399974 398356 397903 398490 399975 402542 406482 411708 417798 424503 431912 440104
63440 440104 449029 458854 470119 483309 498504 515697 535238 557723 583532 612796 645700 682379
63428 682379 722105 762565 800149 831347 854275 869175 877686 881875 884006 886741 892777 903943
63416 903943 920894 943731 972489 1006695 1044858 1084874 1124807 1162848 1196749 1223950 1242537
63405 1242537 1251896 1252537 1245660 1232997 1216561 1198176 1179162 1160301 1141702 1122638 1101924 1078696
63393 1078696 1052655 1023628 991461 956682 920810 885482 851406 818571 787312 758644 733466
$$ packed form
63483D23184k024j429j64J037J669J981K596L675M625M753M065L266K931K904
63469D53069K616J719K87j389k926l947m401m684n156n597n474m713l843l365
63455D12196l276l274l101k571j618m53N87J485K567L940N226O090O705P409Q192
63440D40104Q925R825J1265J3190J5195J7193J9541K2485K5809K9264L2904L6679
63428F82379L9726M0460L7584L1198K2928J4900Q511M189K131K735O036J1166
63416I03943J6951K2837K8758L4206L8163M0016L9933L8041L3901K7201J8587
63405A242537R359O41o877j2663j6436j8385j9014j8861j8599j9064k0714k3228
63393A078696k6041k9027l2167l4779l5872l5328l4076l2835l1259k8668k5178
$$ plain form
63382 733466 711847 693212 676999 662960 651077 641405 633960 628674 625443 624198 624842 627204 631167
63369 631167 636839 644440 653990 665250 677970 692099 707717 724907 743776 764508 787328 812401
63357 812401 839752 869284 900910 934740 970997 1009583 1049729 1090142 1129369 1165803 1197468
63346 1197468 1222265 1238738 1246546 1246215 1238730 1225559 1208703 1190179 1171222 1152049 1132291 1111441
63334 1111441 1088981 1064508 1037976 1009650 979703 948049 914839 880963 847787 816378 787150
63323 787150 760247 736080 715379 698834 686669 678531 673855 672371 673944 677470 680077 678096 669245
63310 669245 653811 633722 611011 587348 564328 543285 524743 508519 494357 482167 471708
63299 471708 462510 454149 446352 438888 431720 425144 419373 414064 408698 403337 398420 393880 389153 384183
$$ packed form
63382G33466k1619j8635j6213j4039j1883r672p445n286l231j245O44K362L963
63369F31167N672P601R550J1260J2720J4129J5618J7190J8869K0732K2820K5073
63357H12401K7351K9532L1626L3830L6257L8586M0146M0413L9227L6434L1665
63346A197468K4797J6473P808l31p485j3171j6856j8524j8957j9173j9758k0850
63334A111441k2460k4473k6532k8326k9947l1654l3210l3876l3176l1409k9228
63323G87150k6903k4167k0701j6545j2165q138m676j484J573L526K607j981q851
63310F69245j5434k0089k2711k3663k3020k1043j8542j6224j4162j2190j0459
63299D71708r198q361p797p464p168o576n771n309n366n361m917m540m727m970
$$ plain form
63285 384183 379698 376244 373577 371339 369615 368354 366927 364931 362899 361527 360561 359224 357431 355835
63271 355835 354808 354090 353389 352607 351537 350006 348366 347225 346605 345944 345012 344186 343699 343238 342507 341677 341041
63254 341041 340738 341037 342330 344496 346675 348077 348705 349025 349288 349577 350219 351693 354180 357448 361129 364953
63238 364953 368846 372910 377226 381679 386195 391010 396391 402151 407976 414211 421642 430290 439096 447188
63224 447188 454851 462768 470919 478836 486440 493861 500799 506927 512831 519701 527985 536975 545773 554093
63210 554093 561977 569381 576279 582674 588203 592083 593781 593511 591876 589281 585795 581318 575662 568776
63196 568776 561054 553209 545698 538545 531903 526449 522875 521252 521248 522771 525996 530829 536844 543856 552200
63181 552200 562198 573596 585788 598438 611642 625507 639876 654513 669293 684025 698256 711506
$$ packed form
63285C84183m485l454k667k238j724j261j427j996k032j372r66j337j793j596
63271C55835j027p18p01p82j070j531j640j141o20o61r32q26m87m61p31q30o36
63254C41041l03K99J293K166K179J402O28L20K63K89O42J474K487L268L681L824
63238C64953L893M064M316M453M516M815N381N760N825O235P431Q648Q806Q092
63224D47188P663P917Q151P917P604P421O938O128N904O870Q284Q990Q798Q320
63210E54093P884P404O898O395N529L880J698k70j635k595l486m477n656o886
63196E68776p722p845p511p153o642n454l574j623mJ523L225M833O015P012Q344
63181E52200R998J1398J2192J2650J3204J3865J4369J4637J4780J4732J4231J3250
$$ plain form
63169 711506 723626 734695 744638 753273 760753 767579 773922 779184 782470 783286 781542 777126 769878 759884
63155 759884 747309 731958 713502 692372 670014 647921 626600 605811 585612 566757 549991
63144 549991 535311 522138 510024 499042 489534 481725 475646 471225 468243 466202 464405 462356 460108
63131 460108 458166 457023 456801 457247 458080 459324 461366 464615 469028 473990 478775 483152 487497 492272 497435
63116 497435 502494 507094 511401 515724 519913 523449 526216 528818 531904 535411 538846 542118 545588 549370
63102 549370 553137 556750 560512 564450 567836 569941 571056 572317 574615 578030 582114 586294 590033 593128
63088 593128 595940 598999 602337 605493 608209 610722 613281 615697 617518 618370 618018 616423 613920 611097 608292
63073 608292 605376 602147 598639 594941 591032 587104 583734 581282 579285 576914 574094 571785 571037 572123
$$ packed form
63169G11506J2120J1069R943Q635P480O826O343N262L286Q16j744m416p248r994
63155G59884j2575j5351j8456k1130k2358k2093k1321k0789k0199j8855j6766
63144E49991j4680j3173j2114j0982r508p809o079m421k982k041j797k049k248
63131D60108j942j143k22M46Q33J244K042L249M413M962M785M377M345M775N163
63116D97435N059M600M307M323M189L536K767K602L086L507L435L272L470L782
63102E49370L767L613L762L938L386K105J115J261K298L415M084M180L739L095
63088E93128K812L059L338L156K716K513K559K416J821Q52l52j595k503k823k805
63073F08292k916l229l508l698l909l928l370k452j997k371k820k309p48J086
$$ plain form
63059 572123 574752 578869 584898 593164 603262 614127 624863 635618 647581 661904 678627 696810
63047 696810 715685 735338 756178 778167 800900 824103 847552 870654 892721 913768 934493
63036 934493 955296 975784 995545 1014878 1034270 1053540 1072071 1089663 1106466 1122140 1135720
63025 1135720 1146451 1154174 1158709 1159373 1155427 1146667 1133394 1116202 1096002 1073812 1050242 1025477
63013 1025477 999996 974877 951100 928958 908564 890542 875725 864494 856870 852961 852781 855952
63001 855952 862197 871912 885541 902480 921318 941131 961887 983552 1005630 1027862 1050653 1074394
62989 1074394 1098763 1123074 1146892 1169976 1192007 1212693 1231813 1248907 1263361 1275206 1285321
62978 1285321 1294164 1300489 1301907 1296739 1284893 1267040 1243607 1214833 1181372 1144458 1105560 1066021
$$ packed form
63059E72123K629M117O029Q266J0098J0865J0736J0755J1963J4323J6723J8183
63047F96810J8875J9653K0840K1989K2733K3203K3449K3102K2067K1047K0725
63036I34493K0803K0488J9761J9333J9392J9270J8531J7592J6803J5674J3580
63025A135720J0731P723M535O64l946q760j3273j7192k0200k2190k3570k4765
63013A025477k5481k5119k3777k2142k0394j8022j4817j1231p624l909j80L171
63001H55952O245R715J3629J6939J8838J9813K0756K1665K2078K2232K2791K3741
62989A074394K4369K4311K3818K3084K2031K0686J9120J7094J4454J1845J0115
62978A285321Q843O325J418n168j1846j7853k3433k8774l3461l6914l8898l9539
$$ plain form
62966 1066021 1026832 988435 950792 913927 878510 845778 816672 791059 767940 746425 726325
62955 726325 707789 690668 674507 658940 643784 628859 614054 599509 585383 571444 557361
62944 557361 543432 530525 519063 508504 498162 488186 479294 471762 465125 458814 452709 447033 441975
62931 441975 437423 432972 428216 423260 418855 415810 414281 413704 413297 412397 410530 407683 404627 402543 401946
62916 401946 402107 401802 400635 399395 399032 399469 399674 398858 397419 396567 397114 398820 400878 402745 404399 405987
62900 405987 407590 409353 411603 414566 417942 421000 423260 425010 426950 429412 432221 435330 439067 443509
62886 443509 447994 451770 454842 457636 459986 461221 461350 461410 462211 463240 463345 462152 460247 458167 455812
62871 455812 452892 449465 445816 442086 438209 434119 429877 425619 421433 417275 413053 408821 404802 401182
$$ packed form
62966A066021l9189l8397l7643l6865l5417l2732k9106k5613k3119k1515k0100
62955G26325j8536j7121j6161j5567j5156j4925j4805j4545j4126j3939j4083
62944E57361j3929j2907j1462j0559j0342r976q892p532o637o311o105n676n058
62931D41975m552m451m756m956m405l045j529n77m07r00j867k847l056k084n97
62916D01946J61l05j167j240l63M37K05q16j439q52N47J706K058J867J654J588
62900D05987J603J763K250K963L376L058K260J750J940K462K809L109L737M442
62886D43509M485L776L072K794K350J235J29O0Q01J029J05j193j905k080k355
62871D55812k920l427l649l730l877m090m242m258m186m158m222m232m019l620
$$ plain form
62857 401182 397957 395036 392380 389896 387358 384636 382043 380219 379520 379516 379286 378326 377075 376331 376191 375924
62841 375924 375001 373826 373111 372931 372913 373079 373768 374776 375324 375025 374278 373508 372659 371758 371335 371803 372900 374180
62823 374180 375581 377026 377975 378036 377678 377644 377901 377869 377557 377725 378895 380790 382877 384916 386840 388568 390197
62806 390197 392029 394279 396936 399944 403241 406609 409761 412593 415168 417570 420112 423486 428202 433846
62792 433846 439320 443949 447969 451936 456176 461005 467028 474831 484512 495692 507946 521235 536078
62779 536078 553265 573183 595457 619543 645450 673406 702898 732655 761777 790329 818592
62768 818592 846194 872299 896174 917171 934536 947792 957118 962907 964970 962515 954918 942226
62756 942226 925063 904326 881001 855884 829366 801631 773130 744700 717112 690620 665091
$$ packed form
62857D01182l225k921k656k484k538k722k593j824o99mk30r60j251p44j40k67
62841C75924r23j175p15j80j8J66O89J008N48k99p47p70q49r01m23M68J097J280
62823C74180J401J445R49O1l58l4K57l2l12J68J170J895K087K039J924J728J629
62806C90197J832K250K657L008L297L368L152K832K575K402K542L374M716N644
62792D33846N474M629M020L967M240M829O023P803R681J1180J2254J3289J4843
62779E36078J7187J9918K2274K4086K5907K7956K9492K9757K9122K8552K8263
62768H18592K7602K6105K3875K0997J7365J3256R326N789K063k455p597j2692
62756I42226j7163k0737k3325k5117k6518k7735k8501k8430k7588k6492k5529
$$ plain form
62745 665091 640529 617300 595710 575480 555944 536891 518995 503167 489582 477614 466620
62734 466620 456537 447798 440985 436467 433962 432387 430567 428224 425982 424289 422776 420889 418752 417077
62720 417077 416499 417332 419678 423307 427505 431481 435026 438633 443001 448593 455576 463906 473410 483971
62706 483971 495701 508881 523743 540384 558834 579100 601131 624835 650138 677067 705831
62695 705831 736800 770295 806338 844737 885403 928328 973149 1018881 1064269 1108372 1150632
62684 1150632 1190378 1226301 1256456 1278874 1292351 1296694 1292263 1279494 1258964 1231625 1198489 1160178
62672 1160178 1117252 1071007 1023382 975831 928728 882183 837013 794538 755601 720107 687331
62661 687331 656453 627104 599777 575492 554674 536516 519805 504210 490301 478428 468104
$$ packed form
62745F65091k4562k3229k1590k0230j9536j9053j7896j5828j3585j1968j0994
62734D66620j0083q739o813m518k505j575j820k343k242j693j513j887k137j675
62720D17077n78Q33K346L629M198L976L545L607M368N592O983Q330R504J0561
62706D83971J1730J3180J4862J6641J8450K0266K2031K3704K5303K6929K8764
62695G05831L0969L3495L6043L8399M0666M2925M4821M5732M5388M4103M2260
62684A150632L9746L5923L0155K2418J3477M343m431j2769k0530k7339l3136l8311
62672A160178m2926m6245m7625m7551m7103m6545m5170m2475l8937l5494l2776
62661F87331l0878k9349k7327k4285k0818j8158j6711j5595j3909j1873j0324
$$ plain form
62650 468104 458605 449724 441743 434903 429086 423877 418833 413794 408941 404483 400360 396456 393008 390478
62636 390478 388960 388031 387290 386782 386686 386780 386521 385616 384320 383108 382176 381352 380374 379052 377171 374494 371145
62619 371145 367890 365663 364670 364170 363327 362133 361352 361671 363053 364815 366176 366834 367191 367956 369430 371252
62603 371252 372933 374453 376175 378332 380865 383744 387289 392111 398714 406954 415874 424432 432719 442227
62589 442227 454540 469779 486556 503254 518983 533479 546684 558613 569232 578150 584691 588463
62577 588463 589700 588801 585680 579810 570949 559690 547214 534527 521977 509514 497314 485874 475452
62564 475452 465656 455826 445724 435618 425864 416768 408799 402481 397845 394254 390971 387823 385169 383336
62550 383336 382153 380996 379213 376689 374095 372472 372390 373529 375154 376918 379037 381658 384255 385910 386245
$$ packed form
62650D68104r499q881p981o840n817n209n044n039m853m458m123l904l448k530
62636C90478j518r29p41n08r6R4k59r05j296j212r32q24r78j322j881k677l349
62619C71145l255k227r93n00q43j194p81L19J382J762J361O58L57P65J474J822
62603C71252J681J520J722K157K533K879L545M822O603Q240Q920Q558Q287R508
62589D42227J2313J5239J6777J6698J5729J4496J3205J1929J0619Q918O541L772
62577E88463J237q99l121n870q861j1259j2476j2687j2550j2463j2200j1440j0422
62564D75452r796r830j0102j0106r754r096p969o318m636l591l283l148k654j833
62550C83336j183j157j783k524k594j623q2J139J625J764K119K621K597J655L35
$$ plain form
62535 386245 385876 385764 386218 386818 387223 387684 388593 389949 391606 393796 396964 401136 405852 410803 416301 423038
62519 423038 431515 441703 453088 465117 477754 491555 507083 524433 543537 564643 588077 613638
62507 613638 640687 668770 697685 726880 755377 782427 807773 831018 851239 867618 880113
62496 880113 889070 894379 895529 892466 886068 877689 868484 859205 850488 843165 838088 835592 835304 836913
62482 836913 841067 848994 861025 875990 892422 909837 928242 946744 963490 976954 986587 992039
62470 992039 992477 987155 976229 960462 940273 915534 886255 853170 817622 781122 744950 709872
62458 709872 676086 643608 612819 584542 559573 538143 519847 503899 489492 476169 464059
62447 464059 453691 445463 439302 434870 431905 430152 429096 428016 426402 424237 421907 419992 419032 419200
$$ packed form
62535C86245l69j12M54O00M05M61R09J356J657K190L168M172M716M951N498O737
62519D23038Q477J0188J1385J2029J2637J3801J5528J7350J9104K1106K3434K5561
62507F13638K7049K8083K8915K9195K8497K7050K5346K3245K0221J6379J2495
62496H80113Q957N309J150l063o398q379r205r279q717p323n077k496k88J609
62482H36913M154P927J2031J4965J6432J7415J8405J8502J6746J3464R633N452
62470I92039M38n322j0926j5767k0189k4739k9279l3085l5548l6500l6172l5078
62458G09872l3786l2478l0789k8277k4969k1430j8296j5948j4407j3323j2110
62447D64059j0368q228o161m432k965j753j056j080j614k165k330j915r60J68
$$ plain form
62433 419200 420100 421069 421727 422071 422031 421272 419566 417095 414186 410995 407675 404603 402117 400189 398627 397414
62417 397414 396477 395322 393413 390943 388776 387505 386902 386396 385721 384923 384076 383253 382640 382450 382816 383742 384939
62400 384939 385744 385580 384748 384411 385496 387816 390526 393180 395975 399124 402503 406009 409896 414563 420162
62385 420162 426539 433440 440706 448358 456610 465682 475497 485591 495454 505009 514695 524974 535847
62372 535847 546959 558188 569869 582334 595493 609125 623521 639500 657765 678517 701729
62361 701729 727548 756329 788575 824978 866296 912915 964604 1020798 1080967 1144554 1210576
62350 1210576 1277436 1343079 1405335 1462237 1512099 1553259 1583905 1602560 1609042 1604801 1592015 1572292
62338 1572292 1546216 1513967 1476089 1433582 1387406 1338203 1286747 1234615 1183957 1136232 1091383
$$ packed form
62433D19200R00R69O58L44m0p59j706k471k909l191l320l072k486j928j562j213
62417C97414r37j155j909k470k167j271o03n06o75p98q47q23o13j90L66R26J197
62400C84939Q05j64q32l37J085K320K710K654K795L149L379L506L887M667N599
62385D20162O377O901P266P652Q252R072R815J0094R863R555R686J0279J0873
62372E35847J1112J1229J1681J2465J3159J3632J4396J5979J8265K0752K3212
62361G01729K5819K8781L2246L6403M1318M6619N1689N6194O0169O3587O6022
62350A210576O6860O5643O2256N6902M9862M1160L0646J8655O482m241j2786j9723
62338A572292k6076l2249l7878m2507m6176m9203n1456n2132n0658m7725m4849
$$ plain form
62327 1091383 1048649 1008000 970252 935855 904333 875076 847962 822737 798397 773909 749294
62316 749294 725467 703101 682098 662028 642631 623979 606567 591155 578061 566638 555881
62305 555881 545581 536546 529581 524530 520418 516319 512095 508438 506137 505137 504523 503657 503071 503806 506053
62290 506053 508976 511813 514604 517799 521696 526394 531785 537354 542337 546401 549918 553422 557035 560593
62276 560593 564034 567443 570922 574612 578748 583632 589658 597281 606649 617345 628870 641437 655874
62263 655874 672720 691925 713601 738541 767688 801500 840135 883848 932795 986762 1045454
62252 1045454 1108716 1175985 1245687 1315448 1382708 1444894 1499455 1544361 1578498 1601319 1612353
62241 1612353 1611560 1599865 1578725 1549185 1511811 1467370 1416959 1361519 1301960 1239952 1177908 1117776
$$ packed form
62327A091383m2734m0649l7748l4397l1522k9257k7114k5225k4340k4488k4615
62316G49294k3827k2366k1003k0070j9397j8652j7412j5412j3094j1423j0757
62305E55881j0300r035o965n051m112m099m224l657k301j000o14q66n86P35K247
62290E06053K923K837K791L195L897M698N391N569M983M064L517L504L613L558
62276E60593L441L409L479L690M136M884O026P623R368J0696J1525J2567J4437
62263F55874J6846J9205K1676K4940K9147L3812L8635M3713M8947N3967N8692
62252A045454O3262O7269O9702O9761O7260O2186N4561M4906L4137K2821J1034
62241A612353p93j1695k1140k9540l7374m4441n0411n5440n9559o2008o2044o0132
$$ plain form
62229 1117776 1060206 1005176 953020 904568 860603 821562 787439 757624 731039 706858 685019
62218 685019 665759 648783 633293 618811 605597 594106 584243 575294 566453 557329 548150 539573 532217
62205 532217 526158 520845 515636 510481 506051 503152 502074 502495 503889 505888 508347 511281 514797 518933
62191 518933 523591 528790 534931 542521 551576 561693 572806 585404 599626 614508 628690 641703
62179 641703 654114 666546 679069 691450 703417 714643 725078 735463 747014 760415 775622
62168 775622 792834 813135 837817 867568 902691 943599 990438 1042407 1097938 1155422 1213348
62157 1213348 1269922 1323028 1370606 1410870 1442440 1464749 1478233 1483681 1481433 1471479 1454118 1430013
62145 1430013 1399704 1363647 1322758 1278425 1231906 1184147 1136260 1089616 1045210 1003306 963897
$$ packed form
62229A117776n7570n5030n2156m8452m3965l9041l4123k9815k6585k4181k1839
62218F85019j9260j6976j5490j4482j3214j1491r863q949q841r124r179q577p356
62205E32217o059n313n209n155m430k899j078M21J394J999K459K934L516M136
62191E18933M658N199O141P590R055J0117J1113J2598J4222J4882J4182J3013
62179F41703J2411J2432J2523J2381J1967J1226J0435J0385J1551J3401J5207
62168G75622J7212K0301K4682K9751L5123M0908M6839N1969N5531N7484N7926
62157A213348N6574N3106M7578M0264L1570K2309J3484N448k248r954j7361k4105
62145A430013l0309l6057m0889m4333m6519m7759m7887m6644m4406m1904l9409
$$ plain form
62134 963897 927179 893470 863087 836433 813697 794249 776821 760704 746384 734577 725037 716834
62122 716834 709486 703211 698244 694555 692295 691883 693493 696807 701431 707169 713727 720633 727867 736342
62108 736342 747270 760967 776463 792254 807146 820335 831045 838523 842463 843255 841811 839402 837643
62095 837643 838146 841549 846752 851384 853252 851475 846581 839934 833065 827070 822398 819331 818577 820992 826618
62080 826618 834564 844160 855820 870392 887944 907727 929112 952055 976672 1002876 1030475 1059273
62068 1059273 1088914 1118884 1148826 1178781 1209211 1240855 1274335 1309644 1346131 1383149 1420351
62057 1420351 1456905 1490762 1519452 1541604 1557106 1565829 1567155 1561108 1549124 1532887 1512705 1487675
62045 1487675 1457335 1422492 1384340 1343358 1299463 1253046 1205459 1158400 1112973 1069490 1028130
$$ packed form
62134I63897l6718l3709l0383k6654k2736j9448j7428j6117j4320j1807r540q203
62122G16834p348o275m967l689k260m12J610L314M624N738O558O906P234Q475
62108G36342J0928J3697J5496J5791J4892J3189J0710P478L940P92j444k409j759
62095H37643N03L403N203M632J868j777m894o647o869n995m672l067p54K415N626
62080H26618P946R596J1660J4572J7552J9783K1385K2943K4617K6204K7599K8798
62068A059273K9641K9970K9942K9955L0430L1644L3480L5309L6487L7018L7202
62057A420351L6554L3857K8690K2152J5502Q723J326o047j1984j6237k0182k5030
62045A487675l0340l4843l8152m0982m3895m6417m7587m7059m5427m3483m1360
$$ plain form
62034 1028130 989449 954088 922130 893037 866177 841240 818238 797369 778831 762480 747723
62023 747723 734021 721436 710327 700565 691507 682708 674084 665278 655544 644694 633662 623598 614745
62010 614745 606616 599009 592260 586654 582119 578517 575792 573821 572535 572293 573733 577048 581605 586489
61996 586489 591287 596203 601460 606724 611206 614258 615789 616071 615261 613258 609897 605101 598941 591805 584330
61981 584330 576826 568906 560200 551387 543820 537990 533005 527856 522515 517382 512395 507423 502932 499423
61967 499423 496550 493673 491003 489283 488394 487279 485388 483348 481919 481078 480541 480484 481221 482608 484311 486380
61951 486380 489107 492490 496258 500371 505206 511269 518846 527863 538036 549251 561865 576517 593659
61938 593659 613404 635639 659949 685483 711355 737290 763520 789976 815944 840637 863665
$$ packed form
62034A028130l8681l5361l1958k9093k6860k4937k3002k0869j8538j6351j4757
62023G47723j3702j2585j1109r762r058q799q624q806r734j0850j1032j0064q853
62010F14745q129p607o749n606m535l602k725j971j286k42J440L315M557M884
61996E86489M798M916N257N264M482L052J531K82q10k003l361m796o160p136p475
61981E84330p504p920q706q813p567n830m985n149n341n133m987m972m491l509
61967D99423k873k877k670j720q89j115j891k040j429q41n37n7P37J387J703K069
61951D86380K727L383L768M113M835O063P577R017J0173J1215J2614J4652J7142
61938E93659J9745K2235K4310K5534K5872K5935K6230K6456K5968K4693K3028
$$ plain form
61927 863665 884789 903654 920126 934513 947079 957468 964826 968382 967803 963286 955510 945318 933364
61914 933364 920367 907797 897750 891711 889652 890702 894438 901226 911532 925342 942158 961160
61902 961160 981382 1001931 1021941 1040145 1054795 1064466 1068827 1068307 1063140 1053203 1038774 1020859 1000488
61889 1000488 978047 953705 928334 903524 880477 859112 838550 818375 799060 781036 763848
61878 763848 746660 729341 712505 696580 681491 667278 654387 643045 632974 624097 617024 612342
61866 612342 609835 608870 609255 611226 614888 620229 627464 636776 647871 660322 674277 690342 708864
61853 708864 729826 753425 780225 810750 845265 883814 925882 970117 1015026 1060031 1105216
61842 1105216 1149963 1192538 1231271 1265476 1294860 1318565 1335315 1344156 1344765 1337516 1323817 1306080
$$ packed form
61927H63665K1124J8865J6472J4387J2566J0389P358L556n79m517p776j0192j1954
61914I33364j2997j2570j0047o039k059J050L736O788J0306J3810J6816J9002
61902I61160K0222K0549K0010J8204J4650R671M361n20n167r937j4429j7915k0371
61889A000488k2441k4342k5371k4810k3047k1365k0562k0175j9315j8024j7188
61878G63848j7188j7319j6836j5925j5089j4213j2891j1342j0071q877p073m682
61866F12342k507r65L85J971L662N341P235R312J1095J2451J3955J6065J8522
61853G08864K0962K3599K6800L0525L4515L8549M2068M4235M4909M5005M5185
61842A105216M4747M2575L8733L4205K9384K3705J6750Q841O09p249j3699j7737
$$ plain form
61830 1306080 1286740 1267351 1248908 1232836 1221033 1214930 1214790 1220008 1229788 1243446 1260218 1278767
61818 1278767 1296809 1311438 1320199 1322002 1316928 1305312 1287242 1262814 1232449 1196835 1156846 1113752
61806 1113752 1069280 1025121 982262 940957 901421 864460 831211 802242 777061 754585 733953
61795 733953 714841 697192 681034 666516 653749 642497 632227 622653 614039 606825 601055 596254
61783 596254 591750 587090 582317 577941 574402 571473 568404 564777 560987 557703 555140 553125 551610 550715
61769 550715 550383 550365 550496 550664 550619 550298 550432 552286 556460 562219 568312 574205 580177 586425 592622 598455
61753 598455 604148 610088 616126 621596 626067 629767 633141 636163 638330 639291 639228 638544 637395 635725 633666
61738 633666 631577 629586 627378 624671 621797 619487 618046 617047 616034 615299 615594 617151 619337 621341 622927
$$ packed form
61830A306080j9340j9389j8443j6072j1803o103j40N218R780J3658J6772J8549
61818A278767J8042J4629Q761J803n074j1616j8070k4428l0365l5614l9989m3094
61806A113752m4472m4159m2859m1305l9536l6961l3249k8969k5181k2476k0632
61795G33953j9112j7649j6158j4518j2767j1252j0270r574q614p214n770m801
61783E96254m504m660m773m376l539k929l069l627l790l284k563k015j515q95
61769E50715l32j8J31J68m5l21J34J854M174N759O093N893N972O248O197N833
61753E98455N693N940O038N470M471L700L374L022K167R61o3o84j149j670k059
61738F33666k089j991k208k707k874k310j441r99j013p35K95J557K186K004J586
$$ plain form
61723 622927 624432 626343 629031 632541 636291 639256 640931 642044 643893 646969 650552 653669 656016 657804
61709 657804 659104 659597 658753 656156 652022 647505 644088 642265 641065 639170 636237 632822 629371 625887 622451
61694 622451 619400 616804 614270 611560 609040 607253 606249 605594 604839 603669 601778 598996 595681 592711 590767
61679 590767 589620 588262 585888 582687 579559 577100 575110 573157 571350 570247 570123 570659 571341 571892 572188
61664 572188 572027 571184 569667 567866 566481 566230 567374 569472 571749 573755 575524 577141 578517 579719 581179
61649 581179 583280 585892 588581 591171 593856 596869 600300 604087 607861 610892 612588 613179 613581 614417 615388
61634 615388 615681 614720 612371 608713 603967 598593 593166 588070 583407 579155 575264 571633 568214 565148 562648
61619 562648 560636 558656 556245 553371 550461 548038 546374 545364 544584 543490 541679 539063 535747 531772
$$ packed form
61723F22927J505J911K688L510L750K965J675J113J849L076L583L117K347J788
61709F57804J300M93q44k597m134m517l417j823j200j895k933l415l451l484l436
61694F22451l051k596k534k710k520j787j004o55p55j170j891k782l315k970j944
61679E90767j147j358k374l201l128k459j990j953j807j103j24N36O82N51K96
61664E72188j61q43j517j801j385k51J144K098K277K006J769J617J376J202J460
61649E81179K101K612K689K590K685L013L431L787L774L031J696N91M02Q36R71
61634F15388K93r61k349l658m746n374n427n096m663m252l891l631l419l066k500
61619E62648k012j980k411k874k910k423j664j010p80j094j811k616l316l975
$$ plain form
61605 531772 527003 521350 515030 508570 502519 497177 492514 488268 484103 479838 475622 471848 468784 466269
61591 466269 463831 461096 458060 455010 452277 450046 448280 446766 445239 443471 441230 438248 434363 429698
61577 429698 424629 419639 415241 411838 409338 406989 404019 400544 397507 395516 394098 392354 390057 387761
61563 387761 386011 384904 384302 384060 383939 383632 382951 381846 380317 378560 377084 376317 376090 375833 375310 374805 374610
61546 374610 374777 375458 376920 378949 380661 381302 380987 380411 380100 380246 380951 382239 383971 386044 388482 391110
61530 391110 393437 395203 396781 398626 400509 401771 402139 401875 401260 400421 399527 398576 397068 394519 391397 388885
61514 388885 387505 386508 384940 382812 380846 379466 378507 377730 377196 377101 377437 377764 377330 375651 373144 370966
61498 370966 369958 369899 369894 369325 368338 367621 367889 369340 371397 373104 373949 374173 374230 374255 374222 374272 374560 375006 375489 376102
$$ packed form
61605E31772m769n653o320o460o051n342m663m246m165m265m216l774l064k515
61591D66269k438k735l036l050k733k231j766j514j527j768k241k982l885m665
61577D29698n069m990m398l403k500k349k970l475l037j991j418j744k297k296
61563C87761j750j107o02k42j21l07o81j105j529j757j476p67k27k57n23n05j95
61546C74610J67O81J462K029J712O41l15n76l11J46P05J288J732K073K438K628
61530C91110K327J766J578J845J883J262L68k64o15q39q94r51j508k549l122k512
61514C88885j380r97j568k128j966j380r59p77n34r5L36L27m34j679k507k178
61498C70966j008n9nn69r87p17K68J451K057J707Q45K24N7K5l3N0K88M46M83O13
$$ plain form
61478 376102 376916 377681 378058 378055 377990 378215 379046 380643 382581 383841 383769 382897 382309 382301 382184 381351 379956 378518 377476
61459 377476 377296 378310 380060 381324 381314 380588 380369 381243 382876 384719 386367 387357 387264 386273 385267 385082 385850
61442 385850 387196 388801 390537 392184 393426 394275 395345 397502 401132 405812 410706 415222 419257 422935
61428 422935 426310 429321 431848 433767 435126 436333 437947 440161 442702 445438 448764 453014 457639 461514
61414 461514 464139 466048 467848 469333 469951 469737 469248 468685 467696 466066 464112 462161 460040 457359 454028
61399 454028 450227 446092 441731 437402 433390 429790 426647 424221 422853 422565 422966 423537 423875 423802 423493 423377
61383 423377 423630 423805 423289 422164 421293 421484 422786 424660 426605 428466 430355 432402 434514 436412 438018
61368 438018 439744 442163 445440 449317 453541 457963 462325 466408 470392 474575 478708 482213 485160 488358
$$ packed form
61478C76102Q14P65L77lo5K25Q31J597J938J260p2q72n88qj17q33j395j438j042
61459C77476j80J014J750J264j0p26k19Q74J633J843J648R90r3r91j006j85P68
61442C85850J346J605J736J647J242Q49J070K157L630M680M894M516M035L678
61428D22935L375L011K527J919J359J207J614K214K541K736L326M250M625L875
61414D61514K625J909J800J485O18k14m89n63r89j630j954j951k121k681l331
61399D54028l801m135m361m329m012l600l143k426j368k88M01N71L38p3l09j16
61383D23377K53J75n16j125q71J91J302J874J945J861J889K047K112J898J606
61368D38018J726K419L277L877M224M422M362M083L984M183M133L505K947L198
$$ plain form
61354 488358 492205 496203 500082 504670 510912 518542 526596 534886 544010 554105 564654 575642 587893
61341 587893 601834 616620 630957 644166 655963 665718 672702 676898 679008 679645 678863 676472 672497
61328 672497 667328 661588 655839 650243 644517 638371 631951 625814 620482 616077 612301 608704 605135 601958
61314 601958 599696 598390 597513 596610 595766 595278 595158 595369 596391 599036 603495 608937 614362 619651 625447 632152
61298 632152 639501 647263 655821 665512 675583 684300 690143 692504 691278 686550 679117 670712 662962 656230
61284 656230 650017 644298 639794 636901 635045 633395 631746 630445 629834 630124 631547 634283 638286 643390 649454
61269 649454 656297 663673 671511 680010 689338 699248 709129 718387 726849 734964 743629 753602 764975 777339
61255 777339 790427 804422 819633 836057 853240 870331 886246 900015 910975 918429 921416 919340
$$ packed form
61354D88358L847L998L879M588O242P630Q054Q290R124J0095J0549J0988J2251
61341E87893J3941J4786J4337J3209J1797R755O984M196K110O37p82k391l975
61328F72497n169n740n749n596n726o146o420o137n332m405l776l597l569l177
61314F01958k262j306q77r03q44m88j20K11J022K645M459N442N425N289N796O705
61298F32152P349P762Q558R691J0071Q717N843K361j226m728p433q405p750o732
61284F56230o213n719m504k893j856j650j649j301o11K90J423K736M003N104O064
61269F49454O843P376P838Q499R328R910R881R258Q462Q115Q665R973J1373J2364
61255G77339J3088J3995J5211J6424J7183J7091J5915J3769J0960P454K987k076
$$ plain form
61243 919340 912769 903048 891053 876942 861204 845140 829856 815393 801496 788713 778003 769462
61231 769462 762166 755284 748888 743570 739649 736798 734313 731807 729746 729068 730089 732154 734553 737321
61217 737321 740690 744241 747268 749688 751849 753623 754467 754372 753981 753663 753206 752615 752477 753156 754233 755235
61201 755235 756480 758650 761853 765618 769718 774542 780686 788593 798629 811186 826457 844193 863878
61188 863878 885216 908373 933563 960276 987046 1012143 1034482 1053843 1070401 1084354 1095884
61177 1095884 1105158 1112299 1117529 1121332 1124244 1126476 1127856 1128007 1126389 1122333 1115447 1106008 1094672 1081825
61163 1081825 1067476 1051685 1034681 1016646 997825 978852 960417 942522 924603 906614 889513
61152 889513 874339 861235 849736 839660 831222 824426 818837 814017 809974 807135 805923 806303 807652
$$ packed form
61243I19340o571r721j1995j4111j5738j6064j5284j4463j3897j2783j0710q541
61231G69462p296o882o396n318l921k851k485k506k061o78J021K065K399K768
61217G37321L369L551L027K420K161J774Q44r5l91l18m57n91j38O79J077J002
61201G55235J245K170L203L765M100M824O144P907J0036J2557J5271J7736J9685
61188H63878K1338K3157K5190K6713K6770K5097K2339J9361J6558J3953J1530
61177A095884R274P141N230L803K912K232J380J51j618m056o886r439j1336j2847
61163A081825j4349j5791j7004j8035j8821j8973j8435j7895j7919j7989j7101
61152H89513j5174j3104j1499j0076q438o796n589m820m043k839j212L80J349
$$ plain form
61139 807652 809139 810125 810098 808412 804597 798947 792367 785529 778613 771960 766458 762896 761393 761760 764019
61124 764019 768265 774387 782328 792267 804179 817679 832792 850385 871148 894421 918819 943862
61112 943862 970161 997977 1026451 1054575 1082249 1109900 1137479 1164253 1189411 1212544 1233624
61101 1233624 1252683 1269469 1283427 1294217 1302178 1307931 1311409 1311661 1307775 1299674 1287718 1271871 1251675
61088 1251675 1227110 1199212 1169762 1140323 1111468 1082841 1054070 1025620 998607 973814 951152
61077 951152 930172 910713 892819 876364 861193 847574 836026 826620 818808 812050 806348 801935
61065 801935 798707 796306 794595 793724 793707 794293 795360 797156 799986 803908 808948 815308 823077 831920 841487
61050 841487 852016 864149 878127 893585 910207 928176 947873 969490 993107 1018759 1046184
$$ packed form
61139H07652J487R86k7j686l815n650o580o838o916o653n502l562j503L67K259
61124G64019M246O122P941R939J1912J3500J5113J7593K0763K3273K4398K5043
61112I43862K6299K7816K8474K8124K7674K7651K7579K6774K5158K3133K1080
61101A233624J9059J6786J3958J0790P961N753L478K52l886q101j1956j5847k0196
61088A251675k4565k7898k9450k9439k8855k8627k8771k8450k7013k4793k2662
61077I51152k0980j9459j7894j6455j5171j3619j1548r406p812o758n702m413
61065H01935l228k401j711q71j7N86J067J796K830L922N040O360P769Q843R567
61050H41487J0529J2133J3978J5458J6622J7969J9697K1617K3617K5652K7425
$$ plain form
61039 1046184 1074801 1104239 1134652 1166368 1199498 1234019 1269776 1306112 1341974 1376882 1411553
61028 1411553 1447122 1483947 1521564 1559559 1597996 1637264 1678075 1721482 1768323 1818676 1872279
61017 1872279 1929325 1990305 2055192 2123408 2194620 2269104 2347553 2431356 2523121 2626192 2743371
61006 2743371 2876574 3027624 3198604 3391339 3607554 3850221 4124501 4437687 4799484
60997 4799484 5222889 5723930 6320056 7029865 7875267 8883525 10087428 11525340 13240760
60988 13240760 15275451 17652714 20357665 23323336 26420810 29449608 32144367 34228557
60980 34228557 35517164 36012459 35917175 35545295 35190885 35034659 35113137 35321378 35429314
60971 35429314 35132733 34157099 32376044 29868598 26876330 23697498 20590752 17730496
$$ packed form
61039A046184K8617K9438L0413L1716L3130L4521L5757L6336L5862L4908L4671
61028A411553L5569L6825L7617L7995L8437L9268M0811M3407M6841N0353N3603
61017A872279N7046O0980O4887O8216P1212P4484P8449Q3803R1765J03071J17179
61006B743371J33203J51050J70980J92735K16215K42667K74280L13186L61797
60997D799484M23405N01041N96126P09809Q45402J008258J203903J437912J715420
60988A3240760K034691K377263K704951K965671L097474L028798K694759K084190
60980C4228557J288607M95295r5284l71880l54410j56226P8478K08241J07936
60971C5429314k96581r75634j781055k507446k992268l178832l106746k860256
$$ plain form
60963 17730496 15207070 13045990 11230395 9721669 8474869 7446820 6598986 5898497
60955 5898497 5318118 4834961 4429335 4084815 3788454 3530034 3301382 3096701 2912661
60946 2912661 2747047 2597400 2461413 2338010 2226939 2127298 2037164 1954564 1877901 1805267
60936 1805267 1734286 1663268 1592156 1521971 1453722 1388236 1326559 1269722 1217948 1170596 1127014
60925 1127014 1087123 1051015 1018399 988857 962416 939342 919302 901169 883968 867807 853646
60914 853646 842296 833794 827519 822556 818059 813697 809832 807008 805242 804035 803026 802217 801427 799951
60900 799951 797091 792816 787611 781826 775467 768473 760888 752779 744212 735310 726132 716472 706010 694726
60886 694726 683048 671532 660532 650231 640803 632381 624880 618000 611473 605204 599145 593143 587086
$$ packed form
60963A7730496k523426k161080j815595j508726j246800j028049q47834p00489
60955E898497n80379m83157m05626l44520k96361k58420k28652k04681j84040
60946B912661j65614j49647j35987j23403j11071r9641r0134q2600p6663p2634
60936A805267p0981p1018p1112p0185o8249o5486o1677n6837n1774m7352m3582
60925A127014l9891l6108l2616k9542k6441k3074k0040j8133j7201j6161j4161
60914H53646j1350q502o275m963m497m362l865k824j766j207j009q09p90j476
60900G99951k860m275n205n785o359o994p585q109q567q902r178r660j0462j1284
60886F94726j1678j1516j1000j0301r428q422p501o880o527o269o059o002o057
$$ plain form
60873 587086 581161 575731 570931 566600 562800 560123 559179 559885 561668 564371 568518 574532 582006 590059 598164
60858 598164 606282 614319 621823 628312 633731 638487 643099 647848 652646 657176 661138 664423 667108 669349
60844 669349 671273 672905 674273 675577 677104 678749 679767 679290 677024 673127 667489 659681 649875 639319
60830 639319 629388 620384 611626 602593 593503 584853 576886 569687 563391 557984 553053 548042 542827 537917
60816 537917 533992 531258 529337 527840 526842 526591 526915 527372 528058 529782 533124 537674 542558 547409 552353
60801 552353 557342 562144 567007 572744 579937 588476 598052 608668 620439 633202 646651 660658 675235
60788 675235 690391 706323 723530 742346 762340 782470 801978 821052 840521 861056 882758
60777 882758 905396 928786 952730 976821 1000656 1024250 1047851 1071158 1093114 1112755 1129955
$$ packed form
60873E87086n925n430m800m331l800k677r44P06J783K703M147O014P474Q053Q105
60858E98164Q118Q037P504O489N419M756M612M749M798M530L962L285K685K241
60844F69349J924J632J368J304J527J645J018m77k266l897n638p808r806j0556
60830F39319r931r004q758r033r090q650p967p199o296n407m931n011n215m910
60816E37917l925k734j921j497r98k51L24M57O86J724L342M550M884M851M944
60801E52353M989M802M863N737P193Q539R576J0616J1771J2763J3449J4007J4577
60788F75235J5156J5932J7207J8816J9994K0130J9508J9074J9469K0535K1702
60777H82758K2638K3390K3944K4091K3835K3594K3601K3307K1956J9641J7200
$$ plain form
60766 1129955 1144947 1157417 1166675 1172437 1174775 1173420 1167919 1158557 1146212 1131052 1112277 1089684
60754 1089684 1064634 1038726 1012148 984331 955750 927903 901565 876132 850889 826106 802534
60743 802534 780545 760198 741580 724637 708977 694162 679877 665690 651181 636687 623379
60732 623379 612034 602010 592007 581682 572056 564372 558952 555160 552154 549644 548065 547897 548689 549076
60718 549076 548119 546351 545026 544536 544176 543358 542346 541555 540688 538922 535650 530821 524909 518759 513112 507933
60702 507933 502467 496236 489726 483801 478672 473867 469011 464219 459745 455620 451669 447588 443080 438185
60688 438185 433482 429602 426531 423760 421204 419577 419624 421249 423652 426118 428382 430427 432274 434056 436027
60673 436027 438396 441217 444389 447636 450489 452499 453585 454111 454530 455017 455508 456048 456900 458227 459729 460788
$$ packed form
60766A129955J4992J2470R258N762K338j355n501r362j2345j5160j8775k2593
60754A089684k5050k5908k6578k7817k8581k7847k6338k5433k5243k4783k3572
60743H02534k1989k0347j8618j6943j5660j4815j4285j4187j4509j4494j3308
60732F23379j1345j0024j0003j0325r626p684n420l792l006k510j579j68P92L87
60718E49076r57j768j325m90l60q18j012p91q67j766l272m829n912o150n647n179
60702E07933n466o231o510n925n129m805m856m792m474m125l951m081m508m895
60688D38185m703l880l071k771k556j627M7J625K403K466K264K045J847J782J971
60673D36027K369K821L172L247K853K010J086N26M19M87M91N40Q52J327J502J059
$$ plain form
60657 460788 460997 460541 460032 460106 461202 463562 467212 471968 477595 483981 491059 498636 506463 514424 522441
60642 522441 530114 536681 541469 544313 545462 545179 543595 540943 537778 534819 532395 530039 526820 522295
60628 522295 517119 512525 509220 506929 504893 502508 499527 496083 492698 489960 487954 486206 484305 482296
60614 482296 480301 478155 475718 473279 471242 469642 468335 467404 466943 466603 465906 464962 464356 464279 464310 464152 464044
60597 464044 464257 464680 465183 466001 467383 469176 471079 473016 474965 476705 478144 479680 481753 484134 486128
60582 486128 487495 488745 490399 492348 494176 495842 497761 500301 503465 507101 511279 516330 522571 530086
60568 530086 538816 548757 559931 572263 585708 600539 617312 636359 657436 679899 702997 725854
60556 725854 747331 766200 781479 792521 798896 800328 796726 788326 776097 762076 748805 737885
$$ packed form
60657D60788K09m56n09P4J096K360L650M756N627O386P078P577P827P961Q017
60642E22441P673O567M788K844J149k83j584k652l165k959k424k356l219m525
60628E22295n176m594l305k291k036k385k981l444l385k738k006j748j901k009
60614D82296j995k146k437k439k037j600j307r31m61l40o97r44o06p7L1j58j08
60597D64044K13M23N03Q18J382J793J903J937J949J740J439J536K073K381J994
60582D86128J367J250J654J949J828J666J919K540L164L636M178N051O241P515
60568E30086Q730R941J1174J2332J3445J4831J6773J9047K1077K2463K3098K2857
60556G25854K1477J8869J5279J1042O375J432l602q400j2229j4021j3271j0920
$$ plain form
60544 737885 729218 722045 716605 714209 715768 720974 729250 740920 756901 777527 802221 830228 861081
60531 861081 894087 927603 959114 986078 1006821 1020771 1028046 1028948 1023945 1014069 1001026 986677
60519 986677 972459 959310 947882 938498 930927 924516 918621 912910 907392 902487 899031 897811 898913
60506 898913 901724 905726 911057 918149 927100 937819 950645 966480 986260 1010606 1040119 1075724
60494 1075724 1118487 1169205 1228264 1295737 1371406 1454648 1544298 1638422 1734034 1827210 1913764
60483 1913764 1989913 2052240 2097294 2121775 2123486 2102075 2058822 1995986 1916557 1824413 1724118
60472 1724118 1620191 1516511 1416367 1322689 1237740 1162429 1096225 1038017 987044 942898 904942
60461 904942 872245 844205 820753 801577 785533 771315 758613 748053 739891 733237 726831 720224
$$ packed form
60544G37885q667p173n440k396J559N206Q276J1670J5981K0626K4694K8007L0853
60531H61081L3006L3516L1511K6964K0743J3950P275R02n003r876j3043j4349
60519I86677j4218j3149j1428r384p571o411n895n711n518m905l456j220J102
60506H98913K811M002N331P092Q951J0719J2826J5835J9780K4346K9513L5605
60494A075724M2763N0718N9059O7473P5669Q3242Q9650R4124R5612R3176Q6554
60483A913764P6149O2327M5054K4481J711k1411m3253o2836p9429r2144j00295
60472A724118j03927j03680j00144r3678q4949p5311o6204n8208n0973m4146l7956
60461I04942l2697k8040k3452j9176j6044j4218j2702j0560q162o654o406o607
$$ plain form
60449 720224 713836 708026 702390 695986 688044 678547 668306 658418 649583 641930 635433 630146 625942 622438
60435 622438 619549 617825 617717 618650 619347 619147 618554 618389 618800 619301 619361 618644 616978 614474 611593 608812 606252
60418 606252 603824 601711 600443 600463 601665 603387 604848 605668 606006 606147 606056 605574 605021 605148 606292 607891 609151
60401 609151 610009 611033 612568 614388 616211 618101 620258 622735 625518 628673 632215 635963 639619 642947
60387 642947 645912 648813 652228 656464 661038 664995 667869 670052 672137 674317 676614 679223 682195 685161
60373 685161 687899 690948 695025 699948 704818 709373 714532 721287 729579 738652 748058 757766 767561 776923
60359 776923 785532 793462 800813 807518 813577 819193 824587 830018 836170 844234 855305 869806 887764
60346 887764 909642 936593 969677 1008898 1053208 1101454 1152966 1206781 1260181 1308416 1346384
$$ packed form
60449G20224o388n810n636o404p942r497j0241r888q835p653o497n287m204l504
60435F22438k889j724j08R33O97k00n93j65M11N01O0p17j666k504k881k781k560
60418F06252k428k113j268K0J202J722J461Q20L38J41r1m82n53J27J144J599J260
60401F09151Q58J024J535J820J823J890K157K477K783L155L542L748L656L328
60387F42947K965K901L415M236M574L957K874K183K085K180K297K609K972K966
60373F85161K738L049M077M923M870M555N159O755Q292R073R406R708R795R362
60359G76923Q609P930P351O705O059N616N394N431O152Q064J1071J4501J7958
60346H87764K1878K6951L3084L9221M4310M8246N1512N3815N3400M8235L7968
$$ plain form
60335 1346384 1370825 1380943 1377156 1359757 1329061 1286699 1236357 1182928 1130709 1082211 1038371
60324 1038371 999533 965976 937698 914239 894982 879404 866862 856439 847455 840016 834662 831450
60312 831450 829772 829032 829118 830092 831941 834901 839711 847117 857295 870121 885961 905903 931118 962184
60298 962184 998985 1041009 1087469 1137082 1187814 1237149 1282842 1323473 1358110 1385558 1404187
60287 1404187 1412550 1409925 1396293 1372146 1338500 1296799 1248638 1195769 1140375 1084877 1031156 980277
60275 980277 933182 891114 854843 823808 796729 772995 752902 736525 723030 711303 700823
60264 700823 691579 683445 675910 668412 660843 653773 648075 644096 641252 638682 636197 634263 633143 632516
60250 632516 632023 631694 631627 631598 631339 630931 630649 630501 630164 629369 628248 627362 627293 628089 629124 629686 629676 629568 629880
$$ packed form
60335A346384K4441J0118l787j7399l0696m2362n0342n3429n2219m8498m3840
60324A038371l8838l3557k8278k3459j9257j5578j2542j0423q984p439n354l212
60312H31450j678p40Q6R74J849K960M810P406J0178J2826J5840J9942K5215L1066
60298I62184L6801M2024M6460M9613N0732M9335M5693M0631L4637K7448J8629
60287A404187Q363k625j3632k4147l3646m1701m8161n2869n5394n5498n3721n0879
60275I80277m7095m2068l6271l1035k7079k3734k0093j6377j3495j1727j0480
60264G00823r244q134p535p498p569p070n698l979k844k570k485j934j120o27
60250F32516m93l29o7k9k59m08k82j48l37p95j121q86o9P96J035N62j0j08L12
$$ plain form
60231 629880 631030 633539 637755 643268 649161 655009 661198 668059 675237 682154 688496 693789 697213 698538
60217 698538 698856 699564 700807 701627 701563 701221 701211 701315 701100 700757 700868 701752 703476 706207 710047 714536 718676
60200 718676 721564 722947 723288 723404 723922 724842 725608 725670 724972 723898 722912 722331 722273 722651 723283 724133 725383 727117
60182 727117 729034 730690 732017 733393 735103 736966 738628 740047 741416 742670 743465 743760 744096 745084 746832
60167 746832 749211 752454 757038 762961 769573 776202 782580 788561 793824 798045 800961 802045 800564 796333
60153 796333 790151 783099 775681 768054 760750 754540 749734 746241 744354 744831 747940 752845 758224 763327
60139 763327 768330 773934 780659 788264 795752 802164 807420 812235 817263 822682 828427 834220 839182 842009
60125 842009 841945 839313 834899 829237 822801 816405 810844 806318 802691 800158 799105 799344 800004 800442 800923 802169
$$ packed form
60231F29880J150K509M216N513N893N848O189O861P178O917O342N293L424J325
60217F98538L18P08J243Q20o4l42j0J04k15l43J11Q84J724K731L840M489M140
60200G18676K888J383L41J16N18R20P66O2o98j074r86n81n8L78O32Q50J250J734
60182G27117J917J656J327J376J710J863J662J419J369J254P95K95L36R88J748
60167G46832K379L243M584N923O612O629O378N981N263M221K916J084j481m231
60153G96333o182p052p418p627p304o210m806l493j887M77L109M905N379N103
60139G63327N003N604O725P605P488O412N256M815N028N419N745N793M962K827
60125H42009o4k632m414n662o436o396n561m526l627k533j053K39O60M38M81J246
$$ plain form
60109 802169 804364 806897 809149 811343 814375 818711 823673 828112 831674 834971 838492 841862 844423 846080
60095 846080 847116 847498 846872 845207 843003 840858 839032 837379 835412 832615 829015 825453 822983 822001 822143
60080 822143 822839 823713 824702 826106 828332 831089 832981 832448 829076 823514 816332 807699 798124 788526 779242
60065 779242 769751 759891 750654 743165 737441 732831 729216 726824 725061 722461 718016 712017 705394 698675
60051 698675 691711 684093 675637 666653 657811 649682 642590 637054 633893 633296 634137 635032 636014 638245 641919
60036 641919 645461 647385 648153 649407 651836 654645 656813 657980 658117 657226 655618 653876 652183 650095 647201
60021 647201 643624 639610 635030 629665 623697 617496 611101 604304 597232 590488 584698 580189 577151 575766
60007 575766 576025 577643 580446 584701 590787 598534 607202 616242 625887 636718 648716 661002 672569
$$ packed form
60109H02169K195K533K252K194L032M336M962M439L562L297L521L370K561J657
60095H46080J036L82o26j665k204k145j826j653j967k797l600l562k470r82J42
60080H22143O96Q74R89J404K226K757J892n33l372n562p182q633r575r598r284
60065G79242r491r860r237p489n724m610l615k392j763k600m445n999o623o719
60051F98675o964p618q456q984q842q129p092n536l161n97Q41Q95R82K231L674
60036F41919L542J924P68J254K429K809K168J167J37q91j608j742j693k088k894
60021F47201l577m014m580n365n968o201o395o797p072o744n790m509l038j385
60007E75766K59J618K803M255O086P747Q668R040R645J0831J1998J2286J1567
$$ plain form
59994 672569 682995 692227 699889 705217 707780 708031 706940 705111 702443 698598 693632 688110 682737 678032
59980 678032 674245 671358 669038 666715 663920 660569 656897 653210 649872 647384 646081 645569 644713 642482 638800
59965 638800 634473 630410 627123 624781 623390 622832 622951 623748 625305 627486 629884 632211 634551 637071 639603
59950 639603 641768 643549 645472 648086 651305 654425 656808 658406 659574 660448 660709 659960 658155 655577 652548
59935 652548 649257 645753 641996 638010 634091 630694 627988 625662 623355 621159 619438 618324 617753 617909 619123
59920 619123 621197 623214 624312 624400 623931 623242 622439 621727 621426 621615 622032 622467 623072 624159 625756 627442 628659
59903 628659 629221 629578 630562 632793 636236 640281 644223 647720 650810 653544 655716 657101 657889 658629 659684
59888 659684 661019 662686 665139 668685 672909 677128 681311 686010 691410 697002 702321 707448 712579 717621
$$ packed form
59994F72569J0426R232P662N328K563K51j091j829k668l845m966n522n373m705
59980F78032l787k887k320k323k795l351l672l687l338k488j303n12q56k231l682
59965F38800m327m063l287k342j391n58J19P97J557K181K398K327K340K520K532
59950F39603K165J781J923K614L219L120K383J598J168Q74K61p49j805k578l029
59935F52548l291l504l757l986l919l397k706k326k307k196j721j114n71J56J214
59920F19123K074K017J098Q8m69o89q03p12l01J89M17M35O05J087J597J686J217
59903F28659N62L57R84K231L443M045L942L497L090K734K172J385P88P40J055
59888F59684J335J667K453L546M224M219M183M699N400N592N319N127N131N042
$$ plain form
59874 717621 722445 727074 731307 734656 736944 738466 739124 737998 734414 729012 723012 716719 709582 701577
59860 701577 693643 686597 680401 674819 670102 666560 663914 661529 659045 656473 653966 651896 651029 652130
59846 652130 655318 659957 665220 670722 676701 683708 692140 702033 713365 726476 742004 760267 780672
59833 780672 801655 821159 837377 849441 857599 862742 865775 867386 868090 868076 866960 863857 857679 847336
59819 847336 832125 812524 790567 768860 748917 730637 713347 696950 681962 668926 658083
59808 658083 649327 642213 636162 630792 625936 621356 616785 612345 608521 605551 603143 600889 598602 596103
59794 596103 593141 589814 586637 583897 581258 578346 575284 572315 569340 566323 563773 562103 560759 558684
59780 558684 555614 552253 549173 546247 543361 540989 539666 539248 539060 538582 537807 537172 537291 538476 540329 542073
$$ packed form
59874G17621M824M629M233L349K288J522O58j126l584n402o000o293p137q005
59860G01577p934p046o196n582m717l542k646k385k484k572k507k070q67J101
59846F52130L188M639N263N502N979P007Q432R893J1332J3111J5528J8263K0405
59833G80672K0983J9504J6218J2064Q158N143L033J611P04j4j116l103o178j0343
59819H47336j5211j9601k1957k1707j9943j8280j7290j6397j4988j3036j0843
59808F58083q756p114o051n370m856m580m571m440l824k970k408k254k287k499
59794E96103k962l327l177k740k639k912l062k969k975l017k550j670j344k075
59780E58684l070l361l080k926k886k372j323m18j88m78p75o35J19J185J853J744
$$ plain form
59764 542073 543438 544909 546948 549330 551609 553892 556620 559685 562280 563755 564295 564621 565267 566328 567736
59749 567736 569578 572122 575565 579712 583976 587800 591072 593931 596238 597504 597467 596544 595550 595124 595523 596669
59733 596669 598103 599092 599220 598888 598823 599067 598864 597708 596049 594726 594035 593782 593889 594453 595303 596033 596539 597138
59715 597138 598088 599332 600754 602307 603730 604502 604339 603552 602755 602365 602481 603056 603981 605113 606332 607550
59699 607550 608710 609930 611553 613815 616516 619314 622262 625625 629180 632239 634572 636713 639019 640918
59685 640918 641550 640808 639188 637012 634412 631970 630574 630469 630915 631006 630507 629725 628880 627867 626421 624339
59669 624339 621540 618039 613922 609432 605117 601609 599013 596678 593917 590894 588434 587037 586527 586662 587596
59654 587596 589489 592077 594956 597998 601157 604144 606717 609132 611797 614511 616496 617341 617423 617146 616168
$$ packed form
59764E42073J365J471K039K382K279K283K728L065K595J475N40L26O46J061J408
59749E67736J842K544L443M147M264L824L272K859K307J266l7r23r94m26L99J146
59733E96669J434R89J28l32o5K44k03j156j659j323o91k53J07N64Q50P30N06N99
59715E97138R50J244J422J553J423P72j63p87p97l90J16N75R25J132J219J218
59699F07550J160J220J623K262K701K798K948L363L555L059K333K141K306J899
59685F40918O32p42j620k176k600k442j396j05M46R1m99p82q45j013j446k082
59669F24339k799l501m117m490m315l508k596k335k761l023k460j397n10J35R34
59654E87596J893K588K879L042L159K987K573K415K665K714J985Q45Q2k77r78
$$ plain form
59639 616168 613864 610340 606401 602582 598759 594884 591527 589302 588171 587746 587952 588828 589914 590488 590473 590516
59623 590516 591037 591669 591849 591529 591075 590826 590966 591512 592170 592442 592100 591345 590362 589022 587166 584885 582458
59606 582458 580311 579140 579476 580897 582203 582722 582965 583546 584046 583566 582048 580318 579053 578330 578051 578127 578251
59589 578251 578000 577289 576368 575482 574838 574670 574835 574556 573131 570845 568656 567083 565880 564621 563020 560790
59573 560790 557891 554950 552764 551282 549688 547565 545365 543575 542104 540740 539644 539035 538810 538766 538906
59558 538906 539396 540497 542475 545106 547349 548217 548078 548447 550254 552963 555561 557735 559746 561889 564517
59543 564517 568046 572467 577347 582631 588905 596554 605437 615845 628935 645353 664010 683000 701072
59530 701072 717177 729202 734748 733521 727984 721324 715533 711527 709955 711033 714112 718190 722763 727683
$$ packed form
59639F16168k304l524l939l819l823l875l357k225j131m25K06Q76J086N74j5M3
59623E90516N21O32J80l20m54k49J40N46O58K72l42p55r83j340j856k281k427
59606E82458k147j171L36J421J306N19K43N81N00m80j518j730j265p23k79P6J24
59589E78251k51p11r21q86o44j68J65k79j425k286k189j573j203j259j601k230
59573E60790k899k941k186j482j594k123k200j790j471j364j096o09k25m4J40
59558E38906M90J101J978K631K243Q68j39L69J807K709K598K174K011K143K628
59543E64517L529M421M880N284O274P649Q883J0408J3090J6418J8657J8990J8072
59530G01072J6105J2025N546j227n537o660n791m006j572J078L079M078M573M920
$$ plain form
59516 727683 732359 735698 736955 736261 734083 730381 724658 716802 707531 697802 688009 678053 667973 658010
59502 658010 648109 637973 627820 618591 611050 605027 599806 594904 590124 585297 580529 576496 573968 572973
59488 572973 572710 572234 571131 569757 569076 570004 572650 576375 580653 585446 590550 595226 599108 602981 607951
59473 607951 614143 620863 627705 634630 641103 646106 649233 651062 652196 652546 651894 650670 649884 650505 652981
59458 652981 657010 661771 666770 672566 680295 690508 702837 716643 731321 745980 759696 772405
59446 772405 784907 797496 809152 818509 825077 828953 829743 826555 819011 807749 793928 778644 762895
59433 762895 747667 733789 721737 711600 703170 696111 690135 685149 681319 679100 679086 681607 686491 693466
59419 693466 702707 714621 729086 745372 762973 782205 803686 827542 853286 880155 907188 933085
$$ packed form
59516G27683M676L339J257o94k178l702n723p856r271r729r793r956j0080r963
59502F58010r901j0136j0153r229p541o023n221m902m780m827m768m033k528r95
59488E72973k63m76j103j374o81R28K646L725M278M793N104M676L882L873M970
59473F07951O192O720O842O925O473N003L127J829J134L50o52j224p86O21K476
59458F52981M029M761M999N796P729J0213J2329J3806J4678J4659J3716J2709
59446G72405J2502J2589J1656R357O568L876P90l188p544j1262j3821j5284j5749
59433G62895j5228j3878j2052j0137q430p059n976m986l830k219j4K521M884O975
59419F93466R241J1914J4465J6286J7601J9232K1481K3856K5744K6869K7033K5897
$$ plain form
59407 933085 956196 974462 985275 985994 975425 955163 929352 902943 879852 862160 850360 844081
59395 844081 842529 844151 846024 844195 835363 818510 794999 767385 738401 710656 686302 666337
59383 666337 650329 637173 626202 617474 611103 606610 603130 600169 597935 596885 597150 598484 600532 602915
59369 602915 605168 606999 608631 610619 613243 616313 619622 623304 627585 632408 637524 642821 648430 654593
59355 654593 661509 669257 677847 687504 698797 712205 727532 744074 761420 779745 799276 819937
59343 819937 841664 864516 888094 911322 933287 953912 973235 990392 1004070 1013792 1019951 1022536
59331 1022536 1020734 1014208 1004115 992217 979253 964715 948075 929778 911007 892839 875773 859821
59319 859821 844857 830869 817979 806258 795598 785774 776579 767920 759900 752870 747241 743078 739904
$$ packed form
59407I33085K3111J8266J0813P19j0569k0262k5811k6409k3091j7692j1800o279
59395H44081j552J622J873j829q832j6853k3511k7614k8984k7745k4354j9965
59383F66337j6008j3156j0971q728o371m493l480k961k234j050K65J334K048K383
59369F02915K253J831J632J988K624L070L309L682M281M823N116N297N609O163
59355F54593O916P748Q590R657J1293J3408J5327J6542J7346J8325J9531K0661
59343H19937K1727K2852K3578K3228K1965K0625J9323J7157J3678R722O159K585
59331A022536j802o526j0093j1898j2964j4538j6640j8297j8771j8168j7066j5952
59319H59821j4964j3988j2890j1721j0660r824r195q659q020p030n629m163l174
$$ plain form
59306 739904 737048 734217 731675 729842 728852 728561 728894 730029 732265 735894 741199 748341 757081 766813 777167
59291 777167 788473 801375 816146 832811 851904 874373 900290 927883 954126 976004 990999
59280 990999 997127 993613 981770 964692 945794 927758 912546 901469 894801 891804 891647 894175 899595
59267 899595 907767 918057 929496 940690 949947 956188 959658 961197 960743 957112 949357 937848 923698
59254 923698 907580 889602 870188 850506 831833 814779 799308 785343 773035 762416 753120 744775
59242 744775 737657 732606 730097 729606 730171 731435 733823 737761 743177 749862 757824 766900 776222 784518 790957
59227 790957 795455 798153 798855 797112 792749 786196 778238 769370 759468 748279 736245 724495 713809
59214 713809 703932 694315 685252 677669 671815 666871 662137 657961 654975 652888 650791 648581 647297 647810
$$ packed form
59306G39904k856k831k542j833r90k91L33J135K236L629N305P142Q740R732J0354
59291G77167J1306J2902J4771J6665J9093K2469K5917K7593K6243K1878J4995
59280I90999O128l514j1843j7078j8898j8036j5212j1077o668k997j57K528N420
59267H99595Q172J0290J1439J1194R257O241L470J539m54l631p755j1509j4150
59254I23698j6118j7978j9414j9682j8673j7054j5471j3965j2308j0619r296q345
59242G44775p118n051k509m91N65J264K388L938N416O685P962R076R322Q296O439
59227G90957M498K698P02j743m363o553p958q868r902j1189j2034j1750j0686
59214G13809r877r617r063p583n854m944m734m176k986k087k097k210j284N13
$$ plain form
59200 647810 649735 652027 654248 656752 659801 663081 666219 669340 672880 677047 681723 686645 691489 695959
59186 695959 700186 704861 710514 716662 722162 726547 730543 735024 739971 744878 749730 754964 760732 766830
59172 766830 773216 779952 786721 793157 799774 807769 817577 828271 838768 849044 859592 870195 879866
59159 879866 887788 893762 897937 900652 902363 903067 901768 897040 888391 876841 864137 851625 839767
59146 839767 828319 816826 805169 793798 783337 774084 766020 759214 753910 750191 747732 745915 744131
59133 744131 742169 740508 740033 741223 743706 746754 749957 753232 756546 760089 764444 770129 777119 785244
59119 785244 794752 805857 817940 829954 841676 853844 866897 880215 892834 904359 914902 924580
59107 924580 933340 940883 946545 949720 950646 950356 949580 948098 945484 942029 938515 935375 932441 929279 925418
$$ packed form
59200F47810J925K292K221K504L049L280L138L121L540M167M676M922M844M470
59186F95959M227M675N653O148N500M385L996M481M947M907M852N234N768O098
59172G66830O386O736O769O436O617P995R808J0694J0497J0276J0548J0603R671
59159H79866P922N974M175K715J711P04j299m728q649j1550j2704j2512j1858
59146H39767j1448j1493j1657j1371j0461r253q064o806n304l719k459j817j784
59133G44131j962j661m75J190K483L048L203L275L314L543M355N685O990Q125
59119G85244R508J1105J2083J2014J1722J2168J3053J3318J2619J1525J0543R678
59107I24580Q760P543N662L175R26k90p76j482k614l455l514l140k934l162l861
$$ plain form
59092 925418 920480 914522 908169 902137 896733 891878 887362 882823 877701 871501 864031 855334 845674 835641
59078 835641 825815 816091 805716 794391 782925 772388 762969 754184 745906 738501 732055 726186 720753
59065 720753 716170 712741 710169 708073 706606 706043 705883 704951 702583 699362 696354 693881 691477 688906 686550
59050 686550 684637 682744 680568 678668 677747 677527 677149 676537 676461 677198 678068 678613 679372 681049 683540 686290 689016
59033 689016 691571 693707 695523 697679 700592 703924 707401 711567 717082 723848 731679 741298 753538 767755
59019 767755 782112 795461 807948 819674 829858 837773 843662 848102 850954 851456 849154 844473 838613
59006 838613 832992 828440 824828 821824 820016 820732 824615 830935 838531 846851 855686 864500 872659 880055
58992 880055 886973 893426 899053 903526 906693 908375 908420 906861 903660 898351 890365 879889 868122 856481
$$ packed form
59092I25418m938n958o353o032n404m855m516m539n122o200p470q697r660j0033
59078H35641r826r724j0375j1325j1466j0537r419q785q278p405o446n869n433
59065G20753m583l429k572k096j467n63j60r32k368l221l008k473k404k571k356
59050F86550j913j893k176j900r21k20l78o12p6P37Q70N45P59J677K491K750K726
59033F89016K555K136J816K156K913L332L477M166N515O766P831R619J2240J4217
59019G67755J4357J3349J2487J1726J0184P915N889M440K852N02k302m681n860
59006H38613n621m552l612l004j808P16L883O320P596Q320Q835Q814Q159P396
58992H80055O918O453N627M473L167J682M5j559l201n309p986j0476j1767j1641
$$ plain form
58978 856481 845714 835938 827318 820393 815645 813007 811975 812175 813661 816702 821499 828162 836787 847366
58964 847366 859626 872998 886719 900072 912787 925252 937982 950659 961871 970041 974425 975031
58952 975031 971842 964555 953068 937993 920659 902693 885346 868967 853293 838451 825354 814766
58940 814766 806325 799074 792781 788060 785152 783318 781686 780091 778613 776621 772920 766892 759216 751291
58926 751291 744003 737150 730104 722915 716443 711277 706942 702520 697861 693723 690824 689235 688704 689098 690357
58911 690357 692321 694778 697542 700582 704289 709352 715923 723138 730115 737349 746322 757612 770217 783091
58897 783091 796475 811125 826917 843084 859466 876647 894960 914147 934160 955621 979245
58886 979245 1005174 1033112 1062682 1093303 1123915 1153114 1179537 1202008 1219533 1231518 1238032 1239568
$$ packed form
58978H56481j0767r776q620o925m748k638j032K00J486L041M797O663Q625J0579
58964H47366J2260J3372J3721J3353J2715J2465J2730J2677J1212Q170M384O06
58952I75031l189p287j1487j5075j7334j7966j7347j6379j5674j4842j3097j0588
58940H14766q441p251o293m721k908j834j632j595j478j992l701o028p676p925
58926G51291p288o853p046p189o472n166m335m422m659m138k899j589n31L94J259
58911F90357J964K457K764L040L707N063O571P215O977P234Q973J1290J2605J2874
58897G83091J3384J4650J5792J6167J6382J7181J8313J9187K0013K1461K3624
58886I79245K5929K7938K9570L0621L0612K9199K6423K2471J7525J1985O514J536
$$ plain form
58874 1239568 1236335 1227968 1214137 1195375 1172976 1148072 1121245 1093247 1065647 1040220 1017797 998154
58862 998154 980912 965911 952616 939798 926332 912052 897471 882868 868085 853081 838201
58851 838201 823771 809679 795591 781490 767855 755327 744267 734636 726162 718500 711284 704288
58839 704288 697633 691684 686571 681844 676782 671010 664774 658728 653507 649357 645974 642771 639324 635477
58825 635477 631153 626555 622573 620320 619833 619840 619406 619306 620952 624362 628218 631832 635893 641031 646616 651492
58809 651492 655099 657427 658614 659299 660692 663483 666971 669926 671968 673458 674367 674221 673138 672001 671249
58794 671249 670162 667789 664202 660410 657256 654871 653127 652167 652302 653629 655994 659221 663187 667726 672691
58779 672691 678116 684079 690319 696274 701613 706436 710780 714171 715989 716004 714233 710596 705193 698778 692418
$$ packed form
58874A239568l233q367j3831j8762k2399k4904k6827k7998k7600k5427k2423j9643
58862I98154j7242j5001j3295j2818j3466j4280j4581j4603j4783j5004j4880
58851H38201j4430j4092j4088j4101j3635j2528j1060r631q474p662p216o996
58839G04288o655n949n113m727n062n772o236o046n221m150l383l203l447l847
58825F35477m324m598l982k253m87Pm34j00J646L410L856L614M061N138N585M876
58809F51492L607K328J187O85J393K791L488K955K042J490R09j46j083j137p52
58794F71249j087k373l587l792l154k385j744r60J35J327K365L227L966M539M965
58779F72691N425N963O240N955N339M823M344L391J818J5j771l637n403o415o360
$$ plain form
58764 692418 686664 681398 676347 671312 666037 660471 655185 651036 648400 647187 647463 649372 652423 655713
58750 655713 659096 663467 669506 676664 683753 690044 695569 700933 707219 715509 725942 737478 748917
58737 748917 759833 770376 780719 791175 802376 814767 828107 841769 855227 868055 879902
58726 879902 890871 901496 911953 921645 929951 936946 943001 948194 952654 957070 962229 968331 975294
58713 975294 983410 992926 1003104 1012363 1019500 1024378 1027363 1028422 1026851 1021756 1012835 1000644 985870
58700 985870 968463 948049 925189 901326 877129 851832 824966 797994 773226 751587 732443
58689 732443 715289 700427 687981 677292 667626 658789 650850 643796 637599 632103 626790 621168 615496
58676 615496 610647 607216 605182 604347 604524 605281 606164 607377 609727 613741 619253 625938 633872 643375 654646
$$ packed form
58764F92418n754n266n051n035n275n566n286m149k636j213K76J909L051L290
58750F55713L383M371O039P158P089O291N525N364O286Q290J0433J1536J1439
58737G48917J0916J0543J0343J0456J1201J2391J3340J3662J3458J2828J1847
58726H79902J0969J0625J0457R692Q306O995O055N193M460M416N159O102O963
58713I75294Q116R516J0178R259P137M878K985J059j571n095q921j2191j4774
58700I85870j7407k0414k2860k3863k4197k5297k6866k6972k4768k1639j9144
58689G32443j7154j4862j2446j0689r666q837p939p054o197n496n313n622n672
58676F15496m849l431k034q35J77P57Q83J213K350M014N512O685P934R503J1271
$$ plain form
58661 654646 667571 681496 695146 707224 717131 724783 729814 731592 730200 726827 722862 718871 714580
58648 714580 709525 703546 696935 690309 684139 678354 672575 666733 661245 656674 653502 652127 652595 654311
58634 654311 656413 658567 661118 664420 668271 671929 674438 675094 674091 672622 671837 671694 671320 670495 670150 671327
58618 671327 674263 678797 685034 693138 702800 713434 724679 736300 747712 758016 766590 773399 778603
58605 778603 781960 782779 780576 775708 769218 762041 754583 747086 740030 733843 728458 723503 718839 714681
58591 714681 711391 709424 709279 711156 714747 719658 725890 733646 742927 753599 765623 778865 792875
58578 792875 807186 821510 835271 847371 857060 864755 871466 877683 883465 889259 895837 903562 912591
58565 912591 923775 938474 957306 979725 1004886 1032172 1060680 1088955 1115654 1140087 1161883
$$ packed form
58661F54646J2925J3925J3650J2078R907P652N031J778j392l373l965l991m291
58648G14580n055n979o611o626o170n785n779n842n488m571l172j375M68J716
58634F54311K102K154K551L302L851L658K509O56j003j469p85j43l74q25l45J177
58618F71327K936M534O237Q104R662J0634J1245J1621J1412J0304Q574O809N204
58605G78603L357Q19k203m868o490p177p458p497p056o187n385m955m664m158
58591G14681l290j967j45J877L591M911O232P756R281J0672J2024J3242J4010
58578G92875J4311J4324J3761J2100R689P695O711O217N782N794O578P725R029
58565I12591J1184J4699J8832K2419K5161K7286K8508K8275K6699K4433K1796
$$ plain form
58554 1161883 1180554 1195482 1205974 1211394 1211775 1208261 1202289 1194277 1183753 1170746 1156280 1141322
58542 1141322 1126083 1110572 1095014 1079268 1062530 1044179 1024489 1004166 983704 963555 944407
58531 944407 926752 910480 895310 881362 869063 858822 850995 845811 843023 841940 842002 843058 844965
58518 844965 847308 849688 852003 854303 856747 859689 863385 867536 871590 875467 879369 882855 884897 885146
58504 885146 884387 883343 881698 878773 874600 869815 864869 859867 854878 849960 845068 840209 835485 830851
58490 830851 826173 821681 818009 815672 814872 815834 818739 823225 828597 834745 842269 851552 862384 874661
58476 874661 888570 903635 918425 931824 943947 955128 964626 971041 973615 972463 967928 960435 950761
58463 950761 939855 928496 917497 907880 900324 894659 890389 887563 886766 888382 892238 897807 904510 911941
$$ packed form
58554A161883J8671J4928J0492N420L81l514n972q012j0524j3007j4466j4958
58542A141322j5239j5511j5558j5746j6738j8351j9690k0323k0462k0149j9148
58531I44407j7655j6272j5170j3948j2299j0241p827n184k788j083O2J056J907
58518H44965K343K380K315K300K444K942L696M151M054L877L902L486K042K49
58504H85146p59j044j645k925m173m785m946n002m989m918m892m859m724m634
58490H30851m678m492l672k337q00R62K905M486N372O148P524R283J0832J2277
58476H74661J3909J5065J4790J3399J2123J1181R498O415K574j152m535p493r674
58463I50761j0906j1359j0999r617p556n665m270k826p97J616L856N569O703P431
$$ plain form
58449 911941 919892 927897 934726 938898 939888 938344 934928 929590 922344 914043 905836 898311 891713 886534
58435 886534 883235 881714 881595 882823 885490 889343 893852 898665 903683 908985 914946 922145 930868 940930
58421 940930 952047 963912 975801 986707 996135 1004221 1010949 1015961 1019390 1022025 1024131 1024899 1023657
58408 1023657 1020886 1017354 1012881 1006676 998432 988461 977361 966234 956656 949508 944151 939447 935245
58395 935245 932186 930507 929858 930039 931132 933002 935226 937396 939079 939846 939778 939586 939801 940262 940829 941995
58379 941995 944220 947242 950704 954863 959989 965617 971230 977157 983956 991387 998913 1006764 1015520 1025015
58365 1025015 1034681 1044785 1056248 1069257 1082963 1096623 1110241 1124065 1138166 1152597 1167262
58354 1167262 1181479 1194095 1204221 1211689 1217061 1221438 1225896 1230655 1235158 1239266 1243852 1249744 1256674
$$ packed form
58449I11941P951Q005O829M172R90j544l416n338p246q301q207p525o598n179
58435H86534l299j521j19J228K667L853M509M813N018N302N961P199Q723J0062
58421I40930J1117J1865J1889J0906R428Q086O728N012L429K635K106P68j242
58408A023657k771l532m473o205q244r971j1100j1127r578p148n357m704m202
58395I35245l059j679o49J81J093J870K224K170J683P67o8j92K15M61N67J166
58379I41995K225L022L462M159N126N628N613N927O799P431P526P851Q756R495
58365A025015R666J0104J1463J3009J3706J3660J3618J3824J4101J4431J4665
58354A167262J4217J2616J0126P468N372M377M458M759M503M108M586N892O930
$$ plain form
58341 1256674 1263934 1271595 1280328 1290422 1301646 1313687 1326108 1338365 1350583 1363881 1379164 1395938
58329 1395938 1412978 1429701 1446142 1461993 1476506 1489093 1499432 1507417 1513660 1519510 1525850 1532318
58317 1532318 1538356 1544414 1551286 1558906 1566728 1574839 1583820 1594020 1605678 1619159 1634193 1649618 1664840
58304 1664840 1680820 1698545 1717326 1735802 1753929 1772576 1791785 1810952 1830297 1850618 1871772
58293 1871772 1892816 1913534 1934600 1956422 1979121 2003456 2030382 2059642 2089977 2120727 2152238
58282 2152238 2184790 2218218 2252543 2288061 2324893 2363178 2403332 2445270 2487907 2530411 2573502
58271 2573502 2618583 2666172 2716141 2768665 2823734 2880537 2938721 2999545 3064424 3133054 3204377
58260 3204377 3278514 3356048 3436160 3517295 3599194 3682539 3767173 3852381 3938372 4025743 4114135
$$ packed form
58341A256674P260P661Q733J0094J1224J2041J2421J2257J2218J3298J5283J6774
58329A395938J7040J6723J6441J5851J4513J2587J0339P985O243N850O340O468
58317A532318O038O058O872P620P822Q111Q981J0200J1658J3481J5034J5425J5222
58304A664840J5980J7725J8781J8476J8127J8647J9209J9167J9345K0321K1154
58293A871772K1044K0718K1066K1822K2699K4335K6926K9260L0335L0750L1511
58282B152238L2552L3428L4325L5518L6832L8285M0154M1938M2637M2504M3091
58271B573502M5081M7589M9969N2524N5069N6803N8184O0824O4879O8630P1323
58260C204377P4137P7534Q0112Q1135Q1899Q3345Q4634Q5208Q5991Q7371Q8392
$$ plain form
58249 4114135 4203277 4294774 4390911 4492200 4597987 4708905 4826705 4952143 5085103 5226307
58239 5226307 5376989 5537323 5707130 5887555 6080120 6284918 6501787 6732404 6978992
58230 6978992 7241908 7520942 7817969 8135757 8475190 8836454 9221998 9635518 10079114
58221 10079114 10554512 11066044 11619240 12217635 12864294 13565370 14328741 15160724 16068144
58212 16068144 17062421 18157618 19366257 20701870 22184634 23840194 25695254 27780457
58204 27780457 30137191 32817635 35881975 39403760 43478139 48220928 53765672 60273333
58196 60273333 67946169 77027983 87800505 100598467 115832893 133989420 155593292
58189 155593292 181141892 210959752 244921016 282086968 320425029 356779290 387189776
$$ packed form
58249D114135Q9142R1497R6137J01289J05787J10918J17800J25438J32960J41204
58239E226307J50682J60334J69807J80425J92565K04798K16869K30617K46588
58230F978992K62916K79034K97027L17788L39433L61264L85544M13520M43596
58221A0079114M75398N11532N53196N98395O46659P01076P63371Q31983R07420
58212A6068144R94277J095197J208639J335613J482764J655560J855060K085203
58204B7780457K356734K680444L064340L521785M074379M742789N544744O507661
58196F0273333P672836R081814J0772522J2797962J5234426J8156527K1603872
58189A55593292K5548600K9817860L3961264L7165952L8338061L6354261L0410486
$$ plain form
58182 387189776 407601104 414888492 407870476 387778211 357849885 322262811 285003258
58175 285003258 249159078 216720076 188708284 165441194 146791655 132364698 121591118
58168 121591118 113790002 108209986 104015593 100263244 96004192 90553390 83740784 75915980
58160 75915980 67698440 59683139 52283379 45716061 40044258 35227690 31172738 27770415
58152 27770415 24912717 22498696 20442712 18678994 17156317 15831948 14672346 13653385
58144 13653385 12754543 11954709 11235053 10581915 9984321 9431828 8916706 8435078 7984098
58135 7984098 7560721 7164324 6797123 6460204 6151643 5869418 5613094 5381253 5170071
58126 5170071 4975727 4795715 4626686 4463697 4303064 4143981 3986603 3830950 3678640
$$ packed form
58182C87189776K0411328P287388p018016k0092265k9928326l5587074l7259553
58175B85003258l5844180l2439002k8011792k3267090j8649539j4426957j0773580
58168A21591118p801116n580016m194393l752349m259052n450802o812606p824804
58160G5915980q217540q015301p399760o567318n671803m816568m054952l402323
58152B7770415k857698k414021k055984j763718j522677j324369j159602j018961
58144A3653385q98842p99834p19656o53138n97594n52493n15122m81628m50980
58135G984098m23377l96397l67201l36919l08561k82225k56324k31841k11182
58126E170071j94344j80012j69029j62989j60633j59083j57378j55653j52310
$$ plain form
58117 3678640 3533156 3396985 3270105 3151906 3042503 2941405 2847108 2758938 2677378 2601804
58107 2601804 2529902 2460148 2392977 2328710 2266233 2204692 2144752 2087166 2031611 1977761 1926141
58096 1926141 1877167 1830606 1786505 1745323 1706759 1669829 1634486 1601750 1571939 1544260 1518400
58085 1518400 1494966 1473974 1454384 1435448 1416989 1398147 1377531 1355007 1331725 1308021 1282934
58074 1282934 1256203 1229059 1202672 1177386 1153740 1132317 1112167 1091355 1069809 1049707 1032262
58063 1032262 1016061 999601 983617 969614 957610 946723 936699 927495 918330 908432 897990 887441
58051 887441 876555 865025 853223 841741 830935 821339 813432 806487 798763 789501 779684 770318 761231
58038 761231 752227 743988 736849 729854 722145 714285 707106 700162 692421 683740 674601 665085 655167 645423
$$ packed form
58117C678640j45484j36171j26880j18199j09403j01098r4297q8170q1560p5574
58107B601804p1902o9754o7171o4267o2477o1541n9940n7586n5555n3850n1620
58096A926141m8974m6561m4101m1182l8564l6930l5343l2736k9811k7679k5860
58085A518400k3434k0992j9590j8936j8459j8842k0616k2524k3282k3704k5087
58074A282934k6731k7144k6387k5286k3646k1423k0150k0812k1546k0102j7445
58063A032262j6201j6460j5984j4003j2004j0887j0024r204r165r898j0442j0549
58051H87441j0886j1530j1802j1482j0806r596p907o945p724r262r817r366r087
58038G61231r004q239p139o995p709p860p179o944p741q681r139r516r918r744
$$ plain form
58024 645423 636458 628048 619729 611760 604660 598155 591434 584212 576973 570420 565088 561118 557980 554798
58010 554798 551195 547412 543517 539303 535168 532199 530904 530663 530846 531600 533026 534491 535495 536494 538236
57995 538236 540872 544228 548189 552244 555468 557622 559592 562033 564266 565221 564854 563884 562685 561177 559330
57980 559330 557149 554513 551538 548576 545484 541544 536612 531603 527293 523417 519577 516254 514073 512749
57966 512749 511632 510754 510467 510592 510752 511134 512132 513687 515708 518597 522457 526247 528748 530030 531042 531971
57950 531971 532029 530702 528287 525148 521374 517327 513763 511105 509125 507552 506568 506512 507297 508318 508899 508986
57934 508986 509490 511666 515956 521646 527757 533870 539881 545533 550660 555502 560345 565081 569413 573100
57920 573100 575668 576458 575469 573664 571822 569429 565382 559554 552969 546575 540473 534389 528386 522923 518450
$$ packed form
58024F45423q965q410q319p969p100o505o721p222p239o553n332l970l138l182
58010E54798l603l783l895m214m135k969j295k41J83P54J426J465J004R99J742
57995E38236K636L356L961M055L224K154J970K441K233R55l67r70j199j508j847
57980E59330k181k636k975k962l092l940m932n009m310l876l840l323k181j324
57966E12749j117q78k87J25J60L82R98J555K021K889L860L790K501J282J012R29
57950E31971N8j327k415l139l774m047l564k658j980j573r84n6P85J021N81Q7
57934E08986N04K176M290N690O111O113O011N652N127M842M843M736M332L687
57920E73100K568P90r89j805j842k393m047n828o585o394o102o084o003n463m473
$$ plain form
57905 518450 514959 511874 508519 504708 500636 496190 490893 484651 477957 471048 463513 455273 447419 441352
57891 441352 437308 434211 430877 426970 423022 419854 417846 416532 415123 413470 412039 410875 409339 407309
57877 407309 405936 406485 408807 411495 413251 413569 412483 410248 407170 403406 399114 394930 391706 389404 386800
57862 386800 382798 377607 372242 367468 363776 361704 361363 362078 363220 365022 367868 371297 374587 378036 382747
57847 382747 389244 397086 405671 414600 423287 431077 437964 444566 451206 457420 462498 466155 468662 470537
57833 470537 472079 472978 472574 470684 467923 465041 462345 460017 458378 457365 456249 454523 452637 451291 450355
57818 450355 449118 447267 445090 443050 441683 441426 441960 442216 441623 440787 440221 439172 436755 433615 431125 429265
57802 429265 426631 422496 417557 412569 407466 402116 396813 391602 386026 379973 374028 368705 364068 360370
$$ packed form
57905E18450l491l085l355l811m072m446n297o242o694o909p535q240p854o067
57891D41352m044l097l334l907l948l168k008j314j409j653j431j164j536k030
57877D07309j373N49K322K688J756L18j086k235l078l764m292m184l224k302k604
57862C86800m002n191n365m774l692k072l41P15J142J802K846L429L290L449M711
57847C82747O497P842Q585Q929Q687P790O887O602O640O214N078L657K507J875
57833D70537J542Q99m04j890k761k882k696k328j639j013j116j726j886j346r36
57818D50355j237j851k177k040j367k57N34K56n93q36n66j049k417l140k490j860
57802D29265k634m135m939m988n103n350n303n211n576o053n945n323m637l698
$$ plain form
57788 360370 358233 357776 358244 358961 360142 362317 365368 368493 370917 372510 373984 376423 380200 384463 388199
57773 388199 391650 395942 401389 407008 411819 415815 419459 422991 426492 429899 432560 433405 431946 428629
57759 428629 424030 418289 411532 404099 396041 387031 377217 367571 358974 351510 345049 339914 336414 334190
57745 334190 332585 331342 330417 329440 327850 325365 321927 317493 312342 307389 303637 301307 299808 298525 297368
57730 297368 296586 296292 296330 296599 297443 299452 302647 306059 308576 310096 311382 312817 313915 314185 313905 313722
57714 313722 313945 314461 314934 314834 313716 311821 310034 308951 308306 307555 306574 305436 303893 301649 298927 296339
57698 296339 294301 292942 292488 293260 295188 297569 299479 300458 300820 301303 302366 303849 305355 306898 308964
57683 308964 311999 316038 320800 325986 331620 338342 347217 358957 373529 390872 411764 437513 468993
$$ packed form
57788C60370k137m57M68P17J181K175L051L125K424J593J474K439L777M263L736
57773C88199L451M292N447N619M811L996L644L532L501L407K661Q45j459l317
57759D28629m599n741o757p433q058r010r814r646q597p464o461n135l500k224
57745C34190j605j243r25r77j590k485l438m434n151m953l752k330j499j283j157
57730B97368p82k94L8K69Q44K009L195L412K517J520J286J435J098K70k80j83
57714C13722K23N16M73j00j118j895j787j083o45p51r81j138j543k244k722k588
57698B96339k038j359m54P72J928K381J910R79L62M83J063J483J506J543K066
57683C08964L035M039M762N186N634O722Q875J1740J4572J7343K0892K5749L1480
$$ plain form
57670 468993 506673 551549 605254 668947 742396 823833 909612 993438 1066633 1120020 1146156
57659 1146156 1140827 1104217 1041636 962419 876740 792563 714803 646037 587144 537715 496760
57648 496760 463305 436292 414388 396366 381502 369274 359000 350113 342516 336152 330482 324915
57636 324915 319612 315363 312590 310905 309760 309165 309464 310434 310950 309867 307306 304743 303456 303098 302256 300251
57620 300251 297811 295956 294888 294179 293437 292429 291036 289462 288138 287192 286379 285732 285733 286562 287680 288584 289446
57603 289446 290577 291734 292484 292867 293188 293499 293821 294502 295700 296780 296829 295637 293616 291006 287766 284173
57587 284173 280865 278225 276223 274841 274134 273844 273400 272458 271106 269576 268103 267036 266668 266824 266916 266454
57571 266454 265289 263426 260952 258201 255660 253605 251997 250708 249621 248555 247354 246131 245210 244809 244859
$$ packed form
57670D68993L7680M4876N3705O3693P3449Q1437Q5779Q3826P3195N3387K6136
57659A146156n329l6610o2581p9217q5679q4177p7760o8766n8893m9429m0955
57648D96760l3455k7013k1904j8022j4864j2228j0274q887p597o364n670n567
57636C24915n303m249k773j685j145n95K99R70N16j083k561k563j287l58q42k005
57620C00251k440j855j068p09p42j008j393j574j324r46q13o47JQ29J118R04Q62
57603B89446J131J157P50L83L21L11L22O81J198J080M9j192k021k610l240l593
57587B84173l308k640k002j382p07k90m44r42j352j530j473j067l68J56R2m62
57571B66454j165j863k474k751k541k055j608j289j087j066j201j223r21m01N0
$$ plain form
57556 244859 245105 245276 245301 245526 246551 248613 251229 253661 255605 257231 258744 260173 261418 262213 262233 261576
57540 261576 260972 261167 262206 263637 265231 267049 268965 270677 272180 273658 274812 274839 273346 270889 268367
57525 268367 266179 264186 262182 260059 257725 255216 252871 251102 250024 249466 249330 249739 250774 252263 253964
57510 253964 255846 257970 260159 262083 263841 266140 269492 273350 276472 278259 279310 280515 282001 283248
57496 283248 283851 283734 282825 281026 278521 275801 273310 271269 269754 268692 267845 267041 266421 266199 266253 266286 266413
57479 266413 267106 268343 269099 268196 265693 263057 261718 261605 261386 260079 258024 256172 254885 253797 252617
57464 252617 251535 250904 250976 251959 253866 256147 257877 258498 258232 257759 257726 258525 260121 261983 263539 264737 265844
57447 265844 266826 267442 267876 268584 269465 269918 269925 270306 271612 273475 275406 277391 279241 280224 280037 279458 279331 279560
$$ packed form
57556B44859K46J71K5K25J025K062K616K432J944J626J513J429J245P95K0o57
57540B61576o04J95J039J431J594J818J916J712J503J478J154K7j493k457k522
57525B68367k188j993k004k123k334k509k345j769j078n58j36M09J035J489J701
57510B53964J882K124K189J924J758K299L352L858L122J787J051J205J486J247
57496B83248O03j17r09j799k505k720k491k041j515j062q47q04o20k22N4L3J27
57479B66413O93J237P56r03k503k636j339j13k19j307k055j852j287j088j180
57464B52617j082o31P2R83J907K281J730O21k66m73l3P99J596J862J556J198J107
57447B65844R82O16M34P08Q81M53PL81J306J863J931J985J850R83j87n79j27K29
$$ plain form
57429 279560 279800 280337 281337 281971 281494 280679 280820 281635 281616 280428 279531 280080 281490 282596 283155 283561 283899 283935
57411 283935 283560 282794 281850 281443 282318 284099 285304 285017 283919 283178 282905 282382 281347 280311 279859 280197 281226
57394 281226 282554 283614 284200 284771 285847 287343 288896 290581 292726 295139 297087 298084 298329 298349 298674 299803
57378 299803 301884 304225 305590 305458 304745 304920 306491 308666 310373 311190 311282 310938 310491 310392 310893 311767 312660
57361 312660 313636 315017 316726 318252 319314 320141 320983 321805 322614 323577 324592 325203 325318 325522 326299 327402 328470
57344 328470 329749 331574 333544 334974 335898 336854 337847 338366 338417 338738 339814 341335 342787 344030 345176 346438
57328 346438 348182 350583 353105 354880 355705 356121 356466 356499 356116 355730 355628 355615 355657 356293 357902 359982 361595
57311 361595 362253 362113 361611 361214 361212 361461 361592 361657 362229 363664 365656 367738 369908 372485 375640 379219 382762
$$ packed form
57429B79560K40N37J000O34m77q15J41Q15j9j188q97N49J410J106N59M06L38L6
57411B83935l75p66r44m07Q75J781J205k87j098p41k73n23j035j036m52L38J029
57394B81226J328J060N86N71J076J496J553J685K145K413J948R97K45K0L25J129
57378B99803K081K341J365j32p13J75J571K175J707Q17R2l44m47r9N01Q74Q93
57361C12660R76J381J709J526J062Q27Q42Q22Q09R63J015O11J15K04P77J103J068
57344C28470J279J825J970J430R24R56R93N19N1L21J076J521J452J243J146J262
57328C46438J744K401K522J775Q25M16L45L3l83l86j02j3M2O36J609K080J613
57311C61595O58j40n02l97kK49J31O5N72J435J992K082K170K577L155L579L543
$$ plain form
57294 382762 385637 387605 389311 391641 394416 396359 396702 396181 396077 396797 397926 399106 400229 401107 401639 402231
57278 402231 403589 406113 409723 414096 418885 423963 429602 436056 442879 449197 454874 460675 466886 472541
57264 472541 476756 480210 484378 489651 495123 500039 504581 509181 513908 518677 523437 527925 531706 534587
57250 534587 536685 538139 539202 540532 542792 545816 548708 550973 553160 556108 559836 563490 566321 568566
57236 568566 571334 575600 581322 587591 593553 598899 603526 607278 610371 613621 617850 623268 629669 636775
57222 636775 643989 650348 655457 660216 665982 673142 681113 689505 698533 708309 718456 728604 738703
57209 738703 748785 758845 769072 779727 790845 802446 815022 829223 845128 862290 880387
57198 880387 899212 918120 936333 953907 971726 990382 1009787 1029926 1051111 1073177 1095390
$$ packed form
57294C82762K875J968J706K330K775J943L43n21j04P20J129J180J123Q78N32N92
57278D02231J358K524L610M373M789N078N639O454O823O318N677N801O211N655
57264D72541M215L454M168N273N472M916M542M600M727M769M760M488L781K881
57250E34587K098J454J063J330K260L024K892K265K187K948L728L654K831K245
57236E68566K768M266N722O269N962N346M627L752L093L250M229N418O401P106
57222F36775P214O359N109M759N766P160P971Q392R028R776J0147J0148J0099
57209G38703J0082J0060J0227J0655J1118J1601J2576J4201J5905J7162J8097
57198H80387J8825J8908J8213J7574J7819J8656J9405K0139K1185K2066K2213
$$ plain form
57187 1095390 1117732 1141594 1168462 1198431 1230646 1264759 1301209 1340279 1381492 1423816 1466066
57176 1466066 1507340 1547561 1587483 1627804 1668442 1708946 1749202 1789279 1828973 1868169 1907437
57165 1907437 1947609 1988786 2030421 2072418 2115600 2160943 2208889 2259537 2313026 2369353 2428080
57154 2428080 2488395 2549369 2610111 2669926 2728485 2785668 2841216 2894747 2946139 2995604 3043277
57143 3043277 3088919 3132134 3172652 3210323 3245115 3277329 3307709 3337215 3366746 3397050 3428683
57132 3428683 3461942 3497085 3534788 3576290 3622833 3674960 3732342 3794147 3859450 3927460 3997560
57121 3997560 4069146 4141379 4213238 4284060 4354132 4424740 4497690 4574836 4657962 4748802 4848867
57110 4848867 4959193 5080477 5213754 5361133 5525850 5711510 5921357 6158366 6426068
$$ packed form
57187A095390K2342K3862K6868K9969L2215L4113L6450L9070M1213M2324M2250
57176A466066M1274M0221L9922M0321M0638M0504M0256M0077L9694L9196L9268
57165A907437M0172M1177M1635M1997M3182M5343M7946N0648N3489N6327N8727
57154B428080O0315O0974O0742N9815N8559N7183N5548N3531N1392M9465M7673
57143C043277M5642M3215M0518L7671L4792L2214L0380K9506K9531L0304L1633
57132C428683L3259L5143L7703M1502M6543N2127N7382O1805O5303O8010P0100
57121C997560P1586P2233P1859P0822P0072P0608P2950P7146Q3126R0840J00065
57110D848867J10326J21284J33277J47379J64717J85660K09847K37009K67702
$$ plain form
57101 6426068 6729364 7075006 7471915 7931352 8466752 9093305 9827627 10687392 11690540
57092 11690540 12853983 14191967 15714068 17423166 19314748 21378124 23598119 25955769
57084 25955769 28429229 30995614 33628953 36288561 38903182 41367626 43560457 45368178
57076 45368178 46693080 47443336 47529092 46882951 45493088 43420496 40787572 37750276 34472051
57067 34472051 31106051 27783308 24605600 21643907 18941352 16517827 14374981 12501483
57059 12501483 10877803 9479749 8281166 7256350 6381572 5635322 4998263 4453613 3987288
57050 3987288 3587350 3243574 2947655 2693010 2473640 2283386 2116682 1969583 1839485
57041 1839485 1724187 1621728 1530750 1450187 1378614 1314459 1256829 1205578 1160501 1120855 1085716
$$ packed form
57101F426068L03296L45642L96909M59437N35400O26553P34322Q59765J003148
57092A1690540J163443J337984J522101J709098J891582K063376K219995K357650
57084B5955769K473460K566385K633339K659608K614621K464444K192831J807721
57076D5368178J324902P50256Q5756o46141j389863k072592k632924l037296l278225
57067C4472051l366000l322743l177708k961693k702555k423525k142846j873498
57059A2501483j623680j398054j198583j024816q74778p46250o37059n44650m66325
57050C987288l99938l43776k95919k54645k19370j90254j66704j47099j30098
57041A839485j15298j02459r0978q0563p1573o4155n7630n1251m5077l9646l5139
$$ plain form
57030 1085716 1054428 1026621 1002031 980420 961682 946178 934974 929360 930029 937073 950989 973261
57018 973261 1005923 1051338 1112667 1193295 1294560 1414311 1547913 1688707 1824886 1936498
57008 1936498 1999546 1997053 1928027 1806792 1654827 1492585 1335367 1192454 1067866 962101
56998 962101 873938 801352 741860 692990 652706 619330 591460 568440 550567 538221 530847 527148
56986 527148 526151 527578 531248 536617 542961 549544 555399 559224 559703 555927 547652 535475 520835 505510
56972 505510 490874 477566 465788 455692 447448 441108 436633 434019 433376 434824 438337 443775 451202
56959 451202 461137 474169 490134 507794 525484 541786 555239 563680 564657 557002 541862 521986
56947 521986 500160 478412 458204 440646 426300 415214 407382 402918 401644 402899 406216 411993 421043
$$ packed form
57030A085716l1288k7807k4590k1611j8738j5504j1204n614O69P044J3916K2272
57018I73261L2662M5415O1329Q0628J01265J19751J33602J40794J36179J11612
57008A936498O3048k493o9026j21235j51965j62242j57218j42913j24588j05765
56998I62101q8163p2586n9492m8870m0284l3376k7870k3020j7873j2346p374l699
56986E27148r97J427L670N369O344O583N855L825M79l776q275j2177j4640j5325
56972E05510j4636j3308j1778j0096q244o340m475k614o43J448L513N438P427
56959D51202R935J3032J5965J7660J7690J6302J3453Q441R77p655j5140j9876
56947E21986k1826k1748k0208j7558j4346j1086p832m464j274J255L317N777R050
$$ plain form
56934 421043 433647 449539 468760 491758 518262 546367 572965 594655 608156 610768 601499 581840
56922 581840 554986 524276 492527 462127 434679 410408 388685 369428 353464 341303 332191 324818
56910 324818 318551 313567 310061 307756 306089 304585 303132 302095 302056 303287 305557 308471 311770 315307 319186
56895 319186 324184 331641 342434 356159 371646 388164 405872 425234 446424 469272 493298 517482
56883 517482 540122 559185 572937 580301 580804 574436 561807 544498 525007 505963 489209 475612
56871 475612 465492 458949 455788 455698 458835 466086 478524 496714 520769 550932 587726 631270 680375
56858 680375 732229 782802 827447 861351 880173 881324 865323 835805 797783 755848 713820 675157
56846 675157 642561 617136 598754 587435 583819 588265 600445 620300 648677 686453 733691 790302
$$ packed form
56934D21043J2604J5892J9221K2998K6504K8105K6598K1690J3501K612r269j9659
56922E81840k6854l0710l1749l0400k7448k4271k1723j9257j5964j2161r112p373
56910C24818o267m984l506k305j667j504j453j037l9J231K270K914L299L537L879
56895C19186M998P457J0793J3725J5487J6518J7708J9362K1190K2848K4026K4184
56883E17482K2640J9063J3752P364N03o368j2629j7309j9491j9044j6754j3597
56871D75612j0120o543l161r0L137P251J2438J8190K4055L0163L6794M3544M9105
56858F80375N1854N0573M4645L3904J8822J151j6001k9518l8022m1935m2028l8663
56846F75157l2596k5425j8382j1319l616M446J2180J9855K8377L7776M7238N6611
$$ plain form
56834 790302 856797 933138 1016570 1100984 1178101 1238859 1274653 1279499 1252623 1199067 1127415 1046695
56822 1046695 964631 887162 818231 759739 712051 674713 646894 627801 617197 615488 623069 639820
56810 639820 665531 700489 744939 797712 855581 913909 967421 1010251 1036170 1040110 1020304 979163
56798 979163 922271 856605 789086 725338 668628 619795 578546 544789 518585 499349 486001
56787 486001 478044 475923 480090 490234 505682 526036 550876 579023 608359 636055 658637 672317
56775 672317 674128 663144 640614 609141 571984 532612 494018 457979 425142 395779 370150 348179
56763 348179 329318 313053 299279 287925 278423 269856 261643 253921 247250 242010 238093 235090 232692
56750 232692 230745 228955 226740 223729 220349 217632 216256 215873 215476 214304 212315 209946 207625 205562 203855
$$ packed form
56834G90302O6495P6341Q3432Q4414P7117O0758L5794M846k6876n3556p1652q0720
56822A046695q2064p7469o8931n8492m7688l7338k7819j9093j0604j709P581J6751
56810F39820K5711L4958M4450N2773N7869N8328N3512M2830K5919L940j9806m1141
56798I79163n6892o5666o7519o3748n6710m8833m1249l3757k6204j9236j3348
56787D86001p957k121M167J0144J5448K0354K4840K8147K9336K7696K2582J3680
56775F72317J811j0984k2530l1473l7157l9372l8594l6039l2837k9363k5629k1971
56763C48179j8861j6265j3774j1354r502q567q213p722o671n240l917l003k398
56750B32692j947j790k215l011l380k717j376l83l97j172j989k369k321k063j707
$$ plain form
56735 203855 202607 201904 201684 201680 201484 200679 199041 196780 194602 193374 193541 194805 196327 197273 197277 196581 195746 195154
56717 195154 194790 194594 194856 195952 197672 199160 199716 199472 199096 198976 198907 198510 197825 197430 197959 199408 200963
56700 200963 201681 201315 200347 199336 198528 197972 197517 196640 194873 192622 191040 190712 190930 190689 189973 189469 189353
56683 189353 189066 188267 187352 186958 187392 188568 190089 191285 191606 191194 190782 190929 191531 192112 192300 191979 191274 190496
56665 190496 189919 189518 189074 188549 188195 188337 189161 190572 191992 192496 191605 189965 188850 188961 190020 191486 193155
56648 193155 194941 196558 197793 198821 199999 201518 203404 205616 207971 210203 212322 214722 217670 220838
56634 220838 223569 225520 226846 227802 228416 228596 228415 228133 227913 227643 227230 227041 227685 229175 230567 230843 229968
56617 229968 228721 227677 226878 226322 226048 225603 224239 222010 220018 219130 218927 218528 217894 217579 217484 216770 215033
$$ packed form
56735B03855j248p03k20mj96q05j638k261k178j228J67J264J522R46Mo96q35n92
56717A95154l64j96K62J096J720J488N56k44l76j20o9l97o85l95N29J449J555
56700B00963P18l66r68j011q08n56m55q77j767k251j582l28K18k41p16n04j16
56683A89353k87p99r15l94M34J176J521J196L21m12m12J47O02N81J88l21p05p78
56665A90496n77m01m44n25l54J42Q24J411J420N04q91j640j115J11J059J466J669
56648A93155J786J617J235J028J178J519J886K212K355K232K119K400K948L168
56634B20838K731J951J326R56O14J80j81k82k20k70m13j89O44J490J392K76q75
56617B29968j247j044p99n56k74m45j364k229j992q88k03l99o34l15r5p14j737
$$ plain form
56600 215033 212806 210753 209099 208111 208402 210119 212252 213451 213465 213283 213806 214859 215693 216081 216543 217587
56584 217587 219058 220339 221013 221191 221263 221516 221985 222534 222967 223139 223118 223282 224180 226149 229004 232051 234462
56567 234462 235740 236060 236233 237279 239822 243798 248735 254362 260823 268275 276438 284792 293127 301547 309837
56552 309837 317185 322870 327050 330520 333784 336751 339311 341635 343661 344814 344743 344093 343912 344325 344355 343270
56536 343270 341533 340015 338671 336592 333211 328854 324003 318614 312484 305892 299463 293592 288348 283819
56522 283819 280153 277214 274490 271414 267664 263205 258269 253319 248875 245324 242833 241198 239672 237377
56508 237377 234258 231366 229633 228599 227033 224744 222913 222454 222843 223040 222880 222881 223110 222996 222108 220637 219195
56491 219195 218608 219645 222342 225593 227924 228787 228799 228799 229109 229704 230530 231445 232168 232543 232670 232629 232281 231479 230355
$$ packed form
56600B15033k227k053j654r88K91J717K133J199J4j82N23J053Q34L88M62J044
56584B17587J471J281O74J78P2K53M69N49M33J72k1J64Q98J969K855L047K411
56567B34462J278L20J73J046K543L976M937N627O461P452Q163Q354Q335Q420Q290
56552C09837P348N685M180L470L264K967K560K324K026J153p1o50j81M13L0j085
56536C43270j737j518j344k079l381m357m851n389o130o592o429n871n244m529
56522B83819l666k939k724l076l750m459m936m950m444l551k491j635j526k295
56508B37377l119k892j733j034j566k289j831m59L89J97j60JK29j14q88j471j442
56491B19195n87J037K697L251K331Q63J2%L10N95Q26R15P23L75J27m1l48q02j124
$$ plain form
56472 230355 229288 228625 228471 228711 229197 229896 230773 231602 232139 232520 233158 234104 234851 235079 235213 235841 236865 237744
56454 237744 238439 239532 241366 243537 245351 246444 246858 246818 246607 246433 246328 246309 246591 247462 248929 250681 252383
56437 252383 253881 255215 256586 258171 259808 261052 261752 262290 263024 263773 264232 264508 264799 264854 264360 263650 263319
56420 263319 263281 262915 262106 261387 260962 260351 259317 258487 258659 259833 261253 262113 262096 261566 261351 262023 263283 264395
56402 264395 265206 266228 267739 269365 270733 271909 273028 274015 274910 275883 276705 276794 276120 275470 275445 275718 275800 275974
56384 275974 276874 278478 280095 281208 281882 282561 283798 285964 288838 291659 293886 295689 297420 298982 300087
56369 300087 300748 301025 300586 299151 297227 295826 295400 295450 295252 294583 293707 292933 292280 291514 290544 289839 290109 291343
56351 291343 292463 292337 291004 289536 288858 289087 289941 291193 292532 293415 293445 292846 292288 292200 292372 292393 292382 293005
$$ packed form
56472B30355j067o63j54K40M86O99Q77Q29N37L81O38R46P47K28J34O28J024Q79
56454B37744O95J093J834K171J814J093M14m0k11j74j05j9K82Q71J467J752J702
56437B52383J498J334J371J585J637J244P00N38P34P49M59K76K91N5m94p10l31
56420B63319l8l66q09p19m25o11j034q30J72J174J420Q60j7n30k15O72J260J112
56402B64395Q11J022J511J626J368J176J119R87Q95R73Q22Q9o74o50k5K73Q2J74
56384B75974R00J604J617J113O74O79J237K166K874K821K227J803J731J562J105
56369C00087O61K77m39j435j924j401m26N0j98o69q76p74o53p66r70p05K70J234
56351B91343J120j26j333j468o78K29Q54J252J339Q83L0n99n58q8J72K1j1O23
$$ plain form
56333 293005 294638 296774 298589 299954 301476 303581 306034 308442 310758 313059 315224 317162 319078 321210
56319 321210 323434 325324 326501 326900 326869 327043 327816 328894 329696 330164 330795 331813 332835 333501 333936 334412 335059
56302 335059 336142 338020 340543 342975 344923 346801 348939 350777 351585 351607 351862 352981 354781 356854 358998
56287 358998 361138 363223 365336 367658 370364 373617 377430 381369 384669 386920 388472 390033 392095 394831
56273 394831 398131 401584 404801 407972 411722 416264 421161 426061 431070 436164 440942 445364 450162 456096
56259 456096 463351 472006 482321 494037 506177 518268 531190 546140 563382 582702 604328 628458
56247 628458 654511 681948 711352 743680 778786 815766 854399 895068 937484 980636 1023848
56236 1023848 1066652 1107604 1144526 1176252 1203141 1225524 1242526 1252744 1255343 1250338 1238542 1221473
$$ packed form
56333B93005J633K136J815J365J522K105K453K408K316K301K165J938J916K132
56319C21210K224J890J177L99l1J74P73J078Q02M68O31J018J022O66M35M76O47
56302C35059J083J878K523K432J948J878K138J838Q08K2K55J119J800K073K144
56287C58998K140K085K113K322K706L253L813L939L300K251J552J561K062K736
56273C94831L300L453L217L171L750M542M897M900N009N094M778M422M798N934
56259D56096P255Q655J0315J1716J2140J2091J2922J4950J7242J9320K1626K4130
56247F28458K6053K7437K9404L2328L5106L6980L8633M0669M2416M3152M3212
56236A023848M2804M0952L6922L1726K6889K2383J7002J0218K599n005j1796j7069
$$ plain form
56224 1221473 1200555 1176134 1147865 1116096 1082089 1046909 1011045 975304 941014 908860 878351
56213 878351 848940 820923 794800 770496 747790 726937 708238 691385 675762 661113 647592
56202 647592 635461 625068 616747 610402 605434 601271 597704 594636 591932 589689 588210 587525 587315 587427
56188 587427 588043 589253 590947 593225 596366 600219 604137 607722 611144 614515 617450 619478 620424 620254 619050
56173 619050 617383 616155 615754 615759 615684 615573 615716 616256 617326 619056 621203 623224 625007 627166 630383 634828
56157 634828 640268 646326 652472 658358 664352 671299 679569 688840 698914 710075 722424 735499 748928
56144 748928 762963 778105 794770 813603 835532 861175 890673 924391 963170 1007640 1058041
56133 1058041 1115255 1181421 1258808 1348277 1449106 1559784 1678309 1801824 1926286 2046446
$$ packed form
56224A221473k0918k4421k8269l1769l4007l5180l5864l5741l4290l2154l0509
56213H78351k9411k8017k6123k4304k2706k0853j8699j6853j5623j4649j3521
56202F47592j2131j0393q321o345m968m163l567l068k704k243j479o85k10J12
56188E87427O16J210J694K278L141L853L918L585L422L371K935K028R46j70j204
56173F19050j667j228m01Np5j11J43N40J070J730K147K021J783K159L217M445
56157F34828N440O058O146N886N994O947Q270R271J0074J1161J2349J3075J3429
56144G48928J4035J5142J6665J8833K1929K5643K9498L3718L8779M4470N0401
56133A058041N7214O6166P7387Q9469J00829J10678J18525J23515J24462J20160
$$ plain form
56123 2046446 2156428 2251395 2329543 2392483 2443615 2486364 2523556 2556942 2586175 2608625 2621117
56112 2621117 2622034 2611916 2592796 2567426 2538234 2505829 2468320 2422465 2365416 2295451 2212112 2116814
56100 2116814 2013258 1906443 1801004 1700560 1608102 1526025 1455557 1396600 1348336 1309740
56090 1309740 1279486 1255771 1236609 1220525 1207012 1196287 1188600 1183830 1181679 1181773 1183275 1184918 1186106
56077 1186106 1187752 1191281 1196888 1203462 1210153 1217201 1225162 1234189 1244331 1255791 1268538 1282227 1296745
56064 1296745 1312322 1328967 1346360 1364372 1383024 1402017 1421049 1440575 1461243 1482440 1502441
56053 1502441 1520289 1536607 1552345 1567827 1583438 1600075 1618197 1637268 1656728 1676784 1697859
56042 1697859 1720126 1744026 1770267 1798759 1828474 1858851 1890403 1923426 1957230 1991368 2026622
$$ packed form
56123B046446J09982R4967P8148O2940N1132M2749L7192L3386K9233K2450J2492
56112B621117R17j0118j9120k5370k9192l2405l7509m5855n7049o9965q3339r5298
56100B116814j03556j06815j05439j00444r2458q2077p0468n8957m8264l8596
56090A309740l0254k3715j9162j6084j3513j0725p687m770k151R4J502J643J188
56077A186106J646L529N607O574O691P048P961R027J0142J1460J2747J3689J4518
56064A296745J5577J6645J7393J8012J8652J8993J9032J9526K0668K1197K0001
56053A502441J7848J6318J5738J5482J5611J6637J8122J9071J9460K0056K1075
56042A697859K2267K3900K6241K8492K9715L0377L1552L3023L3804L4138L5254
$$ plain form
56031 2026622 2063994 2103582 2145161 2188890 2234702 2281888 2330108 2379969 2431913 2485452 2540251
56020 2540251 2597005 2656386 2718024 2781450 2847201 2916163 2988569 3064418 3144053 3227561 3314451
56009 3314451 3404542 3498346 3596081 3697387 3802571 3912856 4028752 4149514 4274936 4406333
55999 4406333 4544970 4691065 4845122 5008612 5182332 5365844 5559684 5766405 5988278
55990 5988278 6225674 6478832 6749254 7038036 7344997 7670996 8019016 8391402 8788505
55981 8788505 9211947 9666811 10158535 10690246 11265440 11890549 12572260 13315278 14126006
55972 14126006 15015762 15997117 17080142 18276390 19604241 21086647 22747066 24612988
55964 24612988 26721832 29119856 31859810 35007105 38647633 42886124 47842963 53662961
$$ packed form
56031B026622L7372L9588M1579M3729M5812M7186M8220M9861N1944N3539N4799
56020B540251N6754N9381O1638O3426O5751O8962P2406P5849P9635Q3508Q6890
56009C314451R0091R3804R7735J01306J05184J10285J15896J20762J25422J31397
55999D406333J38637J46095J54057J63490J73720J83512J93840K06721K21873
55990E988278K37396K53158K70422K88782L06961L25999L48020L72386L97103
55981H788505M23442M54864M91724N31711N75194O25109O81711P43018Q10728
55972A4126006Q89756R81355J083025J196248J327851J482406J660419J865922
55964B4612988K108844K398024K739954L147295L640528M238491M956839N819998
$$ plain form
55956 53662961 60527942 68657297 78305330 89775216 103441174 119751127 139202718
55949 139202718 162292529 189396681 220525065 254974503 291022298 325834800 355715433
55942 355715433 376744806 385739291 381227776 363973852 336715354 303245074 267338025
55935 267338025 232008991 199251486 170119772 144956063 123639135 105795755 90950099
55928 90950099 78615409 68346921 59766695 52564285 46485645 41324706 36918271 33137237
55920 33137237 29876153 27048249 24584470 22429832 20537959 18869291 17391933 16080185
55912 16080185 14911571 13866389 12928559 12084365 11320755 10626301 9992630 9412985 8880355
55903 8880355 8388668 7934475 7515390 7127806 6767976 6434213 6125830 5840592 5575203
$$ packed form
55956E3662961O864981Q129355R648033J1469886J3665958J6309953J9451591
55949A39202718K3089811K7104152L1128384L4449438L6047795L4812502K9880633
55942C55715433K1029373Q994485m511515j7253924k7258498l3470280l5907049
55935B67338025l5329034l2757505k9131714k5163709k1316928j7843380j4845656
55928I0950099j2334690j0268488q580226p202410o078640n160939m406435l781034
55920C3137237l261084k827904k463779k154638j891873j668668j477358j311748
55912A6080185j168614j045182r37830q44194p63610o94454o33671n79645n32630
55903H880355m91687m54193m19085l87584l59830l33763l08383k85238k65389
$$ plain form
55894 5575203 5327773 5097882 4884490 4685487 4499140 4324695 4161809 4010508 3871181
55885 3871181 3743528 3626073 3517848 3419812 3333470 3258898 3195450 3143624 3104677 3078810 3064970
55874 3064970 3061790 3067095 3076623 3084549 3085364 3074640 3048700 3004856 2941850 2859436 2758341 2641736
55862 2641736 2515978 2388375 2264222 2146562 2037650 1938991 1850368 1770491 1698653 1634710
55852 1634710 1577806 1526503 1479989 1437904 1399081 1361803 1325401 1290513 1257690 1226703 1197177
55841 1197177 1168916 1141611 1115082 1089685 1065641 1042291 1019102 997102 977925 961460 945773
55830 945773 929566 913461 898583 885070 872470 860579 849267 838206 827263 816555 805795
55819 805795 794238 781588 768318 754861 741127 727196 713860 702048 692094 683840 677076 671597
$$ packed form
55894E575203k47430k29891k13392j99003j86347j74445j62886j51301j39327
55885C871181j27653j17455j08225r8036q6342p4572o3448n1826l8947k5867j3840
55874C064970l180N305R528P926Q15j0724k5940m3844o3006q2414j01095j16605
55862B641736j25758j27603j24153j17660j08912r8659q8623p9877p1838o3943
55852A634710n6904n1303m6514m2085l8823l7278l6402l4888l2823l0987k9526
55841A197177k8261k7305k6529k5397k4044k3350k3189k2000j9177j6465j5687
55830I45773j6207j6105j4878j3513j2600j1891j1312j1061j0943j0708j0760
55819H05795j1557j2650j3270j3457j3734j3931j3336j1812r954q254o764n479
$$ plain form
55807 671597 667208 663940 661992 661426 662214 664503 668398 673530 679348 685744 692805 699946 705989 710189 712544
55792 712544 712913 710525 704676 695449 683501 669639 654809 640038 626091 613416 602442 593369 585548
55779 585548 577628 568622 558407 547087 534524 520968 507629 496071 487215 481247 478173 477934 480055
55766 480055 483574 487410 490636 492386 491754 488052 481420 473159 465011 457777 450724 442734 433865 425371
55752 425371 418293 412537 407311 401919 395961 389261 381908 374195 366374 358610 351158 344276 337994 332285
55738 332285 327425 323827 321459 319804 318365 316839 314926 312554 310354 309237 309249 309305 308332 306183 303259
55723 303259 299798 296022 292488 289710 287533 285313 282630 279573 276448 273521 271011 269116 267982 267715
55709 267715 268364 269935 272495 276095 280357 284349 287367 289648 291683 292850 291568 287156 280753 273967
$$ packed form
55807F71597m389l268j948n66P88K289L895N132N818O396P061P141O043M200K355
55792G12544L69k388n849r227j1948j3862j4830j4771j3947j2675j0974r073p821
55779E85548p920r006j0215j1320j2563j3556j3339j1558q856n968l074k39K121
55766D80055L519L836L226J750o32l702o632q261q148p234p053p990q869q494
55752D25371p078n756n226n392n958o700p353p713p821p764p452o882o282n709
55738C32285m860l598k368j655j439j526j913k372k200j117J2N6r73k149k924
55723C03259l461l776l534k778k177k220k683l057l125k927k510j895j134k67
55709B67715O49J571K560L600M262L992L018K281K035J167j282m412o403o786
$$ plain form
55695 273967 267318 260644 254315 249069 244929 241216 237626 234477 231871 229370 226754 224489 223186 223051
55681 223051 224057 226180 229204 232675 236275 239868 243023 244994 245541 245302 244853 243741 241106 237084 232953
55666 232953 229820 227693 225970 224299 222674 221159 219980 219654 220541 222368 224564 227060 230416 235078 240766
55651 240766 246705 252233 257075 261199 264582 267066 268413 268553 267670 265818 262514 257135 249849 241819 234222
55636 234222 227292 220551 213712 206975 200637 194953 190319 187058 184796 182471 179345 175859 173185 171975
55622 171975 171768 171585 170833 169619 168443 167800 167937 168701 169515 169687 168896 167405 165763 164393 163476 163010 162773
55605 162773 162325 161314 159823 158230 156785 155509 154462 153793 153481 153310 153158 153062 152923 152493 151709 150757 149687
55588 149687 148411 147254 146984 147860 148966 149020 147700 145783 144130 143040 142486 142472 143002 143973 145194 146332
$$ packed form
55695B73967o649o674o329n246m140l713l590l149k606k501k616k265j303j35
55681B23051J006K123L024L471L600L593L155J971N47k39m49j112k635m022m131
55666B32953l133k127j723j671j625j515j179l26Q87J827K196K496L356M662N688
55651B40766N939N528M842M124L383K484J347J40q83j852l304n379p286q030p597
55636B34222o930o741o839o737o338n684m634l261k262k325l126l486k674j210
55622A71975k07j83p52j214j176o43J37P64Q14J72p91j491j642j370r17m66k37
55605A62773m48j011j491j593j445j276j047o69l12j71j52r6j39m30p84r52j070
55588A49687j276j157k70Q76J106N4j320j917j653j090n54j4N30R71J221J138
$$ plain form
55572 146332 146973 147045 147108 147811 149025 149866 149727 149005 148656 149177 150182 150880 150916 150689 150812 151215 151033 149514 146823
55553 146823 143796 141144 139138 137755 136699 135409 133562 131498 129823 128716 128023 127888 128699 130347 132086
55538 132086 133301 134040 134624 135047 135003 134287 133132 132204 132073 132434 132152 130596 128695 127899 128202 128103 126775 125305
55520 125305 125138 125983 126129 124540 121837 119235 117191 115381 113583 112117 111435 111469 111725 111996 112632 113808
55504 113808 114863 114918 113982 112869 112059 111337 110551 109876 109093 107491 104980 102544 100965 99764 98212 96805
55488 96805 96762 98304 100388 102102 103466 104767 105872 106480 106543 106179 105610 105286 105615 106399 106932 106832 106449 106348
55470 106348 106734 107552 108783 110396 112216 113947 115109 114970 113031 109809 106745 104958 104264 103708 102842 102106
55454 102106 102112 102988 104494 106370 108270 109576 109680 108634 107303 106657 106879 107304 107255 106758 106415 106726 107700 108990
$$ packed form
55572A46332O41P2O3P03J214Q41j39p22l49N21J005O98L6k27J23M03j82j519k691
55553A46823l027k652k006j383j056j290j847k064j675j107o93j35Q11J648J739
55538A32086J215P39N84M23m4p16j155r28j31L61k82j556j901p96L03r9j328j470
55520A25305j67Q45J46j589k703k602k044j810j798j466o82L4K56K71O36J176
55504A13808J055N5r36j113q10p22p86o75p83j602k511k436j579j201j552j407
55488I6805m3J542K084J714J364J301J105O08O3l64n69l24L29P84N33j00l83j01
55470A06348L86Q18J231J613J820J731J162j39j939l222l064j787o94n56q66p36
55454A02106OQ76J506J876J900J306J04j046j331o46K22M25m9m97l43L11R74J290
$$ plain form
55436 108990 110249 111308 112092 112408 112035 111174 110634 111108 112222 112770 112119 110934 110210 110056 109907 109560 109306
55419 109306 109244 109182 109230 109835 111098 112638 114227 115963 117609 118446 118216 117658 117549 117625 117011 115455 113490 111579
55401 111579 109792 108335 107722 108144 109112 109989 110512 110574 109917 108494 106855 105748 105363 105326 105329 105383 105495 105585 105813
55382 105813 106491 107443 107860 107213 106008 105232 105292 105914 106850 108021 109041 109331 108955 108781 109435 110519 111238 111463
55364 111463 111716 112329 113040 113342 112947 111979 110975 110519 110649 110811 110669 110669 111407 112671 113651 113980 113996 113968 113674
55345 113674 112947 112086 111331 110347 108708 106775 105595 105808 106934 107919 108233 108177 108130 107860 106942 105665 104977 105341
55327 105341 106082 106148 105220 103810 102567 101908 101993 102640 103346 103810 104236 104790 105104 104881 104661 105254 106568 107788
55309 107788 108653 109649 110825 111339 110613 109133 107705 106547 105641 105308 105783 106654 107376 107992 108783 109489 109546 108877
$$ packed form
55436A08990J259J059P84L16l73q61n40M74J114N48o51j185p24j54j49l47k54
55419A09306o2o2M8O05J263J540J589J736J646Q37k30n58j09P6o14j556j965j911
55401A11579j787j457o13M22R68Q77N23O2o57j423j639j107l85l7LN4J12R0K28
55382A05813O78R52M17o47j205p76O0O22R36J171J020K90l76j74O54J084P19K25
55364A11463K53O13P11L02l95r68j004m56J30J62j42%P38J264R80L29J6k8k94
55345A13674p27q61p55r84j639j933j180K13J126R85L14n6m7k70r18j277o88L64
55327A05341P41O6r28j410j243o59Q5O47P06M64M26N54L14k23k20N93J314J220
55309A07788Q65R96J176N14p26j480j428j158r06l33M75Q71P22O16P91P06N7o69
$$ plain form
55291 108877 107930 107042 106276 105778 105801 106396 107382 108523 109490 109890 109704 109453 109540 109709 109584 109428 109781 110539 110990
55272 110990 110730 109997 109233 108853 109298 110676 112301 113228 113305 113183 113299 113495 113671 114082 114724 115103 114955 114663
55254 114663 114620 114671 114539 114319 114185 114023 113777 113766 114229 114866 115235 115373 115640 116198 116921 117509 117411 116109 113953
55235 113953 112335 112395 113773 115152 115806 115981 115978 115652 114909 113970 112931 111661 110382 109805 110305 111313 111936
55218 111936 111954 111872 112156 112731 113153 113064 112483 111772 111263 110922 110563 110388 111031 112859 115430 117825 119355 119811
55200 119811 119298 118196 117191 116947 117586 118571 119162 118916 117873 116507 115471 115162 115387 115576 115407 115071 114884
55183 114884 114811 114583 114155 113749 113403 112772 111633 110394 109789 110018 110482 110477 109997 109731 110396 112234 114948 117863
55165 117863 120176 121354 121448 120962 120350 119694 118848 117791 116791 116300 116648 117720 118931 119612 119487 118774 117896
$$ packed form
55291A08877r47q88p66m98K3N95R86J141R67M00j86k51Q7J69j25j56L53P58M51
55272A10990k60p33p64l80M45J378J625R27P7j22J16J96J76M11O42L79j48k92
55254A14663m3N1j32k20j34j62k46j1M63O37L69J38K67N58P23N88r8j302k156
55235A13953j618O0J378J379O54J75ll26p43r39j039j270j279n77N00J008O23
55218A11936J8q2K84N75M22q9n81p11n09l41l59j75O43J828K571K395J530M56
55200A19811n13j102j005k44O39R85N91k46j043j366j036l09K25J89j69l36j87
55183A14884p3k28m28m06l46o31j139j239o05K29M64nm80k66O65J838K714K915
55165A17863K313J178R4m86o12o56q46j057j000m91L48J072J211O81j25p13q78
$$ plain form
55148 117896 117176 116778 116731 116902 117070 117115 117151 117465 118275 119459 120484 120801 120422 119973 120001 120311 120244 119505 118479
55129 118479 117759 117656 118137 118968 119802 120347 120497 120192 119284 117850 116488 115831 115749 115524 114931 114567 114909 115609
55111 115609 116118 116485 117048 117746 118292 118750 119345 119931 120225 120421 120992 121993 123069 124039 124862 125204 124799 124209
55093 124209 124391 125336 126001 125863 125672 126161 126815 126707 125970 125502 125521 125297 124335 123037 122053 121555 121382 121457 121783
55074 121783 122307 122932 123462 123511 122740 121271 119646 118329 117494 117239 117615 118299 118611 118189 117450 117120 117421 117927
55056 117927 118193 118280 118615 119448 120584 121582 122149 122302 122213 122003 121672 121200 120651 120259 120306 120758 121066 120644 119625
55037 119625 118896 119208 120442 121905 123065 123764 124008 123948 123855 123736 123130 121697 119923 118771 118672 119285 120207 121392
55019 121392 122808 124179 125254 125895 125828 124847 123464 122761 123177 123912 124015 123644 123649 124236 124729 124596 124025 123383
$$ packed form
55148A17896p20l98m7J71J68M5L6L14Q10J184J025L17l79m49K8L10o7p39j026
55129A18479p20j03M81Q31Q34N45J50l05r08j434j362o57q2k25n93l64L42P00
55111A15609N09L67N63O98N46M58N95N86K94J96N71J001J076R70Q23L42m05n90
55093A24209J82R45O65j38j91M89O54j08p37m68J9k24r62j298r84m98j73P5L26
55074A21783N24O25N30M9p71j469j625j317q35k55L76O84L12m22p39l30L01N06
55056A17927K66Q7L35Q33J136R98N67J53q9k10l31m72n49l92M7M52L08m22j019
55037A19625p29L12J234J463J160O99K44o0r3j19o06j433j774j152r9O13R22J185
55019A21392J416J371J075O41o7r81j383p03M16P35J03l71NN87M93j33n71o42
$$ plain form
55001 123383 122717 122032 121630 121809 122405 122898 122913 122494 122032 122021 122777 124192 125731 126794 127147 127015 126793 126688
54983 126688 126664 126709 126986 127648 128575 129495 130310 131081 131726 132063 132215 132621 133417 134134 134317 134198 134380 135012 135683
54964 135683 136093 136454 137107 138048 138972 139652 140186 140876 141839 142841 143656 144568 146110 148169 149775 150151 149557
54947 149557 148720 147849 146826 145994 145895 146245 146111 145294 144753 145292 146507 147525 148281 149447 151421 153869 156102
54930 156102 157536 157974 157827 157954 159012 161070 163934 167501 171600 175912 180497 186101 193459 202435 212182
54915 212182 221831 230621 237657 242201 244171 243867 241291 236274 229215 221120 212843 204750 197140 190413
54901 190413 184590 179185 173896 169102 165378 162754 160693 158676 156626 154854 153701 153187 153021 153046 153526
54886 153526 154719 156335 157806 159012 160368 162253 164880 168654 174006 180657 187724 194834 202540 211180
$$ packed form
55001A23383o66o85m02J79N96M93J5m19m62j1P56J415J539J063L53j32k22j05
54983A26688k4M5K77O62R27R20Q15P71O45L37J52M06P96P17J83j19J82O32O71
54964A35683M10L61O53R41R24O80N34O90R63J002Q15R12J542K059J606L76n94
54947A49557q37q71j023q32r9L50j34q17n41N39J215J018P56J166J974K448K233
54930A56102J434M38j47J27J058K058K864L567M099M312M585N604P358Q976R747
54915B12182R649Q790P036M544J970l04k576n017p059q095q277q093p610o727
54901A90413n823n405n289m794l724k624k061k017k050j772j153n14j66K5M80
54886A53526J193J616J471J206J356J885K627L774N352O651P067P110P706Q640
$$ plain form
54872 211180 219892 227327 232968 237120 239856 240578 238571 233594 226086 217216 208512 200882 194021 187170
54858 187170 180289 174032 168788 164387 160723 157887 155564 153010 149985 147173 145267 144027 142637 140648
54844 140648 138220 135715 133525 132061 131464 131340 131150 130830 130730 131038 131591 132257 133146 134261 135228 135621 135459
54827 135459 135259 135556 136385 137206 137348 136604 135441 134622 134576 135093 135532 135338 134527 133762 133800 134715 135788 136341 136507
54808 136507 136915 137778 138715 139478 140273 141154 141584 141106 140132 139501 139425 139494 139633 140309 141514 142301 141888 140801 140265
54789 140265 140749 141711 142576 143224 143540 143250 142455 141713 141292 140848 140181 139818 140455 142234 144960 148584 152920
54772 152920 157270 161037 164545 168606 173331 178086 182630 187619 193748 200976 208857 217080 225252 232537
54758 232537 238045 241512 243244 243505 242184 239048 234112 227814 220941 214215 207815 201403 194764 188316
$$ packed form
54872B11180Q712P435N641M152K736P22k007m977p508q870q704p630o861o851
54858A87170o881o257n244m401l664k836k323k554l025k812j906j240j390j989
54844A40648k428k505k190j464n97j24j90l20j00L08N53O66Q89J115R67L93j62
54827A35459k00K97Q29Q21J42p44j163q19m6N17M39j94q11p65L8R15J073N53J66
54808A36507M08Q63R37P63P95Q81M30m78r74o31p6O9J39O76J205P87m13j087n36
54789A40265M84R62Q65O48L16k90p95p42m21m44o67l63O37J779K726L624M336
54772A52920M350L767L508M061M725M755M544M989O129P228P881Q223Q172P285
54758B32537N508L467J732K61j321l136m936o298o873o726o400o412o639o448
$$ plain form
54744 188316 182835 178819 176241 174812 174238 174262 174616 175027 175242 175139 174872 174799 175125 175700 176239 176742 177537 178955
54726 178955 181076 183874 187501 192223 197971 204157 210232 216391 223297 230936 238149 243700 247451 249938
54712 249938 251034 249799 245730 239463 231958 223645 214754 205956 198081 191389 185549 180203 175302 171072
54698 171072 167934 166205 165567 165098 164155 163020 162287 161899 161248 160008 158346 156395 154105 151660 149554 148075
54682 148075 147076 146382 146145 146617 147723 148947 149573 149140 147885 146685 146326 146847 147728 148512 148984 148996 148516 147794
54664 147794 147082 146304 145390 144766 144949 145705 146225 146188 146013 146013 146004 146013 146591 147916 149205 149638 149439 149413 149704 149718 149077
54643 149077 148018 146919 146040 145713 146194 147201 148126 148860 149898 151454 152934 153621 153456 152830 151959 150943
54627 150943 150236 150406 151349 152186 152211 151695 151463 151879 152539 152910 152918 152812 152757 152812 153130 153826 154673 155242 155456 155767
$$ packed form
54744A88316n481m016k578j429n74K4L54M11K15j03k67p3L26N75N39N03P95J418
54726A78955K121K798L627M722N748O186O075O159O906P639P213N551L751K487
54712B49938J096j235m069o267p505q313q891q798p875o692n840n346m901m230
54698A71072l138j729o38m69r43j135p33l88o51j240j662j951k290k445k106j479
54682A48075r99o94k37M72J106J224O26m33j255j200l59N21Q81P84M72J2m80p22
54664A47794p12p78r14o24J83P56N20l7j75%rRN78J325J289M33j99k6K91J4o41
54643A49077j059j099q79l27M81J007R25P34J038J556J480O87j65o26q71j016
54627A50943p07J70R43Q37K5n16k32M16O60L71Qj06n5N5L18O96Q47N69K14L11
$$ plain form
54607 155767 156601 157806 158858 159480 159787 159885 159678 159215 158987 159518 160666 161588 161566 160754 159977 159809 160039 160001 159236
54588 159236 157768 155988 154482 153813 154128 154962 155611 155784 155756 155874 156128 156276 156219 156112 156171 156461 156801 156870 156506
54569 156506 155987 155890 156585 157859 159023 159359 158603 157250 156380 156884 158667 160730 162119 162687 162894 163145 163531
54552 163531 164016 164543 164971 165127 165007 164808 164722 164779 164898 165022 165229 165718 166624 167748 168584 168792 168671 169036 170537
54533 170537 173055 175765 177848 179224 180599 182671 185265 187390 188219 187895 187281 187089 187442 188125 188870 189274
54517 189274 188742 186898 184138 181523 179878 179028 178118 176743 175501 175242 175941 176713 176892 176723 176857 177464 178089
54500 178089 178200 177665 176824 176307 176637 177762 179048 179859 180110 180125 180172 180446 181337 183212 185775 187999 189005
54483 189005 188836 188215 187717 187444 187360 187501 187725 187648 187177 186930 187716 189546 191507 192820 193738 195084 197085 199093
$$ packed form
54607A55767Q34J205J052O22L07R8k07m63k28N31J148R22k2q12p77j68K30l8p65
54588A59236j468j780j506o69L15Q34O49J73k8J18K54J48n7j07N9K90L40O9l64
54569A56506n19r7O95J274J164L36p56j353q70N04J783K063J389N68K07K51L86
54552A63531M85N27M28J56j20j99q6N7J19J24K07M89R06J124Q36K08j21L65J501
54533A70537K518K710K083J376J375K072K594K125Q29l24o14j92L53O83P45M04
54517A89274n32j844k760k615j645q50r10j375j242k59O99P72J79j69J34O07O25
54500A78089J11n35q41n17L30J125J286Q11K51J5M7K74Q91J875K563K224J006
54483A89005j69o21m98k73q4J41K24p7m71k47P86J830J961J313R18J346K001K008
$$ plain form
54465 199093 200482 201435 202567 204054 205421 206129 206143 205878 205766 205950 206304 206666 206990 207312 207619 207759 207498 206721
54447 206721 205655 204838 204658 204855 204736 203974 202921 201949 200841 199254 197518 196394 196084 196028 195733 195235 194612
54430 194612 193641 192241 190795 189698 188972 188639 188961 189883 190660 190665 190255 190212 190495 190242 189004 187325 185939 184989
54412 184989 184335 184172 184911 186621 188874 191065 192667 193279 192759 191452 190151 189593 189863 190357 190496 190404 190688
54395 190688 191662 193108 194770 196625 198526 200069 201141 202157 203333 204092 203779 202725 202039 202373 203358 204194
54379 204194 204347 203712 202612 201693 201407 201557 201651 201593 201607 201677 201652 201872 202881 204376 205200 204762 203888 203752 204445
54360 204445 205074 204942 204071 202780 201289 199760 198366 197243 196541 196392 196642 196731 196110 194749 193081 191503
54344 191503 190121 188919 187976 187401 187110 186754 186030 185098 184469 184298 184067 183323 182431 182036 181961 181415 180450 180329
$$ packed form
54465A99093J389R53J132J487J367P08J4k65j12J84L54L62L24L22L07J40k61p77
54447B06721j066q17j80J97j19p62j053r72j108j587j736j124l10n6k95m98o23
54430A94612r71j400j446j097p26l33L22R22P77Nm10m3K83k53j238j679j386r50
54412A84989o54j63P39J710K253K191J602O12n20j307j301n58K70M94J39r2K84
54395A90688R74J446J662J855J901J543J072J016J176P59l13j054o86L34R85Q36
54379B04194J53o35j100r19k86J50R4n8J4P0k5K20J009J495Q24m38q74j36O93
54360B04445O29j32q71j291j491j529j394j123p02j49K50Q9o21j361j668j578
54344A91503j382j202r43n75k91l56p24r32o29j71k31p44q92l95p5n46r65j21
$$ plain form
54326 180329 182011 184909 187712 189902 191791 193455 194393 194180 192866 190809 188587 186965 186369 186324 185928 184934
54310 184934 183954 183566 183663 183793 183647 183070 181982 180582 179390 178846 179004 179634 180375 180711 180199 179008 177994
54293 177994 177875 178402 178614 177894 176541 175284 174488 174012 173664 173479 173404 173017 171929 170507 169796 170450 171948
54276 171948 173134 173452 173305 173303 173517 173580 173233 172597 172063 172016 172505 173062 172989 172022 170654 169690 169472 169618 169463 168703
54256 168703 167668 167040 167373 168775 170918 173223 175037 175865 175688 175085 174835 175221 175763 175734 174935 173877 173207
54239 173207 173038 172889 172203 170837 169140 167672 166848 166658 166674 166442 165933 165475 165245 165067 164843 164825 165204 165703
54221 165703 166015 166444 167571 169351 171094 172358 173308 174038 174201 173693 173131 173171 173677 174015 173847 173172 171919
54204 171919 170104 168241 167005 166452 166057 165535 165195 165375 165960 166600 167097 167398 167437 167140 166556 165935 165694 166141
$$ packed form
54326A80329J682K898K803K190J889J664R38k13j314k057k222j622n96m5l96r94
54310A84934r80l88R7J30j46n77j088j400j192n44J58O30P41L36n12j191j014
54293A77994j19N27K12p20j353j257p96m76l48j85p5l87j088j422p11O54J498
54276A71948J186L18j47kK14O3l47o36n34m7M89N57p3r67j368r64k18J46j55p60
54256A68703j035o28L33J402K143K305J814Q28j77o03k50L86N42k9p99j058o70
54239A73207j69j49o86j366j697j468q24j90J6k32n09m58k30j78k24j8L79M99
54221A65703L12M29J127J780J743J264R50P30J63n08n62M0N06L38j68o75j253
54204A71919j815j863j236n53l95n22l40J80N85O40M97L01L9k97n84o21k41M47
$$ plain form
54186 166141 167088 167927 168272 168347 168528 168757 168770 168650 168699 168938 169227 169688 170430 170957 170600 169618 169166 169852 170929
54167 170929 171279 170728 169951 169499 169395 169419 169295 168710 167516 165959 164495 163416 162740 162327 162004 161745 161784 162287
54149 162287 162853 162745 161863 161098 161390 162710 164281 165510 166280 166615 166642 166754 167262 167872 167998 167667 167585 168090
54131 168090 168494 167869 166269 164790 164430 165168 166213 166907 167215 167402 167467 167098 166151 165025 164416 164749 165847
54114 165847 167130 168116 168802 169576 170686 171840 172468 172343 171735 170895 169674 167861 165733 164044 163482 164244
54098 164244 165965 167897 169279 169761 169529 168927 168116 167199 166443 166097 166060 166049 166098 166616 167869 169609 171280 172482
54080 172482 173190 173682 174302 175160 175992 176446 176564 176870 177894 179676 181755 183565 184785 185406 185615 185659 185714 185782
54062 185782 185664 185160 184376 183787 183797 184246 184552 184426 184276 184737 185943 187401 188503 189019 189171 189420 190147 191385
$$ packed form
54186A66141R47Q39L45P5J81K29J3j20M9K39K89M61P42N27l57r82m52O86J077
54167A70929L50n51p77m52j04K4j24n85j194j557j464j079o76m13l23k59L9N03
54149A62287N66j08q82p65K92J320J571J229P70L35K7J12N08O10J26l31q2N05
54131A68090M04o25j600j479l60P38J045O94L08J87O5l69r47j126o09L33J098
54114A65847J283R86O86P74J110J154O28j25o08q40j221j813k128j689n62P62
54098A64244J721J932J382M82k32o02q11r17p56l46l7j1M9N18J253J740J671J202
54080A72482P08M92O20Q58Q32M54J18L06J024J782K079J810J220O21K09M4N5O8
54062A85782j18n04p84n89J0M49L06j26j50M61J206J458J102N16J52K49P27J238
$$ plain form
54044 191385 192854 194358 196073 198334 201219 204450 207618 210427 212868 215384 218695 223138 228174 232841
54030 232841 236769 240502 244736 249492 254184 258365 262206 266263 270900 275960 280981 285685 290123 294326
54016 294326 298125 301585 305512 311082 318849 328364 338699 348959 358129 364961 368534 368778 366045 360339
54002 360339 351449 339908 327322 315376 304644 294550 284380 274218 265015 257935 253443 250774
53990 250774 248377 245225 241749 239223 238212 237901 237107 235520 233616 231701 229590 227178 224742 222542 220523
53975 220523 218627 217012 215751 214650 213661 213152 213470 214439 215599 216677 217534 217933 217819 217634 217853 218309 218442
53958 218442 218127 217762 217661 217912 218829 220797 223480 225827 227201 228000 228873 229878 230920 232470 235144 238731
53942 238731 242240 244979 247280 250179 254543 260352 266599 272166 277002 282142 288266 294694 300242 304613
$$ packed form
54044A91385J469J504J715K261K885L231L168K809K441K516L311M443N036M667
54030B32841L928L733M234M756M692M181L841M057M637N060N021M704M438M203
54016B94326L799L460L927N570P767R515J0335J0260R170O832L573K44k733n706
54002C60339q890j1541j2586j1946j0732j0094j0170j0162r203p080m492k669
53990B50774k397l152l476k526j011l11p94j587j904j915k111k412k436k200k019
53975B20523j896j615j261j101r89n09L18R69J160J078Q57L99j14j85K19M56J33
53958B18442l15l65j01K51R17J968K683K347J374P99Q73J005J042J550K674L587
53942B38731L509K739K301K899M364N809O247N567M836N140O124O428N548M371
$$ plain form
53928 304613 308220 310963 312087 311292 309206 306626 303995 301754 300460 300190 300461 301071 302519 305200 308748
53913 308748 312612 316784 321446 326354 331127 335830 340750 345904 351248 356964 362895 368042 371455 373508
53899 373508 375423 377535 378844 378492 376883 374984 373182 371286 369148 366742 363964 360809 357544 354323
53885 354323 350865 346791 342100 337003 331589 326019 320778 316273 312311 308405 304522 301092 298314 295895
53871 295895 293565 291485 289955 288902 287822 286172 283850 281323 279230 277795 276802 276204 276373 277472 278958
53856 278958 280212 281465 283510 286681 290797 296085 303264 312396 322421 332368 342478 353513 365272
53843 365272 376407 385411 391166 392737 389456 381438 369601 355084 339038 322870 308001 295054
53831 295054 283678 273435 264506 257289 251743 247542 244545 242614 241131 239263 236754 234156 232188 231137
$$ packed form
53928C04613L607K743J124p95k086k580k631k241j294k70K71O10J448K681L548
53913C08748L864M172M662M908M773M703M920N154N344N716N931N147L413K053
53899C73508J915K112J309l52j609j899j802j896k138k406k778l155l265l221
53885C54323l458m074m691n097n414n570n241m505l962l906l883l430k778k419
53871B95895k330k080j530j053j080j650k322k527k093j435r93n98J69J099J486
53856B78958J254J253K045L171M116N288P179R132J0025R947J0110J1035J1759
53843C65272J1135R004N755J571l281q018j1837j4517j6046j6168j4869j2947
53831B95054j1376j0243q929p217n546m201k997j931j483j868k509k598j968j051
$$ plain form
53817 231137 230876 231114 231478 231603 231339 230840 230401 230284 230580 231065 231245 230900 230606 231348 233451 236206 238715 240779
53799 240779 242718 244732 246886 249443 252668 256337 259922 263260 266677 270441 274523 278827 283097 286576
53785 286576 288456 288977 289499 291020 293033 294256 294136 293135 291945 291036 290675 290668 290140 288257 285239 282087
53769 282087 279244 276153 272315 268140 264388 261268 258512 255999 253843 252039 250373 248612 246603 244365
53755 244365 242224 240621 239569 238539 237093 235374 233786 232564 231921 232207 233365 234524 234712 233909 232831
53740 232831 231744 230166 227868 225485 223774 222750 222006 221562 221827 222865 224188 225356 226415 227616 228933
53725 228933 230062 230794 231208 231558 232019 232560 233000 233234 233387 233671 234076 234303 234135 233714 233312 232928 232459 232230
53707 232230 232939 234775 236956 238571 239649 240934 242731 244645 246529 248958 252293 255819 258475 260223
$$ packed form
53817B31137k61K38L64J25k64m99m39j17K96M85J80l45k94P42K103K755K509K064
53799B40779J939K014K154K557L225L669L585L338L417L764M082M304M270L479
53785B86576J880N21N22J521K013J223j20j001j190r09l61pn28j883l018l152
53769B82087k843l091l838m175l752l120k756k513k156j804j666j761k009k238
53755B44365k141j603j052j030j446j719j588j222o43K86J158J159J88q03j078
53740B32831j087j578k298k383j711j024p44m44K65J038J323J168J059J201J317
53725B28933J129P32M14L50M61N41M40K34J53K84M05K27j68m21m02l84m69k29
53707B32230P09J836K181J615J078J285J797J914J884K429L335L526K656J748
$$ plain form
53693 260223 262069 264782 268094 271259 273879 275978 277629 278849 279766 280601 281441 282049 281998 281061 279594 278358
53677 278358 277775 277445 276598 274963 272948 271044 269399 268041 267118 266718 266657 266704 266862 267213 267637 267901 267938 267850
53659 267850 267723 267621 267732 268179 268677 268715 268285 268135 268881 270079 270663 270383 270182 270823 271714 271780 271155 271098 272223
53640 272223 273663 274366 274411 274465 274593 274437 274196 274501 275402 276285 276867 277532 278478 279218 279308 279037 278961 279152 279364 279742
53620 279742 280868 283110 286163 289261 291799 293837 296009 298781 301857 304585 306897 309392 312374 315310
53606 315310 317516 318981 320166 321351 322609 324159 326258 328844 331670 334631 337601 340079 341471 341740
53592 341740 341440 341098 340912 341003 341531 342343 342820 342370 341011 339373 338206 337807 337800 337433 336262 334553 332925 331674
53574 331674 330598 329408 328060 326725 325670 325130 325073 325104 324879 324575 324678 325352 326367 327640 329363 331399
$$ packed form
53693B60223J846K713L312L165K620K099J651J220R17Q35Q40O08n1r37j467j236
53677B78358n83l30q47j635k015j904j645j358r23m00o1M7J58L51M24K64L7q8
53659B67850j27j02J11M47M98L8m30j50P46J198N84k80k01O41Q91O6o25n7J125
53640B72223J440P03M5N4J28j56k41L05R01Q83N82O65R46P40R0k71p6J91K12L78
53620B79742J126K242L053L098K538K038K172K772L076K728K312K495K982K936
53606C15310K206J465J185J185J258J550K099K586K826K961K970K478J392K69
53592C41740l00l42j86R1N28Q12M77m50j359j638j167l99pl67j171j709j628j251
53574C31674j076j190j348j335j055n40n7L1k25l04J03O74J015J273J723K036
$$ plain form
53558 331399 333057 333909 334525 335951 338548 341700 344576 346814 348511 350041 352049 355278 360026 365811 371681
53543 371681 376871 381173 384877 388456 392186 395925 399217 401762 403794 405991 408966 412817 417126 421439
53529 421439 425813 430851 437159 444804 453428 462803 473108 484617 497328 510961 525104 539205 552698
53516 552698 565537 578546 592919 609256 627284 646529 666946 688720 711800 735970 761237
53505 761237 787710 814987 841988 867638 891661 914616 937256 959975 982757 1005410 1027687
53494 1027687 1049313 1070083 1090058 1109666 1129543 1150207 1171726 1193604 1215027 1235431 1254920
53483 1254920 1274027 1293006 1311569 1329418 1346733 1363755 1380054 1394746 1407542 1419104 1430110
53472 1430110 1440334 1448960 1455480 1459907 1462293 1462536 1460601 1456558 1450271 1441313 1429369 1414671 1398042
$$ packed form
53558C31399J658Q52O16J426K597L152K876K238J697J530K008L229M748N785N870
53543C71681N190M302L704L579L730L739L292K545K032K197K975L851M309M313
53529D21439M374N038O308P645Q624R375J0305J1509J2711J3633J4143J4101J3493
53516E52698J2839J3009J4373J6337J8028J9245K0417K1774K3080K4170K5267
53505G61237K6473K7277K7001K5650K4023K2955K2640K2719K2782K2653K2277
53494A027687K1626K0770J9975J9608J9877K0664K1519K1878K1423K0404J9489
53483A254920J9107J8979J8563J7849J7315J7022J6299J4692J2796J1562J1006
53472A430110J0224Q626O520M427K386K43j935m043o287q958j1944j4698j6629
$$ plain form
53459 1398042 1380497 1362625 1344298 1325112 1305120 1284777 1264082 1242338 1219177 1195346 1171846
53448 1171846 1148700 1125305 1101757 1078844 1056742 1034777 1012858 992207 974056 958252 943718
53437 943718 929778 916471 904125 893395 885332 880450 877796 875705 873626 872625 873965 877708 882926
53424 882926 888867 895631 903972 914661 927827 942765 958580 975132 993147 1013259 1035174 1058094
53412 1058094 1081861 1107284 1135151 1165125 1196040 1227295 1259556 1293838 1330341 1368675 1408922
53401 1408922 1451611 1496629 1543051 1590432 1639514 1691069 1744648 1799204 1854496 1911060 1969024
53390 1969024 2027713 2086334 2144308 2201094 2256545 2311482 2366979 2422697 2476628 2526864 2573053
53379 2573053 2615756 2655093 2690707 2722681 2751642 2777863 2800733 2819284 2833001 2842048 2846788 2847207
$$ packed form
53459A398042j7545j7872j8327j9186j9992k0343k0695k1744k3161k3831k3500
53448A171846k3146k3395k3548k2913k2102k1965k1919k0651j8151j5804j4534
53437I43718j3940j3307j2346j0730q063m882k654k091k079j001J340L743N218
53424H82926N941O764Q341J0689J3166J4938J5815J6552J8015K0112K1915K2920
53412A058094K3767K5423K7867K9974L0915L1255L2261L4282L6503L8334M0247
53401A408922M2689M5018M6422M7381M9082N1555N3579N4556N5292N6564N7964
53390A969024N8689N8621N7974N6786N5451N4937N5497N5718N3931N0236M6189
53379B573053M2703L9337L5614L1974K8961K6221K2870J8551J3717R047M740M19
$$ plain form
53367 2847207 2842853 2833333 2818649 2798732 2772766 2739461 2698175 2649539 2594932 2535782 2473483 2409470
53355 2409470 2344841 2280068 2215351 2151097 2087817 2025766 1965043 1905959 1848999 1794444 1742184
53344 1742184 1691777 1642475 1593408 1544104 1494938 1446899 1400871 1357142 1315538 1275882 1238400
53333 1238400 1203740 1172466 1144471 1119006 1095341 1073254 1052854 1034302 1017869 1003920 992463
53322 992463 982859 974310 966473 959382 953016 947366 942795 939869 938747 939063 940424 942688 945739 949432
53308 949432 953885 959563 966882 975976 986915 999806 1014413 1029995 1045912 1062327 1079994 1099380
53296 1099380 1120305 1142486 1166073 1191360 1218144 1245720 1273571 1301838 1330963 1360977 1391296
53285 1391296 1421078 1449586 1476250 1500660 1522683 1542459 1560151 1575694 1588823 1599331 1607274
$$ packed form
53367B847207m354r520j4684j9917k5966l3305m1286m8636n4607n9150o2299o4013
53355B409470o4629o4773o4717o4254o3280o2051o0723n9084n6960n4555n2260
53344A742184n0407m9302m9067m9304m9166m8039m6028m3729m1604l9656l7482
53333A238400l4660l1274k7995k5465k3665k2087k0400j8552j6433j3949j1457
53322I92463r604q549p837p091o366n650m571k926j122L16J361K264L051L693
53308I49432M453N678P319R094J0939J2891J4607J5582J5917J6415J7667J9386
53296A099380K0925K2181K3587K5287K6784K7576K7851K8267K9125L0014L0319
53285A391296K9782K8508K6664K4410K2023J9776J7692J5543J3129J0508P943
$$ plain form
53274 1607274 1612981 1616777 1618588 1617883 1614234 1607858 1599322 1588685 1575353 1559032 1540434 1520571 1499488
53261 1499488 1476154 1449682 1420315 1389096 1356835 1323589 1288984 1252870 1215674 1178247 1141356
53250 1141356 1105321 1070144 1035939 1003054 971755 941911 913071 884802 856895 829295 801992
53239 801992 775000 748415 722339 696798 671854 647891 625594 605412 587124 570153 554303
53228 554303 539928 527350 516436 506815 498197 490318 482901 475892 469447 463359 456848 449360 441351
53215 441351 433743 426689 419495 411827 404404 398114 392867 387771 382250 376501 370936 365618 360449 355658
53201 355658 351768 349022 346983 344839 342088 338804 335253 331460 327309 322954 318816 315153 311822 308522
53187 308522 305108 301634 298286 295365 293096 291248 289132 286274 283048 280388 278779 277817 276905 276151 276172
$$ packed form
53274A607274N707L796J811p05l649o376q536j0637j3332j6321j8598j9863k1083
53261A499488k3334k6472k9367l1219l2261l3246l4605l6114l7196l7427l6891
53250A141356l6035l5177l4205l2885l1299k9844k8840k8269k7907k7600k7303
53239H01992k6992k6585k6076k5541k4944k3963k2297k0182j8288j6971j5850
53228E54303j4375j2578j0914r621q618p879p417p009o445o088o511p488q009
53215D41351p608p054p194p668p423o290n247n096n521n749n565n318n169m791
53201C55658l890k746k039k144k751l284l551l793m151m355m138l663l331l300
53187C08522l414l474l348k921k269j848k116k858l226k660j609r62r12p54K1
$$ plain form
53172 276172 277071 278063 278327 277894 277361 276944 276341 275439 274566 273852 272930 271641 270592 270473 271086 271651 271939 272503
53154 272503 273659 274833 275120 274107 271965 269149 266298 264088 262760 261916 261016 259911 258723 257468 256162
53139 256162 255110 254613 254426 253915 252883 251864 251457 251629 251939 252215 252671 253416 254195 254735 255115 255558 256000 256124
53121 256124 255889 255807 256523 258246 260674 263350 265883 267877 268925 268880 268068 267162 266798 267205 268027 268490 267942
53104 267942 266388 264401 262451 260422 257939 255094 252563 250867 249636 247901 245242 242401 240539 239979
53090 239979 240017 239969 239878 239954 239835 239034 237925 237553 238295 239311 239636 239299 238963 238872 238771 238661 238889 239354 239253 238043
53070 238043 236334 235283 235232 235390 234995 234335 234324 235317 236817 238312 239873 241691 243443 244568 244968 245034 245022
53053 245022 244831 244432 244081 243926 243692 243004 241798 240323 238932 237953 237444 236964 235909 234286 232780 231828 230997
$$ packed form
53172B76172Q99R92K64m33n33m17o03r02q73p14r22j289j049j19O13N65K88N64
53154B72503J156J174K87j013k142k816k851k210j328q44r00j105j188j255j306
53139B56162j052m97j87n11j032j019m07J72L10K76M56P45P79N40L80M43M42J24
53121B56124k35q2P16J723K428K676K533J994J048m5q12r06l64M07Q22M63n48
53104B67942j554j987j950k029k483k845k531j696j231j735k659k841j862n60
53090B39979L8m8r1P6j19q01j109l72P42J016L25l37l36r1j01j10K28M65j01j210
53070B38043j709j051n1J58l95o60j1R93J500J495J561J818J752J125M00O6j2
53053B45022j91l99l51j55k34o88j206j475j391r79n09m80j055j623j506r52q31
$$ plain form
53036 230997 229720 228262 227403 227382 227758 228171 228517 228356 227002 224582 222396 221664 222282 223212 223783 224065 224194
53019 224194 224009 223419 222640 221858 220982 219894 218781 218040 217958 218516 219355 219952 220045 219967 220340 221274 222044 221765 220324
53000 220324 218415 216687 215122 213410 211765 211050 211943 214113 216436 218015 218837 219347 219715 219791 219660 219764
52984 219764 220371 221199 221785 222064 222391 223039 223892 224580 224822 224629 224292 224184 224593 225704 227636 230248 232936
52967 232936 235001 236399 237865 240008 242514 244557 245758 246321 246379 245787 244598 243214 241884 240512 239090
52952 239090 237901 237028 236109 234915 233738 232783 231572 229562 227119 225283 224559 224433 224094 223153 221598 219558
52936 219558 217329 215311 213713 212500 211676 211361 211601 212352 213610 215174 216351 216481 215898 215733 216433 216985
52920 216985 216038 213455 210356 208004 207170 208164 210679 213651 215910 217166 217937 218564 218843 218678 218439 218396 218317
$$ packed form
53036B30997j277j458q59k1L76M13L46j61j354k420k186p32O18R30N71K82J29
53019B24194j85n90p79p82q76j088j113p41q2N58Q39N97R3p8L73R34P70k79j441
53000B20324j909j728j565j712j645p15Q93K170K323J579Q22N10L68P6j31J04
52984B19764O07Q28N86K79L27O48Q53O88K42j93l37j08M09J111J932K612K688
52967B32936K065J398J466K143K506K043J201N63N8n92j189j384j330j372j422
52952B39090j189q73r19j194j177r55j211k010k443j836p24j26l39r41j555k040
52936B19558k229k018j598j213q24l15K40P51J258J564J177J30n83j65P00N52
52920B16985r47k583l099k352q34R94K515K972K259J256P71O27K79j65k39m3p9
$$ plain form
52903 218317 217981 217632 217444 216945 215574 213613 211964 211012 210287 209385 208659 208697 209516 210719 212194 214178 216695
52886 216695 219288 221433 222917 223769 224029 223760 223120 222287 221380 220495 219702 218982 218268 217557 216790 215721 214205
52869 214205 212697 212047 212665 214207 216278 218902 221863 224149 224868 224590 224953 226878 229860 233122 236577
52854 236577 240253 243550 245785 247028 247789 248164 247899 247037 245819 244090 241443 237960 234238 230643 227085
52839 227085 223597 220588 218358 216796 215741 215241 215265 215550 215949 216597 217536 218536 219514 220778 222560 224543
52823 224543 226153 227077 227315 226992 226439 226128 226142 225911 224876 223265 221793 220782 220042 219518 219464 219875 220303 220452
52805 220452 220657 221520 223299 225731 228129 229524 229141 227074 224271 221617 219209 216731 214217 212081 210589
52790 210589 209693 209289 209255 209299 209159 208986 209232 210055 211084 211753 211670 210741 209341 208351 208530 209637 210495 210229 209179
$$ packed form
52903B18317l36l49j88m99j371j961j649r52p25r02p26L8Q19J203J475J984K517
52886B16695K593K145J484Q52K60k69o40q33r07q85p93p20p14p11p67j069j516
52869B14205j508o50O18J542K071K624K961K286P19k78L63J925K982L262L455
52854B36577L676L297K235J243P61L75k65q62j218j729k647l483l722l595l558
52839B27085l488l009k230j562j055n00K4K85L99O48R39J000R78J264J782J983
52823B24543J610R24K38l23n53l11J4k31j035j611j472j011p40n24n4M11M28J49
52805B20452K05Q63J779K432K398J395l83k067k803k654k408k478k514k136j492
52790B10589q96m04l4M4j40j73K46Q23J029O69q3r29j400r90J79J107Q58k66j050
$$ plain form
52771 209179 208431 208690 209815 211190 212260 212864 213278 213807 214286 214281 213888 213833 214489 215233 215250 214552 213628 212548 211264
52752 211264 210527 211450 213994 216783 218713 219946 220971 221567 221365 220798 220649 220997 221322 221476 221805 222425 223015
52735 223015 223432 223956 224758 225507 225700 225156 224099 222960 222123 221682 221441 221284 221434 222197 223525 225033 226249
52718 226249 226698 226104 224915 224320 225079 226395 226631 225230 223331 222330 222430 222915 223203 223049 222138 220232 217723
52701 217723 215488 214074 213338 212989 213100 213836 214956 215935 216578 217208 218080 218871 219015 218483 217882 217730 217944 218207
52683 218207 218510 219015 219588 219877 219830 219798 220087 220625 221159 221573 221993 222673 223703 224737 225153 224709 223921 223499 223584
52664 223584 223802 223951 224181 224581 225046 225569 226199 226657 226470 225728 225316 226097 228066 230471 232512 233827 234587
52647 234587 235325 236501 238097 239721 241038 241841 241852 240961 239647 238611 237907 236975 235659 234524 233915 233384
$$ packed form
52771B09179p48K59J125J375J070O04M14N29M79nl93n5O56P44J7o98r24j080j284
52752B11264p37R23K544K789J930J233J025N96k02n67j49L48L25J54L29O20N90
52735B23015M17N24Q02P49J93n44j057j139q37m41k41j57J50P63J328J508J216
52718B26249M49n94j189n95P59J316K36j401j899j001J00M85K88j54r11j906k509
52701B17723k235j414p36l49J11P36J120R79O43O30Q72P91J44n32o01j52K14K63
52683B18207L03N05N73K89m7l2K89N38N34M14M20O80J030J034M16m44p88m22Q5
52664B23584K18J49K30M00M65N23O30M58j87p42m12P81J969K405K041J315P60
52647B34587P38J176J596J624J317Q03J1q91j314j036p04r32j316j135o09n31
$$ plain form
52631 233384 232571 232000 232350 233369 234257 234866 235828 237552 239686 241576 242825 243374 243422 243227 242736 241567 239654
52614 239654 237613 236059 234850 233561 232448 232216 232915 233798 234374 234900 235624 236231 236422 236505 236943 237596 237826
52597 237826 237232 236009 234727 233920 233778 234040 234278 234333 234390 234633 235052 235590 236231 236900 237568 238505 240089 242225
52579 242225 244235 245525 246118 246381 246510 246593 246969 248096 249997 252078 253635 254415 254560 254057 252588 250127
52563 250127 247521 245973 245797 246126 246122 245977 246251 246653 246302 245073 243901 243603 244122 245093 246333 247403 247401 245942
52545 245942 243918 242623 242295 242091 241333 240213 239266 238666 238179 237513 236626 235873 235816 236668 237929 238828 239085 239008
52527 239008 238917 238810 238674 238762 239311 240152 240880 241382 241995 243003 244157 244921 245214 245608 246648 248246 250022 251978
52509 251978 254376 257057 259523 261719 264130 266823 269031 270087 270229 269929 268854 266274 262380 258478 255732
$$ packed form
52631B33384q13n71L50J019Q88O09R62J724K134J890J249N49M8j95m91j169j913
52614B39654k041j554j209j289j113k32O99Q83N76N26P24O07J91Q3M38O53K30
52597B37826n94j223j282q07j42K62K38N5N7K43M19N38O41O69O68R37J584K136
52579B42225K010J290N93K63J29Q3L76J127J901K081J557P80J45n03j469k461
52563B50127k606j548j76L29mj45K74M02l51j229j172k98N19R71J240J070kj459
52545B45942k024j295l28k04p58j120r47o00m87o66q87p53n7Q52J261Q99K57p7
52527B39008r1j07j36Q8N49Q41P28N02O13J008J154P64K93L94J040J598J776J956
52509B51978K398K681K466K196K411K693K208J056J42l00j075k580l894l902k746
$$ plain form
52494 255732 254160 253015 251777 250609 250090 250591 251776 252734 252788 252113 251364 250939 250904 251417 252593 253992 254867
52477 254867 255091 255395 256417 257958 259454 260776 262174 263671 264924 265650 265925 266120 266717 268126 270484 273610
52461 273610 277165 280714 283668 285516 286371 286976 287856 288568 288154 286238 283357 280225 277062 273782 270476
52446 270476 267426 264734 262298 260164 258660 258045 258140 258455 258643 258679 258641 258523 258338 258199 258130 257948 257529 257025
52428 257025 256564 255895 254752 253568 253377 254705 256848 258540 259161 259077 258960 259151 259605 260100 260389 260394 260358 260706
52410 260706 261651 263070 264784 266816 269304 272292 275814 280107 285599 292569 300842 309858 319075 328259
52396 328259 337297 345672 352247 355761 355590 351993 345668 337380 328102 319117 311489 305371 300175 295544
52382 295544 291800 289257 287509 285867 284327 283558 283869 284739 285579 286500 287935 289879 292005 294329 297221
$$ packed form
52494B55732j572j145j238j168n19N01J185R58N4o75p49m25l5N13J176J399Q75
52477B54867K24L04J022J541J496J322J398J497J253P26K75J95N97J409K358L126
52461B73610L555L549K954J848Q55O05Q80P12m14j916k881l132l163l280l306
52446B70476l050k692k436k134j504o15R5L15J88L6l8j18j85j39o9j82m19n04
52428B57025m61o69j143j184j91J328K143J692O21q4j17J91M54M95K89Nl6L48
52410B60706R45J419J714K032K488K988L522M293N492O970Q273R016R217R184
52396C28259R038Q375O575L514j71l597o325q288r278q985p628o118n196m631
52382B95544l744k543j748j642j540p69L11Q70Q40R21J435J944K126K324K892
$$ plain form
52367 297221 300754 304520 308100 311272 313629 314563 313979 312645 311454 310532 309447 308081 306853 306098 305626
52352 305626 305013 304029 302779 301741 301707 303270 306125 309124 311299 312699 313967 315350 316494 317128 317462 317871
52336 317871 318582 319864 322152 325631 329880 334217 338248 341809 344639 346669 348665 352030 357655 365181
52322 365181 373516 381760 389514 396657 403273 409617 415818 421652 426836 431482 436007 440661 445356 449904
52308 449904 454265 458625 463464 469362 476521 484511 492701 500725 508372 515394 522012 529295 538244 548396
52294 548396 558028 565966 572501 578249 582898 585770 587145 588195 589674 591310 592468 592939 592956 592877 592984 593372
52278 593372 593956 594731 595917 597611 599413 600817 601881 603132 604735 606266 607445 608736 610875 614031 617658
52263 617658 621050 623901 626452 629295 632940 637362 642024 646462 650794 655547 661060 667134 673269 679155
$$ packed form
52367B97221L533L766L580L172K357R34n84j334j191r22j085j366j228p55m72
52352C05626o13r84j250j038l4J563K855K999K175J400J268J383J144O34L34M09
52336C17871P11J282K288L479M249M337M031L561K830K030J996L365N625P526
52322C65181Q335Q244P754P143O616O344O201N834N184M646M525M654M695M548
52308D49904M361M360M839N898P159P990Q190Q024P647P022O618P283Q949J0152
52294E48396R632P938O535N748M649K872J375J050J479J636J158M71J7p9J07L88
52278E93372N84P75J186J694J802J404J064J251J603J531J179J291K139L156L627
52263F17658L392K851K551K843L645M422M662M438M332M753N513O074O135N886
$$ plain form
52249 679155 685063 691771 699966 709524 719316 727912 734533 739346 742952 745778 748037 750038 752273 755119
52235 755119 758558 762265 765838 768901 771161 772635 773783 775177 776959 778755 780142 780993 781347 781272 781024
52220 781024 781049 781532 782131 782421 782421 782370 782161 781433 780188 778933 778198 778259 779381 781863 785569 789716 793457 796686
52202 796686 800093 804486 809987 815820 820866 824645 827737 831147 835304 839926 844714 849737 855031 860270
52188 860270 865108 869595 874004 878401 882543 885990 888222 888888 888047 885916 882354 877019 870259 863355 857459
52173 857459 852590 848065 843578 839347 835460 831685 827933 824479 821735 820128 820029 821346 823265 824918 826250
52158 826250 827783 829704 831824 834301 837490 840842 842889 842892 841907 841644 842703 844487 846335 848013 849380
52143 849380 850409 851560 853521 856467 859959 863496 866719 869127 870148 869563 867508 864136 859806 855510
$$ packed form
52249F79155N908O708Q195R558R792Q596O621M813L606K826K259K001K235K846
52235G55119L439L707L573L063K260J474J148J394J782J796J387Q51L54p5k48
52220G81024K5M83N99K90%n1k09p28j245j255p35O1J122K482L706M147L741L229
52202G96686L407M393N501N833N046L779L092L410M157M622M788N023N294N239
52188H60270M838M487M409M397M142L447K232O66q41k131l562n335o760o904n896
52173H57459m869m525m487m231l887l775l752l454k744j607r9J317J919J653J332
52158H26250J533J921K120K477L189L352K047Lr85k63J059J784J848J678J367
52143H49380J029J151J961K946L492L537L223K408J021n85k055l372m330m296
$$ plain form
52129 855510 852394 850736 850044 850320 852447 856938 863127 870240 878624 889027 901079 913451 925416 937253
52115 937253 948999 959819 969028 976990 984369 990993 996119 999550 1001852 1003570 1004782 1005508 1006133 1007331
52101 1007331 1009815 1014291 1021275 1030723 1041888 1053728 1065527 1077153 1088661 1099606 1108789 1114919
52089 1114919 1117628 1117665 1115956 1112706 1107687 1101104 1093746 1086366 1079380 1073194 1068334 1064964 1062547 1060206
52075 1060206 1057304 1053661 1049515 1045436 1041988 1039281 1036975 1034819 1032924 1031390 1030044 1028816 1028060 1028144 1028923
52060 1028923 1029932 1030928 1031918 1032896 1033978 1035654 1038442 1042245 1046437 1050592 1054738 1058910 1062842 1066134 1068315
52045 1068315 1068775 1067208 1064290 1061324 1058845 1056044 1051998 1047117 1042840 1040129 1038703 1037681 1036429 1034758
52031 1034758 1032766 1030753 1029085 1027954 1027234 1026482 1024987 1022036 1017441 1011779 1005919 1000328 995048 990073
$$ packed form
52129H55510l116j658o92K76K127M491O189P113Q384J0403J2052J2372J1965J1837
52115I37253J1746J0820R209P962P379O624N126L431K302J718J212P26O25J198
52101A007331K484M476O984R448J1165J1840J1799J1626J1508J0945R183O130
52089A114919K709L7j709l250n019o583p358p380o986o186m860l370k417k341
52075A060206k902l643m146m079l448k707k306k156j895j534j346j228p56Q4P79
52060A028923J009R96R90R78J082J676K788L803M192M155M146M172L932L292K181
52045A068315M60j567k918k966k479k801m046m881m277k711j426j022j252j671
52031A034758j992k013j668j131p20p52j495k951m595n662n860n591n280m975
$$ plain form
52017 990073 985321 980294 974396 967879 962038 958065 955861 954305 952493 950394 948413 946793 945487 944192
52003 944192 942193 938401 931925 922665 911178 898052 883615 868225 852511 837077 822114 807525
$$ packed form
52017I90073m752n027n898o517n841l973k204j556j812k099j981j620j306j295
52003I44192j999l792o476r260j1487j3126j4437j5390j5714j5434j4963j4589
$$ [...]
##END NTUPLES=NMR SPECTRUM
##END=
