
##TITLE=UV1227_M6_1234-1212_90_7231117_pYZuIHwrQY
##JCAMPDX= 6.0         $$ Bruker NMR JCAMP-DX V2.0
##DATA TYPE= NMR SPECTRUM
##DATA CLASS= NTUPLES
##ORIGIN= BRUKER
##OWNER= Administrator
$$ 1.72 TOPSPIN		Version 2.1
$$ 2013-01-24 00:09:55.747 -0500  Administrator@X
$$ Compression mode = diff/dup
##.OBSERVE FREQUENCY= 400.02188249412
##.OBSERVE NUCLEUS= ^1H
##.ACQUISITION MODE= SIMULTANEOUS (DQD)
##.ACQUISITION SCHEME= undefined
##.AVERAGES= 64
##.DIGITISER RES= 22
##SPECTROMETER/DATA SYSTEM= spect
##.PULSE SEQUENCE= noesygpps1d.comp
##.SOLVENT NAME= COFFEE_meoh
##.SHIFT REFERENCE= INTERNAL, COFFEE_meoh, 1, 14.96115
##AUDIT TRAIL= $$ (NUMBER, WHEN, WHO, WHERE, PROCESS, VERSION, WHAT)
$$ ##TITLE= Audit trail, TOPSPIN		Version 2.1
$$ ##JCAMPDX= 5.01
$$ ##ORIGIN= Bruker BioSpin GmbH
$$ ##OWNER= Administrator
$$ $$ E:\/data/COFFEE/nmr/UV1227_M6_1234-1212_90_7231117_pYZuIHwrQY/32/pdata/1/auditp.txt
$$ ##AUDIT TRAIL=  $$ (NUMBER, WHEN, WHO, WHERE, PROCESS, VERSION, WHAT)
(   1,<2013-01-24 00:09:49.888 -0500>,<Administrator>,<X>,<go>,<TOPSPIN 2.1>,
      <created by zg
	started at 2013-01-23 23:58:19.886 -0500,
	POWCHK enabled, PULCHK disabled,
       configuration hash MD5:
       86 BA 57 50 F2 9D 5C 9B 26 00 A9 28 5F 66 2E 89
       data hash MD5: 64K
       95 6E D6 D4 43 C4 7B 7F CC EE ED CD 13 39 2A 06>)
(   2,<2013-01-24 00:09:52.997 -0500>,<Administrator>,<X>,<proc1d>,<TOPSPIN 2.1>,
      <Start of raw data processing
       efp LB = 0.3 FT_mod = 6 PKNL = 1 PHC0 = 0 PHC1 = 0 SI = 128K 
       data hash MD5: 128K
       7D 1D 36 17 C2 7C 4B DE 54 89 0D 06 40 0E 8D FD>)
(   3,<2013-01-24 00:09:54.059 -0500>,<Administrator>,<X>,<proc1d>,<TOPSPIN 2.1>,
      <pk PHC0 = -77.28333 PHC1 = 0 
       data hash MD5: 128K
       FA 7C 51 92 8D B0 A7 7C F1 3A 20 E5 67 EB 94 E8>)
(   4,<2013-01-24 00:09:54.731 -0500>,<Administrator>,<X>,<proc1d>,<TOPSPIN 2.1>,
      <abs ABSG = 1 
       data hash MD5: 128K
       35 0F 42 03 86 59 1F D0 7D 51 2D B2 DA D4 C1 61>)
(   5,<2013-01-24 00:09:54.903 -0500>,<Administrator>,<X>,<proc1d>,<TOPSPIN 2.1>,
      <abs ABSG = 2 
       data hash MD5: 128K
       30 90 B9 A9 A2 8F 0C FA 9E 16 7F 97 65 C9 44 6B>)
(   6,<2013-01-24 00:09:55.075 -0500>,<Administrator>,<X>,<proc1d>,<TOPSPIN 2.1>,
      <abs ABSG = 3 
       data hash MD5: 128K
       E7 14 04 EB F4 C4 62 79 5B A4 E3 56 C1 54 A0 27>)
(   7,<2013-01-24 00:09:55.263 -0500>,<Administrator>,<X>,<proc1d>,<TOPSPIN 2.1>,
      <abs ABSG = 4 
       data hash MD5: 128K
       18 5C DD B3 FF 22 5E 92 78 D7 FE 80 9C 0F 02 D8>)
(   8,<2013-01-24 00:09:55.434 -0500>,<Administrator>,<X>,<proc1d>,<TOPSPIN 2.1>,
      <abs ABSG = 5 
       data hash MD5: 128K
       91 49 D7 E8 2E DD 1D 38 04 4B 30 1C 80 66 01 69>)
$$ ##END=
$$ 
$$ $$ hash MD5
$$ $$ 07 84 49 E9 9E 57 F5 81 3B 80 E8 99 AE 6D ED 49
##$RELAX= 
##$RELAX= 
##$RELAX= 
##$RELAX= 
##$RELAX= 
##$RELAX= 
##$RELAX= 
##$RELAX= 
$$ Bruker specific parameters
$$ --------------------------
##$DU= <E:\>
##$EXPNO= 32
$$ [...]
##$TP07= 0
##$TPNAME0= <>
##$TPNAME1= <>
##$TPNAME2= <>
##$TPNAME3= <>
##$TPNAME4= <>
##$TPNAME5= <>
##$TPNAME6= <>
##$TPNAME7= <>
##$TPOAL= (0..7)
0.5 0.5 0.5 0.5 0.5 0.5 0.5 0.5
##$TPOFFS= (0..7)
0 0 0 0 0 0 0 0
##$TUNHIN= 0
##$TUNHOUT= 0
##$TUNXOUT= 0
##$USERA1= <user>
##$USERA2= <user>
##$USERA3= <user>
##$USERA4= <user>
##$USERA5= <user>
##$V9= 5
##$VALIST= <valist>
##$VCLIST= <CCCCCCCCCCCCCCC>
##$VD= 0
##$VDLIST= <DDDDDDDDDDDDDDD>
##$VPLIST= <PPPPPPPPPPPPPPP>
##$VTLIST= <TTTTTTTTTTTTTTT>
##$WBST= 1024
##$WBSW= 4
##$XGAIN= (0..3)
0 0 0 0
##$XL= 0
##$YL= 0
##$YMAX_a= 5755832
##$YMIN_a= -11970460
##$ZGOPTNS= <>
##$ZL1= 120
##$ZL2= 120
##$ZL3= 120
##$ZL4= 120
##$ABSF1= 14.96115
##$ABSF2= -5.597032
##$ABSG= 5
##$ABSL= 3
##$ALPHA= 0
##$AQORDER= 0
##$ASSFAC= 0
##$ASSFACI= 0
##$ASSFACX= 0
##$ASSWID= 0
##$AUNMP= <proc_prof1d_extract.lims>
##$AXLEFT= 0
##$AXNAME= <>
##$AXNUC= <1H>
##$AXRIGHT= 0
##$AXTYPE= 0
##$AXUNIT= <>
##$AZFE= 0.1
##$AZFW= 0.1
##$BCFW= 0
##$BC_mod= 0
##$BYTORDP= 0
##$COROFFS= 0
##$CY= 15
##$DATMOD= 1
##$DC= 0
##$DFILT= <>
##$DTYPP= 0
##$F1P= 0
##$F2P= 0
##$FCOR= 0.5
##$FTSIZE= 131072
##$FT_mod= 6
##$GAMMA= 0
##$GB= 0
##$INTBC= 1
##$INTSCL= 1
##$ISEN= 128
##$LB= 0.3
##$LEV0= 0
##$LPBIN= 0
##$MAXI= 10000
##$MC2= 0
##$MEAN= 0
##$ME_mod= 0
##$MI= 0
##$NCOEF= 0
##$NC_proc= -2
##$NLEV= 6
##$NOISF1= 0
##$NOISF2= 0
##$NSP= 0
##$NTH_PI= 0
##$NZP= 0
##$OFFSET= 14.96115
##$PC= 1
##$PHC0= -77.28333
##$PHC1= 0
##$PH_mod= 1
##$PKNL= yes
##$PPARMOD= 0
##$PPDIAG= 0
##$PPIPTYP= 0
##$PPMPNUM= 2147483647
##$PPRESOL= 1
##$PSCAL= 4
##$PSIGN= 0
##$PYNMP= <proc.py>
##$REVERSE= no
##$SF= 400.020009574973
##$SI= 131072
##$SIGF1= 0
##$SIGF2= 0
##$SINO= 400
##$SIOLD= 131072
##$SPECTYP= <>
##$SREGLST= <1H.CDCl3>
##$SSB= 0
##$STSI= 131072
##$STSR= 0
##$SW_p= 8223.68421052631
##$SYMM= 0
##$S_DEV= 0
##$TDeff= 65536
##$TDoff= 0
##$TI= <>
##$TILT= no
##$TM1= 0
##$TM2= 0
##$TOPLEV= 0
##$USERP1= <user>
##$USERP2= <user>
##$USERP3= <user>
##$USERP4= <user>
##$USERP5= <user>
##$WDW= 1
##$XDIM= 131072
##$YMAX_p= 378700326
##$YMIN_p= -12690
##$CURPLOT= <Network HP LaserJet P1505>
##$CURPRIN= <$Network HP LaserJet P1505>
##$DFORMAT= <normdp>
##$LAYOUT= <+/1D_H.xwp>
##$LFORMAT= <normlp>
##$PFORMAT= <normpl>
##$SURQMSG= 1
$$ End of Bruker specific parameters
$$ ---------------------------------
##NTUPLES= NMR SPECTRUM
##VAR_NAME=  FREQUENCY,     SPECTRUM/REAL,   SPECTRUM/IMAG
##SYMBOL=    X,             R,               I
##VAR_TYPE=  INDEPENDENT,   DEPENDENT,       DEPENDENT
##VAR_FORM=  AFFN,          ASDF,            ASDF
##VAR_DIM=   131072,        131072,          131072
##UNITS=     HZ,            ARBITRARY UNITS, ARBITRARY UNITS
##FACTOR=    0.0627417313425164, 1,          1
##FIRST=     8223.62146879497, -1573,        -54082
##LAST=      0,             140,             -55387
##MIN=       0,             -12690,          0
##MAX=       8223.62146879497, 378700326,    0
$$ Real data points
##PAGE= N=1
##DATA TABLE= (X++(R..R)), XYDATA
$$ [...]
$$ plain form
61591 445486 443003 440756 438669 436493 434153 431937 430170 428789 427429 425843 424033 421959 419422 416394
61577 416394 413289 410672 408697 407009 405243 403417 401743 400181 398354 395847 392481 388431 384250 380725
61563 380725 378405 377178 376467 375842 375210 374403 373022 370927 368654 366969 366100 365633 365050 364138 363042 362226
61547 362226 362273 363362 364903 366054 366605 367069 367839 368623 368909 368750 368868 369982 372109 374494 376369 377854
61531 377854 379859 382837 385930 387855 388450 388655 388992 388872 387709 385988 384624 383738 382695 381063 378892
61516 378892 376244 373161 370170 368192 367575 367556 367009 365644 364226 363561 363431 362770 360875 358171 355533 353210
61500 353210 350968 349133 348576 349331 350030 349404 347877 346907 347046 347530 347696 347884 348605 349541 349881 349321 348297
61483 348297 347422 347046 347218 347739 348175 348124 347621 347220 347510 348478 349408 349537 348832 348005 347803 348388 349332 349968 349787
$$ packed form
61591D45486k483k247k087k176k340k216j767j381j360j586j810k074k537l028
61577D16394l105k617j975j688j766j826j674j562j827k507l366m050m181l525
61563C80725k320j227p11o25o32q07j381k095k273j685q69m67n83r12j096q16
61547C62226M7J089J541J151N51M64P70P84K86j59J18J114K127K385J875J485
61531C77854K005K978L093J925N95K05L37j20j163j721j364q86j043j632k171
61516C78892k648l083k991j978o17j9n47j365j418o65j30o61j895k704k638k323
61500C53210k242j835n57P55O99o26j527r70J39M84J66J88P21R36L40n60j024
61483C48297q75l76J72N21M36n1n03m01K90R68R30J29p05q27k02N85R44O36j81
$$ plain form
61464 349787 348910 348285 349010 351204 353836 355920 357460 358876 359933 359912 358689 357058 355849 355186 354702 354130
61448 354130 353544 353216 353342 353815 354369 354992 355968 357271 358282 358499 358320 358631 359814 361657 364067 367245 371117
61431 371117 375209 379196 383093 386795 389957 392527 394943 397611 400548 403696 407188 411094 415215 419259
61417 419259 422973 426073 428478 430657 433251 436176 438614 440062 440880 441488 441595 440664 438755 436403 433907
61402 433907 431157 427989 424332 420190 415875 412036 409099 406760 404442 402073 400045 398492 397114 395777
61388 395777 394841 394650 394939 395030 394552 393809 393406 393618 394223 394945 395841 397049 398283 398913 398660 397961 397521 397668
61370 397668 398283 399192 400390 401933 403792 405829 407947 410178 412577 414954 416913 418343 419729 421741 424605
61355 424605 428131 432182 436739 441609 446556 451787 457871 465077 473237 482304 492537 503954 516142
$$ packed form
61464C49787q77o25P25K194K632K084J540J416J057k1j223j631j209o63m84n72
61448C54130n86l28J26M73N54O23R76J303J011K17j79L11J183J843K410L178L872
61431C71117M092L987L897L702L162K570K416K668K937L148L492L906M121M044
61417D19259L714L100K405K179K594K925K438J448Q18O08J07r31j909k352k496
61402D33907k750l168l657m142m315l839k937k339k318k369k028j553j378j337
61388C95777r36j91K89R1m78p43m03K12O05P22Q96J208J234O30k53o99m40J47
61370C97668O15R09J198J543J859K037K118K231K399K377J959J430J386K012K864
61355D24605L526M051M557M870M947N231O084P206Q160R067J0233J1417J2188
$$ plain form
61342 516142 528939 542812 558088 574080 589383 602868 614141 623278 630524 636078 639827 641367
61330 641367 640489 637521 633008 627250 620376 612653 604422 595893 587301 579153 571990 565946 560741 556056
61316 556056 551745 547741 543955 540313 536860 533838 531561 530084 529096 528382 528237 529043 530568 532301 534492
61301 534492 538153 543730 550460 557431 564712 572859 581753 590581 598653 605602 610953 614042 614372 611722
61287 611722 606192 598578 590455 583268 577337 572172 567620 564211 562409 562045 562558 563454 564524 565971 568324
61272 568324 571946 576611 581846 587552 593965 601092 608613 616349 624483 633239 642574 652224 661898 671571
61258 671571 681736 693157 706084 719929 734089 748879 765148 783031 801515 819201 835115
61247 835115 848762 859774 867653 871638 870912 865237 855436 842987 829141 814572 799681 784858 770456
$$ packed form
61342E16142J2797J3873J5276J5992J5303J3485J1273R137P246N554L749J540
61330F41367q78k968m513n758o874p723q231q529q592q148p163o044n205m685
61316E56056m311m004l786l642l453l022k277j477r88p14j45Q06J525J733K191
61301E34492L661N577O730O971P281Q147Q894Q828Q072O949N351L089L30k650
61287F11722n530p614q123p187n931n165m552l409j802l64N13Q96J070J447K353
61272E68324L622M665N235N706O413P127P521P736Q134Q756R335R650R674R673
61258F71571J0165J1421J2927J3845J4160J4790J6269J7883J8484J7686J5914
61247H35115J3647J1012P879L985p26n675r801j2449j3846j4569j4891j4823j4402
$$ plain form
61234 770456 756786 744185 732915 723063 714610 707469 701339 695810 690800 686640 683501 681117 679267
61221 679267 678102 677628 677385 677131 677416 678863 681181 683450 685100 686045 686246 685776 684940 683632 680992 676594
61205 676594 671671 668197 666855 666826 667337 668396 670072 672246 675222 679492 684771 690401 696982 706423 719803
61190 719803 736195 754133 773283 794006 816207 839490 863757 888784 913654 937326 959393
61179 959393 979701 997684 1012766 1025109 1035416 1044258 1051934 1058544 1063721 1066719 1067203 1065577 1062150
61166 1062150 1056563 1048486 1038239 1026080 1011494 994011 974313 953727 932941 911956 891006 870686
61154 870686 851296 832798 815384 799423 784939 771703 759791 749582 741327 735192 731497 730349
61142 730349 731232 733493 736964 741534 746386 750384 752988 754037 752884 748795 742272 735066 728664 723512
$$ packed form
61234G70456j3670j2601j1270r852q453p141o130n529n010m160l139k384j850
61221F79267j165m74k43k54K85J447K318K269J650R45K01m70q36j308k640m398
61205F76594m923l474j342k9N11J059J676K174K976M270N279N630O581R441J3380
61190G19803J6392J7938J9150K0723K2201K3283K4267K5027K4870K3672K2067
61179I59393K0308J7983J5082J2343J0307Q842P676O610N177K998M84j626l427
61166A062150n587q077j0247j2159j4586j7483j9698k0586k0786k0985k0950k0320
61154H70686j9390j8498j7414j5961j4484j3236j1912j0209q255o135l695j148
61142G30349Q83K261L471M570M852L998K604J049j153m089o523p206o402n152
$$ plain form
61128 723512 719815 718137 718751 721194 725025 730502 738016 747401 758392 771358 786902 804855 824218
61115 824218 844160 864715 886490 909932 934894 960711 986686 1012620 1038786 1065287 1091485
61104 1091485 1116303 1139006 1159539 1178073 1194429 1208097 1218718 1226380 1231439 1234223 1234888 1233255
61092 1233255 1228533 1219478 1205253 1186202 1163538 1138349 1111211 1082657 1053416 1024041 994778 966013
61080 966013 938431 912480 888074 865080 843709 824209 806573 790844 777247 765694 755633
61069 755633 746739 739253 733224 727968 722839 718065 714234 711408 709416 708503 708892 710078 711498 713603 717327
61054 717327 722631 728551 734671 741599 749880 759375 769937 781817 795099 809492 825060 842469 862113
61041 862113 883486 905762 928572 951960 976060 1001125 1027501 1055319 1084427 1114612 1145439
$$ packed form
61128G23512l697j678O14K443L831N477P514R385J0991J2966J5544J7953J9363
61115H24218J9942K0555K1775K3442K4962K5817K5975K5934K6166K6501K6198
61104A091485K4818K2703K0533J8534J6356J3668J0621P662N059K784O65j633
61092A233255m722r055j4225j9051k2664k5189k7138k8554k9241k9375k9263k8765
61080I66013k7582k5951k4406k2994k1371j9500j7636j5729j3597j1553j0061
61069G55633q894p486o029n256n129m774l831k826j992r13L89J186J420K105L724
61054G17327N304N920O120O928Q281R495J0562J1880J3282J4393J5568J7409J9644
61041H62113K1373K2276K2810K3388K4100K5065K6376K7818K9108L0185L0827
$$ plain form
61030 1145439 1175985 1205366 1233676 1261829 1290386 1319171 1348147 1377891 1408884 1440958 1473885
61019 1473885 1508039 1544153 1582867 1624716 1670093 1718939 1770866 1825794 1884114 1946264 2012823
61008 2012823 2085212 2165747 2256762 2360196 2478057 2612611 2765982 2940269 3138266 3363752
60998 3363752 3621641 3919215 4267800 4683352 5186737 5804817 6569553 7513017 8663856
60989 8663856 10050573 11702278 13632080 15813018 18181360 20677862 23279953 25969831
60981 25969831 28658787 31159351 33258961 34833096 35886813 36498666 36751593 36728674 36543585
60972 36543585 36318470 36095743 35774306 35152744 34049915 32397732 30246054 27713598 24946925
60963 24946925 22103034 19332474 16753904 14437853 12411615 10674061 9205942 7976289
$$ packed form
61030A145439L0546K9381K8310K8153K8557K8785K8976K9744L0993L2074L2927
61019A473885L4154L6114L8714M1849M5377M8846N1927N4928N8320O2150O6559
61008B012823P2389Q0535R1015J03434J17861J34554J53371J74287J97997K25486
60998C363752K57889K97574L48585M15552N03385O18080P64736R43464J150839
60989H663856J386717J651705J929802K180938K368342K496502K602091K689878
60981B5969831K688956K500564K099610J574135J053717O11853K52927k2919j85089
60972C6543585k25115k22727l21437o21562j102829j652183k151678k532456k766673
60963B4946925k843891k770560k578570k316051k026238j737554j468119j229653
$$ plain form
60955 7976289 6950846 6099622 5397488 4820441 4344702 3949482 3618488 3338572 3098582
60946 3098582 2889886 2706598 2544472 2399849 2269613 2151421 2043660 1945325 1855631 1773292
60936 1773292 1696265 1622618 1551481 1482778 1416297 1351566 1288508 1227761 1170283 1116833 1067650
60925 1067650 1022398 980633 942481 908502 878729 852281 828279 806619 787418 770159 754021
60914 754021 738772 724834 712685 702673 695070 689685 685613 681993 678887 676898 676139 676190 676959 678804
60900 678804 681744 685129 688227 690646 692058 692041 690415 687397 683267 678056 671590 663637 654073 643186
60886 643186 631727 620350 609157 598106 587605 578168 569598 561132 552415 543727 535268 526847 518460
60873 518460 510491 503077 495824 488497 481547 475613 470913 467474 465539 465233 466044 467180 468436 470452 474024
$$ packed form
60955G976289j025443q51224p02134n77047m75739l95220l30994k79916k39990
60946C098582k08696j83288j62126j44623j30236j18192j07761r8335q9694q2339
60936A773292p7027p3647p1137o8703o6481o4731o3058o0747n7478n3450m9183
60925A067650m5252m1765l8152l3979k9773k6448k4002k1660j9201j7259j6138
60914G54021j5249j3938j2149j0012p603n385m072l620l106j989p59N1P69J845
60900F78804K940L385L098K419J412j7j626l018m130n211o466p953r564j0887
60886F43186j1459j1377j1193j1051j0501r437q570q466q717q688q459q421q387
60873E18460p969p414p253p327o950n934m700l439j935l06Q11J136J256K016L572
$$ plain form
60858 474024 479280 485447 491420 496704 501827 507632 514241 521069 527831 534943 542683 550495 557617 564059
60844 564059 570426 576922 583021 588063 591815 594430 596238 597621 598777 599442 599032 597127 593760 589203 583663
60829 583663 577314 570526 563873 557759 552062 546253 539928 533076 525793 518041 509943 502010 494621 487467
60815 487467 480021 472401 465134 458201 451164 444332 438784 434799 431180 426851 422345 418863 416477 414375
60801 414375 412403 411136 410528 409802 408848 408580 409503 410895 411974 413031 414794 417332 420276 423559 427202
60786 427202 430754 433743 436472 439695 443627 447901 452414 457597 463755 470649 477766 484631 490855 496377
60772 496377 501676 507335 513330 519212 524931 530862 536889 542216 546525 550708 555794 561525 566651 570448
60758 570448 573184 575244 576681 577854 579701 582782 586508 589928 592990 596404 600365 604132 607019 609263
$$ packed form
60858D74024N256O167N973N284N123N805O609O828O762P112P740P812P122O442
60844E64059O367O496O099N042L752K615J808J383J156O65m10j905l367m557n540
60829E83663o349o788o653o114n697n809o325o852p283p752q098p933p389p154
60815D87467p446p620p267o933p037o832n548l985l619m329m506l482k386k102
60801D14375j972j267o08p26r54k68R23J392J079J057J763K538K944L283L643
60786D27202L552K989K729L223L932M274M513N183O158O894P117O865O224N522
60772D96377N299N659N995N882N719N931O027N327M309M183N086N731N126L797
60758E70448K736K060J437J173J847L081L726L420L062L414L961L767K887K244
$$ plain form
60744 609263 611608 614363 617252 619981 622605 625369 628470 632031 636132 640799 646030 651872 658569 666648
60730 666648 676794 689420 704387 721283 739912 760291 782235 805378 829613 855015 881089
60719 881089 906582 930380 952179 971791 988341 1000823 1009206 1014134 1015626 1012906 1005648 994605
60707 994605 980699 964209 945263 924492 902614 879784 855910 831304 806532 781877 757500
60696 757500 733860 711401 689954 668971 648355 628557 609900 592269 575554 559933 545621
60685 545621 532665 521068 510765 501411 492562 484195 476770 470634 465641 461459 457973 455223 453162
60672 453162 451618 450313 448888 447153 445405 444142 443372 442511 441126 439406 437613 435453 432471 428968 426040
60657 426040 424588 424490 424792 424565 423620 422605 422497 423884 426676 430450 434954 440202 446245 452893 459519 465105
$$ packed form
60744F09263K345K755K889K729K624K764L101L561M101M667N231N842O697Q079
60730F66648J0146J2626J4967J6896J8629K0379K1944K3143K4235K5402K6074
60719H81089K5493K3798K1799J9612J6550J2482Q383M928J492k720p258j1043
60707I94605j3906j6490j8946k0771k1878k2830k3874k4606k4772k4655k4377
60696G57500k3640k2459k1447k0983k0616j9798j8657j7631j6715j5621j4312
60685E45621j2956j1597j0303r354q849q367p425o136m993m182l486k750k061
60672D53162j544j305j425j735j748j263p70q61j385j720j793k160k982l503k928
60657D26040j452r8L02k27r45j015j08J387K792L774M504N248O043O648O626N586
$$ plain form
60641 465105 468857 471056 472996 475691 478840 481510 483626 486140 489664 493592 496865 499095 500544 501402
60627 501402 501695 501728 502050 502835 503577 503494 502106 499438 495920 492126 488454 484957 481499 477979 474296 470268
60611 470268 465867 461504 457813 455112 453250 451897 450769 449545 447939 445975 443986 442247 440729 439298
60597 439298 437959 436842 436129 435992 436357 436711 436525 435973 435871 436663 437892 438980 440102 441753 443682 444908
60581 444908 444869 444132 443911 445184 448254 452758 457957 463282 468747 474661 481072 487815 494996 503021 512124
60566 512124 522309 533806 547100 562370 579376 598044 618669 641203 664810 688432 711368
60555 711368 732922 751850 766689 776432 780641 779303 773167 763876 753119 741699 729939 718728
60543 718728 709500 703201 699991 700025 703871 712013 724578 741802 764057 790962 820927 852036 883001
$$ packed form
60641D65105L752K199J940K695L149K670K116K514L524L928L273K230J449Q58
60627E01402K93L3L22P85P42q3j388k668l518l794l672l497l458l520l683m028
60611D70268m401m363l691k701j862j353j128j224j606j964j989j739j518j431
60597D39298j339j117p13j37L65L54j86n52j02P92J229J088J122J651J929J226
60581D44908l9p37k21J273L070M504N199N325N465N914O411O743P181Q025R103
60566E12124J0185J1497J3294J5270J7006J8668K0625K2534K3607K3622K2936
60555G11368K1554J8928J4839R743M209j338o136r291j0757j1420j1760j1211
60543G18728r228o299l210L4L846Q142J2565J7224K2255K6905K9965L1109L0965
$$ plain form
60530 883001 912881 940333 963787 982218 995244 1002625 1004247 1000633 993032 982900 971518 960013
60518 960013 949292 939812 931689 924995 919650 915037 910244 904936 899660 895094 891357 888374 886572 886725
60504 886725 889153 893510 899457 907277 917800 931980 950676 974642 1004536 1041071 1085217 1138094
60492 1138094 1200462 1272312 1353000 1441658 1537271 1638298 1742270 1845726 1944530 2034288 2110712
60481 2110712 2169774 2207921 2222564 2212702 2179066 2123628 2049118 1959067 1857946 1750645 1641514
60470 1641514 1533875 1430307 1333013 1243738 1163512 1092630 1030823 977399 931433 891988 858188
60459 858188 829156 804064 782310 763499 747255 733237 721266 711141 702238 693672 685048 676787
60447 676787 669485 663177 657394 651660 645681 639429 633384 628362 624601 621272 617428 613276 609877 607647
$$ packed form
60530H83001K9880K7452K3454J8431J3026P381J622l614p601j0132j1382j1505
60518I60013j0721r480q123o694n345m613m793n308n276m566l737k983j802J53
60504H86725K428M357N947P820J0523J4180J8696K3966K9894L6535M4146N2877
60492A138094O2368P1850Q0688Q8658R5613J01027J03972J03456R8804Q9758P6424
60481B110712N9062L8147J4643r862l3636n5438p4510r0051j01121j07301j09131
60470A641514j07639j03568r7294q9275q0226p0882o1807n3424m5966l9445l3800
60459H58188k9032k5092k1754j8811j6244j4018j1971j0125q903q566q624q261
60447F76787p302o308n783n734n979o252o045n022l761l329l844m152l399k230
$$ plain form
60433 607647 605869 603834 601802 600486 600141 600569 601550 602737 603410 602880 601171 598909 596543 593920 590667
60418 590667 586826 583049 580178 578557 577755 577195 577004 577876 579950 582251 583664 584130 584464 585212 586212 587140
60402 587140 587888 588387 588592 588796 589552 591063 593052 595385 598356 602080 606069 609870 613799 618478 623763
60387 623763 628699 632578 635601 638336 640945 643169 644821 646023 647087 648354 650016 651928 653712 655155
60373 655155 656456 657992 660029 662807 666612 671470 676873 682238 687699 694136 702296 712116 722956 734210
60359 734210 745513 756612 767335 777662 787668 797450 807122 816743 826168 835301 844757 856103 871099
60346 871099 890748 915341 945251 981203 1023610 1072007 1125274 1182049 1240495 1297749 1349988
60335 1349988 1393300 1424655 1442295 1445581 1434670 1410360 1374115 1328125 1275183 1218431 1161034
$$ packed form
60433F07647j778k035k032j316l45M28R81J187O73n30j709k262k366k623l253
60418E90667l841l777k871j621q02n60j91Q72K074K301J413M66L34P48J000R28
60402E87140P48M99K05K04P56J511J989K333K971L724L989L801L929M679N285
60387F23763M936L879L023K735K609K224J652J202J064J267J662J912J784J443
60373F55155J301J536K037K778L805M858N403N365N461O437Q160R820J0840J1254
60359G34210J1303J1099J0723J0327J0006R782R672R621R425R133R456J1346J4996
60346H71099J9649K4593K9910L5952M2407M8397N3267N6775N8446N7254N2239
60335A349988M3312L1355J7640L286j0911k4310l6245m5990n2942n6752n7397
$$ plain form
60324 1161034 1105835 1054969 1009644 970270 936809 908984 886285 868003 853401 841816 832640
60313 832640 825393 819874 816142 814209 813867 814985 817914 823342 831605 842295 854785 869137 886311
60300 886311 907404 932903 962835 997256 1035909 1077253 1118403 1156654 1190995 1221772 1249043
60289 1249043 1271897 1289582 1302839 1313538 1322977 1330692 1334858 1333551 1325591 1310458 1287833 1257437
60277 1257437 1219344 1174378 1124215 1071118 1017478 965340 916142 870801 830029 794414 764186
60266 764186 738994 718079 700635 685979 673502 662676 653118 644631 637207 630977 626026 622155 618900
60253 618900 615846 612814 609766 606813 604399 603066 602696 602283 600884 598639 596425 594631 592898 591097 589933
60238 589933 590164 591590 593179 594084 594251 594188 594444 595397 597358 600677 605625 612089 619476 627034 634268 640975
$$ packed form
60324A161034n5199n0866m5325l9374l3461k7825k2699j8282j4602j1585r176
60313H32640p247n519l732j933l42J118K929N428Q263J0690J2490J4352J7174
60300H86311K1093K5499K9932L4421L8653M1344M1150L8251L4341L0777K7271
60289A249043K2854J7685J3257J0699R439P715M166j307p960j5133k2625l0396
60277A257437l8093m4966n0163n3097n3640n2138m9198m5341m0772l5615l0228
60266G64186k5192k0915j7444j4656j2477j0826r558q487p424o230m951l871l255
60253F18900l054l032l048k953k414j333l70m13j399k245k214j794j733j801j164
60238E89933K31J426J589R05J67o3K56R53J961L319M948O464P387P558P234O707
$$ plain form
60222 640975 647049 652484 657476 662221 666552 669942 671928 672424 671739 670464 669253 668476 668125 668172 668804 670087
60206 670087 671628 673010 674338 675822 677048 677341 676844 676527 676980 677834 678482 678671 678217 676964 675463 674892
60190 674892 675650 676610 676431 675130 673680 672585 671753 671414 672166 674054 676447 678984 681989 685737 689869 693719
60174 693719 696812 698956 700320 701567 703404 705834 708240 710423 713127 717302 723197 730408 738466 747016
60160 747016 755660 763950 771481 777770 782233 784489 784639 783056 780003 775619 770213 764315 758420 752783
60146 752783 747536 742909 739311 737137 736483 737040 738355 740207 742659 745778 749438 753486 757942 762883 768202
60131 768202 773691 779325 785139 790652 794692 796222 795359 793144 790206 786083 780158 772803 765121 757846
60117 757846 751126 745222 740645 737479 735209 733499 732610 732834 734022 735981 738837 742640 747008 751592 756567
$$ packed form
60222F40975O074N435M992M745M331L390J986M96o85j275j211p77l51M7O32J283
60206F70087J541J382J328J484J226K93m97l17M53Q54O48J89m54j253j501n71
60190F74892P58R60j79j301j450j095q32l39P52J888K393K537L005L748M132L850
60174F93719L093K144J364J247J837K430K406K183K704M175N895P211Q058Q550
60160G47016Q644Q290P531O289M463K256J50j583l053m384n406n898n895n637
60146G52783n247m627l598k174o54N57J315J852K452L119L660M048M456M941N319
60131G68202N489N634N814N513M040J530q63k215k938m123n925p355p682p275
60117G57846o720n904m577l166k270j710q89K24J188J959K856L803M368M584M975
$$ plain form
60102 756567 762351 769135 776911 785447 793855 800768 805535 808880 811834 814434 816062 816622 816521 815736 813774
60087 813774 810552 806613 802482 798452 794916 792209 790142 788344 787071 786906 787569 787807 786631 784019 780249
60072 780249 775332 769415 763020 756467 749545 742096 734443 726963 719749 713036 707409 703248 700345 698330
60058 698330 696906 695399 692740 688423 682965 676968 670266 662541 654188 645828 637409 628577 619703 611672
60044 611672 604775 598625 593209 589259 587322 587036 587620 588667 590218 592354 594983 597815 600339 601981 602456
60029 602456 602004 601203 600525 599947 598874 596564 592781 588033 583143 578696 574882 571518 568054 563916 559225
60014 559225 554944 551945 550062 548440 546688 545267 544845 545736 548010 551652 556423 561909 567972 574998 583528
59999 583528 593760 605469 618247 631745 645737 659996 674036 687084 698419 707681 714650 718918
$$ packed form
60102G56567N784O784P776Q536Q408O913M767L345K954K600J628N60j01p85j962
60087H13774l222l939m131m030l536k707k067j798j273j65O63K38j176k612l770
60072G80249m917n917o395o553o922p449p653p480p214o713n627m161k903k015
60058F98330j424j507k659m317n458n997o702p725q353q360q419q832q874q031
60044F11672o897o150n416l950j937k86N84J047J551K136K629K832K524J642M75
60029F02456m52q01o78n78j073k310l783m748m890m447l814l364l464m138m691
60014E59225m281k999j883j622j752j421m22Q91K274L642M771N486O063P026Q530
59999E83528J0232J1709J2778J3498J3992J4259J4040J3048J1335R262O969M268
$$ plain form
59987 718918 720145 718607 715084 710052 703343 694781 684859 674516 664469 655001 646231 638227 630884 624007
59973 624007 617577 611710 606310 600969 595358 589586 584058 579083 574764 571140 568208 565806 563699 561911
59959 561911 560806 560713 561571 563072 565067 567663 570890 574484 578119 581799 585920 590847 596445 602151 607530
59944 607530 612635 617618 622183 625794 628468 630819 633059 634351 633606 630691 626415 621524 616270 610851
59930 610851 605662 600934 596565 592460 588716 585354 582186 579061 575954 572800 569622 566904 565354 565087
59916 565087 565377 565346 564608 563240 561674 560753 561239 562863 564382 565025 565435 566727 569043 571596 573811 575754
59900 575754 577654 579624 581777 584077 586165 587876 589875 593171 597942 603363 608675 613926 619439 625096
59886 625096 630422 635117 639118 642371 644823 646688 648517 650913 654099 657766 661420 664840 667992 670501
$$ packed form
59987G18918J227j538l523n032o709q562r922j0343j0047r468q770q004p343o877
59973F24007o430n867n400n341n611n772n528m975m319l624k932k402k107j788
59959E61911j105r3Q58J501J995K596L227L594L635L680M121M927N598N706N379
59944F07530N105M983M565L611K674K351K240J292p45k915m276m891n254n419
59930F10851n189m728m369m105l744l362l168l125l107l154l178k718j550k67
59916E65087K90l1p38j368j566r21M86J624J519O43M10J292K316K553K215J943
59900E75754J900J970K153K300K088J711J999L296M771N421N312N251N513N657
59886F25096N326M695M001L253K452J865J829K396L186L667L654L420L152K509
$$ plain form
59872 670501 671688 671407 670427 669480 668217 665667 661540 656424 650710 644158 636819 629703 623965 619758 616332
59857 616332 613060 609991 607542 606101 605927 607048 609022 610929 611823 611431 610512 610441 612223 615873 620786 626540
59841 626540 633054 640147 647499 655271 664267 675130 687614 701057 715344 730884 747588 764357
59829 764357 779829 793330 804817 814061 820375 823224 822832 819894 814802 807366 797204 784125 768091
59816 768091 749149 727729 704945 682349 661300 642534 626183 611986 599525 588519 579019 571282
59804 571282 565373 560932 557391 554351 551679 549277 546911 544392 541816 539421 537183 534831 532360 530202
59790 530202 528585 527016 524861 522280 520049 518446 516959 515216 513534 512155 510547 508066 504965 502111
59776 502111 499898 498019 496259 494870 494021 493386 492528 491451 490550 490131 490086 489996 489546 488915 488725 489514 491297
$$ packed form
59872F70501J187k81r80r47j263k550m127n116n714o552p339p116n738m207l426
59857F16332l272l069k449j441j74J121J974J907Q94l92r19p1J782L650M913N754
59841F26540O514P093P352P772Q996J0863J2484J3443J4287J5540J6704J6769
59829G64357J5472J3501J1487R244O314K849l92k938n092p436j0162j3079j6034
59816G68091j8942k1420k2784k2596k1049j8766j6351j4197j2461j1006r500p737
59804E71282n909m441l541l040k672k402k366k519k576k395k238k352k471k158
59790E30202j617j569k155k581k231j603j487j743j682j379j608k481l101k854
59776E02111k213j879j760j389q49o35q58j077r01m19m5r0m50o31j90P89J783
$$ plain form
59759 491297 493644 496032 498096 499821 501636 504049 507062 510131 512869 515405 517927 520318 522565 525024
59745 525024 527745 529959 530797 530334 529387 528612 528308 528753 529904 530978 531162 530689 530431 530523 530277 529487 528843 528779
59727 528779 528829 528515 528041 527629 526995 526071 525556 525966 526697 526748 526003 525023 523956 522491 520771 519560 519399 520131
59709 520131 521335 522701 523950 524859 525601 526748 528789 531819 535656 539941 544073 547384 549643 551315 553181
59694 553181 555724 558855 562182 565492 568892 572375 575435 577428 578379 579015 579800 580271 579638 577793 575414
59679 575414 573288 571817 570993 570472 569795 568853 567968 567176 565722 562817 558870 555295 552973 551358 549349 546588
59663 546588 543590 540924 538784 537226 536383 536237 536425 536452 536140 535837 536154 537417 539384 541523 543573 545739
59647 545739 548304 551176 553934 556230 557908 558758 558364 556490 553499 550173 547043 544107 541276 538792 536893
$$ packed form
59759D91297K347K388K064J725J815K413L013L069K738K536K522K391K247K459
59745E25024K721K214Q38m63r47p75l04M45J151J074J84m73k58R2k46p90o44o4
59727E28779N0l14m74m12o34r24n15M10P31N1p45r80j067j465j720j211j61P32
59709E20131J204J366J249R09P42J147K041L030L837M285M132L311K259J672J866
59694E53181K543L131L327L310L400L483L060J993R51O36P85M71o33j845k379
59679E75414k126j471q24n21o77r42q85p92j454k905l947l575k322j615k009k761
59663E46588k998k666k140j558q43j46J88K7l12l03L17J263J967K139K050K166
59647E45739K565K872K758K296J678Q50l94j874k991l326l130k936k831k484j899
$$ plain form
59632 536893 535267 533323 531121 529662 529966 531964 534517 536453 537426 537825 538106 538347 538397 538281 538300 538723 539482
59615 539482 540267 540853 541206 541256 540764 539493 537528 535407 533840 533124 532823 532228 531217 530381 530167 530266 530167 529974
59597 529974 530105 530382 530088 528964 527542 526339 525267 524085 522924 522037 521396 520844 520353 519852 519120 518120
59581 518120 517158 516498 516053 515651 515212 514399 512591 509611 506170 503141 500678 498451 496345 494377 492234 489629
59565 489629 486998 485222 484693 485167 486410 488224 489835 490167 489119 488002 488240 490053 492736 495658 498454
59550 498454 500662 502062 503293 505405 508552 511618 513519 514524 515973 518929 523585 529872 538061 548406
59536 548406 560517 573612 587419 602411 618816 635478 649920 659736 664063 663856 660863 656412 651273
59523 651273 646510 643911 645022 649800 656625 663683 670010 675222 678951 680967 681449 680554 677900 672940 665809
$$ packed form
59632E36893j626j944k202j459L04J998K553J936R73L99K81K41N0j16J9M23P59
59615E39482P85N86L53N0m92j271j965k121j567p16l01n95j011q36k14R9r9j93
59597E29974J31K77k94j124j422j203j072j182j161q87o41n52m91n01p32j000
59581E18120r62o60m45m02m39q13j808k980l441l029k463k227k106j968k143k605
59565D89629k631j776n29M74J243J814J611L32j048j117K38J813K683K922K796
59550D98454K208J400J231K112L147L066J901J005J449K956M656O287Q189J0345
59536E48406J2111J3095J3807J4992J6405J6662J4442R816M327k07k993m451n139
59523F51273m763k599J111M778O825P058O327N212L729K016M82q95k654m960p131
$$ plain form
59508 665809 657358 648370 639032 629225 618946 608387 597945 588270 579961 572970 566518 559870 553140
59495 553140 547154 542556 539233 536636 534456 532824 531839 531134 530124 528680 527355 526888 527569 529139 531148
59480 531148 533332 535738 538630 542263 546648 551576 556830 562253 567651 572836 577804 582666 587305 591276
59466 591276 594193 596065 597184 597873 598436 599076 599742 600265 600848 602212 605062 609665 616135 624806 635920
59451 635920 649122 663661 679023 695028 711321 727163 741832 754953 766318 775480 781606 783754
59439 783754 781355 774552 764064 750776 735640 719892 704919 691598 679919 669417 659738 650647
59427 650647 641953 633833 627014 622221 619594 618940 620219 623478 628652 636018 646524 660958 678931 699340
59413 699340 721729 746413 773212 800878 827957 853342 875535 892157 901042 901619 894796 881906
$$ packed form
59508F65809q451q988r338r807j0279j0559j0442r675q309o991o452o648o730
59495E53140n986m598l323k597k180j632r85p05j010j444j325m67O81J570K009
59480E31148K184K406K892L633M385M928N254N423N398N185M968M862M639L971
59466E91276K917J872J119O89N63O40O66N23N83J364K850M603O470Q671J1114
59451F35920J3202J4539J5362J6005J6293J5842J4669J3121J1365R162O126K148
59439G83754k399o803j0488j3288j5136j5748j4973j3321j1679j0502r679r091
59427F50647q694q120o819m793k627o54J279L259N174P366J0506J4434J7973K0409
59413F99340K2389K4684K6799K7666K7079K5385K2193J6622Q885N77o823j2890
$$ plain form
59401 881906 864446 844629 825284 808824 796425 788128 783154 779873 775845 768558 756481 739524
59389 739524 718594 694903 669770 644771 621523 601051 583528 568848 557217 548826 543093 538725
59377 538725 534778 531396 529321 528816 529211 529501 529286 529077 529611 530949 532494 533891 535484 537659 540162 542507
59361 542507 544741 547223 549941 552719 555933 560177 565173 569952 574402 579840 587568 597554 609142 622372
59347 622372 637726 655001 673409 692733 713545 736092 759667 783268 806332 828471 848976
59336 848976 867026 882148 894075 902306 906256 905959 902308 896346 888394 878084 865277 850766 835882
59323 835882 821515 807695 794117 780802 768159 756643 746499 737706 729994 723014 716635 710981
59311 710981 706069 701538 697000 692564 688748 685788 683254 680497 677418 674637 672818 671919 671249 670356 669698
$$ packed form
59401H81906j7460j9817j9345j6460j2399q297m974l281m028p287j2077j6957
59389G39524k0930k3691k5133k4999k3248k0472j7523j4680j1631q391n733m368
59377E38725l947l382k075n05L95K90k15k09N34J338J545J397J593K175K503K345
59361E42507K234K482K718K778L214M244M996M779M450N438P728R986J1588J3230
59347F22372J5354J7275J8408J9324K0812K2547K3575K3601K3064K2139K0505
59336H48976J8050J5122J1927Q231L950k97l651n962p952j0310j2807j4511j4884
59323H35882j4367j3820j3578j3315j2643j1516j0144q793p712o980o379n654
59311G10981m912m531m538m436l816k960k534k757l079k781j819q99o70q93o58
$$ plain form
59296 669698 670263 672649 676773 682426 689730 698895 709841 722331 736300 751805 768782 787075 806544
59283 806544 826855 847217 866575 883977 898479 908765 913421 911925 905277 895535 884859 875033
59271 875033 867499 863267 862609 865026 869670 875843 883186 891567 900784 910133 918204 923331 924514 921846
59257 921846 915923 906963 894801 879641 862444 844413 826350 808619 791396 774701 758411 742615
59245 742615 727908 715040 704237 695064 686963 679840 674162 670680 669923 671739 675310 679819 685054 691193
59231 691193 698101 705194 711958 718266 723980 728535 731139 731296 728987 724462 718016 709915 700435 689944
59217 689944 678947 667945 657221 646830 636813 627351 618721 611212 605044 600169 596110 592150 587824
59204 587824 583209 578756 574940 572029 570027 568729 567929 567603 567851 568712 570143 572162 574897 578505 583106
$$ packed form
59296F69698N65K386M124N653P304R165J0946J2490J3969J5505J6977J8293J9469
59283H06544K0311K0362J9358J7402J4502J0286M656j496o648r742j0676r826
59271H75033p534m232o58K417M644O173P343Q381R217R349Q071N127J183k668
59257I21846n923q960j2162j5160j7197j8031j8063j7731j7223j6695j6290j5796
59245G42615j4707j2868j0803r173q101p123n678l482p57J816L571M509N235O139
59231F91193O908P093O764O308N714M555K604J57k309m525o446q101r480j0491
59217F89944j0997j1002j0724j0391j0017r462q630p509o168m875m059l960m326
59204E87824m615m453l816k911k002j298q00l26K48Q61J431K019K735L608M601
$$ plain form
59189 583106 588666 594786 600740 606053 611040 616464 622575 628768 634326 639213 643834 648254 652042 654981
59175 654981 657644 661045 665810 671822 678657 686127 694297 703269 713263 724770 738139 752843 767582
59162 767582 781340 794086 806190 817577 827786 836540 843645 848513 850415 849255 845659 840196 832890
59149 832890 823518 812051 798765 784343 769878 756391 744147 732769 721966 711807 702331 693500
59137 693500 685684 679566 675260 672008 669142 666892 665835 665988 666998 668926 672120 676373 680872 685200
59123 685200 689974 696231 704485 714664 726690 740635 756194 772468 788662 804864 821644 838796
59111 838796 855050 869419 882403 895251 908192 920017 929395 935972 940168 942526 943576 943714 942803
59098 942803 940209 935582 929292 921925 913738 904931 896019 887484 879323 871403 863958 857230 850759 843669
$$ packed form
59189E83106N560O120N954N313M987N424O111O193N558M887M621M420L788K939
59175F54981K663L401M765O012O835P470Q170Q972R994J1507J3369J4704J4739
59162G67582J3758J2746J2104J1387J0209Q754P105M868J902j160l596n463p306
59149H32890r372j1467j3286j4422j4465j3487j2244j1378j0803j0159r476q831
59137F93500p816o118m306l252k866k250j057J53J010J928L194M253M499M328
59123F85200M774O257Q254J0179J2026J3945J5559J6274J6194J6202J6780J7152
59111H38796J6254J4369J2984J2848J2941J1825R378O577M196K358J050J38r11
59098I42803k594m627o290p367q187q807q912q535q161p920p445o728o471p090
$$ plain form
59084 843669 835720 827611 820000 812512 804014 793780 782193 770259 758588 747055 735453 724124
59072 724124 713638 704070 695050 686502 678870 672472 667087 662371 658306 654987 652297 650057 648198 646485
59058 646485 644364 641449 638028 634843 632456 630960 630079 629334 628256 626695 624843 622886 620829 618738 616885
59043 616885 615477 614445 613620 612946 612473 612436 613387 615836 619605 623956 628435 633155 638084 642671 646528 650006
59027 650006 653729 658009 663081 669369 676968 685357 694211 704154 716037 729660 743708 756738 767785
59014 767785 776388 782660 787184 790249 791426 790365 787697 784511 781286 778081 775469 774331 774808 776429
59000 776429 779275 784004 790524 797651 804520 811439 818807 826004 832122 837221 841998 846438 849530 850327
58986 850327 848679 844945 839462 832445 823972 813909 802090 788875 775414 763147 752967 744902 738608
$$ packed form
59084H43669p949q109p611p488q498j0234j1587j1934j1671j1533j1602j1329
59072G24124j0486r568r020q548p632o398n385m716m065l319k690k240j859j713
59058F46485k121k915l421l185k387j496q81p45j078j561j852j957k057k091j853
59043F16885j408j032q25o74m73l7R51K449L769M351M479M720M929M587L857L478
59027F50006L723M280N072O288P599Q389Q854R943J1883J3623J4048J3030J1047
59014G67785Q603O272M524L065J177j061k668l186l225l205k612j138M77J621
59000G76429K846M729O520P127O869O919P368P197O118N099M777M440L092P97
58986H50327j648l734n483p017q473j0063j1819j3215j3461j2267j0180q065o294
$$ plain form
58973 738608 734006 731219 730011 729751 730216 732100 736299 742824 750898 760086 770763 783276 797147 811442
58959 811442 825582 839362 852381 863934 873457 880633 884850 884995 880231 870945 858539 844194 828179
58946 828179 810660 792801 776415 762448 750363 739273 729275 721257 715636 711770 708605 705590 702853
58933 702853 700626 698585 695801 691534 686027 680226 674556 668361 660831 652185 643529 635795 629236 623799
58919 623799 619476 616213 613821 612041 610542 608928 607045 605279 604310 604592 606208 609085 613072 617927 623535
58904 623535 630143 638063 647223 657294 668239 680389 693870 708244 722871 737507 752425 768021
58892 768021 784383 801313 818780 837242 857341 879379 903361 929417 957662 987503 1017561
58881 1017561 1046514 1073575 1097932 1118273 1133391 1142860 1146665 1144573 1136490 1123131 1105702 1085016
$$ packed form
58973G38608m602k787j208k60M65J884M199O525Q074R188J0677J2513J3871J4295
58959H11442J4140J3780J3019J1553R523P176M217J45m764r286j2406j4345j6015
58946H28179j7519j7859j6386j3967j2085j1090r998q018n621l866l165l015k737
58933G02853k227k041k784m267n507n801n670o195p530q646q656p734o559n437
58919F23799m323l263k392j780j499j614j883j766r69K82J616K877L987M855N608
58904F23535O608P920R160J0071J0945J2150J3481J4374J4627J4636J4918J5596
58892G68021J6362J6930J7467J8462K0099K2038K3982K6056K8245K9841L0058
58881A017561K8953K7061K4357K0341J5118R469L805k092q083j3359j7429k0686
$$ plain form
58869 1085016 1061492 1035921 1009623 983787 959030 935611 913745 893710 875817 860018 845357
58858 845357 830255 813892 796978 780581 764599 748097 730876 713864 698021 683681 671038
58847 671038 660359 651433 643451 635778 628422 621600 615315 609609 604794 601111 598349 595941 593201 589527
58833 589527 584695 579039 573168 567595 562779 559167 556730 554685 552289 549752 547842 546734 545902 545060 544546
58818 544546 544752 545794 547794 550848 554536 557985 560538 562063 562679 562779 563188 564638 566931 569132 570613
58803 570613 571404 571667 571495 571259 571444 572041 572724 573538 574717 575853 576143 575595 575138 575310 575654 575667 575525 575565 575811
58784 575811 576458 578122 581155 585249 590009 595393 601293 607292 613124 618803 624088 628450 631759 634331
58770 634331 636017 636037 634005 630373 625593 619756 613466 608097 604444 601848 599294 596691 594430 592411 590411
$$ packed form
58869A085016k3524k5571k6298k5836k4757k3419k1866k0035j7893j5799j4661
58858H45357j5102j6363j6914j6397j5982j6502j7221j7012j5843j4340j2643
58847F71038j0679q926p982p673p356o822o285n706m815l683k762k408k740l674
58833E89527m832n656n871n573m816l612k437k045k396k537j910j108q32q42n14
58818E44546K06J042K000L054L688L449K553J525O16J00M09J450K293K201J481
58803E70613P91K63j72k36J85N97O83Q14J179J136K90n48m57J72L44J3j42M0K46
58784E75811O47J664L033M094M760N384N900N999N832N679N285M362L309K572
58770F34331J686K0k032l632m780n837o290n369l653k596k554k603k261k019k000
$$ plain form
58755 590411 588888 588630 589888 592437 596024 600140 603890 606809 609500 612808 616819 621336 626876 634312
58741 634312 643726 654406 665836 677939 690429 702681 714382 725830 737467 749450 761720 774199
58729 774199 786863 799664 812253 823833 833730 842220 850300 858387 865807 871877 876914 881754 886806
58716 886806 892227 898537 906322 915449 925134 934658 943600 951478 957521 960772 960383 956097 948536 938524
58702 938524 926023 910268 891186 869946 847758 824779 800734 775926 751061 726570 702811
58691 702811 680470 660211 642173 626256 612448 600497 589860 580426 572640 566374 560409 553735
58679 553735 546758 540493 535197 530643 527027 524542 522515 520132 517785 516691 517310 519133 521953 526380
58665 526380 532978 541628 551814 563009 574800 587107 600032 612974 624242 632281 637059 639585
$$ packed form
58755E90411j523k58J258K549L587M116L750K919K691L308M011M517N540P436
58741F34312R414J0680J1430J2103J2490J2252J1701J1448J1637J1983J2270J2479
58729G74199J2664J2801J2589J1580R897Q490Q080Q087P420O070N037M840N052
58716H86806N421O310P785R127R685R524Q942P878O043L251l89m286p561j0012
58702I38524j2501j5755j9082k1240k2188k2979k4045k4808k4865k4491k3759
58691G02811k2341k0259j8038j5917j3808j1951j0637r434p786o266n965o674
58679E53735o977o265n296m554l616k485k027k383k347j094O19J823K820M427
58665E26380O598Q650J0186J1195J1791J2307J2925J2942J1268Q039M778K526
$$ plain form
58653 639585 640395 639321 636462 632407 627523 621822 615552 609179 602805 596245 589651 583433 577666 572193
58639 572193 567207 563077 559784 557177 555611 555600 556951 558995 561503 564572 567678 569737 570257 569771 569074
58624 569074 568586 568425 568478 568387 568085 568310 570106 573944 579822 587860 598048 609688 621957 634836 648558
58609 648558 662277 674271 683570 690479 695455 698376 699105 697908 694982 690300 684135 677168 669884 662438
58595 662438 655185 648719 643257 638572 634637 631776 630117 629472 629900 631881 635955 642569 652025 663911
58581 663911 676785 689223 701055 712862 724491 735019 744038 751952 758932 764675 769452 774402 780462
58568 780462 787746 796281 806608 819308 834533 852196 872083 893732 916790 941402 967478 993654
58556 993654 1017833 1038810 1056496 1070712 1080903 1087160 1090293 1090544 1087313 1080505 1071082 1059838 1046702
$$ packed form
58653F39585Q10j074k859m055m884n701o270o373o374o560o594o218n767n473
58639E72193m986m130l293k607j566j1J351K044K508L069L106K059N20m86o97
58624E69074m88j61N3r1l02K25J796L838N878Q038J0188J1640J2269J2879J3722
58609F48558J3719J1994R299O909M976K921P29j197k926m682o165o967p284p446
58595F62438p253o466n462m685l935k861j659o45M28J981M074O614R456J1886
58581F63911J2874J2438J1832J1807J1629J0528R019P914O980N743M777M950O060
58568G80462P284Q535J0327J2700J5225J7663J9887K1649K3058K4612K6076K6176
58556I93654K4179K0977J7686J4216J0191O257L133K51l231o808r423j1244j3136
$$ plain form
58543 1046702 1031750 1015859 999679 982876 965064 946650 928091 909144 889611 870070 851063
58532 851063 832288 813488 795584 780007 767187 756485 747352 739825 734036 729908 727319 726189 726399
58519 726399 727790 730057 732483 734201 735041 735765 737234 739740 743350 748290 754417 760650 765579 768698 770793
58504 770793 773096 776137 779279 781318 781589 780356 778023 774381 769164 763008 757052 751590 745875 739414
58490 739414 732764 726855 722119 718546 716100 714850 714994 716817 720276 724832 730172 736905 745863 756883
58476 756883 769010 781752 795167 808709 820938 830605 837305 840969 841534 839248 834596 827828 819184
58463 819184 809481 799596 789514 778910 768580 760166 754410 750806 749008 749263 751286 754171 757812 763030
58449 763030 769701 776069 780574 783193 784333 783725 781266 777819 774111 769753 764299 758519 753667 750113
$$ packed form
58543A046702j4952j5891j6180j6803j7812j8414j8559j8947j9533j9541j9007
58532H51063j8775j8800j7904j5577j2820j0702r133p527n789m128k589j130K10
58519G26399J391K267K426J718Q40P24J469K506L610M940O127O233M929L119K095
58504G70793K303L041L142K039K71j233k333l642n217o156n956n462n715o461
58490G39414o650n909m736l573k446j250J44J823L459M556N340O733Q958J1020
58476G56883J2127J2742J3415J3542J2229R667O700L664N65k286m652o768q644
58463H19184r703r885j0082j0604j0330q414n756l604j798K55K023K885L641N218
58449G63030O671O368M505K619J140o08k459l447l708m358n454n780m852l554
$$ plain form
58435 750113 747538 745883 745321 745828 747450 750460 754697 759333 763817 768467 773718 779538 786067 793982 803523
58420 803523 813849 823914 833378 842163 849903 856398 861920 866548 869925 872072 873622 874743 874692 872989
58406 872989 870139 866607 861920 855433 847233 837801 827645 817767 809494 803157 797808 792770 788540 785651
58392 785651 783715 782349 781918 782497 783013 782212 779769 775851 770574 764611 759334 755517 752739 750567 749310
58377 749310 749106 749596 751237 755520 762883 771674 780211 788638 797643 806721 815138 823528 833103 843949
58363 843949 855290 866722 878232 889849 902172 916169 931512 946229 959013 970658 982145
58352 982145 992670 1000919 1006966 1011458 1014153 1014935 1015191 1016474 1018592 1020583 1022658 1025671 1029542 1033846
58338 1033846 1039171 1046349 1055016 1064431 1074955 1087263 1100897 1115035 1129897 1145922 1162383 1178215
$$ packed form
58435G50113k575j655n62N07J622L010M237M636M484M650N251N820O529P915R541
58420H03523J0326J0065R464Q785P740O495N522M628L377K147J550J121n1j703
58406H72989k850l532m687o487q200r432j0156r878q273o337n349n038m230k889
58392G85651j936j366m31N79N16q01k443l918n277n963n277l817k778k172j257
58377G49310k04M90J641M283P363Q791Q537Q427R005R078Q417Q390R575J0846
58363H43949J1341J1432J1510J1617J2323J3997J5343J4717J2784J1645J1487
58352I82145J0525Q249O047M492K695P82K56J283K118J991K075L013L871M304
58338A033846N325P178Q667R415J0524J2308J3634J4138J4862J6025J6461J5832
$$ plain form
58326 1178215 1193298 1207528 1219719 1229114 1237005 1245081 1253044 1259559 1264606 1269105 1273126 1276380 1279744
58313 1279744 1284430 1290290 1296626 1303888 1312785 1322557 1332055 1341748 1352798 1364900 1376902 1388803 1401344
58300 1401344 1414452 1427935 1442723 1459472 1476895 1493489 1509876 1527340 1545222 1562136 1578668
58289 1578668 1596330 1614830 1633075 1651965 1673327 1696683 1719921 1742719 1766496 1791407 1816199
58278 1816199 1840933 1867118 1895244 1924583 1955250 1988065 2022697 2058300 2095557 2135693 2178085
58267 2178085 2221386 2266372 2314939 2366941 2420873 2477061 2537057 2600308 2664505 2728932 2794406
58256 2794406 2860306 2924796 2987795 3050614 3112968 3173464 3232857 3293704 3357087 3422671 3491524
58245 3491524 3565599 3644885 3728312 3816869 3912526 4014855 4122404 4236536 4359976 4492386
$$ packed form
58326A178215J5083J4230J2191R395P891Q076P963O515N047M499M021L254L364
58313A279744M686N860O336P262Q897R772R498R693J1050J2102J2002J1901J2541
58300A401344J3108J3483J4788J6749J7423J6594J6387J7464J7882J6914J6532
58289A578668J7662J8500J8245J8890K1362K3356K3238K2798K3777K4911K4792
58278A816199K4734K6185K8126K9339L0667L2815L4632L5603L7257M0136M2392
58267B178085M3301M4986M8567N2002N3932N6188N9996O3251O4197O4427O5474
58256B794406O5900O4490O2999O2819O2354O0496N9393O0847O3383O5584O8853
58245C491524P4075P9286Q3427Q8557R5657J02329J07549J14132J23440J32410
$$ plain form
58235 4492386 4631646 4778773 4937148 5107560 5288609 5481355 5688641 5910384 6144729
58226 6144729 6393479 6661127 6948856 7255053 7581518 7933472 8313703 8722768 9164831
58217 9164831 9647012 10173156 10744972 11369427 12058178 12820030 13661881 14597530 15647585
58208 15647585 16830286 18160990 19661497 21361274 23289757 25478538 27973854 30838940
58200 30838940 34146902 37987834 42490100 47829818 54229845 61977377 71451341 83111317
58192 83111317 97448371 114960010 136153318 161465825 191019094 224290993 259891892
58185 259891892 295550913 328309493 354912036 372386017 378700326 373267649 357078121
58178 357078121 332416930 302290748 269774274 237482823 207295030 180329986 157093840
$$ packed form
58235D492386J39260J47127J58375J70412J81049J92746K07286K21743K34345
58226F144729K48750K67648K87729L06197L26465L51954L80231M09065M42063
58217I164831M82181N26144N71816O24455O88751P61852Q41851R35649J050055
58208A5647585J182701J330704J500507J699777J928483K188781K495316K865086
58200C0838940L307962L840932M502266N339718O400027P747532R473964J1659976
58192H3111317J4337054J7511639K1193308K5312507K9553269L3271899L5600899
58185B59891892L5659021L2758580K6602543J7473981O314309n432677j6189528
58178C57078121k4661191l0126182l2516474l2291451l0187793k6965044k3236146
$$ plain form
58171 157093840 137683341 121945672 109546088 99994834 92738476 87314655 83410104
58164 83410104 80712681 78711848 76718811 74132364 70675496 66381457 61422177 56002842
58156 56002842 50368065 44797985 39539767 34749475 30498570 26804225 23640693 20948967
58148 20948967 18662705 16726739 15091642 13706627 12527473 11522486 10664015 9921944
58140 9921944 9270660 8694603 8181743 7717910 7291440 6896934 6530463 6186563 5862951
58131 5862951 5562275 5285925 5031017 4795674 4581543 4388300 4211038 4045995 3893883
58122 3893883 3754684 3623776 3496199 3370739 3247393 3125006 3004093 2888128 2779254
58113 2779254 2675921 2576790 2483532 2397607 2317664 2242323 2172421 2108297 2047771 1988941 1932438
$$ packed form
58171A57093840j9410499j5737669j2399584r551254p256358n423821l904551
58164H3410104k697423k000833j993037k586447l456868m294039m959280n419335
58156E6002842n634777n570080n258218m790292m250905l694345l163532k691726
58148B0948967k286262j935966j635097j385015j179154j004987q58471p42071
58140I921944o51284n76057n12860m63833m26470l94506l66471l43900l23612
58131E862951l00676k76350k54908k35343k14131j93243j77262j65043j52112
58122C893883j39199j30908j27577j25460j23346j22387j20913j15965j08874
58113B779254j03333r9131r3258q5925p9943p5341o9902o4124o0526n8830n6503
$$ plain form
58102 1932438 1879186 1828462 1779657 1733328 1689169 1645652 1602983 1563586 1528275 1494776 1461408
58091 1461408 1429360 1399822 1371791 1344479 1319164 1296796 1276179 1256235 1237739 1221130 1204835
58080 1204835 1187423 1169306 1150806 1130727 1108439 1085385 1062924 1040565 1017702 995203 973934
58069 973934 953594 934274 917133 902267 887846 872704 857895 844491 831921 819800 809257
58058 809257 800891 793340 785381 777647 770760 763681 755453 746850 738744 730549 721814 713604 706651 699793
58044 699793 691917 683966 677334 671664 665825 659702 653477 646581 638949 631959 626485 621260 614773 607477
58030 607477 600497 593436 585284 576435 567975 559869 551492 543124 535300 527449 518789 509918 502054 495349
58016 495349 489281 483965 479674 475752 471424 467185 464003 461689 459265 456479 453841 451639 449974 449167
$$ packed form
58102A932438n3252n0724m8805m6329m4159m3517m2669l9397l5311l3499l3368
58091A461408l2048k9538k8031k7312k5315k2368k0617j9944j8496j6609j6295
58080A204835j7412j8117j8500k0079k2288k3054k2461k2359k2863k2499k1269
58069I73934k0340j9320j7141j4866j4421j5142j4809j3404j2570j2121j0543
58058H09257q366p551p959p734o887p079q228q603q106q195q735q210o953o858
58044F99793p876p951o632n670n839o123o225o896p632o990n474n225o487p296
58030F07477o980p061q152q849q460q106q377q368p824p851q660q871p864o705
58016D95349o068n316m291l922m328m239l182k314k424k786k638k202j665q07
$$ plain form
58002 449167 449158 449096 448543 448422 449794 452403 455434 458931 463271 467943 472027 475409 478502 481285 483596 485810
57986 485810 488234 490386 491733 492548 493209 493408 492927 492357 492048 491227 489285 487138 486066 485865 485392 484327
57970 484327 483185 482076 480698 479182 477889 476728 475603 474973 474987 474665 473076 470801 469136 468284 467425 466074
57954 466074 464205 461488 457600 453002 448399 443714 438568 433314 428522 423874 418693 413238 408365 404241
57940 404241 400531 397635 396544 397572 400227 404184 409403 415443 421629 427843 434355 441097 447906 455197
57926 455197 463423 472072 480073 487062 493408 499228 504223 508373 511994 515227 518035 520401 521872 521346
57912 521346 518089 512549 505570 497438 488486 479794 472098 464614 456202 447178 438640 430488 421595 411689
57898 411689 401574 391572 381259 370825 361302 353173 345949 339328 333632 328884 324608 320743 317743
$$ packed form
58002D49167ro2n53j21J372K609L031L497M340M672M084L382L093K783K311K214
57986D85810K424K152J347Q15O61J99m81n70l09q21j942k147j072k01m73j065
57970D84327j142j109j378j516j293j161j125o30J4l22j589k275j665q52q59j351
57954D66074j869k717l888m598m603m685n146n254m792m648n181n455m873m124
57940D04241l710k896j091J028K655L957N219O040O186O214O512O742O809P291
57926D55197Q226Q649Q001O989O346N820M995M150L621L233K808K366J471n26
57912E21346l257n540o979q132q952q692p696p484q412r024q538q152q893r906
57898D11689j0115j0002j0313j0434r523q129p224o621n696m748m276l865l000
$$ plain form
57885 317743 315583 313767 312497 312672 314375 316447 317997 319341 321060 323125 325429 328215 331376 334119
57871 334119 335891 336976 337682 337650 336537 334739 332816 330667 327898 324674 321656 319307 317661 316579 315904
57856 315904 315434 315027 314726 314822 315862 318460 322836 328612 335189 342167 349233 356102 362991 370736 379848
57841 379848 389733 399343 408249 416380 423164 427849 430499 431775 431807 430186 427005 422995 418501 413178 406860
57826 406860 399952 392821 385522 378316 371708 365812 360325 355324 351346 348538 346446 344921 344511 345593
57812 345593 347587 349396 350285 350264 350017 350462 351826 353131 353130 351727 349833 347955 345798 343248 340745 338372
57796 338372 335494 331764 327738 324055 320697 317567 315158 314017 313931 314144 314060 313323 311627 308953 305873 303220
57780 303220 301473 300536 299900 298967 297457 295611 293836 292307 291249 291343 293197 296444 300023 303438 307112
$$ packed form
57885C17743k160j816j270J75J703K072J550J344J719K065K304K786L161K743
57871C34119J772J085P06l2j113j798j923k149k769l224l018k349j646j082o75
57856C15904m70m07l01R6J040K598M376N776O577O978P066O869O889P745R112
57841C79848R885R610Q906Q131O784M685K650J276L2j621l181m010m494n323o318
57826D06860o908p131p299p206o608n896n487n001l978k808k092j525m10J082
57812C45593J994J809Q89k1k47M45J364J305jj403j894j878k157k550k503k373
57796C38372k878l730m026l683l358l130k409j141q6K13q4p37j696k674l080k653
57780C03220j747r37o36r33j510j846j775j529j058R4J854L247L579L415L674
$$ plain form
57765 307112 311379 315782 319637 322726 325168 327106 328719 330036 330484 329085 325417 320031 313822 307359
57751 307359 300937 294716 288609 282487 276679 271849 268197 265226 262472 259988 257961 256310 254857 253443
57737 253443 251775 249593 247132 244983 243414 242297 241725 242055 243152 244195 244549 244440 244550 245309 246666 248145
57721 248145 249090 249299 249395 250049 251007 251543 251681 252063 252607 252340 250834 248862 247283 246154 245319 244892 244647 243781
57703 243781 241930 239772 238075 236832 235798 235120 234781 234154 232860 231471 230669 230272 229832 229668 230450 232118
57687 232118 233989 235668 237230 238759 240395 242595 245774 249898 254911 261299 269668 280130 292764 308447
57673 308447 328653 354569 386982 426903 475653 534108 601862 676839 755429 833256 905986
57662 905986 969022 1016519 1041969 1041053 1014046 965228 900533 826169 748445 673147 604358 544052
$$ packed form
57765C07112M267M403L855L089K442J938J613J317M48j399l668n386o209o463
57751C07359o422o221o107o122n808m830l652k971k754k484k027j651j453j414
57737B53443j668k182k461k149j569j117n72L30J097J043L54j09J10P59J357J479
57721B48145R45K09R6O54R58N36J38L82N44k67j506j972j579j129q35m27k45q66
57703B43781j851k158j697j243j034o78l39o27j294j389q02l97m40j64P82J668
57687B32118J871J679J562J529J636K200L179M124N013O388Q369J0462J2634J5683
57673C08447K0206K5916L2413L9921M8750N8455O7754P4977P8590P7827P2730
57662I05986O3036M7497K5450r16k7007m8818o4695p4364p7724p5298o8789o0306
$$ plain form
57650 544052 492545 448878 411329 378618 350820 328613 311771 298943 288740 280314 273009 266298
57638 266298 260232 255240 251296 247839 244710 242574 242049 242789 243805 244451 244753 244897 244743 244033 242931 242042
57622 242042 241620 240991 239238 236432 233662 231711 230299 228840 227233 225438 223012 219851 216948 215534 215647
57607 215647 216249 216614 216900 217449 218325 219608 221509 223971 226612 229130 231317 232675 232572 231024 228874 226966
57591 226966 225405 223778 221775 219348 216475 213098 209401 206045 203835 202922 202475 201540 200202 199319 199013
57576 199013 198154 195772 192365 189170 186631 184296 181894 179673 177765 175965 174173 172560 171257 170351 170033
57561 170033 170224 170233 169429 168219 167691 168245 169201 169827 170120 170452 171051 172080 173640 175383 176577 176942 177102 177876
57543 177876 179370 181067 182578 183909 185042 185643 185426 184674 184134 184247 184654 184679 184175 183539 182962 182191 181117
$$ packed form
57650E44052n1507m3667l7549l2711k7798k2207j6842j2828j0203q426p305o711
57638B66298o066m992l944l457l129k136n25P40J016O46L02J44j54p10j102q89
57622B42042m22o29j753k806k770j951j412j459j607j795k426l161k903j414J13
57607B15647O02L65K86N49Q76J283J901K462K641K518K187J358j03j548k150j908
57591B26966j561j627k003k427k873l377l697l356k210r13m47r35j338q83l06
57576A99013q59k382l407l195k539k335k402k221j908j800j792j613j303r06l18
57561A70033J91Rq04j210n28N54R56O26K93L32N99J029J560J743J194L65J60P74
57543A77876J494J697J511J331J133O01k17p52n40J13M07K5n04o36n77p71j074
$$ plain form
57526 181117 180054 179182 178236 177100 176208 175893 175836 175633 175508 175902 176781 177888 179305 181104 182784 183774 184314
57509 184314 185184 186742 188745 190739 191982 191449 188904 185736 183775 183343 183322 182936 182369 181673 180300 178110
57493 178110 175894 174427 173713 173408 173273 172926 171962 170631 169707 169412 169231 169031 169417 170539 171454 171349 170644
57476 170644 170212 170114 169853 169323 168755 168080 167081 165939 164981 164114 163057 161927 161036 160309 159433 158434 157627 157092
57458 157092 156708 156591 157044 158076 159311 160373 161073 161310 161116 160819 160889 161542 162555 163418 163671 163285 162762 162647
57440 162647 162900 163079 163151 163642 164753 165862 166306 166277 166491 167220 168149 169033 169949 170956 171894 172639 173265 173898
57422 173898 174593 175328 175973 176299 176191 175771 175216 174524 173578 172434 171449 171134 171821 173299 174856 175880 176391
57405 176391 176786 177161 177278 177144 177049 176911 176154 174554 172736 171404 170475 169475 168488 168144 168663 169432 169698 169463
$$ packed form
57526A81117j063q72r46j136q92l15n7k03j25L94Q79J107J417J799J680R90N40
57509A84314Q70J558K003J994J243n33k545l168j961m32k1l86n67o96j373k190
57493A78110k216j467p14l05j35l47r64j331r24k95j81k00L86J122R15j05p05
57476A70644m32r8k61n30n68o75r99j142r58q67j057j130q91p27q76r99q07n35
57458A57092l84j17M53J032J235J062P00K37j94k97P0O53J013Q63K53l86n23j15
57440A62647K53J79P2M91J111J109M44k9K14P29R29Q84R16J007R38P45O26O33
57422A73898O95P35O45L26j08m20n55o92r46j144r85l15O87J478J557J024N11
57405A76391L95L75J17j34r5j38p57j600j818j332r29j000r87l44N19P69K66k35
$$ plain form
57387 169463 169531 170688 172878 175192 176776 177645 178459 179633 181067 182652 184492 186455 187990 188736 188961 189116
57371 189116 189271 189271 189119 188875 188429 187722 186915 186068 184954 183578 182558 182505 183192 183813 184007 184175 184797 185869
57353 185869 187082 188243 189364 190505 191627 192565 193179 193560 193948 194360 194499 194188 193757 193786 194544 195798 197115
57336 197115 198233 199138 199787 199785 198642 196667 195292 195823 197861 199613 199961 199540 199493 199932 200240 200273 200392 200597
57318 200597 200481 200038 199863 200379 201354 202294 202977 203501 204094 204956 206025 206848 206851 205871 204394 203223 202868 203084
57300 203084 203101 202538 202045 202596 204194 205799 206687 207246 208119 209298 210524 211865 213157 213492 212235 210252
57284 210252 209151 209365 209891 209910 209750 210042 210845 212000 213730 216325 219611 223142 226713 230484 234786 239917
57268 239917 245855 252120 258206 264124 270162 276112 281292 285454 289101 292641 295727 297834 299135 300358
$$ packed form
57387A69463O8J157K190K314J584Q69Q14J174J434J585J840J963J535P46K25J55
57371A89116J55%j52k44m46p07q07q47j114j376j020n3O87O21J94J68O22J072
57353A85869J213J161J121J141J122R38O14L81L88M12J39l11m31K9P58J254J317
57336A97115J118R05O49kj143j975j375N31K038J752L48m21m7M39L08L3J19K05
57318B00597j16m43j75N16R75R40O83N24N93Q62J069Q23Lr80j477j171l55K16
57300B03084J7n63m93N51J598J605Q88N59Q73J179J226J341J292L35j257j983
57284B10252j101K14N26J9j60K92Q03J155J730K595L286L531L571L771M302N131
57268B39917N938O265O086N918O038N950N180M162L647L540L086K107J301J223
$$ plain form
57254 300358 302051 304297 306925 309570 311745 313313 314842 317104 320222 323635 326930 330311 334054 337805
57240 337805 340723 342309 342910 343421 344656 347052 350731 355552 361039 366433 371045 374671 377772 381298 386194
57225 386194 392782 400427 407929 414406 419838 424880 430301 436597 443764 451232 458238 464598 471094 478870
57211 478870 488387 499047 509764 519764 528889 537323 545217 552628 559783 567226 575579 585239 596512
57198 596512 609800 625197 641862 658297 673599 688188 703110 718917 735446 752378 769549
57187 769549 786849 804113 821196 837999 854564 871202 888379 906325 924928 944011 963440
57176 963440 982847 1001698 1019808 1037492 1054989 1072189 1089256 1106978 1126001 1146047 1166473
57165 1166473 1187345 1209311 1232561 1256565 1280938 1306062 1332636 1360833 1389965 1418865 1446730
$$ packed form
57254C00358J693K246K628K645K175J568J529K262L118L413L295L381L743L751
57240C37805K918J586O01N11J235K396L679M821N487N394M612L626L101L526M896
57225C86194O588P645P502O477N432N042N421O296P167P468P006O360O496P776
57211D78870R517J0660J0717J0000R125Q434P894P411P155P443Q353R660J1273
57198E96512J3288J5397J6665J6435J5302J4589J4922J5807J6529J6932J7171
57187G69549J7300J7264J7083J6803J6565J6638J7177J7946J8603J9083J9429
57176I63440J9407J8851J8110J7684J7497J7200J7067J7722J9023K0046K0426
57165A166473K0872K1966K3250K4004K4373K5124K6574K8197K9132K8900K7865
$$ plain form
57154 1446730 1473850 1501386 1530265 1560384 1591012 1621598 1651860 1681566 1710800 1740266 1770688
57143 1770688 1801884 1832862 1862909 1892332 1922153 1953308 1986057 2019979 2054631 2090300 2127778
57132 2127778 2167262 2208052 2249694 2292845 2338464 2386758 2437660 2491895 2550503 2613464 2679789
57121 2679789 2749023 2821910 2899443 2982010 3069666 3162684 3261644 3367475 3481506 3605175 3739764
57110 3739764 3886920 4049236 4229860 4431797 4658440 4914724 5207079 5542453 5928438
57101 5928438 6374684 6893758 7500975 8214717 9057521 10056521 11242952 12652063 14323365
57092 14323365 16299280 18621492 21326363 24440191 27974293 31921308 36254186 40926131
57084 40926131 45868885 50991369 56182815 61317814 66255394 70831973 74860303 78144580
$$ packed form
57154A446730K7120K7536K8879L0119L0628L0586L0262K9706K9234K9466L0422
57143A770688L1196L0978L0047K9423K9821L1155L2749L3922L4652L5669L7478
57132B127778L9484M0790M1642M3151M5619M8294N0902N4235N8608O2961O6325
57121B679789O9234P2887P7533Q2567Q7656R3018R8960J05831J14031J23669J34589
57110C739764J47156J62316J80624K01937K26643K56284K92355L35374L85985
57101E928438M46246N19074O07217P13742Q42804R99000J186431J409111J671302
57092A4323365J975915K322212K704871L113828L534102L947015M332878M671945
57084D0926131M942754N122484N191446N134999M937580M576579M028330L284277
$$ plain form
57076 78144580 80506555 81809596 81975285 80994754 78932668 75916489 72111134 67691494
57068 67691494 62825834 57671464 52375410 47074435 41893661 36944188 32319348 28089988
57060 28089988 24300558 20967766 18082696 15616391 13527447 11769153 10294464 9058973
57052 9058973 8022800 7151556 6416262 5792775 5261312 4805833 4412975 4071160 3770642
57043 3770642 3504058 3266292 3053565 2862780 2691573 2538251 2401130 2278067 2167031
57034 2167031 2066916 1977282 1897211 1824850 1758234 1696330 1639143 1587042 1540013 1497418 1458535
57023 1458535 1423688 1394693 1373822 1362467 1361388 1372036 1396759 1437858 1497512 1578196 1680841
57012 1680841 1801858 1934394 2074269 2222000 2375154 2519352 2630932 2690132 2690166 2634138
$$ packed form
57076G8144580K361975J303041J65689r80531k062086l016179l805355m419640
57068F7691494m865660n154370n296054n300975n180774m949473m624840m229360
57060B8089988l789430l332792k885070k466305k088944j758294j474689j235491
57052I058973j036173q71244p35294o23487n31463m55479l92858l41815l00518
57043C770642k66584k37766k12727j90785j71207j53322j37121j23063j11036
57034B167031j00115q9634q0071p2361o6616o1904n7187n2101m7029m2595l8883
57023A458535l4847k8995k0871j1355j079J0648K4723M1099N9654Q0684J02645
57012A680841J21017J32536J39875J47731J53154J44198J11580N9200L4n6028
$$ plain form
57002 2634138 2527876 2378824 2199092 2004746 1810753 1627415 1460655 1313187 1185005
56993 1185005 1074450 979931 900413 834633 780904 737735 703887 677921 658475 644848 636447
56982 636447 631682 628155 623858 617500 607925 594233 576558 555893 533151 509130 485284 463383
56970 463383 444101 426793 411022 397514 387145 379706 374346 370825 369779 371955 377677 386964 399763
56957 399763 415774 433994 452439 468511 479860 484947 482979 473775 458028 437355 413704 388857
56945 388857 364540 342383 323158 306471 291785 279538 270787 266194 266052 270798 280566 294496 311517
56932 311517 331708 355794 383205 411549 438084 460540 476272 482097 476206 459787 436043 407993
56920 407993 377739 347116 317882 291115 266985 245271 225800 208522 193549 181074 171016
$$ packed form
57002B634138j06262j49052j79732j94346j93993j83338j66760j47468j28182
56993A185005j10555r4519p9518o5780n3729m3169l3848k5966j9446j3627q401
56982F36447m765l527m297o358r575j3692j7675k0665k2742k4021k3846k1901
56970D63383j9282j7308j5771j3508j0369p439n360l521j046K176N722R287J2799
56957C99763J6011J8220J8445J6072J1349N087j968r204j5747k0673k3651k4847
56945C88857k4317k2157j9225j6687j4686j2247q751m593j42M746R768J3930J7021
56932C11517K0191K4086K7411K8344K6535K2456J5732N825n891j6419k3744k8050
56920D07993l0254l0623k9234k6767k4130k1714j9471j7278j4973j2475j0058
$$ plain form
56909 171016 162764 155561 149105 143577 139158 135720 132984 130768 129022 127743 126978 126904 127815 129885 132950
56894 132950 136753 141562 148348 158098 171095 187104 206016 227811 251860 276713 300716 322552
56882 322552 341119 355238 363826 366344 363041 354875 343230 329667 315831 303394 293693 287234 283865
56869 283865 283636 287251 295428 308247 325615 348110 376815 412374 454584 502664 555179 609496
56857 609496 661615 706730 740055 757891 758898 744648 718598 684429 645433 604833 565745 530654
56845 530654 501386 479413 465562 459590 460970 470241 488970 518415 559064 611449 676200 752480
56833 752480 836924 924382 1008919 1083654 1140795 1173503 1178338 1155972 1110115 1046302 971096 891097
56821 891097 811850 737435 670757 613734 567256 531379 505891 490822 486557 493616 512254 542221
$$ packed form
56909A71016q252p203o456n528m419l438k736k216j746j279p65p4R11K070L065
56894A32950L803M809O786R750J2997J6009J8912K1795K4049K4853K4003K1836
56882C22552J8567J4119Q588K518l303q166j1645j3563j3836j2437r701o459l369
56869B83865k29L615Q177J2819J7368K2495K8705L5559M2210M8080N2515N4317
56857F09496N2119M5115L3325J7836J007j4250k6050l4169l8996m0600l9088l5091
56845E30654k9268k1973j3851n972J380R271J8729K9445M0649N2385O4751P6280
56833G52480Q4444Q7458Q4537P4735N7141L2708M835k2366m5857o3813p5206p9999
56821H91097p9247p4415o6678n7023m6478l5877k5488j5069m265P059J8638K9967
$$ plain form
56809 542221 582790 632724 689803 750396 809765 862715 903860 927979 931433 913836 878028 828295
56797 828295 769090 705216 641759 582726 529931 483781 444694 413162 388920 371101 359422
56786 359422 354598 357421 367854 385150 408403 436532 467703 498994 526848 547977 559938 561094
56774 561094 550595 528958 498481 462514 424089 385373 348129 313867 283330 256396 232826
56763 232826 212655 195595 180717 167215 155184 145154 137155 130654 125154 120486 116723 114093 112695
56750 112695 111967 110788 108558 105882 103731 102209 100656 98758 96927 95648 94955 94646 94526 94324 93711 92551
56734 92551 90962 89078 86998 85043 83844 83970 85412 87393 88751 88758 87739 86756 86578 87071 87652 88052 88400
56717 88400 88767 88981 88883 88562 88247 88060 87938 87843 88014 88816 90177 91372 91689 91203 90559 90177 90102 90469 91469
$$ packed form
56809E42221M0569M9934N7079O0593N9369N2950M1145K4119L454j7597l5808m9733
56797H28295n9205o3874o3457n9033n2795m6150l9087l1532k4242j7819j1679
56786C59422m824K823J0433J7296K3253K8129L1171L1291K7854K1129J1961J156
56774E61094j0499k1637l0477l5967l8425l8716l7244l4262l0537k6934k3570
56763B32826k0171j7060j4878j3502j2031j0030p999o501n500m668l763k630j398
56750A12695p28j179k230k676k151j522j553j898j831j279o93l09j20k02o13j160
56734I2551j589j884k080j955j199J26J442J981J358Pj019r83j78M93N81M00L48
56717H8400L67K14r8l21l15j87j22r5J71Q02J361J195L17m86o44l82p5L67J000
$$ plain form
56698 91469 92762 93601 93662 93121 91859 89405 86058 83193 81866 81723 81917 82466 83875 85920 87726 88838
56682 88838 89392 89386 88666 87627 87080 87222 87409 87225 87198 88137 90169 92770 95370 97576 98991 99280 98591 97726
56664 97726 97666 98728 100262 101376 101954 102677 103995 105571 106950 108337 110212 112398 114074 114778 115034 115879
56648 115879 117843 120383 122219 122386 121048 119188 117581 116377 115638 115627 116267 116893 117034 117042 117425 117915 117811
56631 117811 117049 116332 116267 116831 117603 118073 117837 116934 115976 115560 115665 115934 116327 117036 117957 118805 119629 120700 121918
56612 121918 122860 123440 124062 125059 126339 127598 128570 129155 129595 130336 131294 131475 129940 127053 124205 122340 121327
56595 121327 120734 120414 120199 119771 119213 119120 119809 120828 121626 122206 122719 122866 122283 121302 120777 121174 122292 123871
56577 123871 126012 128746 131484 133294 133779 133547 133711 135006 137361 140135 142651 144693 146748 149671 153782
$$ packed form
56698I1469J293Q39O1n41j262k454l347k865j327j43J94N49J409K045J806J112
56682H8838N54op20j039n47J42J87j84k7R39K032K601K600K206J415K89o89q65
56664I7726o0J062J534J114N78P23J318J576J379J387J875K186J676P04K56Q45
56648A15879J964K540J836J67j338j860j607j204p39j1O40O26J41QL83M90j04
56631A17811p62p17o5N64P72M70k36r03r58m16J05K69L93P09R21Q48Q24J071J218
56612A21918R42N80O22R97J280J259R72N85M40P41R58J81j535k887k848j865j013
56595A21327n93l20k15m28n58r3O89J019P98N80N13J47n83r81n25L97J118J579
56577A23871K141K734K738J810M85k32J64J295K355K774K516K042K055K923M111
$$ plain form
56562 153782 158383 162550 166388 171028 177370 185356 194559 204755 215485 225715 234575 242073 248570
56549 248570 253994 258196 261658 265061 268289 270595 271663 271864 271572 270868 269905 268853 267422 265075 261788
56534 261788 258081 254248 250152 245822 241586 237425 232811 227473 221858 216574 211854 207730 204290 201402
56520 201402 198532 195199 191423 187639 184319 181725 179698 177633 174988 171916 169052 166694 164565 162416
56506 162416 160364 158482 156557 154523 152781 151775 151436 151211 150540 149259 147816 147098 147675 149138 150460
56491 150460 151080 151350 151890 152899 154184 155448 156387 156808 156864 156951 157258 157647 157978 158254 158426 158400 158320 158487 158917
56472 158917 159258 159294 159252 159508 160235 161342 162460 163040 162829 162324 162455 163722 165869 168256 170218 171229 171288
56455 171288 171174 171818 173313 174936 176112 176900 177572 178308 179306 180572 181532 181560 181049 181236 182665 184486 185632
$$ packed form
56562A53782M601M167L838M640O342P986R203J0196J0730J0230Q860P498O497
56549B48570N424M202L462L403L228K306J068K01k92p04r63j052j431k347l287
56534B61788l707l833m096m330m236m161m614n338n615n284m720m124l440k888
56520B01402k870l333l776l784l320k594k027k065k645l072k864k358k129k149
56506A62416k052j882j925k034j742j006l39k25o71j281j443p18N77J463J322
56491A50460O20K70N40J009J285J264R39M21N6Q7L07L89L31K76J72k6q0J67M30
56472A58917L41L6m2K56P27J107J118N80k11n05J31J267K147K387J962J011N9
56455A71288j14O44J495J623J176P88O72P36R98J266R60K8n11J87J429J821J146
$$ plain form
56438 185632 186036 186267 186609 187126 188150 189988 192387 194833 197245 199889 202728 205246 206918 207536 207174 206061
56422 206061 204524 202934 201715 201284 201699 202396 202630 202202 201418 200406 199002 197365 196048 195197 194286 193009
56406 193009 191918 191677 192079 192302 191906 191145 190465 190118 190154 190489 190975 191512 191996 192278 192481 193282 195317 198209
56388 198209 200782 202450 203789 205437 207118 208273 209069 210085 211431 212881 214600 217000 219930 222653
56374 222653 224691 226247 227764 229433 231145 232647 233738 234503 235239 236025 236639 237080 237751 238689 239024 237843
56358 237843 235452 233132 231686 230825 230042 229404 229148 228953 228128 226347 223894 221311 219157 218010 218245 219567
56342 219567 220990 221659 221679 221880 222810 224317 226217 228883 232803 237791 243030 247655 251036 252841 253432 253985
56326 253985 255556 258048 260589 262813 265029 267148 268375 268317 267764 267907 269237 271426 273774 275448 275822
$$ packed form
56438A85632M04K31L42N17J024J838K399K446K412K644K839K518J672O18l62j113
56422B06061j537j590j219m31M15O97K34m28p84j012j404j637j317q51r11j277
56406A93009j091k41M02K23l96p61o80l47L6L35M86N37M84K82K03Q01K035K892
56388A98209K573J668J339J648J681J155P96J016J346J450J719K400K930K723
56374B22653K038J556J517J669J712J502J091P65P36P86O14M41O71R38L35j181
56358B37843k391k320j446q61p83o38k56j95q25j781k453k583k154j147K35J322
56342B19567J423O69K0K01R30J507J900K666L920M988N239M625L381J805N91N53
56326B53985J571K492K541K224K216K119J227n8n53J43J330K189K348J674L74
$$ plain form
56311 275822 275048 273992 273331 273046 272923 273031 273407 273830 274298 275235 276761 278204 278907 279222 280210 282459 285537
56294 285537 288440 290345 291181 291740 292966 294873 296459 296920 296584 296384 296764 297479 298179 298808 299556 300661 302112
56277 302112 303521 304597 305751 307698 310391 312943 314831 316452 318171 319606 320490 321576 323860 327268
56263 327268 330858 334099 337225 340496 343783 347001 350412 354376 359108 364730 371345 379013 387685 397163
56249 397163 407178 417735 429297 442303 456551 471511 487194 504119 522373 541358 560565
56238 560565 579922 599178 617634 634799 650701 665309 678287 689505 698966 706035 709681 709881
56226 709881 707760 703879 697536 688486 678091 667681 656747 644097 630134 616601 604487 593399
56214 593399 582707 572083 561086 549416 537707 527131 518143 510352 503464 497522 492333 487593 483618
$$ packed form
56311B75822p74j056o61k85j23J08L76M23M68R37J526J443P03L15R88K249L078
56294B85537K903J905Q36N59J226J907J586M61l36k00L80P15P00O29P48J105J451
56277C02112J409J076J154J947K693K552J888J621J719J435Q84J086K284L408
56263C27268L590L241L126L271L287L218L411L964M732N622O615P668Q672R478
56249C97163J0015J0557J1562J3006J4248J4960J5683J6925J8254J8985J9207
56238E60565J9357J9256J8456J7165J5902J4608J2978J1218R461P069L646K00
56226G09881k121l881o343r050j0395j0410j0934j2650j3963j3533j2114j1088
56214E93399j0692j0624j0997j1670j1709j0576q988p791o888n942n189m740l975
$$ plain form
56201 483618 481048 479731 478647 477120 475464 474325 473945 474215 475002 476298 478294 481181 484653 487951 490754
56186 490754 493600 496922 500164 502549 504322 506368 508849 511084 512720 514237 516167 518411 520395 521565
56172 521565 521740 521256 520587 519692 518108 515939 514105 513229 512953 512910 513577 515389 517732 519787 521835 524790
56156 524790 528883 533773 539517 546361 553909 561561 569542 578536 588487 598667 608718 618859 629339
56143 629339 640545 653251 667880 683937 701195 721002 745235 774330 807585 845240 889044
56132 889044 940878 1001952 1073262 1155540 1248499 1350884 1461105 1576952 1694998 1811459
56122 1811459 1923530 2028999 2125108 2209320 2281259 2342678 2395484 2440752 2479192 2510902 2534587
56111 2534587 2548505 2552487 2547905 2535655 2515524 2487514 2452191 2409280 2357259 2294796 2221549 2137526
$$ packed form
56201D83618k570j317j084j527j656j139l80K70P87J296J996K887L472L298K803
56186D90754K846L322L242K385J773K046K481K235J636J517J930K244J984J170
56172E21565J75m84o69q95j584k169j834q76k76m3O67J812K343K055K048K955
56156E24790M093M890N744O844P548P652P981Q994R951J0180J0051J0141J0480
56143F29339J1206J2706J4629J6057J7258J9807K4233K9095L3255L7655M3804
56132H89044N1834O1074P1310Q2278R2959J02385J10221J15847J18046J16461
56122A811459J12071J05469R6109Q4212P1939O1419N2806M5268L8440L1710K3685
56111B534587J3918L982m582j2250k0131k8010l5323m2911n2021o2463p3247q4023
$$ plain form
56099 2137526 2043198 1940802 1834332 1727732 1624035 1526331 1437911 1360584 1293917 1236737
56089 1236737 1188484 1148668 1116155 1089824 1069234 1054054 1043430 1036296 1031769 1029069 1027697 1027760 1029428
56076 1029428 1032176 1035366 1039325 1044784 1051407 1058132 1064891 1072721 1082138 1092736 1104425 1117657 1132269
56063 1132269 1147539 1163546 1181000 1199426 1217143 1233499 1249686 1266754 1284184 1300994 1316905
56052 1316905 1331779 1345199 1357364 1369346 1381832 1394515 1407157 1420257 1434325 1449545 1466429
56041 1466429 1485626 1506757 1528553 1550475 1573076 1596628 1620687 1645341 1671567 1699947 1730153
56030 1730153 1761926 1795374 1830243 1866157 1903694 1943848 1986406 2030244 2075188 2122041 2170791
56019 2170791 2220480 2270865 2322522 2375410 2429178 2484834 2544123 2607187 2672787 2740691 2811723
$$ packed form
56099B137526r4328j02396j06470j06600j03697r7704q8420p7327o6667n7180
56089A236737m8253l9816l2513k6331k0590j5180j0624p134m527k700j372O3J668
56076A029428K748L190L959N459O623O725O759P830R417J0598J1689J3232J4612
56063A132269J5270J6007J7454J8426J7717J6356J6187J7068J7430J6810J5911
56052A316905J4874J3420J2165J1982J2486J2683J2642J3100J4068J5220J6884
56041A466429J9197K1131K1796K1922K2601K3552K4059K4654K6226K8380L0206
56030A730153L1773L3448L4869L5914L7537M0154M2558M3838M4944M6853M8750
56019B170791M9689N0385N1657N2888N3768N5656N9289O3064O5600O7904P1032
$$ plain form
56008 2811723 2885722 2961953 3041466 3126291 3216225 3309234 3405235 3506501 3614028 3726672 3844415
55997 3844415 3969178 4101590 4240257 4385271 4539333 4704426 4880438 5067937 5268950
55988 5268950 5483952 5711490 5951927 6208287 6482555 6774816 7086905 7422897 7785110
55979 7785110 8174072 8593625 9051340 9552545 10099070 10695607 11352123 12078412 12882383
55970 12882383 13776229 14778351 15906694 17176612 18608234 20229422 22069238 24157396
55962 24157396 26535356 29262031 32408149 36059202 40334295 45398882 51464484 58801865
55954 58801865 67770371 78818001 92436070 109126059 129406481 153760797 182410308
55947 182410308 214969392 250191286 285944922 319399203 347360329 366774954 375364991
$$ packed form
56008B811723P3999P6231P9513Q4825Q9934R3009R6001J01266J07527J12644J17743
55997C844415J24763J32412J38667J45014J54062J65093J76012J87499K01013
55988E268950K15002K27538K40437K56360K74268K92261L12089L35992L62213
55979G785110L88962M19553M57715N01205N46525N96537O56516P26289Q03971
55970A2882383Q93846J002122J128343J269918J431622J621188J839816K088158
55962B4157396K377960K726675L146118L651053M275093N064587O065602P337381
55954E8801865Q968506J1047630J3618069J6689989K0280422K4354316K8649511
55947A82410308L2559084L5221894L5753636L3454281K7961126J9414625Q590037
$$ plain form
55940 375364991 372192328 357891831 334468561 304771126 271851234 238404599 206432153
55933 206432153 177167990 151202688 128672029 109425600 93160243 79519075 68145432
55926 68145432 58698407 50859946 44348485 38926267 34393137 30580282 27351526 24601342
55918 24601342 22244521 20209178 18438683 16891677 15534456 14335901 13270792 12322018
55910 12322018 11475401 10715388 10027929 9403656 8835430 8315724 7838403 7399909 6996485
55901 6996485 6622875 6275411 5953552 5656674 5381961 5126857 4890656 4672088 4468083
55892 4468083 4276676 4098594 3934363 3782246 3640636 3510073 3391209 3282941 3184151 3095331
55882 3095331 3017116 2949227 2892214 2848172 2818210 2800985 2794861 2799453 2813582 2833522 2854702 2873415
$$ packed form
55940C75364991l172663j4300497k3423270k9697435l2919892l3446635l1972446
55933B06432153k9264163k5965302k2530659j9246429j6265357j3641168j1373643
55926F8145432r447025p838461o511461n422218m533130l812855l228756k750184
55918B4601342k356821k035343j770495j547006j357221j198555j065109r48774
55910A2322018q46617p60013o87459o24273n68226n19706m77321m38494m03424
55901F996485l73610l47464l21859k96878k74713k55104k36201k18568k04005
55892D468083j91407j78082j64231j52117j41610j30563j18864j08268r8790q8820
55882C095331p8215o7889n7013m4042k9962j7225o124M592J4129J9940K1180J8713
$$ plain form
55870 2873415 2885616 2885961 2869967 2836191 2785365 2718762 2638261 2546325 2444739 2334748 2219315
55859 2219315 2103550 1991791 1885624 1785635 1693312 1609983 1535432 1468797 1409563 1356683 1308201
55848 1308201 1262901 1221035 1182559 1146173 1111090 1078131 1047901 1019431 991847 965837 942112
55837 942112 919858 898176 877734 859526 843167 827835 813744 801222 789411 777353 765456
55826 765456 754464 743897 732920 721873 711509 701470 690879 679754 668550 657063 645121
55815 645121 633643 623585 614452 605210 596107 588185 581581 575749 571035 568461 568077 568927 570690 574193
55801 574193 580122 588128 597342 607040 616737 626137 634890 642023 646057 646195 642902 636793 627613 615183
55787 615183 600686 585974 571890 558230 544996 532704 521624 511631 502674 494563 486417 477199
$$ packed form
55870B873415J2201L45j5994l3776n0826o6603q0501r1936j01586j09991j15433
55859B219315j15765j11759j06167r9989r2323q3329p4551o6635n9234n2880m8482
55848A308201m5300m1866l8476l6386l5083l2959l0230k8470k7584k6010k3725
55837I42112k2254k1682k0442j8208j6359j5332j4091j2522j1811j2058j1897
55826G65456j0992j0567j0977j1047j0364j0039j0591j1125j1204j1487j1942
55815F45121j1478j0058r133r242r103p922o604n832m714k574l84Q50J763L503
55801E74193N929Q006R214R698R697R400Q753P133M034J38l293o109r180j2430
55787F15183j4497j4712j4084j3660j3234j2292j1080r993q957q111q146r218
$$ plain form
55775 477199 466909 456631 447406 439586 433187 428289 425021 423512 423834 425737 428701 432379 436524 440171
55761 440171 441582 439705 435303 430028 424715 419086 412663 405225 396657 387083 377062 367183 357621 348403
55747 348403 339757 331740 323894 315809 307684 299904 292457 285320 278981 273904 269778 265966 262514 260135
55733 260135 259288 259694 260596 261173 260986 260303 259693 259041 257468 254492 250603 246318 241506 236273 231661 228495
55717 228495 226188 223744 221462 220468 220877 221650 222241 223222 225111 227638 230499 233907 237905 241776 244665
55702 244665 246408 247375 247769 247371 245838 243018 239003 233946 227920 221143 214352 208518 203975 200151 196432
55687 196432 192918 190028 187793 186034 184859 184482 184855 185949 188032 191080 194233 196582 198239 199905 201493
55672 201493 201979 200678 197973 194636 191017 187166 183295 179818 177124 175427 174609 174222 173881 173717 174249 175872
$$ packed form
55775D77199j0290j0278r225p820o399m898l268j509L22J903K964L678M145L647
55761D40171J411j877m402n275n313n629o423p438q568r574j0021r879r562r218
55747C48403q646q017p846q085q125p780p447p137o339n077m126l812l452k379
55733B60135q47M06R02N77j87o83o10o52j573k976l889m285m812n233m612l166
55717B28495k307k444k282r94M09P73N91R81J889K527K861L408L998L871K889
55702B44665J743R67L94l98j533k820m015n057o026o777o791n834m543l824l719
55687A96432l514k890k235j759j175l77L73J094K083L048L153K349J657J666J588
55672B01493M86j301k705l337l619l851l871l477k694j697q18l87l41j64N32J623
$$ plain form
55656 175872 178618 182287 186587 191244 196184 201494 207103 212751 218424 224384 230431 235479 238373 238921
55642 238921 237728 235243 231436 226219 219717 212255 204455 197211 191071 185740 180565 175441 170861 167185
55628 167185 164232 161545 158742 155697 152668 150127 148264 146785 145377 144058 142842 141449 139744 138114
55614 138114 136952 136057 134955 133557 132041 130476 129038 128260 128442 129035 129231 128918 128410 127529 125779 123410
55598 123410 121513 120846 121091 121400 121203 120414 119304 118288 117523 116720 115685 114850 114834 115619 116649 117559 118238
55581 118238 118405 117878 117205 117148 117431 116813 114786 112470 111372 111781 112894 114056 115256 116522 117416 117344 116222
55564 116222 114691 113621 113361 113602 113940 114292 114556 114285 113203 111816 110866 110257 109162 107292 105412 104294
55548 104294 103731 102974 101764 100445 99326 98383 97567 97016 96851 96956 97047 96902 96453 95698 94639 93397 92355
$$ packed form
55656A75872K746L669M300M657M940N310N609N648N673N960O047N048K894N48
55642B38921j193k485l807n217o502p462p800p244o140n331n175n124m580l676
55628A67185k953k687k803l045l029k541j863j479j408j319j216j393j705j630
55614A38114j162q95j102j398j516j565j438p78J82N93J96l13n08q81j750k369
55598A23410j897o67K45L09j97p89j110j016p65q03j035q35j6P85J030R10O79
55581A18238J67n27o73n7K83o18k027k316j098M09J113J162J200J266Q94p2j122
55564A16222j531j070k60K41L38L52K64k71j082j387r50o09j095j870j880j118
55548A04294n63p57j210j319j119r43q16n51j65J05R1j45m49p55j059j242j042
$$ plain form
55531 92355 91998 92501 93564 94718 95711 96594 97564 98765 100081 101110 101560 101643 101776 101890 101417 100111 98426
55514 98426 96928 95722 94728 94021 93559 92950 91925 90713 89644 88747 88067 87952 88546 89340 89689 89475 88968
55497 88968 88442 88337 89192 90900 92517 93460 94286 95579 96749 96954 96702 97308 98994 100707 101707 102153 102133
55480 102133 101385 100230 99560 99558 99477 99091 99256 100431 101667 101852 101134 100325 99608 98762 98125 98237 98748 98638 97613
55461 97613 96524 96179 96307 96063 95202 94400 94473 95502 96813 97720 98103 98287 98607 99179 99883 100368 100332 100008 100066
55442 100066 100765 101557 101914 102099 102561 102943 102455 100999 99188 97451 95964 95272 95931 97408 98347 98199 97722
55425 97722 97616 97640 97505 97692 98733 100345 101895 103191 104214 104636 104214 103326 102585 102248 102310 102754 103300 103468
55407 103468 103279 103348 103793 103694 102319 100306 98768 97662 96006 93533 91158 89702 88960 88283 87454 86673 86156
$$ packed form
55531I2355l57N03J063J154R93Q83R70J201J316J029M50Q3J33J14m73j306j685
55514I8426j498j206r94p07m62o09j025j212j069q97o80j15N94P94L49k14n07
55497H8968n26j05Q55J708J617R43Q26J293J170K05k52O06J686J713J000M46k0
55480A02133p48j155o70kq1l86J65J175J236J85p18q09p17q46o37J12N11j10j025
55461I7613j089l45J28k44q61q02P3J029J311R07L83J84L20N72P04M85l6l24N8
55442A00066O99P92L57J85M62L82m88j456j811j737j487o92O59J477R39j48m77
55425I7722j06K4j35J87J041J612J550J296J023M22m22q88p41l37O2M44N46J68
55407A03468j89O9M45r9j375k013j538j106j656k473k375j456p42o77q29p81n17
$$ plain form
55390 86156 86121 86886 88554 90627 92186 92604 92051 91275 90901 91077 91759 92982 94550 95777 96035 95485 94844
55373 94844 94550 94689 95486 97074 98736 99325 98736 98135 98377 98956 99000 98497 97898 97183 96124 94999 94314 94180
55355 94180 94540 95524 96939 97910 97835 97284 97148 97301 97036 96444 96257 96421 96003 94720 93586 93670 94896 96407
55337 96407 97473 97775 97430 97044 97315 98235 99107 99513 99758 100118 100164 99268 97502 95676 94666 94810 95700 96391
55319 96391 96164 95266 94652 94830 95279 95188 94426 93496 92861 92674 92950 93552 94023 93854 93057 92329 92467 93628 95175
55300 95175 96258 96540 96345 96110 95828 95153 94000 92856 92383 92815 93752 94594 95145 95757 96754 97804 98118 97367
55282 97367 96096 95092 94603 94455 94613 95228 96251 97475 98881 100519 102015 102631 102060 100877 100019 99973 100568
55265 100568 101340 101870 101873 101226 100088 98952 98475 99020 100294 101555 102277 102501 102487 102282 101817 101210 100651 100137
$$ packed form
55390H6156l5P65J668K073J559M18n53p76l74J76O82J223J568J227K58n50o41
55373I4844k94J39P97J588J662N89n89o01K42N79M4n03n99p15j059j125o85j34
55355I4180L60R84J415R71p5n51j36J53k65n92j87J64m18j283j134Q4J226J511
55337I6407J066L02l45l86K71R20Q72M06K45L60M6q96j766j826j010J44Q90O91
55319I6391k27q98o14J78M49r1p62r30o35j87K76O02M71j69p97p28J38J161J547
55300I5175J083K82j95k35k82o75j153j144m73M32R37Q42N51O12R97J050L14p51
55282I7367j271j004m89j48J58O15J023J224J406J638J496O16n71j183q58m6N95
55265A00568P72N30Lo47j138j136m77N45J274J261P22K24j4k05m65o07n59n14
$$ plain form
55247 100137 99630 99341 99517 99969 100175 99860 99230 98672 98503 98975 100071 101211 101573 100885 99673 98572 97698
55230 97698 96881 96193 95872 95814 95554 94833 93946 93406 93363 93586 93945 94690 96031 97623 98835 99525 100147 100941 101434
55211 101434 101114 100271 99669 99586 99755 100168 101260 103076 104853 105860 106254 106685 107322 107762 107758 107520 107258 106931
55193 106931 106618 106741 107497 108357 108522 107872 107097 106842 107065 107382 107622 107732 107486 106767 105966 105551 105301 104573 103434
55174 103434 102824 103307 104223 104584 104355 104237 104507 104775 104808 104885 105176 105370 105161 104696 104297 104042 103966 104374 105535
55155 105535 107115 108215 108152 107085 105820 105017 104706 104558 104488 104804 105727 106954 107846 107971 107407 106599 106011 105770
55137 105770 105591 105151 104553 104183 104053 103588 102314 100497 98833 97710 97111 97096 97926 99610 101599 103044 103382
55120 103382 102769 102025 101966 102647 103429 103937 104587 105869 107415 108283 108093 107412 106995 107045 107281 107421 107518 107947 109048
$$ packed form
55247A00137n07k89J76M52K06l15o30n58j69M72J096J140L62o88j212j101q74
55230I7698q17o88l21n8k60p21q87n40m3K23L59P45J341J592J212O90O22P94M93
55211A01434l20q43o02q3J69M13J092J816J777J007L94M31O37M40mk38k62l27
55193A06931l13J23P56Q60J65o50p75k55K23L17K40J10k46p19q01m15k50p28j139
55174A03434o10M83R16L61k29j18K70K68L3P7K91J94k09m65l99k55p6M08J161
55155A05535J580J100o3j067j265q03l11j48p0L16R23J227Q92J25n64q08n88k41
55137A05770j79m40n98l70j30m65j274j817j664j123n99j5Q30J684J989J445L38
55120A03382o13p44n9O81P82N08O50J282J546Q68j90o81m17N0K36J40R7M29J101
$$ plain form
55101 109048 110641 112031 112721 112935 113165 113458 113549 113421 113235 112891 112312 112020 112714 114176 115324 115534 115221 114859
55083 114859 114187 112919 111666 111415 112342 113659 114513 114577 113873 112573 111021 109567 108268 106992 105854 105274
55067 105274 105475 106101 106557 106714 107112 108292 109910 110769 109962 107931 106178 105912 107145 108927 110169 110312
55051 110312 109708 109461 110483 112449 113966 114022 113026 112198 112243 112937 113709 114138 113947 113063 111874 111112 111207 111817
55033 111817 112165 111835 111104 110494 110163 109933 109774 109923 110441 110988 111313 111701 112569 113824 115023 116038 117057
55016 117057 118021 118596 118795 119073 119610 120003 119954 119753 119757 119756 119294 118320 117162 116089 115271 114947 115266 116098 117316
54997 117316 119025 121175 123192 124436 124883 124955 124839 124441 123871 123411 123006 122373 121656 121404 121709 121928 121600 121106
54979 121106 120989 121013 120526 119592 119110 119701 120939 121871 121994 121529 121059 121131 122013 123490 124973 126058 126857 127623
$$ packed form
55101A09048J593J390O90K14K30K93R1j28j86l44n79k92O94J462J148K10l13l62
55083A14859o72j268j253k51R27J317Q54O4p04j300j552j454j299j276j138n80
55067A05274K01O26M56J57L98J180J618Q59q07k031j753k66J233J782J242J43
55051A10312o04k47J022J966J517N6r96q28M5O94P72M29j91q84j189p62R5O10
55033A11817L48l30p31o10l31k30j59J49N18N47L25L88Q68J255J199J015J019
55016A17057R64N75J99K78N37L93m9k01Mjm62r74j158j073q18l24L19Q32J218
54997A17316J709K150K017J244M47P2j16l98n70m60m05o33p17k52L05K19l28m94
54979A21106j17K4m87r34m82N91J238R32J23m65m70P2Q82J477J483J085P99P66
$$ plain form
54961 127623 128224 128384 128347 128827 130125 131736 132997 133781 134309 134648 134797 134962 135290 135512 135268 134641 133960 133237
54943 133237 132307 131398 130980 131054 131204 131370 131895 132669 133032 132870 133092 134392 136138 137210 137611 138442 140458 143488
54925 143488 147250 151887 157348 162934 168079 173256 179536 187330 195990 204687 213197 221561 229252 235134
54911 235134 238256 238377 235667 230355 223006 214765 206745 199146 191429 183389 175643 168942 163474 159015
54897 159015 155368 152377 149849 147785 146439 145815 145369 144517 143272 142102 141389 141296 141953 143390 145444 148016
54881 148016 151268 155249 159581 163913 168530 174077 180818 188553 197101 206231 215100 222372 227224 229852
54867 229852 230732 229736 226312 220313 212352 203426 194356 185549 177082 168973 161390 154616 148824 143994 139979
54852 139979 136625 133872 131846 130729 130390 130270 129888 129391 129292 129655 129874 129360 128196 126910 125782 124656
$$ packed form
54961A27623O01J60l7M80J298J611J261P84N28L39J49J65L28K22k44o27o81p23
54943A33237r30r09m18P4J50J66N25P74L63j62K22J300J746J072M01Q31K016L030
54925A43488L762M637N461N586N145N177O280P794Q660Q697Q510Q364P691N882
54911B35134L122J21k710n312p349q241q020p599p717q040p746o701n468m459
54897A59015l647k991k528k064j346o24m46q52j245j170p13r3O57J437K054K572
54881A48016L252L981M332M332M617N547O741P735Q548R130Q869P272M852K628
54867B29852Q80r96l424n999p961q926r070q807q467q109p583o774n792m830m015
54852A39979l354k753k026j117l39j20l82m97r9L63K19n14j164j286j128j126
$$ plain form
54836 124656 123362 122117 121358 121251 121467 121534 121291 120883 120388 119726 119010 118648 118903 119573 120378 121436 123000 124888
54818 124888 126522 127495 127804 127563 126885 126008 125201 124456 123653 123073 123346 124703 126563 128109 129053 129660 130217
54801 130217 130750 131141 131245 130876 129859 128258 126581 125604 125745 126553 127150 127321 127759 128921 130070 130160 129408
54784 129408 129134 129976 131127 131651 131722 132039 132704 133387 134136 135254 136695 138327 140604 144180 148905 154011
54768 154011 159371 165791 173773 182693 191643 200488 209565 218716 227269 234724 240864 245267 247276 246662
54754 246662 243921 239708 234189 227142 218602 209264 200285 192680 186821 182405 178850 175699 172705 169806
54740 169806 167207 165302 164199 163443 162562 161854 162244 164170 166957 169514 171394 172934 174618 176726 179429
54725 179429 182830 186913 191757 197747 205193 213652 222023 229470 235968 241794 246800 250474 252425 252447 250226
$$ packed form
54836A24656j294j245p59j07K16O7k43m08m95o62p16l62K55O70Q05J058J564J888
54818A24888J634R73L09k41o78q77q07p45q03n80K73J357J860J546R44O07N57
54801A30217N33L91J04l69j017j601j677r77J41Q08N97J71M38J162J149R0p52
54784A29408k74Q42J151N24P1L17O65O83P49J118J441J632K277L576M725N106
54768A54011N360O420P982Q920Q950Q845R077R151Q553P455O140M403K009o14
54754B46662k741m213n519p047q540r338q979p605n859m416l555l151k994k899
54740A69806k599j905j103p56q81p08L90J926K787K557J880J540J684K108K703
54725A79429L401M083M844N990P446Q459Q371P447O498N826N006L674J951K2k221
$$ plain form
54710 250226 245371 237873 228412 218152 208265 199447 191702 184670 178323 173215 169799 167600 165421 162454
54696 162454 158911 155475 152446 149681 147140 145084 143717 142907 142386 142029 141769 141382 140609 139539 138640 138294
54680 138294 138392 138498 138279 137673 136740 135617 134566 133840 133446 133261 133366 134006 135050 135753 135361 133943 132448
54663 132448 131867 132376 133255 133665 133460 133157 133093 132875 131982 130691 129899 129973 130287 130106 129483 128958 128829 129206 130408
54644 130408 132658 135398 137477 138205 137929 137486 137321 137219 136768 135995 135584 136257 137839 139188 139354 138609 137988
54627 137988 138045 138493 138872 139041 139018 138877 138858 139117 139291 138821 137798 137012 136976 137386 137784 138255 139168 140577 142284
54608 142284 144113 145771 146777 147010 147137 148012 149714 151540 152836 153421 153286 152435 151191 150262 150121 150483
54592 150483 150646 150290 149718 149315 149065 148718 148249 147832 147390 146520 145024 143295 141987 141538 142135 143782 146014
$$ packed form
54710B50226m855p498r461j0260r887q818p745p032o347n108l416k199k179k967
54696A62454l543l436l029k765k541k056j367q10n21l57k60l87p73j070q99l46
54680A38294R8J06k19o06r33j123j051p26l94j85J05O40J044P03l92j418j495
54663A32448n81N09Q79M10k05l03o4k18q93j291p92P4L14j81o23n25j29L77J202
54644A30408K250K740K079P28k76m43j65j02m51p73m11O73J582J349J66p45o21
54627A37988N7M48L79J69k3j41j9K59J74m70j023p86l6M10L98M71R13J409J707
54608A42284J829J658J006K33J27Q75J702J826J296N85j35q51j244r29j41L62
54592A50483J63l56n72m03k50l47m69m17m42q70j496j729j308m49N97J647K232
$$ plain form
54575 146014 147892 148847 149437 150662 152612 154336 155061 154878 154172 153158 152222 151901 152041 151611 150011 148077
54559 148077 147157 147535 148397 149010 149273 149341 149465 150062 151325 152718 153452 153411 153087 152724 152227 151862 152288 153669
54541 153669 155373 156791 157923 158970 159987 161218 163142 165710 167999 169184 169574 170211 171664 173619 175389
54526 175389 176390 176259 175117 173745 173129 173686 175065 176612 177779 178190 177744 176727 175597 174542 173500
54511 173500 172611 172306 172773 173636 174408 175073 175919 176884 177490 177482 177150 176792 176179 174974 173554 172859 173322 174325
54493 174325 174927 174815 174332 173935 173914 174338 174863 174869 174233 173731 174187 175378 176379 176831 177205 177853 178583 179299 180233
54474 180233 181253 181749 181635 181764 182785 184269 185584 187011 189090 191346 192717 193105 193548 194837 196746
54459 196746 198701 200379 201520 201860 201505 200824 199880 198625 197703 198124 199778 201117 200909 199624 198460 197639
$$ packed form
54575A46014J878R55N90J225J950J724P25j83p06j014r36l21J40m30j600j934
54559A48077r20L78Q62O13K63O8J24N97J263J393P34m1l24l63m97l65M26J381
54541A53669J704J418J132J047J017J231J924K568K289J185L90O37J453J955J770
54526A75389J001j31j142j372o16N57J379J547J167M11m46j017j130j055j042
54511A73500q89l05M67Q63P72O65Q46R65O06ql32l58o13j205j420o95M63J003
54493A74325O02j12m83l97k1M24N25Oo36n02M56J191J001M52L74O48P30P16R34
54474A80233J020M96j14J29J021J484J315J427K079K256J371L88M43J289J909
54459A96746J955J678J141L40l55o81r44j255r22M21J654J339k08j285j164q21
$$ plain form
54443 197639 196458 194586 192440 190460 188837 187926 188084 188991 189675 189480 188639 187830 187522 187754 188167 188132 187264
54426 187264 185941 185001 184811 184937 184741 183994 182866 181756 181229 181679 182739 183414 183142 182527 182729 184245 186532
54409 186532 188642 189964 190429 190333 190025 189628 189025 188136 187207 186683 186812 187412 188030 188416 188852 189940 191935 194356
54391 194356 196403 197631 198028 197621 196490 195205 194704 195418 196775 197798 197998 197457 196398 195049 193751 192783
54375 192783 192123 191658 191574 192184 193361 194458 194891 194705 194512 194933 196020 197108 197342 196511 195305 194587 194540 194724
54357 194724 194752 194580 194171 193338 192057 190681 189608 188838 187936 186406 184100 181363 178823 177016 176174 176256 176939
54340 176939 177532 177283 176070 174601 173607 173025 172325 171426 170760 170487 170199 169522 168541 167474 166354 165291 164673
54323 164673 164818 165646 166844 168042 168779 168796 168653 169482 171585 173708 174338 173510 172624 172590 172949 172901 172448 172090
$$ packed form
54443A97639j181j872k146j980j623r11J58R07O84j95q41q09l08K32M13l5q68
54426A87264j323r40j90J26j96p47j128j110n27M50J060O75k72o15K02J516K287
54409A86532K110J322M65r6l08l97o03q89r29n24J29O00O18L86M36J088J995K421
54391A94356K047J228L97m07j131j285n01P14J357J023K00n41j059j349j298r68
54375A92783o60m65q4O10J177J097M33j86j93M21J087J088K34q31j206p18m7J84
54357A94724K8j72m09q33j281j376j073p70r02j530k306k737k540j807q42Q2O83
54340A76939N93k49j213j469r94n82p00q99o66k73k88o77r81j067j120j063o18
54323A64673J45Q28J198J198P37J7j43Q29K103K123O30q28q86l4L59m8m53l58
$$ plain form
54305 172090 171959 171785 171410 170859 170105 169190 168444 168123 167932 167387 166702 166717 167717 168758 168667 167431 166066 165237
54287 165237 164577 163492 162097 160998 160501 160471 160736 161155 161341 160775 159342 157493 155831 154792 154769 156067 158457
54270 158457 161009 162723 163267 163002 162459 162018 161851 161858 161732 161368 161124 161436 162238 163071 163750 164510 165411 166041 166015
54251 166015 165479 164812 164096 163206 162297 161774 161744 161833 161605 160973 160117 159338 159047 159507 160349 160617 159738 158292 157432
54232 157432 157586 158138 158398 158379 158394 158353 157919 157176 156670 156740 157160 157480 157471 157148 156526 155560 154261 152830 151726 151481
54212 151481 152313 153772 154942 155082 154179 152917 152147 152270 152999 153684 153865 153468 152583 151383 150361 150283 151475
54195 151475 153287 154614 154975 154763 154491 154183 153617 152836 152186 151970 152158 152396 152308 151995 152132 153285 155131 156635
54177 156635 157066 156577 155847 155493 155862 156856 157744 157552 155977 153679 151469 149577 147955 146815 146372 146359 146367 146532
$$ packed form
54305A72090j31j74l75n51p54r15p46l21j91n45o85J5J000J041r1j236j365q29
54287A65237o60j085j395j099m97l0K65M19J86n66j433j849j662j039k3J298K390
54270A58457K552J714N44k65n43m41j67Pj26l64k44L12Q02Q33O79P60R01O30k6
54251A66015n36o67p16q90r09n23l0Q9k28o32q56p79k91M60Q42K68q79j446q60
54232A57432J54N52K60j9J5m1m34p43n06P0M20L20rl23o22r66j299j431j104k45
54212A51481Q32J459J170J40r03j262p70J23P29O85J81l97q85j200j022p8J192
54195A51475J812J327L61k12k72l08n66p81o50k16J88K38q8l13J37J153J846J504
54177A56635M31m89p30l54L69R94Q88j92j575k298k210j892j622j140m43j3QJ65
$$ plain form
54159 146532 147314 148643 149791 150226 150126 149962 149953 150130 150581 151350 152237 152916 153206 153143 152893 152667 152609 152706 152861 153030
54139 153030 153151 152964 152162 150846 149643 149181 149503 150127 150642 151100 151755 152513 152809 152143 150730 149470 149180
54122 149180 149881 150907 151635 152065 152689 153904 155585 157193 158298 158906 159279 159533 159607 159533 159456 159415 159363 159462 159974
54103 159974 160753 161149 160711 159697 158674 157898 157379 157194 157246 157018 156156 155190 155039 155784 156572 156839 156985 157555
54085 157555 158364 158926 159315 159972 160886 161555 161745 161812 162213 163059 164222 165491 166498 166844 166530 166096 166096 166572 167180
54066 167180 167629 167756 167393 166562 165778 165731 166469 167241 167404 167257 167634 168809 170178 171015 171210 171173 171316 171759 172358
54047 172358 172833 173037 173180 173657 174615 175843 177144 178560 180182 182012 184084 186477 189076 191635 194207
54032 194207 197152 200502 203725 206466 209128 212256 215695 218939 222118 225954 230689 235678 240179 244031
$$ packed form
54159A46532P82J329J148M35j00j64rJ77M51P69Q87O79K90o3k50k26n8R7J55J69
54139A53030J21j87q02j316j203m62L22O24N15M58O55P58K96o66j413j260k90
54122A49180P01J026P28M30O24J215J681J608J105O08L73K54P4p4p7m1n2R9N12
54103A59974P79L96m38j014j023p76n19j85N2k28q62r66j51P45P88K67J46N70
54085A57555Q09N62L89O57R14O69J90O7M01Q46J163J269J007L46l14m34%M76O08
54066A67180M49J27l63q31p84m7P38P72J63j47L77J175J369Q37J95l7J43M43N99
54047A72358M75K04J43M77R58J228J301J416J622J830K072K393K599K559K572
54032A94207K945L350L223K741K662L128L439L244L179L836M735M989M501L852
$$ plain form
54018 244031 247383 250125 251967 252878 253305 253996 255524 257742 259788 260870 260933 260270 258780 256236 253137 250498
54002 250498 248648 246966 245065 243486 242799 242719 242752 243139 244413 246484 249043 252687 258625 267098 276824 286281
53986 286281 294861 302377 308061 310675 309480 304657 296930 287158 276317 265438 255411 246887 240254
53973 240254 235433 231658 227802 223261 218445 214212 210908 208239 206015 204545 204044 204005 203645 202833 202118 201826
53957 201826 201720 201705 202283 203749 205325 205814 205146 204647 205527 207541 209510 210836 211983 213584 215627 217715
53941 217715 219729 221902 224471 227641 231724 236898 242800 248753 254524 260503 266991 273640 279846 285293
53927 285293 289729 292564 293259 292086 290013 287802 285590 283378 281448 280197 279851 280494 282048 284138 286339
53912 286339 288666 291574 295337 299773 304552 309436 314127 318374 322421 326881 331832 336453 339884 342085
$$ packed form
54018B44031L352K742J842R11M27O91J528K218K046J082O3o63j490k544l099k639
54002B50498j850j682j901j579o87q0L3L87J274K071K559L644N938Q473R726R457
53986B86281Q580P516N684K614j195m823p727r772j0841j0879j0027q524o633
53973B40254m821l775l856m541m816m233l304k669k224j470n01l9l60q12p15k92
53957B01826j06j5N78J466J576M89o68m99Q80K014J969J326J147J601K043K088
53941B17715K014K173K569L170M083N174N902N953N771N979O488O649O206N447
53927B85293M436K835O95j173k073k211k212k212j930j251l46O43J554K090K201
53912B86339K327K908L763M436M779M884M691M247M047M460M951M621L431K201
$$ plain form
53898 342085 343511 344398 344892 345420 346230 346733 346075 344332 342457 340916 339029 335952 331764 327233 322882 318708
53882 318708 314597 310597 306811 303283 299934 296439 292373 287765 283422 280250 278116 275707 271802 266567
53868 266567 261366 257348 254512 252140 249753 247400 245308 243642 242491 241770 241112 240212 239228 238484 237781 236477
53852 236477 234366 232010 229964 228146 226317 224696 223506 222270 220313 217935 216363 216324 217208 217893 217969 217843
53836 217843 217955 218306 218615 218631 218281 217762 217490 217835 218876 220506 222718 225665 229433 233917 239042 245085
53820 245085 252599 261823 272184 282524 291956 300429 308358 315707 321535 324490 323848 320124 314625 308358
53806 308358 301447 293711 285584 278119 272171 268004 265699 265391 266852 269379 272515 276535 281760 287627
53792 287627 292934 296824 299127 300020 299884 299384 299014 298572 297578 296240 295341 295078 294649 293288 291156 288844
$$ packed form
53898C42085J426Q87M94N28Q10N03o58j743j875j541j887l077m188m531m351m174
53882C18708m111m000l786l528l349l495m066m608m343l172k134k409l905n235
53868B66567n201m018k836k372k387k353k092j666j151p21o58r00r84p44p03j304
53852B36477k111k356k046j818j829j621j190j236j957k378j572l9Q84O85P6j26
53836B17843J12L51L09J6l50n19k72L45J041J630K212K947L768M484N125O043
53820B45085P514R224J0361J0340R432Q473P929P349N828K955o42l724n499o267
53806C08358o911p736q127p465n948m167k305l08J461K527L136M020N225N867
53792B87627N307L890K303Q93j36n00l70m42r94j338q99k63m29j361k132k312
$$ plain form
53776 288844 286556 284242 282142 280528 279053 276877 273499 269170 264543 260199 256460 253343 250630 248113
53762 248113 245752 243500 241171 238744 236632 235260 234397 233291 231504 229245 226784 223961 220615 217200
53748 217200 214528 212910 211941 211166 210628 210531 210663 210523 209976 209485 209561 210125 210538 210255 209438 208955 209660 211537
53730 211537 213603 214806 214995 214831 214853 214994 215001 214896 214780 214540 214075 213559 213159 212693 211887 210809 209689 208512
53712 208512 207191 206077 205833 206776 208585 210667 212491 213728 214513 215538 217386 219768 221909 223723 225997
53697 225997 229131 232317 234381 235103 235235 235485 235961 236456 236881 237404 238374 239995 241845 242980 242856 241998 241396
53680 241396 241374 241483 241380 241287 241438 241577 241341 240889 240780 241349 242405 243497 244175 244052 242880 240793 238396 236463
53662 236463 235532 235722 236769 238068 238853 238714 238027 237590 237698 237780 237194 236097 235234 235029 235247 235500 235615 235489
$$ packed form
53776B88844k288k314k100j614j475k176l378m329m627m344l739l117k713k517
53762B48113k361k252k329k427k112j372q63j106j787k259k461k823l346l415
53748B17200k672j618r69p75n38r7J32j40n47m91P6N64M13k83q17m83P05J877
53730B11537K066J203J89j64K2J41Pj05j16k40m65n16m00m66q06j078j120j177
53712B08512j321j114k44R43J809K082J824J237P85J025J848K382K141J814K274
53697B25997L134L186K064P22J32K50M76M95M25N23R70J621J850J135j24q58o02
53680B41396k2J09j03r3J51J39k36m52j09N69J056J092O78j23j172k087k397j933
53662B36463r31J90J047J299P85j39o87m37J08Q2n86j097q63k05K18K53J15j26
$$ plain form
53644 235489 234964 234035 232934 231877 230924 230177 229871 230170 231080 232609 234702 236943 238648 239508 239881 240280 240778
53627 240778 241133 241248 241305 241627 242555 244240 246372 248321 249795 251155 252853 254852 256901 259108 261804 264862
53611 264862 267597 269487 270783 272294 274650 277717 280682 282765 283939 284837 285951 287154 288134 288930 289784
53596 289784 290693 291458 292015 292470 292951 293664 294837 296323 297468 297768 297482 297154 296714 295606 293742 291725 290011
53579 290011 288347 286350 284274 282850 282487 282829 283068 282661 281786 281099 281019 281389 281938 282734 283834 284759 284826 283960
53561 283960 282718 281637 281008 281243 282703 284989 287000 288049 288510 289147 290277 291878 293975 296460 298924
53546 298924 301144 303497 306434 309856 313411 317086 320954 324624 327690 330622 334437 339412 344822 350192
53532 350192 356097 363256 371472 380060 389027 399060 410453 422697 435217 447849 460318 471818
$$ packed form
53644B35489n25r29j101j057r53p47l06K99R10J529K093K241J705Q60L73L99M98
53627B40778L55J15N7L22R28J685K132J949J474J360J698J999K049K207K696L058
53611B64862K735J890J296J511K356L067K965K083J174Q98J114J203R80P96Q54
53596B89784R09P65N57M55M81P13J173J486J145L00k86l28m40j108j864k017j714
53579B90011j664j997k076j424l63L42K39m07q75o87q0L70N49P96J100R25O7q66
53561B83960j242j081o29K35J460K286K011J049M61O37J130J601K097K485K464
53546B98924K220K353K937L422L555L675L868L670L066K932L815M975N410N370
53532C50192N905P159Q216Q588Q967J0033J1393J2244J2520J2632J2469J1500
$$ plain form
53520 471818 481708 490422 499172 508802 519380 530887 543706 558149 573957 590648 608124 626536
53508 626536 645793 665661 686221 707691 729755 751629 772980 794363 816411 838977 861397
53497 861397 883327 904857 925960 946419 966398 986637 1007778 1029690 1051675 1073191 1094083
53486 1094083 1114197 1133184 1150895 1167795 1184603 1201529 1218049 1233532 1247935 1261801 1275731
53475 1275731 1289902 1303844 1316549 1327052 1335158 1341406 1346145 1348936 1349151 1346777 1342054 1334721 1324458
53462 1324458 1312042 1299074 1286223 1272505 1256778 1239212 1220623 1201013 1179757 1156977 1133814
53451 1133814 1111219 1089101 1066808 1043900 1020399 996819 974137 953204 933938 915423 896976
53440 896976 878773 861309 844727 829011 814502 801737 790907 781761 773987 767457 762207 758472
$$ packed form
53520D71818R890Q714Q750R630J0578J1507J2819J4443J5808J6691J7476J8412
53508F26536J9257J9868K0560K1470K2064K1874K1351K1383K2048K2566K2420
53497H61397K1930K1530K1103K0459J9979K0239K1141K1912K1985K1516K0892
53486A094083K0114J8987J7711J6900J6808J6926J6520J5483J4403J3866J3930
53475A275731J4171J3942J2705J0503Q106O248M739K791K15k374m723p333j0263
53462A324458j2416j2968j2851j3718j5727j7566j8589j9610k1256k2780k3163
53451A133814k2595k2118k2293k2908k3501k3580k2682k0933j9266j8515j8447
53440H96976j8203j7464j6582j5716j4509j2765j0830r146p774o530n250l735
$$ plain form
53428 758472 756737 757466 760682 765882 772431 780051 788894 799188 810906 823896 838279 854484 872763
53415 872763 892866 914412 937373 961927 987994 1015291 1043711 1073250 1103697 1134933 1167544
53404 1167544 1202507 1240026 1279260 1319422 1360636 1403411 1447929 1494382 1543366 1595121 1648693
53393 1648693 1702726 1756908 1811811 1867339 1922377 1976254 2029727 2083916 2138820 2193378 2246520
53382 2246520 2297534 2345763 2390681 2432220 2470475 2505068 2535302 2561058 2583116 2602405 2619199
53371 2619199 2633128 2643633 2650188 2652309 2649706 2642363 2630244 2612882 2589410 2559069 2521665 2477607
53359 2477607 2427689 2372917 2314394 2253159 2190100 2126092 2062155 1999180 1937352 1876067 1814838
53348 1814838 1754234 1695603 1639761 1586265 1534077 1482613 1431954 1382378 1334101 1287251 1241752
$$ packed form
53428G58472j735P29L216N200O549P620Q843J0294J1718J2990J4383J6205J8279
53415H72763K0103K1546K2961K4554K6067K7297K8420K9539L0447L1236L2611
53404A167544L4963L7519L9234M0162M1214M2775M4518M6453M8984N1755N3572
53393A648693N4033N4182N4903N5528N5038N3877N3473N4189N4904N4558N3142
53382B246520N1014M8229M4918M1539L8255L4593L0234K5756K2058J9289J6794
53371B619199J3929J0505O555K121k603p343j2119j7362k3472l0341l7404m4058
53359B477607m9918n4772n8523o1235o3059o4008o3937o2975o1828o1285o1229
53348A814838o0604n8631n5842n3496n2188n1464n0659m9576m8277m6850m5499
$$ plain form
53337 1241752 1197378 1154315 1113496 1075904 1041600 1009843 980098 952386 926690 902805 881000
53326 881000 862117 846486 833281 821560 811500 803887 798629 794607 791033 788193 786714 786764 788242
53313 788242 791161 795375 800353 805690 811610 818564 826560 835301 844829 855598 867938 881850 897352
53300 897352 914659 933867 954663 976521 999112 1022504 1047027 1072955 1100212 1128387 1157094
53289 1157094 1186238 1215804 1245437 1274445 1302224 1328619 1353802 1377870 1400478 1420866 1438419
53278 1438419 1453318 1466423 1478265 1488340 1495684 1500038 1501940 1501711 1498921 1493138 1484721 1474434 1462521
53265 1462521 1448601 1432356 1413842 1393168 1370278 1345201 1318131 1289108 1257919 1224582 1189748
53254 1189748 1154296 1118635 1082689 1046575 1010932 976395 942993 910319 878232 847103 817354
$$ packed form
53337A241752m4374m3063m0819l7592l4304l1757k9745k7712k5696k3885k1805
53326H81000j8883j5631j3205j1721j0060p613n258m022l574k840j479N0J478
53313G88242K919M214M978N337N920O954P996Q741R528J0769J2340J3912J5502
53300H97352J7307J9208K0796K1858K2591K3392K4523K5928K7257K8175K8707
53289A157094K9144K9566K9633K9008K7779K6395K5183K4068K2608K0388J7553
53278A438419J4899J3105J1842J0075P344M354J902k29k790n783q417j0287j1913
53265A462521j3920j6245j8514k0674k2890k5077k7070k9023l1189l3337l4834
53254A189748l5452l5661l5946l6114l5643l4537l3402l2674l2087l1129k9749
$$ plain form
53243 817354 788991 761705 735210 709351 683998 659050 634549 610622 587311 564570 542412
53232 542412 521008 500640 481618 464170 448365 434224 421950 411808 403583 396378 389284 382198
53220 382198 375644 369906 364742 359884 355246 350550 345337 339713 334544 330417 326786 322689 318073 313787
53206 313787 310392 307557 304736 301822 299006 296394 294041 291950 289802 286987 283234 279086 275448 272733
53192 272733 270630 268674 266828 265411 264510 263675 262406 260877 259781 259218 258172 255593 251838 248422 246362
53177 246362 245327 244500 243604 242818 242238 241871 241795 241932 241987 241873 241890 242135 242178 241686 240941 240231 239175 237406 235674
53158 235674 235389 236963 239262 240839 241188 240715 240122 240040 240768 241953 242797 242797 242068 240957 239738 238752 238269 238017
53140 238017 237308 235934 234504 233551 232808 231762 230497 229426 228553 227658 227079 227545 229096 230718 231322 230773
$$ packed form
53243H17354k8363k7286k6495k5859k5353k4948k4501k3927k3311k2741k2158
53232E42412k1404k0368j9022j7448j5805j4141j2274j0142q225p205p094p086
53220C82198o554n738n164m858m638m696n213n624n169m127l631m097m616m286
53206C13787l395k835k821k914k816k612k353k091k148k815l753m148l638k715
53192B72733k103j956j846j417r01q35j269j529j096n63j046k579l755l416k060
53177B46362j035q27q96p86n80l67p6J37N5j14J7K45M3m92p45p10j056j769j732
53158B35674k85J574K299J577L49m73n93q2P28J185Q44%p29j111j219r86m83k52
53140B38017p09j374j430r53p43j046j265j071q73q95n79M66J551J622O04n49
$$ plain form
53124 230773 229793 229113 228925 228951 228824 228434 228061 228158 228983 230434 232177 233872 235379 236847 238498 240237 241602
53107 241602 242222 242161 241601 240377 238215 235399 232817 231160 230240 229247 227552 225205 222786 220918 219849 219445
53091 219445 219510 219963 220618 220948 220372 218878 217215 216365 216747 217856 218618 218287 217161 216309 216402 217020 217322 217150
53073 217150 216977 216845 216054 214207 212055 210777 210628 210731 210184 209017 207972 207652 208057 208819 209648 210472 211184
53056 211184 211471 211061 210136 209329 209207 209830 210821 211744 212378 212756 213044 213354 213622 213745 213797 213971 214315 214704 215103
53037 215103 215627 216269 216770 216882 216555 215797 214532 212817 210973 209327 208012 207140 206894 207074 206786 205141 202333
53020 202333 199631 198126 197726 197536 197011 196451 196447 197072 197766 197983 197780 197644 197779 197846 197425 196497 195340 194247
53002 194247 193558 193638 194374 194896 194277 192548 190569 188985 187808 187029 186945 187535 188042 187708 186706 185952 186135 187264
$$ packed form
53124B30773r80o80j88K6j27l90l73R7Q25J451J743J695J507J468J651J739J365
53107B41602O20o1n60j224k162k816k582j657r20r93j695k347k419j868j069m04
53091B19445O5M53O55L30n76j494j663q50L82J109P62l31j126q52R3O18L02j72
53073B17150j73j32p91j847k152j278j49J03n47j167j045l20M05P62Q29Q24P12
53056B11184K87m10r25q07j22O23R91R23O34L78K88L10K68J23N2J74L44L89L99
53037B15103N24O42N01J12l27p58j265j715j844j646j315q72k46J80k88j645k808
53020B02333k702j505m00j90n25n60mO25O94K17k03j36J35O7m21r28j157j093
53002A94247o89Q0P36N22o19j729j979j584j177p79q4N90N07l34j002p54J83J129
$$ plain form
52984 187264 188929 190656 192089 193176 194137 195036 195558 195465 195100 195082 195580 196254 196856 197541 198580 200085 202016
52967 202016 204129 205938 207081 207783 208602 209647 210392 210404 209906 209457 209359 209497 209515 208976 207599 205562 203427
52950 203427 201689 200543 200050 200116 200251 199792 198561 196914 195038 192795 190518 189256 189559 190506 190742 190202
52934 190202 189970 190550 191189 191083 190417 189858 189603 189382 188988 188348 187371 186155 185154 184803 185052 185455 185630 185482
52916 185482 185154 184909 184917 185018 184872 184430 184072 184142 184613 185330 186304 187491 188558 189224 189714 190529 191747 192805
52898 192805 193072 192506 191700 191292 191350 191383 191037 190622 190679 191171 191558 191711 192176 193262 194341 194570 193970 193276 192873
52879 192873 192409 191467 190179 189000 188174 187549 186827 186009 185611 186318 188240 190659 192679 193992 194885 195757 196911
52862 196911 198531 200470 202200 203319 203978 204518 204942 205134 205450 206503 208385 210483 212069 212725 212325 211101
$$ packed form
52984A87264J665J727J433J087R61Q99N22r3l65j8M98O74O02O85J039J505J931
52967B02016K113J809J143P02Q19J045P45J2m98m49r8J38J8n39j377k037k135
52950B03427j738j146m93O6J35m59j231j647j876k243k277j262L03R47K36n40
52934A90202k32N80O39j06o66n59k55k21l94o40r77j216j001l51K49M03J75j48
52916A85482l28k45QJ01j46m42l58P0M71P17R74J187J067O66M90Q15J218J058
52898A92805K67n66q06m08N8L3l46m15N7M92L87J53M65J086J079K29o00o94m03
52879A92873m64r42j288j179q26o25p22q18l98P07J922K419K020J313Q93Q72J154
52862A96911J620J939J730J119O59N40M24J92L16J053J882K098J586O56m00j224
$$ plain form
52846 211101 209720 208741 207974 206783 205013 203092 201198 199004 196457 194199 192846 192249 191738 190798 189322
52831 189322 187614 186310 185868 185944 185740 185185 185189 186400 188277 189876 191004 192012 192890 193352 193548 193955 194598
52814 194598 194966 194704 193905 192829 191898 191913 193594 196671 199875 202141 203504 204691 206138 207597 208393 207858
52798 207858 205755 202577 199403 197225 196267 195939 195432 194423 193199 192086 190832 188834 186005 183083 180862
52783 180862 179418 178315 177305 176441 175828 175690 176482 178352 180618 182329 183348 184353 185711 186933 187417
52768 187417 187208 186792 186564 186745 187404 188244 188765 188895 189151 189819 190397 190307 189862 189923 190727 191664 192274 192882 193936
52749 193936 195134 195683 195269 194397 193741 193484 193468 193715 194467 195683 196901 197720 198240 198798 199468 200042 200401 200565
52731 200565 200442 199860 198886 197834 196917 196125 195509 195279 195517 196093 196974 198301 199940 201282 201817 201700 201469
$$ packed form
52846B11101j381r79p67j191j770j921j894k194k547k258j353n97n11r40j476
52831A89322j708j304m42P6k04n55MJ211J877J599J128J008Q78M62J96M07O43
52814A94598L68k62p99j076r31J5J681L077L204K266J363J187J447J459P96n35
52798B07858k103l178l174k178r58l28n07j009j224j113j254j998k829k922k221
52783A80862j444j103j010q64o13j38P92J870K266J711J019J005J358J222M84
52768A87417k09m16k28J81O59Q40N21J30K56O68N78r0m45O1Q04R37O10O08J054
52749A93936J198N49m14q72o56k57j6K47P52J216J218Q19N20N58O70N74L59J64
52731B00565j23n82r74j052r17p92o16k30K38N76Q81J327J639J342N35j17k31
$$ plain form
52714 201469 201320 200947 200006 198453 196511 194578 193149 192544 192623 192921 193059 192907 192430 191700 191084 191107 191865 192711
52696 192711 192758 191753 190347 189443 189337 189558 189511 189110 188651 188240 187685 187021 186789 187496 188929 190296 191025 191189
52678 191189 191212 191416 191922 192739 193796 194991 196282 197577 198541 198745 198164 197377 197088 197519 198388 199338 200182 200773
52660 200773 200897 200393 199265 197731 196273 195562 196026 197386 198827 199757 200232 200613 201062 201601 202342 203297 204099
52643 204099 204327 204030 203582 203091 202420 201797 201798 202431 202779 202016 200496 199360 199269 199951 200800 201457 201864 202246 203103
52624 203103 204785 206981 208931 210191 210934 211514 212116 212797 213433 213549 212644 210893 209085 207698 206391 204668
52608 204668 202657 200938 199911 199654 200059 200771 201254 201283 201182 201227 201122 200538 199926 200187 201505 203017 203765 203593
52590 203593 203051 202809 203309 204595 206185 207346 207781 207954 208591 209868 211213 211854 211534 210711 210070 209879 209916
$$ packed form
52714B01469j49l73r41j553j942j933j429o05P9K98J38j52m77p30o16K3P58Q46
52696A92711M7j005j406r04j06K21m7m01m59m11n55o64k32P07J433J367P29J64
52678A91189K3K04N06Q17J057J195J291J295R64K04n81p87k89M31Q69R50Q44N91
52660B00773J24n04j128j534j458p11M64J360J441R30M75L81M49N39P41R55Q02
52643B04099K28k97m48m91o71o23JO33L48p63j520j136r1O82Q49O57M07L82Q57
52624B03103J682K196J950J260P43N80O02O81O36J16r05j751j808j387j307j723
52608B04668k011j719j027k57M05P12M83K9j01M5j05n84o12K61J318J512P48j72
52590B03593n42k42N00J286J590J161M35J73O37J277J345O41l20q23o41j91L7
$$ plain form
52573 209916 210047 210538 211571 212672 213109 212786 212331 212228 212345 212501 212971 214008 215139 215441 214536 212995 211740
52556 211740 211326 211782 212836 214067 215013 215380 215198 214672 213875 212680 211107 209648 209026 209494 210465 211053 211000
52539 211000 210903 211449 212566 213447 213366 212342 211016 209981 209347 208917 208661 208818 209515 210480 211298 211877 212450 213136
52521 213136 213749 214171 214703 215864 217839 220197 222160 223180 223372 223454 224245 226079 228651 231324 233589 235372
52505 235372 237011 238885 240857 242112 241758 239684 236687 233736 231231 228979 226644 224106 221558 219390
52491 219390 217878 217006 216728 217323 219069 221490 223416 224176 224333 224763 225341 225225 224280 223424 223437 224148 225143 226580
52473 226580 228666 230839 232237 232862 233557 234809 236221 237310 238213 239280 240463 241549 242706 244297 246311
52458 246311 248380 250277 252036 253550 254425 254317 253209 251299 248844 246130 243379 240633 237927 235571 233997
$$ packed form
52573B09916J31M91J033J101M37l23m55j03J17J56M70J037J131L02r05j541j255
52556B11740m14M56J054J231R46L67j82n26p97j195j573j459o22M68R71N88n3
52539B11000r7N46J117Q81q1j024j326j035o34m30k56J57O97R65Q18N79N73O86
52521B13136O13M22N32J161J975K358J963J020J92Q2P91J834K572K673K265J783
52505B35372J639J874J972J255l54k074k997k951k505k252k335k538k548k168
52491B19390j512q72k78N95J746K421J926P60J57M30N78j16r45q56J3P11R95J437
52473B26580K086K173J398O25O95J252J412J089R03J067J183J086J157J591K014
52458B46311K069J897J759J514Q75j08j108j910k455k714k751k746k706k356j574
$$ plain form
52443 233997 233235 232734 231794 230059 227639 225070 223204 222737 223622 225128 226577 227716 228335 228139 227343 226913
52427 226913 227538 228629 228963 228192 227103 226394 225954 225526 225411 226031 227213 228314 228929 229146 229299 229666 230282
52410 230282 230919 231435 232217 233906 236495 239174 241496 244381 249347 256818 265680 274588 283199 291894 300651
52395 300651 308547 314378 317494 317930 315828 311072 303801 295123 286826 280093 274828 270435 266879 264526
52381 264526 263305 262630 262131 261871 261770 261363 260362 259085 258153 258037 258981 260965 263540 266027 268136 270117
52365 270117 272107 273751 274815 275767 277205 278824 279497 278419 275866 272798 270126 268392 267718 267775 267940 267713
52349 267713 267010 266062 265207 264808 265100 265942 266788 267095 266826 266541 267009 268620 270984 273115 274275 274763 275728
52332 275728 278010 281281 284497 287081 289435 292364 296340 301421 307491 314262 321149 327542 333305 338785
$$ packed form
52443B33997p62n01r40j735k420k569j866m67Q85J506J449J139O19j96p96m30
52427B26913O25J091L34p71j089p09m40m28j15O20J182J101O15K17J53L67O16
52410B30282O37N16P82J689K589K679K322K885M966P471Q862Q908Q611Q695Q757
52395C00651P896N831L116M36k102m756p271q678q297o733n265m393l556k353
52381B64526j221o75m99k60j01m07j001j277r32j16R44J984K575K487K109J981
52365B70117J990J644J064R52J438J619O73j078k553l068k672j734o74N7J65k27
52349B67713p03r48q55l99K92Q42Q46L07k69k85M68J611K364K131J160M88R65
52332B75728K282L271L216K584K354K929L976N081O070O771O887O393N763N480
$$ plain form
52318 338785 344235 349394 353734 356971 359161 360456 361061 361397 362059 363483 365713 368551 371807 375366 379096
52303 379096 382850 386625 390686 395421 400896 406571 411689 416086 420412 425352 430795 436043 440633 444499
52289 444499 447403 448831 448651 447431 445820 443977 441895 439904 438422 437462 436882 436886 437759 439157 440234 440609
52273 440609 440812 441645 443392 445790 448494 451372 454513 458001 461582 464657 466926 469060 472253 476945 482263
52258 482263 486966 490643 493771 496893 500190 503743 507820 512642 518010 523295 527867 531522 534549 537379
52244 537379 540246 543116 545764 547867 549271 550362 551932 554372 557239 559964 562715 566008 569669 572937
52230 572937 575609 578263 581135 583647 585561 587795 591348 595902 600288 603988 607406 610867 614213 617367
52216 617367 620554 623817 626909 629765 632616 635541 638378 641120 643916 646665 649214 652000 655796 660613
$$ packed form
52318C38785N450N159M340L237K190J295O05L36O62J424K230K838L256L559L730
52303C79096L754L775M061M735N475N675N118M397M326M940N443N248M590L866
52289D44499K904J428j80j220j611j843k082j991j482r60n80MQ73J398J077L75
52273D40609K03Q33J747K398K704K878L141L488L581L075K269K134L193M692N318
52258D82263M703L677L128L122L297L553M077M822N368N285M572L655L027K830
52244E37379K867K870K648K103J404J091J570K440K867K725K751L293L661L268
52230E72937K672K654K872K512J914K234L553M554M386L700L418L461L346L154
52216F17367L187L263L092K856K851K925K837K742K796K749K549K786L796M817
$$ plain form
52202 660613 665530 669974 674544 679996 685821 690523 693205 694482 695861 698518 702584 707340 712015 716451
52188 716451 720957 725631 730132 734102 737445 740091 741945 743168 744036 744281 743106 740195 736240 732096 727892
52173 727892 723400 718711 713909 708591 702580 696825 692656 690257 688770 687920 688443 690600 693275 695251 696705
52158 696705 698727 701736 705051 707784 709573 710560 711183 711934 712906 713605 713590 713237 713474 714800 716995 719766
52142 719766 723123 726902 730415 733012 734720 735935 736594 736103 734194 731499 729080 727519 726649 726033 725549
52127 725549 725507 726398 728580 732131 736927 742874 750073 758663 768467 778820 788833 797853 805749 812811
52113 812811 819275 824802 828456 829456 828025 825351 822525 819712 816540 813105 810254 808862 809113 810619
52099 810619 813031 816403 821050 827187 834645 842788 850686 857434 862459 865707 867588 868590 868785 867742
$$ packed form
52202F60613M917M444M570N452N825M702K682J277J379K657M066M756M675M436
52188G16451M506M674M501L970L343K646J854J223Q68K45j175k911l955m144m204
52173G27892m492m689m802n318o011n755m169k399j487q50N23K157K675J976J454
52158F96705K022L009L315K733J789R87O23P51R72O99j5l53K37J326K195K771
52142G19766L357L779L513K597J708J215O59m91j909k695k419j561q70o16m84
52127G25549m2Q91K182L551M796N947P199Q590R804J0353J0013R020P896P062
52113H12811O464N527L654J000j431k674k826k813l172l435k851j392K51J506
52099H10619K412L372M647O137P458Q143P898O748N025L248J881J002J95j043
$$ plain form
52085 867742 865022 860641 854975 848392 841313 834554 829204 825968 824775 825041 826058 827093 827529 827233 826649
52070 826649 826291 826322 826774 827847 829535 831090 831512 830731 829835 829850 830677 831582 832384 833579 835418 837521 839512
52053 839512 841420 843137 844026 843649 842518 841520 840765 839666 838077 836476 834794 831931 826995 820532 813917
52038 813917 807967 802803 798677 795965 794388 793155 792089 791892 792949 794539 795628 795967 795897 795585 795013 794401
52022 794401 793951 793255 791603 788994 786301 784299 782913 781677 780555 779986 780240 781095 782215 783614 785585
52007 785585 788199 791038 793489 795190 795998 795573 793246 788479 781254 771913 760769 748125 734577 721026
51993 721026 708331 697001 687159 678601 670907 663668 656693 649941 643326 636644 629672 622235 614204 605568
51979 605568 596478 587138 577688 568227 558914 549921 541332 533152 525351 517858 510725 504427 499859 497764
$$ packed form
52085H67742k720m381n666o583p079o759n350l236j193K66J017J035M36k96n84
52070H26649l58L1M52J073J688J555M22p81q96J5Q27R05Q02J195J839K103J991
52053H39512J908J717Q89l77j131r98p55j099j589j601j682k863m936o463o615
52038H13917n950n164m126k712j577j233j066j97J057J590J089L39p0l12n72o12
52022G94401m50o96j652k609k693k002j386j236j122n69K54Q55J120J399J971
52007G85585K614K839K451J701Q08m25k327m767p225r341j1144j2644j3548j3551
51993G21026j2695j1330r842q558p694p239o975o752o615o682o972p437q031q636
51979F05568r090r340r450r461r313q993q589q180p801p493p133o298m568k095
$$ plain form
51965 497764 498198 500713 504974 511005 518917 528581 539465 550547 560545 568577 574617 578992 581529 581605
51951 581605 579041 574474 568660 561867 554244 546420 539330 533579 529325 526717 526238 528649 534661 544357
51937 544357 556742 570114 583223 595918 608406 620196 630179 637539 642068 643738 642565 638968 633564
51924 633564 626426 617051 605339 592064 578040 563360 547961 532494 517886 504262 491076 478343
51912 478343 467050 458070 451236 445799 441415 438305 436797 437104 439322 443184 447997 453302 459591 467835
51898 467835 478063 488778 498060 505039 510022 513318 514317 511812 505032 494379 481380 468022 455836
51885 455836 445247 435769 426980 419376 414171 412257 413517 417177 422653 429928 439336 451244 465897
51872 465897 483188 502450 522601 542685 562215 580974 598644 614713 628682 640340 649934 658092
$$ packed form
51965D97764M34K515M261O031P912R664J0884J1082R998Q032O040M375K537P6
51951E81605k564m567n814o793p623p824p090n751m254k608m79K411O012R696
51937E44357J2385J3372J3109J2695J2488J1790R983P360M529J670j173l597n404
51924F33564p138r375j1712j3275j4024j4680j5399j5467j4608j3624j3186j2733
51912D78343j1293q980o834n437m384l110j508L07K218L862M813N305O289Q244
51898D67835J0228J0715R282O979M983L296R99k505o780j0653j2999j3358j2186
51885D55836j0589r478q789p604n205j914J260L660N476P275R408J1908J4653
51872D65897J7291J9262K0151K0084J9530J8759J7670J6069J3969J1658R594Q158
$$ plain form
51860 658092 665290 671220 674813 674992 671298 663734 652444 637957 621497 604479 587597 570803 554226
51847 554226 538573 524371 511287 498661 486425 475057 464723 455011 445551 436435 427880 419916
51835 419916 412696 406756 402584 400037 398622 398279 399392 401903 404817 406969 408049 408546 408866 408949 408684 408183
51819 408183 407425 406088 404077 402014 400807 400840 401900 403794 406645 410509 415013 419451 423056 425157 425414
51804 425414 424138 422162 420130 417905 414822 410453 405068 399416 394196 389756 386163 383457 381738 380971
51790 380971 380853 381001 381197 381328 381217 380817 380520 380894 381963 383032 383393 382975 382107 380908 379212 376967 374432
51773 374432 371981 369921 368490 367939 368596 370891 375135 381169 388441 396536 405428 414958 424306 432342 438427
51758 438427 442575 444918 445390 443929 440601 435456 428621 420645 412393 404374 396498 388758 381899 376927
$$ packed form
51860F58092P198N930L593J79l694p564j1290j4487j6460j7018j6882j6794j6577
51847E54226j5653j4202j3084j2626j2236j1368j0334r712r460r116q555p964
51835D19916p220n940m172k547j415l43J113K511K914K152J080M97L20Q3k65n01
51819D08183p58j337k011k063j207L3J060J894K851L864M504M438L605K101K57
51804D25414j276j976k032k225l083m369n385n652n220m440l593k706j719p67
51790C80971j18J48J96J31j11m00k97L74J069J069L61m18q68j199j696k245k535
51773C74432k451k060j431n51O57K295M244O034P272Q095Q892R530R348Q036O085
51758D38427M148K343M72j461l328n145o835p976q252q019p876p740o859m972
$$ plain form
51744 376927 374012 372226 370516 368679 367283 366858 367446 368858 371065 374187 378290 383332 389247 395832 402599
51729 402599 408912 414373 418905 422415 424599 425241 424545 422991 421008 418957 417311 416515 416605 417158 417658 417823
51713 417823 417564 416825 415584 414011 412546 411684 411500 411414 410729 409603 409209 410670 414019 418492 423563 429099
51697 429099 434577 438932 441594 443305 445441 448661 452489 456015 458722 460613 461916 462781 463182 462952 461791
51682 461791 459198 454571 447743 439534 431522 425050 420551 417852 416760 417021 417970 418689 418638 417868 416625 415039
51666 415039 413298 411769 410638 409579 408174 406749 406438 408124 411344 414555 416497 416999 416447 414962 412593
51651 412593 410017 408397 408480 410276 413689 418868 425647 433153 440420 447026 452654 456373 456984 454059 448084
51636 448084 439688 429309 417696 406033 395185 385229 376039 367911 361151 355409 350061 345165 341478
$$ packed form
51744C76927k915j786j710j837j396m25N88J412K207L122M103N042N915O585O767
51729D02599O313N461M532L510K184O42o96j554j983k051j646p96R0N53N00J65
51713D17823k59p39j241j573j465q62j84q6o85j126l94J461L349M473N071N536
51697D29099N478M355K662J711K136L220L828L526K707J891J303Q65M01k30j161
51682D61791k593m627o828q209q012o472m499k699j092K61R49P19n1p70j243j586
51666D15039j741j529j131j059j405j425l11J686L220L211J942N02n52j485k369
51651D12593k576j620Q3J796L413N179O779P506P267O606N628L719O11k925n975
51636D48084q396j0379j1613j1663j0848r956r190q128o760n742n348m896l687
$$ plain form
51623 341478 339428 338569 338253 338392 339214 340554 341881 342993 344225 345865 347608 348785 348932 348008 346169 343584
51607 343584 340433 336976 333586 330731 328788 327786 327431 327538 328325 330097 332709 335599 338398 341339 345054
51592 345054 350195 357196 366091 376374 387224 398050 408716 419109 428679 436608 442385 446047 447883
51579 447883 448093 446884 444981 443914 445499 450743 459304 470304 483500 499300 517691 537781 558709
51566 558709 580530 603831 628861 655527 683912 714185 746136 779474 814750 853485 896993
51555 896993 945114 996084 1047488 1097276 1143972 1185856 1220011 1242693 1251202 1245332 1226707 1197030
51543 1197030 1157557 1109967 1056668 999895 941151 881879 824037 769528 719419 674162 634145
51532 634145 599505 569751 544159 522431 504518 490014 478243 468817 461520 455669 450199 444586
$$ packed form
51623C41478k050q59l16J39Q22J340J327J112J232J640J743J177J47r24j839k585
51607C43584l151l457l390k855j943j002l55J07P87J772K612K890K799K941L715
51592C45054N141P001Q895J0283J0850J0826J0666J0393R570P929N777L662J836
51579D47883K10j209j903j067J585N244Q561J1000J3196J5800J8391K0090K0928
51566E58709K1821K3301K5030K6666K8385L0273L1951L3338L5276L8735M3508
51555H96993M8121N0970N1404M9788M6696M1884L4155K2682Q509n870j8625k9677
51543A197030l9473m7590n3299n6773n8744n9272n7842n4509n0109m5257m0017
51532F34145l4640k9754k5592k1728j7913j4504j1771r426p297n851n470n613
$$ plain form
51520 444586 439298 435070 431978 429339 426333 422558 418231 413984 410336 407296 404541 401917 399539 397418
51506 397418 395251 392677 389564 386022 382265 378514 374841 371158 367507 364335 362226 361333 361317 361781 362413
51491 362413 362745 362314 361299 360575 360833 361904 363238 364654 366198 367579 368332 368469 368361 367964 366749 364537
51475 364537 361885 359296 356571 353374 350159 347911 347005 346816 346478 345632 344403 343119 342322 342614 344074 346035
51459 346035 347812 349490 351618 354268 356890 359075 360904 362419 363294 363390 363207 363323 363676 363859 364033 365047
51443 365047 367660 372016 377912 385232 394037 404421 416208 428512 439756 448647 455208 460402 464671
51430 464671 467442 468275 467836 467176 466457 465024 462459 458838 453973 447198 438287 428225 418688 410865 404858
51415 404858 400021 395668 391634 388313 386130 384948 384148 383309 382588 382305 382449 382847 383619 385026 386901 388644
$$ packed form
51520D44586n288m228l092k639l006l775m327m247l648l040k755k624k378k121
51506C97418k167k574l113l542l757l751l673l683l651l172k109q93j6M64O32
51491C62413L32m31j015p24K58J071J334J416J544J381P53J37j08l97j215k212
51475C64537k652k589k725l197l215k248r06j89l38q46j229j284p97K92J460J961
51459C46035J777J678K128K650K622K185J829J515Q75R6j83J16L53J83J74J014
51443C65047K613M356N896P320Q805J0384J1787J2304J1244Q891O561N194M269
51430D64671K771Q33m39o60p19j433k565l621m865o775q911j0062r537p823o007
51415D04858m837m353m034l321k183j182q00q39p21k83J44L98P72J407J875J743
$$ plain form
51399 388644 389999 391511 393899 397160 400711 404339 408509 413586 419230 425020 431373 439338 449532 461767
51385 461767 475755 491642 509737 530349 554278 583002 617772 658680 705082 756738 813934
51374 813934 876411 942691 1010670 1078501 1144576 1206825 1262326 1307718 1340064 1357547 1359601 1346556
51362 1346556 1319306 1279315 1228628 1169571 1104495 1035871 966367 898388 833616 773247 718423
51351 718423 669929 627483 590009 556802 527996 503678 483107 465219 449463 435632 423129
51340 423129 411047 399044 387738 378128 370747 365333 361067 357153 353352 350006 347458 345585 344026
51327 344026 342663 341557 340537 339282 337847 336710 336095 335595 334760 333837 333546 334149 335080 335636 335798 336134 337000
51310 337000 338154 339227 340284 341698 343607 345784 347996 350229 352414 354158 354981 354805 354101 353450 352949
$$ packed form
51399C88644J355J512K388L261L551L628M170N077N644N790O353P965J0194J2235
51385D61767J3988J5887J8095K0612K3929K8724L4770M0908M6402N1656N7196
51374H13934O2477O6280O7979O7831O6075O2249N5501M5392L2346J7483K054j3045
51362A346556k7250l9991n0687n9057o5076o8624o9504o7979o4772o0369n4824
51351G18423m8494m2446l7474l3207k8806k4318k0571j7888j5756j3831j2503
51340D23129j2082j2003j1306r610p381n414m266l914l801l346k548j873j559
51327C44026j363j106j020j255j435j137o15n00q35r23k91O03R31N56J62L36Q66
51310C37000J154J073J057J414J909K177K212K233K185J744Q23j76p04o51n01
$$ plain form
51295 352949 352067 350146 347029 343072 338596 333644 328470 323877 320568 318296 316119 313513 310882 308987
51281 308987 308324 309091 311152 313841 316320 318470 321068 324811 329515 334469 339105 343048 346152 348977 352664
51266 352664 357581 362522 366015 368144 370198 372699 374745 375384 374666 373035 370589 367525 364600 362420 360589
51251 360589 358170 354822 350959 346970 342893 338923 335723 333871 333139 332594 331515 330121 329304 329651 330909
51236 330909 332478 334105 335766 337090 337474 336874 336080 335983 336845 338323 339840 340796 340877 340519 340753 342127 343969
51219 343969 345064 344951 344209 343576 343211 342884 342530 342378 342676 343524 344931 346843 349047 351176 353001 354775
51203 354775 357133 360554 365002 370114 375450 380411 384238 386566 387849 388849 389757 390210 390113 389871 389774 389698
51187 389698 389629 389873 390462 390864 390707 390319 390144 390028 389622 389077 388734 388389 387597 386560 385910 385551 384502 382203
$$ packed form
51295C52949q82j921l117l957m476m952n174m593l309k272k177k606k631j895
51281C08987o63P67K061K689K479K150K598L743M704M954M636L943L104K825L687
51266C52664M917M941L493K129K054K501K046O39p18j631k446l064k925k180j831
51251C60589k419l348l863l989m077l970l200j852p32n45j079j394q17L47J258
51236C30909J569J627J661J324L84o00p94r7Q62J478J517R56Q1l58K34J374J842
51219C43969J095j13p42o33l65l27l54j52K98Q48J407J912K204K129J825J774
51203C54775K358L421M448N112N336M961L827K328J283J000R08M53r7k42r7p6
51187C89698o9K44N89M02j57l88j75j16m06n45l43l45p92j037o50l59j049k299
$$ plain form
51169 382203 379330 376890 374972 372949 370648 368696 367669 367395 367208 366614 365449 363667 361396 359188 357807
51154 357807 357494 357646 357563 357396 357907 359201 360236 359871 358099 355817 353661 351604 349681 348427 348305 349017
51138 349017 349751 349995 349877 349782 349903 350189 350575 351127 352002 353295 354860 356280 357075 357072 356570 356068 355835 355831 356032
51119 356032 356649 357912 359812 362247 365291 369059 373361 377792 382148 386503 390890 395142 399065 402457
51105 402457 404939 406157 406256 405839 405309 404565 403506 402412 401582 400853 399806 398319 396659 395185 394052 393006
51089 393006 391392 388730 385473 382807 381420 380827 380163 379205 378218 377347 376792 377207 379106 381959 384607 386605
51073 386605 388543 390932 393401 395285 396521 397634 399060 400772 402438 403806 405011 406524 408762 411835
51059 411835 415728 420398 425455 430193 434420 439003 444981 452244 459653 466293 471978 476738 480727 484820
$$ packed form
51169C82203k873k440j918k023k301j952j027k74j87n94j165j782k271k208j381
51154C57807l13J52q3j67N11J294J035l65j772k282k156k057j923j254j22P12
51138C49017P34K44j18r5J21K86L86N52Q75J293J565J420P95ln02n02k33mK01
51119C56032O17J263J900K435L044L768M302M431M356M355M387M252L923L392
51105D02457K482J218R9m17n30p44j059j094q30p29j047j487j660j474j133j046
51089C93006j614k662l257k666j387n93o64r58r87q71n55M15J899K853K648J998
51073C86605J938K389K469J884J236J113J426J712J666J368J205J513K238L073
51059D11835L893M670N057M738M227M583N978P263P409O640N685M760L989M093
$$ plain form
51045 484820 490416 498190 507563 517598 527812 537857 547183 555579 563513 571298 578336 583724 587268
51032 587268 589435 590657 591185 591153 590118 586771 579887 569560 557037 543523 529749 516466 504452
51019 504452 493874 484376 476074 469827 466177 464592 464267 465188 467776 471762 476142 480302 484572 489444
51005 489444 494723 499829 504636 509525 514694 519799 524344 528125 531165 533519 535322 536795 538003 538788
50991 538788 539165 539552 540401 541808 543808 546801 551220 556950 563599 571277 580573 591689 604153 617431
50977 617431 631183 644735 657030 667499 676388 683694 688404 689455 687107 682544 676365 668332 658642
50964 658642 648542 639336 631388 624581 619335 616638 617123 620534 626078 633058 641108 650016 659556 669585
50950 669585 680213 691733 704302 717813 732105 747234 763450 781086 800575 822370 846572
$$ packed form
51045D84820N596P774R373J0035J0214J0045R326Q396P934P785P038N388L544
51032E87268K167J222N28l2j035l347o884j0327j2523j3514j3774j3283j2014
51019E04452j0578r498q302o247l650j585l25R21K588L986M380M160M270M872
51005D89444N279N106M807M889N169N105M545L781L040K354J803J473J208P85
50991E38788L77L87Q49J407K000K993M419N730O649P678R296J1116J2464J3278
50977F17431J3752J3552J2295J0469Q889P306M710J051k348m563o179q033r690
50964F58642j0100r206p948o807n246k697M85L411N544O980Q050Q908R540J0029
50950F69585J0628J1520J2569J3511J4292J5129J6216J7636J9489K1795K4202
$$ plain form
50939 846572 872763 900412 929343 959468 989998 1019131 1044688 1065041 1079640 1088971 1094073 1095854
50927 1095854 1094684 1090557 1083567 1074043 1062313 1048510 1032615 1014498 994003 971290 947128 922577
50915 922577 898187 873690 848632 823143 797968 773935 751653 731562 713865 698255 683934
50904 683934 670131 656639 643736 631704 620600 610489 601634 594261 588264 583271 578933 574918 570772
50891 570772 566196 561568 557836 555584 554323 552976 550998 548783 546994 545813 544966 544292 544019 544464 545618
50876 545618 547123 548624 550020 551366 552584 553445 553893 554304 555309 557227 559773 562517 565629 569823 575329
50861 575329 581276 586670 591832 598072 605813 613881 621234 628597 637535 648433 660393 672793 685816
50848 685816 699482 713471 728218 745035 764532 785799 807802 830782 855535 882014 909488
$$ packed form
50939H46572K6191K7649K8931L0125L0530K9133K5557K0353J4599R331N102J781
50927A095854j170m127o990r524j1730j3803j5895j8117k0495k2713k4162k4551
50915I22577k4390k4497k5058k5489k5175k4033k2282k0091j7697j5610j4321
50904F83934j3803j3492j2903j2032j1104j0111q855p373n997m993m338m015m146
50891E70772m576m628l732k252j261j347j978k215j789j181q47o74k73M45J154
50876E45618J505J501J396J346J218Q61M48M11J005J918K546K744L112M194N506
50861E75329N947N394N162O240P741Q068P353P363Q938J0898J1960J2400J3023
50848F85816J3666J3989J4747J6817J9497K1267K2003K2980K4753K6479K7474
$$ plain form
50837 909488 937502 965770 993533 1020029 1045462 1070641 1095799 1120554 1144936 1169595 1194957
50826 1194957 1220957 1247781 1276200 1306966 1340359 1376449 1415244 1456473 1499648 1544365 1589968
50815 1589968 1634894 1676976 1714539 1746692 1772415 1790103 1798329 1796638 1785353 1765150 1737006 1702027
50803 1702027 1660976 1614489 1564095 1512428 1461873 1413320 1366690 1322378 1281632 1245727 1215282
50792 1215282 1190304 1170483 1155393 1144789 1138764 1137491 1140698 1147519 1156864 1167961 1180637 1195017
50780 1195017 1210716 1226395 1240407 1251886 1260922 1267688 1271916 1273339 1272089 1268336 1261923 1252691 1240799
50767 1240799 1226383 1209175 1188857 1165487 1139263 1110156 1078284 1044474 1010039 976040 943049
50756 943049 911501 881874 854543 829670 807120 786353 766746 748404 732426 719937 710939 704491
$$ packed form
50837I09488K8014K8268K7763K6496K5433K5179K5158K4755K4382K4659K5362
50826A194957K6000K6824K8419L0766L3393L6090L8795M1229M3175M4717M5603
50815A589968M4926M2082L7563L2153K5723J7688Q226j691j1285k0203k8144l4979
50803A702027m1051m6487n0394n1667n0555m8553m6630m4312m0746l5905l0445
50792A215282k4978j9821j5090j0604o025j273L207O821R345J1097J2676J4380
50780A195017J5699J5679J4012J1479R036O766M228J423j250l753o413r232j1892
50767A240799j4416j7208k0318k3370k6224k9107l1872l3810l4435l3999l2991
50756I43049l1548k9627k7331k4873k2550k0767j9607j8342j5978j2489q998o448
$$ plain form
50744 704491 699895 697247 696852 698569 701839 706109 711151 717174 724608 733635 744021 755555 768375 782547
50730 782547 797647 813243 829599 847312 866277 885664 904972 924483 944501 964682 984426
50719 984426 1003428 1021526 1038395 1053775 1067593 1079517 1088781 1095013 1099062 1102474 1106220 1110408 1115181
50706 1115181 1121356 1129989 1141654 1156287 1173474 1192692 1213557 1236053 1260366 1286263 1312682 1338064
50694 1338064 1360973 1380313 1395236 1405285 1410683 1412178 1410496 1406111 1399632 1392112 1384717 1378173 1372744
50681 1372744 1368618 1366086 1365356 1366454 1369452 1374659 1382565 1393700 1408504 1427213 1449858 1476558 1507755
50668 1507755 1543906 1584880 1629826 1677634 1727208 1777284 1826401 1873360 1917591 1958895 1997138
50657 1997138 2032383 2065002 2095220 2122665 2146761 2167478 2185304 2200438 2212438 2220858 2225998 2228918
$$ packed form
50744G04491m596k648l95J717L270M270N042O023P434R027J0386J1534J2820J4172
50730G82547J5100J5596J6356J7713J8965J9387J9308J9511K0018K0181J9744
50719I84426J9002J8098J6869J5380J3818J1924R264O232M049L412L746M188M773
50706A115181O175Q633J1665J4633J7187J9218K0865K2496K4313K5897K6419K5382
50694A338064K2909J9340J4923J0049N398J495j682m385o479p520p395o544n429
50681A372744m126k532p30J098K998N207P906J1135J4804J8709K2645K6700L1197
50668A507755L6151M0974M4946M7808M9574N0076M9117M6959M4231M1304L8243
50657A997138L5245L2619L0218K7445K4096K0717J7826J5134J2000Q420N140K920
$$ plain form
50645 2228918 2230889 2232979 2236063 2241151 2249649 2263118 2282497 2307546 2337242 2370668 2407267 2446259
50633 2446259 2486290 2525918 2564213 2600599 2634237 2663926 2688662 2708147 2722621 2732318 2737132 2736774
50621 2736774 2730985 2719325 2700722 2673550 2636583 2590006 2535557 2476030 2414979 2356605 2304997
50610 2304997 2262828 2230770 2208223 2194269 2187678 2186437 2187891 2189407 2188659 2183404 2171577 2151829 2123687
50597 2123687 2087106 2042209 1989745 1931442 1869512 1805776 1741376 1677128 1613766 1551871 1491985
50586 1491985 1434949 1381945 1333988 1291438 1254039 1221272 1192649 1167972 1147522 1131881 1121273
50575 1121273 1115111 1112333 1112152 1114368 1119107 1126480 1136398 1148387 1161488 1174564 1186781 1197721 1207192
50562 1207192 1215269 1222549 1229981 1238156 1247042 1256645 1267794 1282037 1300829 1324950 1354552 1389440
$$ packed form
50645B228918J971K090L084N088Q498J3469J9379K5049K9696L3426L6599L8992
50633B446259M0031L9628L8295L6386L3638K9689K4736J9485J4474R697M814l58
50621B736774n789j1660j8603k7172l6967m6577n4449n9527o1051n8374n1608
50610B304997m2169l2058k2547j3954o591j241J454J516p48n255j1827j9748k8142
50597B123687l6581m4897n2464n8303o1930o3736o4400o4248o3362o1895n9886
50586A491985n7036n3004m7957m2550l7399l2767k8623k4677k0450j5641j0608
50575A121273o162k778j81K216M739P373R918J1989J3101J3076J2217J0940R471
50562A207192Q077P280P432Q175Q886R603J1149J4243J8792K4121K9602L4888
$$ plain form
50550 1389440 1429215 1473317 1521060 1571740 1624782 1679712 1735815 1791838 1846393 1898862 1949757
50539 1949757 2000123 2050855 2102766 2156895 2214214 2275045 2339145 2406435 2477456 2553142 2634419
50528 2634419 2721941 2815927 2916213 3022733 3136009 3256815 3385245 3520197 3659785 3801943
50518 3801943 3944527 4085049 4220564 4347722 4462843 4562076 4641727 4698581 4730154 4734913
50508 4734913 4712548 4664023 4591246 4496614 4382866 4253409 4112800 3966691 3820932 3680563
50498 3680563 3549759 3432595 3333226 3254849 3198615 3163869 3149169 3152596 3171243 3201085 3237451
50487 3237451 3275330 3309269 3333681 3343716 3335815 3307630 3258125 3188158 3100612 2999487 2888725
50476 2888725 2771590 2650574 2527588 2404594 2284163 2168896 2060010 1957042 1859335 1767311
$$ packed form
50550A389440L9775M4102M7743N0680N3042N4930N6103N6023N4555N2469N0895
50539A949757N0366N0732N1911N4129N7319O0831O4100O7290P1021P5686Q1277
50528B634419Q7522R3986J00286J06520J13276J20806J28430J34952J39588J42158
50518C801943J42584J40522J35515J27158J15121R9233P9651N6854L1573M759
50508D734913k2365m8525p2777r4632j13748j29457j40609j46109j45759j40369
50498C680563j30804j17164r9369p8377n6234l4746j4700L427J8647K9842L6366
50487C237451L7879L3939K4412J0035p901k8185m9505o9967q7546j01125j10762
50476B888725j17135j21016j22986j22994j20431j15267j08886j02968r7707r2024
$$ plain form
50466 1767311 1681857 1603130 1530803 1465061 1406337 1354081 1306785 1263448 1224278 1189655 1159098
50455 1159098 1131741 1107305 1086041 1067987 1052693 1039544 1028051 1018016 1009609 1003025 997875 993292
50443 993292 988967 985713 984468 984967 986006 986965 988482 991558 996518 1003065 1010905 1019920 1029982 1040898
50429 1040898 1052578 1065193 1079301 1095812 1115440 1138024 1162620 1188494 1215881 1245598 1278199
50418 1278199 1313753 1352254 1393858 1438858 1487765 1541287 1599837 1663118 1730600 1802300 1878547
50407 1878547 1958859 2041660 2125466 2209865 2294964 2380252 2464420 2545850 2622657 2692515 2753222
50396 2753222 2803473 2842426 2868419 2878830 2871583 2846398 2804431 2747349 2677240 2596891 2509419
50385 2509419 2417720 2324764 2234105 2149375 2073158 2006762 1951004 1906597 1873688 1851710 1839985
$$ packed form
50466A767311q5454p8727p2327o5742n8724n2256m7296m3337l9170l4623l0557
50455A159098k7357k4436k1264j8054j5294j3149j1493j0035q407o584n150m583
50443I93292m325l254j245M99J039R59J517L076M960O547P840R015J0062J0916
50429A040898J1680J2615J4108J6511J9628K2584K4596K5874K7387K9717L2601
50418A278199L5554L8501M1604M5000M8907N3522N8550O3281O7482P1700P6247
50407A878547Q0312Q2801Q3806Q4399Q5099Q5288Q4168Q1430P6807O9858O0707
50396B753222N0251L8953K5993J0411p247k5185m1967n7082p0109q0349q7472
50385B509419r1699r2956r0659q4730p6217o6396n5758m4407l2909k1978j1725
$$ plain form
50374 1839985 1837882 1843929 1855213 1868315 1880647 1890409 1895499 1893326 1882004 1861257 1831794 1794146
50362 1794146 1748495 1695588 1637410 1576770 1516187 1457061 1399730 1344161 1290544 1239333 1190982
50351 1190982 1145861 1104262 1066216 1031340 999153 969616 942986 919104 897198 876689 857797
50340 857797 840967 825991 812181 799271 787528 776955 766970 757080 747393 738147 729179 720271 711734
50327 711734 704144 697620 691834 686608 682089 678285 674908 671850 669476 668220 668091 668852 670481 673139 676710
50312 676710 680639 684445 688376 693440 700651 710106 720829 731647 742235 753221 765307 778508 792345
50299 792345 806577 821434 837097 853181 868952 884066 898942 914265 930064 945389 958942
50288 958942 969893 978008 983094 984758 982971 978807 974251 970961 969186 967956 966227 963507 959256 952178
$$ packed form
50374A839985k103O047J1284J3102J2332R762N090k173j1322k0747k9463l7648
50362A794146m5651n2907n8178o0640o0583n9126n7331n5569n3617n1211m8351
50351A190982m5121m1599l8046l4876l2187k9537k6630k3882k1906k0509j8892
50340H57797j6830j4976j3810j2910j1743j0573r985r890r687r246q968q908q537
50327G11734p590o524n786n226m519l804l377l058k374j256j29P61J629K658L571
50312F76710L929L806L931N064P211R455J0723J0818J0588J0986J2086J3201J3837
50299G92345J4232J4857J5663J6084J5771J5114J4876J5323J5799J5325J3553
50288I58942J0951Q115N086J664j787m164m556l290j775j230j729k720m251p078
$$ plain form
50274 952178 940825 925111 906826 888390 871324 856092 842948 832361 824652 819689 817032 816094
50262 816094 816182 816696 817381 818180 818940 819569 820426 822077 824633 827738 831251 835405 840035 844272 847426 849785
50246 849785 852072 854430 856391 857576 857872 857123 855286 852835 850488 848403 846085 843158 839825 836520 833524
50231 833524 831034 829166 827753 826472 825312 824507 823997 823477 823236 824335 827481 832152 837356 843005 849889
50216 849889 858462 868320 878994 890744 904297 920181 938618 959984 985084 1014833 1049639 1089168
50204 1089168 1132872 1180721 1233046 1289348 1347599 1405113 1459959 1511123 1557623 1598414 1633397
50193 1633397 1663750 1690613 1713801 1732247 1745348 1753203 1755560 1751083 1737908 1714684 1681118 1637869
50181 1637869 1586220 1527855 1464851 1399759 1335298 1273604 1215851 1162824 1115672 1075637 1043004
$$ packed form
50274I52178j1353j5714j8285j8436j7066j5232j3144j0587p709m963k657r38
50262H16094Q8N14O85P99P60O29Q57J651K556L105L513M154M630M237L154K359
50246H49785K287K358J961J185K96p49j837k451k347k085k318k927l333l305k996
50231H33524k490j868j413j281j160q05n10n20k41J099L146M671N204N649O884
50216H49889Q573R858J0674J1750J3553J5884J8437K1366K5100K9749L4806L9529
50204A089168M3704M7849N2325N6302N8251N7514N4846N1164M6500M0791L4983
50193A633397L0353K6863K3188J8446J3101P855K357m477j3175k3224l3566m3249
50181A637869n1649n8365o3004o5092o4461o1694n7753n3027m7152m0035l2633
$$ plain form
50170 1043004 1016768 995537 978429 964837 953674 943298 932223 919677 905520 889913 873245
50159 873245 856270 840181 826328 815648 808194 803223 799824 797484 796112 795668 795871 796254 796410 796151
50145 796151 795390 793902 791343 787626 783127 778303 773161 767369 760938 754493 748805 744275 740984 738975
50131 738975 738263 738797 740604 743798 748209 753235 758249 763008 767474 771475 774859 777784 780522 783122 785609
50116 785609 788271 791328 794494 797460 800732 805306 811479 818721 826887 836692 848459 861192 873765
50103 873765 886579 901053 917664 935540 954092 974099 996708 1022295 1050986 1083738 1121965
50092 1121965 1166319 1216699 1273503 1338071 1411529 1493744 1583813 1681017 1784559 1892472 2001490
50081 2001490 2108284 2210624 2307320 2397540 2480702 2556873 2626741 2690821 2748624 2798584 2838650
$$ packed form
50170A043004k6236k1231j7108j3592j1163j0376j1075j2546j4157j5607j6668
50159H73245j6975j6089j3853j0680p454m971l399k340j372m44K03L83J56k59
50145G96151p61j488k559l717m499m824n142n792o431o445n688m530l291k009
50131G38975p12N34J807L194M411N026N014M759M466M001L384K925K738K600K487
50116G85609K662L057L166K966L272M574O173P242Q166R805J1767J2733J2573
50103H73765J2814J4474J6611J7876J8552K0007K2609K5587K8691L2752L8227
50092A121965M4354N0380N6804O4568P3458Q2215R0069R7204J03542J07913J09018
50081B001490J06794J02340R6696R0220Q3162P6171O9868O4080N7803M9960M0066
$$ plain form
50070 2838650 2866849 2881359 2880362 2862113 2825394 2770151 2697875 2611391 2514041 2408847 2298392
50059 2298392 2185406 2073028 1964001 1859658 1760280 1666641 1580708 1504300 1437407 1378424
50049 1378424 1325886 1279379 1238798 1203501 1172490 1144889 1119849 1096518 1074605 1054708 1037544
50038 1037544 1023018 1010408 999321 990030 982934 978108 975267 973830 973044 972477 972364 973142 974620 976032
50024 976032 976897 977417 977902 978210 978020 977378 976669 976106 975339 973510 969801 964181 957611 951167 944851 937573
50008 937573 928391 917557 906215 895429 885672 876955 869107 862036 855947 851328 848705 848478 850901 855901
49994 855901 862831 870728 878992 887598 896529 905297 913241 920023 925594 929909 932934 934785 935599 935393 934252
49979 934252 932512 930625 929108 928839 931079 936816 946309 959688 977879 1002464 1034579 1074258 1120810
$$ packed form
50070B838650K8199J4510r97j8249l6719n5243p2276q6484r7350j05194j10455
50059B298392j12986j12378j09027j04343r9378r3639q5933p6408o6893n8983
50049A378424n2538m6507m0581l5297l1011k7601k5040k3331k1913j9897j7164
50038A037544j4526j2610j1087r291p096m826k841j437p86n67j13P78J478J412
50024I76032Q65N20M85L08j90o42p09n63p67j829l709n620o570o444o316p278
50008I37573r182j0834j1342j0786r757q717p848p071o089m619k623k27K423N000
49994H55901O930P897Q264Q606Q931Q768P944O782N571M315L025J851Q14k06j141
49979I34252j740j887j517k69K240N737R493J3379J8191K4585L2115L9679M6552
$$ plain form
49966 1120810 1173424 1231325 1293687 1359526 1427424 1495285 1560733 1622076 1678838 1731272 1779598
49955 1779598 1823890 1864465 1901955 1936802 1968640 1996078 2016903 2028526 2028567 2015448 1988712 1948880
49943 1948880 1897066 1834777 1764018 1687364 1607731 1527921 1450266 1376353 1306874 1241823 1180964
49932 1180964 1124031 1070514 1019687 971380 926534 886466 851555 821043 794017 770014 748702
49921 748702 729805 713602 700776 691294 684030 678052 673651 671461 671055 671271 671582 672247 673280 674288
49907 674288 675396 677492 681299 686911 694366 703888 715217 727447 740121 753929 769656 786752 803535
49894 803535 818632 831713 842908 852047 858603 862054 862120 858747 852002 842046 829245 814204 797466
49881 797466 779255 759815 739925 720658 702487 685085 668209 652357 638195 625741 614564
$$ packed form
49966A120810N2614N7901O2362O5839O7898O7861O5448O1343N6762N2434M8326
49955A779598M4292M0575L7490L4847L1838K7438K0825J1623M1j3119k6736l9832
49943A948880n1814o2289p0759p6654p9633p9810p7655p3913o9479o5051o0859
49932A180964n6933n3517n0827m8307m4846m0068l4911l0512k7026k4003k1312
49921G48702j8897j6203j2826r482p264n978m401k190m06K16L11O65J033J008
49907F74288J108K096L807N612P455R522J1329J2230J2674J3808J5727J7096J6783
49894H03535J5097J3081J1195R139O556L451O6l373o745r956j2801j5041j6738
49881G97466j8211j9440j9890j9267j8171j7402j6876j5852j4162j2454j1177
$$ plain form
49870 614564 604591 596182 589542 584476 580695 577939 575923 574611 574582 576656 580946 586661 593033 600159 608671
49855 608671 618874 630510 643300 657340 672870 689817 707595 725230 741604 755749 767163
49844 767163 775907 782337 786719 789145 789787 788911 786387 781349 772788 760688 746397 731740 717901 705221
49830 705221 693727 683399 674005 665123 656601 648914 642910 639225 637992 638995 641936 646484 652183 658596
49816 658596 665740 674265 684933 697813 712144 726993 741806 756178 769461 780988 790579 798400
49804 798400 804272 807560 807922 805818 801923 796242 788251 777921 766143 753958 741652 728994 716143
49791 716143 703871 692774 682652 672941 663540 654923 647536 641459 636620 633039 630647 629134 628174 627659
49777 627659 627564 627692 627777 627835 628267 629630 632435 637065 643590 651584 660362 669632 679767 691225 703657
$$ packed form
49870F14564r973q409o640n066l781k756k016j312k9K074M290N715O372P126Q512
49855F08671J0203J1636J2790J4040J5530J6947J7778J7635J6374J4145J1414
49844G67163Q744O430M382K426O42q76k524n038q561j2100j4291j4657j3839j2680
49830G05221j1494j0328r394q882q522p687o004l685j233J003K941M548N699O413
49816F58596P144Q525J0668J2880J4331J4849J4813J4372J3283J1527R591P821
49804G98400N872L288L62k104l895n681p991j0330j1778j2185j2306j2658j2851
49791G16143j2272j1097j0122r711r401q617p387o077m839l581k392j513r60n15
49777F27659r5J28Q5N8M32J363K805M630O525P994Q778R270J0135J1458J2432
$$ plain form
49762 703657 715814 726385 734817 741287 746161 749731 752308 754137 754983 753966 750009 742548 731927 719239
49748 719239 705672 691753 677191 661761 646313 632478 621179 611899 603767 596920 592130 589407
$$ packed form
49762G03657J2157J0571Q432O470M874L570K577J829Q46j017l957p461j0621j2688
49748G19239j3567j3919j4562j5430j5448j3835j1299r280q132o847m790k723
$$ [...]
##END NTUPLES=NMR SPECTRUM
##END=
