
##TITLE=UV1228_M7_1357-1247_5_7230771_NkS6smYVZU
##JCAMPDX= 6.0         $$ Bruker NMR JCAMP-DX V2.0
##DATA TYPE= NMR SPECTRUM
##DATA CLASS= NTUPLES
##ORIGIN= BRUKER
##OWNER= Administrator
$$ 1.72 TOPSPIN		Version 2.1
$$ 2013-01-17 19:13:25.817 -0500  Administrator@X
$$ Compression mode = diff/dup
##.OBSERVE FREQUENCY= 400.02188249412
##.OBSERVE NUCLEUS= ^1H
##.ACQUISITION MODE= SIMULTANEOUS (DQD)
##.ACQUISITION SCHEME= undefined
##.AVERAGES= 8
##.DIGITISER RES= 22
##SPECTROMETER/DATA SYSTEM= spect
##.PULSE SEQUENCE= zg30
##.SOLVENT NAME= COFFEE_meoh
##.SHIFT REFERENCE= INTERNAL, COFFEE_meoh, 1, 14.98509
##AUDIT TRAIL= $$ (NUMBER, WHEN, WHO, WHERE, PROCESS, VERSION, WHAT)
$$ ##TITLE= Audit trail, TOPSPIN		Version 2.1
$$ ##JCAMPDX= 5.01
$$ ##ORIGIN= Bruker BioSpin GmbH
$$ ##OWNER= Administrator
$$ $$ E:\/data/COFFEE/nmr/UV1228_M7_1357-1247_5_7230771_NkS6smYVZU/20/pdata/1/auditp.txt
$$ ##AUDIT TRAIL=  $$ (NUMBER, WHEN, WHO, WHERE, PROCESS, VERSION, WHAT)
(   1,<2013-01-17 19:13:18.130 -0500>,<Administrator>,<X>,<go>,<TOPSPIN 2.1>,
      <created by zg
	started at 2013-01-17 19:12:12.161 -0500,
	POWCHK enabled, PULCHK disabled,
       configuration hash MD5:
       86 BA 57 50 F2 9D 5C 9B 26 00 A9 28 5F 66 2E 89
       data hash MD5: 64K
       9C 48 69 04 C4 7D 69 AA DA 8A D2 E8 2D 34 12 94>)
(   2,<2013-01-17 19:13:21.176 -0500>,<Administrator>,<X>,<proc1d>,<TOPSPIN 2.1>,
      <Start of raw data processing
       efp LB = 0 FT_mod = 6 PKNL = 1 PHC0 = 0 PHC1 = 0 SI = 32K 
       data hash MD5: 32K
       65 13 27 9E D1 66 50 11 5D FA 23 B5 73 F4 63 1F>)
(   3,<2013-01-17 19:13:21.630 -0500>,<Administrator>,<X>,<proc1d>,<TOPSPIN 2.1>,
      <pk PHC0 = 96.10291 PHC1 = 0 
       data hash MD5: 32K
       2B 92 F2 0A A1 E7 2D E1 D9 A7 79 F8 90 BF EA D8>)
(   4,<2013-01-17 19:13:21.833 -0500>,<Administrator>,<X>,<proc1d>,<TOPSPIN 2.1>,
      <abs ABSG = 1 
       data hash MD5: 32K
       EB 73 AE 4C 97 10 02 16 63 FB E2 C0 5D F4 27 F4>)
(   5,<2013-01-17 19:13:21.973 -0500>,<Administrator>,<X>,<proc1d>,<TOPSPIN 2.1>,
      <abs ABSG = 2 
       data hash MD5: 32K
       3E 02 6C 52 EA F9 2C 85 4A C7 01 07 2A 1F E3 1F>)
(   6,<2013-01-17 19:13:22.130 -0500>,<Administrator>,<X>,<proc1d>,<TOPSPIN 2.1>,
      <abs ABSG = 3 
       data hash MD5: 32K
       81 61 69 5D 36 9D B4 A0 96 EC 11 4E 02 95 58 73>)
(   7,<2013-01-17 19:13:22.270 -0500>,<Administrator>,<X>,<proc1d>,<TOPSPIN 2.1>,
      <abs ABSG = 4 
       data hash MD5: 32K
       5C 69 9F 91 C4 3F DD 65 42 60 ED 48 99 51 3F AD>)
(   8,<2013-01-17 19:13:22.411 -0500>,<Administrator>,<X>,<proc1d>,<TOPSPIN 2.1>,
      <abs ABSG = 5 
       data hash MD5: 32K
       72 54 91 3C 4E 9B B6 D7 0C A4 46 40 AD 62 EA D5>)
$$ ##END=
$$ 
$$ $$ hash MD5
$$ $$ 97 04 86 92 06 1F 27 2F 61 72 31 F7 98 67 D2 C6
##$RELAX= 
##$RELAX= 
##$RELAX= 
##$RELAX= 
##$RELAX= 
##$RELAX= 
##$RELAX= 
$$ Bruker specific parameters
$$ --------------------------
##$DU= <E:\>
##$EXPNO= 20
$$ [...]
##$TP= (0..7)
150 150 150 150 150 150 150 150
##$TP07= 0
##$TPNAME0= <>
##$TPNAME1= <>
##$TPNAME2= <>
##$TPNAME3= <>
##$TPNAME4= <>
##$TPNAME5= <>
##$TPNAME6= <>
##$TPNAME7= <>
##$TPOAL= (0..7)
0.5 0.5 0.5 0.5 0.5 0.5 0.5 0.5
##$TPOFFS= (0..7)
0 0 0 0 0 0 0 0
##$TUNHIN= 0
##$TUNHOUT= 0
##$TUNXOUT= 0
##$USERA1= <user>
##$USERA2= <user>
##$USERA3= <user>
##$USERA4= <user>
##$USERA5= <user>
##$V9= 5
##$VALIST= <valist>
##$VCLIST= <CCCCCCCCCCCCCCC>
##$VD= 0
##$VDLIST= <DDDDDDDDDDDDDDD>
##$VPLIST= <PPPPPPPPPPPPPPP>
##$VTLIST= <TTTTTTTTTTTTTTT>
##$WBST= 1024
##$WBSW= 4
##$XGAIN= (0..3)
0 0 0 0
##$XL= 0
##$YL= 0
##$YMAX_a= 633760
##$YMIN_a= -539380
##$ZGOPTNS= <>
##$ZL1= 120
##$ZL2= 120
##$ZL3= 120
##$ZL4= 120
##$ABSF1= 14.98509
##$ABSF2= -5.573092
##$ABSG= 5
##$ABSL= 3
##$ALPHA= 0
##$AQORDER= 0
##$ASSFAC= 0
##$ASSFACI= 0
##$ASSFACX= 0
##$ASSWID= 0
##$AUNMP= <proc_prof1d_extract_pilot.lims>
##$AXLEFT= 0
##$AXNAME= <>
##$AXNUC= <1H>
##$AXRIGHT= 0
##$AXTYPE= 0
##$AXUNIT= <>
##$AZFE= 0.1
##$AZFW= 0.1
##$BCFW= 0
##$BC_mod= 0
##$BYTORDP= 0
##$COROFFS= 0
##$CY= 15
##$DATMOD= 1
##$DC= 0
##$DFILT= <>
##$DTYPP= 0
##$F1P= 0
##$F2P= 0
##$FCOR= 0.5
##$FTSIZE= 32768
##$FT_mod= 6
##$GAMMA= 0
##$GB= 0
##$INTBC= 1
##$INTSCL= 1
##$ISEN= 128
##$LB= 0
##$LEV0= 0
##$LPBIN= 0
##$MAXI= 10000
##$MC2= 0
##$MEAN= 0
##$ME_mod= 0
##$MI= 0
##$NCOEF= 0
##$NC_proc= -8
##$NLEV= 6
##$NOISF1= 0
##$NOISF2= 0
##$NSP= 0
##$NTH_PI= 0
##$NZP= 0
##$OFFSET= 14.98509
##$PC= 1
##$PHC0= 96.10291
##$PHC1= 0
##$PH_mod= 1
##$PKNL= yes
##$PPARMOD= 0
##$PPDIAG= 0
##$PPIPTYP= 0
##$PPMPNUM= 2147483647
##$PPRESOL= 1
##$PSCAL= 4
##$PSIGN= 0
##$PYNMP= <proc.py>
##$REVERSE= no
##$SF= 400.02
##$SI= 32768
##$SIGF1= 0
##$SIGF2= 0
##$SINO= 400
##$SIOLD= 32768
##$SPECTYP= <>
##$SREGLST= <1H.CDCl3>
##$SSB= 0
##$STSI= 32768
##$STSR= 0
##$SW_p= 8223.68421052631
##$SYMM= 0
##$S_DEV= 0
##$TDeff= 65536
##$TDoff= 0
##$TI= <>
##$TILT= no
##$TM1= 0
##$TM2= 0
##$TOPLEV= 0
##$USERP1= <user>
##$USERP2= <user>
##$USERP3= <user>
##$USERP4= <user>
##$USERP5= <user>
##$WDW= 1
##$XDIM= 32768
##$YMAX_p= 469564482
##$YMIN_p= -685230
##$CURPLOT= <Network HP LaserJet P1505>
##$CURPRIN= <$Network HP LaserJet P1505>
##$DFORMAT= <normdp>
##$LAYOUT= <+/1D_H.xwp>
##$LFORMAT= <normlp>
##$PFORMAT= <normpl>
##$SURQMSG= 1
$$ End of Bruker specific parameters
$$ ---------------------------------
##NTUPLES= NMR SPECTRUM
##VAR_NAME=  FREQUENCY,     SPECTRUM/REAL,   SPECTRUM/IMAG
##SYMBOL=    X,             R,               I
##VAR_TYPE=  INDEPENDENT,   DEPENDENT,       DEPENDENT
##VAR_FORM=  AFFN,          ASDF,            ASDF
##VAR_DIM=   32768,         32768,           32768
##UNITS=     HZ,            ARBITRARY UNITS, ARBITRARY UNITS
##FACTOR=    0.250966925370066, 1,           1
##FIRST=     8223.43324360094, 57264,        -27158
##LAST=      0,             -219126,         122128
##MIN=       0,             -685230,         0
##MAX=       8223.43324360094, 469564482,    0
$$ Real data points
##PAGE= N=1
##DATA TABLE= (X++(R..R)), XYDATA
$$ [...]
19546D9934K23550D1286a30878C3617R5639L10089A759c3147q4980a6646A52123
19534D32821d59407a85742A53404a44020j5062B76122A6221b89422F1285K3859
19524H5144O4279F2430a83008B30420f5792q325m8668e3607k33950J27896J7699
19513a41962j15339H9551J16552i9200r1308A34553Q6153K9482A01592a63222
19502b86657a5780G8332a36749k9460A21857a47973r3044P6161A55446J20102
19492B75548j17218p6958K2539P632A4794P2702c474H0064a36587L6748C5820
19480i07l1433c203A2264b21058c6388j70241a4167j95522h9291k46023J16440
19469b18874b3795k38049a19190L905B07714e7956A16323a1930l29270B6193b20443
$$ y = [49934, 273484, 41286, -130878, 33617, 129256, 439345, 1759, -33147, -118127, -16646, 152123, 432821, -459407, -185742, 153404, -144020, -159082, 276122, 16221, -289422, 61285, 85144, 149423, 62430, -183008, 230420, -65792, -74117, -122785, -53607, -287557, -159661, -141962, -257301, 89551, 206103, -99200, -190508, 134553, 220706, 250188, 101592, -163222, -286657, -15780, 78332, -136749, -166209, 121857, -147973, -241017, -164856, 155446, 275548, 158330, 81372, 103911, 111543, 14794, 87496, -3474, 80064, -136587, -99839, 35820, -907, -32340, -3203, 12264, -221058, -36388, -206629, -14167, -209689, -89291, -335314, -218874, -23795, -261844, -119190, -115285, 207714, -57956, 116323, -11930, -341200, 26193, -220443]
19457E921b5882C56948A16762i0333I1702i2540I1846l1537b35330d4565q1517
19446a26082n5791h028F6275j2150a26143e2164I7183K0760C2375J95957b0708
19434A10677d53177a92394K0494a1572j1351I4925a48900J1258k64783a34001
19423c00051P8238M2845H1170j458J01340H8958F388h7554J4440j35483L9639
19412a68958H0636a38020G3027K2843b5839k7380q0455j09937a7246p3678A09281
19400C20943A58197C794a87156O5524j34920a02331j15534A27312D3772J855J29278
19389A74905A6466J46808F059O806K0234c97011a48593j02138a02145F4392E881
19377c53841C40143b09253p4103C4831R6083a14445B26632f5736a8385j67611
$$ y = [5921, -25882, 356948, 116762, -90333, 91702, -92540, 91846, 60309, -235330, -44565, -126082, -181873, -8028, 66275, 54125, -126143, -52164, 97183, 117943, 32375, 228332, -20708, 110677, -453177, -192394, -171900, -11572, -22923, 94925, -148900, -137642, -402425, -134001, -300051, -221813, -178968, 81170, 79712, 181052, 88958, 6388, -87554, -73114, -208597, -168958, 80636, -138020, 73027, 95870, -25839, -53219, -133674, -243611, -17246, -90924, 109281, 320943, 158197, 3794, -187156, -121632, -256552, -102331, -217865, 127312, 43772, 45627, 174905, 16466, 163274, 6059, 12865, 33099, -397011, -148593, -250731, -102145, 64392, 5881, -353841, 340143, -209253, -283356, 34831, 130914, -114445, 226632, -65736, -18385, -185996]
19367a85996L7802E4912b34253j400A59663D1917a0587j85588O1252A45385B9323
19355A53410l358b77880J7965J28359l9719A85475R3246i5933B3603N40721A6334
19343c5459B69515A6616d4960K1620B8811A1241c51843a06346F3083a93903k7008
19332b20911E4107a12996k12359J24921p9532B38556A7584h7330G1457b22496
19321F6516a39330A03496B2408b09853B910P8303i2708p9767m20297A73449d03066
19309A63019o1339a42491A31351a0902p4002I4195c94699a17395e7556a2374p3536
19298h5910l5192C3319K32919L5401a0763n712o4169b3364k05874B12672a59944
19286a43207A7384N3724g4818k83983K0139E5961J17169a91242B3273a71952k51857
$$ y = [-185996, -148194, 54912, -234253, -235653, 159663, 41917, -10587, -196175, -134923, 145385, 29323, 153410, 150052, -277880, -259915, -131556, -171275, 185475, 278721, -95933, 23603, 564324, 16334, -35459, 269515, 16616, -44960, -23340, 28811, 11241, -351843, -106346, 63083, -193903, -220911, 54107, -112996, -325355, -200434, -279966, 238556, 17584, -87330, 71457, -222496, 66516, -139330, 103496, 22408, -209853, 2910, 81213, -92708, -172475, -592772, 173449, -403066, 163019, 101680, -142491, 131351, -10902, -84904, 94195, -394699, -117395, -57556, -12374, -85910, -121102, 33319, 266238, 301639, -10763, -16475, -80644, -23364, -229238, 212672, -159944, -143207, 17384, 71108, -74818, -358801, -338662, 55961, 173130, -191242, 23273, -171952, -423809]
19275d23809J06554C6071b5732n2924B2792Q4007g0805a4891l29400R1249O0853
19264a92189a0619q7522B20400n5442b27855N1256j06908A95732b40790A4067
19253b03845A49772A7377J16029g3991k56277G9498K79473F1200a44211C81131
19242b14281C8480c08457d4558j85619f7158m723l36360a61817b294D1136N9824
19231A00960i9352J6716C4494e443j9648A00530a10270H0733P5550D4957a41548
19219c8858j49809A3085K63801b36576L0708A90814m7696D4538c74688f6244A51927
19207A8984Q2242b31158C20354F7385J17882M8186q8689p661B2088L21622a94691
19195e3334B94549A43457b0775j79102P8305A80533c32512c1296n2353j88243
$$ y = [-423809, -317255, 36071, -25732, -78656, 22792, 106799, -70805, -14891, -344291, -253042, -192189, -10619, -98141, 220400, 164958, -227855, -176599, -283507, 195732, -240790, 14067, -203845, 149772, 17377, 133406, -73991, -330268, 79498, 358971, 61200, -144211, 381131, -214281, 38480, -308457, -44558, -230177, -67158, -71881, -408241, -161817, -2294, 41136, 100960, -99352, -82636, 34494, -5443, -25091, 100530, -110270, 80733, 156283, 44957, -141548, -38858, -188667, 13085, 276886, -236576, -205868, 190814, 143118, 44538, -374688, -66244, 151927, 18984, 101226, -231158, 320354, 67385, 185267, 233453, 144764, 137103, 22088, 343710, -194691, -53334, 294549, 143457, -20775, -199877, -121572, 180533, -332512, -31296, -83649, -271892]
19185b71892F2399K1582N512i7053j00140j50277J44871i4903j67904Q1174D71798
19173A11346d7275E3781b6026A18988M3075b23412h383k22761B41802G022a5795
19161a63083j09115G3467b0962l97983c0987j31010E9665h1833j56262a8385j7723
19150c6108C6128J11839b3896j4401j97810A64847b03518E906Q4007n355L7536
19139A22094a9064o7778j25486c6420k42777Q2089J8750l3893A53514c10386E0142
19127b44181R7963B7834a7739B3899L58751c9235k02751g2922B20435a63305N3956
19116a09349j34894j9652P0416p1722B71230A13037a5678A98418i2659L7095B26359
19104D1888b27964D3387b44149p1287B54526f4233D2778a7340j8531j81641m2756
$$ y = [-271892, 62399, 83981, 89493, -97053, -197193, -347470, -202599, -94903, -262807, -181633, 471798, 111346, -47275, 53781, -26026, 118988, 162063, -223412, -8383, -231144, 241802, 7022, -15795, -163083, -272198, 73467, -20962, -418945, -30987, -161997, 59665, -81833, -238095, -18385, -36108, 36128, 147967, -23896, -38297, -236107, 164847, -203518, 5906, 89913, 84558, 122094, -19064, -86842, -212328, -36420, -279197, -197108, -178358, -212251, 153514, -310386, 50142, -244181, -146218, 27834, -17739, 23899, 382650, -39235, -241986, -72922, 220435, -163305, -109349, -244243, -263895, -193479, -265201, 271230, 113037, -15678, 198418, -92659, -55564, 226359, 41888, -227964, 43387, -244149, -315436, 254526, -64233, 42778, -17340, -35871, -217512, -260268]
19093b60268G7155f3462E6599b05032g1998b1214D0980o586O7583i3035J9125
19082g3910b5020E8468a25788C31623b68075B82042b10345B1434b59180B30353
19071a90916g8219q3012B78245G4001g8899m83361g2206j21103d3099A92627i5027
19059H9990a4787r0401C86453a43623B6199J87380a79510A45170g2759A53759
19048b40710C0128J317i6071F2926G584a29333d5291G4495K43985A18922b6822
19036e1299o1874d9249b4003A28440h1543A09911H849i526F0912J7300J46276
19025B24488A9053k63a38133f1059C65225J01784b25519C69677C2984a812l92618
19014c94430C8370R1611K00261j29312a6710C6649d5350K1631j2604l83483a34106
$$ y = [-260268, 77155, -63462, 56599, -205032, -71998, -21214, 40980, 34394, 101977, -93035, -73910, -25020, 58468, -125788, 331623, -268075, 282042, -210345, 21434, -259180, 230353, -190916, -78219, -161231, 278245, 74001, -78899, -562260, -72206, -193309, -43099, 192627, -95027, 89990, -14787, -105188, 386453, -143623, 26199, 213579, -179510, 145170, -72759, 153759, -240710, 30128, 31445, -96071, 62926, 7584, -129333, -45291, 74495, 318480, 118922, -26822, -51299, -113173, -49249, -24003, 128440, -81543, 109911, 8849, -9526, 60912, 78212, 224488, 19053, 18790, -138133, -61059, 365225, 467009, -225519, 369677, 32984, -1812, -394430, 38370, 129981, 330242, 200930, -16710, 36649, -45350, -23719, -36323, -419806, -134106]
19002A98220b14k3504l1739q3142A85670b0015A65782J0266g7940D7136M6105
18991I3241g2619k14897l0810P0012b2257k03329n8001I6572D3075a87120O164
18980a80956G0288J96109c7036j18840B7420d067j4051B21171H2169c262I4033
18968a69519m4025A10882b70266A85541e8025A20761a48754C6438M2072b96912
18957A25840c8129k44765J19264A36782b7317E7934b9955C961i1025A35849c71949
18945D23572a45892L2934q6699B01251c35621n1895a1391c343k88795A13986a95452
18933B13626g2005l85864a00956M3397k7358A5062L1434d3037B66436A11354f4970
18921h1807j08717E9289E150a17375b049l3635k87023A38195e6181j81115B8513
$$ y = [198220, -214, -23718, -55457, -138599, 185670, -20015, 165782, 176048, -77940, 47136, 93241, -72619, -287516, -318326, -248314, -22257, -225586, -283587, 96572, 43075, -187120, -180956, 70288, 266397, -37036, -155876, 27420, -4067, -18118, 221171, 82169, -3262, 94033, -169519, -213544, 110882, -270266, 185541, -58025, 120761, -148754, 36438, 78510, -296912, 125840, -38129, -282894, -163630, 136782, -27317, 57934, -29955, 3961, -91025, 135849, -371949, 423572, -145892, -112958, -199657, 201251, -335621, -387516, -11391, -3343, -292138, 113986, -195452, 213626, -72005, -457869, -100956, -57559, -84917, 15062, 46496, -43037, 266436, 111354, -64970, -81807, -190524, 59289, 5150, -117375, -2049, -35684, -322707, 138195, -56181, -237296, 28513]
18909b65344c9598l19726F9375J29249e6356L686n4106A47261g5730G3299N812
18898G9111a6348j23593j75048C23876c9221j08993b019A28521c2253k11815d3240
18886c66073I6454a35635A97395b19241D555a27352A37048b36814C00417b4165
18875B38295f1679A79317e8867B84716j00283f9077A17710c9389A3724a24214
18864d15816J19001a22623B10256a58799C12844a62462n0085d1636j29189L9582
18854a31243k631D62947I8442a83544b780k67515C9839a17891j09070G5073i5988
18842A55274a82644G2616a17836A77839i7751C9292J0634e7790C7288g4492I6154
18830a77062B54104b50309K8534b1872k32287N1125O2708j97524A3336K10755
$$ y = [-265344, -39598, -359324, 69375, 198624, -56356, -52670, -106776, 147261, -75730, 73299, 79111, -16348, -139941, -314989, 323876, -39221, -148214, -2019, 128521, -32253, -244068, -43240, -366073, 96454, -135635, 197395, -219241, 4555, -127352, 137048, -236814, 300417, -24165, 238295, -61679, 179317, -58867, 284716, 184433, -69077, 117710, -39389, 13724, -124214, -415816, -296815, -122623, 210256, -158799, 312844, -162462, -212547, -41636, -170825, -131243, -133874, 462947, 98442, -183544, -2780, -270295, 39839, -117891, -226961, 75073, -95988, 155274, -182644, 72616, -117836, 177839, -97751, 39292, 49926, -57790, 37288, -74492, 96154, -177062, 254104, -250309, -221775, -21872, -254159, -203034, -140326, -337850, 13336, 224091]
18820B24091J58353e8334D3958P7569h9422c510j41311C5999a93652C2894J68567
18809B01461c5309C1292K31145O2878j05336B7078P5987a00908c4402i903B36641
18797E5020K0540b87111J23523H2461a31284o3368A99056q2565b72993g4833j30225
18786b05058M6915O5012b8353k11597G9232a37929r2695J0418F8369B4063J66492
18775A90555F2355b56916N9244J364A77051G6793i4314r9805R0502k83132J39333
18764b47416A26076i5568B00685E8362a42979j4785k6160K6193j01142P2607q472
18753a94738F9103a54353d9520j92734M6214A19949a0468k19286c4536k20656
18743b55192b3006j68939N2268q8625R4873B19286c13696C19781F8088B3015N8473
$$ y = [224091, 382444, -58334, 43958, 121527, -89422, -3510, -144821, 35999, -193652, 32894, 201461, -35309, 31292, 262437, 325315, 219979, 27078, 103065, -100908, -34402, -9903, 236641, 55020, 75560, -287111, -163588, 82461, -131284, -194652, 199056, 116491, -272993, -74833, -205058, -158143, -93131, -28353, -239950, 79232, -137929, -230624, -220206, 68369, 24063, 190555, 62355, -256916, -197672, -196308, 177051, 76793, -94314, -194119, -103617, -386749, -247416, 126076, -95568, 200685, 58362, -142979, -157764, -183924, -157731, -258873, -186266, -194738, 69103, -154353, -49520, -242254, -196040, 119949, -10468, -229754, -34536, -255192, -23006, -191945, -139677, -228302, -133429, 219286, -313696, 319781, 68088, 23015, 81488]
18732H1488c97223b2884o5769E9296J30169b77452F8901c25669j9718L7143F0637
18720a81754P0627p329l112c0640m1498J5291A10011L066g432p7846q8452g1035
18707C6855L49062A912f0946b7418r6414g277j47800A84199h3739o3642b6667
18695a52191g2128J2186r4449B55605b42474A63962i0302j44890I4139b82726
18684a73935J5381o698A57947K4703l6591e4378n45921B17247I028O0752k8454
18673D1326b26308O8610p2010c0918B25623b52148A60125c2155q3538k250A66032
18661H298c36991B2469c42356A23819d8125o9662A85956a60997B88524B7978g5013
18649A15854h2442j67585o0765B83149F8533a17835A11608b922j79957j51328
$$ y = [81488, -397223, -22884, -88653, 59296, 189465, -277452, 68901, -325669, -345387, -308244, 60637, -181754, -111127, -118456, -121568, -30640, -72138, -56847, 110011, 113077, -7432, -85278, -173730, -71035, 36855, 385917, 1912, -60946, -27418, -123832, -7277, -155077, 184199, -83739, -147381, -26667, -152191, -72128, -59942, -154391, 255605, -242474, 163962, -90302, -235192, 94139, -282726, -173935, -158554, -165252, 157947, 182650, 146059, -54378, -600299, 217247, 9028, 69780, 41326, -226308, -157698, -229708, -30918, 225623, -252148, 160125, -32155, -115693, -117943, 166032, 8298, -336991, 22469, -342356, 123819, -48125, -117787, 185956, -160997, 288524, 27978, -75013, 115854, -82442, -250027, -310792, 283149, 68533, -117835, 111608, -2922, -182879, -334207]
18639c34207D4460a8370j97270R2323k2476N8595F3391C0868a78078A80328a64992
18627g8705A72234H2356J7066Q9500a95930J8135n2548C65094H7936a13568B58232
18615c15802a37209k3400p007f9335K7858j86948O5905A26691a00315M9821l6150
18604h6644j66376D6210c42151f9782D02201C8211O1873a43886j63758A53260
18593C18875C2464a11403j58109H2228d0154q1211J1702G4691g8357q1825i166
18581G7537c07189f1243h971G6313a98178A59646a979j28492e4935A04818K6731
18570A31549d738A56120a9928C57798h4609E0102O6351b19054R6200K0524K085
18559a00245c6913j93777c5173r5978B96222l5564b37303E273J49133d01218a71643
$$ y = [-334207, 44460, -18370, -215640, -123317, -145793, -87198, 63391, 30868, -178078, 180328, -164992, -78705, 172234, 82356, 99422, 188922, -195930, -177795, -230343, 365094, 87936, -113568, 258232, -315802, -137209, -160609, -167616, -69335, -41477, -228425, -162520, 126691, -100315, -50494, -86644, -253020, 46210, -342151, -69782, 402201, 38211, 100084, -143886, -307644, 153260, 318875, 32464, -111403, -269512, 82228, -40154, -121365, -109663, 74691, -78357, -160182, -9166, 77537, -307189, -61243, -8971, 76313, -198178, 159646, -1979, -130471, -54935, 104818, 131549, -4738, 156120, -19928, 357798, -84609, 50102, 116453, -219054, -122854, -102330, -100245, -36913, -230690, -35173, -131151, 296222, 260658, -237303, 5273, 154406, -401218, -171643]
18547a01393j9008g39o6342j89794A75847D2438c6109j72044D0730R3473b19848
18535a23813B64461A00728B3406b49945c2864D5591c0979A8931e8839r375k82810
18524c51024B81636F727h2467m2075d630A10577d42340J89858R3618I7048g7591
18512G8098a896E7130a45607A83355H0465f1344J2912k08962h1185m9125A24520
18500G0478d58790a49581D35824H9808L4849e3547a5097I5761a65923f4557j14850
18489a79407H9916a87258O1669k6621K4112F5575a61691p2288N4033d0220A16054
18477b18677a05768d7854C89909G8227R2659d92694i5776m8599q799P5919C0046
18465c7383j87616h9358n4633B24212a0478r6780d940o5848k30233A20117a0350
$$ y = [-101393, -120401, -739, -67081, -256875, 175847, 42438, -36109, -208153, 40730, 134203, -219848, -123813, 264461, 100728, 23406, -249945, -32864, 45591, -30979, 18931, -58839, -68214, -351024, 281636, 6727, -82467, -124542, -4630, 110577, -442340, -252482, -158864, 97048, -77591, 78098, -1896, 57130, -145607, 183355, 80465, -61344, -48432, -257394, -81185, -130310, 124520, 70478, -458790, -149581, 435824, 89808, 124657, -53547, -15097, 95761, -165923, -64557, -179407, 89916, -187258, -125589, -152210, -128098, 65575, -161691, -233979, -179946, -40220, 116054, -218677, -105768, -47854, 389909, 78227, 170886, -492694, -95776, -144375, -153174, -77255, 30046, -37383, -224999, -89358, -143991, 224212, -10478, -107258, -4940, -70788, -301021, 120117, -10350]
18453A41487F3458K4243l0730e9762A39388m255c68496G5078e14315C35254A5569
18441f6151A29894J84778r2765R438J24321A34577b66356R6092B96929a44599
18430b63194R3501n0554Q6954Q577M4882A82873h2263J1716j6637E4074b21674
18418a38244N5846A32914e5393A8026h784D8558A3463b79601F4605a59934B7010
18406h0644h607p4544c4457B50230c1142n6066m6948a9725j74611A27693b65509
18394B26668b70498j13536e109k29015A81007b65215f235j89661A93168b9295
18383G0479J11651B3633b06908A90992F3505a59077N3302i277p5636m4042O2387
18372f6568A12571a82196h2664n1894c1828B70474a1879A25998L33972b29497
$$ y = [141487, 63458, 87701, 56971, -59762, 139388, 135133, -368496, 75078, -514315, 335254, 15569, -66151, 129894, 314672, 221907, 231345, 355666, 134577, -266356, -170264, 296929, -144599, -263194, -169693, -220247, -133293, -124716, -79834, 182873, -82263, -70547, -87184, 54074, -221674, -138244, -82398, 132914, -55393, 18026, -8784, 48558, 13463, -279601, 64605, -159934, 27010, -80644, -8607, -83151, -34457, 250230, -31142, -87208, -134156, -19725, -194336, 127693, -265509, 226668, -270498, -384034, -5109, -234124, 181007, -265215, -6235, -195896, 193168, -29295, 70479, 182130, 23633, -206908, 190992, 63505, -159077, -105775, -9277, -84913, -128955, -66568, 112571, -182196, -82664, -134558, -31828, 270474, -11879, 125998, 459970, -229497]
18361A4753K7205c20725f9150C3393P5685b68305F8076N8247C9839a81953f8086
18349a9908E5030c32264A59542A6674a22098d5278B6812b61677f3576m468k67481
18338c35525a10268r2006d7368A51724a38451N1042B08079b44098C88502f0172
18327a27284A35748b90825m8027f7973j16220a7841k28314E8056J21779J2419
18317A92254c9991H9702A0540c38391K6159J12975H3906b03845M0977P6080C2063
18305a13939E4831a91411j70937B6080a07147a691j3527j29433j9860A60915a87585
18293i3912k24329J30747M0287P0413C80173d56157b8158A83476J8527k6169a08538
18281B14142a04499l6057N9457C82168a56128C16535c2135A87413I0916a45629
$$ y = [14753, 41958, -320725, -69150, 33393, 109078, -268305, 68076, 126323, 39839, -181953, -68086, -19908, 55030, -332264, 159542, 16674, -122098, -45278, 26812, -261677, -63576, -68044, -335525, -110268, -202274, -47368, 151724, -138451, -87409, 208079, -244098, 388502, -60172, -127284, 135748, -290825, -338852, -67973, -184193, -17841, -246155, 58056, 179835, 192254, -39991, 89702, 10540, -338391, -312232, -199257, 83906, -203845, -162868, -86788, 32063, -113939, 54831, -191411, -362348, 26080, -107147, -1691, -15218, -144651, -164511, 160915, -187585, -93912, -318241, -187494, -147207, -76794, 380173, -456157, -28158, 183476, 202003, 175834, -108538, 214142, -104499, -140556, -81099, 382168, -156128, 316535, -32135, 187413, 90916, -145629]
18270i9150B2202f7857o4910j29723l0255c0352a3853k45565F7801a82280B96733
18258C22994c51944J47524E7256R7925i688m1578B89439a46774A75800a42690
18247a41478A83826c73370d5237H1758b14839e1190j5843j81614O1588h0965n5711
18236a36676C53768A5430c9256j2814r6515O9974R631K7032o0316A68965d3392
18224b93199B21851c49916k35700K27669A01921d845C3350a00681j6988l04322
18214d21991A25360d6441b0808A57427d3810A2637J31244K59954A35075b48221
18203G9215c7055J6123k3296G0355a63040n1292H0639d35406A13112J2764b07570
18191a18157j58206H3290c30077A39302a93150L2646P2041A21480d01049b7424
$$ y = [-99150, 22202, -67857, -132767, -262490, -292745, -30352, -13853, -259418, 67801, -182280, 296733, 322994, -351944, -204420, 57256, 155181, -9688, -51266, 289439, -146774, 175800, -142690, -141478, 183826, -373370, -45237, 81758, -214839, -51190, -67033, -248647, -187059, -80965, -136676, 353768, 15430, -39256, -52070, -148585, -78611, -68980, -41948, -102264, 168965, -43392, -293199, 221851, -349916, -585616, -357947, 101921, -4845, 33350, -100681, -117669, -421991, 125360, -46441, -20808, 157427, -43810, 12637, 143881, 403835, 135075, -248221, 79215, -37055, -20932, -44228, 70355, -163040, -214332, 80639, -435406, 113112, 125876, -207570, -118157, -276363, 83290, -330077, 139302, -193150, -160504, -88463, 121480, -401049, -27424]
18180a26433B4210a69838q2118J12795j2390r8826N2959A56600h3048B42829b5691
18168A37893D9346a5557k9392j7713j66636M426A61271b37248F8619K95132I6015
18156g5938A59451c37086F8717J6529b58359O0041p3974C9927b99474A77404a63991
18144d4503j7800j22863P6958p8438r7254A76356c10949a13346q7406k8844A32953
18132f8017j16003Q4491k540d9664a9481m5746C7368K06656A05489m5984P5702
18121A35207J33455B9643J2852d6637B56739A1115i1455m5623L998l2469G1314
18109c83615a36438i462q8488A99991a77414K3343C89827N6090a57226A94408
18098A30745a26179B72789d9271A87137J31256a16176B37426j18400c9561k86285
$$ y = [-126433, 24210, -169838, -251956, -139161, -151551, -250377, -197418, 156600, -83048, 242829, -25691, 137893, 49346, -15557, -44949, -62662, -229298, -224872, 161271, -237248, 68619, 363751, 96015, -75938, 159451, -337086, 68717, 85246, -258359, -198318, -272292, 39927, -299474, 177404, -163991, -44503, -62303, -185166, -108208, -186646, -283900, 176356, -310949, -113346, -200752, -229596, 132953, -68017, -184020, -99529, -102069, -49664, -19481, -65227, 37368, 244024, 105489, 59505, 135207, 268662, 29643, 42495, -46637, 256739, 11115, -91455, -137078, -133080, -165549, 71314, -383615, -136438, -9462, -97950, 199991, -177414, -154071, 389827, 445917, -157226, 194408, 130745, -126179, 272789, -49271, 187137, 318393, -116176, 237426, 119026, -39561, -325846]
18088c25846e2672j26590J520L9779A20769a45918m249A80948d6414F4548a30770
18076A8190a21322C48567c4568r4869L0159A18311a1024A20543b39077A94362
18065A41677D6510o641e0251A54611E2383b00159O6830l4692K9711A40416C696
18053B38035q3302p5333a0928j20845A2515a10661K66A38273a71183K3505O2843
18042h4835a984k92764A21177g4417b9069k2538j05863R859G869J40746a57109
18030i5658A3097O8623e0260n7612e3287A51800m213K7275a25402j96744F3362
18018D51J35312a49919D1946K31843g1009K6163k50580B34498a46779E752P0750
18007G6502b87880B93684j36801j8470b6177A4711g949j11089A15557c8255C8557
$$ y = [-325846, -52672, -179262, -177742, -137963, 120769, -145918, -150167, 180948, -46414, 64548, -130770, 18190, -121322, 348567, -34568, -129437, -99278, 118311, -11024, 120543, -239077, 194362, 141677, 46510, 39869, -50251, 154611, 52383, -200159, -133329, -168021, -138310, 140416, 3696, 238035, 154733, 79400, -10928, -131773, 12515, -110661, -110395, 138273, -171183, -147678, -84835, -1984, -294748, 121177, -74417, -29069, -51607, -157470, -147611, 7869, 148615, -157109, -95658, 13097, 81720, -50260, -107872, -53287, 151800, 147587, 174862, -125402, -322146, 63362, 451, 135763, -149919, 41946, 273789, -71009, -44846, -295426, 234498, -146779, 5752, 76502, -287880, 293684, 156883, 138413, -26177, 14711, -7949, -119038, 115557, -38255, 38557]
17995h1737A34084c10471J33114o3766G3969a08670H3087b37100b5734B6412O3051
17984H9463d0450A24083J65052P5432A00362k2494b9124k18350D0440a43839L5568
17973a08271f259C7301b260B9551i4808K0832l19497A74469b47672A27290a51851
17961C35846a56489A04948l0866b51419f6034A36213e475j08122c8876p4572r2205
17950b05653B54922H5277L65392A20188c9762A84702a72804Q4724j26223G3911
17939C05067a136r3558p2690O3533F0289b56386B7926f6924A93060b88203K8513
17928b59690A80950c7426a6600q9094k9087j36759A42660a3804A08958n2742A519
17916f7770j81561H8178h1123n8922A57353j332A0965R1284b83396A05128c80211
$$ y = [-81737, 134084, -310471, -177357, -241123, 73969, -108670, 83087, -237100, -25734, 26412, 89463, -40450, 124083, 289135, 364567, 100362, 77868, -29124, -247474, 40440, -143839, -108271, -6259, 37301, -2260, 29551, -94808, -73976, -393473, 174469, -247672, 127290, -151851, 335846, -156489, 104948, 74082, -251419, -66034, 136213, -5475, -113597, -38876, -113448, -205653, 254922, 85277, 450669, 120188, -39762, 184702, -172804, -88080, -214303, 73911, 305067, -1136, -94694, -167384, -103851, 60289, -256386, 27926, -66924, 193060, -288203, -259690, 180950, -37426, -16600, -105694, -134781, -271540, 142660, -13804, 108958, 56216, 1519, -67770, -249331, 88178, -81123, -140045, 157353, 156021, 10965, 102249, -283396, 105128, -380211]
17904a76997j13644F0995B4288b37802A45853O2018a82023M1485c8015k93084
17894c31099E3714a83392Q1595J4392C3684J62326F491R1655M0373M9225f6200
17882B6689e3394q9409B52646b2808k8193j90541J02966M3537F1871a58119J6685
17871a41434d1207d034B10721E2202c3516A71694K1960r5866B1555e9886A11210
17859E7201A9321L0394B213b0647B4550c9262J9531j15171N9638b8101m2345p7212
17847a47658A79568C0790a22123J7065K8650b5038a490H9907a35672A15555N0629
17836A66184e9050j16872B9518a58202L6343B67964c1771q8520B33307b09988
17825B18839c85638a09863A57151N572B6396J32810c44915F3664J09744A7105
$$ y = [-176997, -290641, 60995, 24288, -237802, 145853, 207871, -182023, -140538, -38015, -331099, 53714, -183392, -101797, -87405, 33684, 196010, 6491, 98146, 138519, 187744, -66200, 26689, -53394, -142803, 252646, -22808, -51001, -241542, -138576, -95039, 61871, -158119, -141434, -41207, -4034, 210721, 52202, -33516, 171694, 193654, 97788, 21555, -59886, 111210, 57201, 19321, 49715, 2213, -20647, 24550, -39262, -19731, -134902, -75264, -28101, -70446, -147658, 179568, 30790, -122123, -105058, -76408, -25038, -1490, 89907, -135672, 115555, 166184, -59050, -175922, 29518, -158202, -121859, 267964, -31771, -120291, 233307, -209988, 218839, -385638, -109863, 157151, 162723, 26396, 159206, -344915, 63664, 173408, 17105]
17814f7948A29960n0491b26134A31298N4433f31342A11810m9484i2143C02444
17803i2486k13219a08371r2130J0541L7201A83145c6808k52183A97628a36459
17792b19729C1924P4091j201i5986C22772a27220D3923g6207b2744B9836B659
17780c38775B3498M39489a31604B55988a44793O4540B31107m8205A1459a29036
17769e7373n6076L0786G6107g7365j10445d9274r5814E8670K76831A30664a06475
17757a22478c6839A20845K2358k6352h9354C68848Q3417I7440M0881g0193B06098
17745a04419M9296o3596k33348Q7910A49699D6146K72150I0999c6848m40025a84470
17733F4214Q3608K05083c67891B29587M995d0224E194d9540D0506J29950b61920
$$ y = [-67948, 129960, 79469, -226134, 131298, 185731, -631342, 111810, 62326, -92143, 302444, -92486, -305705, -108371, -200501, -189960, -152759, 183145, -36808, -288991, 197628, -136459, -219729, 31924, 106015, 104814, -95986, 322772, -127220, 43923, -76207, -22744, 29836, 2659, -338775, 23498, 462987, -131604, 255988, -144793, -80253, 231107, 182902, 11459, -129036, -57373, -113449, -82663, 76107, -77365, -187810, -49274, -145088, 58670, 335501, 130664, -106475, -122478, -36839, 120845, 143203, 116851, -89354, 368848, 452265, 97440, 138321, -70193, 206098, -104419, -55123, -118719, -352067, -264157, 149699, 46146, 318296, 90999, -36848, -476873, -184470, 64214, 147822, 352905, -367891, 229587, 234582, -40224, 5194, -49540, 40506, 170456, -261920]
17721C1816M1400L45651I9207M2817J80691D9946i1847A92862E8853b390l66394
17710c68784M7753P7723M7088A34589J24452J23884H2557e2728D58970A83074
17699A13988a44962e7829D31J72796A5021L32743d8948C21092a71655l11761A88643
17687C64388a54175A29770E9450B0888a76550C3204b73816A79257l7669K2760
17677A64348c0715B03884a31816F8072B1585b17107b6445j12332B78416O8069
17667C46485a20549A19282l6219a91305B6947J9274k1802P6626f2718D8480J17779
17656A66259a75537A35997K958F1236a2821j49349O800G7289K6314B7352Q6892
17645A14244b9095C02613n5751k7184b03744Q5582e7935F1828h3671C14644c03411
$$ y = [31816, 73216, 418867, 99207, 142024, 322715, 49946, -91847, 192862, 58853, -2390, -368784, -321031, -243308, -196220, 134589, 259041, 382925, 82557, -52728, 458970, 183074, 113988, -144962, -57829, 431, 173227, 15021, 347764, -48948, 321092, -171655, -483416, 188643, 364388, -154175, 129770, 59450, 20888, -176550, 33204, -273816, 179257, 141588, 164348, -30715, 203884, -131816, 68072, 21585, -217107, -26445, -138777, 278416, 346485, -120549, 119282, 83063, -191305, 26947, 46221, 24419, 101045, -62718, 48480, 166259, -175537, 135997, 138955, 61236, -12821, -162170, -155370, 77289, 103603, 27352, 114244, -29095, 302613, 246862, 219678, -203744, -118162, -57935, 61828, -83671, 314644, -303411]
17633i130B9688a28369E4914A2441L624a10744B14568b78130A57685c3221k49505
17622b82726F8351J69451A9203J18927O8770b47980P3866A86380H8459M34148
17612E22607a62983B6075J45919b00596Q1426l0910K3718N9514j80959P0818I7800
17600h1527D4744J90109b07205L8994B12236n0546d1666A4279b77233f7805B21823
17588C94136I1345a83177C45657o7744a24548M1428C70894D3625R4495h714k6828
17577c5542C4882b8340B06242a18920m6652B8955a36063D327d04413d5834F3831
17565i0665l0267B71208b46898L7099a8885A93023C6602a90025H6351D1826E980
17553C0396b24033g941j00474M4639A38384F2849J1973r038M84322A68643d4027
$$ y = [-9130, 29688, -128369, 54914, 12441, 16065, -110744, 214568, -278130, 157685, -33221, -282726, 68351, 237802, 19203, 138130, 206900, -247980, -174114, 186380, 88459, 522607, -162983, 26075, 171994, -200596, -119170, -150080, -126362, -66848, -247807, -176989, 97800, -81527, 44744, 234853, -207205, -168211, 212236, 161690, -41666, 14279, -277233, -67805, 221823, 394136, 91345, -183177, 345657, 277913, -124548, -83120, 370894, 43625, 138120, -8714, -35542, 34882, -28340, 206242, -118920, -165572, 28955, -136063, 4327, -404413, -45834, 63831, -90665, -120932, 271208, -246898, -209799, -18885, 193023, 36602, -190025, 86351, 41826, 5980, 30396, -224033, -7941, -108415, -63776, 138384, 62849, 74822, 65784, 550106, 168643, -44027]
17541A44684n9065J41134l3021D0397J37975a28753C11200A29141f4991I2271
17530a21742L7560B08402E2612O8968J07042o3190a69375Q2687l7429C47199j08689
17519B38510H938J68736G7121i6869D62709B7559a79999B90250b46934A17362
17508I9289a6250A04458J14749r3587k9402C8270K99077a2209B93463A15881n2686
17497F3195K11958I6035J13581i391A72155m0573Q2146L17838g3882A17993C6934
17485A63027h5695H9881h8025A09173n0916J0818J23418O756l7091J40386p2680
17474B29864A04030k8622J41177F7646a7899j80768A37020E3668J09239p9279
17464H3628R2637J26011A19681J97204A52544B8730K03551a22875B64302L9309
$$ y = [144684, 85619, 226753, 193732, 40397, 178372, -128753, 311200, 129141, -64991, 92271, -121742, -84182, 208402, 52612, 121580, 228622, 165432, -169375, -86688, -124117, 347199, 238510, 8938, 177674, 77121, -96869, 462709, 27559, -179999, 290250, -246934, 117362, 99289, -16250, 104458, 219207, 125620, 96218, 38270, 337347, -12209, 293463, 115881, 63195, 275153, 96035, 209616, -9391, 172155, 131582, 213728, 531566, -73882, 117993, 36934, 163027, -85695, 89881, -88025, 109173, 58257, 69075, 192493, 199249, 162158, 302544, 229864, 104030, 75408, 216585, 67646, -17899, -198667, 137020, 53668, 162907, 83628, 176265, 302276, 119681, 316885, 152544, 28730, 232281, -122875, 264302, 303611]
17454C03611p6424C7910K22995q976a67892B21997l6234J47214R9501E3645L61858
17443D15503b0256j702E8928b82791E03010f3584G7081A1204K54683J70663r0859
17432C45691k913b59906D03856a07367A45050N44320A92251K13030j82473J36209
17422C59017D3721J87194l3190F9712L9130Q1680q8751M33768A29772J67573J17676
17411D15021a86435B95834q5316G3532J54164a18588B84673K50344D8152K03491
17401B51643a972E03489C6715L88400j71120M1849o3831K11706Q1958k01874A06122
17389C73935F0484K51746N4786a14351B32452r8166b3472l34987f7608m0649B74508
17377c6908B38050L078r7529J39045g6515D9267K0584L4031K8840K6898l9243
$$ y = [303611, 227187, 37910, 260905, 251929, -167892, 221997, 185763, 332977, 432478, 53645, 415503, -20256, -21958, 58928, -282791, 503010, -63584, 77081, 11204, 265887, 436550, 345691, 342778, -259906, 403856, -107367, 145050, 689370, 192251, 405281, 222808, 359017, 43721, 230915, 197725, 69712, 108842, 190522, 101771, 535539, 129772, 297345, 415021, -186435, 295834, 210518, 73532, 227696, -118588, 284673, 535017, 48152, 251643, -1972, 503489, 36715, 425115, 253995, 295844, 232013, 443719, 525677, 323803, 106122, 373935, 60484, 312230, 367016, -114351, 232452, 134286, -23472, -358459, -67608, -108257, 274508, -36908, 238050, 241128, 143599, 282644, -76515, 49267, 69851, 103882, 132722, 159620, 120377]
17366A20377b62071O0868B09875R1632K0064B730K45148j10519b75091E4614q540
17355D6074N7105K7404J81033e9112j9582A5595J89319j6638i5964H1388a50815
17343I6097a34001a5632A26885J74735j49897J53293K20345a08969C38547A46261
17332B82196a31709N7404E29677e2492A08262Q9815p3197B3521K15771A9799c8839
17320A00146R9227J49072a1314A61570l3474O7610n033K37365A37135a07676b8056
17308A93414O7083g2275A36247R0909G7829N19909k12190o8960F1946d7087D06472
17296A40849K23632j46915H3324J67112J86291k4250J68492A18925J51787Q7013
17286C57725K11905h9141A54214K00793F2342a90727D24894F9964B7758J34730
$$ y = [120377, -262071, -201203, 209875, 301507, 321571, 2730, 247878, 137359, -275091, 54614, 46074, 103179, 130583, 311616, -59112, -78694, 15595, 204914, 188276, -95964, 81388, -150815, 96097, -134001, -15632, 126885, 301620, 151723, 305016, 525361, -108969, 338547, 146261, 282196, -131709, -74305, 529677, -52492, 108262, 198077, 124880, 23521, 239292, 19799, -38839, 100146, 199373, 348445, -11314, 161570, 128096, 195706, 190673, 428038, 137135, -107676, -28056, 193414, 260497, -72275, 136247, 227156, 77829, 597738, 385548, 316588, 61946, -47087, 406472, 140849, 364481, 217566, 83324, 250436, 436727, 412477, 580969, 118925, 270712, 357725, 569630, -89141, 154214, 355007, 62342, -190727, 424894, 69964, 27758, 162488]
17276A62488k8354g869E04603J8282k11497j1984Q4134I5880J14425p3014K68296
17265D05587C2029J62303K45648I1175K58588A33436K66952p4303F2518N9134
17255A21652B0343j101N1249C4970L72289K155j33664J57660A84366E1531J20620
17244A72151D9434P485O9067L465a527C11446K06676k20546K1879F0836d4010
17232E19K68192b05176i7314c308k4885a0031C40620j65290J50931j01905m2794
17221A81562J48361j4828A38008A9004J47823H1134M1699L0975o0770N25233B92600
17209E2799P7325K08519A05815J77801m1929B7374L4874K01358C1161M04292A07638
17197A77581J48662P7990A48796k1333K26679G6139K44537j49037K3292r3000
$$ y = [162488, 134134, -7869, 504603, 522885, 311388, 299404, 383538, 95880, 210305, 137291, 405587, 32029, 194332, 439980, 91175, 349763, 133436, 400388, 326085, 62518, 121652, 20343, 19242, 70491, 34970, 407259, 409414, 275750, 433410, 184366, 51531, 172151, 49434, 56919, 125986, 129451, -1527, 311446, 518122, 297576, 319455, 60836, -44010, 519, 268711, -205176, -97314, -3308, -28193, -10031, 340620, 175330, 326261, 224356, 181562, 329923, 315095, 138008, 19004, 166827, 81134, 122833, 153808, 93038, 618271, 292600, 52799, 130124, 338643, 105815, 283616, 241687, 27374, 62248, 263606, 31161, 435453, 107638, 177581, 326243, 404233, 148796, 127463, 354142, 76139, 320676, 171639, 194931, 101931]
17187A01931b4350H2088L46994B12696R1447Q175l2271K57881A9405M68788j60177
17176C28016h0086j5444A82315K81318F0009L13314e0792A53473L69709A00849
17165A84223J05173k5244O7975B3241O48584F9361K91330J70852k37620J56364
17155D50287B14827r3774L19086D8993L82867j11052J94754n5972f5449C59366
17144C14611K2907j08216L32062k80591j35405L83652J59204A94345Q1175j13015
17134A62505J13446A24021J82448K31675k61760K52580r5049G6011L43260A54257
17123C02563j9239o1034K39882j76076P3089m2851a0336C65939H6738K90751j56858
17112B20631J73985J960j50868m7152p0905K45871L23004J34339C47349j19526
$$ y = [101931, -24350, 82088, 429082, 212696, 304143, 312318, 280047, 537928, 19405, 488193, 328016, -80086, -95530, 182315, 463633, 60009, 373323, -50792, 153473, 523182, 100849, 184223, 289396, 264152, 332127, 23241, 671825, 69361, 360691, 531543, 293923, 450287, 214827, 121053, 440139, 48993, 431860, 320808, 515562, 459590, -65449, 359366, 314611, 337518, 229302, 561364, 280773, 145368, 529020, 688224, 194345, 275520, 162505, 275951, 124021, 306469, 538144, 276384, 528964, 433915, 76011, 419271, 154257, 302563, 283324, 222290, 462172, 286096, 359185, 316334, -10336, 365939, 86738, 377489, 220631, 394616, 396576, 245708, 198556, 127651, 373522, 696526, 830865, 347349, 227823]
17102B27823K44094k10460O6194K08581o7149Q1512p7684B08547L29911M8942
17092E87400J52569B50199K80258B48823K90688Q0848B37131l2920K15127J27195
17082E46533j03453K15896K72158l94048P569J80320C31958M33353k04162j24812
17072D36337j35355O6571l1212n4335L92047M9052k85101Q1227K80699C58632
17061D40898k4813J00537J06133K41738C26922K58770M1660J20923k83701J38900
17051F03474j75070L1507J28104j67161j04378Q5636M18756J0624l02270J94950
17041G24172k9816C27568N21396l40476J96611J4604j67214l7470j77514K68035
17031F05540M0392J4350M5565J52746l8088k74759L77855l67881j6135j785O28346
$$ y = [227823, 471917, 261457, 327651, 536232, 469083, 550595, 472911, 208547, 538458, 587400, 739969, 250199, 530457, 248823, 539511, 620359, 237131, 204211, 419338, 546533, 443080, 658976, 931134, 537086, 544655, 724975, 331958, 765311, 561149, 436337, 300982, 367553, 336341, 282006, 674053, 723105, 438004, 519231, 799930, 358632, 440898, 416085, 516622, 622755, 864493, 326922, 585692, 627352, 748275, 464574, 603474, 428404, 459911, 588015, 420854, 316476, 402112, 820868, 831492, 529222, 724172, 694356, 327568, 848964, 508488, 705099, 719703, 552489, 515019, 337505, 605540, 645932, 660282, 705847, 858593, 820505, 545746, 923601, 555720, 539585, 537800, 1166146]
17020A166146D58655N92142l07618k41760J05435M2040J31682m8013Q8790B33387
17009C92565M34972k03158K53312J18547k80866J78978C92547N37142J19728m59080
16999E90337K72467J66040j851k33612j82567J91853N01239M9902l46220k64301
16989G43287K15820j10995J52293k00207k10373L01033M2572L9717n4131P3454
16979I92470j4712J3020J4959k14154k57872J17292K01497K90473j13951m3510
16969I85512J52517n948k1494Q853q7258j24653o1867j42587J28647M54343j20660
16958A165405l10368J23699J11972o2279K56010m5319k66799k0827M59868l52256
16948A059106r8475J57339K73941k76893k61913K79085L72814j84968j65359L45757
$$ y = [1166146, 458655, 1050797, 743179, 501419, 606854, 648894, 780576, 732563, 821353, 233387, 392565, 827537, 624379, 877691, 996238, 715372, 894350, 392547, 929689, 1049417, 590337, 862804, 1028844, 1026993, 793381, 610814, 802667, 1303906, 1353808, 1007588, 743287, 959107, 848112, 1000405, 800198, 589825, 890858, 933430, 973147, 919016, 992470, 977758, 990778, 1005737, 791583, 533711, 651003, 852500, 1142973, 1029022, 985512, 1138029, 1132081, 1110587, 1119440, 1032182, 907529, 845662, 703075, 831722, 1286065, 1165405, 855037, 978736, 1090708, 1028429, 1284439, 1239120, 972321, 951494, 1411362, 1059106, 960631, 1117970, 1391911, 1115018, 853105, 1132190, 1505004, 1320036, 1154677, 1500434]
16938A500434l05589Q5098l24265L12525p5501K42964k5785k41630M6879J18650
16928A333780o1066o2588M04835l39701K48530l51228L51091l11577K49643Q4652
16918A546371m64242K51628J54674L03663j57117O883j37288l0785P7447K87474
16908A838708m73572k51362L56696J82377k41749K36491k27391J00266K6724L9093
16898A586281L03749K09519k67626K32690j64355j15661K67505k98303K6073K96650
16888B076522k90426l0005Q0907L39285M9236R4498j19815N8343j2213K16017
16878B462349k48792K14080j86329M05916j72489Q0465L04722k99535j70532J68841
16868B558696L22763j08008j17039p9699l624J84568Q6134N4509m2640K18201
$$ y = [1500434, 1194845, 1279943, 955678, 1268203, 1192702, 1435666, 1409881, 1168251, 1215130, 1333780, 1272714, 1210126, 1614961, 1275260, 1523790, 1172562, 1523653, 1212076, 1461719, 1546371, 1082129, 1333757, 1488431, 1792094, 1634977, 1641860, 1504572, 1473787, 1551234, 1838708, 1365136, 1113774, 1470470, 1652847, 1411098, 1647589, 1420198, 1520464, 1547188, 1586281, 1890030, 2099549, 1831923, 2064613, 1900258, 1784597, 2052102, 1753799, 1779872, 2076522, 1786096, 1756091, 1836998, 2176283, 2225519, 2320017, 2200202, 2258545, 2246332, 2462349, 2213557, 2427637, 2241308, 2647224, 2474735, 2555200, 2859922, 2560387, 2389855, 2558696, 2881459, 2773451, 2656412, 2576713, 2573089, 2757657, 2843791, 2898300, 2855660, 3073861]
16858C073861j82700J38177j73004Q2631L38446j70385J17433J24385k19083J53028
16848C282789K96809q7508j9727L24232k29144P2947J08536r5712K51078J43958
16838D048258j40748l4679K71353l3797P4281q2248J67037L59757p770J50968
16828D772412L207Q2479O8928K07400p2225K19502O7350m562J55860P6130m9824
16817E526657P2423L10772j47494K48276L87560k4247K91334j36532J47048J96027
16807F871824R5985M44345l35181M11820J82325K67076k56263K60503L43017K84689
16797H570140K2373L04059K75745l3804J92211M75678K59909J84551L52622N24312
16787A1127796l48893N62128O7207M00471N89173J65614O05754K37077N23257
$$ y = [3073861, 2891161, 3029338, 2856334, 2938965, 3277411, 3107026, 3224459, 3348844, 3129761, 3282789, 3579598, 3492090, 3472363, 3796595, 3567451, 3640398, 3748934, 3653222, 3904300, 4048258, 3907510, 3872831, 4144184, 4110387, 4184668, 4102420, 4269457, 4629214, 4621444, 4772412, 4775619, 4858098, 4927026, 5134426, 5062201, 5281703, 5349053, 5344491, 5500351, 5576481, 5526657, 5599080, 5909852, 5762358, 6010634, 6398194, 6373947, 6665281, 6528749, 6675797, 6871824, 6967809, 7412154, 7076973, 7488793, 7671118, 7938194, 7681931, 7942434, 8285451, 8570140, 8592513, 8896572, 9172317, 9138513, 9330724, 9806402, 10066311, 10250862, 10603484, 11127796, 10778903, 11341031, 11408238, 11808709, 12397882, 12563496, 13169250, 13406327, 13929584]
16778A3929584M64586K98593O19776K16749M05049N15864O30601N92431J043835
16769A8717068J53336P91246Q49872P41186N81583Q92775P64988Q57007N80653
16760B4929714J308747Q47276J241602J055903J213286J603629J223214J479602
16752C4902973J557530J751225J414902K042333J802266K398238K305679K010930
16744E0186076K785057K573252L075123L539422K897567L675000L801130L873869
16736G6406496M370218M470472M945372M690688N920556N754170N449002O463067
16728A18470041N807951O945134O192542O438208O273914N941339N720320N220985
16720A67010434M400612L853472K392390K360789M07616m51970j169463k184911
$$ y = [13929584, 14394170, 14692763, 15312539, 15529288, 15934337, 16450201, 17080802, 17673233, 18717068, 18870404, 19661650, 20511522, 21252708, 21834291, 22727066, 23492054, 24349061, 24929714, 26238461, 27085737, 28327339, 29383242, 30596528, 32200157, 33423371, 34902973, 36460503, 38211728, 39626630, 41668963, 43471229, 45869467, 48175146, 50186076, 52971133, 55544385, 58619508, 62158930, 65056497, 68731497, 72532627, 76406496, 80776714, 85247186, 90192558, 94883246, 100803802, 106557972, 112006974, 118470041, 124277992, 131223126, 137415668, 143853876, 150127790, 156069129, 161789449, 167010434, 171411046, 175264518, 177656908, 180017697, 180425313, 179973343, 178803880, 176618969]
16712A76618969l337514m065995m977220n370661o089863o278453o051090o818245
16704A33629928o856151o109661o445012o407877n807470n743050n123252n593431
16696H5544024m350219m481004m155522m052005l773820l070921l507910l240969
16688E4911654k546635k500416k560976k181463k672006j752160k133531j714350
16680C6850117j542647j379311j668968r01466j730447j499544j401929r18115
16672B5807690r16339r71997q06603q65688j074541o03549p76727o82123p07105
16663A8403018l11336j144919j44639m56423p44243m77534m23271p66122k00064
16654A3734467o21544l91799l50421l19171k85070N3578p28801l29161o56496
$$ y = [176618969, 173281455, 169215460, 164238240, 158867579, 152777716, 146499263, 140448173, 133629928, 126773777, 120664116, 114219104, 107811227, 102003757, 96260707, 91137455, 85544024, 81193805, 76712801, 72557279, 68505274, 64731454, 61660533, 58152623, 54911654, 52365019, 49864603, 47303627, 45122164, 42450158, 40697998, 38564467, 36850117, 35307470, 33928159, 32259191, 31357725, 29627278, 28127734, 26725805, 25807690, 24891351, 23919354, 23112751, 22247063, 21172522, 20568973, 19792246, 19110123, 18403018, 18091682, 16946763, 16802124, 16345701, 15601458, 15123924, 14700653, 13934531, 13734467, 13112923, 12721124, 12370703, 12051532, 11766462, 11820040, 11091239, 10762078, 10105582]
16645A0105582m0274o8418l69171l43525j08447m30263j66794Q4431o86141P9344
16635H056324j16993n04704j79279o5633q0366k22534K82039p53672J16337j57007
16625F374512j75392K6336k31567p6605m59567K41792j81295K5728m04083k80025
16615D859834r4042m29456P23201j34871k56905q5163O6549k21307o1980k99930
16605D065930o3380m3775K0987k77906R2175k22923m8306K53931k31390L8633
16595C583976r5415K40813k59063k88596J43410n53452L04832k83108K69775k08396
16585B854776j4693n0837J01707L6925J42593n61712M97492m69619K86965j44062
16575B679535k22701j24424k29843L70339o0162m63883K01572j1430J81311j68042
$$ y = [10105582, 10065308, 9996890, 9627719, 9284194, 9175747, 8745484, 8578690, 8663121, 7976980, 8056324, 7939331, 7434627, 7255348, 7189715, 7109349, 6886815, 7168854, 6415182, 6531519, 6374512, 6199120, 6225456, 5993889, 5917284, 5457717, 5699509, 5518214, 5543942, 5139859, 4859834, 4765792, 4336336, 5059537, 4924666, 4667761, 4582598, 4649147, 4427840, 4365860, 4065930, 4002550, 3958775, 3979762, 3701856, 3794031, 3571108, 3522802, 3776733, 3545343, 3583976, 3488561, 3729374, 3470311, 3181715, 3325125, 2771673, 3076505, 2793397, 3063172, 2854776, 2840083, 2789246, 2890953, 2927878, 3070471, 2508759, 3006251, 2536632, 2823597, 2679535, 2456834, 2332410, 2102567, 2472906, 2412744, 1948861, 2150433, 2139003, 2320314, 2152272]
16565B152272k46221J62923J47275j03689N7660j63013l5488n572j20756l00979
16555A544412K69506j27637K25237o6025p3397J22776p6505r3578n2756M9547
16545A721580j03389R0134l4894q0467l23968J00267N9200J23286P6421j7645
16535A610525q7316M0131m22168J89813J00662m5187K22190j63886J81631n96119
16525A030276J30309K58769k25076l85836K58311K08201k553p4439J2477K9998
16515A240437K96528k57735l32628K10074p8481J71398l58614J24013m1478j5821
16505I57693p5773R8468q9894J08088J87702k67826K12389j59392l59930K173
16495F13698L95383k04649J47408o335J41330k76631j30107J07070j84577k08508
$$ y = [2152272, 1906051, 2068974, 2216249, 2112560, 2170220, 2007207, 1971719, 1966147, 1845391, 1544412, 1813918, 1686281, 1911518, 1845493, 1772096, 1894872, 1818367, 1724789, 1672033, 1721580, 1618191, 1708325, 1673431, 1592964, 1268996, 1369263, 1428463, 1551749, 1628170, 1610525, 1523209, 1563340, 1141172, 1330985, 1431647, 1386460, 1608650, 1444764, 1626395, 1030276, 1160585, 1419354, 1194278, 808442, 1066753, 1274954, 1272401, 1197962, 1210439, 1240437, 1536965, 1279230, 946602, 1156676, 1078195, 1249593, 890979, 1014992, 973514, 957693, 881920, 980388, 890494, 998582, 1186284, 918458, 1130847, 971455, 611525, 613698, 1009081, 804432, 951840, 945505, 1086835, 810204, 680097, 787167, 602590, 394082]
16485C94082L53808P1985P6738l46097O8621L64271j03237o3229M6867j98376
16475F65433J76985j31140j1206J28664M1418k86429J01495J34772J78832k33407
16465G65417j27973J07978j9402k06297M0734L11735j17652j31604R3307k85904
16455D30339J76801J04738j2411B95804J61055K17281l8843j50072R6308K40443
16445H21976k7941k10277L99121m58501O3400q7722J74732B26552M47771j17708
16435E56615P7459k35076K8596O8005K09498l19021L12695j37418q5211J16874
16425E93016k21656K46844K29094C84361J20481j65400n2822J51752J25796q3258
16415D80910K27413p6618m0500J18303B69617O6123L57374j66134E3337J87211
$$ y = [394082, 747890, 819875, 896613, 550516, 619137, 983408, 880171, 816942, 863809, 665433, 842418, 711278, 700072, 828736, 870154, 583725, 685220, 819992, 998824, 765417, 637444, 745422, 726020, 519723, 560457, 872192, 754540, 622936, 716243, 430339, 607140, 711878, 699467, 295804, 456859, 674140, 635297, 485225, 581533, 821976, 794035, 583758, 982879, 524378, 587778, 500056, 674788, 226552, 674323, 556615, 634074, 398998, 427594, 495599, 705097, 386076, 698771, 561353, 476142, 593016, 371360, 618204, 847298, 384361, 504842, 339442, 286620, 438372, 564168, 480910, 708323, 631705, 591205, 709508, 269617, 335740, 693114, 526980, 53337, 240548]
16405B40548N41657k15182l2906k11982L12310Q8585j95505K03265B52291N64713
16395H17004C01517K19326A34731J13361b7477E02943j22517A44634M34405j23027
16385D56012A41814O5278p9529J38531I310J94194J96213q3991j40779L73424
16375E48371B21291K62784I2411J74094A0938a59792C71227j8023K41823j411
16365E93616I0674M99821j85758j97613J09394A01519N00803k05533l75A34748
16354B30692l3864P5777J4311j38523F0659K81729o4924A03330M0721J49003K92596
16343E85650j86709B8361K15080f3652A31941J04313P0127D3591J85517K79150
16333E08258C4660f3589A13358K42104A40257K9688L57290k11597p8038E7181
$$ y = [240548, 782205, 567023, 534117, 322135, 634445, 723030, 527525, 730790, 252291, 817004, 301517, 520843, 134731, 248092, -27477, 502943, 380426, 144634, 579039, 456012, 141814, 207092, 127563, 266094, 9310, 203504, 399717, 315726, 174947, 548371, 221291, 484075, 92411, 266505, 10938, -159792, 371227, 353204, 595027, 593616, 90674, 590495, 404737, 207124, 316518, 101519, 602322, 396789, 396414, 134748, 230692, 196828, 272605, 286916, 148393, 60659, 342388, 277464, 103330, 144051, 293054, 585650, 398941, 28361, 243441, -63652, 131941, 236254, 306381, 43591, 229108, 508258, 34660, -63589, 113358, 355462, 140257, 169945, 527235, 315638, 237600, 57181]
16322E36067a09118A75512J81638A35776O2708J24186A34645g1892A22181J07954
16312B30135F5269J79416M1571h5467A87001b6592r7014C46254A37168o8250K67591
16301C36509A56132O0660C3064g0063C75736j51376K6166o7825R3300j35267K03256
16290C43990j28355a16054B42982j8996D8815O670p415a38159B18433a41715H6452
16278B63198D5858K90985A08447J42160F9001K52081q1238j5804r0657B7801K76467
16267C04268A23026a4464B27592g7510A08506L7488P6440R3484I5892C8189K8460
16256F6649L9504M99675B14719K7909L3544N5194b06199H6455K3168K70759A08225
16244A72025K57170A05174a27050f2498p5352I8583K17911A6635M3521L6020j7606
$$ y = [536067, -109118, 175512, 357150, 135776, 198484, 322670, 134645, -71892, 122181, 230135, 65269, 244685, 286256, -85467, 187001, -26592, -123606, 346254, 137168, 68918, 336509, 156132, 216792, 33064, -70063, 375736, 224360, 250526, 182701, 276001, 140734, 343990, 215635, -116054, 242982, 223986, 48815, 55485, 48070, -138159, 218433, -141715, 86452, 263198, 45858, 336843, 108447, 250607, 69001, 321082, 239844, 224040, 133383, 27801, 304268, 123026, -14464, 227592, -77510, 108506, 145994, 222434, 315918, 95892, 38189, 66649, 106153, 605828, 214719, 242628, 276172, 331366, -206199, 86455, 109623, 380382, 108225, 172025, 429195, 105174, -127050, -62498, -137850, 98583, 316494, 16635, 60156, 96176, 78570]
16233G8570A4299P6737i2380k9820j35111B76746A38009b79279b7953B05917B2235
16221C2552K13519A6249i616C80856A50618K9013b1561A75357p259B6549a48192
16209d0762B1890J89982c566m5152A96419d00572i4459d2126C93662A06650D1621
16197a51685C90277j00542J76475F899L13863J62328G4580a32928c7907A82325
16186A10021a45326A16505p717J25717b25723M5336A38234a41544A34371e4968
16175e4808A27826L37670A10002i049k2534H6713B7817d5727A36679B1181a78542
16163E36686k63025j31828h6234K5477b0479B38417d2777E769K17178e4387j82327
16152b36714A97976e6827E1008c46438J40635a6189A10045D8577b8939B21666
$$ y = [78570, 14299, 91036, -92380, -122200, -257311, 276746, 138009, -279279, -27953, 205917, 22235, 32552, 246071, 16249, -9616, 380856, 150618, 179631, -21561, 175357, 168098, 26549, -148192, -40762, 21890, 211872, -3566, -48718, 196419, -400572, -94459, -42126, 393662, 106650, 41621, -151685, 390277, 289735, 466210, 6899, 320762, 483090, 74580, -132928, -37907, 182325, 110021, -145326, 116505, 108788, 234505, -225723, -180387, 138234, -141544, 134371, -54968, -54808, 127826, 465496, 110002, -9049, -31583, 86713, 27817, -45727, 136679, 21181, -178542, 536686, 273661, 141833, -86234, -60757, -20479, 238417, -42777, 5769, 222947, -54387, -236714, 197976, -56827, 51008, -346438, -205803, -16189, 110045, 48577, -28939, 221666]
16141b34768a3000o2550A85648b6215D59891b72401F7242a75089b3097R797A2656
16129A94869a16814B53997l5782l5681b57431d914n5053r2303B93550M5752a5755
16117A26024J89123H7265j1061g5568G4943K1881O3021f2091b65B96851a46065
16105C09487F8184P5592B8874Q3919f4854C24040a52089B85980o9711j9931Q5734
16094B82072q4839m9309a6661A4858J80283F5686a49025N0219M4048k451F0549
16082H5210a68150o0076H1319a32664j22711i4540B92142a41852j82013J34060
16072a89805B01635a55533P128E7079a7457G4998b34406k11040c444q0227j3832
16061i7503l0409j07831B5049K45568n9883b48538F092L92422a91881Q8076k17281
$$ y = [-234768, -13000, -75550, 185648, -26215, 459891, -272401, 67242, -175089, -23097, -13300, 12656, 194869, -116814, 253997, 218215, 182534, -257431, -4914, -59967, -152270, 293550, 339302, -15755, 126024, 315147, 87265, 76204, -75568, 74943, 96824, 159845, -62091, -265, 296851, -146065, 309487, 68184, 143776, 28874, 112793, -64854, 324040, -152089, 285980, 216269, 196338, 282072, 197233, 147924, -16661, 14858, 195141, 65686, -149025, -98806, -54758, -57209, 60549, 85210, -168150, -228226, 81319, -132664, -255375, -94540, 292142, -141852, -323865, -189805, 201635, -155533, -148405, 57079, -17457, 74998, -234406, -445446, -3444, -83671, -97503, -127912, -235743, 25049, 270617, 210734, -248538, 6092, 398514, -191881, -103805, -321086]
16050c21086F4401c11521b3231A84491b30628O3721A43126P1787c81046E8976
16039C37037b06036Q2706j41618p3923A37568n514h3133A91600N8308b92590i398
16027a82410A28505o77J2714h3202o3054a6503H1030L788a18304c0008j53068
16016a83076A51117f8334m87193B81776G1296i1069I2684B3883N5408R6249I82
16004c4070A91738d6893A53834M9704i9445H4774b26559j00813j28828e2671B35663
15992G9973J9208c27057A74651D436a36352M6126b7087F9162J89130L969H2788
15980a1433B74505H8038r988a66950A79550p8657J36185C6653a80458d579n874
15969a0453C3574c1023j79058n3289A72410f0183k7595k9772q1961B33891a83182
$$ y = [-321086, 64401, -311521, -23231, 184491, -230628, -166907, 143126, 214913, -381046, 58976, 337037, -206036, -123330, -264948, -338871, 137568, 132054, -83133, 191600, 249908, -292590, -9398, -182410, 128505, 127828, 140542, -83202, -146256, -16503, 81030, 84818, -118304, -30008, -183076, 151117, -68334, -555527, 281776, 71296, -91069, 92684, 23883, 79291, 175540, 982, -34070, 191738, -46893, 153834, 203538, -99445, 84774, -226559, -327372, -456200, -52671, 235663, 79973, 99181, -327057, 174651, 4436, -136352, -90226, -27087, 69162, 258292, 262261, 82788, -11433, 274505, 88038, 78050, -166950, 179550, 100893, 237078, 36653, -180458, -4579, -10453, 33574, -31023, -210081, -263370, 172410, -60183, -87778, -117550, -199511, 233891, -183182]
15957B43872h1663p8514A88446B5520O3979N7095g1228B60265h9297A40874c65560
15945G918K65147I9984d00592E2207d8134G8634J6075J35042q164e1953q9630
15934a41583j5598B48095q8840h4091F5419g8702K5952j01239C70060A3312a4599
15922c15577A16135A9161i6746A23666e4613k3969L7831n5993F4928a36435C5616
15910f3771j76165c0019H7380J26054b38363A6308d90012A46262a02509L1216
15900g1293A15800c9871j69770o7628j0805K8089B2037J36578a06675d7156A04149
15888a23441o8627D7739L6673J41841b13544d7729q6445e7978G1621c36503c4475
15876d5015n9651k2521K5846B02434I3327a23033d4203j44550F8687i2435l34866
$$ y = [243872, -81663, -160177, 188446, 25520, 89499, 146594, -71228, 260265, -89297, 140874, -365560, 7918, 273065, 99984, -400592, 52207, -48134, 78634, 94709, 229751, 221587, -51953, -141583, -157181, 248095, 159255, -84091, 65419, -78702, -52750, -153989, 370060, 13312, -14599, -315577, 116135, 19161, -96746, 123666, -54613, -78582, -40751, -96744, 64928, -136435, 35616, -63771, -239936, -30019, 87380, 213434, -238363, 16308, -490012, 146262, -102509, -71293, 115800, -39871, -209641, -277269, -288074, -259985, 22037, 158615, -106675, -47156, 104149, -123441, -192068, 47739, 84412, 226253, -213544, -47729, -134174, -57978, 71621, -336503, -34475, -45015, -104666, -127187, -101341, 202434, 93327, -123033, -44203, -188753, 68687, -92435, -427301]
15865d27301a06276m1746a031A45367a57280j74713g1661A546M711J6208a95287
15853h1788E799a6463j22348l0380B0150b73471a36324k25254a3490j86787A55779
15841b24962A73683M2275f4667j85825F3268K18494j00247E72d0891B9199a48764
15829a96733E5712R1139m2306e6356E1246b14153N2303j98815a1906A88485a57151
15817a14821i905j31954G2671b37627L515A09612N1824d5235C6761K0818M45269
15806E02848E5021a13925A36456a7265m693j99069B50275F8271Q1511b41815i273
15794c7213A52056M1927P9239A19873J15554b18754a05515j05130A25351K450
15784A27801e2681O01l1256j89929a11502F4865b81390f9184j36486g4661e163
$$ y = [-427301, -106276, -148022, -1031, 145367, -157280, -331993, -71661, 1546, 6257, 22465, -195287, -81788, 5799, -16463, -138811, -169191, 20150, -273471, -136324, -361578, -13490, -200277, 155779, -224962, 173683, 215958, -64667, -250492, 63268, 281762, 181515, 572, -40891, 29199, -148764, -196733, 55712, 146851, 104545, -56356, 51246, -214153, -161850, -360665, -11906, 188485, -157151, -114821, -9905, -141859, 72671, -237627, -234112, 109612, 161436, -45235, 36761, 57579, 502848, 55021, -113925, 136456, -17265, -21958, -221027, 250275, 68271, 149782, -241815, -9273, -37213, 152056, 193983, 273222, 119873, 235427, -218754, -105515, -210645, 125351, 127801, -52681, -52080, -83336, -273265, -111502, 64865, -281390, -69184, -205670, -74661, -5163]
15772b2935o663n6811B36395I9768a75748A21656h0610g38C063c9715A29904a39592
15759b7644J1621D2126Q7625j0175J50063a15640A32610k0561g0123j50510k7022
15748b47655H2872J74318A24319a3656A84150a5369r4342N1416B05494e8348a9835
15736b79791a02728O964A96010a27114K8410j22360q6762g1589A9670K8073b12186
15724b82024B3932b99937A54923b6841D95415A52495d1137k40969A54979F3510
15713b21302B13264a67204I7932J21152D9329d10447A14123J35128c01091f1167
15702a9559A1986K56860a21057B880a95140M898a4415A82102a68738k7171C30235
15690A44798P6282H7983A5152c40720e267B24499L4606g0592N608k6227c771l2905
$$ y = [-22935, -29598, -86409, 236395, 99768, -175748, 121656, -80610, -738, 3063, -39715, 129904, -139592, -27644, -16023, 42126, 129751, 119576, 269639, -115640, 132610, 112049, -70123, -220633, -247655, 82872, 257190, 124319, -13656, 184150, -15369, -109711, -58295, 205494, -58348, -19835, -279791, -102728, -95764, 196010, -127114, -98704, -221064, -307826, -71589, 19670, 47743, -212186, -282024, 23932, -299937, 154923, -26841, 495415, 152495, -41137, -282106, 154979, 63510, -221302, 213264, -167204, 97932, 219084, 49329, -410447, 114123, 249251, -301091, -61167, -19559, 11986, 268846, -121057, 2880, -195140, -190242, -14415, 182102, -168738, -195909, 330235, 144798, 221080, 87983, 15152, -340720, -5267, 224499, 259105, -70592, -64984, -91211, -3771, -36676]
15678c6676J2672B3989l228d6863C7180b29653B796J78681d6071k2176A30424
15666a2005j90964b1036k13142B78795j00662a28100A19539E5159c8036E7510
15655g8571n7846j02759B6531a54074n3275B31750e8604j670A22505E0527F448
15643d2893o9046B68255a96574L6396A21075b25092F4468a62114C2864a92110
15632a2334j44913K4067N933C71589a57331B09881f7701I3584J42131a61604F7562
15620A20968j3197b63549B46605a73522h5931B18832b16314o2396l0953J41737
15610a67926F46134g5693B04318L1319e5856K5071k22003B47065a04755A64401
15599a14256B5409L21691A15913a36578j03012B66256A0441J95586D6046L3599
$$ y = [-36676, -24004, 23989, 20761, -46863, 37180, -229653, 2796, 181477, -46071, -68247, 130424, -12005, -202969, -21036, -234178, 278795, 178133, -128100, 119539, 55159, -38036, 57510, -78571, -136417, -239176, 26531, -154074, -207349, 231750, -58604, -60274, 122505, 50527, 6448, -42893, -111939, 268255, -196574, -160178, 121075, -225092, 64468, -162114, 32864, -192110, -12334, -157247, -133180, -127247, 371589, -157331, 209881, -67701, 93584, 235715, -161604, 67562, 120968, 107771, -263549, 246605, -173522, -85931, 218832, -216314, -278710, -309663, -167926, 646134, -75693, 204318, 235637, -55856, -30785, -252788, 247065, -104755, 164401, -114256, 25409, 347100, 115913, -136578, -239590, 266256, 10441, 206027, 46046, 79645]
15589G9645o531a22479o5018P5591B04686m4058R1471g8876b4289A42608b72038
15577f8517K3960j76986I8042M1109c8724A43251a18723d5644d343B97351a86892
15565e8076A48218c28170a27446A16639J10968a4142B13529e2255q1182k28246
15555c61683e4469C2541a02716j14459B8478a59619P646A68922m3524O1267o4346
15544A22319e8588C00657A390c16902Q226C90820H3603M5484a18591j20858e4087
15532A89321b30248M2232A37016i6383C3793i6803C57468D5442b75786c5562B19063
15520F3475B2387J28095J73487e4095j33322B5095k468a5971L403j18447D1440
15508B94807j26195h0417l1842e366k06408k6005A1106N5538b17741b432B38519
$$ y = [79645, 73114, -122479, -187497, -111906, 204686, 160628, 252099, -78876, -24289, 142608, -272038, -68517, -44557, -221543, 98042, 139151, -38724, 143251, -118723, -45644, -4343, 297351, -186892, -58076, 148218, -328170, -127446, 116639, 227607, -14142, 213529, -52255, -133437, -361683, -54469, 32541, -102716, -217175, 28478, -159619, -151973, 168922, 125398, 186665, 122319, -58588, 300657, 1390, -316902, -308676, 390820, 83603, 129087, -118591, -239449, -54087, 189321, -230248, -188016, 137016, -96383, 33793, -96803, 357468, 45442, -275786, -35562, 219063, 63475, 22387, 150482, 323969, -54095, -187417, 25095, 22627, -15971, -12568, -131015, 41440, 294807, 168612, -80417, -112259, -5366, -211774, -237779, 11106, 66644, -217741, -2432, 238519]
15496d07718a81425o7868G4251a71348j3873C54549h2190I9540a01185D5815L317
15485D9132K09285C9823L2414K37435A21960l4296K10279h023j85170P8639B9129
15473B15718A04210d4516j7390B91212f9688k7602A91381C5466a0260G8038K91698
15462C69736A72769b5328J812l23300I2695b30049F9345d1724C5568J44607a13515
15450g5734E1112k3548b2601m6751A42114m3825b02283Q1362a2530r0554A01028
15438A68897h557B83501i4080G8867a33529O2181n0608j15225j91518C6280J62866
15427A99146a07270j74523A4198c15256c9366G7294f629B1454i0285L7934F089
15415I7372k9009J55747A8621K39392h6781K2315j04577A15983N2276m7541a84657
$$ y = [-407718, -181425, -249293, 74251, -171348, -185221, 354549, -82190, 99540, -101185, 45815, 49132, 258417, 39823, 72237, 309672, 121960, 87664, 297943, -8023, -193193, -114554, 29129, 215718, 104210, -44516, -61906, 291212, -69688, -97290, 191381, 35466, -10260, 78038, 369736, 172769, -25328, -23516, -346816, 92695, -230049, 69345, -41724, 35568, 180175, -113515, -75734, 51112, 27564, -22601, -69352, 142114, 98289, -202283, -120921, -12530, -103084, 101028, 168897, -8557, 283501, -94080, 78867, -133529, -71348, -121956, -237181, -428699, 36280, 199146, -107270, -281793, 14198, -315256, -39366, 77294, -6629, 21454, -90285, -52351, 6089, 97372, 68363, 224110, 18621, 258013, -86781, -64466, -169043, 115983, 168259, 120718, -184657]
15403B29813a06404E4910l998c21969d0985n9755C25345A02652b86939d3632B9744
15391a12954o7823F2952k5328o501L8181J8028J90559E1526a06196b5083B08500
15379a93135B32555P1852d83952a07256j20953e2915C7969h4125m7459b7562B28888
15367B43922A00630K18133Q6920a28853B07253m8443a44897o5323A21831c41199
15356G7791b43443C5733J6464J73331i9179j25789c8559B95820e4381A95649e4097
15344A64260b16410B54461d4566m1303A39622E5805f6962J7975l78084g06E4975
15332c10802E755M5875K91808j30609c63163a10313B07121b95462L7926g3770
15321A8180R9092K1316h3536C4671J13640F2082M39314b4252D43627A94013a86085
$$ y = [229813, -106404, 54910, 50912, -321969, -40985, -100740, 325345, 102652, -286939, -43632, 29744, -112954, -180777, 62952, 37624, 31123, 69304, 87332, 277891, 51526, -106196, -25083, 208500, -193135, 232555, 304407, -483952, -107256, -228209, -52915, 37969, -84125, -131584, -27562, 228888, 243922, 100630, 318763, 405683, -128853, 207253, 158810, -144897, -210220, 121831, -341199, 77791, -243443, 35733, 52197, 225528, -99179, -224968, -38559, 295820, -54381, 195649, -54097, 164260, -216410, 254461, -44566, -85869, 139622, 55805, -66962, -48987, -427071, -706, 54975, -310802, 5755, 51630, 343438, 212829, -363163, -110313, 207121, -295462, -257536, -73770, 18180, 117272, 138588, -83536, 34671, 148311, 62082, 501396, -24252, 443627, 194013, -186085]
15309B51292J30733A37407J64999h1418A64483C6888a35168K3651j35106F4876
15298A54960f1032m2310A89271G2556A6206M54869b60756B73830b84009B52450
15287B31378i7253n713E1668c71277J67029E62737k72173H172f1211j3313A79777
15275a977D620h3213A37250N8949d9095o0688p3660q114A19355f1789B01427a14809
15262e127A86607q1865J81313l5476q5183a9870D01872A53764e4647A98703a76796
15250A13961J88431N03051M98267N1213k62330K85114m84356B93458k259R2983
15240C84182G4934B4224R0418K45191G4408K37744A32601N5409a89854B6725b6146
15228E6186c634n8418K8173B57299E6938b7233B03715J90240F2646J03754K4615
$$ y = [251292, 382025, 137407, 302406, -81418, 164483, 36888, -135168, -111517, -246623, 64876, 154960, -61032, -103342, 189271, 72556, 16206, 471075, -260756, 273830, -284009, 252450, 231378, -97253, -102966, 51668, -371277, -204248, 562737, 290564, 8172, -61211, -74524, 179777, -1977, 4620, -83213, 137250, 196199, -49095, -109783, -183443, -191557, 119355, -61789, 201427, -114809, -5127, 186607, 104742, 286055, 250579, 165396, -19870, 401872, 153764, -54647, 198703, -176796, 113961, 302392, 805443, 1303710, 1354923, 1092593, 1377707, 893351, 293458, 291199, 384182, 74934, 24224, 114642, 359833, 74408, 312152, 132601, 188010, -189854, 26725, -26146, 56186, -3634, -62052, -33879, 257299, 56938, -27233, 203715, 393955, 62646, 166400, 191015]
15217A91015p873j1875m4978n258B523a55366r3753i3261B39614J08245A14327
15205b51138H8600B8328K54760j06968K4751b10823c2031B1123N4049K2138M0097
15194A37407J24543j15827J7959J04859h1592b8414k46288l5147h9197j11956
15184b01153A41570E411a56940q49D2238a84900D7321L28594E1063q075g2623
15172d15334B13275i8751B52112a01452j59462B79714r2208p2121b5593n6937
15162h2530j46158P7684D0789B397R3355J6528n6093g2305b031o1341E49085A92103
15149A41926K539l1917R2302a41163M483B08024H1024a98803j25118B79269r7026
15138A82243e2743a7601j00144A1941J43363C3557a08153M1378C50154E1210a75752
$$ y = [191015, 183142, 171267, 126289, 121031, 2523, -155366, -249119, -93261, 239614, 347859, 114327, -251138, 88600, 28328, 283088, 176120, 200871, -210823, -32031, 21123, 75172, 97310, 137407, 261950, 146123, 164082, 268941, -81592, -28414, -274702, -309849, -89197, -201153, 141570, 5411, -156940, -157789, 42238, -184900, 47321, 375915, 51063, 42988, -72623, -415334, 213275, -98751, 252112, -101452, -260914, 279714, 187506, 115385, -25593, -82530, -228688, -151004, 40789, 2397, 95752, 112280, 56187, -72305, -2031, -63372, 549085, 192103, 141926, 144465, 112548, 204850, -141163, -136680, 208024, 81024, -198803, -323921, 279269, 182243, -52743, -17601, -117745, 11941, 155304, 33557, -108153, -66775, 350154, 51210, -175752]
15126b41073b5194l59448B76702j37694M7361a845A11402k8092a45704D20538
15115C59039a2614B39418K22285p5913G920M9119J46166b0745F9649k1177g5559
15103A9229K26176L3168c65828g3707A00589O1292K00742j61536r1619R921P2718
15092A92107J0028P7500j05855b7579A73420F4035L17766j41283k3758a63B81249
15080g8143B7344J51473L21234F6633J67260r3426o0695O331O6788K1897N1308
15069B26096K89612H4051J10604n5645l2518K37886F7071b33740A93527g753B43189
15057a01483I6951J82721K8193J73361G7045J4161N010J00379H1524Q6144J96921
15046C64589i428C0148J32974m4649A7634J63954L58142a40231A55889K5761F9243
$$ y = [-241073, -25194, -384642, 276702, 139008, 186369, -1845, 111402, 83310, -145704, 420538, 359039, -12614, 239418, 461703, 385790, 7920, 57039, 203205, -20745, 69649, 48472, -75559, 19229, 245405, 278573, -365828, -73707, 100589, 161881, 362623, 201087, 109468, 119389, 192107, 202135, 279635, 173780, -27579, 173420, 64035, 381801, 240518, 216760, -163, 281249, -78143, 27344, 178817, 500051, 66633, 233893, 140467, 79772, 86103, 152891, 174788, 226096, 515708, 84051, 194655, 139010, 106492, 344378, 67071, -233740, 193527, -7753, 243189, -101483, 96951, 279672, 307865, 481226, 77045, 91206, 96216, 196595, 81524, 167668, 364589, -9428, 30148, 163122, 118473, 17634, 181588, 539730, -140231, 155889, 181650, 69243]
15034D92941g9838E26500A78616i4028E9704J57162J95293f2505A8850a9803k47287
15023b67090J13464A18830J06988A05390J58436n1413c6545D7105K66534b26782
15012A43619A0562b5457A47336a52238A16725K35626I0054A3974L14503q7772
15002B40705H8791K94356j65177G4014L59045j77320l7381J97962A07520L00431
14992D07951A21081O6327b11479F744L13693M1178l5884m0623j27495J25838a1205
14980A72110p5125J44313R4812A05130K00446F6504L3441J00613J55374j14995
14970B40937L4181J17647A92216J69892d17606b3295B48084E6533O1985D0930
14959B45324K38294D7537J45787b1377I0571N0078N0355d792B69866A14990k568
$$ y = [492941, -79838, 526500, 178616, -94028, 59704, 216866, 412159, -62505, 18850, -19803, -267090, -153626, 118830, 225818, 105390, 263826, 212413, -36545, 47105, 313639, -226782, 143619, 10562, -25457, 147336, -152238, 116725, 352351, 90054, 13974, 328477, 240705, 88791, 383147, 217970, 74014, 433059, 255739, 218358, 416320, 107520, 407951, 121081, 187408, -211479, 6744, 320437, 361615, 325731, 285108, 157613, 283451, -11205, 172110, 96985, 241298, 336110, 105130, 305576, 66504, 99945, 200558, 355932, 240937, 275118, 392765, 192216, 362108, -417606, -23295, 248084, 56533, 118518, 40930, 245324, 483618, 47537, 193324, -21377, 90571, 140649, 191004, -4792, 269866, 114990, 112422]
14948A12422K04914b79294B24106R803J4569Q2596A49768d194A79483N7940j8259
14937B19164K21124g5765C33851I8206J50156n5815H7921K85526R8035H6200J72419
14926B58619A24127L36855B29345O03341a00988C88179J8058J65903k39213r9203
14916B33724A16258J7133J37881p715K05384B27629Q6244P4558r0148l7168p7398
14905A83717J34921j47386k8526K98412m1881l5208Q8695j48524M772J40168r1874
14894C57286o8263I0857C6092M29801k21681j15927K91655A92413J1885N8615
14884B62913K35418L46286j94440r4803k41019J818J13472K35468k85018Q9503
14874D69598B21800J53804r8671J7620A39875L73300C6648K23096J54507J4603
$$ y = [112422, 317336, -279294, 224106, 233909, 248478, 331074, 149768, -4194, 179483, 237423, 219164, 440288, -75765, 333851, 98206, 248362, 192547, 87921, 373447, 471482, 86200, 258619, 124127, 460982, 229345, 832686, -100988, 388179, 406237, 572140, 332927, 233724, 116258, 133391, 271272, 263557, 468941, 227629, 313873, 388431, 298283, 261115, 183717, 318638, 171252, 142726, 441138, 399257, 364049, 452744, 304220, 308992, 449160, 357286, 289023, 90857, 36092, 465893, 244212, 128285, 419940, 192413, 204298, 262913, 498331, 844617, 650177, 555374, 314355, 316173, 429645, 665113, 380095, 469598, 221800, 375604, 276933, 294553, 139875, 513175, 36648, 259744, 414251, 428854]
14864D28854L10417C13803Q5327q8210O511L68131j61646B14023K50458L4602
14854D99083j34903J78804A52648J82171J16911j19339J77716j91925o6062K98809
14844E50929j04521J00826m281m2011r6718J04751J03006A75262L95931k64903
14834C06290j38422K56791j1061K00492k08674K7734k0513Q0761J72666j15256
14824E50808J25347j55944J82624k17824N2403K09642k47240j18065J09271m1192
14814D49830k4585J66493B64772K68403l2017q777q6311A83159K58803k04497
14804B37465L73262B37785J0181L91449k74302j50030K66183A75565K44593M3312
14794D63470m8484K18796Q1895A02549L93224J37399j5975Q7573L6499C21444
$$ y = [428854, 739271, 313803, 399130, 310920, 317431, 685562, 523916, 214023, 464481, 499083, 364180, 542984, 152648, 334819, 451730, 332391, 510107, 318182, 252120, 550929, 446408, 547234, 542953, 500942, 404224, 508975, 611981, 175262, 571193, 306290, 167868, 424659, 413598, 614090, 405416, 433150, 412637, 493398, 666064, 550808, 676155, 520211, 702835, 485011, 537414, 747056, 499816, 381751, 491022, 449830, 425245, 591738, 264772, 533175, 501158, 492381, 406070, 183159, 441962, 237465, 610727, 237785, 247966, 639415, 365113, 215083, 481266, 175565, 420158, 463470, 414986, 633782, 715677, 102549, 495773, 633172, 617197, 704770, 741269, 321444]
14783G16083j70364n9168J07646K42848j35488j35620k45076K19969J19778k13013
14773D47595o3440K30009K25704k83056K17796m9620j62067B51814J52100L10127
14763G14041J2925j57219K8997k67487n4987M41233k66326k8157K68235J11315
14753H02570l20495K22103l05054K91645J7477k87851N38909C83643K69121r5468
14743E57296M7295L93605j11935k01111k09138L77858N7497m7152n5986k11051
14733E97178M0979J81195j80913K39850k6575C97588K50120J50084o5845j4045
14723G17902O5017j42614k3774J55824J28909o8741o9735p8922K46359k63139
14713F67086M51889D40898O88750B90927Q04684m26126K5689q0753N0667J25050
$$ y = [716083, 545719, 486551, 594197, 837045, 701557, 565937, 320861, 540830, 660608, 447595, 384155, 614164, 839868, 556812, 774608, 724988, 562921, 251814, 403914, 714041, 726966, 569747, 598744, 331257, 276270, 717503, 451177, 423020, 691255, 802570, 482075, 704178, 399124, 690769, 708246, 420395, 959304, 383643, 652764, 557296, 604591, 998196, 886261, 685150, 476012, 853870, 911367, 864215, 808229, 597178, 638157, 819352, 638439, 878289, 851714, 397588, 647708, 797792, 731947, 717902, 782919, 640305, 616531, 772355, 901264, 832523, 762788, 683866, 930225, 667086, 1118975, 440898, 1129648, 290927, 1095611, 669485, 695174, 614421, 665088, 790138]
14703G90138K02603n0301l54831L43051r3790K06485l14881Q3716J94744l11723
14693F95211j25314K19726Q1901m4422n9939L61930j91382j97505j50257L61769
14683I51718j65815j75189O99314l01004N8183k14686k04602L60566k55205k5514
14673G27766K98460l36868M35258r4497L21912l95605j33348K50021j2198j82031
14663H78870M92027o29638L39283M1185J21637m84191L47459m96295N32235o4344
14653A078228l2870K50950k08693j89351J65996L2691k55397M41156j02603L3339
14643A213446k61288O75514l83420l4789M57042n29415J9463J25994p6941M8684
14633A254290j33371K62381J105k71946K05658O1779l83633n364L35178N64079
$$ y = [790138, 992741, 942440, 587609, 930660, 836870, 1043355, 728474, 812190, 1006934, 695211, 569897, 789623, 871524, 827102, 767163, 1129093, 937711, 740206, 589949, 951718, 785903, 610714, 1310028, 1009024, 1067207, 852521, 647919, 1008485, 753280, 727766, 1026226, 689358, 1124616, 1030119, 1352031, 956426, 823078, 1073099, 1060901, 878870, 1370897, 741259, 1080542, 1121727, 1243364, 759173, 1106632, 610337, 1142572, 1078228, 1045358, 1296308, 1087615, 898264, 1064260, 1096951, 841554, 1282710, 1180107, 1213446, 952158, 1627672, 1244252, 1209463, 1666505, 1137090, 1156553, 1282547, 1205606, 1254290, 1120919, 1383300, 1384405, 1112459, 1318117, 1379896, 996263, 990899, 1326077, 1890156]
14623A890156o27307K20771N4162k65800n0455J59316J34555l27708L84854l24996
14613A247548R9899j08384j0475J45743J13900N13774p25549K87522J28079j74400
14603A517657J23879j2256m0341k00476L0850J91231J78209j15881R2275J31514
14593A896661l02823k1208P0396L9312k66696L73135l6954l1439l5318R9480j21462
14582A663084L25974J4483o4627n1074N3557P4803k17719K94422j68137m6452
14572A878314J49773j94326L19760J66175j76153o3855K09822K47130n44078K22229
14562B214791o23K04144L38880l92545M30758R3261k29167O00953R0259k2062
14552C328649M82851M13221J197063K093811L268723P213376J5293511J4667494
$$ y = [1890156, 1262849, 1483620, 1537782, 1271982, 1221527, 1380843, 1515398, 1187690, 1572544, 1247548, 1347447, 1239063, 1228588, 1374331, 1488231, 2002005, 1276456, 1563978, 1692057, 1517657, 1641536, 1629280, 1588939, 1388463, 1419313, 1610544, 1788753, 1672872, 1765147, 1896661, 1593838, 1572630, 1643026, 1682338, 1415642, 1788777, 1751823, 1720384, 1685066, 1784546, 1663084, 1989058, 2003541, 1938914, 1887840, 1941397, 2016200, 1798481, 2092903, 1924766, 1878314, 2028087, 1833761, 2153521, 2319696, 2143543, 2079688, 2289510, 2536640, 1992562, 2214791, 2214168, 2418312, 2757192, 2364647, 2795405, 2888666, 2659499, 3260452, 3350711, 3328649, 3811500, 4224721, 5421784, 7515595, 10784318, 17997694, 33291205, 47958699]
14544D7958699k0949420A1562634D827586k089886m18125n85730K53475j7747
14536A969573k25176J94358l45800K41128k76893K70563J11993M5260Q9042r8202
14526A975846K88808j4166m5600N9315k09072L97407j89056k09732K60728R7534
14516B412012J13057K23539k77600j81973K97390O5821j76900N96923o16846M5324
14506B500747N31471l56269J41037L23799k94341k7463M31380m26544K6836o4555
14496B786098L39889R4653j45463L81899j88930J2692P9248l2399J60996j10242
14486C378441O9499r008q5565j4509J72841J94384k13120M73572l88792N8584
14476C636327K30945J46053R2012n7837j82907k3233L35751j46685o347L3072
$$ y = [47958699, 27009279, 11562634, 4827586, 2737700, 2319575, 1733845, 1987320, 1969573, 1744397, 1938755, 1592955, 1834083, 1557190, 1827753, 1939746, 1985006, 2074048, 1975846, 2264654, 2250488, 2204888, 2264203, 2055131, 2452538, 2263482, 2053750, 2314478, 2412012, 2525069, 2748608, 2471008, 2289035, 2586425, 2652246, 2475346, 3072269, 2455423, 2500747, 3032218, 2675949, 2816986, 3140785, 2846444, 2818981, 3250361, 2823817, 2850653, 2786098, 3125987, 3220640, 3075177, 3457076, 3268146, 3280838, 3360086, 3327687, 3488683, 3378441, 3447940, 3438932, 3353367, 3338858, 3511699, 3706083, 3492963, 3966535, 3577743, 3636327, 3867272, 4013325, 4105337, 4047500, 3864593, 3841360, 4177111, 4030426, 4024079, 4057151]
14466D057151L98022k01692K6065J73539j48358K28175k80588P10636m54928K40148
14456D748170K08735m9749j65234M30680p5610j14711L01416l92311K42969K64886
14446E399241l23130L96856K95475k15577K05212m2031K62673J5077m14592K20931
14436E800135J76065M73830j67225m93037M11837N80283k78015K31292j0660K43552
14426F968057k20959L71115J98675O5443l47536K04587M41722k01009J66290K37867
14416G884252K8968r3642K07875j66242M31050r9291J74126L46908K45960N5836
14406I015800P4372k46936M43654q5770N22011J23268L34291j68038K54902L3931
14396A0301485K08247O9814M11295K3744L83282P629L30255Q7622L20270Q5851
$$ y = [4057151, 4455173, 4253481, 4279546, 4453085, 4304727, 4532902, 4252314, 4962950, 4508022, 4748170, 4956905, 4907156, 4741922, 5172602, 5096992, 4982281, 5283697, 4891386, 5134355, 5399241, 5076111, 5472967, 5768442, 5552865, 5758077, 5716046, 5978719, 5993796, 5579204, 5800135, 5976200, 6450030, 6282805, 5789768, 6201605, 6781888, 6503873, 6735165, 6724505, 6968057, 6747098, 7118213, 7316888, 7382331, 7034795, 7239382, 7681104, 7480095, 7646385, 7884252, 7913220, 7819578, 8027453, 7861211, 8292261, 8192970, 8367096, 8714004, 8959964, 9015800, 9090172, 8843236, 9286890, 9201120, 9723131, 9846399, 10180690, 10012652, 10267554, 10301485, 10509732, 10579546, 10990841, 11014585, 11397867, 11405496, 11735751, 11823373, 12143643, 12229494]
14386A2229494M77636q5923K13087N02162O3189L48778K79736M202K04968P21207
14376A4958536J37474K06628L47748q8235Q49241j4913L34679L22513L72935K58678
14366A7685284P29057M328N34057M34462M91652J75637O81188O91728K87574O32707
14356B2347674M31748L22335N00209N89740L48774J080794L69785M68789J107745
14347B7567593J88900Q68876R13957N22204N06501J133746Q18017J151566O44724
14338C4316084J217953J002652J051412J099287R01464J265763J244199J276869
14330D3375683J581823J235730J484309J846729J461441J437501K063929J705837
14322E6192982J638683K396344K312234K361606K228820K034774L147105K719090
$$ y = [12229494, 12707130, 12621207, 12834294, 13336456, 13399645, 13748423, 14028159, 14032361, 14237329, 14958536, 15096010, 15302638, 15650386, 15562151, 16411392, 16396479, 16731158, 17053671, 17426606, 17685284, 18414341, 18418669, 18952726, 19387188, 19878840, 20054477, 20735665, 21427393, 21714967, 22347674, 22779422, 23101757, 23601966, 24191706, 24540480, 25621274, 25991059, 26459848, 27567593, 27756493, 28625369, 29539326, 30061530, 30568031, 31701777, 32519794, 33671360, 34316084, 35534037, 36536689, 37588101, 38687388, 39588852, 40854615, 42098814, 43375683, 44957506, 46193236, 47677545, 49524274, 50985715, 52423216, 54487145, 56192982, 57831665, 60228009, 62540243, 64901849, 67130669, 69165443, 72312548, 75031638]
14314G5031638K641901L057110L796924L579373L662756L447131M421213M207808
14306A03845854M790110N217687M924124N539985O128732O287169O309463P371039
14298A50414163P454603Q357235Q170856R377898R070301J0863797J0840405J1296837
14290B25846095J2084833J2813175J3765534J4381389J4108895J5281225J5908577
14283C24189723J6424197J6141100J6374826J6541314J5924103J4986788J4059482
14276D34641533J2372839J0903321P280508K509366J494953L61962q62144K86463
14268D68988801l690700l898534m843822j0009843j2904914j4396149j5289321
14261D03955518j6647516j6669743j6716561j6821292j6700494j6176233j4973396
$$ y = [75031638, 77673539, 80730649, 84527573, 88106946, 91769702, 95216833, 99638046, 103845854, 108635964, 113853651, 118777775, 124317760, 130446492, 136733661, 143043124, 150414163, 157868766, 166226001, 174396857, 183774755, 192845056, 203708853, 214549258, 225846095, 237930928, 250744103, 264509637, 278891026, 292999921, 308281146, 324189723, 340613920, 356755020, 373129846, 389671160, 405595263, 420582051, 434641533, 447014372, 457917693, 465198201, 467707567, 469202520, 469564482, 468702338, 468988801, 465298101, 461399567, 456555745, 446545902, 433640988, 419244839, 403955518, 387308002, 370638259, 353921698, 337100406, 320399912, 304223679, 289250283]
14254B89250283j4227537j4420949j3688642j2759537j2505827j1680895j0577462
14247A99389434j0133863r646407q924624q352427p974576p544420p087787o387482
14239A33337848o141068n670898n368073n067815n231426m408921m531323l776897
14231I3141427l450246l544122l452671l104628l394002l001263k727549k479733
14223F7987213k305825k369514k372319k165884j786662k197272j620302k057816
14215E1111619j594647j244653j264065j593253j428228j452686j139130r65705
14207D0429252r70488p52830j483447j494508p49535j041910o51638m16000r05094
14198C1963802j122624j114137o92968q71028l41019o67814r23434n54383o98775
$$ y = [289250283, 275022746, 260601797, 246913155, 234153618, 221647791, 209966896, 199389434, 189255571, 179609164, 170684540, 162332113, 154357537, 146813117, 139725330, 133337848, 127196780, 121525882, 116157809, 111089994, 105858568, 101449647, 96918324, 93141427, 89691181, 86147059, 82694388, 79589760, 76195758, 73194495, 70466946, 67987213, 65681388, 63311874, 60939555, 58773671, 56987009, 54789737, 53169435, 51111619, 49516972, 48272319, 47008254, 45415001, 43986773, 42534087, 41394957, 40429252, 39458764, 38705934, 37222487, 35727979, 34978444, 33936534, 33284896, 32868896, 31963802, 30841178, 29727041, 29034073, 28163045, 27822026, 27154212, 26230778, 25676395, 24977620]
14189B4977620l14011r13632n08722n01952j37106q72668o54192l81182j95428
14180B0498727o90631j60142p12109j79340k03884l75433n79473m97939J34231
14171A7234007o62545k69195n65123J76136n85689k86517j67119m63271k0955
14162A4389729n96500J8229k07838m03732l73211M660m93043N1748k93022k22897
14152A1874123k07998j64541o408j62220j31346m48506j04378m7264k29840k984
14142A0368638q7974k28704O5368m56852j31483k06567l792k19674j47676q3118
14132H868166k48073Q030l02811j30959r6583J39970k04239o5620l15817J32091
14122G784155r8720k48081k16855j24755j55684N0388j63012K19474l45683J23386
$$ y = [24977620, 24663609, 23749977, 23241255, 22739303, 22602197, 21729529, 21075337, 20694155, 20498727, 19808096, 19647954, 18935845, 18756505, 18552621, 18177188, 17597715, 17099776, 17234007, 16571462, 16302267, 15737144, 15913280, 15327591, 15041074, 14873955, 14410684, 14389729, 13793229, 13811458, 13603620, 13199888, 12826677, 12831337, 12338294, 12390042, 12097020, 11874123, 11666125, 11501584, 11495176, 11332956, 11201610, 10753104, 10648726, 10601462, 10371622, 10368638, 10280664, 10051960, 10117328, 9660476, 9528993, 9322426, 9318634, 9098960, 8951284, 8868166, 8620093, 8628123, 8325312, 8194353, 8097770, 8237740, 8033501, 7967881, 7652064, 7784155, 7685435, 7437354, 7220499, 7095744, 6940060, 6990448, 6827436, 7046910, 6701227, 6824613]
14112F824613l53121O6264m21638R4333j65952J15329j489j42583o6381k15473
14102E733902J10706m7075L36131o15459J66847j82347j590j90980n4778L52643
14092E608000l95708l76239K32984L49584o14102J43899l94873K03987l44814
14083D412718j21402K47796j68089L43117j75287k53422J06030n9946j30510J38691
14073D339696j27021J74185j91394l92341K35012j91635N3620k51585J73462N1051
14063C873050r2281K90123l08118J15922j74471p5873m3077K59487N9791l37236
14053C567317l01034J47706J06118J78782m94180J00748j83259J31992l22050
14044B932140J24170J80375m46968K96984k33917j9633P2063k4503q4113M1619
$$ y = [6824613, 6471492, 6537756, 6116118, 6210451, 6044499, 6159828, 6158339, 6015756, 5949375, 5733902, 5844608, 5797533, 6133664, 5518205, 5685052, 5502705, 5501115, 5310135, 5255357, 5608000, 5212292, 4836053, 5069037, 5418621, 4804519, 4948418, 4553545, 4757532, 4412718, 4291316, 4539112, 4371023, 4714140, 4538853, 4285431, 4391461, 4331515, 4201005, 4339696, 4212675, 4386860, 4195466, 3803125, 4038137, 3846502, 3900122, 3648537, 3821999, 3873050, 3780769, 4070892, 3762774, 3878696, 3704225, 3628352, 3585275, 3844762, 3904553, 3567317, 3266283, 3413989, 3520107, 3698889, 3204709, 3305457, 3122198, 3254190, 2932140, 3056310, 3236685, 2789717, 3086701, 2852784, 2833151, 2905214, 2880711, 2796598, 2838217]
14034B838217M7488l48894N24659k59568p6702Q3763k4781N8318k85638j94707
14024B362155L6797J88897J06506m8269j96062L65145l12874J92474j22082j74800
14014B397887n11437J80633p1758J99524O1018J05040k55915J56033k00793L53773
14004B414005m11396J03890K13141l53855L18304k21972J56538j78970j1182j7055
13994B011448k7512l12598j78036J22835J384810N70640K588920N550547J4080579
13985B5791633J9895697j5024859j4894389p089887l085225r72084o46563m12707
13977C561616m20776k31342l2721k94812r5647P1980j25536k0725N7242j07830
13967B361449j68428j21041j45652K27875j12432K2760O7321l38387l1288L29528
$$ y = [2838217, 2885705, 2536811, 3061470, 2801902, 2725200, 2808963, 2784182, 2842500, 2556862, 2362155, 2398952, 2587849, 2694355, 2646086, 2450024, 2815169, 2502295, 2694769, 2572687, 2397887, 1886450, 2067083, 1995325, 2194849, 2255867, 2360907, 2104992, 2261025, 2060232, 2414005, 2002609, 2106499, 2319640, 1965785, 2284089, 2062117, 2218655, 2039685, 2028503, 2011448, 1983936, 1671338, 1493302, 1616137, 3000947, 3571587, 6160507, 11711054, 25791633, 45687330, 30662471, 15768082, 8678195, 5592970, 4620886, 3974323, 3561616, 3140840, 2909498, 2876777, 2581965, 2486318, 2558298, 2432762, 2412037, 2469279, 2361449, 2193021, 2071980, 1926328, 2154203, 2041771, 2064531, 2131852, 1793465, 1762177, 2091705]
13957B091705M6048k606k44463J79326k19107l11026L33505P9097l18073M79911
13947B114317n24700J14714o0119L38273O507l18091K77005m3969m53720J80125
13937A630342l28966J10873J92048J33106k18777l1771l7118Q4274K02845k01162
13927A535694Q7443l90289N07471k23441k19170K36387k34113O3584j73518L87870
13917A577918k68273j23029L67701l73918J87524j8058J0736Q4316j83925K58898
13907A519890J24637k1043o29418J50483q4247K32932j27266j48223L01729q2707
13897A236767R1112L2369j6106j6298o4160J4437N1243j98532J140j40130M9849
13886A041691o6647k34253K85624L11636k53531M4132J45757J38271m56926M84213
$$ y = [2091705, 2137753, 2135147, 1890684, 2070010, 1850903, 1539877, 1873382, 1952479, 1634406, 2114317, 1589617, 1704331, 1644212, 1982485, 1988992, 1670901, 1947906, 1903937, 1450217, 1630342, 1301376, 1412249, 1604297, 1737403, 1518626, 1486855, 1449737, 1534011, 1736856, 1535694, 1623137, 1232848, 1740319, 1516878, 1297708, 1534095, 1299982, 1363566, 1190048, 1577918, 1309645, 1186616, 1554317, 1180399, 1367923, 1349865, 1360601, 1444917, 1260992, 1519890, 1644527, 1623484, 994066, 1144549, 1060302, 1293234, 1165968, 1017745, 1319474, 1236767, 1327879, 1360248, 1344142, 1327844, 1263684, 1278121, 1329364, 1130832, 1131972, 991842, 1041691, 975044, 740791, 1026415, 1338051, 1084520, 1128652, 1274409, 1412680, 955754, 1439967]
13876A439967k92217P016k9257Q599j79091k2557r7945R8422K92483K3729l33853
13865I15296K68171l396l08564M20257F36524K04786J76N07534l61927k06709
13855G80384N3650J32390K69243k92302J90869j78458K78948l41603K14202k94260
13845H13063J94539k18786l65602O35819j47081K3666k44546R4021L6604q8160
13835G33537O3421j17865K52877j08030j34716N24624l45122k7900J32838l06496
13825F67168L07953D21501N12343j82653K06770J53974m66679K39243j5189Q1519
13815I50829l33264N7564J94586j37138j36703N47495m38526j37179O5532L3649
13805F66845k02186J80813L63069j99374L8107l1725M9796J00598j76238C21405
$$ y = [1439967, 1147750, 1154766, 1125509, 1134108, 955017, 932460, 834515, 932937, 1225420, 1249149, 915296, 1183467, 1180071, 871507, 1291764, 636524, 841310, 841486, 1349020, 987093, 780384, 834034, 966424, 1235667, 943365, 1134234, 955776, 1234724, 893121, 1107323, 813063, 1007602, 788816, 423214, 1059033, 911952, 935618, 691072, 785093, 821697, 733537, 796958, 679093, 931970, 823940, 689224, 1213848, 868726, 840826, 973664, 667168, 975121, 421501, 933844, 751191, 957961, 1111935, 645256, 884499, 869310, 950829, 617565, 675129, 869715, 732577, 595874, 1143369, 704843, 567664, 633196, 666845, 464659, 645472, 1008541, 809167, 847274, 815549, 865345, 965943, 789705, 321405]
13794G24049N9460J02445k23727J06585j26231o7895J91395J76449k05247J06891
13784H44174L386C65483L36935B70289N69156l99380K00647r1794k62848L32992
13774F19062j5400J05096k00445j5408J72714B78323L47015l4235B72687J18631
13764C91318J46531K53028j98111Q7416j76790p1143K93550m3475p6288N39274
13754A145310m66655J24139K97562E20278o726J3301o4337J45327J09191k58605
13744D58429P1457K71380j14709k63816M80330k39052J63687n1680o4974n2471
13734F58581p5230N0823k07156K36518j35678J65958j28607j34954J92660l10104
13724C12811Q6073j0172J73266J7944j39074m2804K99531o7003k12959R4283J15861
$$ y = [724049, 783509, 885954, 662227, 768812, 642581, 574686, 766081, 942530, 737283, 844174, 847560, 365483, 702418, 270289, 839445, 440065, 640712, 548918, 286070, 619062, 603662, 708758, 508313, 492905, 665619, 278323, 625338, 591103, 272687, 391318, 537849, 790877, 592766, 680182, 503392, 432249, 725799, 682324, 606036, 1145310, 678655, 802794, 1100356, 520278, 513552, 526853, 462516, 607843, 717034, 458429, 529886, 801266, 686557, 422741, 903071, 664019, 827706, 776026, 711052, 658581, 583351, 634174, 427018, 663536, 527858, 693816, 565209, 430255, 622915, 312811, 398884, 388712, 561978, 579922, 440848, 398044, 697575, 630572, 417613, 511896, 627757]
13713F27757m4085J33722j95529A43716L13189m7201r712J0468K22592J00201
13703G33253j07988J03126l23158q8152q0988J44964J69146J20983j514P187j90466
13692D86393k37159K22330L3587p6087K85911J35085q3622l17585J3898J9249
13682D82000B31983M27218j70335j50099K27690o9568B10783O21041k87435j2110
13672E32279k24157J37603q5840M6371l5381L76421B30908K67605A57012L65322
13662E22334l6716B26477P9840m0581K41905j34633E6019L14716K99366B63409
13651A76458K06758K42659k16296P6856J09189k48840A65331M03279k61442q6379
13641B20789r3673K31229J5540L8656j24634J19089l6912m1030L66501C28406
$$ y = [627757, 583672, 717394, 521865, 143716, 456905, 409704, 399992, 410460, 633052, 733253, 625265, 728391, 405233, 317081, 236093, 381057, 550203, 671186, 669672, 676859, 486393, 249234, 471564, 505151, 429064, 714975, 850060, 766438, 448853, 462751, 482000, 231983, 659201, 488866, 338767, 566457, 496889, 210783, 831824, 544389, 532279, 308122, 445725, 359885, 406256, 370875, 747296, 230908, 498513, 157012, 522334, 485618, 226477, 306317, 265736, 507641, 373008, 56019, 370735, 670101, 263409, 176458, 383216, 625875, 409579, 486435, 595624, 346784, 165331, 568610, 307168, 220789, 127116, 358345, 373885, 412541, 287907, 406996, 370084, 329054, 695555, 328406]
13630E86527j88788r946q1803O7467j80214K06726n675j04472J34336k7857K37010
13619F33311A93142J33356k7528M23594A99753O9964K91507A80114K86218C2439
13608E64627k42046K83605B90432A36096K60751A85417J85391P2912A14091L24391
13598D38482L3961j00696m0670r1121Q3284B9138N9427J82759J65047K25297c5873
13586E48816k00087P7115m3450J31391A88677K89496k1737K9248B30066J01403
13576C31469N6540k7597o2687j35337J42439c3584C18360A55353M11275L5566
13566F02194j82765J566K9116j02212K16783F7226L57480j93364H4930o009N42924
13555F21845k71604j61525I1689L29548C6151N9305A7839K37514J8507J02399
$$ y = [586527, 397739, 387793, 305990, 373457, 193243, 399969, 394294, 289822, 424158, 396301, 633311, 193142, 326498, 298970, 722564, 199753, 269717, 561224, 180114, 466332, 32439, 564627, 322581, 606186, 290432, 136096, 396847, 185417, 370808, 443720, 114091, 438482, 472443, 371747, 331077, 239956, 323240, 29138, 88565, 271324, 436371, 661668, -35873, 548816, 348729, 425844, 382394, 513785, 188677, 478173, 456436, 485684, 230066, 331469, 388009, 360412, 297725, 162388, 304827, -33584, 318360, 155353, 566628, 602194, 419429, 420995, 450111, 347899, 564682, 67226, 424706, 231342, 84930, 78921, 621845, 350241, 188716, 91689, 421237, 36151, 95456, 17839, 255353, 273860, 376259]
13545C76259D2862M20080B04522k1583l1757L78922k32983G464d1952B69651J74540
13534D44191C286L00302j0908J11391j67137R1345B9570d8995D50122l1144A41267
13522A45586l011P2996K03964K94252E4857J02235N7669I6143K3257J31298j23014
13511A27684K9716C5800L20349J92744n1495i3211D62527G2882P6935M82270I8975
13499A24763b55624F32694j87836k17876R983K66633A41672J29268O0635j7577
13489C13998p5098J42603C0875d2093A61330J82902j3440A20622J06243J01719
13479C28584j00278p2722J64129Q936A25408J55425H2884J39090b04369B46907
13468B13291K20739A54920C2713R0679b41606B82628I9812M13426c6366B380K76531
$$ y = [376259, 42862, 462942, 204522, 182939, 151182, 530104, 297121, 7464, -41952, 269651, 444191, 3286, 303588, 292680, 404071, 236934, 328279, 29570, -48995, 450122, 418978, 141267, 145586, 142575, 215571, 419535, 713787, 54857, 157092, 214761, 96143, 119400, 250698, 127684, 157400, 35800, 356149, 548893, 497398, -93211, 462527, 72882, 149817, 632087, 98975, 124763, -255624, 632694, 444858, 226982, 236965, 503598, 141672, 270940, 331575, 313998, 238900, 381503, 30875, -42093, 161330, 344232, 330792, 120622, 226865, 328584, 228306, 155584, 319713, 328649, 125408, 280833, 82884, 221974, -204369, 246907, 213291, 434030, 154920, 32713, 123392, -241606, 282628, 99812, 513238, -36366, 2380, 278911]
13457B78911A21801F0756K29182C5393J46998G3925J63524J00293A117K33916
13447B35033R1761N5842j79321d2975l21924I4980K32046A31109E6873L1688L43165
13436D31726J70643d5256C36742j38507i2769D08317K01066k15000a53862C49061
13425C57423b22710C26703h446D7874J11178J77801n9539J50838j83897r6053
13415A48202b5132C71323Q8345B19048r6658J99543c753B42352D9454L3674K05414
13404B88542F3758f8868B35028n8559K11609j64617j8639A00218c8619D57946
13393B73621J8549J81476D9922Q6358n6895A1646Q26b25916C99627A02206L73354
13382D75560B26952b07996b4631A69616A2929K89072L8438h845C29803K7249j47569
$$ y = [278911, 121801, 60756, 289938, 35393, 182391, 73925, 237449, 337742, 1117, 235033, 326794, 382636, 203315, -42975, -364899, 94980, 327026, 131109, 56873, 88561, 431726, 602369, -45256, 336742, 198235, -92769, 408317, 609383, 394383, -153862, 349061, 357423, -222710, 326703, -8446, 47874, 159052, 336853, 277314, 428152, 244255, 148202, -25132, 371323, 459668, 219048, 122390, 321933, -3753, 242352, 49454, 83128, 288542, 63758, -68868, 235028, 176469, 388078, 223461, 204822, 100218, -38619, 457946, 273621, 292170, 473646, 49922, 136280, 79385, 11646, 12472, -225916, 399627, 102206, 475560, 226952, -207996, -24631, 169616, 12929, 302001, 340439, -8845, 329803, 357052, 209483]
13371B09483A00115J56481q2355N5381E4510a1817C24063J33896A88520E9902
13360H0790J23370J05413m1040J36983n6227J93492a00742G6364k056L17903K40084
13349F32295B25936K82581M1116k43388p6601n3361K13459R3203J84224k93874
13339C73295H5395J03224K97194k32414A03885Q1962L75001j73485A50690n4398
13329I6292J38077l5920o9164P7316J6349J12073h0609B86312B4825J04130K6548
13318A55503J42148b56983A39846J40233d4588B96196i3328B66213A18801e8311
13307F5653K56133e4394C65308g7924A66664G0477a6422A33241a91261A09610
13296C50638o3566J9830j09554J16906h5215m1C05189a55415A27820J83155A6484
$$ y = [209483, 100115, 256596, 174241, 229622, 54510, -11817, 324063, 457959, 188520, 59902, 80790, 204160, 309573, 268533, 405516, 349289, 542781, -100742, 76364, 74308, 392211, 632295, 225936, 508517, 549633, 306245, 229644, 176283, 389742, 482945, 667169, 373295, 85395, 188619, 485813, 253399, 103885, 185847, 560848, 387363, 150690, 96292, 234369, 198449, 129285, 206601, 222950, 335023, -80609, 286312, 24825, 128955, 155503, 297651, -256983, 139846, 280079, -44588, 296196, -93328, 266213, 118801, -58311, 65653, 321786, -54394, 365308, -77924, 166664, 70477, -16422, 133241, -191261, 109610, 350638, 287072, 306902, 197348, 314254, -85215, -85256, 305189, -155415, 127820, 310975, 16484]
13284E63980B29653L86517G6074g1413B63407F1733J81008l2604G4196N1785N7076
13273A83057p5618P5424A4988J39351a06167C21659a02013C20521C0157h714B3086
13261i324C04442A8270h4931a3960A22670E7074j9877e6908k58476g8665C48582
13249a436o0278l3016c795j06419A60920Q7899L2604A22133h7741B92048i8723
13237i1517m300C03724F6504a08049a2225I9053J06850n5293j048J01144h3110
13225F1650a71954B67322h1111L7123D5972I120K9794c96750E9078J21427A5153
13213B96626L8062E4279J64813m2717a23883A7144J03995P400K1410i3480j9969
13202a13449F959K50831b4225r4839B85187f2106E2387J82260I0482h3636n398
$$ y = [563980, 229653, 616170, 76074, -71413, 263407, 61733, 242741, 210137, 74196, 125981, 183057, 107439, 182863, 14988, 154339, -106167, 321659, -102013, 320521, 30157, -8714, 23086, -9324, 304442, 18270, -84931, -13960, 122670, 57074, 37197, -56908, -315384, -78665, 348582, -1436, -61714, -94730, -3795, -110214, 160920, 248819, 281423, 122133, -87741, 292048, -98723, -91517, -95817, 303724, 66504, -108049, -12225, 99053, 205903, 150610, 149562, 250706, -83110, 61650, -171954, 267322, -81111, -43988, 45972, 9120, 38914, -396750, 59078, 180505, 15153, 296626, 334688, 54279, 219092, 176375, -123883, 17144, 121139, 128539, 149949, -93480, -113449, 6959, 257790, -24225, -119064, 285187, -62106, 52387, 234647, 90482, -83636, -89034]
13191h9034A89199d2407D11283c0974A77898Q3430r003H8401b15884D63424a98934
13179f0636B74234D4116a55670j64559A61348a85668E9019K42789j48117o3349
13169I0342J3100g6995G6438J10348a19187k13277I0824l5276a6211q9734I2024
13157G6134i7878A74133L11179k22556h1042A09487c8634A74621J62708c26938
13146B8771R1414C2672J99364b90158B8761L80629i739B1124J1893a59471C27938
13134A21087e3496B44778A20371c4527A02132b0769j44706k30071B24931K8502
13124B53433i1584A53608O1911b55763Q4583A69630a3557j04200A54183c87329
13113e6272n1094D21146a29047A80613b88975O3027A42300b17707k03854B25183
$$ y = [-89034, 189199, -42407, 411283, -30974, 177898, 261328, 252325, 88401, -215884, 463424, -198934, -60636, 274234, 44116, -155670, -320229, 161348, -185668, 59019, 301808, 153691, 90342, 103442, -76995, 76438, 186786, -119187, -332464, 90824, 55548, -16211, -105945, 92024, 76134, -97878, 174133, 485312, 262756, -81042, 109487, -38634, 174621, 337329, -326938, 28771, 120185, 32672, 232036, -290158, 28761, 409390, -9739, 21124, 33017, -159471, 327938, 121087, -53496, 244778, 120371, -34527, 102132, -20769, -165475, -395546, 224931, 253433, -91584, 153608, 215519, -255763, -171180, 169630, -13557, -117757, 154183, -387329, -56272, -107366, 421146, -129047, 180613, -288975, -225948, 142300, -217707, -421561, 225183]
13102B79988g4855A66303J85312H5469n712L5712J14106m3438e8134q5096A29228
13090B19100p4727e004E5186a84746B5535J55632D8769a6978C76310J43454A65073
13078B5174b58521a24252B77500f3058A72900j6742L3510n6799J9512A766J95846
13067A97612M4311n6677n6620A6122c3405I4221J83600j24200a83023B69040E2155
13055C28572j39958e8026r8158B86618b21385F116J36867B8969K24913r5601G7009
13043B43215r7696d9055r0525c5731F2530C028c4661B46885D7493a24017B82848
13031A56580G4417b10928B6124b4811B2545K52469J36157a93404A56472J54382
13021C10854c70280B23390K1293J2615K8976a16700A78337J57782r2134j09712
$$ y = [279988, -74855, 166303, 351615, 85469, 79757, 115469, 229575, 186137, -58134, -143230, 129228, 219100, 144373, -5004, 55186, -184746, 25535, 181167, 48769, -16978, 376310, 519764, 165073, 25174, -258521, -124252, 277500, -63058, 172900, 156158, 189668, 132869, 152381, 1766, 197612, 241923, 185246, 128626, 16122, -33405, 94221, 277821, 153621, -183023, 269040, 52155, 328572, 188614, -58026, -156184, 286618, -221385, 6116, 142983, 28969, 253882, 158281, 77009, 243215, 145519, -49055, -139580, -35731, 62530, 3028, -34661, 246885, 47493, -124017, 282848, 156580, 74417, -210928, 26124, -24811, 22545, 275014, 411171, -193404, 156472, 310854, -370280, 223390, 244683, 257298, 286274, -116700, 178337, 336119, 243985, 134273]
13011A34273A3877K11334a90727C63122e8392A24511c4100B8126K997b36955A66401
12999B17788h1129L8954j5583I219J47664p2094e8721B91483C2766O9895J38931
12988B41592C3037c4377H5531O1645a5931A35552O7978I5743h37D2151J83909
12977B26060n9985a99890Q0356D48151k18043d6395E6981O5811l0194a72893E5195
12965A87976J07007a06219A79768R1730H2519R8057a80042D015c5408C060K16973
12954B20033a8352C06704N2795I1867j9788K7813J86857C1499a18910L0657D4752
12942D8993e2443j5031k31524I4303J46255f3433B88339c2199A40799b60643A375
12930b51461B23324f5022G007i3290B74311j00295q3126a06663B20933I3073a70928
$$ y = [134273, 13877, 225211, -190727, 363122, -58392, 124511, -34100, 28126, 31123, -236955, 166401, 217788, -81129, -42175, -57758, 9219, 156883, 84789, -58721, 291483, 32766, 102661, 241592, 33037, -34377, 85531, 147176, -15931, 135552, 203530, 95743, -837, 42151, 226060, 166075, -199890, -119534, 448151, 230108, -46395, 56981, 122792, 92598, -172893, 55195, 187976, 294983, -106219, 179768, 271498, 82519, 180576, -180042, 4015, -35408, 3060, 220033, -18352, 306704, 359499, 91867, 72079, 99892, 286749, 31499, -118910, -88253, 44752, 48993, -52443, -67474, -298998, 94303, 240558, -63433, 288339, -32199, 140799, -260643, 1375, -251461, 223324, -65022, 7007, -93290, 274311, 174016, 90890, -106663, 220933, 93073, -170928]
12918A42908A2509b38096A50019d5121b1223j10054E4211M9474a21102o7707J384
12907a87425N4853H9360j8917J93607j17774b19448b265q3793k11413B63610D9703
12895e6384A12720a52692N8262j20046D8234J82169d0545B07566b41045B24648
12884B89303D56M33841A01599f9815J4744b3051I3O6551c4934A19136f1082m8219
12872a09301L1195A00699L18302a57075j2955D01879c37417B23579i2646G5429
12861I7646a61174n5257F0083Q5669i0725q6935j23171B74093j17529J77305f8877
12849a37837F7739K39180l5372b1753B15624I5519K21089h8747o9445B50980a64267
12837B02942d6629F338a47556c2096a4309A54500D5862b90447E5075d11588I2287
$$ y = [142908, 12509, -238096, 150019, -45121, -21223, -131277, 54211, 103685, -121102, -188809, -187425, -132572, 89360, 70443, 264050, 146276, -219448, -2265, -86058, -297471, 263610, 49703, -56384, 112720, -152692, -94430, -214476, 48234, 230403, -40545, 207566, -241045, 224648, 289303, 456, 434297, 101599, -69815, -55071, -23051, 93, 66644, -34934, 119136, -61082, -109301, -78106, 100699, 419001, -157075, -170030, 401879, -337417, 223579, -92646, 75429, 97646, -161174, -216431, 60083, 145752, -90725, -177660, -300831, 274093, 156564, 333869, -68877, -137837, 67739, 306919, 271547, -21753, 215624, 95519, 316608, -88747, -158192, 250980, -164267, 202942, -46629, 6338, -147556, -32096, -14309, 154500, 45862, -290447, 55075, -411588, 92287]
12825c4614k72673g766l06366A70197l4077C7105K16490A20640N2657a1388D4569
12813a21499l5183b0383A19090d5458m575I4916M775i6634A486K05027I0512a44897
12800A89501b8362C11707H6234a54239A76864l4896J8786K41892a7114j04819
12790a21933B05248L5430c6941F4729g2638c3845E3554a75570D8730b66509a00295
12778a01441B0851a79528A71922b66822e1876A18738a72745f9554B1357a15792
12767B06266B6315K62497j43585c59213H0173M7579a12831B2631K8905a51647
12756A94753a89893B26203M1457E1551f0634j31050A85526a01112l841A18734
12745a25813A14218i277H944J71141J85053A06798c67490H4528K88531h1549l0238
$$ y = [-34614, -307287, -7766, -314132, 170197, 136120, 37105, 253595, 120640, 173297, -11388, 44569, -121499, -156682, -20383, 119090, -45458, -50033, 94916, 99691, -96634, 1486, 206513, 90512, -144897, 189501, -28362, 311707, 86234, -154239, 176864, 141968, 160754, 402646, -17114, -121933, 205248, 240678, -36941, 64729, -72638, -33845, 53554, -175570, 48730, -266509, -100295, -101441, 20851, -179528, 171922, -266822, -51876, 118738, -172745, -69554, 21357, -115792, 206266, 26315, 288812, 145227, -359213, 80173, 127752, -112831, 22631, 51536, -151647, 194753, -189893, 226203, 267660, 51551, -60634, -191684, 185526, -101112, -104953, 118734, -125813, 114218, -9277, 8944, 180085, 365138, 106798, -367490, 84528, 373059, -81549, -111787]
12734a11787H0228b9723p2172A5481d4801A59532B5847R637J02230i0393c5349
12722A19677j0989g5689k03626h3750o0894o4910D33756G9442a88813a4277B42514
12710G195J39882A7894L89726A70166J36098q6388G1779M88899k20851C0039J65479
12699A95518R8356A11725a04294j37536A57091K22705A19218K9387l4757L30521
12689D44369D4222q07J78939G6447d9370A51593a35928A39702K51948a6722d686
12677B38969c3066G5588L27091C1495J32494M6520D7117M084d81115B13766B6792
12665c85663F1257L6950j2199j9478a36942A82358C3983J23261a10342I9803O7720
12654A67523i3436F4928h299A11927m389M8184K1957o7319K1688k8388C9128d8280
$$ y = [-111787, 80228, -29723, -101895, 15481, -44801, 159532, 25847, 35484, 137714, -90393, -35349, 119677, 108688, -75689, -279315, -83750, -144644, -209554, 433756, 79442, -188813, -14277, 242514, 7195, 147077, 17894, 407620, 170166, 306264, 219876, 71779, 560678, 339827, 30039, 195518, 293874, 111725, -104294, -241830, 157091, 379796, 119218, 148605, 113848, 444369, 44222, 43415, 222354, 76447, -49370, 151593, -135928, 139702, 391650, -16722, -4686, 238969, -33066, 75588, 402679, 31495, 163989, 210509, 47117, 51201, -481115, 213766, 26792, -385663, 61257, 98207, 86008, 66530, -136942, 182358, 33983, 157244, -110342, 99803, 167523, -93436, 64928, -8299, 111927, 107538, 155722, 177679, 110360, 132048, 103660, 39128, -48280]
12641a14815C79539h617k77751A45037G2250L57943b6307A85271q2886B0114L42852
12630C62966J56741A83397p5260J40474H5445O8368C397c62414A30729J25068
12620B55797a11476c7908a5994E9659k7681g2549B03852q2082a08764N3864A46053
12608B74755a40697o6624A12253N9367q5703I219L98634B9871a53381k0164A70942
12596B47934J63655C9072c47164I9038D5100J51786C1947g4225B40656q4938m2514
12585A13204M6213G2143N5505k4254B6871J32907d2267F07K22259o3691a12304
12573a50859A76575a90061B11823E3634K0889c93111A7323J13450B7170a74482
12562a91805C26502f556j19856I3397C2275a4101C27055A60198D5727a57819C7119
$$ y = [-114815, 379539, -8617, -286368, 145037, 72250, 430193, -26307, 185271, 102385, 20114, 362966, 519707, 183397, 108137, 248611, 85445, 153813, 3397, -362414, 130729, 255797, -111476, -37908, -15994, 59659, 31978, -72549, 203852, 121770, -108764, -54900, 146053, 274755, -140697, -207321, 112253, 171620, 85917, 9219, 407853, 29871, -153381, -173545, 170942, 247934, 411589, 39072, -347164, 99038, 45100, 196886, 31947, -74225, 240656, 155718, 113204, 159417, 72143, 127648, 103394, 26871, 159778, -42267, 607, 222866, 159175, -112304, -150859, 176575, -190061, 211823, 53634, 74523, -393111, 17323, 130773, 27170, -174482, -191805, 326502, -6556, -126412, 93397, 32275, -14101, 327055, 160198, 45727, -157819, 37119]
12550H9495i2578K7103j6793A01868b18918j03603i8292c9920k2906j90805A18702
12538b5165j51026C58087a75671B56109b67438J09585a7960A89055n2260L76467
12528E13262a24046D1131a5436j01752A76422h9454A36211n8579H724b44301h9729
12516c51041d8801j77025A34822K5478a5087C1163J7432K86386d98513B67568
12505a75033j62042A14773h2497G0260a35040A71470P8558a24951o8811g4495
12494G9485J3082a00175A27311m8944b21840g3545c4575A74145a49414j21336
12484b70750q4733j36350J68661f4234p3521B3608Q4574R1258o9565a25712a3342
12472c09008J05735c8209n2184d4584B36897l7538b72496M9986f8704o4350j48239
$$ y = [89495, -92578, -65475, -82268, 101868, -218918, -322521, -98292, -39920, -62826, -253631, 118702, -25165, -176191, 358087, -175671, 256109, -267438, -157853, -17960, 189055, 136795, 513262, -124046, 41131, -15436, -117188, 176422, -89454, 136211, 77632, 8724, -244301, -89729, -351041, -48801, -225826, 134822, 160300, -15087, 31163, 48595, 334981, -498513, 267568, -175033, -337075, 114773, -82497, 70260, -135040, 171470, 250028, -124951, -193762, -74495, 79485, 92567, -100175, 127311, 78367, -221840, -73545, -34575, 174145, -149414, -270750, -355483, -491833, -323172, -64234, -137755, 23608, 108182, 199440, 129875, -125712, -13342, -309008, -203273, -38209, -90393, -44584, 236897, 199359, -272496, -222510, -68704, -133054, -281293]
12461b81293A56734c61279a0272G7789J69203p2623a25533A17806B7423P9395
12451A06818a94662e9998j8341g80m0956J119M499b400j3411A34866A419J04209
12439A05628N2962F3579c71749F130K610e1754j57925A55319N9322G8939b93818
12427a41541D1052L05944H6851D1628j5522J30805a75761A88632a85545D2016
12416i1165d2256D3032K318Q5465K58310A53804m6061b35624P369B43802b57290
12404B18005K69808b23984A24513a31095c2697l6144A28427c77327B43525b49950
12393B4550a84632A13473d5520r1562A55784B9668J00756F1523a93491k7560A04367
12381a81957g1814K4729D79434b88764A17870J32398a40028A0940A723c11833
$$ y = [-281293, 156734, -361279, -10272, 77789, 246992, 174369, -125533, 117806, 27423, 106818, -194662, -59998, -78339, -780, -41736, -40617, -36118, -2400, -15811, 134866, 1419, 105628, 158590, 63579, -371749, 6130, 8740, -51754, -209679, 155319, 214641, 78939, -293818, -141541, 41052, 346996, 86851, 41628, 26106, 156911, -175761, 188632, -185545, 42016, -91165, -42256, 43032, 45350, 130815, 389125, 153804, 107743, -235624, -228255, 243802, -257290, 218005, 487813, -223984, 124513, -131095, -32697, -68841, 128427, -377327, 243525, -249950, 24550, -184632, 113473, -45520, -137082, 155784, 29668, 130424, 61523, -193491, -221051, 104367, -181957, -71814, -47085, 479434, -288764, 117870, 250268, -140028, 10940, 1723, -311833]
12370d4985E10105D8032E310J05517b64663A43868m6105k9826F618h2080j43719
12359b25799C83258b71614J8791G2950J54531b39387A40348J39617H3794e6893
12348A42923a08789M3082A6696M6961a51450B51573d5683C16834I7377O9089E0408
12336C0936g3221B64071B3382D022Q877Q3147L7002f1021G9395l7579a02459B62782
12323A03201L41445e2207K0993o270C69692H4243B493a63342N0460A60045B8881
12311F5969B0288a19324c0882G1728a28249a4405A73660J201b53570C52999b88225
12299C423K4285J34925d1841J4202j11267c5705r5984A97958f3509l07108b3366
12287A11072a7887j6782C08903j43341m9447R2532K1277c05308f8437j11859g5332
$$ y = [-44985, 510105, 48032, 5310, 110827, -264663, 143868, 97763, 67937, 6618, -82080, -225799, 383258, -271614, -252823, 72950, 227481, -239387, 140348, 279965, 83794, -56893, 142923, -108789, -65707, 16696, 63657, -151450, 251573, -45683, 316834, 97377, 166466, 50408, 30936, -73221, 264071, 23382, 4022, 12899, 96046, 133048, -61021, 79395, 41816, -102459, 262782, 103201, 444646, -52207, -31214, -37484, 369692, 84243, 2493, -163342, -112882, 160045, 28881, 65969, 20288, -119324, -30882, 71728, -128249, -14405, 173660, 174861, -253570, 352999, -288225, 3423, 27708, 162633, -41841, -27639, -138906, -35705, -131689, 197958, -63509, -370617, -23366, 111072, -17887, -34669, 308903, 165562, 116115, 208647, 229924, -305308, -68437, -180296, -75332]
12275g8457A92536a48649A54747D3671K47790A27312a74316C46568b2584A27J94975
12264A95102e6481J8641A63872o2416J00416A4580J66204c5058A02445J2318J82806
12253B97569b02973R1001c935C6625J9176Q7894N3739b7973A69780a34049a4723
12241B41740j10937d0475I527K24591I5114B7723d6843B3853J35588J17748I8157
12229C4339N53541k09971P085A56758J28388n3704R5890J2781H0989l4690f8092
12217B44801R1768B2826L3148c5052A35919K67141A97475G9675L40364A99831
12206E56702A14495E0365K94962b014l42652B84817j24712L24602M5024j87631
12196C42100h9107A30666l3940J29318K19406J55669a06148M7996A9043M07951
$$ y = [-78457, 192536, -148649, 154747, 43671, 291461, 127312, -174316, 346568, -22584, 127, 195102, -56481, -37840, 163872, 101456, 201872, 14580, 180784, -35058, 102445, 114763, 297569, -202973, -111972, -3935, 36625, 55801, 143695, 197434, -27973, 169780, -134049, -14723, 241740, 130803, -40475, 9527, 234118, 95114, 27723, -46843, 23853, 159441, 277189, 98157, 34339, 587880, 377909, 384994, 156758, 285146, 231442, 327332, 340113, 80989, 46299, -68092, 244801, 336569, 22826, 55974, -35052, 135919, 403060, 197475, 79675, 420039, 199831, 556702, 114495, 50365, 345327, -2014, -344666, 284817, 160105, 484707, 529731, 342100, -89107, 130666, 96726, 226044, 445450, 601119, -106148, -58152, 19043, 426994]
12186D26994A41589c531I208b7229B6942b6425A17286D760c10554B164J21428
12175A23592C6213P0538C8764j196N4820J00008i0265l0915I8767L1028P1152
12164B00947H5110L8871J0354A8224d2290C6388L55864A71104B934Q0225K67225
12153C50384j61243M9212C1546J71707J25794c51127A10020B8046J67704a90087
12142D59447b11611A86266a83161D8475J99502a38798e2001G7804g4068k15338
12132b89406f315A86098b9066F861K43512F135a2847q2560A4416L5465j3396N81
12120C7066a57282d5623k31720b4783b366j36347A97030C8949J12816O7501A01598
12108F3162b79082c2893A66656L4609b13330B61814a04246j98398J29375H9154
$$ y = [426994, 141589, -3531, 9208, -27229, 26942, -26425, 117286, 4760, -310554, 2164, 123592, 36213, 106751, 38764, 37568, 92388, 192396, -90265, -121180, 98767, 129795, 200947, 85110, 123981, 134335, 18224, -42290, 36388, 392252, 171104, 2934, 83159, 350384, 189141, 238353, 31546, 203253, 329047, -351127, 110020, 28046, 195750, -190087, 459447, -211611, 186266, -183161, 48475, 247977, -138798, -52001, 77804, -74068, -289406, -6315, 186098, -29066, 6861, 250373, 6135, -12847, -95407, 14416, 49881, 36485, 37066, -157282, -45623, -277343, -24783, -2366, -138713, 197030, 38949, 151765, 219266, 101598, 63162, -279082, -32893, 166656, 201265, -213330, 261814, -104246, -302644, -173269, 89154]
12097a11645B71840c23760b1106B13160b12545g7535C89571E9017a4254p428F6072
12085B0778b34167B2561B814c41995a50568B25432o1755L55250O47679Q96992
12075B063598E12453H5473L3617K0028J8748J22982a73441c708F4124L20050c4236
12063d2582A39844a05300A97564a11415i203C9165J2349f1070j53501H6199h6683
12051D94733A60420c99189A86719b3091l2721k3668C9628A1140f7341E5723d0106
12039D1937a58873l3032j7125b5800N331j5185E2422N9192P501c4394j5590j73682
12027b23666A60177j5349g105I5536p044J39422A02031A3761J48476n7041a55396
12015B99636E0178d4532l06363J04289G7012g0268j43457a2485m8583O713n4163
$$ y = [-111645, 271840, -323760, -21106, 213160, -212545, -77535, 389571, 59017, -14254, -21682, 66072, 20778, -234167, 22561, 2814, -341995, -150568, 225432, 163677, 518927, 1166606, 2063598, 512453, 85473, 119090, 139118, 157866, 280848, -173441, -3708, 64124, 384174, -34236, -42582, 139844, -105300, 197564, -111415, -9203, 39165, 51514, -61070, -214571, 86199, -86683, 494733, 160420, -399189, 186719, -23091, -55812, -79480, 39628, 11140, -67341, 55723, -40106, 41937, -158873, -191905, -209030, -25800, -20469, -35654, 52422, 111614, 119115, -34394, -49984, -223666, 160177, 144828, -7105, 95536, 88492, 227914, 102031, 13761, 162237, 105196, -155396, 299636, 50178, -44532, -350895, -246606, 77012, -70268, -213725, -12485, -61068, -54355, -108518]
12004a08518j22821e0294D5516A8769R2952a60709M078L1794A46141a0763D0649
11992I3148b16683A02262e5662k35163H6303a31516G4848a02586j21503e6579
11981b33825g3834B09432b22970B54116D5612b98481k32203a06852B90339B1581
11970b11056d6245k28809e8058k30673B54670a25591A65372o3534a05277k59624
11960c64901h0572j84828C9617R9986Q0697B6073e14420A74604a59574j45534
11950c05108J09064D6679N6155b6241a1729C19286I5034A1720Q1039O6771O9053
11939B28583a94573B3363c72742a5479A04350a81303k5232a76j90244B01414L06967
11928E08381b36401F0938A0441K3289K85015e0817j4905A00857b76553a18882
$$ y = [-108518, -231339, -50294, 45516, 18769, 111721, -160709, -156631, -124837, 146141, -10763, 40649, 93148, -216683, 102262, -55662, -290825, 86303, -131516, 74848, -102586, -224089, -56579, -233825, -73834, 209432, -222970, 254116, 45612, -298481, -530684, -106852, 290339, 21581, -211056, -46245, -275054, -58058, -288731, 254670, -125591, 165372, 101838, -105277, -364901, -80572, -265400, 39617, 139603, 220300, 26073, -514420, 174604, -159574, -305108, -196044, 46679, 102834, -26241, -11729, 319286, 95034, 11720, 92759, 159530, 228583, -194573, 23363, -372742, -15479, 104350, -181303, -206535, -176, -190420, 201414, 508381, -236401, 60938, 10441, 33730, 318745, -50817, -65722, 100857, -276553, -118882]
11917a41874j1562J0917B07156b3222A06062b36924C03808j33964b64532b7105
11906a13936A90314b25367A27860a48856A89925P6781n0647h8055k0820A33719
11895B21514a99737j81528a84766C6043N3157b2155A43644d19658E3976A1469
11884f11p371n1257p6113B24266d65173A14968a40331B75089b24457r2494j6641
11873c33592b0844j41319j44947F893a20720j06430A35241a37238c8593j90876
11863b29469C76084c23588N9433K188d5306F9921K39151A7510K76945E1371K27623
11852B78994I7115b12685B43642C1188k666a38467j69738C3768K60023A4236a45026
11840b86655e9067I5301M7151N4073p7468a96691c9681D1615J38802i1305j42540
$$ y = [-141874, -153436, -142519, 207156, -23222, 106062, -236924, 303808, 169844, -264532, -27105, -113936, 190314, -225367, 127860, -148856, 189925, 266706, 216059, -88055, -108875, 133719, 221514, -199737, -381265, -184766, 36043, 89200, -22155, 143644, -419658, 53976, 11469, -611, -7982, -59239, -135352, 224266, -465173, 114968, -140331, 275089, -224457, -316951, -333592, -20844, -162163, -307110, 6893, -120720, -227150, 135241, -137238, -38593, -229469, 376084, -323588, -264155, -261967, -45306, 69921, 309072, 17510, 294455, 51371, 278994, 97115, -212685, 243642, 31188, 28522, -138467, -308205, 33768, 293791, 14236, -145026, -286655, -59067, 95301, 142452, 196525, 119057, -196691, -39681, 41615, 180417, -91305, -233845]
11829b33845H7495d1668h600g84r4487K8826n0584D9470a04504j4214C5680a9720
11816d73070a71364d6177A33536d9114m4572A44551a34406j48209A62506h9289
11805a35056A8455J0512J07851c29337a26957C54496b62413A56185B1336e1857
11794b15351B54278f7495l2096j16066D7375K42079A13824C6674K02674d1717
11783h3866k18914A64325B7850J45189b90777E4071L60150k05596J08474b4632
11772b1478k32710B58648a28008p0875a113l47677m678a7583n7384j68530e9958
11760C4071a35631B36885a75532E9159c8139E082a23326a9541C9373b79521D9946
11748C5840c7525k2325G8231a10460j77756c4545k7555a1523k55187B98516j05663
$$ y = [-233845, 87495, -41668, -8600, -784, -95271, -66445, -117029, 49470, -104504, -118718, 35680, -19720, -473070, -171364, -46177, 133536, -49114, -93686, 144551, -134406, -282615, 162506, -89289, -135056, 18455, 28967, 136818, -329337, -126957, 354496, -262413, 156185, 21336, -51857, -215351, 254278, -67495, -99591, -215657, 47375, 289454, 113824, 36674, 239348, -41717, -83866, -302780, 164325, 27850, 173039, -290777, 54071, 414221, 208625, 317099, -24632, -21478, -254188, 258648, -128008, -198883, -1113, -348790, -353468, -17583, -74967, -243497, -59958, 34071, -135631, 236885, -175532, 59159, -38139, 5082, -123326, -19541, 39373, -279521, 49946, 35840, -37525, -59850, 78231, -110460, -288216, -34545, -62100, -11523, -266710, 298516, 192853]
11737A92853F1728R0282c01783f1029k84994B05055a66561j0101j00872B38134
11726a65116A78663a21234B07312o9645c00637a4706C46456c8816D31304a02149
11715b84518H1504a24056B45325A02546a08166l5739D11561b23466I9549j6262
11705H3287a97648m0632D01808j97661f0738p4028L4085L1637j24148D00758j63172
11694B37586c3773l59360C1626a68190j3483B7425Q3604b11789O6501B08114r5566
11683A12548B4107M13655A10584b54414A14171C6750b97860a7495r8765B29926
11672A39066a0166j23026e2387j94287N5837Q6282a2338C9183J4221e0586k29258
11661b79844a19300B16549K0974h5652A72589J91085j40562c302I6103J47617
$$ y = [192853, 61728, 152010, -301783, -61029, -346023, 205055, -166561, -176662, -277534, 238134, -165116, 178663, -121234, 207312, 137667, -300637, -14706, 346456, -38816, 431304, -102149, -284518, 81504, -124056, 245325, 102546, -108166, -143905, 411561, -223466, 99549, 83287, -197648, -238280, 401808, 204147, -60738, -134766, -100681, -69044, -193192, 400758, 237586, -33773, -393133, 31626, -168190, -181673, 27425, 111029, -211789, -145288, 208114, 112548, 24107, 437762, 110584, -254414, 114171, 36750, -297860, -17495, -116260, 229926, 139066, -10166, -133192, -52387, -246674, -190837, -104555, -12338, 39183, 53404, -50586, -279844, -119300, 216549, 237523, -85652, 172589, 363674, 223112, -3302, 96103, 243720]
11651B43720H8948f8321G5032P2518c78450C86521A01583O7214G3386a12862B48179
11639C43847E2027a16452o2847k797A58263a29878A98706o0204P6158a10609k0602
11628a31211j8614f569F9270J59868b004C5278J65289c2137L52H4256c3899j16747
11616a50646a5294A73540g7805A63272d9646B02417G8435a55291p321a1240k41470
11605b52710A45711B4167a61857K2329A55022b52368M6080C151h4152q00C34868
11593C0537M38758A50726B9159r234N7586L412E154K03358a64094A59890g2720
11581C7545b67768E1344Q2624a18965a6004G3948f5308l5678c4728B86387E1110
11569A2284J68705a91597K8201c5792A33769p076i0123b780k11908F8537Q7916
$$ y = [243720, 88948, -68321, 75032, 147550, -378450, 386521, 101583, 168797, 73386, -112862, 248179, 343847, 52027, -116452, -179299, -182096, 158263, -129878, 198706, 138502, 214660, -110609, -131211, -149825, -6569, 69270, 229138, -2004, 35278, 200567, -32137, -31785, 84256, -33899, -150646, -15294, 173540, -77805, 163272, -49646, 202417, 78435, -155291, -162612, -11240, -252710, 145711, 24167, -161857, -139528, 155022, -252368, -206288, 3151, -84152, -84952, 334868, 30537, 469295, 150726, 29159, 19925, 77511, 80923, 5154, 208512, -164094, 159890, -72720, 37545, -267768, 51344, 133968, -118965, -16004, 73948, -65308, -100986, -34728, 286387, 51110, 12284, 180989, -191597, -163396, -35792, 133769, 126693, -90123, -2780, -214688, 68537, 156453]
11558A56453i9228M4708j53841B79654i5238k8879A46943N6395J04217E3933b49886
11546e8654n5063A85843A254K98230p5096H1060C1764N6720e7052B85472A07691
11534A7479J34505B9547L50234L7304B04494l8188p7176J26271A2146f6632B21673
11522I4885B95J62290h015o72o061m9262A58314p0100m2337I308b48734B79673
11509B62634a61446C98699D1223K68241g710A80468A9009K27671i232C08558A6438
11497A25761J7083m4507B8182L3127c4590A66115b4567D00205A99643n7715P9243
11486B21171a3933j68770D14659A48117m0252i3602j57154B891Q4642Q6074J3996
11475A87603M2015b1092G495Q166L2121a88476c3017B28265J39051j54155N970
$$ y = [156453, -99228, -54520, -208361, 279654, -95238, -124117, 146943, 203338, 307555, 53933, -249886, -58654, -113717, 185843, 1254, 299484, 224388, 81060, 31764, 88484, -57052, 285472, 107691, 17479, 151984, 29547, 379781, 417085, 204494, 166306, 89130, 215401, 12146, -66632, 221673, 94885, 295, 162585, -8015, -8687, -14748, -64010, 158314, 88214, 45877, 9308, -248734, 279673, 262634, -161446, 398699, 41223, 309464, -7710, 180468, 19009, 246680, -9232, 308558, 16438, 125761, 142844, 98337, 28182, 61309, -34590, 166115, -24567, 400205, 199643, 141928, 221171, -13933, -182703, 414659, 148117, 107865, -93602, -250756, 2891, 87533, 173607, 187603, 229618, -21092, 7495, 15661, 47782, -188476, -33017, 228265, 367316, 213161, 219131]
11464B19131N171m8967J62239g8982c6194j29056n9360F1788c4253B48686n2139
11453A96547K11761A6092J49386h9428c1737A0792R6672a2415q5383q788A07399
11441b49614B79161q1018a95982g2206k75389J23839j26869b3996B18073a38953
11430H2612b27711j1005A8953f1726B984b49996b6667r4049A12930a03604C9752
11418H0859l5734B1893J10121L8355b37652o4456c2408j67757A59197a56989d8004
11406F3932K72750A11665c02721J38265O026A40100h8683l1512K0317C81479f6581
11394b7926B01688B2049a1844j34983k96330b3921l9650K0275k16300A885a82150
11382A1124J22096a37352L1547C20055b38561b6552I9463a3248r6122B1581M3645
$$ y = [219131, 224302, 175335, 337574, -78982, -36194, -165250, -224610, 61788, -34253, 248686, 196547, 408308, 16092, 165478, -89428, -31737, 10792, 107464, -12415, -97798, -106586, 107399, -249614, 279161, 198143, -195982, -72206, -347595, -223756, -350625, -23996, 218073, -138953, 82612, -227711, -238716, 18953, -61726, 2984, -249996, -26667, -120716, 112930, -103604, 39752, 80859, 45125, 21893, 132014, 170369, -237652, -302108, -32408, -200165, 159197, -156989, -48004, 63932, 336682, 111665, -302721, -164456, -158430, 140100, -88683, -120195, -99878, 381479, -66581, -27926, 201688, 22049, -11844, -146827, -443157, -23921, -63571, -43296, -259596, 1885, -182150, 11124, 133220, -137352, -105805, 320055, -238561, -26552, 99463, -13248, -109370, 21581, 65226]
11371F5226R2060F0518n856a47891A24674m6648d0533B57958A15725J08980b59861
11359e8483E5201j605J28927d64209a95666B11631c99977A7604K01790E4546e2991
11347H8252e2993D4883K6203a1079A92464C1405a22068b1611j45707o4603A58219
11335D8676L4698a51996N8551a0164p2347B37117a26751d6755a7430A86010H9933
11323A54853c9844B71252A193c7966A4106b00828I7851m0176Q7757c2601k6601
11312e9202A27732i7141B35982E8820a92761R1293G7270f0033K0602a3649I1743
11300F1327b82420B66098I5280b58086b2463k89732a17409H207h6426n2200m3219
11289a81845d8677m7003c1169o3006A69750N3557h6211K9482j3845B35617H7391
$$ y = [65226, 157286, 60518, 54662, -147891, 124674, 78026, -40533, 257958, 115725, 224705, -259861, -58483, 55201, 53596, 182523, -464209, -195666, 211631, -399977, 17604, 219394, 54546, -52991, 88252, -52993, 44883, 71086, -11079, 192464, 31405, -122068, -21611, -167318, -231921, 158219, 48676, 83374, -151996, -93445, -10164, -82511, 237117, -126751, -46755, -17430, 186010, 89933, 154853, -39844, 271252, 1193, -37966, 14106, -200828, 97851, 57675, 145432, -32601, -59202, 127732, -97141, 235982, 58820, -192761, -101468, 77270, -60033, -39431, -13649, 91743, 61327, -282420, 266098, 95280, -258086, -22463, -312195, -117409, 8207, -86426, -138626, -181845, -48677, -95680, -31169, -94175, 169750, 223307, -86211, -56729, -70574, 235617, 87391]
11277b26978a11891k06041a44149L6763j7122l6314f2198q5124r9403A52942c6776
11265B19666I1922a05838C54794a83642M3102H5566C0144c2363l44323a19819
11254c21233A88525A9423i2987E3455a4808j53839C95072I4319a30164j7227M8778
11243i8613q1093o6537F9293a24427N4602E9257J09986G4713c0329A13552d06221
11231b18951M1205H255c54601D2118j5725J43523F8834d2823j43375H0835C1476
11219F8257i3985p6275o4263F6853J35636b28318R6272A14495a40794k16235D457
11207a98969k1329m4387d2012j51591L3138j26544b8299A15890B0757B94a15183
11195a44170A1637b29312d174E6438c55494a01235B00328c31011d0846n9681p2219
$$ y = [-226978, -111891, -317932, -144149, -107386, -124508, -160822, -62198, -147322, -246725, 152942, -36776, 219666, 91922, -105838, 354794, -183642, -140540, 85566, 30144, -32363, -376686, -119819, -321233, 188525, 19423, -92987, 53455, -14808, -168647, 395072, 94319, -130164, -147391, -98613, -179706, -246243, 69293, -124427, -69825, 59257, 169243, 74713, -30329, 113552, -406221, -218951, -177746, 8255, -354601, 42118, 26393, 169916, 68834, -42823, -186198, 80835, 31476, 68257, -93985, -170260, -234523, 66853, 202489, -228318, -132046, 114495, -140794, -357029, 4457, -198969, -220298, -264685, -42012, -193603, -160465, -287009, -28299, 115890, 20757, 294, -115183, -144170, 11637, -229312, -4174, 56438, -355494, -101235, 200328, -331011, -40846, -100527, -172746]
11184a72746L4212o6375C71117E3102L28911a81998j2711C7789b20894J2124B53939
11172D10312j91141a75423j59202A78051h9554k57179B02090F2477K34575a6881
11161h2221B64329h7110L7748k1352B4793J97707e1941k8261j756E5331A2340
11149A33215a53694B90977i2470k5781k67694a01940I5760h0701k5015A16408
11138a20065a0235k2218D3085J9314a28280A8980b88014G0945K24615j30569J83413
11127C48404i988j58949E015R0777J66315b6180o6692b3123A9731a19112b3522
11115b65911E3266e1882B55824j13671e5587b2235o0668f880C65546H0314E545
11103B56133C7183M59090A23798L31793j77094E1437P0197K76760A27566N4869
$$ y = [-172746, -138534, -204909, 371117, 53102, 382013, -181998, -194709, 37789, -220894, -208770, 253939, 410312, 219171, -175423, -334625, 178051, -89554, -346733, 202090, 62477, 297052, -16881, -82221, 264329, -87110, -49362, -70714, 24793, 222500, -51941, -80202, -81958, 55331, 12340, 133215, -153694, 290977, -92470, -118251, -385945, -101940, 95760, -80701, -105716, 116408, -120065, -10235, -32453, 43085, 62399, -128280, 18980, -288014, 70945, 295560, 164991, 348404, -9988, -168937, 5015, 95792, 262107, -26180, -92872, -23123, 19731, -119112, -23522, -265911, 53266, -51882, 255824, 142153, -55587, -22235, -82903, -6880, 365546, 80314, 5545, 256133, 37183, 496273, 123798, 455591, 278497, 51437, 121634, 398394, 127566, 182435]
11093A82435R4226J52940j53941m7112j12462L1522L12063j30125h4349j36984
11083b21333B53457O5479k0094j6675P8542Q6564q0822j82640K91976j9299j44042
11072C12446K82728A37871m5068L59410P2060M4741B51041F8541J76737K4307
11062B69585K73147j71152M1385J62393q2026J43740j66094K00403P9413l50819
11052C99975J79006J56712J93519J66272m29721N02K7110m9609L38686k43820
11042G38632K34072l41260J75275j45845l5933J18814J4604k21472M9769K88940
11032H75596k38017J138L84868D21074K94137C41401O84069j36860k36685k19988
11022D31937P1407j1696L6052R8994o7589Q4879K05249j25393J78245m39125K6844
$$ y = [182435, 276661, 429601, 275660, 228548, 116086, 147608, 459671, 329546, -84349, -221333, 253457, 318936, 298842, 282167, 360709, 447273, 366451, 183811, 475787, 456488, 312446, 595174, 137871, 92803, 452213, 524273, 569014, 251041, 68541, 245278, 269585, 542732, 371580, 412965, 575358, 493332, 637072, 470978, 671381, 750794, 399975, 578981, 735693, 929212, 1095484, 665763, 666265, 693375, 643766, 982452, 738632, 972704, 631444, 806719, 660874, 624941, 743755, 758359, 536887, 586656, 875596, 637579, 638717, 1023585, 421074, 715211, 341401, 1025470, 888610, 651925, 431937, 503344, 491648, 527700, 626694, 559105, 643984, 849233, 723840, 902085, 462960, 489804]
11011D89804M0324J30313p0173k65883M31315l69154L87125B93037k5742K48890
11001E16185L7083J07382O2830j08855j65564R6764j12595j92632P17496R1350
10991A049444j14791j96881j24759k01403L77335J18041k02333K09159J28473
10982A042285m7171N7191K46718l0149J749M28038M1142K36141N18733N3492Q4794
10971B632963k08081L48186j22395j98245k25839l4773q4145n99101j03980J52765
10961A557355J40215J31244R8088j79509L36920m47461L79065o47761l11869R2863
10951A149150J04554k68528k83851J50437j57339k87497c8266D59181A35064J61783
10941B96847A31340d4831D35744a17050B48078n8208b15832a6458I9272m872b79231
$$ y = [489804, 530128, 660441, 590268, 324385, 755700, 386546, 773671, 293037, 267295, 516185, 553268, 660650, 723480, 614625, 449061, 545825, 433230, 240598, 958094, 1049444, 934653, 737772, 613013, 411610, 788945, 906986, 704653, 913812, 1042285, 995114, 1052305, 1299023, 1268874, 1270623, 1698661, 1739803, 1975944, 2494677, 2548169, 2632963, 2424882, 2773068, 2650673, 2452428, 2226589, 2191816, 2107671, 1508570, 1404590, 1557355, 1697570, 1828814, 1926902, 1747393, 2084313, 1636852, 2015917, 1368156, 1056287, 1149150, 1253704, 985176, 701325, 851762, 694423, 406926, -38266, 459181, 135064, 296847, 131340, -44831, 435744, -117050, 248078, 189870, -215832, -16458, 99272, 94400, -279231]
10929I7128K21424B4290J93937a9484G1310c4830j92384f1070A5149c64398a34746
10917I1027k3652c02238e1723D37013a39116A52089a69559H7943C0357J65670
10907A96027K7741b09973i7144A41251b17511g4764I34a22857E48075e0753A39907
10895a28865A45728m9150a15829D2402L8372b09467R624A31407e3585H8352h3352
10883b59114B1727i1517B23910b47693I5412p521d2697n5476E774K39653b92089
10871I9951a5964G6796a34507C24709A42412j3806E4016a02090b8006j53536k1690
10860b03232C94117B9942g795A25664f6037J2881A19495c239p5023B83417b06816
10848A99681a90596j14191c5538C73832a64036H2548i293A64956c40477a09458
$$ y = [97128, 318552, 24290, 218227, -19484, 71310, -34830, -227214, -61070, 15149, -364398, -134746, 91027, 67375, -302238, -51723, 437013, -139116, 152089, -169559, 87943, 30357, 196027, 223768, -209973, -97144, 141251, -217511, -74764, 934, -122857, 548075, -50753, 139907, -128865, 145728, 96578, -115829, 42402, 80774, -209467, -199843, 131407, -53585, 88352, -83352, -259114, 21727, -91517, 223910, -247693, 95412, 87891, -42697, -98173, 5774, 245427, -292089, 99951, -15964, 76796, -134507, 324709, 142412, 128606, 54016, -102090, -28006, -181542, -203232, 394117, 29942, -7795, 125664, -66037, -53156, 119495, -3239, -78262, 283417, -206816, 199681, -190596, -304787, -35538, 373832, -164036, 82548, -9293, 164956, -340477, -109458]
10837e5171p2674H9786J1920b35919E5480k3444a94208A80507i6885E9519a04614
10825H4335d0690A53222b87183K6101i7455P943A51055o7594N1104Q1255b47753
10813a49472f8442a4672B06463C3263O3879l280J33908a78550j04026M8894i4117
10801a13264l8008C43848a58874H0908g5009o9382d1699A77526G2124d3414J8585
10790b4829r163I0714e2845A84760J64247n4197l7013P6626a31546B585d3653
10778b20547A79656a12778o3271O3046e3506j97769B94452a20475C07746C2701
10767B43776k2298a52005p6153a6194C86601j75941B4805a92616B17968j5058
10757B02910N8345a8746D09885A42204K37633G4161H811b02919A23689k1710a46215
$$ y = [-55171, -127845, 89786, 101706, -235919, 55480, 32036, -194208, 180507, -96885, 59519, -104614, 84335, -40690, 153222, -287183, -261082, -97455, -89512, 151055, 83461, 134565, 215820, -247753, -149472, -68442, -14672, 206463, 33263, 97142, 93862, 227770, -178550, -282576, -233682, -94117, -113264, -151272, 343848, -158874, 80908, -75009, -144391, -41699, 177526, 72124, -43414, -24829, -33992, 90714, -52845, 184760, 349007, 294810, 257797, 334423, -131546, 2585, -43653, -220547, 179656, -112778, -176049, -113003, -53506, -251275, 294452, -120475, 307746, 32701, 243776, 221478, -152005, -228158, -16194, 386601, 210660, 24805, -192616, 217968, 202910, 261255, -18746, 409885, 142204, 379837, 74161, 8811, -202919, 123689, 101979, -146215]
10745A27517d6549B3960a30350D1177A4551J61251p409d3191A27578H465M5110
10734E3575K33508a19871n41082a11909q6651J0439f2822B12117c24912A95407
10723A0521A177K7136J21047N6250a30827I9030K7215a83350B77531a07711k07518
10712c15229j63961J51161A10279b7385j15884C2992e4722D8503f5565k14084
10702b79649Q2498F8515a67919h3201j73871J08355A0954a4117n1771a1742C67913
10690a52801l9051D1548f1616H4545b20807A35349B2859J28348b14252j12696
10680c26948a57370A14952b57028L3091a9727k27974A4089M01261A7533a00141
10669B8477J87563c3975o7363m3107n4741A70947K9271f123k12111a05705C063
$$ y = [127517, -46549, 23960, -130350, 41177, 14551, 175802, 168393, -43191, 127578, 8465, 53575, 287083, -119871, -660953, -111909, -198560, -188121, -62822, 212117, -324912, 195407, 10521, 1177, 28313, 149360, 205610, -130827, 99030, 126245, -183350, 277531, -107711, -315229, -479190, -328029, 110279, -27385, -143269, 32992, -54722, 48503, -65565, -279649, -197151, 68515, -167919, -83201, -257072, -148717, 10954, -14117, -65888, -11742, 367913, -152801, -191852, 41548, -61616, 84545, -220807, 135349, 22859, 151207, -214252, -326948, -157370, 114952, -257028, -223937, -19727, -247701, 14089, 415350, 17533, -100141, 28477, 216040, -33975, -101338, -144445, -199186, 170947, 200218, -6123, -218234, -105705, 3063]
10657B12929c90753F5179d8599k73132C9603R0578R6317l5560F7083b8233B588
10645A5766R5088j4999B1628J50738C272N0608c25924A30670d61899I6694f3106
10633b36346B18386e7117j18872k67923J54870j06702C30073n3849A31993n9297
10623G2696b89749a32616k77282a38481F538a81224N4675A20082a91688b0701
10612g9135k25352J47033I9848f9709B07034B1174R8724L0719a00066C35040a48074
10600a69301I2111b32302b9812j54441j36107a321B18074n1145b35206N7247C24225
10588b68134j19419C4324a55643N2934r4573K4859A67522A600h771p9537a6562
10576B19840B1423a6299q4585F2563a92266Q55N4982d2481k55809R2207d6226
$$ y = [212929, -390753, 65179, -48599, -321731, 39603, 130181, 226498, 190938, 67083, -28233, 2588, 15766, 110854, 95855, 21628, 172366, 3272, 53880, -325924, 130670, -461899, 96694, -63106, -236346, 218386, -57117, -175989, -443912, -289042, -395744, 330073, 276224, 131993, 72696, -289749, -132616, -409898, -138481, 6538, -181224, -126549, 120082, -191688, -20701, -79135, -304487, -157454, 99848, -69709, 207034, 21174, 119898, 150617, -100066, 335040, -148074, -169301, 92111, -232302, -29812, -184253, -320360, -1321, 218074, 166929, -235206, -177959, 324225, -268134, -387553, 34324, -155643, -102709, -197282, -172423, 167522, 1600, -8771, -88308, -16562, 219840, 21423, -16299, -100884, 62563, -192266, -191411, -136429, -42481, -298290, -206083, -46226]
10564A47426J20814a72321H1396K15374E2546b2241A28028a02580p1260e2462
10553a05495E4067K4008e4058j8264j85354G3511a19636F6050i023l7598B10356
10541A51131f3852A92372F3810g9466j06902q8621j34100A05257a25037j41019
10531b66056l8124a09907A51698B1888b47244B39987b56218J21382A25323a35619
10520B70423I200J80424b00138A73726K64519c5063J1324k99648J16441P3254
10510a33692k16410A23175a23495A29389d2618j3996l16405J81038O9137L3650
10500h9194j05773a0108B3355J5892c11603c7735l0657l4539K2632A01360a02434
10488a14221H196L48887b3054A17526e6978j90628E18852A42680C7549L76513
$$ y = [147426, 268240, -172321, 81396, 296770, 52546, -22241, 128028, -102580, -173840, -52462, -105495, 54067, 78075, -54058, -72322, -257676, 73511, -119636, 66050, -9023, -46621, 210356, 151131, -63852, 192372, 63810, -79466, -186368, -274989, -409089, 105257, -125037, -266056, -304180, -109907, 151698, 21888, -247244, 239987, -256218, -134836, 125323, -135619, 270423, 9200, 189624, -200138, 173726, 438245, -35063, -23739, -323387, -206946, -133692, -350102, 123175, -123495, 129389, -42618, -56614, -373019, -191981, -122844, -89194, -194967, -10108, 23355, 39247, -311603, -37735, -68392, -102931, -80299, 101360, -102434, -114221, 8196, 357083, -23054, 117526, -56978, -247606, 518852, 142680, 37549, 414062]
10478D14062j76124O6301l488J66057b74606R6017A32948b994m9490o6280A81509
10466A52206e8575m102k39055F373c15075A6804c18976c5833j93940e338B22015
10454b92586I4400d10286B37700c67296P5768c3369o3593j2188r278E1152P8906
10443A30058C4198e4799A58447a41772J3934K2254r3821N1799B13616C8619b64021
10431g0857j6532A06539k5640b04871O3697D275b89977a38517I6768O0620a31127
10419c60632b2169B66270B3246J37907l8263i8117B10079o986r8568J55695d2425
10407H7001f7217k08237a33578J7229C37271a5173j95131C12499m9549B5645f3410
10395D5582K30716a44435P25A01136c251I6741K2283O6572L97814B08554a96647
$$ y = [414062, 237938, 304239, 300751, 466808, -274606, -178589, 132948, -2994, -52484, -118764, 181509, 152206, -58575, -62677, -301732, 6373, -315075, 16804, -318976, -35833, -229773, -5338, 222015, -292586, 94400, -410286, 237700, -367296, -291528, -33369, -96962, -109150, -118428, 51152, 130058, 34198, -54799, 158447, -141772, -127838, -105584, -199405, -147606, 213616, 38619, -264021, -70857, -87389, 106539, 80899, -204871, -141174, 4275, -289977, -138517, 96768, 157388, -131127, -360632, -22169, 266270, 23246, 161153, 122890, -98117, 210079, 203093, 104525, 260220, -42425, 87001, -67217, -275454, -133578, -116349, 337271, -15173, -210304, 312499, 262950, 25645, -63410, 45582, 276298, -144435, -143710, 101136, -3251, 96741, 119024, 185596, 583410, 208554, -196647]
10383A61124b9674B3806b14335H0642J77005Q1491C2779K33767G5481A9226L58057
10372C77283j22958J04735r6495K33964A81059J59344m5581m0868H8063k0761
10362F7302J14999N5309M6289J21518A17572L9623J62142c3986E38463B40840
10351B82915K63604k35557M01060j79840L7448E6024K80487A07113L19400P558
10341D34071j11640A34569J30987N0272Q3912j33260j14134J28411J93944A10717
10330C20512i9076l4294A90019O3555M233B1786b24233F511P5101b17571E79291
10318D92978e553C28776c6147l9496H5966l6007K5010d64427c3297k11778n7512
10307c02587a34881C5667Q2836a79807H9723M1137a00923a3246B03417B0314J6553
$$ y = [161124, -29674, 23806, -214335, 80642, 257647, 339138, 32779, 266546, 75481, 19226, 377283, 254325, 359060, 262565, 496529, 181059, 340403, 294822, 253954, 88063, 67302, 182301, 237610, 283899, 405417, 117572, 157195, 319337, -33986, 538463, 240840, 282915, 546519, 310962, 712022, 532182, 569630, 56024, 336511, 107113, 426513, 434071, 322431, 134569, 265556, 315828, 399740, 266480, 152346, 280757, 474701, 110717, 320512, -99076, -133370, 190019, 253574, 257807, 21786, -224233, 6511, 81612, -217571, 579291, 492978, -5553, 328776, -36147, -75643, 85966, 49959, 74969, -464427, -33297, -245075, -302587, -134881, 35667, 118503, -179807, 89723, 130860, -100923, -13246, 203417, 20314, 36867]
10296C6867e2131k14137B47202i3795o1570C6486a7674C2435K06198a689D1415
10284c8007A94927a68098A56147e0932B83847a06708L4369j7904A5970b81304
10273a34031A19789P2724a85609B08175a08074L5366L0948j8429k15807A8305
10262E13041b31852D3686K40264l9483J75427j86628L30417D8350K06661g7973
10251F0207J92876b09849E0252e7506l64836a87577j1605j65033a67944H6458
10240B35440d899A34334K3501a4854k46798a03301A11819D9848a43788A8394K4944
10229D3338b04969Q2947j41033a15612c4241f873j57322e045j9989j78271j38622
10218c41927a34144j15217E5646M345d435q3326j94323k28478A10457A0912a1923
$$ y = [36867, -52131, -266268, 247202, -93795, -155365, 36486, -17674, 32435, 238633, -1689, 41415, -38007, 194927, -168098, 156147, -50932, 283847, -106708, -72339, -90243, 15970, -281304, -134031, 119789, 192513, -185609, 208175, -108074, -72708, -41760, -60189, -275996, 18305, 513041, -231852, 43686, 283950, 244467, 419894, 233266, 563683, 48350, 255011, -77973, 60207, 253083, -209849, 50252, -57506, -422342, -187577, -199182, -364215, -167944, 86458, 235440, -4899, 134334, 157835, -14854, -261652, -103301, 111819, 49848, -143788, 18394, 43338, -204969, -122022, -263055, -115612, -34241, -6873, -164195, -5045, -25034, -203305, -341927, -134144, -249361, 55646, 59991, -4435, -87761, -282084, -510562, 110457, 10912, -11923]
10206a50554d2994A15371J22274b17098j31238B31741c72898a34548D2833j1448
10196C1385J53414H2863J27779a15661K5845j9194B30102a96412M6663A53339
10185e200j98830Q2343c1811A34197b64733p5452J41737L6673J2849d6874B44045
10173A52230J7975k137J693A7976a17299j7802A83970F10b87219H9373f2644k09292
10161b71936Q2290C83459b34626C12606b38482j84222a59255p142q6860c0112
10150F6334b76404G2634a68766j60617a07378L5682B65985h3851R730j22709A60018
10138g8501G1880a30227O1074C9317L8175F933J00894a03981M200I1729k4996
10127F6733j4266b06221A56088a47892j03658N6533o8831c1654A49132b4491A70771
$$ y = [-150554, -42994, 115371, 237645, -217098, -348336, 231741, -372898, -134548, 42833, 31385, 184799, 82863, 210642, -115661, -89816, -109010, 230102, -196412, -149749, 153339, -5200, -204030, -121687, -31811, 134197, -264733, -340185, -198448, -161775, -148926, -46874, 244045, 152230, 170205, 168068, 169761, 17976, -117299, -135101, 183970, 610, -287219, 89373, -62644, -271936, -189646, 383459, -234626, 312606, -238482, -422704, -159255, -166397, -253257, -30112, 66334, -276404, 72634, -168766, -329383, -107378, -71696, 265985, -83851, -74121, -196830, 160018, -78501, 71880, -130227, -69153, 39317, 77492, 6933, 107827, -103981, -99781, 91729, 66733, 52467, -206221, 156088, -147892, -251550, -195017, -263848, -31654, 149132, -24491, 170771]
10115b22490j86767a1737E34926G2892a90758d0674e206A65200c068B97888A26911
10103a9575p4439A05831R9735D3798a56317I353L12214A5837O4638a31805E2722
10091B8868i9606c3389k7382l69276N4266d5445k89358j52156K03599a05848k58542
10080c64390B05283c21500a26294E0438c9397J0369A46210A0245b65597k3042
10070b88639A76641m6970i1801Q058a4056A55065L0468e0478j82139b4593D54599
10058b33912E0189L6717b10038m926A73707a45708o9266e0457k3976B21242a82375
10046a35430c0300m2169q9638q1811l9983d4518j03235A18442b03644A08175b84897
10034F0199R7814k9183b25622C00102a98952C09535J29810b05723R2098B59141
$$ y = [-222490, -409257, -11737, 534926, 72892, -190758, -40674, -5206, 165200, -3068, 297888, 126911, -19575, -94014, 105831, 205566, 43798, -156317, 9353, 321567, 15837, 80475, -131805, 52722, 28868, -99606, -33389, -60771, -430047, -375781, -45445, -334803, -486959, -283360, -105848, -364390, 205283, -321500, -126294, 50438, -39397, -29028, 146210, 10245, -265597, -288639, 176641, 129671, -91801, -83743, -14056, 155065, 185533, -50478, -232617, -24593, 454599, -233912, 50189, 86906, -210038, -214964, 173707, -145708, -214974, -50457, -74433, 221242, -182375, -135430, -30300, -72469, -162107, -243918, -283901, -44518, -147753, 118442, -203644, 108175, -284897, 60199, 158013, 128830, -225622, 300102, -198952, 309535, 439345, -205723, -113625, 259141]
10023b83585D3344b48881A42304c6744k03255B48538l4137b62046L2014B26929
10012I9053a14289A66738c0902k97875B18586E3349a10835D8307r935a79909B4936
10000a67819j47894B00625g7259O102G6152b76500A68057a59322k89844H7257
9989d43798i956B7641L5852L04446b53280J24776J2993j01712D29a53867l1646
9978a85513p8098I3105P537a41460l7768j08662A55774G5775b66833J6378A10270
9966e2733A3331b51099i3322H3798L08510D0347a23503L4937I6298b42927N3307
9955a89620R3425k9319A64783e8429A99634d6723A39813B5367a36568d5316A73164
9943a89743q4338n2730D1380E664a62521D3142Q1103J61317I9610a04430G8b16231
$$ y = [-283585, 43344, -248881, 142304, -36744, -239999, 248538, 214401, -262046, -230032, 226929, 99053, -114289, 166738, -30902, -328777, 218586, 53349, -110835, 48307, 38372, -179909, 24936, -167819, -315713, 200625, -77259, -71157, 76152, -276500, 168057, -159322, -449166, 87257, -443798, -9956, 27641, 63493, 367939, -253280, -128504, -115511, -217223, 429, -153867, -185513, -263611, 93105, 100642, -141460, -179228, -287890, 155774, 75775, -266833, -250455, 110270, -52733, 13331, -251099, -93322, 83798, 392308, 40347, -123503, -88566, 96298, -242927, -189620, -96195, -125514, 164783, -58429, 199634, -46723, 139813, 25367, -136568, -45316, 173164, -189743, -274081, -326811, 41380, 5664, -162521, 43142, 124245, 285562, 99610, -104430, 78, -216231]
9930a21279j13170D58538E811g2038b193A97277f4259k31104C3903N2085g1640
9918c10276J39407B10122a29019j83621a12172M325k64148J15105n9835a01709
9907f1201r7149k15587A09817C8022a49317m4177j69818K3474a45867E6636M62749
9896E19385c01882N1583q1641B40612a02709I3255M255M6562b1425p4107q4730
9885a80262d1378C41313c1524j86437P6033e9567C89603b42229R9870A85039o2120
9874A22919h3808C2874a56543B40761b40507f6456j09415b57l2401k44417g7928
9862a99510A21872A1134J76808c6975o6743j8884C03199b13104a5547j32567k02894
9851c51008A39939A7516b23111D2216c42976a36308b6786j01727A87995a95782
$$ y = [-121279, -234449, 458538, 5811, -72038, -2193, 197277, -64259, -295363, 33903, 85988, -71640, -310276, -170869, 210122, -129019, -312640, -112172, -107847, -371995, -256890, -316725, -101709, -61201, -158350, -373937, 109817, 38022, -149317, -193494, -363312, -339838, -145867, 56636, 519385, -301882, -250299, -331940, 240612, -102709, 93255, 97510, 144072, -21425, -95532, -180262, -41378, 341313, -31524, -217961, -141928, -59567, 389603, -242229, -142359, 185039, 122919, -83808, 32874, -156543, 240761, -240507, -66456, -175871, -257, -32658, -277075, -77928, -199510, 121872, 11134, 187942, -36975, -103718, -122602, 303199, -213104, -15547, -148114, -351008, 139939, 17516, -223111, 42216, -342976, -136308, -26786, -128513, 187995, -195782]
9840b5354m8570j8161L1419E7438a10226d1504A37829A4809K70970H3078J17483
9829B00561b10059B44013f8865B49291a57999q7699A48254n7666b85972P6695
9819b09277Q8778F8900h5757j66361j99182a12331k38851P8009a9301A13185J92965
9808C06150M8232H8521b17462I4002a19103j29413a07524A14278c25780j6199
9798c41979J29043i9981k75358G8934J03363c9374j37180j1135b1804j30845b1319
9786D1542b19582A25061c5702k83932R252i4862p0700d0202n9939b3809l7033
9775f0842j09774o3481n6788C19109E4670i9670l5920G055b91237G0062a11699
9763A3102K18725b52243B41649a49642n2653j32010d3801H1787P3791M844o1912
$$ y = [-25354, -73924, -92085, -60666, 57438, -110226, -41504, 137829, 14809, 285779, 83078, 200561, -210059, 244013, -68865, 249291, -157999, -245698, 148254, 90588, -285972, -209277, -120499, 68900, -85757, -252118, -451300, -112331, -351182, -273173, -19301, 113185, 306150, 354382, 88521, -217462, 94002, -119103, -248516, -107524, 114278, -325780, -341979, -212936, -99981, -375339, 78934, 182297, -39374, -176554, -187689, -21804, -152649, -21319, 41542, -219582, 125061, -35702, -319634, -310382, -94862, -165562, -40202, -100141, -23809, -60842, -170616, -234097, -290885, 319109, 54670, -99670, -135590, 7055, -291237, 70062, -111699, 13102, 231827, -252243, 241649, -149642, -202295, -334305, -43801, 81787, 155578, 160422, 98510]
9752I8510a11620j81767A59689a25832K0609k9247H4176a06813j44279C52998
9741a31275j21683D76448A15411b53715L4437m4415J13655A00381a75202j12681
9731b87883a03173k09644A3209c45636e1764j60544A04721a93475i3328K4748
9721f8580A83950e734j4454i998l4123A6985c18093e1863q6034B64264a28286
9709a06756N1550I8266a94197K9515f0777A61925b60149g3208q1350M0825j1210
9698a24943C8743Q021b3968r9163B64876j1070c02078J23560L1993j16837g3919
9686h4821K1184A9635n530g6069O274j14399E3629J17393d9448l03830O9422h2578
9673d22877a89252B52390c1803m47629J76195D9757J68125I47a84278A2015K5684
$$ y = [98510, -111620, -293387, 159689, -125832, -105223, -134470, 84176, -106813, -251092, 352998, -131275, -252958, 476448, 115411, -253715, -219278, -263693, -150038, 100381, -175202, -287883, -103173, -312817, 13209, -345636, -51764, -212308, 104721, -193475, -93328, -68580, 183950, -5734, -20188, -9998, -44121, 16985, -318093, -51863, -137897, 264264, -128286, -106756, -55206, 98266, -194197, -164682, -60777, 161925, -260149, -73208, -154558, -113733, -124943, 38743, 46764, -23968, -123131, 264876, 253806, -302078, -178518, -146525, -263362, -73919, -84821, -63637, 19635, 14105, -76069, -69795, -184194, 53629, 171022, -49448, -353278, -283856, -82578, -422877, -189252, 252390, -31803, -479432, -303237, 49757, 217882, 947, -184278, 12015, 37699]
9662C7699a19749k68418b9624F7224M7271i0836j0227j35973j8531J17096B6550
9650a2785A62329B1828c9335k91548C38759a24558j8471B81347J27838d1931o7851
9639a09782d7434j81653l6501B8055b7496l87586A54366a13650q3045A0608a23567
9627G7653P3649J73550h6793j46783j43757J70457O8021q6711P6655L5458k28433
9616c41886B8679b42226r568C11801b09190A39573i5009B4336K0155b26066A51704
9604a43208n2927J7389e1659B14154D1330J30734C499b9045k18694g7758m29428
9593e07186C6304E398M4078a64511D6264f4955A23431M8821b14450A09583a0700
9581A87967b03240a4477k35842A12198A5044L3860J01277a82766p1438C8685b20136
$$ y = [37699, -119749, -388167, -29624, 67224, 114495, -90836, -101063, -237036, -255567, -138471, 26550, -12785, 162329, 21828, -39335, -330883, 338759, -124558, -143029, 281347, 409185, -41931, -109782, -47434, -229087, -265588, 28055, -27496, -415082, 154366, -113650, -196695, 10608, -123567, 77653, 151302, 324852, -86793, -233576, -377333, -206876, -138855, -225566, -148911, -113453, -341886, 28679, -242226, -251794, 311801, -209190, 139573, -95009, 24336, 44491, -226066, 151704, -143208, -196135, -178746, -51659, 214154, 41330, 172064, 3499, -29045, -247739, -77758, -507186, 36304, 5398, 49476, -164511, 46264, -64955, 123431, 172252, -214450, 109583, -10700, 187967, -203240, -14477, -250319, 112198, 15044, 48904, 150181, -182766, -254204, 38685, -220136]
9569a70718g3520E9722a53589c2624o3153k07686J33725o8062Q2443I5967h9988
9557A62012d07843P5699R9993K4637l98027A29333a41500A7240g9385k133j6289
9546i7807k3999A85936a21869A19105f77A67159c79957C8585Q7305D2163P6649
9535A18812c43515D0232a83908C00133I773a19772o6674a9257F4137h9249k83630
9524c72879B9711L5136h4174j8141A9493c707B13311N6667a12245k83963B21265
9512b62462e4616m7354m260F4006g6958q1062A23343b37536b4853G7631a80484
9500b67917b7714k21522e0805i239j36339k02341H6495a71786q8058K9676i9593
9488H9009a4034q9275c3232A35433b8594j58196j08881A02059k9043l0100a69869
$$ y = [-170718, -73520, 59722, -153589, -32624, -95777, -303463, -169738, -237800, -155357, 95967, -89988, 162012, -407843, -332144, -232151, -207514, -605541, 129333, -141500, 17240, -79385, -81518, -97807, -121806, 185936, -121869, 119105, -677, 167159, -379957, 38585, 125890, 42163, 118812, -343515, 40232, -183908, 300133, 9773, -119772, -186446, -19257, 64137, -89249, -372879, 29711, 64847, -84174, -102315, 19493, -3707, 213311, 269978, -112245, -396208, 221265, -262462, -54616, -101970, -106230, 64006, -76958, -158020, 123343, -237536, -24853, 77631, -180484, -267917, -27714, -249236, -50805, -9239, -145578, -347919, 86495, -171786, -259844, -230168, -99593, 89009, -14034, -103309, -33232, 135433, -28594, -186790, -295671, 102059, 73016, 42916, -169869]
9476A1274a61753B0173J18384a34486L8876A09087b27216B081c40428L4579A16237
9464b69559B33759C6802c0676r4828c3524k77292J45048k10025A32059c41729
9453B2564a77337b7011j80792l9511A7628d06404F3237e347k64943A57396o3687
9442I3709J72982b00698R8860I3088h4090G938b19732J796b5248j29209j82662
9431c37119O6504J1685a0256j87765e1106j28862D3858M6038a34226I5239D7181
9419I3666b2112k5977l14582G5824b50465A434a29386j96381a04348K7763L4018
9408d2567l49493f0722j78728D5962i1634H5037a47869M3955H7223L6935b3932
9396a77306q808d8669l6682k98151E2398A0777b16227L3335A23989a39938D2857
$$ y = [11274, -161753, 20173, 138557, -134486, -95610, 109087, -227216, 2081, -340428, -305849, 116237, -269559, 233759, 36802, -30676, -125504, -33524, -310816, -165768, -375793, 132059, -341729, 22564, -177337, -27011, -207803, -247314, 17628, -406404, 63237, -5347, -270290, 157396, 93709, 266691, -200698, -101838, 93088, -84090, 7938, -219732, -217936, -25248, -154457, -337119, -270615, -258930, -10256, -198021, -51106, -179968, 43858, 89896, -134226, 95239, 47181, 93666, -22112, -48089, -362671, 75824, -250465, 1434, -129386, -325767, -104348, -76585, -42567, -392060, -60722, -239450, 45962, -91634, 85037, -147869, -103914, 87223, 124158, -23932, -177306, -186114, -48669, -85351, -383502, 52398, 10777, -216227, -182892, 123989, -139938, 42857]
9384D46839G5779d4349A4653L49230b6250l6050C54868h1071A59255o3346L50757
9373D46666H2498a68606N0451j51528b5272j03550k65121A97742B8257K07365
9363B35622a11845A483K5113a16801E5069P9846b2338k77956L0709a07746G1158
9351b46930A57813b1979k4055r7130a4103o2980C4827f0203j6842i224A6963o616
9339A0347d5585j97531a10630n5373A09349b00458B12497j02116d03067K9398
9329c73669Q5681C0194a58991M6440M0679B2846c55529a46883c3634b488A07602
9317a09824R447d5177F4909b6670k46260d1711p8559m1091p7891k3801g786k72080
9305b79866B53880A23481a60685m1286N5955K640H2667a8203k62426a26816l6783
$$ y = [446839, 75779, -44349, 14653, 363883, -26250, -62300, 354868, -81071, 159255, 95909, 446666, 82498, -168606, -118155, -269683, -25272, -128822, -393943, 197742, 28257, 235622, -111845, 1483, 26596, -116801, 55069, 134915, -22338, -300294, -269585, -107746, 71158, -246930, 157813, -21979, -46034, -143164, -14103, -77083, 34827, -60203, -77045, -9224, 16963, 10347, -45585, -243116, -110630, -166003, 109349, -200458, 212497, 110381, -403067, -373669, -287988, 30194, -158991, -112551, -71872, 22846, -355529, -146883, -33634, -2488, 107602, -109824, -100377, -45177, 64909, -26670, -272930, -41711, -120270, -161361, -239252, -263053, -7786, -279866, 253880, 123481, -160685, -201971, -146016, -143376, 82667, -18203, -280629, -126816, -163599]
9294a63599n454m0363A17791b37917a15768j88982d739C23700a68446C7360P9750
9283A17110c39278J14865e6452E29424c40768h9726I7603c39600R0954B31076
9272B77742a02678j2575p0519I9762f1931o0158F1502a01635j04459E4301J2869
9261F7170A489a21580D3800P5497J11554f7585j27743D5262J51677g9072a9657
9249E5059M6588b3418A08677a747r7k00255i7591j42037Q0178a1527j42415g0647
9236a29884B3520a14571C63447d6633A92284b61316r3877a07089L1284L6602k46667
9225b85870e2149A08560N6760J48708b2632B24001f5817D3834A6983g7716m645
9214h2361D0551b55830B04108F4251M4829b83523L7228m7211J05149Q7100l8567
$$ y = [-163599, -169053, -209416, 117791, -237917, -115768, -304750, -4739, 323700, -168446, 37360, 117110, -339278, -224413, -56452, 529424, -340768, -89726, 97603, -339600, -248646, 231076, 277742, -102678, -115253, -185772, 99762, -61931, -122089, 61502, -101635, -206094, 54301, 67170, 1489, -121580, 43800, 119297, 230851, -67585, -195328, 45262, 196939, -79072, -19657, 55059, 101647, -23418, 108677, -1747, -1844, -202099, -97591, -239628, -159450, -11527, -153942, -70647, -129884, 23520, -114571, 363447, -46633, 192284, -261316, -355193, -107089, -75805, -39203, -285870, -52149, 108560, 165320, 314028, -22632, 224001, -65817, 43834, 16983, -77716, -82361, 40551, -255830, 204108, 64251, 109080, -283523, -246295, -293506, -188357, -101257, -139824]
9203a39824H7514a49758b3647H0626R8292h0060k48858a37646k29826J33947D9997
9191B13259a1646D8541e7819A21586g2378B22898F6103J85121b68943A73651O0548
9180B34199a06587n2373L9089H5613J3874f5901n7994E7008d3226B93320b4178
9168A66731Q8381P0817c4223q4353A69102a564j9193k98483C41771I5041d6892
9156b84135G0676J08983h5635j61868j6458l4785A36931c3876j37770j15830C8293
9144i7012A09363a12863F5249a45274l95794F350a98808j46472J67381A65461
9133a68542L7525r4220G0658b0686j30537C09003h9746G4740b73628c2717D4482
9121a47969j76374J25469l2050B57498E4602c33706B46805b32180B8165a17911
$$ y = [-139824, 87514, -149758, -23647, 80626, 178918, -80060, -328918, -137646, -367472, -233525, 49997, 213259, -11646, 48541, -57819, 121586, -72378, 222898, 66103, 251224, -268943, 173651, 234199, -106587, -158960, -119871, 85613, 99487, -65901, -123895, 57008, -43226, 293320, -24178, 166731, 255112, 325929, -34223, -118576, 169102, -1564, -20757, -319240, 341771, 95041, -46892, -284135, 70676, 179659, -85635, -247503, -263961, -298746, 136931, -33876, -171646, -287476, 38293, -97012, 109363, -112863, 65249, -145274, -541068, 6350, -198808, -345280, -177899, 165461, -168542, -131017, -225237, 70658, -20686, -151223, 309003, -89746, 74740, -273628, -32717, 44482, -147969, -324343, -198874, -230924, 257498, 54602, -333706, 246805, -232180, 28165, -117911]
9110a41289E8434b77162F7598J00117a65361p4282A33905d590k35893g7306B0024
9098A38348C5027b5652A11437a58184q319B7899f6153j81839H0369e6688k9472
9087h6160K6977B22522d03953A60804b19924A11598Q2779c07546c3442a3165D05
9075b51076H534c37618E2609M0448J23506A7650a20115j39542g9775L5373l47177
9064c91579a79960O8636H1748f7648k14223A2129P0571a9431m56966a14287A58460
9052A98035e2382E7525J54654c02837f1740H2761d882l7147C5063J85883h7769
9040a52885E0819b02418R8374A77330d45263a19021n6394k60591a65480p8150
9030b43630r1421i1754p558d9380j24380B22691E4912d1311A49911E922e2153
$$ y = [-141289, 58434, -277162, 67598, 167715, -165361, -239643, 133905, -4590, -240483, -77306, 20024, 138348, 35027, -25652, 111437, -158184, -166503, 27899, -66153, -247992, 80369, -56688, -86160, -59183, 222522, -403953, 160804, -219924, 111598, 194377, -307546, -33442, -13165, 405, -251076, 8534, -337618, 52609, 93057, 216563, 17650, -120115, -259657, -79775, -44402, -391579, -179960, -111324, 81748, -67648, -281871, 12129, 82700, -19431, -476397, -114287, 158460, 198035, -52382, 57525, 212179, -302837, -61740, 82761, -4882, -42029, 35063, 220946, -87769, -152885, 50819, -202418, -104044, 177330, -445263, -119021, -175415, -436006, -165480, -243630, -335051, -91754, -99312, -49380, -173760, 222691, 54912, -41311, 149911, 5922, -52153]
9018b2242l9117j21456j25703A00356a77918j05138B47019I0744a81126l5654
9008b16780C9489a31780A97683A9599J19050O476b81594m3692g9260a268A53437
8996A98264a98381k87181f3273A9652a9164E2997M6086a09060b9153n85059B06519
8984e1501k53983C05888G1323P6791o6373a54049n3544b7784l01720i6075l7061
8973a33136B04244J05697a49529k9346K0793A27468o0993i5701G4579M0294e5063
8961b97490C575a49532k63466Q2708A61549H0363a44987n3966A35950h0778j84093
8950b64871O9209K8854r8515L6605A48225A7430a70567K7749E3512j304a60515
8938a46548A82611g9771A45493K44473J93722A04287K1877b17023P3725N8645
$$ y = [-22242, -61359, -182815, -308518, 100356, -177918, -283056, 247019, 90744, -181126, -216780, 39489, -131780, 197683, 19599, 138649, 145125, -281594, -325286, -79260, -1268, 153437, 198264, -198381, -485562, -63273, 19652, -19164, 52997, 99083, -109060, -29153, -614212, 206519, -51501, -305484, 305888, 71323, 148114, 81741, -154049, -207593, -27784, -329504, -96075, -133136, 204244, 309941, -149529, -178875, -158082, 127468, 66475, -95701, 74579, 114873, -55063, -297490, 3575, -149532, -412998, -330290, 161549, 80363, -144987, -198953, 135950, -80778, -264871, -195662, -166808, -265323, -228718, 148225, 17430, -170567, -142818, 53512, 52208, -160515, -146548, 182611, -79771, 145493, 389966, 583688, 104287, 126164, -217023, -143298, -84653]
8928h4653A30040b93503C34941M67454O40209K085859O100234J1270673F667277
8918B461942I04329C19321j2011j49177d1766k91627B6751J61137H3433J02447
8908A85880L00658k39617O330A11796e2919P086B63981a75024G2173F757a11733
8896b59308I2962J8757i2932j80286o7545I2171N579K8934h9289I2106F328L00845
8884C07173E2027a90777N0842F3880B3301c51196E0469J49153Q0391A21118d029
8872B64328g3231B99404A47202K02593B0204a54770j55213A4598K485J15701b60404
$$ y = [-84653, 130040, -293503, 334941, 802395, 1442604, 3528463, 9628697, 20899370, 6667277, 2461942, 904329, 319321, 307310, 158133, -41766, -333393, 26751, 187888, 83433, 185880, 486538, 246921, 253251, 111796, -52919, -45833, 263981, -175024, 72173, 6757, -111733, -259308, 92962, 111719, -92932, -273218, -340763, 92171, 97750, 126684, -89289, 92106, 6328, 307173, 52027, -190777, -139935, 63880, 23301, -351196, 50469, 199622, 280013, 121118, -4029, 264328, -73231, 299404, 147202, 349795, 20204, -154770, -309983, 14598, 17083, 132784, -260404]
$$ [...]
##END NTUPLES=NMR SPECTRUM
##END=
