
##TITLE=UV1228_M7_1357-1247_5_7230771_NkS6smYVZU
##JCAMPDX= 6.0         $$ Bruker NMR JCAMP-DX V2.0
##DATA TYPE= NMR SPECTRUM
##DATA CLASS= NTUPLES
##ORIGIN= BRUKER
##OWNER= Administrator
$$ 1.72 TOPSPIN		Version 2.1
$$ 2013-01-17 19:26:27.209 -0500  Administrator@X
$$ Compression mode = diff/dup
##.OBSERVE FREQUENCY= 400.02188249412
##.OBSERVE NUCLEUS= ^1H
##.ACQUISITION MODE= SIMULTANEOUS (DQD)
##.ACQUISITION SCHEME= undefined
##.AVERAGES= 64
##.DIGITISER RES= 22
##SPECTROMETER/DATA SYSTEM= spect
##.PULSE SEQUENCE= noesygpps1d.comp
##.SOLVENT NAME= COFFEE_meoh
##.SHIFT REFERENCE= INTERNAL, COFFEE_meoh, 1, 14.96114
##AUDIT TRAIL= $$ (NUMBER, WHEN, WHO, WHERE, PROCESS, VERSION, WHAT)
$$ ##TITLE= Audit trail, TOPSPIN		Version 2.1
$$ ##JCAMPDX= 5.01
$$ ##ORIGIN= Bruker BioSpin GmbH
$$ ##OWNER= Administrator
$$ $$ E:\/data/COFFEE/nmr/UV1228_M7_1357-1247_5_7230771_NkS6smYVZU/22/pdata/1/auditp.txt
$$ ##AUDIT TRAIL=  $$ (NUMBER, WHEN, WHO, WHERE, PROCESS, VERSION, WHAT)
(   1,<2013-01-17 19:26:21.413 -0500>,<Administrator>,<X>,<go>,<TOPSPIN 2.1>,
      <created by zg
	started at 2013-01-17 19:14:51.614 -0500,
	POWCHK enabled, PULCHK disabled,
       configuration hash MD5:
       86 BA 57 50 F2 9D 5C 9B 26 00 A9 28 5F 66 2E 89
       data hash MD5: 64K
       10 4E B2 22 74 2C 96 70 26 9E 79 31 85 91 23 52>)
(   2,<2013-01-17 19:26:24.444 -0500>,<Administrator>,<X>,<proc1d>,<TOPSPIN 2.1>,
      <Start of raw data processing
       efp LB = 0.3 FT_mod = 6 PKNL = 1 PHC0 = 0 PHC1 = 0 SI = 128K 
       data hash MD5: 128K
       6A 59 45 D0 A1 EB 38 74 9C 46 3B 09 5E DD 80 4C>)
(   3,<2013-01-17 19:26:25.491 -0500>,<Administrator>,<X>,<proc1d>,<TOPSPIN 2.1>,
      <pk PHC0 = -80.96375 PHC1 = 0 
       data hash MD5: 128K
       00 19 A8 E3 DB A5 30 16 59 8B 1F 66 97 0E 56 27>)
(   4,<2013-01-17 19:26:26.163 -0500>,<Administrator>,<X>,<proc1d>,<TOPSPIN 2.1>,
      <abs ABSG = 1 
       data hash MD5: 128K
       2C 3D CA 5E AA C2 4A 30 F6 74 DA 38 A2 24 47 BA>)
(   5,<2013-01-17 19:26:26.350 -0500>,<Administrator>,<X>,<proc1d>,<TOPSPIN 2.1>,
      <abs ABSG = 2 
       data hash MD5: 128K
       DD 4E 16 23 62 8F 68 33 3C 18 12 B2 E9 1B 76 03>)
(   6,<2013-01-17 19:26:26.538 -0500>,<Administrator>,<X>,<proc1d>,<TOPSPIN 2.1>,
      <abs ABSG = 3 
       data hash MD5: 128K
       81 B3 0C 09 27 53 3A AF CA EA C2 DA A8 7F 34 E1>)
(   7,<2013-01-17 19:26:26.694 -0500>,<Administrator>,<X>,<proc1d>,<TOPSPIN 2.1>,
      <abs ABSG = 4 
       data hash MD5: 128K
       B8 FF 9E 1E C0 AB 70 7D 4E 60 BF A8 5C 8B B3 1D>)
(   8,<2013-01-17 19:26:26.866 -0500>,<Administrator>,<X>,<proc1d>,<TOPSPIN 2.1>,
      <abs ABSG = 5 
       data hash MD5: 128K
       20 89 9C A9 45 23 A7 8D 3C 42 8C 40 B0 34 36 79>)
$$ ##END=
$$ 
$$ $$ hash MD5
$$ $$ 48 DE 56 AA 1F F7 31 14 A5 F8 44 6B 0D 3B 91 42
##$RELAX= 
##$RELAX= 
##$RELAX= 
##$RELAX= 
##$RELAX= 
##$RELAX= 
##$RELAX= 
##$RELAX= 
$$ Bruker specific parameters
$$ --------------------------
##$DU= <E:\>
##$EXPNO= 22
$$ [...]
##$TP07= 0
##$TPNAME0= <>
##$TPNAME1= <>
##$TPNAME2= <>
##$TPNAME3= <>
##$TPNAME4= <>
##$TPNAME5= <>
##$TPNAME6= <>
##$TPNAME7= <>
##$TPOAL= (0..7)
0.5 0.5 0.5 0.5 0.5 0.5 0.5 0.5
##$TPOFFS= (0..7)
0 0 0 0 0 0 0 0
##$TUNHIN= 0
##$TUNHOUT= 0
##$TUNXOUT= 0
##$USERA1= <user>
##$USERA2= <user>
##$USERA3= <user>
##$USERA4= <user>
##$USERA5= <user>
##$V9= 5
##$VALIST= <valist>
##$VCLIST= <CCCCCCCCCCCCCCC>
##$VD= 0
##$VDLIST= <DDDDDDDDDDDDDDD>
##$VPLIST= <PPPPPPPPPPPPPPP>
##$VTLIST= <TTTTTTTTTTTTTTT>
##$WBST= 1024
##$WBSW= 4
##$XGAIN= (0..3)
0 0 0 0
##$XL= 0
##$YL= 0
##$YMAX_a= 6465684
##$YMIN_a= -12591220
##$ZGOPTNS= <>
##$ZL1= 120
##$ZL2= 120
##$ZL3= 120
##$ZL4= 120
##$ABSF1= 14.96114
##$ABSF2= -5.597042
##$ABSG= 5
##$ABSL= 3
##$ALPHA= 0
##$AQORDER= 0
##$ASSFAC= 0
##$ASSFACI= 0
##$ASSFACX= 0
##$ASSWID= 0
##$AUNMP= <proc_prof1d_extract.lims>
##$AXLEFT= 0
##$AXNAME= <>
##$AXNUC= <1H>
##$AXRIGHT= 0
##$AXTYPE= 0
##$AXUNIT= <>
##$AZFE= 0.1
##$AZFW= 0.1
##$BCFW= 0
##$BC_mod= 0
##$BYTORDP= 0
##$COROFFS= 0
##$CY= 15
##$DATMOD= 1
##$DC= 0
##$DFILT= <>
##$DTYPP= 0
##$F1P= 0
##$F2P= 0
##$FCOR= 0.5
##$FTSIZE= 131072
##$FT_mod= 6
##$GAMMA= 0
##$GB= 0
##$INTBC= 1
##$INTSCL= 1
##$ISEN= 128
##$LB= 0.3
##$LEV0= 0
##$LPBIN= 0
##$MAXI= 10000
##$MC2= 0
##$MEAN= 0
##$ME_mod= 0
##$MI= 0
##$NCOEF= 0
##$NC_proc= -2
##$NLEV= 6
##$NOISF1= 0
##$NOISF2= 0
##$NSP= 0
##$NTH_PI= 0
##$NZP= 0
##$OFFSET= 14.96114
##$PC= 1
##$PHC0= -80.96375
##$PHC1= 0
##$PH_mod= 1
##$PKNL= yes
##$PPARMOD= 0
##$PPDIAG= 0
##$PPIPTYP= 0
##$PPMPNUM= 2147483647
##$PPRESOL= 1
##$PSCAL= 4
##$PSIGN= 0
##$PYNMP= <proc.py>
##$REVERSE= no
##$SF= 400.020009580855
##$SI= 131072
##$SIGF1= 0
##$SIGF2= 0
##$SINO= 400
##$SIOLD= 131072
##$SPECTYP= <>
##$SREGLST= <1H.CDCl3>
##$SSB= 0
##$STSI= 131072
##$STSR= 0
##$SW_p= 8223.68421052631
##$SYMM= 0
##$S_DEV= 0
##$TDeff= 65536
##$TDoff= 0
##$TI= <>
##$TILT= no
##$TM1= 0
##$TM2= 0
##$TOPLEV= 0
##$USERP1= <user>
##$USERP2= <user>
##$USERP3= <user>
##$USERP4= <user>
##$USERP5= <user>
##$WDW= 1
##$XDIM= 131072
##$YMAX_p= 431937200
##$YMIN_p= -12367
##$CURPLOT= <Network HP LaserJet P1505>
##$CURPRIN= <$Network HP LaserJet P1505>
##$DFORMAT= <normdp>
##$LAYOUT= <+/1D_H.xwp>
##$LFORMAT= <normlp>
##$PFORMAT= <normpl>
##$SURQMSG= 1
$$ End of Bruker specific parameters
$$ ---------------------------------
##NTUPLES= NMR SPECTRUM
##VAR_NAME=  FREQUENCY,     SPECTRUM/REAL,   SPECTRUM/IMAG
##SYMBOL=    X,             R,               I
##VAR_TYPE=  INDEPENDENT,   DEPENDENT,       DEPENDENT
##VAR_FORM=  AFFN,          ASDF,            ASDF
##VAR_DIM=   131072,        131072,          131072
##UNITS=     HZ,            ARBITRARY UNITS, ARBITRARY UNITS
##FACTOR=    0.0627417313425164, 1,          1
##FIRST=     8223.62146879497, 1511,         -63104
##LAST=      0,             3855,            -63339
##MIN=       0,             -12367,          0
##MAX=       8223.62146879497, 431937200,    0
$$ Real data points
##PAGE= N=1
##DATA TABLE= (X++(R..R)), XYDATA
$$ [...]
63937C319278K57213K57789K54290K46707K33621K13607J87080J55959J21847
63928E247391Q5319M6850P517l1577p0025j07718j43812j76489k03888k25138
63918D428430k40381k49980k54112k53228k48402k40754k30669k18025k03045
63909B289834j86528j69263j51858j35129j20018j06803r4850q3390p2353o2286
63899A107356n3763m7027m1868l7678l3854l0286k7223k4715k2565k0768j9478
63888G48131j8469j7257j5862j4837j4321j3547j1736q953n838k877l25J647L154
63875F28910M678O608Q899J1334J3794J6119J8058J9603K0979K2237K3303K4456
63863H18978K6094K7749K8108K6485K3729K1169J9147J7097J4575J1624Q472N369
$$ plain form
63937 3319278 3576491 3834280 4088570 4335277 4568898 4782505 4969585 5125544 5247391
63928 5247391 5332710 5379560 5387077 5355500 5285475 5177757 5033945 4857456 4653568 4428430
63918 4428430 4188049 3938069 3683957 3430729 3182327 2941573 2710904 2492879 2289834
63909 2289834 2103306 1934043 1782185 1647056 1527038 1420235 1325385 1241995 1169642 1107356
63899 1107356 1053593 1006566 964698 927020 893166 862880 835657 810942 788377 767609 748131
63888 748131 729662 712405 696543 681706 667385 653838 642102 633149 627311 624434 624109 625756 628910
63875 628910 633588 640196 649095 660429 674223 690342 708400 728003 748982 771219 794522 818978
63863 818978 845072 872821 900929 927414 951143 972312 991459 1008556 1023131 1034755 1043227 1048596
63851A048596K438o51m508r131j3688j7408k0291k2557k4103k5032k6106k7950
63839H59609l0218l2118l3298l3665l2940l1187k9278k7992k7010k5571k3800
63828E32532k2396k1341j9959j8141j6561j5550j4673j3503j2148j0794r448q292
63816C49726p668p527p333o747n991n384m905m313l436k355j483j306j751k107
63802B87420j924j678j986k479k293j488j165j986l297l967l615k733k018j835
63788B54956k076k346k371k271k288k421k492k398k080j456o27N1L72M93N36L07
63772B33889l04j027j596k008k149j696p89j73j86k93j47k77j005j472q37K24
63756B20154M65j4q4N09R16P48M92M05K38J63P09J630K046J873J951K546K928
$$ plain form
63851 1048596 1051034 1050383 1045875 1036744 1023056 1005648 985357 962800 938697 913665 887559 859609
63839 859609 829391 797273 763975 730310 697370 666183 636905 608913 581903 556332 532532
63828 532532 510136 488795 468836 450695 434134 418584 403911 390408 378260 367466 358018 349726
63816 349726 342058 334531 327198 320451 314460 309076 304171 299858 296422 294067 292584 291278 289527 287420
63802 287420 285496 283818 281832 279353 277060 275572 274407 272421 269124 265157 261542 258809 256791 254956
63788 254956 252880 250534 248163 245892 243604 241183 238691 236293 234213 232757 232130 232181 232553 233046 233582 233889
63772 233889 233585 232558 230962 228954 226805 225109 224320 224147 223961 223668 223521 223244 222239 220767 219930 220154
63756 220154 220619 220605 220521 221030 221946 222694 223186 223591 223829 223992 224701 226331 228377 230250 232201 234747 237675
63739B37675K760K642K844K722J950J211J052J023O36K39L37Q37J622K957M624
63724B65131N552N092M020L514L728M029M035L696K941J973J367J223P94m30j776
63709C04889k363k347k439k627k328j491o83j95J56M85O91Q28J005J133J195J530
63693B97439K333L166L548L663L898L963L284K092J268J066P23m01j865k637k187
63678C19353r51J38M84K68J64N09R46R41M14k93p73p30j41N20O13J36k28j46j87
63659C21037q93j883k472k696l021l376l331l005k978l264l186k338j113j49K11
63644B87543j10q99j428q87P15K395L204L097K710K622L015L671M220M495M766
63629C19129N392O288P039P580Q374R803J1646J3296J4316J4737J5021J5793J7370
$$ plain form
63739 237675 240435 243077 245921 248643 250593 251804 252856 253879 254515 254754 255091 255928 257550 260507 265131
63724 265131 270683 275775 279795 283309 287037 291066 295101 298797 301738 303711 305078 306301 307095 306665 304889
63709 304889 302526 300179 297740 295113 292785 291294 290611 290416 290572 291057 291748 292576 293581 294714 295909 297439
63693 297439 299772 302938 306486 310149 314047 318010 321294 323386 324654 325720 326443 326042 324177 321540 319353
63678 319353 318402 318540 319024 319292 319456 319965 320911 321852 322266 321973 321200 320470 320329 320849 321462 321598 321370 321224 321037
63659 321037 320144 318261 315789 313093 310072 306696 303365 300360 297382 294118 290932 288594 287481 287332 287543
63644 287543 287433 286534 285106 284219 284934 287329 290533 293630 296340 298962 301977 305648 309868 314363 319129
63629 319129 324521 330809 337848 345428 353802 363605 375251 388547 402863 417600 432621 448414 465784
63616D65784J9453K1404K2852K3915K4932K6274K8253L0797L3225L4660L4786
63605G66335L3874L2072K9075K4600J8810J2090M859k108p605j0746j1762j1728
63593H77766j1565j1613j1956j2707j3866j5299j7005j9183k1825k4445k6396
63582F91906k7358k7350k6407k4535k1901j8926j6049j3524j1411r624p970o210
63570D80641m175j843O35K950M837O343P727R000R847J0248J0845J2145J3635
63557E62835J4369J4400J4803J6147J7828J9353K1435K4970K9558L3904L7361
63546H06963M0177M2281M2726M0456L5061K6714J6128M761n432j2906j7212j8836
63534A000881j8683j7593j6002j4057j2139j1050j1388j3060j5792j9623k4331
$$ plain form
63616 465784 485237 506641 529493 553408 578340 604614 632867 663664 696889 731549 766335
63605 766335 800209 832281 861356 885956 904766 916856 921715 919607 912002 901256 889494 877766
63593 877766 866201 854588 842632 829925 816059 800760 783755 764572 742747 718302 691906
63582 691906 664548 637198 610791 586256 564355 545429 529380 515856 504445 494821 486851 480641
63570 480641 476466 474623 475258 478208 483045 489388 497115 506115 515962 526210 537055 549200 562835
63557 562835 577204 591604 606407 622554 640382 659735 681170 706140 735698 769602 806963
63546 806963 847140 889421 932147 972603 1007664 1034378 1050506 1055267 1049835 1036929 1019717 1000881
63534 1000881 982198 964605 948603 934546 922407 911357 899969 886909 871117 851494 827163
63523H27163k8832l1918l3464l4086l3988l2936l1204k9431k7559k4954k1766
63512D97025j9120j7616j6594j5202j3405j1559r766q107o840n927n061m346m236
63499C59246m533m306l193j930j199q30n68p01j271j592j234p04m16R7J164K056
63483C40086K068J770K103K836L072K734K450K307J877J261R58Q77M92j88p55
63468C63948j346k364l443l764l459l477l980m050l225k216j664j165k41O31P11
63453C30896J91J0P67K292M072N664O861P784Q654R415R808R976J0549J1983J4131
63438D33053J6654J9464K2492K5444K8156L0756L2993L3619L1187K5687J9006
63427G18511J3521J0399R397R970J1963J5124J8648K1767K4686K8286L2848L7512
$$ plain form
63523 827163 798331 766413 732949 698863 664875 631939 600735 571304 543745 518791 497025
63512 497025 477905 460289 443695 428493 415088 403529 393763 385656 378816 372889 367828 363482 359246
63499 359246 354713 350407 347214 345284 344085 343255 342687 341986 340715 339123 337889 337185 336769 336866 338030 340086
63483 340086 342154 343924 346027 348863 351935 354669 357119 359426 361303 362564 363522 364399 364891 364703 363948
63468 363948 362602 360238 356795 353031 349572 346095 342115 338065 334840 332624 330960 329795 329554 330185 330896
63453 330896 331087 331097 331864 334156 338228 343892 350753 358537 367191 376606 386414 396390 406939 418922 433053
63438 433053 449707 469171 491663 517107 545263 576019 609012 642631 673818 699505 718511
63427 718511 732032 742431 751828 761798 773761 788885 807533 829300 853986 882272 915120 952632
63415I52632M1035M2629M1846L8336L2176K4124J5153O005k544r470j4086j6576
63403A151260j7578j7486j6657j5962j6399j8227k0976k4303k8240l2583l6512
63392I06337l9067l9778l8797l6682l4074l1355k8567k5755k3146k0841j8519
63381E69756j5790j2710r631o715l912j334P31K165L257M523O402Q930J1652J4033
63367E71357J6023J7946J9876K1593K3221K5257K7682K9765L1193L2748L5173
63356H51834L7965L9994M0798M0416L8350L3777K6816J8669J0440K529m695j0469
63344A126424j4183j5988j6508j6322j5786j5217j5095j6149j8952k3216k7793
63333I31215l1619l4403l6130l6497l5431l3626l1779k9605k6357k2161j7957
$$ plain form
63415 952632 993667 1036296 1078142 1116478 1148654 1172778 1187931 1193936 1191392 1181922 1167836 1151260
63403 1151260 1133682 1116196 1099539 1083577 1067178 1048951 1027975 1003672 975432 942849 906337
63392 906337 867270 827492 788695 752013 717939 686584 658017 632262 609116 588275 569756
63381 569756 553966 541256 531625 524910 520998 519664 520395 522560 525817 530340 536742 545672 557324 571357
63367 571357 587380 605326 625202 646795 670016 695273 722955 752720 783913 816661 851834
63356 851834 889799 929793 970591 1011007 1049357 1083134 1109950 1128619 1139059 1141588 1136893 1126424
63344 1126424 1112241 1096253 1079745 1063423 1047637 1032420 1017325 1001176 982224 959008 931215
63333 931215 899596 865193 829063 792566 757135 723509 691730 662125 635768 613607 595650
63322E95650j4247j0658o929l660j953k738o227j1465j6410j9154j9288j7847
63310D65074j6096j4759j4018j3544j2641j0951q953p296n932m507l236k610k470
63297C48061k243j901j845k017k003j884k038k256k016j590j744k341k392j664
63283C20127j079j184j341q73m0O18R66R16K56o76j025o01k24l34k51N41J320
63266C17116J189M96K82P82J332J455J263J094J322K207L333L651K746J727K047
63251C42042L633N039N367N246N673O621P309P434P539Q155R039R610R891J0536
63237D43134J1877J3426J4652J5744J7188J8951K0594K1868K2658K2678K1969
63226F44739K1352K1597K2299K2391K1658K0843K0420K0237K0281K0660K0800
$$ plain form
63322 595650 581403 570745 563816 560156 558203 555465 549238 537773 521363 502209 482921 465074
63310 465074 448978 434219 420201 406657 394016 383065 374112 366816 360884 356377 353141 350531 348061
63297 348061 345818 343917 342072 340055 338052 336168 334130 331874 329858 328268 326524 324183 321791 320127
63283 320127 319048 317864 316523 315650 315610 316228 317194 318110 318366 317690 316665 316064 315840 315506 315255 315796 317116
63266 317116 318305 318801 319083 319865 321197 322652 323915 325009 326331 328538 331871 335522 338268 339995 342042
63251 342042 345675 350714 356081 361327 367000 373621 380930 388364 395903 404058 413097 422707 432598 443134
63237 443134 455011 468437 483089 498833 516021 534972 555566 577434 600092 622770 644739
63226 644739 666091 687688 709987 732378 754036 774879 795299 815536 835817 856477 877277
63215H77277J9883J8253J7227J7136J6733J4944J2024Q447L945j571p221j2195
63203I84882j6718k1105k4780k7116k8390k8947k8255k5883k2737k0051j7650
63192G23250j4384r998n518j900P22K674M498O925J0217J3595J6037J7540J8886
63179G82544K0466K1985K3136K3749K3566K2698K2053K2387K3112K2924K1580
63168A030200K0034J8819J7315J4820J1425P470K933k214p637j3037j8405k3586
63156A058137k8052l1482l4145l6319l7674l7660l6295l4248l2155l0144k8033
63145F91930k5707k3249k0740j8144j5539j3307j1841j0985j0078q696p116n908
63133E20620n267m921m466l629k413j127j21N69J106J480J675K113L248M648N243
$$ plain form
63215 877277 897160 915413 932640 949776 966509 981453 993477 1001924 1005869 1004298 997077 984882
63203 984882 968164 947059 922279 895163 866773 837826 809571 783688 760951 740900 723250
63192 723250 708866 698868 693350 691450 692172 694846 699344 706269 716486 730081 746118 763658 782544
63179 782544 803010 824995 848131 871880 895446 918144 940197 962584 985696 1008620 1030200
63168 1030200 1050234 1069053 1086368 1101188 1112613 1120083 1123016 1120802 1113165 1100128 1081723 1058137
63156 1058137 1030085 998603 964458 928139 890465 852805 816510 782262 750107 719963 691930
63145 691930 666223 642974 622234 604090 588551 575244 563403 552418 542340 533644 526528 520620
63133 520620 515353 510432 505966 502337 499924 498797 498676 499245 500351 501831 503506 505619 508867 513515 518758
63118E18758M794M339M706N339N230M295L174K155J253Q33J246K027K296J877
63104E62322J330J004P70N50M61L75J7n46r74j157j195j039o83m87p41j038p62
63087E58207K2P16J115J464J768J835J882K313K885K966K682K926L952M860M888
63072E94481M530M788N851P078P982Q729R741J1153J2655J3787J4474J5243J6708
63059G27200J8901K1342K3701K6030K8454L1017L3738L6448L8662M0184M1741
63048A067418M4336M7834N0866N2413N2832N3003N3065N2589N1544N0404M9374
63037A625678M8178M6683M5338M4706M4741M4727M3898M1938L8761L4064K7452
63026B086164J9094R828L43r492k0021l0754m0392m8050n3968n8769o2380o4039
$$ plain form
63118 518758 523552 527891 532597 537936 543166 547461 550635 552790 554043 554876 556122 558149 560445 562322
63104 562322 563652 564656 565426 565976 566437 566812 566829 566283 565309 564152 562957 561918 561235 560748 560007 558969 558207
63087 558207 558229 558945 560060 561524 563292 565127 567009 569322 572207 575173 577855 580781 584733 589593 594481
63072 594481 599011 603799 609650 616728 624710 633439 643180 654333 666988 680775 695249 710492 727200
63059 727200 746101 767443 791144 817174 845628 876645 910383 946831 985493 1025677 1067418
63048 1067418 1111754 1159588 1210454 1262867 1315699 1368702 1421767 1474356 1525900 1576304 1625678
63037 1625678 1673856 1720539 1765877 1810583 1855324 1900051 1943949 1985887 2024648 2058712 2086164
63026 2086164 2105258 2115086 2115429 2105937 2085916 2055162 2014770 1966720 1912752 1853983 1791603 1727564
63014A727564o3278o0507n6498n1560m5505l8483l1324k4735j8359j1299l558
63003A322458L676R514J4502J9765K5398L0340L3763L5970L7844L9792M1449M2261
62991A656732M2176M1718M1376M0994M0027L8255L5854L2805K8803K3849J8308
62980B040897J2086M479m740j4663k4268l3523m2831n1823n9510o5363o9487p1952
62968A619302p2630p1680o9537o6474o2684n8600n4570n0412m5867m1330l7462
62957I88056l4239l1092k7940k5363k3726k2751k2061k1544k1078k0433j9575
62946G18254j8695j7851j6883j5696j4273j2601j0886r582q794q063p181o757
62934E70992p219p732p121n590m444m158l827k734j415p81j013j674k263k367
$$ plain form
63014 1727564 1664286 1603779 1547281 1495721 1450216 1411733 1380409 1355674 1337315 1326016 1322458
63003 1322458 1326134 1335648 1350150 1369915 1395313 1425653 1459416 1495386 1533230 1573022 1614471 1656732
62991 1656732 1698908 1740626 1782002 1822996 1863023 1901278 1937132 1969937 1998740 2022589 2040897
62980 2040897 2052983 2057462 2052722 2038059 2013791 1980268 1937437 1885614 1826104 1760741 1691254 1619302
62968 1619302 1546672 1474992 1405455 1338981 1276297 1217697 1163127 1112715 1066848 1025518 988056
62957 988056 953817 922725 894785 869422 845696 822945 800884 779340 758262 737829 718254
62946 718254 699559 681708 664825 649129 634856 622255 611369 601787 592993 584930 577749 570992
62934 570992 563773 556041 548920 543330 538886 534728 530901 528167 526752 525971 524958 523284 521021 518654
62920E18654j871j299j359j945k261k053k025k711l693m269m277l874l063j910
62906D82044q00j32l0m80j327k068k169j708j214q06j41O78R91N60Qp9J90N17
62888D74034Q50J021O86L1j59L41P03K40n53p73l26K32N57N58P9p55j274j072
62870D74420p53j105j769j600l19R90J211M63k80l96j66k19p18j170j034l31M78
62853D67702J103J625K130K509K639K519K176J715J362J122N70n16j531j681j218
62838D82226j137j679k009j579q39k57L90J116J183K28q07q03K7O70Q59J111J602
62821D80302J990K207K529K885K998L114L765M722N047M391L514L189L303L436
62807E27392L690M302M822M488L421K813L632N450P002P700Q102Q807R535R811
$$ plain form
62920 518654 516783 515484 514125 512180 509919 507866 505841 503130 499437 495168 490891 487017 483954 482044
62906 482044 481244 481112 481082 480602 479275 477207 475038 473330 472116 471310 471169 471847 472838 473398 473406 473327 473517 474034
62888 474034 474884 475905 476591 476622 476463 476804 477507 477747 477194 476421 476095 476327 476884 477442 477521 476766 475492 474420
62870 474420 473667 472562 470793 469193 468874 469864 471075 471538 471258 470862 470696 470477 469759 468589 467555 467224 467702
62853 467702 468805 470430 472560 475069 477708 480227 482403 484118 485480 486602 487172 486656 485125 483444 482226
62838 482226 481089 479410 477401 475822 474983 474726 475116 476232 477415 477643 476836 476033 476060 476730 477589 478700 480302
62821 480302 482292 484499 487028 489913 492911 496025 499790 504512 509559 513950 517464 520653 523956 527392
62807 527392 531082 535384 540206 544694 548115 550928 554560 560010 567012 574712 582814 591621 601156 610967
62793F10967J0080J1405J4066J7253K0197K2935K5672K8174L0320L2663L5827
62782H59559L9753M4110M9082N5047O1591O7575P2215P5628P8221P9978Q0519
62771A563278P9540P7000P2967O7392N9990N0483L8947K5924J2103k000j6005
62760B029619k9528m2136n3305o2436o9178p3780p6807p8512p8771p7690p5756
62749A311720p3246o9925o5625o0737n5889n1395m7231m3238l9176l4907l0720
62738G39631k7122k4194k1529j8956j6773j5057j3299j1113q828p024n860n152
62726E64724m598l658j886K69J612J757J825K954M759O139P025Q253J0074J1864
62712F11113J3299J4758J6485J8307K0288K2862K6031K9278L2512L6287M0687
$$ plain form
62793 610967 621047 632452 646518 663771 683968 706903 732575 760749 791069 823732 859559
62782 859559 899312 943422 992504 1047551 1109142 1176717 1248932 1324560 1402781 1482759 1563278
62771 1563278 1642818 1719818 1792785 1860177 1920167 1970650 2009597 2035521 2047624 2045624 2029619
62760 2029619 2000091 1957955 1904650 1842214 1773036 1699256 1622449 1543937 1465166 1387476 1311720
62749 1311720 1238474 1168549 1102924 1042187 986298 934903 887672 844434 805258 770351 739631
62738 739631 712509 688315 666786 647830 631057 616000 602701 591588 582760 575736 569876 564724
62726 564724 560126 556468 554582 554851 556463 558220 560045 562999 567758 573897 580922 589175 599249 611113
62712 611113 624412 639170 655655 673962 694250 717112 743143 772421 804933 841220 881907
62701H81907M4796M7886N0672N4620O0172O6337P1879P6421Q0183Q3144Q4775
62690A602792Q4487Q2014P7305P0280O0839M9112L5523K0619M976j0771k5948
62679B051228l9984n2486o3193p1979p8811q3584q6088q6331q4720q1734p7603
62668A244715p2659o7674o3223n8877n3793m8098m2948l9035l5830l2613k9410
62657G00555k6467k3542k0386j7389j5130j3641j2595j1849j1298j0636r758r003
62645E18861q529p879o739n654n294n337m835l479j943j070j177j957k653k542
62631D59773j720j031r60j014p17m77q26j330j239o92l86l09N3N47N32K41Q23
62614D51268K704M834N894N656M834M252M376N184O206P102Q122R624J1290J2450
$$ plain form
62701 881907 926703 974589 1025261 1079881 1140053 1206390 1278269 1354690 1434873 1518017 1602792
62690 1602792 1687279 1769293 1846598 1916878 1977717 2026829 2062352 2082971 2087947 2077176 2051228
62679 2051228 2011244 1958758 1895565 1823586 1744775 1661191 1575103 1488772 1404052 1322318 1244715
62668 1244715 1172056 1104382 1041159 982282 928489 880391 837443 798408 762578 729965 700555
62657 700555 674088 650546 630160 612771 597641 584000 571405 559556 548258 537622 527864 518861
62645 518861 510332 502453 495714 490060 484766 479429 474594 471115 469172 468102 466925 464968 462315 459773
62631 459773 458053 457022 456062 455048 454331 453854 453028 451698 450459 449767 449381 449072 449125 449672 450204 450445 451268
62614 451268 453972 458806 464700 470356 475190 479442 483818 489002 495208 502310 510432 520056 531346 543796
62600E43796J3184J4307J6272J8779K1495K4407K7319K9829L2031L4432L6920
62589H12771L8536L8698L7996L7212L6066L3458K8719K2210J4894P590M93o679
62577A101964j3929k0520k5630k9323l2312l4819l6366l6809l6704l6398l5482
62566G63672l3629l1327k9279k7452k5316k2630j9583j6423j3441j1069r608q895
62554E15020q508q128p511o487n218m181l614l222k709k246k111k121j830j116
62540D56018k75L41M87Q2n63p44m7J060J727J813K055L086M645N985O847P639
62524D90156Q869J0653J2802J5097J7299J9135K0621K2303K4894K8534L2587L6219
62512G39169L8999M1010M2654M4395M6349M7932M8256M6967M4370M0618L5301
$$ plain form
62600 543796 556980 571287 587559 606338 627833 652240 679559 709388 741419 775851 812771
62589 812771 851307 890005 928001 965213 1001279 1034737 1063456 1085666 1100560 1108150 1108643 1101964
62577 1101964 1088035 1067515 1041885 1012562 980250 945431 909065 872256 835552 799154 763672
62566 763672 730043 698716 669437 641985 616669 594039 574456 558033 544592 533523 523915 515020
62554 515020 506512 498384 490873 484386 479168 474987 471373 468151 465442 463196 461085 458964 457134 456018
62540 456018 455743 456084 456571 456653 456090 455346 455299 456359 458086 459899 461954 465040 469685 475670 482517 490156
62524 490156 499025 509678 522480 537577 554876 574011 594632 616935 641829 670363 702950 739169
62512 739169 778168 819178 861832 906227 952576 1000508 1048764 1095731 1140101 1180719 1216020
62501A216020K8228K0113J2000M305l109j0184j6545k1892k5936k8173k8340k6953
62489A119534k4807k1962j7847j2398o490j096L513P596J1415J5003J8149K0427
62477A111037K1354K0493J7433J2120N536n33n132r245j4530k1160k7778l3313
62465A076282l7816m1404m3605m4189m3761m2893m1303l8542l4973l1440k8282
62454F48074k5222k1989j8606j5217j2068r480p570o026m427k754j380o16l22
62441E22397M0R57K381L780M772N493O148O469O054M972L556J754p27l638o187
62426E58221p844q707r009q820q265p597o967o495o472o965p324o775n494m415
62412D57072l957l647l112k659k547k447j946j114k71L19L83j41o36k54R93K190
$$ plain form
62501 1216020 1244248 1264361 1276361 1280666 1277557 1267373 1250828 1228936 1203000 1174827 1146487 1119534
62489 1119534 1094727 1072765 1054918 1042520 1036030 1034934 1038447 1046043 1057458 1072461 1090610 1111037
62477 1111037 1132391 1152884 1170317 1182437 1187973 1187440 1182308 1173063 1158533 1137373 1109595 1076282
62465 1076282 1038466 997062 953457 909268 865507 822614 781311 742769 707796 676356 648074
62454 648074 622852 600863 582257 567040 554972 545492 537922 531896 527469 524715 523335 522719 522397
62441 522397 522437 523394 525775 529555 534327 539820 545968 552437 558491 563463 567019 568773 568046 564408 558221
62426 558221 550377 541670 532661 523841 515576 507979 501012 494517 488045 481080 473756 466981 461487 457072
62412 457072 453115 449468 446356 443697 441150 438703 436757 435643 435372 435691 436074 435933 435297 435043 436036 438226
62396D38226K759L013L253L202K710K257K199K214K043K115K839L826M448M692
62382D79796M990N562O392P424Q375Q817Q873R234J0136J0970J1322J1643J2359
62369E95893J3094J3545J4348J6140J8423K0296K1843K3824K6446K9538L3487
62358H26877L8821M4967N0577N5130N9111O2604O4705O4558O2009N7013M9415
62347A435787L9726K9311J9252R692O27p352j3802j9296k4868l0738l6185m0529
62335A361625m3715m5974m7274m7281m5753m2967l9714l6745l4162l1570k8794
62324I17676k6169k4001k2180k0625j9776k0138k1351k2232k1874k0451j8731
62313F80148j7139j5648j4316j3358j2649j1620r936p913o019m286k525q05P10
$$ plain form
62396 438226 440985 443998 447251 450453 453163 455420 457619 459833 461876 463991 466830 470656 475104 479796
62382 479796 484786 490348 496740 504164 512539 521356 530229 539463 549599 560569 571891 583534 595893
62369 595893 608987 622532 636880 653020 671443 691739 713582 737406 763852 793390 826877
62358 826877 865698 910665 961242 1016372 1075483 1138087 1202792 1267350 1329359 1386372 1435787
62347 1435787 1475513 1504824 1524076 1533768 1534395 1527043 1513241 1493945 1469077 1438339 1402154 1361625
62335 1361625 1317910 1271936 1224662 1177381 1131628 1088661 1048947 1012202 978040 946470 917676
62324 917676 891507 867506 845326 824701 804925 784787 763436 741204 719330 698879 680148
62313 680148 663009 647361 633045 619687 607038 595418 585482 577569 571550 567264 564739 563934 564644
62300E64644K162L725N165O168O888P635Q221Q309Q193Q450Q879Q680P727O669
62286F61515N661M060J863K40n3J65k50j126j586j588j736k024j895j344q72l25
62270F60705J066L412N820P604R180J1387J4489J8072K1591K4849K8237L2482
62258H38894L7832M3577M8710N3019N6980O0756O3829O5594O5718O3771N9122
62247A457802N1484M1300K9527J7350O043l485j1299j8342k5549l3152m0715m7493
62235A423471n2840n6628n9233o0828o0839n8614n4573n0071m6058m2405l8608
62224H42774l4569l0425k6199k2062j8537j6050j4414j3067j1627j0074q624p607
62212F29519p198p053o542n562m809m801m993m365k746r85K07R86J727K229K183
$$ plain form
62300 564644 566806 570531 575696 581864 588752 596387 604608 612917 621110 629560 638439 647119 654846 661515
62286 661515 667176 671236 673099 673339 673286 673451 673201 672075 670489 668901 667165 665141 663246 661902 661030 660705
62270 660705 661771 665183 671003 678607 687787 699174 713663 731735 753326 778175 806412 838894
62258 838894 876726 920303 969013 1022032 1079012 1139768 1203597 1269191 1334909 1398680 1457802
62247 1457802 1509286 1550586 1580113 1597463 1603506 1600021 1588722 1570380 1544831 1511679 1470964 1423471
62235 1423471 1370631 1314003 1254770 1193942 1133103 1074489 1019916 969845 923787 881382 842774
62224 842774 808205 777780 751581 729519 710982 694932 680518 667451 655824 645750 637126 629519
62212 629519 622321 615268 608726 603164 598355 593554 588561 584196 581450 580465 580672 581658 583385 585614 587797
62197E87797K044K721M300N742O182O044O392P456Q480Q854Q810Q904R366J0181
62183F83273J1255J2251J2587J2070J1215J0598J0205R701R139Q932R261R928
62171H10415J0872J2520J5460J9778K4720K9171L2682L5954L9951M4472M8059
62160A124054M9444M8507M5617M0669L3461K4620J5428O833q53p457j2807j7211
62148A350305k1447k6057l0848l5236l8718m1002m1920m1501l9979l7664l4770
62137I61163l1390k7588k3562j9719j6430j3760j1621j0112r378r114q728q065
62125G71696p530p207o434m705k516p40N27J942L912O166Q144R254Q822O458K700
62110G90489j038l491m419m494m422m281l784l160l384n122p638r352r503q592
$$ plain form
62197 587797 589841 592562 596862 602604 608786 614830 621222 628678 637158 646012 654822 663726 673092 683273
62183 683273 694528 706779 719366 731436 742651 753249 763454 773155 782294 791226 800487 810415
62171 810415 821287 833807 849267 869045 893765 922936 955618 991572 1031523 1075995 1124054
62160 1124054 1173498 1222005 1267622 1308291 1341752 1366372 1381800 1388633 1387780 1380323 1367516 1350305
62148 1350305 1328858 1302801 1271953 1236717 1197999 1156997 1115077 1073576 1033597 995933 961163
62137 961163 929773 902185 878623 858904 842474 828714 817093 806981 797603 788489 779761 771696
62125 771696 764166 756959 750525 745820 743304 742564 743091 745033 748945 755111 763255 772509 781331 787789 790489
62110 790489 789451 785960 781541 777047 772625 768344 764560 761400 758016 752894 745256 735904 726401 717809
62096G17809p215n381l239j409L2J880M325O120O303N922O694Q475R585R411R122
62081G68434R625J0421J0943J1683J3174J4923J6295J7638J9583K1711K2937K3061
62069I60428K3074K3834K5122K6183K6780K7371K8419K9841L1157L1959L1999
62058A266167L0844K7866K2790J6100Q722J498m929j0056j3834j6858j9921k3434
62046A284955k7412l1747l6122l9919m2613m4109m4451m3581m1730l9651l7817
62035H55803l5866l3311l0528k8230k6281k3924k1010j8190j5852j3782j1885
62024E96944j0441r457q507p460o718o535o725p140p852q601q713p841o328m720
62010D89906l426k860l197l752l365j685M54K183L455M502N133N113M650M024
$$ plain form
62096 717809 710594 705213 701974 700565 700597 702477 706802 712922 719225 725147 731841 740316 749901 759312 768434
62081 768434 778059 788480 799423 811106 824280 839203 855498 873136 892719 914430 937367 960428
62069 960428 983502 1007336 1032458 1058641 1085421 1112792 1141211 1171052 1202209 1234168 1266167
62058 1266167 1297011 1324877 1347667 1363767 1372489 1373987 1369058 1359002 1345168 1328310 1308389 1284955
62046 1284955 1257543 1225796 1189674 1149755 1107142 1063033 1018582 975001 933271 893620 855803
62035 855803 819937 786626 756098 727868 701587 677663 656653 638463 622611 608829 596944
62024 596944 586503 577046 568539 561079 554361 547826 541101 533961 526109 517508 508795 500954 494626 489906
62010 489906 486480 483620 480423 476671 473306 471621 472075 474258 477713 482215 487348 492461 497111 501135
61996E01135L232K381J906J880J564K83j509k730l082l370m395o003p381q001
61982D75910q021p901p828p673p352o967o506n748m754m047l920l844l180k183
61968C95986j608j448r64j2N32O5p91j027n64j02j1N5M88J189J783K184K705L629
61950D02089M784N782O616P594Q651R267R433R993J1462J3114J3987J4288J4846
61937E31906J5658J6126J6376J7054J7777J7321J5589J4037J3597J3330J1851
61926G00622R158O258L797J794O5j701l790n849p031p146o913o716n885l927j575
61911F71161K32J790M044P035R799J1586J2441J2765J2888J2874J2271J0390P165
61898G86441L390k85l983p726j0695j2207j2825j3610j4563j4829j4116j3030
$$ plain form
61996 501135 504367 506748 508654 510534 512098 512381 510872 508142 505060 501690 497295 491292 483911 475910
61982 475910 467889 459988 452160 444487 437135 430168 423662 417914 413160 409113 405193 401349 398169 395986
61968 395986 394378 392930 391966 391954 392486 392551 391760 390733 390169 390067 390056 390111 390599 391788 393571 395755 398460 402089
61950 402089 406873 412655 419271 426865 435516 444783 454216 464209 475671 488785 502772 517060 531906
61937 531906 547564 563690 580066 597120 614897 632218 647807 661844 675441 688771 700622
61926 700622 709780 716038 719835 721629 721694 719993 716203 710354 703323 696177 689264 682548 676663 672736 671161
61911 671161 671393 673183 677227 684262 694061 705647 718088 730853 743741 756615 768886 779276 786441
61898 786441 789831 789546 785563 777837 767142 754935 742110 728500 713937 699108 684992 671962
61886F71962j2097j1326j0740j0510j0530j0468j0263j0045r670q927q143p894
61874E51349q089p936o864m989k757p07M85N00N1L93J903L673M768N349O194P490
61858E50813Q637R202R673J1092J3919J7396K0183K1713K2672K4008K5766K7263
61846G62337K8119K8588K8803K8284K6462K3438J9848J6085J1942P150K014k741
61834I80329o589r423j1151j1526j0564q751o480l652k58L118N935Q438J0953
61821I40379J2745J2625J0580P724M545L88n017j0700j5706k0088k3964k6598
61809H86913k7397k7064k6765k6652k6063k4711k2790k0430j7892j5838j4549
61798F36762j3332j1589r977r408r387q606o968n658n205m793l836l000l125l969
$$ plain form
61886 671962 659865 648539 637799 627289 616759 606291 596028 585983 576313 567386 559243 551349
61874 551349 543260 535324 528460 523471 520714 520007 520492 520992 521043 521436 523339 527012 531780 537129 543323 550813
61858 550813 559450 568652 578325 589417 603336 620732 640915 662628 685300 709308 735074 762337
61846 762337 790456 819044 847847 876131 902593 926031 945879 961964 973906 981056 983070 980329
61834 980329 973740 964317 953166 941640 931076 922325 915845 912193 911935 915053 920988 929426 940379
61821 940379 953124 965749 976329 984053 988598 988986 983969 973269 957563 937475 913511 886913
61809 886913 859516 832452 805687 779035 752972 728261 705471 685041 667149 651311 636762
61798 636762 623430 611841 601864 592456 583069 574463 567495 561837 556632 551839 548003 545003 541878 537909
61784E37909m686m822m331l223j834j040j463k653l495l418k825k339k010j441
61770D98329n42J63J21n57j254j555j442r04M0R19J134R47J313K426L200K836
61754E05174K076K063K642K763K036R33k17j318j945j792j491j866k596k721k403
61739E01338k740l716l896k640j246j075j629j539n74L90Q42J049J267J425J511
61724D88767J624J654J553J720K542L549L623K334N95k35K55J227J554R07j97
61709E11472j216k170l234m194m656m745m980n439n574n068m401m201m406m454
61695D52734m064l428k813k406k441l059l955m512m367l715k976k440k261k485
61681D07812k882k970k463j634r67o29m96n82r47j310j318j219j612k224j834
$$ plain form
61784 537909 533223 528401 524070 520847 519013 517973 516510 513857 510362 506944 504119 501780 499770 498329
61770 498329 497787 497950 498071 497514 496260 494705 493263 492359 492399 493318 494452 495399 496712 499138 502338 505174
61754 505174 507250 509313 511955 514718 516754 517687 517470 516152 514207 512415 510924 509058 506462 503741 501338
61739 501338 498598 494882 490986 488346 487100 486025 484396 482857 482283 482673 483515 484564 485831 487256 488767
61724 488767 490391 492045 493598 495318 497860 501409 505032 507366 507961 507726 507981 509208 510762 511669 511472
61709 511472 510256 508086 504852 500658 496002 491257 486277 480838 475264 470196 465795 461594 457188 452734
61695 452734 448670 445242 442429 440023 437582 434523 430568 426056 421689 417974 414998 412558 410297 407812
61681 407812 404930 401960 399497 397863 396896 396267 395771 395189 394242 392932 391614 390395 388783 386559 384725
61666C84725J8J990K544J953J595J693J232K5o90j70P72J238J534K118K489K092
61650D05158J434J200J118P87P96J740K810K816K106J957K401K295J470J068J409
61635D30565J204m01k355l191k941k658k795l072l382l860m201l750k388q04J86
61620C96157K99j74p58j116j132p96j78M31N59J8q85j755k551l318l790l734l445
61603C73832l440l726l872l641l144k600k346k765l627l869k788j195n33j032
61589C35254j657j825k009k485k617j902q69l05k18j05J79L83L72K90L02M26M09
61572C23623j39j152j828j454m32K08K18K56N55M86k04o56o4J084J679J414R24
61555C24518P58R04J138J385J616J728J580J132O32N34J010J587J630J086M35
$$ plain form
61666 384725 384743 386733 389277 391230 392825 394518 395750 395775 395085 394915 395687 396925 398459 400577 403066 405158
61650 405158 406592 407792 408910 409697 410493 412233 415043 417859 419965 421922 424323 426618 428088 429156 430565
61635 430565 431769 431368 429013 425822 422881 420223 417428 414356 410974 407114 402913 399163 396775 395971 396157
61620 396157 396456 396282 395524 394408 393276 392480 392302 392733 393292 393310 392425 390670 388119 384801 381011 377277 373832
61603 373832 370392 366666 362794 359153 356009 353409 351063 348298 344671 340802 338014 336819 336286 335254
61589 335254 333597 331772 329763 327278 324661 322759 321890 321585 321367 321262 321441 321824 322196 322486 322788 323214 323623
61572 323623 323484 322332 320504 319050 318618 318826 319044 319300 319855 320341 320137 319481 319417 320501 322180 323594 324518
61555 324518 325276 326180 327318 328703 330319 332047 333627 334759 335391 335925 336935 338522 340152 341238 341673
61540C41673K5q1K33J006J773J940J601J396J483J394R67O46O93Q30R08J118J280
61523C58885P28o66k055k647k563k241j706r11k48j22m16p85j064j110p62k98
61507C42019k92o87p16j13L31mn06k73M90Q18L21n70j290j452p92M63J463J638
61489C40848J449J618J988J876J327J134J617K122J867P65o24j511j261R9J692
61474C55006K471K206J538J125J033Q97M30k64p48p49o10r47j704k093j716j207
61458C54668j266j547j165l7J075J621J706J457P50k35q05n09K40O39M39J45K97
61441C57473Q05J162J257J591K491L356L277K378J804K200K818K671J932J554
61427C86769J772J824J146K03j80J61O62Q41Q54J177J934K758L338L709L782L063
$$ plain form
61540 341673 341698 341617 341850 342856 344629 346569 348170 349566 351049 352443 353410 354056 354749 355579 356487 357605 358885
61523 358885 359613 358947 356892 354245 351682 349441 347735 346824 346576 346454 346038 345253 344189 343079 342317 342019
61507 342019 341727 341040 340324 340211 340542 340538 340032 339759 340249 341067 341388 340818 339528 338076 337284 337747 339210 340848
61489 340848 342297 343915 345903 347779 349106 350240 351857 353979 355846 356611 355987 354476 353215 353314 355006
61474 355006 357477 359683 361221 362346 363379 364276 364706 364442 363694 362945 362335 361388 359684 357591 355875 354668
61458 354668 353402 351855 350690 350653 351728 353349 355055 356512 357262 357027 356222 355713 355953 356592 357031 357176 357473
61441 357473 358278 359440 360697 362288 364779 368135 371412 373790 375594 377794 380612 383283 385215 386769
61427 386769 388541 390365 391511 391714 391534 391695 392357 393198 394052 395229 397163 399921 403259 406968 410750 413813
61411D13813J340n50j459j288r23q39o94m36o97j631k313k075j597j813k419k472
61395C93947j892j323q61n2R37J298Q52L47K72J75l90r93q95r0P60J166J299J636
61377C96193K375L171L453L074K545K467K892L437L855M176M363M214L621K714
61363D42550J787J204J271J843K277K046J400J038J272J842K465L158L948M708
61349D72809N412O176O848O886N938M345K837J790J075O10O75J441K382K620J892
61334E23736Q47J89j52o54j408k115k705l383m049m244l748k820j770p55nK72
61318D97236M00J059K363L581M125M392N185O609P991Q711Q906R335J0682J2820
61304E83395J4800J5726J5566J4760J3321J0944P900N025K666L37k271m640o177
$$ plain form
61411 413813 415153 414603 413144 411856 410933 410094 409400 408964 408267 406636 404323 402248 400651 398838 396419 393947
61395 393947 392055 390732 389871 389819 390756 392054 392906 393253 393525 393700 393310 392317 391422 391332 392092 393258 394557 396193
61377 396193 398568 401739 405192 408266 410811 413278 416170 419607 423462 427638 432001 436215 439836 442550
61363 442550 444337 445541 446812 448655 450932 452978 454378 455416 456688 458530 460995 464153 468101 472809
61349 472809 478221 484397 491245 498131 504069 508414 511251 513041 514116 514726 515401 516842 519224 521844 523736
61334 523736 524583 524772 524620 523966 522558 520443 517738 514355 510306 506062 502314 499494 497724 496969 496964 497236
61318 497236 497636 498695 501058 504639 508764 513156 518341 524950 532941 541652 550558 559893 570575 583395
61304 583395 598195 613921 629487 644247 657568 668512 676412 681437 684103 684440 682169 677529 671352
61291F71352o993p547p994q246q273q059p660p447p789q301q101p023n869n169
61277E66881m491l326j903o17N92J771K574K901L186L500L192K137J473K232L883
61262E83985N142N778O580P940R372J0210J0068Q854O937N051L539K093O23l64
61248F65808p66j394k684l774l942m007n052o437o639n597m638m283l739k660
61234F10196j858j891k190k054j530q96j33P35J577K618M148N664O224N891N864
61219F32365O773P759P708O688N634N200N417O021O643O916O696O010M896L624
61205G18350K916L295M241M727M627M868O045P655Q970J0010J1243J2866J4710
61192H14523J6484J7719J7873J6694J4350J1120P399L940J564L00o91k105l720
$$ plain form
61291 671352 664359 656812 648818 640572 632299 624240 616580 609133 601344 593043 584942 577919 572050 566881
61277 566881 562390 559064 557161 556544 557136 558907 561481 564382 567568 571068 574260 576397 577870 580102 583985
61262 583985 589127 594905 601485 609425 618797 629007 639075 647929 654866 659917 663456 665549 666172 665808
61248 665808 665042 663648 660964 657190 653248 649241 644189 637752 631113 625516 620878 616595 612856 610196
61234 610196 608338 606447 604257 602203 600673 599777 599644 600379 601956 604574 608722 614386 620610 626501 632365
61219 632365 639138 646897 654605 661293 666927 672127 677544 683565 690208 697124 703820 709830 714726 718350
61205 718350 721266 724561 728802 733529 738156 743024 749069 756724 765694 775704 786947 799813 814523
61192 814523 831007 848726 866599 883293 897643 908763 916162 920102 921666 921966 921275 919170 915450
61179I15450m968n876o999q488r646r766r201r186j0334j1697j1959j1342j1367
61166G94621j2662j4074j4445j4194j4273j4489j3979j2735j1484j0425r242q051
61154F44568p202o257m376j692O92K166L098L820M094L707K725J035j509m386
61140F40483o633p871q373q166o965n010l052j379K97J893K934L596M819O973
61126F13546R293J0994J2212J3482J4922J6328J7594J8718J9788K0998K2356K3439
61114H13670K3965K4309K4880K5234K4723K3655K2860K2280K1129J9399J7970
61103A064074J7080J5844J3548J0397O742K658j456m874p546j0214j3146j5680
61091A077427j7267j8137j8575j8468j7814j6891j5616j3629j1194r164p801o501
$$ plain form
61179 915450 910482 904606 897607 889119 879473 869707 860506 851320 840986 829289 817330 805988 794621
61166 794621 781959 767885 753440 739246 724973 710484 696505 683770 672286 661861 652619 644568
61154 644568 637366 631109 626733 625041 625733 627899 630997 634817 638911 642618 645343 646378 644869 640483
61140 640483 633850 625979 617606 609440 602475 597465 594413 593034 593331 595224 598158 601754 606573 613546
61126 613546 622839 633833 646045 659527 674449 690777 708371 727089 746877 767875 790231 813670
61114 813670 837635 861944 886824 912058 936781 960436 983296 1005576 1026705 1046104 1064074
61103 1064074 1081154 1096998 1110546 1120943 1127685 1130343 1128887 1124013 1116467 1106253 1093107 1077427
61091 1077427 1060160 1042023 1023448 1004980 987166 970275 954659 941030 929836 920672 912871 906370
61079I06370m834k975r59J393L734N404O591Q196J0375J2400J4102J6116J8456
61066I94369K0217K1136K2069K3425K4476K4847K5272K6213K6923K6653K5696
61055A261296K4620K3538K2649K2275K1887K0392J7882J5694J4291J2729J0784
61044A468037R645R597R039P056N100M599M709M103L341L567M336M800N728Q212
61030A551869J1341J3418J4699J6762J9745K2291K3827K5002K6319K8143L1607
61019A785023L7626M5395N3639O2963P5060R0069J06606J24075J43070J64115
61009B687641J88142K17699K55413L01861L57411M25230N09284O10224P27404
61000F280309Q64165J025256J208140J403180J601997J790399J919762J897432
$$ plain form
61079 906370 901536 898561 897602 898995 902729 908133 914724 922920 933295 945695 959797 975913 994369
61066 994369 1014586 1035722 1057791 1081216 1105692 1130539 1155811 1182024 1208947 1235600 1261296
61055 1261296 1285916 1309454 1332103 1354378 1376265 1396657 1414539 1430233 1444524 1457253 1468037
61044 1468037 1477682 1487279 1496318 1503374 1508474 1513073 1517782 1521885 1525226 1528793 1533129 1537929 1543657 1551869
61030 1551869 1563210 1576628 1591327 1608089 1627834 1650125 1673952 1698954 1725273 1753416 1785023
61019 1785023 1822649 1868044 1921683 1984646 2059706 2149775 2256381 2380456 2523526 2687641
61009 2687641 2875783 3093482 3348895 3650756 4008167 4433397 4942681 5552905 6280309
61000 6280309 7144474 8169730 9377870 10781050 12383047 14173446 16093208 17990640
60992A7990640J638700J152363N71016P8261k05230k70522j77543L353J94686
60983B0975724K87239J64680k14615p63077j307587j696993j875953j876158j762083
60974A1931177j590391j399799j213453j041338q84894p43973o19848n13280m23196
60965C501005l48188k87445k39604k02237j73005j50250j32273j17209j03935
60956A746859r2241q1921p2473o3798n6210m9529m3020l6631l1584k9164k9242
60945A161046l0410l1296l1359l0646k9252k7295k5166k3414k2295k1627k1224
60934H67062k1085k0933j9979j7846j5428j4029j3655j3059j1599j0077r320q924
60922F91128q130p096o400n894n104m398m557n264n196l800k035j026p58o54n84
$$ plain form
60992 17990640 19629340 20781703 21352719 21430980 21225750 20955228 20777685 20781038 20975724
60983 20975724 21262963 21427643 21213028 20449951 19142364 17445371 15569418 13693260 11931177
60974 11931177 10340786 8940987 7727534 6686196 5801302 5057329 4437481 3924201 3501005
60965 3501005 3152817 2865372 2625768 2423531 2250526 2100276 1968003 1850794 1746859
60956 1746859 1654618 1572697 1500224 1436426 1380216 1330687 1287667 1251036 1219452 1190288 1161046
60945 1161046 1130636 1099340 1067981 1037335 1008083 980788 955622 932208 909913 888286 867062
60934 867062 845977 825044 805065 787219 771791 757762 744107 731048 719449 709372 700052 691128
60922 691128 682998 675902 669502 663608 658504 654106 649549 644285 639089 635289 633254 632228 631470 630816 630232
60907F30232o65n76N6Q19Q24r8j123j551j683k347l875n779p149p335o478n616
60891E87656n820p087q336q683q285p613o625n238m144m171n043n683n743n881
60877D99304o414o619n857m519l392k653k034j444r51n13j61OK43J094K536L757
60861D72383M222M380M873N592O012N890N171L820K330J672K063K399J781R06
60847E23494J031K068K797K625J979J215K30q09j471j905k809m398o106p327p845
60832E02769p530o416n097m370m383m646m733m492l822l012k954m084n419n651
60818D36160n013m822n293n221m051k889k790l264l249k675k235k240k399k375
60804C87644j972j239o87r16j640j708n68Q74J372Q50K19J33M86Q78J029R37R86
$$ plain form
60907 630232 629567 628991 629047 629866 630690 630592 629469 627918 626235 623888 620013 614234 607085 599750 593272 587656
60891 587656 581836 574749 566413 557730 549445 541832 535207 529969 525825 521654 516611 510928 505185 499304
60877 499304 492890 486271 480414 475895 472503 469850 467816 466372 465421 464908 464747 464753 464996 466090 468626 472383
60861 472383 476605 480985 485858 491450 497462 503352 508523 512343 514673 516345 518408 520807 522588 523494
60847 523494 524525 526593 529390 532015 533994 535209 535439 534630 533159 531254 528445 524047 517941 510614 502769
60832 502769 495239 488823 483726 479356 474973 470327 465594 461102 457280 454268 451314 447230 441811 436160
60818 436160 431147 426325 421032 415811 411760 408871 406081 402817 399568 396893 394658 392418 390019 387644
60804 387644 385672 384433 383746 382830 381190 379482 378914 379788 381160 382010 382229 382362 382848 383726 384755 385692 386678
60787C86678J681K995M193M598M251L567K728J738P57j5n26o77k02Q45J722J638
60771D15971O21n29j136j141p96l19M4m9p40j635k133k157k323l020l631l211
60755C93816j866q08q12j333j543j464j482j378o96L12J034J519K149K541J832
60740C91821J39j343j960k401l442m666n031m202k826j737j210r44n68k22m07
60725C61001j154j653j220k20N47J035J747K583K845K346J649J183Q97Q61J317
60710C73764J988K215J946J788J966K040J882J946K311K351J741J016O65M72J27
60695C98218k14m23p34j210j505j523j612j791j609j032o72o83l93M76J098P92
60679C87183J07m2M18J128K121L319L896L202J881J104R74N71n80j978k931l178
$$ plain form
60787 386678 388359 391354 395547 400145 404396 407963 410691 412429 413186 413171 412645 411968 411766 412611 414333 415971
60771 415971 416592 416063 414927 413786 412990 412671 412715 412666 411926 410291 408158 406001 403678 400658 397027 393816
60755 393816 391950 391142 390330 388997 387454 385990 384508 383130 382434 382746 383780 385299 387448 389989 391821
60740 391821 391960 390617 388657 386256 382814 378148 373117 368915 366089 364352 363142 362198 361630 361408 361001
60725 361001 359847 358194 356974 356754 357301 358336 360083 362666 365511 367857 369506 370689 371586 372447 373764
60710 373764 375752 377967 379913 381701 383667 385707 387589 389535 391846 394197 395938 396954 397619 398091 398218
60695 398218 398004 397581 396847 395637 394132 392609 390997 389206 387597 386565 385893 385210 384817 385293 386391 387183
60679 387183 387290 387248 387666 388794 390915 394234 398130 401332 403213 404317 405291 405862 405282 403304 400373 397195
60663C97195k799k169j948k451l108l043k082q04K72J009J381J420J388J528J677
60648C87466J553J268J227J589K176K684K694J789P7j572k355k350k152j974j628
60633C90492j173r64j029r99p13m24l17k25j1J16m8k70j06M68Q97O94J15r7L35
60614C86741Q52Q34L60j15m58p11o16l4M13o4j099j447p32k9k46q62q48j97K89
60595C82031K89L26R04J877K654K817K515K282K313K106J238K92K40R29J127L38
60579D04278l59J26J383K259K480K635L031L384L548L800M433N511O912Q363R579
60564D61363J0523J1276J1592J1087R978Q927P921O083L073r3k315l669m693n098
60550E25955m338k911j976j716j158K41J790K636K953L594M966O688Q299R947
$$ plain form
60663 397195 394396 392227 390279 387828 384720 381677 379595 378791 379063 380072 381453 382873 384261 385789 387466
60648 387466 389019 390287 391514 393103 395279 397963 400657 402446 402523 400951 398596 396246 394094 392120 390492
60633 390492 389319 388355 387326 386327 385614 385190 384873 384648 384637 384753 384705 384435 384329 384797 385694 386388 386503 386406 386741
60614 386741 387593 388427 388787 388672 388214 387503 386887 386853 387266 387202 386103 384656 383924 383895 383649 382787 381939 381742 382031
60595 382031 382320 382646 383550 385427 388081 390898 393413 395695 398008 400114 401352 401644 401884 402813 403940 404278
60579 404278 403919 404045 405428 407687 410167 412802 415833 419217 422765 426565 430998 436509 443421 451784 461363
60564 461363 471886 483162 494754 505841 515819 524746 532667 538750 541823 541730 539415 535746 531053 525955
60550 525955 521617 518706 516730 515014 513856 514097 515887 518523 521476 525070 530036 536724 545023 554970
60536E54970J2129J4804J7161J8632J9729K1159K2236K1239J7623J2864Q596M814
60524G45956P01l579p011r150j0405j1087j1101j0556r876r241q464p402o123
60511F42662m670l134j764o53M97J945L524N070O933R556J2846J6380K0044K3999
60497G33235K8231L2555L6811M0723M3898M6177M7650M7950M6263M2485L7740
60486A183718L3073K8116K1838J4067N478l520j2900k2262l0880l8453m5033n0285
60474A082957n3574n4738n4148n2087m8745m4672m0561l6600l2628k8756k5242
60463F11206k1928j8572j5549j3403j1828j0024q076p000p161p566p167o118n221
60450D71593m665l999l082k411k412k743k630j834j032j000j527j653r89k59k05
$$ plain form
60536 554970 567099 581903 599064 617696 637425 658584 680820 702059 719682 732546 741142 745956
60524 745956 746657 743078 736067 726917 716512 705425 694324 683768 673892 664651 656187 648785 642662
60511 642662 637992 634858 633094 632441 632938 634883 638407 643477 650410 659966 672812 689192 709236 733235
60497 733235 761466 794021 830832 871555 915453 961630 1009280 1057230 1103493 1145978 1183718
60486 1183718 1216791 1244907 1266745 1280812 1286290 1282770 1269870 1247608 1216728 1178275 1133242 1082957
60474 1082957 1029383 974645 920497 868410 819665 774993 734432 697832 665204 636448 611206
60463 611206 589278 570706 555157 541754 529926 519902 511826 504826 497665 490099 482932 476814 471593
60450 471593 466928 462929 459847 457436 455024 452281 449651 447817 446785 445785 444258 442605 441616 441357 441152
60435D41152n75p29p43j165j951k443k291j777j187m96K22O41O33N05N49O42M73
60418D31460O7j00L44J125J519J290J101J565K255K299J761J499J671J499P41
60403D50096K67O35J208J351J514K256L064L157K664K101J410N91N20J821L488
60388D76143L943L162K505K626K900K780K499K333K211K229K609L041K953K549
60374E14483K627L330L831L454K446J501J135J494K239K662K444K066K033K012
60360E47757J541J097J552K824M081N038O067P093P527P356P371Q093R117R621
60346F26135Q954O906M032J455l35k095m555p055q440q687q533q062p058o274
60332E86388o601p256o564m615l263l337l608l046k331k364k885l427m178m964
$$ plain form
60435 441152 440577 439848 439105 437940 435989 433546 431255 429478 428291 427795 428017 428658 429291 429796 430345 430987 431460
60418 431460 431527 431427 431771 432896 434415 435705 436806 438371 440626 442925 444686 446185 447856 449355 450096
60403 450096 450363 450998 452206 453557 455071 457327 460391 463548 466212 468313 469723 470314 470834 472655 476143
60388 476143 480086 483248 485753 488379 491279 494059 496558 498891 501102 503331 505940 508981 511934 514483
60374 514483 517110 520440 524271 527725 530171 531672 532807 534301 536540 539202 541646 543712 545745 547757
60360 547757 549298 550395 551947 554771 558852 563890 569957 577050 584577 591933 599304 607397 616514 626135
60346 626135 635089 641995 646027 647482 647147 645052 640497 633442 625002 616315 607782 599720 592662 586388
60332 586388 579787 572531 565967 561352 558089 554752 551144 548098 545767 543403 540518 537091 532913 527949
60318E27949m646k651J2K151L911N875P680Q696R297J0304J1659J2594J2809J2580
60304F18220J2064J1288J0515J0005R589Q947P964O485M155R19k734o410j0093
60291F80914j3496j5768j6368j5719j4479j2788j0762r067q246p875p112n849
60279E43385m685l971l503l065k715k541k505k572k778l069l185k784j844r54
60265E03214q46j450j880j644j349j571j707q95L69P87J79l65k80j09j67L6O76
60248D92998J165J262J494J968J912J031K09J37K60j51q11j080j028j041r97o13
60232D96715m0N12J114J665J819J832K574M038M884M228K977K462K651K701K566
60217E32698K810L422L964M546N578O747P293P125O864O918P223P659Q028P877
$$ plain form
60318 527949 523303 520652 520664 522815 526726 532601 540281 548977 558274 568578 580237 592831 605640 618220
60304 618220 630284 641572 652087 662092 671681 680628 688592 695077 699232 700151 697417 691007 680914
60291 680914 667418 651650 635282 619563 605084 592296 581534 572467 564221 556346 549234 543385
60279 543385 538700 534729 531226 528161 525446 522905 520400 517828 515050 511981 508796 506012 504168 503214
60265 503214 502368 500918 499038 497394 496045 494474 492767 491872 492241 493028 493207 492842 492562 492453 492286 492322 492998
60248 492998 494163 495425 496919 498887 500799 501830 502039 502176 502436 502285 501474 500394 499366 498325 497328 496715
60232 496715 496675 497187 498301 499966 501785 503617 506191 510229 515113 519341 522318 524780 527431 530132 532698
60217 532698 535508 538930 542894 547440 553018 559765 567058 574183 581047 587965 595188 602847 610875 618752
60203F18752P064O169N712N304M380L354L077L351L040J677R3p73r54j113j648
60188F57485k432l117l477l621l805m052m136m070m244m847n487n703n441m824
60174E98229l870k822k177k005j694r22l14n32j184j396j133j114j572j894j602
60159E73998r51l90O1O60J425K044K217K052J975K170K205J557M63k28j10L46
60143E89494N81O20P61J072J512K122K839L436L915M490N093N377N320N280N225
60128F37137M644L459K348J830J669J575J694K011K037J646J518K101K780K724
60114F69173K088J674J777K036K055J656Q12k29j059j602k134k705l098l537m578
60099F62329n968o529n658m134k921k058j314r33r06m31R35K295K585K025J497
$$ plain form
60203 618752 625816 631985 637697 643001 647381 650735 653812 657163 660203 661880 661973 661200 660246 659133 657485
60188 657485 655053 651936 648459 644838 641033 636981 632845 628775 624531 619684 614197 608494 603053 598229
60174 598229 594359 591537 589360 587355 585661 584739 584425 583893 582709 581313 580180 579066 577494 575600 573998
60159 573998 573047 572657 572718 573378 574803 576847 579064 581116 583091 585261 587466 589023 589486 589258 589148 589494
60143 589494 590075 590695 591456 592528 594040 596162 599001 602437 606352 610842 615935 621312 626632 631912 637137
60128 637137 641781 645240 647588 649418 651087 652662 654356 656367 658404 660050 661568 663669 666449 669173
60114 669173 671261 672935 674712 676748 678803 680459 681271 681042 679983 678381 676247 673542 670444 666907 662329
60099 662329 656361 649832 644174 640040 637119 635061 633747 632814 631908 631477 632412 634707 637292 639317 640814
60084F40814J105M19m38j036j556k450l461l910l730l437l417l885n065o634p533
60069E95786p230o568o491o572n901m791m315m558m650m303l992l754l105k147
60055E27409j575j466j148l89L65R64J695K325K148J309J030K096L858N193N655
60040E49469N405M699L902L445L346L150K630K028J483O50o83k090k970l266l451
60025E67747l892m525n117n688o487p570q593r197r407r313q641p245n825n311
60011D70936n455n014l549k062j379j059m92q8m26j096j335j184j010o21K13R37
59995D47316R94Q97J493K568L214L248L185L178K989K765K866L102K994K497J764
59980D85070O55o87j359q62k29q04k321l299l086k287j519r28p48j086j311p99
$$ plain form
60084 640814 641919 642338 641900 640864 639308 636858 633397 629487 625757 622320 618903 615018 609953 603319 595786
60069 595786 588556 581988 575497 568925 563024 558233 553918 549360 544710 540407 536415 532661 529556 527409
60055 527409 525834 524368 523220 522831 523196 524160 525855 528180 530328 531637 532667 534763 538621 543814 549469
60040 549469 554874 559573 563475 566920 570266 573416 576046 578074 579557 580207 579524 577434 574464 571198 567747
60025 567747 563855 559330 554213 548525 542038 534468 525875 516678 507271 497958 489317 482072 476247 470936
60011 470936 465481 460467 456918 454856 453477 452418 451926 451838 451412 450316 448981 447797 446787 446166 446379 447316
59995 447316 448310 449207 450700 453268 456482 459730 462915 466093 469082 471847 474713 477815 480809 483306 485070
59980 485070 485725 485038 483679 482817 482588 481784 479463 476164 473078 470791 469272 468344 467596 466510 465199 464400
59964D64400n5Ml78j85O40J231J389J666J910J301O0l78N63J684J672P36j3P8
59946D76325Q28J569J531N32o33j105j128j536k327k757k721k800k937k320p67
59931D59754R15K193L328M423N079N256N470N834N820N279M558L501J476j195
59917E11691l062l297k666k189j805r98J18J012J501J692J676J640J798J997J843
59902E10951J395J168J367J664J767J608J063J58n00k70O68J714K819M110M951
59887E34633M631L789L836M889N644N426M948M872N017N359O362P767Q407P809
59873F13389O826O121N201L556J620q0j667l095l663l089k152j598j263r03q92
59858F18311j412j805j505r01o31o91p16m30N67K511M610N471M951M551N296O242
$$ plain form
59964 464400 464345 464349 463971 463786 464426 465657 467046 468712 470622 471923 471983 471605 472168 473852 475524 476260 476247 476325
59946 476325 477153 478722 480253 480785 480152 479047 477919 476383 474056 471299 468578 465778 462841 460521 459754
59931 459754 460669 462862 466190 470613 475692 480948 486418 492252 498072 503351 507909 511410 512886 511691
59917 511691 508629 505332 502666 500477 498672 497674 497792 498804 500305 501997 503673 505313 507111 509108 510951
59902 510951 512346 513514 514881 516545 518312 519920 520983 521141 520641 520371 521039 522753 525572 529682 534633
59887 534633 539264 543053 546889 551778 557422 562848 567796 572668 577685 583044 589406 597173 605580 613389
59873 613389 620215 626336 631537 635093 636713 636633 634966 631871 628208 625119 622967 621369 620106 619203 618311
59858 618311 616899 615094 613589 612688 612057 611366 610650 610220 610787 613298 617908 623379 628330 632881 638177 644419
59842F44419N886M130K049M85l10l08J92O42R51J471J933J357m48k317l281l669
59826F53182l924l504k012n12m21j643k868l386l574l922m426m768m524l486k222
59811F07990j874k847m205m834m642m171l732l507l786m415m605l899k833k074
59797E56566j568j154j225k042k968l228k977k841k872k652k082j377o57o8J6
59782E28871m95j059j120p71m47l25l72m80k90N97J947L031L579L967M259M057
59766E44949L498L425M082M628M489M222M424M760M718M550M676M918M964M820
59752F07123M358L313K237K393M002N632O030N538M987M386L637L333L719L880
59738F64568L167K387K452K747K181J031M00N39R18J385J902J845Q50k00k82J79
$$ plain form
59842 644419 650305 654435 656484 656969 656659 656351 656543 657185 658136 659607 661540 662897 662449 660132 656851 653182
59826 653182 649258 645754 643742 643230 642809 641166 638298 634912 631338 627416 622990 618222 613698 610212 607990
59811 607990 606116 603269 599064 594230 589588 585417 581685 578178 574392 569977 565372 561473 558640 556566
59797 556566 554998 553844 552619 550577 547609 544381 541404 538563 535691 533039 530957 529580 528923 528855 528871
59782 528871 528376 527317 526197 525426 524979 524654 524282 523802 523512 524109 526056 529087 532666 536633 540892 544949
59766 544949 548447 551872 555954 560582 565071 569293 573717 578477 583195 587745 592421 597339 602303 607123
59752 607123 611481 614794 617031 619424 623426 629058 635088 640626 645613 649999 653636 656969 660688 664568
59738 664568 667735 670122 672574 675321 677502 678533 678933 679472 680390 681775 683677 685522 686372 686172 685890 686069
59722F86069J63j60J49J036J540J361R86N36k18r10r15n17o02j243j717j699j460
59705F82399j093n83l17n56o84j25M11j12j269j684j125o32o12l58L62O57j59
59688F74520j657l063l995m198l509k394j687j642j888k356l314m419m813m381
59674F31204m025m380n065n521n773o013o058n652m853l859k828k019j673j615
59660E71870j373p44M1P06J151J413J677K165K730K830K277J641J452J386Q02
59645E90024k95j393k293l160m001m650m975m765l762k303j339j262j323q18k37
59630E53448l79j032j409j431j616k058k468k872l375l673l582l645m259m732
59616E16917m212l112k509k519k465k213k161k093j351m5J009J525J899K281K549
$$ plain form
59722 686069 686232 686072 686221 687257 688797 690158 691144 691680 691462 690552 689637 689120 688518 687275 685558 683859 682399
59705 682399 681306 680723 680406 679850 679166 679041 679452 679340 678071 676387 675262 674630 674018 673660 674022 674679 674520
59688 674520 672863 669800 665805 661607 658098 655704 654017 652375 650487 648131 644817 640398 635585 631204
59674 631204 627179 622799 617734 612213 606440 600427 594369 588717 583864 580005 577177 575158 573485 571870
59660 571870 570497 569753 569794 570500 571651 573064 574741 576906 579636 582466 584743 586384 587836 589222 590024
59645 590024 589729 588336 586043 582883 578882 574232 569257 564492 560730 558427 557088 555826 554503 553685 553448
59630 553448 553069 552037 550628 549197 547581 545523 543055 540183 536808 533135 529553 525908 521649 516917
59616 516917 512705 509593 507084 504565 502100 499887 497726 495633 494282 494237 495246 496771 498670 500951 503500
59601E03500K970L779M301L658K268J446J545J724J554J554J953K121J643R86
59587E35002P13P30O35J95n63j235j187m32L8m99j399j704j696k149k630k105
59571E21714r15m49q69q80J0O97M25j3K42P72P89K93l37r64j301p99L98J209R82
59552E21004L21R1K70M21N04O76R11J306K223L633M953O002P475R902J2707J4978
59536E87377J6747J8618K0138J9284J4227N653l061q431r639q477o786m885k636
59523F38129p52m5j70k15kR7L6k64j526m029o474p303o869o820p543p834p049
59506E81367o011n518n415n473n789o013n425m270l685l853l508j887k9O19n2
59491E25058j098j766j831j374q10o44p83n90K01J207K120L011L767M053L932
$$ plain form
59601 503500 506470 510249 514550 518208 520476 521922 523467 525191 526745 528299 530252 532373 534016 535002
59587 535002 535715 536445 537080 537275 536712 535477 534290 533858 533896 533397 531998 530294 528598 526449 523819 521714
59571 521714 520799 520350 519481 518601 518611 519308 519733 519720 519962 520734 521523 521816 521479 520515 519214 518415 518813 520022 521004
59552 521004 521325 521416 521686 522107 522611 523287 524198 525504 527727 531360 536313 542315 549790 559692 572399 587377
59536 587377 604124 622742 642880 662164 676391 682044 678983 670552 660913 652436 645650 640765 638129
59523 638129 637377 637332 637162 636947 636945 637042 637078 636814 635288 631259 624785 617482 610613 603793 596250 588416 581367
59506 581367 575356 569838 564423 558950 553161 547148 541723 537453 533768 529915 526407 524520 524491 525110 525058
59491 525058 523960 522194 520363 518989 518179 517535 516752 516162 516363 517570 519690 522701 526468 530521 534453
59476E34453L875M025M161M349M799N147M808M074L803L968L585K298R51L56M83
59461E85135J101K196L465M338M828N479O261O498O062N690N807N990N819N365
59447F54034M687L740K850K287J361q12l609n382n833o397p773q578p335m564
59433F18676k005n93j6M48J331K628L672L990M294N730P982R423R517R789J1755
59418F86621J5033J8235K0743K2718K4191K5092K5838K7047K8585K8932K5525
59407I48560J6527L249r541j7122j8691j6873j3944j0072m990O76O057J0076J0419
59394I04331M732o004j6968k3724k5748k5026k2913j9820j6595j4230j2669j1136
59382G14230r399p764o339n051m022l288k688k348k540k826k272r21J19M53R66
$$ plain form
59476 534453 538328 542353 546514 550863 555662 560809 565617 569691 573494 577462 581047 583345 584296 584652 585135
59461 585135 586236 588432 591897 596235 601063 606542 612803 619301 625363 631053 636860 642850 648669 654034
59447 654034 658721 662461 665311 667598 668959 668147 664538 659156 653323 646926 639153 630575 623240 618676
59433 618676 616671 616078 616062 616510 617841 620469 624141 628131 632425 638155 646137 655560 665077 674866 686621
59418 686621 701654 719889 740632 763350 787541 812633 838471 865518 894103 923035 948560
59407 948560 965087 968336 958795 941673 922982 906109 892165 882093 877103 877779 883836 893912 904331
59394 904331 909063 903059 886091 862367 836619 811593 788680 768860 752265 738035 725366 714230
59382 714230 704831 697067 690728 685677 681655 678367 675679 673331 670791 667965 665693 664772 664891 665344 666310
59367F66310K057K722K367K135L260N119O226O345O409O941P720Q610R718J1000
59353G46939J2282J3435J4172J4256J4216J4984J6446J7256J6606J5251J4181
59342I10024J3170J1362Q543N225K021o20k714m980q007j1148j3249j4432j5838
59329H79357j7587j8575j8515j8419j8556j7814j5867j4154j3676j3469j2394
59318G00331j0939j0080r711r316q940q451p182n269l943l607l124j933j056q60
59304F15920J81L002O057P655Q495J0040J1932J2950J3023J2185R037K681m813
59291G08345j0211j2668j3418j2983j1093q634p057o050m067j128J076J875K397
59278F26384L493M754N838P203R073J1010J2706J4181J5149J5166J4414J3496
$$ plain form
59367 666310 668367 671089 673456 675591 678851 683970 690196 696541 702950 709891 717611 726221 735939 746939
59353 746939 759221 772656 786828 801084 815300 830284 846730 863986 880592 895843 910024
59342 910024 923194 934556 943099 948324 950345 949725 947011 942031 934024 922876 909627 895195 879357
59329 879357 861770 843195 824680 806261 787705 769891 754024 739870 726194 712725 700331
59318 700331 689392 679312 669601 660285 651345 642894 635712 630443 626500 622893 619769 617836 616780 615920
59304 615920 616101 619103 625160 632815 641310 651350 663282 676232 689255 701440 710477 713158 708345
59291 708345 698134 685466 672048 659065 647972 639338 632281 626231 622164 621036 622112 623987 626384
59278 626384 629877 634631 640469 647672 656745 667755 680461 694642 709791 724957 739371 752867
59266G52867J2666J1971J1557J1025R248O039L031J660J025o72l374n504o448
59253H05091o978p512p703p492p159o467n107l596k546j507R1J524J801J463J736
59238G55639K421K478K091K265K624J680p38l197m824o019o955p204p046p511
59224G25704q752r794j0152j0330j0535j0211r141p815o547n292m371m192m270
59211F24302l687k543j789j651j434q65n39q55j457j682r43R84L276M356L807
59196F19280L127L444L596K126Q9k94R51J739J200M85L40K23n6J38O38L85o30
59179F36781j103n09K08M70R02J814K476K464K369K604K780K701K784L118L256
59164F63115L197L453L925L930L383K753J824q8k629m564n576o548p876q912r215
$$ plain form
59266 752867 765533 777504 789061 800086 809334 815373 818404 820064 821089 820417 817043 811539 805091
59253 805091 798113 790601 782898 775406 768247 761780 756673 753077 750531 749024 749115 750639 752440 753903 755639
59238 755639 758060 760538 762629 764894 767518 769198 768460 765263 760439 754420 747465 740261 733215 725704
59224 725704 716952 707158 697006 686676 676141 665930 656789 648974 642427 637135 632764 628572 624302
59211 624302 620615 618072 616283 614632 613198 612333 611794 610939 609482 607800 606857 607841 611117 615473 619280
59196 619280 622407 625851 629447 631573 631662 631368 632319 634058 635258 635743 636083 636306 636250 636388 637026 637411 636781
59179 636781 635678 635169 635377 635847 636749 638563 641039 643503 645872 648476 651256 653957 656741 659859 663115
59164 663115 666312 669765 673690 677620 681003 683756 685580 685492 682863 678299 672723 666175 658299 649387 640172
59149F40172r035q447p282o001n285m860m092l547m280n728o168n286m415m125
59135E61621l616k730k528l197l412k458j280o38R9J513L003L894M401M839N109
59120E64620N475O511P848Q397Q209Q627J0132J1626J2288J2554J2693J2112J0776
59107F91868R713R307Q530O733M795L652L037K370J628O87q79k726l760l816l892
59092G27247m283m021k781j622j156o61J27J29j129k362k512k397l128m262m810
59077F92379m966n502o426p299p990q194p316n697m769n132n594n089m230l908
59063F10267l660k725j658j442j919k283k426k658k801k612k427k450k153j324
59049E77729q78j520k404k220j027N8M84N75N80L46k31j012j690j765r46K64R30
$$ plain form
59149 640172 631137 622690 615408 609407 604122 599262 595170 591623 587343 581615 575447 570161 565746 561621
59135 561621 558005 555275 552747 549550 546138 543680 542400 541762 541861 543374 546377 550271 554672 559511 564620
59120 564620 570095 576606 584454 592851 601060 609687 619819 631445 643733 656287 668980 681092 691868
59107 691868 701581 710888 719418 726151 730946 734598 737635 740005 741633 742320 741441 738715 734955 731139 727247
59092 727247 722964 718943 716162 714540 713384 712723 712850 712979 711850 709488 706976 704579 701451 697189 692379
59077 692379 687413 681911 675485 668186 660196 652002 644686 638989 634220 629088 623494 618405 614175 610267
59063 610267 606607 603882 602224 600782 598863 596580 594154 591496 588695 586083 583656 581206 579053 577729
59049 577729 576851 575331 572927 570707 569680 569738 570222 570797 571377 571723 571492 570480 568790 567025 566079 566343 567273
59032E67273Q85Q08J043J273J508K261L450M368N138O822R503J1633J2041J1477
59018F39483J1274J1516J1389J0403Q477N711K787P07m55j667l245m158l630k357
59004F86235j356o66O3P15J202J965L162M216M697M845M698L789K293J326J430
58989G18614J793J568J004N55M6o57j089j016r05r66p07J45J223K377L807N166
58973G30958N865O492Q344J1062J2610J2249J1710J2390J3272J2888J1706J1061
58961H60607J0949J0390R086P417N584L670J865j31l033o693r959j2281j4185
58948H63286j5745j6135j5404j4956j5414j5612j4666j3373j2482j1321r294p229
58936G01655n880m617k917j642j474j544r90m79p90j277j111p64q52q97o15r70
$$ plain form
59032 567273 568158 568966 570009 571282 572790 575051 578501 582869 588007 594829 604332 615965 628006 639483
59018 639483 650757 662273 673662 684065 692542 698253 701040 701747 701292 699625 696380 692222 688592 686235
59004 686235 684879 684213 684276 684991 686193 688158 691320 695536 700233 705078 709776 713565 715858 717184 718614
58989 718614 720407 721975 722979 723534 723580 722923 721834 720818 719913 718947 718240 718385 719608 721985 725792 730958
58973 730958 736823 743315 751659 762721 775331 787580 799290 811680 824952 837840 849546 860607
58961 860607 871556 881946 891032 898449 904033 907703 909568 909437 906404 899711 889752 877471 863286
58948 863286 847541 831406 816002 801046 785632 770020 755354 741981 729499 718178 708884 701655
58936 701655 695775 691158 688241 686599 685125 683581 682591 682112 681322 680045 678934 678170 677318 676421 675806 674836
58920F74836k428l600l236k277k189k583k181j068k40K01P60J341J737K553M281
58905F65907O337Q072R732J1421J2439J2727J3376J4586J4875J3717J2975J3960
58893H10124J4992J4096J2407J2475J4496J6667J8227J9690K0894K1079K0336
58882I95483J9063J6676J2701Q291M809J727k158o342r467j1616j3752j5625j6257
58869I83533j5839j5252j4341j2485j0210q521p375o439o358p516q634q548q251
58856H53764r141j0476j0736j0361j0674j1135j0307q690p983q117p678o772o778
58843G34916p620p859p331p214p656p736p614q298r335r146p647o336n709m872
58829F30543l638k831k422j468n4P73R90J595K595L101L291M195N481N603M335
$$ plain form
58920 674836 672408 668808 665572 663295 661106 658523 656342 655274 655034 655235 655995 657336 659073 661626 665907
58905 665907 672244 680316 690048 701469 713908 726635 740011 754597 769472 783189 796164 810124
58893 810124 825116 839212 851619 864094 878590 895257 913484 933174 954068 975147 995483
58882 995483 1014546 1031222 1043923 1052214 1057023 1058750 1056592 1050250 1040783 1029167 1015415 999790 983533
58869 983533 967694 952442 938101 925616 915406 906885 899510 893071 886713 879197 870563 862015 853764
58856 853764 844623 834147 823411 813050 802376 791241 780934 772244 764261 756144 748466 741694 734916
58843 734916 727296 719437 712106 704892 697236 689500 681886 673588 664253 655107 647460 641124 635415 630543
58829 630543 626905 624074 621652 620184 620130 620903 621893 623488 626083 629184 632475 636670 642151 647754 652089
58814F52089L178L053L391L557L393K490P72l90K93J637J240j020k984l609l896
58799F63194m369m192l351l262m412n360n065m366m376m941n346n321m709l357
58785F00767j682m05M13J096J477J404J618K676L598L240K378K527L303L036J595
58770F27041K61r05l119o219q357q697q247p708o580m806l288k284j070M05J237
58755E67664J239J320J899K428K602K597K164J096L41R62K243K635K336K908M552
58740E98986N858O253O608P315P772P806P809P520O498N605O009P025P026O179
58726F94269O026O600O445N376M737M804M403L347K894L523M404N169O129O818
58712G64944O503N891O019N840L564P1k076k823m587p916j0563j1480j2391j4498
$$ plain form
58814 652089 655267 658320 661711 665268 668661 671151 671923 671533 671826 673463 674703 673683 670699 667090 663194
58799 663194 658825 654633 651282 648020 643608 638248 633183 628817 624441 619500 614154 608833 604124 600767
58785 600767 599085 598680 599093 600189 601666 603070 604688 607364 610962 614202 616580 619107 622410 625446 627041
58770 627041 627302 626397 623278 617059 608702 600005 591758 584050 577470 572664 569376 567092 566022 566427 567664
58755 567664 568903 570223 572122 574550 577152 579749 581913 583009 583350 584312 586555 589190 591526 594434 598986
58740 598986 604844 611097 617705 625020 632792 640598 648407 655927 662425 668030 674039 681064 688090 694269
58726 694269 700295 706895 713340 718716 723453 728257 732660 736007 738901 742424 746828 751997 758126 764944
58712 764944 771447 777338 783357 789197 792761 792832 790756 787933 783346 775430 764867 753387 740996 726498
58698G26498j6627j7745j8486j9126j8688j7130j5936j5519j4397j1895r273p409
58686E44267n732m197l807m399m358l376k955l440l229j777p38j005j214k80J007
58671E04767K005L378N265O575P121Q134R886J1188J1864J3160J4887J4977J2666
58658F25873R408N898J254l929p070p483p613q937r771q816p664p814q103p231
58644E58002o254o375o701o205n687n913o001n380n139n746n755m429l198k882
58630D82337k023J83J874J457J09o40j354k668l244k166j008j163j078J376N545
58615D77537R200J1495J2727J2853J2119J1597J1372R987P138M803M102L427J582
58602E89939K51J036K410K176R51N37O55j6j009q67K68J161J599K115K652L135
$$ plain form
58698 726498 709871 692126 673640 654514 635826 618696 602760 587241 572844 560949 551676 544267
58686 544267 538535 534338 530531 526132 521774 518398 515443 512003 508774 506997 506259 505254 504040 503760 504767
58671 504767 506772 510150 515415 521990 529111 537245 547131 558319 570183 583343 598230 613207 625873
58658 625873 635281 641179 642433 638504 631434 623951 616338 607401 597630 588814 581150 573336 565233 558002
58644 558002 551748 545373 538672 532467 526780 520867 514866 509486 504347 498601 492846 488417 485219 482337
58630 482337 480314 480497 482371 483828 483937 483297 481943 479275 476031 473865 472857 471694 470616 471992 477537
58615 477537 486737 498232 510959 523812 535931 547528 558900 568887 576025 580828 584930 588357 589939
58602 589939 590190 591226 593636 595812 596763 597300 597955 597939 596930 596063 596331 597492 599091 601206 603858 606993
58586F06993M298O450Q572R863J0775J1497J1197R921R173R414R118P570O257
58573G21098O066N630M181L497N028P486R311J1199J4129J7196J9511K2025K5337
58560H71694K7820K8103K7206K6233K4115J9845J4620R700M448j366n722p193
58548A039503p289p776q001p219o974q545j0416j1006j1576j3730j6277j7404
58536I13290j7857j9112k0457k0548j9902j9234j7498j4236j1529j0840j0191
58525G31886p437m075k678k779k498k178l039m078l638k494k328k704k404k078
58511F87478k684l073j954n46n25j194j390k002l813n003l846j837j174j264p01
58496F56472k57q56r77O35K059J427N19J625L376L477L147M780P451Q825R404
$$ plain form
58586 606993 611291 617741 626313 636176 646951 658448 669645 679566 688739 698153 707271 714841 721098
58573 721098 727164 732794 736975 740472 745500 752986 762297 773496 787625 804821 824332 846357 871694
58560 871694 899514 927617 954823 981056 1005171 1025016 1039636 1049336 1053784 1052418 1046696 1039503
58548 1039503 1032214 1024438 1016437 1009218 1002244 993699 983283 972277 960701 946971 930694 913290
58536 913290 895433 876321 855864 835316 815414 796180 778682 764446 752917 742077 731886
58525 731886 724449 720374 717696 714917 712419 710241 707202 703124 699486 696992 694664 691960 689556 687478
58511 687478 684794 681721 679767 679221 678696 677502 676112 674110 670297 665294 661448 659611 658437 657173 656472
58496 656472 656215 655359 654382 655017 657076 658503 659022 660647 664023 667500 670647 675427 682878 691703 701107
58481G01107J0835J2160J1890J1721J3806J6333J6169J3985J2327J0570O570J560
58469H39033j551l294o298j0017j1610j1008j0424r751p134l300p94M05K286M705
58455G71248O035O981R381J2118J2577J1178J0277R472O509J909j696m095o991
58442H44903r870j0659r777r251q755o698m204l538l698k074M96J063l2J86K062
58427G80154L414M130N937Q255Q878Q151P979P621N049J453l80j027k992n526
58413H31096o082n702p337r893r743p420o854q335q258n901m417m763m355k355
58399G39681r35o19N79K837M063M057M558N202M087K104J906K946K425O20J98
58384G73709Q82J61j383r66P54O64p31l3K756M523N109P028R696J0100Q872R315
$$ plain form
58481 701107 711942 724102 735992 747713 761519 777852 794021 808006 820333 830903 837473 839033
58469 839033 837482 834188 827890 817873 806263 795255 784831 775080 767946 764646 763852 764257 766543 771248
58455 771248 777283 784264 793645 805763 818340 829518 839795 849267 855776 857685 855989 851894 844903
58442 844903 835033 824374 814597 805346 796591 789893 785689 782151 778453 776379 776875 777938 777906 778092 780154
58427 780154 783568 787698 793635 801890 810768 818919 826898 834519 839568 841021 840641 839614 836622 831096
58413 831096 825014 819312 811975 802082 792339 784919 778065 769730 761472 755571 751154 746391 742036 739681
58399 739681 738746 738127 738706 741543 745606 749663 754221 759423 763510 765614 767520 770466 772891 773511 773709
58384 773709 774591 774752 773369 772403 773157 773821 773090 773057 775813 780336 785445 792473 802169 812269 821141 830456
58368H30456J0846R965P412P453J0138J1264J0108J0186J1997J2203J0517J0334
58356I52879J1794J1259Q453P090P659O650L696K371L051K283K0J55K886M069
58342A024315L142M113P514R182Q334R034J2128J3661J2904J3923J7328J8500
58330A154078J6133J4583J5513J5023J1496Q506P608N783K371R44K181K445J263
58317A257927K404N779O577M322M219P476R171P874Q282J1774J3523J1903J1522
58304A362753J4047J5182J3768J4382J7817J8574J5256J3708J6306J7930J6225
58293A535948J5881J8754J9842J7358J6675J9843K1377J8929J7940K0911K2420
58282A745878J9735J8072K0304K1785K0446K1503K6878L0556K9755L0102L4519
$$ plain form
58368 830456 841302 851267 858679 866132 876270 887534 897642 907828 919825 932028 942545 952879
58356 952879 964673 975932 984385 991475 999134 1005784 1009480 1011851 1014902 1017185 1017205 1017360 1020246 1024315
58342 1024315 1027457 1031570 1039084 1048266 1056600 1065634 1077762 1091423 1104327 1118250 1135578 1154078
58330 1154078 1170211 1184794 1200307 1215330 1226826 1235332 1242940 1248723 1251094 1252038 1254219 1256664 1257927
58317 1257927 1260331 1266110 1272687 1277009 1281228 1288704 1297875 1305749 1314031 1325805 1339328 1351231 1362753
58304 1362753 1376800 1391982 1405750 1420132 1437949 1456523 1471779 1485487 1501793 1519723 1535948
58293 1535948 1551829 1570583 1590425 1607783 1624458 1644301 1665678 1684607 1702547 1723458 1745878
58282 1745878 1765613 1783685 1803989 1825774 1846220 1867723 1894601 1925157 1954912 1985014 2019533
58271B019533L7843L7695L9360M4526M6983M4996M5904N2515N7288N6231N5868
58260B538742O0053O2891O1432O1995O6759O7813O2097N8387O1662O4681O3124
58249C229636O4211P1722P7578P7517P9850Q9169R6952R8200J01371J11464J19789
58238D217459J21367J25482J37560J48033J51112J56662J70924J84034J89849
58229E602482J98991K18307K37174K48806K64540K91666L18480L37643L62039
58220H080128M00140M38923M69690N06582N59901O16462O67477P29175Q13392
58211A3281870R05843R97894J110342J260000J434685J629897J876258K198529
58203B4695318K581437L008356L495789M055572M668669N339196O128721P093714
$$ plain form
58271 2019533 2057376 2095071 2134431 2178957 2225940 2270936 2316840 2369355 2426643 2482874 2538742
58260 2538742 2598795 2661686 2723118 2785113 2851872 2919685 2981782 3040169 3101831 3166512 3229636
58249 3229636 3293847 3365569 3443147 3520664 3600514 3689683 3786635 3884835 3986206 4097670 4217459
58238 4217459 4338826 4464308 4601868 4749901 4901013 5057675 5228599 5412633 5602482
58229 5602482 5801473 6019780 6256954 6505760 6770300 7061966 7380446 7718089 8080128
58220 8080128 8480268 8919191 9388881 9895463 10455364 11071826 11739303 12468478 13281870
58211 13281870 14187713 15185607 16295949 17555949 18990634 20620531 22496789 24695318
58203 24695318 27276755 30285111 33780900 37836472 42505141 47844337 53973058 61066772
58195F1066772Q244602R619629J1336962J3510806J6183548J9403177K3259338
58188A62624834K7719509L2496943L7134820M0958554M2638462M0056275L1394236
58181D15023633J6913567m59305j6670062k8814786l6107950l9200200l9140128
58174B71544769l6945206l3553887k9697487k5786920k2024782j8570072j5534271
58167H9432144j2922107j0689310q824450p317324o102337n100183m279749l629195
58159C0567489l105021k659579k286301j992247j753872j540137j352698j204948
58151A4672686j084366r70227q66704p85766p17026o44836n76654n26029m84841
58142H016237m39066l95208l65387l42111l12689k83914k68487k60519k47121
$$ plain form
58195 61066772 69311374 78931003 90267965 103778771 119962319 139365496 162624834
58188 162624834 190344343 222841286 259976106 300934660 343573122 383629397 415023633
58181 415023633 431937200 431477895 414807833 385993047 349885097 310684897 271544769
58174 271544769 234599563 201045676 171348189 145561269 123536487 104966415 89432144
58167 89432144 76510037 65820727 56996277 49678953 43576616 38476433 34196684 30567489
58159 30567489 27462468 24802889 22516588 20524341 18770469 17230332 15877634 14672686
58151 14672686 13588320 12618093 11751389 10965623 10248597 9603761 9027107 8501078 8016237
58142 8016237 7577171 7181963 6816576 6474465 6161776 5877862 5609375 5348856 5101735
58133E101735k31409k22426k14631j98614j80670j71417j65738j53337j38646
58124C424847j31444j27684j18114j06532j01626r9483r1564q1675p8256p7727
58114B410742p1756o3567o1185o1603n7066n0302m8649m9476m5914m0826m1014
58103A819384m3518m1350l6983l6805l7944l3921k7935k7411l0359k9893k7400
58092A445865k8674l1643l0369k6913k7266k9530k7856k4070k3999k6030k4575
58081A144940k1141k0997k2477k0465j6967j7516k0439k0125j7597j7625j8752
58070I30839j6568j3488j4743j7735j5968j0827q962j0425r824p128o934q668
58058G89569p650m642m679p480q317p349q943j2605j3482j1245j0029j0208q422
$$ plain form
58133 5101735 4870326 4647900 4433269 4234655 4053985 3882568 3716830 3563493 3424847
58124 3424847 3293403 3165719 3047605 2941073 2839447 2739964 2648400 2566725 2488469 2410742
58114 2410742 2338986 2275419 2214234 2152631 2095565 2045263 1996614 1947138 1901224 1860398 1819384
58103 1819384 1775866 1734516 1697533 1660728 1622784 1588863 1560928 1533517 1503158 1473265 1445865
58092 1445865 1417191 1385548 1355179 1328266 1301000 1271470 1243614 1219544 1195545 1169515 1144940
58081 1144940 1123799 1102802 1080325 1059860 1042893 1025377 1004938 984813 967216 949591 930839
58070 930839 914271 900783 886040 868305 852337 841510 832548 822123 812299 805171 798237 789569
58058 789569 781919 777277 772598 765118 756801 749452 740509 727904 714422 703177 693148 682940 674518
58045F74518n108m069n175n029m033n327p796p650n837o329q232p255m017l141
58031E95520m875n282m186n269q484r812q547p914q519p898o335o547p812o882
58017D97158m292l450l995k677k18n02l161l805j663m72j502k039j119p30r61
58002D66572J99K144K196Q40Q98J881Q82j389j464L55M57j328j574R6L93j326
57986D69832k248j885k735m667m639k652k229m132n245m451m106m798m189k092
57972D19764j444l001m030l326k693k642j437P19J302K13K09J922K897K348K166
57957D12967K660J890o7q33l15r66k883l399k187j987l484m210l426l206l729
57942C86825k361J308M178M707M939O226P219P388Q342J0384J1555J1215J0767
$$ plain form
58045 674518 669410 665341 660166 655137 651104 645777 637981 630331 624494 618165 609933 602678 598661 595520
58031 595520 590645 585363 581177 575908 567424 557612 549065 541151 532632 524734 518399 511852 504040 497158
58017 497158 492866 489416 485421 482744 482526 482024 478863 475058 473395 472923 471421 469382 468263 467533 466572
58002 466572 466771 468915 471111 471951 472849 474730 475612 474223 472759 473114 473571 472243 470669 470765 471158 469832
57986 469832 467584 465699 462964 458297 453658 451006 448777 444645 439400 434949 430843 426045 421856 419764
57972 419764 418320 415319 411289 407963 405270 402628 401191 401910 403212 403425 403634 405556 408453 410801 412967
57957 412967 415627 417517 417450 416617 416302 415336 412453 409054 406867 404880 401396 397186 393760 390554 386825
57942 386825 384464 385772 389950 394657 399596 405822 413041 420429 428771 439155 450710 461925 472692
57929D72692J0151P664L813J185j53k695o408q263p700p777r664j0760r716q696
57915D23673r055r167q148p483p455o113l400k001k512k001P99L138K965J890
57901C75130J480O53j161k095j299o78j234j162M51J605J092O65J569K273J789
57886C79078J729L051L989L420L059M170N167M594L558L180K543J056N8J33k34
57871D18551j634k279j296n01j096j643j119q92j763k055p01P09R11J156K366
57856D08714L075K305J704K663L918L993L531L249K271M04o06oL70o62j531r68
57840D32424l61r96j646j101n13r76j280k44J053J483J958L258M060L274K098
57825D42491J847J859J356J042J156N05r49j219J24M50j824m512n356n523o900
$$ plain form
57929 472692 482843 490507 494320 495505 495352 492657 486249 477986 470286 462509 452845 442085 432369 423673
57915 423673 414618 405451 397303 389820 382365 376252 372852 370851 368339 366338 367137 370275 373240 375130
57901 375130 376610 377263 376102 374007 372708 372030 370796 369634 370085 371690 372782 373447 375016 377289 379078
57886 379078 380807 383858 387847 391267 394326 398496 403663 408257 411815 414995 417538 418594 418652 418785 418551
57871 418551 416917 414638 413342 412841 411745 410102 408983 408091 406328 404273 403572 404281 405192 406348 408714
57856 408714 411789 414094 415798 418461 422379 426372 429903 433152 435423 435827 435221 435215 435585 434923 433392 432424
57840 432424 432063 431067 429421 428320 427807 426831 425551 425307 426360 427843 429801 433059 437119 440393 442491
57825 442491 444338 446197 447553 448595 449751 450256 449307 448088 448212 448662 446838 442326 436970 431447 424547
57810D24547q662r267r399j0111j0366r132p773p726p906o964n964o121o152m648
57796C14356l044l301m469m380l104k009j115o7L0j467k619j483O82J467J090
57781B90567J410K659L898N313P418R120R229Q667Q730Q546O775M431L327K992
57767C73082J877L74j35j20r96k305k567k080k252k852k516j309l06O78K453M277
57751C65303M775M447M890N992O298N600M914M225K588K52j414j986k166k180
57737D01538j626o28L26J190J730R90j163l035l220k682k979l689l506k721k446
57722C78079k350j414j63N4n92q39n37m42m19K14J049J159P98Q49J084O54k56
57705C76928q35r76q64r1J381K389K263K147L038L874L362K244J726J089q03l023
$$ plain form
57810 424547 415885 406618 397219 387108 376742 367610 359837 352111 344205 337241 331277 325156 319004 314356
57796 314356 311312 308011 303542 299162 296058 294049 292934 292867 292897 291430 288811 287328 288010 289477 290567
57781 290567 291977 294636 298534 303847 311265 320385 329614 338281 347011 355557 362332 366763 370090 373082
57767 373082 374959 375333 375198 375078 374082 371777 369210 367130 364878 362026 359510 358201 357895 358573 361026 365303
57751 365303 370078 374525 379415 385407 391705 397305 402219 406444 409032 409284 407870 405884 403718 401538
57737 401538 399912 399284 399610 400800 402530 403520 402357 399322 396102 393420 390441 386752 383246 380525 378079
57722 378079 375729 374315 374152 374206 373614 372775 372238 371796 371377 371591 372640 373799 374597 375446 376530 377184 376928
57705 376928 376093 375117 374253 374162 375543 377932 380195 382342 385380 389254 392616 394860 396586 397675 396872 393849
57689C93849m071m642o208p819p238m664k559k024j856j006L49K083M318O573
57675C65085Q539J1264J5709K0844K5250K9877L6802M5831N4756O2492O9203P3298
57663H18950P0768N8225L5415N386k5941n1249o5719p0008o8151o3133n6149m8766
57651E39628m2744l7812l2263k5964k0552j6706j3384r969p086n149l883l254
57639C20862l285l133k112j148j406k081j594l26Q0m19n43l62j041k180k124r47
57623B98241m91j305k011j960j973k241j901j109j195k316l135l143l128l101
57609B69232k140o06j21q03r47PN50j42q40n58q0k62p26j113j807k609k424j170
57591B53441k84o57j545k169k702l103k667j486p51r81j403j527j773k069j629
$$ plain form
57689 393849 389778 385136 378928 371109 363871 359207 356648 354624 352768 351762 352111 354194 358512 365085
57675 365085 373624 384888 400597 421441 446691 476568 513370 559201 613957 676449 745652 818950
57663 818950 889718 947943 983358 988744 962803 911554 845835 775827 707676 644543 588394 539628
57651 539628 496884 459072 426809 400845 380293 363587 350203 340234 333148 327999 324116 320862
57639 320862 317577 314444 312332 311184 309778 307697 306103 305777 305857 305438 304895 304533 303492 301312 299188 298241
57623 298241 297750 296445 294434 292474 290501 288260 286359 285250 284055 281739 278604 275461 272333 269232
57609 269232 267092 266486 266365 265562 264615 264622 265172 265030 264190 263632 263552 263290 262564 261451 259644 257035 254611 253441
57591 253441 253157 252500 250955 248786 246084 242981 240314 238828 238077 237096 235693 234166 232393 230324 228695
57576B28695o49m72j449k246j986j438j427j688j905k376k945k756j707p89n08
57561B04354l15M9J76K41R69K014K072J079N39J153J849J763J433J367J177P99
57545B20719R10J408J128j89j190r60k86q5p0J97K46n07j972l878n859o848n874
57528A96890l737k408k402k340j302N4J077J926K430K019J265J540K669K873J662
57513B02216O80R38J404J214J200K033K802K578J815J116K99m86l72N18Q34K20
57497B19009k9N49O25m25j187o15L07O76J295K624L232K109O91O65J345J184L72
57480B32427K5L5l43q72j084j510k536l070k096n38Q7j43j95K8J1m3J67k4j161
57461B19165k354k457j823j505j577j511j378j407j226p41p52j524j877j038m0
$$ plain form
57576 228695 228046 227574 226125 223879 221893 220455 219028 217340 215435 213059 210114 207358 205651 204862 204354
57561 204354 204039 204088 204264 204505 205474 207488 209560 210639 211178 212331 214180 215943 217376 218743 219920 220719
57545 220719 221629 223037 224165 223976 222786 221826 221540 221455 221385 221582 221828 221321 219349 215471 209612 202764 196890
57528 196890 193153 190745 188343 186003 184701 184755 185832 187758 190188 192207 193472 195012 197681 200554 202216
57513 202216 202896 203834 205238 206452 207652 209685 212487 215065 216880 217996 218295 217809 217437 217955 218789 219009
57497 219009 218980 219529 220154 219729 218542 217927 218234 218910 220205 222829 226061 228170 228861 229526 230871 232055 232427
57480 232427 232452 232487 232144 231272 230188 228678 226142 223072 220976 220438 220525 220382 220187 220215 220226 220183 220350 220326 219165
57461 219165 216811 214354 212531 211026 209449 207938 206560 205153 203927 203186 202434 200910 199033 197995 197955
57446A97955L2p3O56J400Q70l55q37o64p64p48M05K078K628J983J599J976K157
57429B10298J691J241J140Q93L53K4P9J45J71L70M66K5n83o57l31k54l33K8O91
57410B15457R20O24M47O76J020J286J388R43j86j191j109j31P20R35P37L08k35
57393B22609l86K69J291J862J891J862J925J831J522J128O16L6k73j67M6K80R59
57376B37301K047K640K194J436J265J424J105K76m37o22k65M33Q79N07k23j53
57360B49807P74J251O99L02R69J725J311K13k58N2M84R00J422J582J086O11P45
57343B63675R43O81O58J523K417K172J127L86J01q5J03Q24J158L94n27m02K86
57326B75434L65j2m5o7q02j622j459p46n91o56J27J296J367L32m12k88J33P32
$$ plain form
57446 197955 197987 197914 198570 199970 200840 200485 199648 198984 198220 197472 197877 199955 202583 204566 206165 208141 210298
57429 210298 211989 213230 214370 215263 215616 215640 215719 215864 216035 216405 216871 216896 216313 215656 215325 215071 214738 214766 215457
57410 215457 216377 217001 217448 218124 219144 220430 221818 222761 222575 221384 220275 220144 220864 221799 222536 222844 222609
57393 222609 222223 222492 223783 225645 227536 229398 231323 233154 234676 235804 236420 236456 236183 236016 236062 236342 237301
57376 237301 239348 241988 244182 245618 246883 248307 249412 249688 249251 248629 248364 248797 249676 250183 249960 249807
57360 249807 250581 251832 252531 252833 253802 255527 256838 257051 256793 256845 257329 258229 259651 261233 262319 262930 263675
57343 263675 264618 265299 265957 267480 269897 272069 273196 273582 273683 273598 273701 274525 275683 276077 275550 275148 275434
57326 275434 275799 275787 275742 275675 274873 273251 271792 271046 270455 269799 269926 271222 272589 272921 272509 272221 272354 273086
57308B73086J744K356J478j42o14K50Q37N01L50J009J573J376J027J110J274J181
57292B88396J080R80M88k45n24k68j02k10k13j30k53j78O89J794J972J275R09
57275B95460J334J855K047K153K035J232J80nQ70J898K507K866K945K543K135
57260C22055K328K636K183J391J403K059K187J755J849K521K629K014J866K538
57246C51414K892K322J716J781K066K206K553L073L041K436K190K560K713K382
57232C85345K433L277M217M892N840P060P578P157O918P514Q098P937P657P995
57218D73918Q585Q856R047R480R811R750R651R834J0168J0664J1480J2049J1480
57205F04773J0132R507J0139J0986J1348J1869J2962J3766J3589J3108J3160J3499
$$ plain form
57308 273086 274830 277186 278664 278522 277908 278158 278995 279496 279846 280855 282428 283804 284831 285941 287215 288396
57292 288396 289476 290456 290944 290699 290175 289907 289805 289595 289382 289252 288999 288821 289510 291304 293276 294551 295460
57275 295460 296794 298649 300696 302849 304884 306116 306296 306291 307161 309059 311566 314432 317377 319920 322055
57260 322055 324383 327019 329202 330593 331996 334055 336242 337997 339846 342367 344996 347010 348876 351414
57246 351414 354306 356628 358344 360125 362191 364397 366950 370023 373064 375500 377690 380250 382963 385345
57232 385345 387778 391055 395272 400164 406004 413064 420642 427799 434717 442231 450329 458266 465923 473918
57218 473918 482503 491359 500406 509886 519697 529447 539098 548932 559100 569764 581244 593293 604773
57205 604773 614905 624412 634551 645537 656885 668754 681716 695482 709071 722179 735339 748838
57193G48838J3598J3620J3791J3713J3165J2676J2695J3032J3576J4506J5400
57182H98610J5356J4590J4621J6151J7993J8895J9179J9771K0654K1292K1631
57171A098743K1806K1616K1016K0338J9582J8397J7184J7089J8393K0071K1491
57160A315726K3181K5249K6470K5999K4752K4036K3863K3717K3936K5102K6839
57149A588870K8333K9517L0791L2149L3359L4359L4852L4152L2236L0312K9619
57138A938549L0287L1793L3830L6174L8409M0336M1917M2611M1776M0120L9449
57127B355251M0385M1545M1789M1948M3323M5699M8258N1620N7568O7143Q0131
57116B914660R5927J13362J29626J40974J45985J48343J55420J72569J98061K24385
$$ plain form
57193 748838 762436 776056 789847 803560 816725 829401 842096 855128 868704 883210 898610
57182 898610 913966 928556 943177 959328 977321 996216 1015395 1035166 1055820 1077112 1098743
57171 1098743 1120549 1142165 1163181 1183519 1203101 1221498 1238682 1255771 1274164 1294235 1315726
57160 1315726 1338907 1364156 1390626 1416625 1441377 1465413 1489276 1512993 1536929 1562031 1588870
57149 1588870 1617203 1646720 1677511 1709660 1743019 1777378 1812230 1846382 1878618 1908930 1938549
57138 1938549 1968836 2000629 2034459 2070633 2109042 2149378 2191295 2233906 2275682 2315802 2355251
57127 2355251 2395636 2437181 2478970 2520918 2564241 2609940 2658198 2709818 2767386 2834529 2914660
57116 2914660 3010587 3123949 3253575 3394549 3540534 3688877 3844297 4016866 4214927 4439312
57106D439312K45600K63170K84212L15281L59356M17516M90356N76738O73180
57097H064721P75879Q83133R96017J117734J251627J397428J548350J692529J817796
57088A9545214J915596J982793K021723K037038K031647K010779J994185K015404
57080C5554379K090280K176947K176489J988875J577300R84314K96124m02338
57072D6442370j049385j608637k065560k421558k684637k861695k957228k975640
57064B7818030k922851k807136k639931k435212k207174j968672j731169j504327
57056I601558j294859j106462r41013p99105o79712n80499m98718m31408l75292
57047B894490l27516k86426k50964k19899j92336j68293j47819j29984j13707
$$ plain form
57106 4439312 4684912 4948082 5232294 5547575 5906931 6324447 6814803 7391541 8064721
57097 8064721 8840600 9723733 10719750 11837484 13089111 14486539 16034889 17727418 19545214
57088 19545214 21460810 23443603 25465326 27502364 29534011 31544790 33538975 35554379
57080 35554379 37644659 39821606 41998095 43986970 45564270 46548584 46844708 46442370
57072 46442370 45392985 43784348 41718788 39297230 36612593 33750898 30793670 27818030
57064 27818030 24895179 22088043 19448112 17012900 14805726 12837054 11105885 9601558
57056 9601558 8306699 7200237 6259224 5460119 4780407 4199908 3701190 3269782 2894490
57047 2894490 2566974 2280548 2029584 1809685 1617349 1449056 1301237 1171253 1057546
57038A057546r8918q6014p4734o4457n4896m5743l6401k6850j7846r461n66R503
57026E51163K0089L0560M0327M6050M1390K2670n982l5222n7538p0319p4042p0827
57014D38319o4243n7497n1155m4212l6925l0621k5356k0129j5086j1298q532n591
57002F7674k649j036o75j53P02O58k63m51N59J259P75J93M75J083J503K356M078
56985G6088O079Q067J0690J3924J6128J5676J2497P398J032n709j1302j4539j5345
56972A20684j4359j2385j0352q841p454n393k704j27K093M208O039P389R198J2712
56958A00708J7438K1415K3657K4804K5007K2734J6518O865m041j3721k0316k3299
56946A97769k3689k2838k0985j7731j3610r866o815l772o05K107M550P863J2485
$$ plain form
57038 1057546 958628 872614 797880 733423 678527 632784 596383 569533 551687 542226 541660 551163
57026 551163 571252 601812 642139 688189 729579 752249 746267 711045 653507 583188 509146 438319
57014 438319 374076 316579 265424 221212 184287 153666 128310 108181 93095 81797 73265 67674
57002 67674 65025 63989 63314 63161 63863 64521 64258 63807 64366 65625 66400 66593 67068 68151 69654 72010 76088
56985 76088 82167 90234 100924 114848 130976 146652 159149 166547 167579 161870 150568 136029 120684
56972 120684 106325 93940 83588 74747 67293 61900 59196 59069 61162 65370 71409 78798 87996 100708
56958 100708 118146 139561 163218 188022 213029 235763 252281 259146 255105 241384 221068 197769
56946 197769 174080 151242 130257 112526 98916 89050 82235 78463 77858 79965 84515 92378 104863
56933A04863J7565K2316K6775L0970L4258L5565L3296K5513J1897m376j8400k7509
56921B92733l2339l4212l3393l0233k6107k2292j9094j6529j4686j3119j1130
56910C9599r007p688p060o055m583A479b189l147j511K28J173J716a494E85Q95
56895A480l03k96R92L021N581Q510J1414J4240J7434K1162K5042K8616L1032L0393
56881A98318K4974J5506N021l862j0320j4179j5228j4127j2323j0294p236k970
56869A53280J324M841Q187J2088J6546K1742K8291L5861M3148M9844N7036O4524
56857D96712O9110O6694N5234L5415J0180j5421l5674m7321n1079m9667m5259
56846D88924l9087l1924k4031j5494p096L63P738J6925K8117L9490N0246O1909
$$ plain form
56933 104863 122428 144744 171519 202489 236747 272312 305608 331121 343018 338642 320242 292733
56921 292733 260394 226182 192789 162556 136449 114157 95063 78534 63848 50729 39599
56910 39599 30592 22904 15844 9789 5206 1479 -2189 -5336 -6847 -6619 -5446 -3730 -1494 585 1480
56895 1480 1177 881 1873 4894 10475 18985 30399 44639 62073 83235 108277 136893 167925 198318
56881 198318 223292 238798 243819 239957 229637 215458 200230 186103 173780 163486 156250 153280
56869 153280 154604 159445 167632 179720 196266 218008 246299 282160 325308 375152 432188 496712
56857 496712 565822 632516 687750 723165 733345 717924 682250 634929 583850 534183 488924
56846 488924 449837 417913 393882 378388 371292 371655 379393 396318 424435 463925 514171 576080
56834E76080P5602Q9847J01998J09682J09341R5826O6403K4939j9449n7565q3709
56823A088995r6357r7776r2452q4055p3745o1752m9284l7731k7102j6739o744
56812D45258K552J1798K1941L2905M4092N5500O6983P6580Q0396P4120N5017K4204
56800I91346j2045m4657o7109p8405q0922p7120o9243o0080n1650m3740l5266
56789C71109k6547j8813j2249n880Q93P913J5001K2032K8632L4492L9302M1659
56777D97544L8914K9259J3624m944k2942l7135m5298m7628m6547m4146m0610l5778
56765B54313l0727k6542k2830j8858j5179j2663j0948r164p384o092n077m097
56753H4752l647l864l730k651j682j788k067j314k43k95j219j620j265r85r37
$$ plain form
56834 576080 651682 741529 843527 953209 1062550 1158376 1224779 1249718 1230269 1172704 1088995
56823 1088995 992638 894862 802410 718355 644610 582858 533574 495843 468741 452002 445258
56812 445258 447810 459608 481549 514454 558546 614046 681029 757609 838005 912125 967142 991346
56800 991346 979301 934644 867535 789130 708208 631088 561845 501765 450115 406375 371109
56789 371109 344562 325749 313500 307620 308513 316426 331427 353459 382091 416583 455885 497544
56777 497544 536458 565717 579341 574397 551455 514320 469022 421394 374847 330701 290091 254313
56765 254313 223586 197044 174214 155356 140177 127514 116566 107402 100018 93926 88849 84752
56753 84752 81105 77241 73511 70860 69178 67390 65323 64009 63766 63471 62252 60632 59367 58382 57445
56738E7445o60l55m70n53l9M29J6o39m64Q3k17j131j419r85p10n24M11J813K396
56719E4427J940J468J414J168O43O10J330K131K476K353J619K27j025j142k87
56704F9352M85P01O23L72L4J99J114J753J099p6j75Q58J634J550J274J172Q45
56687H2814K29k04m54q67j114n30N88J296J459J622J662J007J14K05J396K429
56671I1652K450J958J822K384L567M883N420M762L811L720M319M548M056L236
56657A42588K172Q39p0K9L18m90k166l370l753m127m695m736m142l755l991m365
56641A06286m461m285l710k724k030k181k369j424K57J212J155J204J936K700
56627I1566K942K809K368J545Q58R77J468J266K70o81j181j408j182l24L80M7
$$ plain form
56738 57445 56785 56430 55960 55407 55368 55797 55813 55174 54710 54793 54576 53445 52026 51041 50331 49807 50218 52031 54427
56719 54427 56367 57835 59249 60417 61060 61670 63000 65131 67607 69960 71579 71806 70781 69639 69352
56704 69352 69837 70538 71161 71533 71567 71766 72880 74633 75732 75656 75481 76339 77973 79523 80797 81969 82814
56687 82814 83043 82839 82385 81518 80404 79874 80462 81758 83217 84839 86501 87508 87622 87827 89223 91652
56671 91652 94102 96060 97882 100266 103833 108716 114136 118898 122709 126429 130748 135296 139352 142588
56657 142588 144760 145599 145529 145558 145876 145386 143220 139850 136097 131970 127275 122539 118397 114642 110651 106286
56641 106286 101825 97540 93830 91106 89076 86895 84526 83102 83359 84571 85726 86930 88866 91566
56627 91566 94508 97317 99685 101230 102088 103065 104533 105799 106069 105388 104207 102799 101617 101293 101673 101720
56611A01720p13o12J96M34l6j31L91N75J00k77l03n70j120j218p89m98l37K76
56593I7088R50O06m36m80J045K744L339K987K202J071J04K34J358K120J723P91
56577A17446P7l55l87L72J657K549K778K895L043K843K530K826L560L810L532
56562A49176L599M207M741N275O451P712P468N490L449K617K560K500K392K119
56548B09756J259J76l4Q10J671J902J764J220j35j669k029j309j117k033k798
56533B07434k614k424l045l694l382k412j591j097r11j250j935k321k238k055
56519A76465j649o57K79M4j006j306m50L76N35N93O19j42j347j445k19N08l16
56502A70882j459j617j412j954k945l399l083k247j138l68o34j498j715j114p80
$$ plain form
56611 101720 101007 100395 100591 101025 100989 100858 101249 101824 101924 101647 101344 100774 99654 98436 97647 97149 96812 97088
56593 97088 98038 98644 98208 97728 98773 101517 104856 107843 110045 111116 111220 111454 112812 114932 116655 117446
56577 117446 117523 117168 116781 117153 118810 121359 124137 127032 130075 132918 135448 138274 141834 145644 149176
56562 149176 152775 156982 161723 166998 173449 181161 188629 194119 197568 200185 202745 205245 207637 209756
56548 209756 211015 211191 211157 211967 213638 215540 217304 218524 218389 216720 214691 213382 212265 210232 207434
56533 207434 204820 202396 199351 195657 192275 189863 188272 187175 186264 185014 183079 180758 178520 176465
56519 176465 174816 174159 174438 174482 173476 172170 171720 172096 172631 173224 173843 173701 172354 170909 170690 171198 170882
56502 170882 169423 167806 166394 164440 161495 158096 155013 152766 151628 151260 150626 149128 147413 146299 145519
56487A45519j013q83k29k27j301k168j748m94P68J754K035J184K9L3R76J177L25
56470A45737j54J09k02j248j252L58J638J323Q17J451K163J620N46J37Om37m31
56453A52181N91J559J591J588K373K925K194J059O66M22n51j397r06L15Q72P18
56437A66200O72Q13Q62J083J492J279K11o12m78k09m44m61J75M53k25p48k81K03
56419A69985q1n5J118K041J100r57k266k347j642j32J768K430J078p09j250j131
56403A68950j573k078j729j344k069l057k809j771j505k105k372j798n91J345
56389A45494L774N369N273M461M032L371J590m18j220j035q81n87N77K285L743
56374A75828M983O057O125M837L437L019K998K669K686L423L589K317R46Q90J348
$$ plain form
56487 145519 144506 143623 143394 143167 141866 139698 137950 137456 138224 139978 142013 143197 143226 143259 144235 145412 145737
56470 145737 145583 145692 145490 144242 142990 143348 144986 146309 147126 148577 150740 152360 152906 153043 153049 152612 152181
56453 152181 152772 154331 155922 157510 159883 162808 165002 166061 166727 167149 166598 165201 164295 164610 165482 166200
56437 166200 166872 167685 168547 169630 171122 172401 172612 172000 171522 171313 170869 170408 170583 171036 170811 170063 169782 169985
56419 169985 169904 169849 170967 173008 174108 173151 170885 168538 166896 166764 168532 170962 172040 171331 170081 168950
56403 168950 167377 165299 163570 162226 160157 157100 154291 152520 151015 148910 146538 144740 144149 145494
56389 145494 149268 154637 159910 164371 168403 171774 173364 172946 171726 170691 169810 169223 169800 172085 175828
56374 175828 180811 186868 192993 197830 201267 204286 207284 209953 212639 216062 219651 221968 222914 223804 225152
56359B25152J053O09R93J468J209J266K549L532K534Q08O54J834K464K256K173
56344B50554K030J094J10J30K99p17k077k053r17j12M01J355J899Q56o18m53R87
56327B52768J677J317J294J886K131J950K032K081J448P73Q90J054M38K29J725
56312B73693L635L843K745K063J606K62r34l7K221L341L065L256M309M807M502
56297C12377M616N278N466N320N788O344N708M513M531N578N913N325N171N675
56283C87603N876N904O647P624P682P350P900Q838Q960R038J0502J2344J2490
56270D98758J1564J1981J3947J5614J6708J8544K0816K1883K2164K3852K7326
56259G03157L0940L4249L8316M3042M7376N1969N8460O6372P3890Q1279R0170
$$ plain form
56359 225152 226205 226814 227807 229275 230484 231750 234299 237831 240365 241173 241827 243661 246125 248381 250554
56344 250554 252584 253678 253788 253918 254217 253500 251423 249370 248453 248341 248742 250097 251996 252852 252234 251781 252768
56327 252768 254445 255762 257056 258942 261073 263023 265055 267136 268584 269357 270247 271301 271739 271968 273693
56312 273693 277328 281171 283916 285979 287585 287847 286913 286876 289097 292438 295503 298759 303068 307875 312377
56297 312377 316993 322271 327737 333057 338845 345189 350897 355410 359941 365519 371432 376757 381928 387603
56283 387603 393479 399383 406030 413654 421336 428686 436586 445424 454384 463422 473924 486268 498758
56270 498758 510322 522303 536250 551864 568572 587116 607932 629815 651979 675831 703157
56259 703157 734097 768346 806662 849704 897080 949049 1007509 1073881 1147771 1229050 1319220
56248A319220R9963J08522J16053J24471J33140J39073J41434J42017J41200J37235
56238B602328J29706J19840J07152Q9754O8365M6156K4167P84k3709m6184o5081
56227C053278q1877r7089j08676j15680j20045j23477j25475j25419j23698j20087
56217A911755j13978j06743j00799r5957q9850q2201p5199o9456o3337n6730n1641
56206A005864m8323m4563l9692l5564l2853k9972k6468k3844k2202j9750j6428
56195F66205j4325j3712j2395r770p847p443p112o545p098q245p514m869l127
56182E56203l144k759j346j068k423k895j408j8K09P86K106K320J291J404L048
56167E52306L631K489K371M429O205O273O589Q295R557R434R748J1241J2049J1755
$$ plain form
56248 1319220 1419183 1527705 1643758 1768229 1901369 2040442 2181876 2323893 2465093 2602328
56238 2602328 2732034 2851874 2959026 3048780 3117145 3163301 3187468 3188252 3164543 3118359 3053278
56227 3053278 2971401 2874312 2765636 2649956 2529911 2406434 2280959 2155540 2031842 1911755
56217 1911755 1797777 1691034 1590235 1494278 1404428 1322227 1247028 1177572 1114235 1057505 1005864
56206 1005864 957541 912978 873286 837722 804869 774897 748429 724585 702383 682633 666205
56195 666205 651880 638168 625773 616003 608156 600713 593601 587056 579958 571713 564199 559330 556203
56182 556203 553059 550300 548954 547886 545463 542568 541160 541142 541351 542137 544243 546563 547854 549258 552306
56167 552306 555937 558426 560797 565226 571431 577704 584293 592588 602145 611579 621327 632568 644617 656372
56153F56372J2676J5331J7007J6653J6955J9560K2702K5420K9593L5721M1321
56142I09311M5715N1990O1859P2961Q3371R4147J05078J12473J13903J10861J04630
56131A866299R4078P9966O6829N7766N1521M6583M3499M0991L4970K4152J2018
56120B418672R30j0542k2292l0544l4281l8364m6875n8311p0317q3558r7370j07126
56108A820022j10034j08685j05419r8381q6776p4563o4756n5174m3971l4167k8413
56097A009683k4300j9146j4641j2420j0016n599j951j364j356M24J908J354J275
56084I23851L427N013M163L872O193Q004P108O763R421J1710J0732R605J1408
56071A021270J3319J2353J1327J3425J6175J6483J6341J7928J8593J6323J4656
$$ plain form
56153 656372 669048 684379 701386 718039 734994 754554 777256 802676 832269 867990 909311
56142 909311 955026 1007016 1068875 1141836 1225207 1319354 1424432 1536905 1650808 1761669 1866299
56131 1866299 1960377 2040343 2107172 2164938 2216459 2263042 2306541 2347532 2382502 2406654 2418672
56120 2418672 2419602 2409060 2386768 2356224 2321943 2283579 2236704 2178393 2108076 2024518 1927148 1820022
56108 1820022 1709988 1601303 1495884 1397503 1310727 1236164 1171408 1116234 1072263 1038096 1009683
56097 1009683 985383 966237 951596 939176 929160 923561 921610 920246 918890 919314 921222 922576 923851
56084 923851 927278 932291 936454 940326 946519 954523 961631 968394 977815 989525 1000257 1009862 1021270
56071 1021270 1034589 1046942 1058269 1071694 1087869 1104352 1120693 1138621 1157214 1173537 1188193
56060A188193J6361J7846J5742J3214J3810J4873J3295J1809J3231J4437J2623
56049A345434J1450J4280J7442J6985J5867J7494J8639J6069J3727J5703J8549
56038A521639J8232J8032K1644K5309K5090K5077K9679L4720L5086L4359L7639
56027A826506M1696M1781M1214M4386M7283M5055M2061M4146M7918M8125M8337
56016B318508N3397N8769N8802N8108O2899O8666O8676O7173P1362P7852Q0116
56005C044328Q1761Q8791R6407R7599R7313J03683J12796J16907J19805J28722
55995D088112J39082J43255J46365J57000J70504J78285J85058J99460K16637
55986E623758K28371K40861K63292K88862L07400L26213L56942L92879M22317
$$ plain form
56060 1188193 1204554 1222400 1238142 1251356 1265166 1280039 1293334 1305143 1318374 1332811 1345434
56049 1345434 1356884 1371164 1388606 1405591 1421458 1438952 1457591 1473660 1487387 1503090 1521639
56038 1521639 1539871 1557903 1579547 1604856 1629946 1655023 1684702 1719422 1754508 1788867 1826506
56027 1826506 1868202 1909983 1951197 1995583 2042866 2087921 2129982 2174128 2222046 2270171 2318508
56016 2318508 2371905 2430674 2489476 2547584 2610483 2679149 2747825 2814998 2886360 2964212 3044328
56005 3044328 3126089 3214880 3311287 3408886 3506199 3609882 3722678 3839585 3959390 4088112
55995 4088112 4227194 4370449 4516814 4673814 4844318 5022603 5207661 5407121 5623758
55986 5623758 5852129 6092990 6356282 6645144 6952544 7278757 7635699 8028578 8450895
55977H450895M52925M98150N51218N98956O49515P18470P99930Q81517R75187
55968A4576763J101161J254978J425567J632233J905321K243078K626859L063800
55960B9829760L571976M142330M766213N483986O354161P397598Q635299J0156221
55952H0337544J2073393J4439081J7284148K0690814K4688028K9076967L3448604
55945B32038579L7227527L9363006L8005309L1137439J8247104J510217j5024535
55938C82504646k7729268l5106336l7703805l6956053l4259591l0674430k6886401
55931A53188762k3222939j9790923j6660714j3908678j1551807r550621p878402
55924E0624678o524567n442669m559559l833167l252414k789436k400696k069122
$$ plain form
55977 8450895 8903820 9401970 9953188 10552144 11201659 11920129 12720059 13601576 14576763
55968 14576763 15677924 16932902 18358469 19990702 21896023 24139101 26765960 29829760
55960 29829760 33401736 37544066 42310279 47794265 54148426 61546024 70181323 80337544
55952 80337544 92410937 106850018 124134166 144824980 169513008 198589975 232038579
55945 232038579 269266106 308629112 346634421 377771860 396018964 397529181 382504646
55938 382504646 354775378 319669042 281965237 245009184 210749593 180075163 153188762
55931 153188762 129965823 110174900 93514186 79605508 68053701 58503080 50624678
55924 50624678 44100111 38657442 34097883 30264716 27012302 24222866 21822170 19753048
55916A9753048j800746j583967j391420j217032j073782r58430q52526p54305
55908A0120840o76873o17590n59675n01671m56745m24734l91895l56630l29883
55899E805144l11416k89782k64707k46556k34655k18129j97273j83000j75660
55890C683966j64747j49137j38068j32219j22696j08973r9731r5501q7806p6155
55880B508933o9401o9381o8921o6533o7785p1626p0366o4196o1356o3027o1943
55869A774398n6778n4149n5307n4102m9457m7141m7751m5245l8812l4520l3833
55858A257303l1793k7662k6232k7585k6483k2941k2587k5575k5946k3015k2666
55847I74818k6036k7506k5494k4909k7101k7383k4486k2901k3809k2909j9226
$$ plain form
55916 19753048 17952302 16368335 14976915 13759883 12686101 11727671 10875145 10120840
55908 10120840 9443967 8826377 8266702 7765031 7308286 6883552 6491657 6135027 5805144
55899 5805144 5493728 5203946 4939239 4692683 4458028 4239899 4042626 3859626 3683966
55890 3683966 3519219 3370082 3232014 3099795 2977099 2868126 2768395 2672894 2585088 2508933
55880 2508933 2439532 2370151 2301230 2234697 2166912 2095286 2024920 1960724 1899368 1836341 1774398
55869 1774398 1717620 1663471 1608164 1554062 1504605 1457464 1409713 1364468 1325656 1291136 1257303
55858 1257303 1225510 1197848 1171616 1144031 1117548 1094607 1072020 1046445 1020499 997484 974818
55847 974818 948782 921276 895782 870873 843772 816389 791903 769002 745193 722284 703058
55836G03058j7108j7574j6415j2753j0942j2067j1901r242q060r479r619p318
55824E60580o174p100o586m192m031o890q377o927o221p708p998n905m932o426
55810D71113p002m967k940k108k39K767L820K874L778P176R017P924P457R055
55796E07725R219O094K586N82j999o009q760r259j0194j2408j2882j0421q082
55783D46192p734p464o441p084j0084j2353j2098j1231j0798q914n186k321j331
55770C43153J91L244N354M976L451J347k401o516p682o113n721p508q155o473
55756C11147n455o200n721k974j330k573l950l755m368o959q577p543o632p752
55742B37358q403o694n067n606o152m578k733k684l027k227j787k796l047r11
$$ plain form
55836 703058 685950 668376 651961 639208 628266 616199 604298 595056 586996 577517 567898 560580
55824 560580 554406 547306 540720 536528 532497 525607 517230 510303 504082 496374 488376 482471 477539 471113
55810 471113 464111 459144 456204 454096 453857 456624 460444 463318 467096 474272 483289 491213 498670 507725
55796 507725 516944 523038 525624 526206 524207 518198 509438 500179 489985 477577 464695 454274 446192
55783 446192 438458 430994 424553 417469 407385 395032 382934 371703 360905 351991 346805 344484 343153
55770 343153 343344 346588 351942 356918 360369 361716 359315 352799 345117 339004 333283 325775 317620 311147
55756 311147 305692 299492 293771 290797 289467 286894 282944 279189 274821 267862 259285 251742 245110 237358
55742 237358 228955 222261 217194 211588 205436 200858 198125 195441 192414 190187 188400 185604 182557 181646
55728A81646J457J861J526J833J229j456l957m048k979k543j929l77L21r70k151
55713A69463j434m25p88r53Q06L027L720L582L728L168J429O47K002K906R94j901
55697A89971k934k784l581m800m745m036m209m550l508j708o66j2J344K741K993
55682A59516K723L109L783M019M431N530O203N594M717M447L780J933J05p20j570
55667B07600l180m114l247j952j703j676q03L2j0L01J878L153K619J542J680K279
55651B04399J840R75R49J092J37j322k074k590l884n432o222o528o896o851o241
55636A61352o149o851o794n244l903m095m536l838k907k823k522r43O36P50K55
55621A12388M23N33l33j106p29l39j081j770j163n31j387k620k537j825j855j929
$$ plain form
55728 181646 183103 184964 186490 188323 189552 188096 184139 180091 177112 174569 172640 172263 172584 171614 169463
55713 169463 168029 167604 166816 165863 166669 169696 173416 176998 180726 183894 185323 185970 187972 190878 191872 189971
55697 189971 187037 184253 180672 175872 171127 167091 162882 158332 154824 153116 152450 152438 153782 156523 159516
55682 159516 162239 165348 169131 173150 177581 183111 189314 194908 199625 204072 207852 209785 209890 209170 207600
55667 207600 204420 200306 197059 195107 193404 191728 190925 190957 190947 191248 193126 196279 198898 200440 202120 204399
55651 204399 206239 207214 208163 209255 209392 208070 205996 203406 199522 194090 187868 181340 174444 167593 161352
55636 161352 155203 148352 141558 136314 132411 128316 123780 119942 117035 114212 111690 110747 111383 112133 112388
55621 112388 112811 113344 113011 111905 111176 110837 109756 107986 106823 106292 104905 102285 99748 97923 96068 94139
55605I4139r76r6n72j146k69P01k83k101k134n25M49K12k7r1p37j414r33K19O94
55586H5110O65J074J526J305J299K432L381K550J096J195K454K921K621L040L954
55571A16623L973L545M325N958O498N681M888M238K570J75j358j939k993m707
55557A47477n805o041o390o842o477n679n788o530o169m392k717j925j266l70
55543H1086J97L66O34P18M0n81K26J940K673J956J008M58j03m66qN63n7j319j383
55524H7948k27K19q12j952k206k155k167j607m77J65R1M61J805L151L777M206
55508I0220M818M985M214K876J286o85k657l644l361k551j704n69Q18J752J804
55493I7602J242L97o06j545k333l271m268m367l131j813j792k480k275j112k85
$$ plain form
55605 94139 93163 93067 92495 91349 91080 91781 91498 89397 87263 86738 87187 87399 87372 87281 86544 85130 84197 84416 85110
55586 85110 85775 86849 88375 89680 90979 93411 96792 99342 100438 101633 104087 107008 109629 112669 116623
55571 116623 120596 124141 128466 134424 140922 146603 151491 155729 158299 158474 157116 155177 152184 147477
55557 147477 141672 135631 129241 122399 115922 110243 104455 97925 91756 87364 84647 82722 81456 81086
55543 81086 81283 81649 82283 83001 83041 82460 82686 84626 87299 89255 90263 90721 90618 90152 90144 90707 90650 89331 87948
55524 87948 87721 87940 87128 85176 82970 80815 78648 77041 76564 76729 76820 77281 79086 82237 86014 90220
55508 90220 95038 100023 104237 107113 108399 107714 105057 101413 98052 95501 93797 93228 94046 95798 97602
55493 97602 98844 99241 98635 97090 94757 91486 87218 82851 79720 77907 76115 73635 71360 70248 69963
55478F9963j41K04R13R97K6j195j838j770j092j22L92J48lO20J161O08k57l2Q67
55459F9449R23K05J35Q35R38P4o19o88r85j724j864r74kL74N78R09R65O59M66
55440F9654L13l68j195j006K15J022N33n16j116j132p64j07M44M70M29J156K319
55423G0351K615J624L28m10o47n33J28J235K287L043L440L044J571k61j489k178
55407H4148k828l101k488j707j757k050j246L47J080N35j05k02k81m48j27M10
55391G0180J78o64q06n1L34j69n20m4N36N19J62l43j241k170k163j231m61k27
55373F1819J91R03R81K08m43n86j032j936k051o67J107J904J727J228N64j78m60
55356F3279m4N03O12L62N6j37O1P24J230J011O31R31J396Q35n30j318j208j124
$$ plain form
55478 69963 69822 70026 70939 71936 71962 70767 68929 67159 66067 65945 66337 66485 66482 67102 68263 68871 68614 68582 69449
55459 69449 70372 70577 70712 71547 72485 72559 71940 71252 70267 68543 66679 65705 65703 66077 66655 67564 68529 69188 69654
55440 69654 69967 69599 68404 67398 67613 68635 69168 68652 67536 66404 65640 65533 65977 66447 66876 68032 70351
55423 70351 72966 74590 74918 74508 73861 73328 73456 74691 76978 80021 83461 86505 88076 87815 86326 84148
55407 84148 81320 78219 75731 74024 72267 70217 68971 69318 70398 70933 70828 70626 70345 69897 69770 70180
55391 70180 70358 69694 68888 68837 69171 69002 68482 68438 68974 69493 69655 69312 68071 65901 63738 62507 62046 61819
55373 61819 62010 62913 63894 64102 63659 63073 62041 60105 58054 57387 58494 60398 62125 63353 63917 63739 63279
55356 63279 63235 63738 64350 64712 64768 64631 64692 65416 66646 67657 68288 69219 70615 71450 70920 69602 68394 67270
55338F7270j197m98Q60J402O29j73o8K46pn42j033j699k225j677k02P99P87P88
55320F3460J350J554Q21Qj70k34n52m89J13K24o14j288r03j55J06J52K63j31j100
55301F2415j516r29n34j061j219J52J893K253J616J614K324K347J183j45p45p09
55285F8939m02pK12P0j50p7J98M28O64R21Q47K44m98q82p71k24N32Q61K71o11
55265G0565n91L63R97O67J83K88N17K03m12q02r54r97p87l84j07J22O22R87M47
55246G0927o09q29O7Q28O04q4o98j372j798j102M38J194N07l77m57l75p43q71
55228F5250l13m7p41j403j095n30n86o28J48J003R11L48L17N84M32J41K62L48
55210F4401j62o56l82J43J43N2N04Q48K18p06o12M32J357J811K077J920J027P1
$$ plain form
55338 67270 66073 65575 66435 67837 68466 68293 68225 68471 68464 67922 66889 65190 62965 61288 61086 61885 62672 63460
55320 63460 64810 66364 67185 67193 67023 66789 66237 65748 65861 66085 65471 64183 63280 63125 63231 63383 63646 63515 62415
55301 62415 60899 59970 59436 58375 57156 57308 59201 61454 63070 64684 67008 69355 70538 70393 69648 68939
55285 68939 68537 68530 68742 68812 68662 68585 68783 69211 69875 70796 71643 71887 71389 70507 69736 69512 70044 70905 71176 70565
55265 70565 69974 70337 71334 72001 72184 72472 72989 73192 72780 71978 71024 70027 69240 68856 68749 68871 69493 70480 70927
55246 70927 70318 69489 69556 70384 70988 70904 70206 68834 67036 65934 66372 67566 68073 67696 67239 66864 66121 65250
55228 65250 64937 64890 64149 62746 61651 61121 60535 59907 60055 61058 61969 62317 62634 63218 63650 63791 64053 64401
55210 64401 64239 63583 63201 63344 63487 63539 64043 64891 65109 64403 63791 64223 65580 67391 69468 71388 72415 72486
55192G2486q4J70j41r01j141n75K03O37M95k07q07m12N74N21q82j637l31J551
55174F9519J884J085R68J583J458L15p22j147j276q70M17J538J098k96p16J84
55158G5022R55R28R31J276J079O4q14r64q76p74j54R00J350P45j46o30q96j104
55140G6892r28l96j08k13j69J93L59K15L35Q21R35L37k35k9O97J175J008K40q46
55121H0283j713j869j442r91p52n19j77K06O95J276J532J171O80P51J281J645
55105H2057J681J620J278L50p03j007n05%O9L9K10M11M64M65N05O30R52J403J578
55086I1497J293Q57L78n63j894k469j466K50J181J093Q45Q49Q73R28J154J103
55070I5909L46n65p98n89o88r18o36k14n93j498j674q73k02l49p94r63q35k99
$$ plain form
55192 72486 72402 72572 72431 71530 70389 69814 70017 70654 71149 70942 70135 69723 70297 70818 69936 68299 67968 69519
55174 69519 71403 72488 73456 75039 76497 76812 76090 74943 73667 72797 73214 74752 75850 75554 74838 75022
55158 75022 75977 76905 77836 79112 80191 80255 79441 78477 77601 76827 76673 77573 78923 79668 79522 78892 77996 76892
55140 76892 75964 75568 75460 75247 75078 75271 75630 75845 76180 77001 77936 78273 78038 78009 78706 79881 80889 81129 80283
55121 80283 78570 76701 75259 74268 73516 72997 72820 73026 73721 74997 76529 77700 78380 79131 80412 82057
55105 82057 83738 85358 86636 86986 86283 85276 84771 84771 84840 84879 85089 85500 85964 86429 86934 87564 88516 89919 91497
55086 91497 92790 93647 94025 93462 91568 89099 87633 87883 89064 90157 91002 91851 92724 93652 94806 95909
55070 95909 96255 95690 94892 94303 93615 92697 92061 91847 91254 89756 88082 87209 87007 86658 85864 84901 84066 83767
55052H3767Q70K062K102Q27n99j225j198r64o31l70m82p30m57L95J133J262R48
55035H6710M96J14J42P59J490J720J444R19Qj246j929j289j0O59O27N69M22k71
55017I1334r42o33J92K05o03r81o45n10o89k30Q30J098J55o09j92N78O83M16M27
54998H9884N16L31J28J11K3j12J12M50J89l18K28J838K701J691p4j052j193j071
54980I4382n59L71P95J40o24k85Q59J647J678J271N92j22k46L63Q12M25j87j55
54962A01157K73L87K33K42K75J10K01R05J500J072m1p14n78j58J62L67L54J06
54944A05853M5M24O28m4j177j611r07K52R63Q33Qr10j124l47R27K128L174M004
54926A13119M193L602K955L054L829M748N713O802P571P386O297M890L395J610
$$ plain form
55052 83767 84637 86699 88801 89628 89029 87804 86606 85642 85011 84641 84159 83429 82972 83367 84500 85762 86710
55035 86710 87206 87320 87462 88221 89711 91431 92875 93794 93802 92556 90627 89338 89328 89987 90614 91183 91605 91334
55017 91334 90392 89759 89951 90156 89553 88572 87927 87417 86728 86498 87328 88426 88581 87972 87780 88358 89041 89457 89884
54998 89884 90400 90731 90859 90970 90993 90881 90993 91443 91632 91314 91542 93380 96081 97772 97698 96646 95453 94382
54980 94382 93823 94194 94989 95129 94505 94220 95079 96726 98404 99675 100267 100145 99899 100262 101074 101499 101312 101157
54962 101157 101430 101817 102050 102292 102567 102677 102878 103783 105283 106355 106314 105600 105022 104864 105026 105393 105747 105853
54944 105853 105898 106322 106950 106906 105729 104118 103211 103463 104426 105259 105267 104357 103233 102886 103813 105941 109115 113119
54926 113119 117312 120914 123869 126923 130752 135500 141213 148015 155586 162972 169269 174159 177554 179164
54912A79164n00k633m488n793o228n829n250n170n541n826n719n210m237k819
54898A13921j379m85k10j31J63O86J121J072M56k14k07N97J579K129K280K442
54882A23820K940L886N081N942O004N616N594O069O298N777M846L878K605P15
54868A89071j430l174m274m914n407o097p036p604p077n771m869m785m516l144
54854A18973j261k00l63j025j365j206q83r06j509k321k747k712k606k446j872
54839I5551j002m63l12J46J050J487Q80K3l7O19J173J223Q57J82n23p20l17Nk55
54820I9567o73p01n48o06n92l1Q65J481J571J180L05p13j028k52Q18J072M01m55
54802A01661q65o21K35J244J615J130N19M96Q82J194J428J656J518Q57K62K24
$$ plain form
54912 179164 178664 176031 171543 165750 159522 153693 148443 143273 137732 131906 126187 120977 116740 113921
54898 113921 112542 112057 111847 111716 111879 112565 113686 114758 115214 115000 114793 115390 116969 119098 121378 123820
54882 123820 126760 130646 135727 141669 147673 153289 158883 164952 171250 177027 181873 185751 188356 189071
54868 189071 187641 184467 180193 175279 169872 163775 156739 149135 142058 136287 131418 126633 122117 118973
54854 118973 117712 117512 117149 116124 114759 113553 112670 111764 110255 107934 105187 102475 99869 97423 95551
54839 95551 94549 94086 93774 93920 94970 96457 97337 97360 97323 97942 99115 100338 101195 101377 100854 100134 99817 99822 99567
54820 99567 98894 98193 97645 97039 96447 96416 97281 98762 100333 101513 101818 101105 100077 99825 100643 101715 102116 101661
54802 101661 100796 100175 100410 101654 103269 104399 104918 105414 106296 107490 108918 110574 112092 112949 113211 113435
54786A13435K75j80p65o81N9P87J172J280J036M72J54N75J407K003K307K609K891
54769A28836L190M038N736P529Q390Q293P878P247N990M119K103J95j604l106
54755A88834m178n113o110o794o837o549o174n237l545k124k088k977l403k900
54741A24805k056j167q6Q52J038P12P73J383J898K099K412K840K796K212J816
54726A42327K022K506L010L759M801N705O094N885M942L167R99q90k347l579m415
54711A73986m601m629n266o225o345n206l684k688k247k073k102k202k048j583
54697A23087j089o95l83m22j019j661j645j184j074j282r30J14Q22M57m29r28
54681A11739q21l50K11L85k77j379j822j180k24K29K19N0l34q67j029n98j19q6
$$ plain form
54786 113435 113710 113530 112765 112084 112143 112930 114102 115382 116418 116890 117044 117619 119026 121029 123336 125945 128836
54769 128836 132026 136064 141800 149329 157719 166012 173890 181137 187127 191246 193349 193544 191940 188834
54755 188834 184656 179543 173433 166639 159802 153253 147079 141842 138297 136173 134085 131108 127705 124805
54741 124805 122749 121582 121496 122348 123386 124098 124871 126254 128152 130251 132663 135503 138299 140511 142327
54726 142327 144349 146855 149865 153624 158425 164130 170224 176109 181051 184218 185217 184327 181980 178401 173986
54711 173986 169385 164756 159490 153265 146920 141714 138030 135342 133095 131022 128920 126718 124670 123087
54697 123087 121998 121303 120920 120498 119479 117818 116173 114989 113915 112633 111703 111817 112639 113096 112667 111739
54681 111739 110918 110568 110779 111164 110887 109508 107686 106506 106282 106511 106730 106780 106446 105579 104550 103952 103833 103747
54663A03747j95Q0O96J266J608J599J044J63k98N3O15N15l72j450k077j905r97
54646A04092Q9O66P09Q13J257J576J322O66n8p49j159q11K10R50P42N3l15l89
54628A09664o67j089j160q34n11l14n4K10K42J62L09O02O22L96L95O75O79J59
54610A09486l00j23L14J93n42j039o12M78J433J715J273L82l96m50K41Q68O57
54593A13578j54p15p84q62j041o81M10J273R84m3o80o00l01k5M44R60R76M75K02
54574A13416O41J307J342M90o93j371j102k45L48K12k45l78j04K74O76J085J125
54557A16778M66m97r88q11l56J30O43Q84M85k33m85q1L65L95K20K32N48J097J558
54538A20350J337K79p47o99K43R60R85P60M07n67j975k599j743k39O77P16L02
$$ plain form
54663 103747 103552 103632 104328 105594 107202 108801 109845 110008 109710 109763 110378 110893 110521 109071 106994 105089 104092
54646 104092 104181 104847 105556 106369 107626 109202 110524 111190 111132 110383 109224 108413 108623 109573 110315 110368 110053 109664
54628 109664 108997 107908 106748 105914 105403 105089 105035 105245 105487 105649 105958 106560 107182 107578 107973 108648 109327 109486
54610 109486 109186 109063 109377 109570 109028 107989 107377 107855 109288 111003 112276 112658 112262 111812 112053 112921 113578
54593 113578 113424 112709 111925 111063 110022 109341 109751 111024 112008 111965 111285 110685 110384 110359 110803 111763 112739 113214 113416
54574 113416 114057 115364 116706 117196 116503 115132 114030 113785 114133 114345 114100 113722 113618 113892 114568 115653 116778
54557 116778 117244 116747 115759 114948 114592 114722 115365 116249 116734 116501 116016 115935 116300 116695 116915 117147 117695 118792 120350
54538 120350 121687 121966 121219 120520 120763 121723 122708 123468 123875 123308 121333 118734 116991 116752 117429 118145 118447
54521A18447k20m83j03O12O43k97j058o15M13O74P0l22KL80K44o1K0L87N42L35
54501A19610P0J0M9o7k98l33p9M8l05p52n38L76J145J056L36k89l74P7P95J353
54481A21890J451J284J352J737J943J590Q69J85k37k52J74O96P52K89j93m26o57
54464A32447r54q51j24O89R83Q77Q57R80R36N57r7q72j435j369p10q9J3j46r3
54445A31599J43J48j95o11q11p11m22j80j00j9K27L87Q7m34n05J5N28O52P02R74
54425A31474J227J204J115J127J003O51M32M77L52r4k33K72N72l38k045l113k863
54408A31220j946j189o39J11J183K187K555K085J306J023J289J228K61q95r95
54393A38784J65J525K002J453M73k78m54r6M44P31M91j60o30k31R40J688R95n09
$$ plain form
54521 118447 118227 117744 117641 118253 118896 118599 117541 116926 117339 118013 118083 117761 117763 118143 118387 118326 118346 118733 119275 119610
54501 119610 119680 119690 119739 119672 119374 119041 118962 119010 118705 117953 117415 117791 118936 119992 120328 120039 119665 119742 120537 121890
54481 121890 123341 124625 125977 127714 129657 131247 132116 132301 132064 131812 131986 132682 133434 133723 133530 133104 132447
54464 132447 131493 130642 130518 131207 132190 133067 133924 134904 135840 136397 136300 135428 133993 132624 131914 131825 131838 131692 131599
54445 131599 131742 131890 131695 131084 130273 129562 129140 128960 128860 128841 129068 129455 129542 129108 128603 128618 129146 129798 130500 131474
54425 131474 132701 133905 135020 136147 137150 137801 138233 138710 139062 138968 138735 139007 139579 139241 137196 134083 131220
54408 131220 129274 128085 127446 127557 128740 130927 133482 135567 136873 137896 139185 140413 140674 139779 138784
54393 138784 138949 140474 142476 143929 144402 144124 143670 143574 144018 144749 145240 145080 144450 144219 145159 146847 147842 147333
54375A47333j159l99O03Q09O62R97J646K005K248K869L568L685L377L350L622
54360A75216L499K722J660N20q08k115k953l350l676l818l307k371j905k195k512
54345A54607k229j657j415j544j706j702j475j025o39p44j236j367p37K3M4n45
54329A36653p61q7Q80J213P28j6n17p69q71p25l31j16m29q49o42J04M52j5n08
54310A33394k48K63L1q03j040j86P83P86L7l83NO38Q07N43L60M50M35j1o48r71
54290A34242q88p30o17k77M33J182J582J612J500J402J358J286R10R4p24q36k05
54273A41324M46O80Q76J385J839J819J625J648J485N81n76q65j11O70P23M06L72
54256A54327N64N47L00J43J67K74O30J471K380K276O23j585k707k351j740j928
$$ plain form
54375 147333 146174 145775 146378 147187 147849 148846 150492 152497 154745 157614 161182 164867 168244 171594 175216
54360 175216 178715 181437 183097 183617 182809 180694 177741 174391 170715 166897 163590 161219 159314 157119 154607
54345 154607 152378 150721 149306 147762 146056 144354 142879 141854 141215 140471 139235 137868 137131 137154 137198 136653
54329 136653 135892 135805 136685 137898 138626 138610 138093 137324 136453 135728 135397 135281 134852 134003 133361 133465 133917 133902 133394
54310 133394 133146 133409 133440 132637 131597 131411 132194 132980 133017 132634 132639 133277 134084 134627 134987 135437 135872 135861 135213 134242
54290 134242 133354 132624 132007 131730 132163 133345 134927 136539 138039 139441 140799 142085 142995 143089 142365 141529 141324
54273 141324 141770 142450 143326 144711 146550 148369 149994 151642 153127 153708 153132 152267 152156 152826 153549 153955 154327
54256 154327 154891 155438 155738 155881 156048 156322 156952 158423 160803 163079 163702 162117 159410 157059 155319 153391
54240A53391k376j965q41j93m01n97j42N55R79J235J351Q85q8n20K66J448J733
54223A54720R43j75j066j506j197k43M56J75n26o35k22j60n96p56k79K74L64N8
54205A49629m21r74j371j299q12k32L98J128J554J128Q3o80p15m48l84m65l79
54188A45740j3N12R68J130R53N47j32j155j958j562J6J285J033n3n07k16k13p61
54170A45614j048o71j60J56M72O41J47p41j018m58L3p7k24K8K31Q3J66Q35J382
54151A45391J071K99j57k95m90n34m2O61Q78N67K70K42K62K16K65M76P03Q00P07
54132A51290M68K64K17P5m24q44l76R15J811J411K84m11l87k02j41R4P21J536
54114A56301K223K576K515K188J945J978K193K583L320M263M828M834M954N690
$$ plain form
54240 153391 151015 149050 148209 148016 147615 147018 146876 147431 148410 149645 150996 151881 151793 151273 151539 152987 154720
54223 154720 155663 155488 154422 152916 151719 151476 151932 152107 151581 150946 150724 150564 149968 149212 148933 149207 149571 149629
54205 149629 149208 148234 146863 145564 144752 144520 144918 146046 147600 148728 148811 148131 147416 146968 146584 146119 145740
54188 145740 145727 146239 147207 148337 149290 149837 149705 148550 146592 145030 145046 146331 147364 147311 146804 146588 146375 145614
54170 145614 144566 143895 143735 143891 144363 145004 145151 144410 143392 142934 142967 142890 142666 142694 142925 143008 143174 144009 145391
54151 145391 146462 146761 146604 146309 145819 145285 145243 145904 146782 147349 147619 147861 148123 148339 148604 149080 149783 150583 151290
54132 151290 151758 152022 152239 152314 151890 151046 150670 151585 153396 154807 155091 154680 154293 154091 153950 154044 154765 156301
54114 156301 158524 161100 163615 165803 167748 169726 171919 174502 177822 182085 186913 191747 196701 202391
54100B02391O315N586L369P66j276k736l737l908k954j416k47J42Q2mn2j89m70
54083B01662q87j425j968k324k492k706l049l215k920k439k279k371k034r06N85
54068A71232J758K305K172J349K00n30n49m41p64j158r74m09j63k57m7O44J258
54051A75626J454J560J892K293K564K818L198L665M133M460M364L840L576M267
54037B19710N566O381O322O115O432O955O907O028M714L631L267L522L711L286
54023B92547K534K075J931J679J219P45R4r38j840j983j842k528m027n148n366
54008B79152n453n904o068n426m518l953l506k983k945l700m448m318l502k601
53994B19827j623n10J10k46r93j318j465k121l059l415l019k468k020j331k68
$$ plain form
54100 202391 208706 214292 217661 218427 217151 214415 210678 206770 203816 202400 202153 202295 202377 202373 202321 202132 201662
54083 201662 200775 199350 197382 195058 192566 189860 186811 183596 180676 178237 175958 173587 171553 170647 171232
54068 171232 172990 175295 177467 178816 179016 178486 177937 177496 176732 175574 174600 174191 174028 173771 173724 174368 175626
54051 175626 177080 178640 180532 182825 185389 188207 191405 195070 199203 203663 208027 211867 215443 219710
54037 219710 225276 231657 237979 244094 250526 257481 264388 270416 275130 278761 282028 285550 289261 292547
54023 292547 295081 297156 299087 300766 301985 302730 302824 301886 300046 298063 296221 293693 289666 284518 279152
54008 279152 273699 267795 261727 256301 251783 247830 244324 241341 238396 234696 230248 225930 222428 219827
53994 219827 218204 217694 217804 217558 216565 215247 213782 211661 208602 205187 202168 199700 197680 196349 196081
53979A96081Q22J626K102K287K295K332K395K303K333L233N142P122Q364R258
53965B47695J0616J2432J4143J5384J5609J3640Q831K352l716q311j1525j3328
53953C03822j3433j2247j0689r003o780m214k239j239o07J38P50R61J046J336
53939B47602J913K962M668O508P376O813N481M258L417K895K627K361J764J125
53925C01770J240K252L255L560L677M366N299N497M918M639N369O538P213P356
53911C66949P562P899P685O587N301M623M220L041Q97j123k024k082k251k915
53897D04369l688m147m210l993l803m076m976o086o846p207p581q244q984r261
53883C21267q603p090n561m974n389n899n727m951m041l290k966l316l957l914
$$ plain form
53979 196081 196903 198529 200631 202918 205213 207545 209940 212243 214576 217809 222951 230073 238437 247695
53965 247695 258311 270743 284886 300270 315879 329519 338350 340702 336986 328675 317150 303822
53953 303822 290389 278142 267453 258450 251670 247456 245217 243978 243371 243509 244259 245220 246266 247602
53939 247602 249515 252477 257145 263653 271029 277842 283323 287581 290998 293893 296520 298881 300645 301770
53925 301770 303010 305262 308517 312077 315754 320120 325419 330916 335834 340473 345842 352380 359593 366949
53911 366949 374511 382410 390095 396682 401983 406606 410826 413867 414764 413641 411617 409535 407284 404369
53897 404369 400681 396534 392324 388331 384528 380452 375476 369390 362544 355337 347756 339512 330528 321267
53883 321267 312664 305574 300013 295039 289650 283751 278024 273073 269032 265742 262776 259460 255503 251589
53869B51589k886j917k094l142l943m008l684l342l141l257l552l341k232r38
53855B10112m37o91r76j127j474j772j335k56N30N26J82J4K0J10L00L66l7o58
53837B03397p81k01M78O58L65p0l87m23j97Nqm3lk54r11j245o07L72N53pj96M11
53815B00906J162J650K221K951L295L073K828K788K497J896J798K779M375N818
53801B40037O838P354P177O503N975N877N855N703N628N431M445K708J279Q53
53787C11663Q63O04L20M38N14j76j433k395k697k677k734k992l463m104m863n765
53771B81103o616o719n614m092l590m258m692l996k994k742k928k706k172j934
53757B26050j871j497j064j176j606j591j058n98m31k55j04m05j173j866k048
$$ plain form
53869 251589 248703 246786 244692 241550 237607 233599 229915 226573 223432 220175 216623 213282 211050 210112
53855 210112 209675 208984 208008 206881 205407 203635 202300 202044 202574 203100 203282 203296 203316 203426 203726 204092 204055 203397
53837 203397 202616 202415 202893 203551 203916 203846 203459 203036 202839 202844 202836 202793 202790 202536 201625 200380 199773 200145 200698 200691 200495 200906
53815 200906 202068 203718 205939 208890 212185 215258 218086 220874 223371 225267 227065 229844 234219 240037
53801 240037 246875 254229 261406 267909 273884 279761 285616 291319 296947 302378 306823 309531 310810 311663
53787 311663 312526 313130 313450 313888 314402 314226 312793 310398 307701 305024 302290 299298 295835 291731 286868 281103
53771 281103 274487 267768 262154 258062 254472 250214 245522 241526 238532 235790 232862 230156 227984 226050
53757 226050 224179 222682 221618 220442 218836 217245 216187 215589 215158 214903 214799 214394 213221 211355 209307
53742B09307j681q44J69O87K57o07r12l89L40O95O91O08O70R97J386J323O46L0
53724B13373J94R07J346J281J168J278J501J922K776L738M042L469K591J810R06
53709B42302j76p12M8J823L424L851L143K214K009K650L413L563L146K837L162
53694B76697M028M892N122M432L206K171J566R14j21j093j458j505j896k520k551
53679B91884j669n17J26J24j82m41m77l65l50m51k86K93O84K64n40o57J76J068
53661B88684J190O36j67j045j740j725q69J32N31M22M16P49J163J420J499J390
53645B92686J115Q79Q79J040J206J472K032K693K929K481J736J321J414J640J630
53630C17153J574K010L059M132M575M425M259M379M500M276L821L490L403L396
$$ plain form
53742 209307 207626 206782 206951 207638 207895 207288 206376 205987 206327 207022 207713 208321 208991 209988 211374 212697 213343 213373
53724 213373 213567 214474 215820 217101 218269 219547 221048 222970 225746 229484 233526 236995 239586 241396 242302
53709 242302 242126 241414 241462 243285 246709 250560 253703 255917 257926 260576 263989 267552 270698 273535 276697
53694 276697 280725 285617 290739 295171 298377 300548 302114 303028 302907 301814 300356 298851 296955 294435 291884
53679 291884 290215 289698 289824 289948 289766 289325 288848 288483 288133 287682 287396 287689 288373 288637 288097 287440 287616 288684
53661 288684 289874 290510 290343 289298 287558 285833 284964 285096 285627 286049 286465 287214 288377 289797 291296 292686
53645 292686 293801 294680 295559 296599 297805 299277 301309 304002 306931 309412 311148 312469 313883 315523 317153
53630 317153 318727 320737 323796 327928 332503 336928 341187 345566 350066 354342 358163 361653 365056 368452
53616C68452L270K942K432J855J464J504J964K528K803K641K279K108K333K820
53602D01395L270L492L513L497L539L465K937J888Q01K91M13N99L26m09j249j812
53586D25956j826j315q06r25j667k388k693k768k670j969o47K47l36j993l300
53571D00900l477k968k427k023j829k025k366k141j157k36k61r46j187m37O63
53556C78083J177R14M12O7k66p10q23j29J002J613J431J206J436J504P09l60l62
53539C86904J081L085M749N878O478O477O189O217O598O693O348O357P336Q743
53525D69133R681J0118J0665J1471J2105J2429J2878J3793J5001J6160J7101J7731
53513F28266J7969J8038J8539J9913K1920K3779K4940K5519K5912K6187K6067
$$ plain form
53616 368452 371722 374664 377096 378951 380415 381919 383883 386411 389214 391855 394134 396242 398575 401395
53602 401395 404665 408157 411670 415167 418706 422171 425108 426996 427797 428088 428501 429100 429426 429017 427768 425956
53586 425956 424130 422815 422009 421084 419417 417029 414336 411568 408898 406929 406282 406529 406193 404200 400900
53571 400900 397423 394455 392028 390005 388176 386151 383785 381644 380487 380251 379990 379044 377857 377420 378083
53556 378083 379260 380174 380586 380653 380387 379677 378854 378725 379727 381340 382771 383977 385413 386917 387626 387266 386904
53539 386904 387985 391070 395819 401697 408175 414652 420841 427058 433656 440349 446697 453054 460390 469133
53525 469133 478814 488932 499597 511068 523173 535602 548480 562273 577274 593434 610535 628266
53513 628266 646235 664273 682812 702725 724645 748424 773364 798883 824795 850982 877049
53502H77049K5488K4800K4230K3495K2324K1141K0717K1128K1570K1318K0527
53491A123787J9846J9616J9655J9628J9391J9068J8903J8939J8859J8357J7606
53480A333655J7072J6888J6778J6613J6608J6730J6397J5024J2602R510O100K775
53468A496752Q1j724l096m732o809q982j1023j3059j5160j7000j8095j8239j7731
53455A361183j7232j7359j8166j9105j9622j9697j9698j9807j9845j9648j9377
53444A151627j9358j9631j9770j9178j7652j5651j3800j2182j0332p999n590l658
53432I86826k221r35K55J024J306J651K804M917P266Q786R040Q707Q942J0234
53418A048602J2076J3877J5807J8352K1298K3728K5108K5853K6673K7703K8649
$$ plain form
53502 877049 902537 927337 951567 975062 997386 1018527 1039244 1060372 1081942 1103260 1123787
53491 1123787 1143633 1163249 1182904 1202532 1221923 1240991 1259894 1278833 1297692 1316049 1333655
53480 1333655 1350727 1367615 1384393 1401006 1417614 1434344 1450741 1465765 1478367 1487877 1493977 1496752
53468 1496752 1496833 1495109 1492013 1487281 1480472 1471490 1460467 1447408 1432248 1415248 1397153 1378914 1361183
53455 1361183 1343951 1326592 1308426 1289321 1269699 1250002 1230304 1210497 1190652 1171004 1151627
53444 1151627 1132269 1112638 1092868 1073690 1056038 1040387 1026587 1014405 1004073 996074 990484 986826
53432 986826 984605 983670 983925 984949 986255 987906 990710 995627 1002893 1011679 1020719 1029426 1038368 1048602
53418 1048602 1060678 1074555 1090362 1108714 1130012 1153740 1178848 1204701 1231374 1259077 1287726
53407A287726K9489L0604L2192L3917L5333L6510L8027M0284M2994M5476M7379
53396A699931M9023N0878N2947N4778N6048N6884N7565N8115N8360N8211N7713
53385B310453N6809N5322N3243N0914M8699M6619M4345M1593L8308L4531L0301
53374B811137K5750K1113J6537J2003P528L226j016n776j1671j8649k5924l2658
53362B801600l8549m3655m7918n1072n3005n4009n4613n5151n5555n5491n4698
53351B237884n3165n1109m8873m6785m4939m3186m1507m0337m0166m0788m1308
53340A745721m1142m0517l9694l8178l5365l1729k8587k6576k5059k3211k1081
53329A394582j9163j7507j5831j4239j3247j3054j3271j3387j3280j3174j3274
$$ plain form
53407 1287726 1317215 1347819 1380011 1413928 1449261 1485771 1523798 1564082 1607076 1652552 1699931
53396 1699931 1748954 1799832 1852779 1907557 1963605 2020489 2078054 2136169 2194529 2252740 2310453
53385 2310453 2367262 2422584 2475827 2526741 2575440 2622059 2666404 2707997 2746305 2780836 2811137
53374 2811137 2836887 2858000 2874537 2886540 2894068 2897294 2896278 2890502 2878831 2860182 2834258 2801600
53362 2801600 2763051 2719396 2671478 2620406 2567401 2513392 2458779 2403628 2348073 2292582 2237884
53351 2237884 2184719 2133610 2084737 2037952 1993013 1949827 1908320 1867983 1827817 1787029 1745721
53340 1745721 1704579 1664062 1624368 1586190 1550825 1519096 1490509 1463933 1438874 1415663 1394582
53329 1394582 1375419 1357912 1342081 1327842 1314595 1301541 1288270 1274883 1261603 1248429 1235155
53318A235155j3463j3317j2434j0883r233q048p366o782n893m531k759q63P52
53305A140335J956L066M452O037P486Q838J0491J2508J4377J5736J6982J8737
53293A261001K0965K3091K4839K6415K7823K8552K8256K7281K6206K5130K3832
53282A543391K2272K0515J8359J5609J2567R767P227M585J863n55k770n402q533
53269A638895j1375j3449j5326j7588j9798k1268k2377k4072k6326k8138k9022
53258A410156k9539l0204l0723l0681l0233k9756k9341k8959k8690k8445k7913
53247A085672k7019k6029k5049k3882k2676k2137k2587k3307k3361k2816k2519
53236H24290k2732k2613k1235j8792j6470j5146j4433j3288j1453r843r250r182
$$ plain form
53318 1235155 1221692 1208375 1195941 1185058 1175825 1167777 1160411 1153629 1147736 1143205 1140446 1139583 1140335
53305 1140335 1142291 1145357 1149809 1155846 1163332 1172170 1182661 1195169 1209546 1225282 1242264 1261001
53293 1261001 1281966 1305057 1329896 1356311 1384134 1412686 1440942 1468223 1494429 1519559 1543391
53282 1543391 1565663 1586178 1604537 1620146 1632713 1642480 1649707 1654292 1656155 1655600 1652830 1647428 1638895
53269 1638895 1627520 1614071 1598745 1581157 1561359 1540091 1517714 1493642 1467316 1439178 1410156
53258 1410156 1380617 1350413 1319690 1289009 1258776 1229020 1199679 1170720 1142030 1113585 1085672
53247 1085672 1058653 1032624 1007575 983693 961017 938880 916293 892986 869625 846809 824290
53236 824290 801558 778945 757710 738918 722448 707302 692869 679581 668128 658285 649035 639853
53224F39853q646p737p461q047q537q397q493r727j1521j2601j2747j2798j3215
53211E09926j3565j3403j2859j2197j1372j0252q815p134n535m693n053o108o829
53198C92111o870o847p279p834p867p272o444n700n150m885m889m874m509l902
53184C07789l538l642l793l394k497j838j987k598k860k488j990j923k306k817
53170B70118l154l037k337j487j330k152l141l273k452j376n88k18l33q82j308
53155B43050r65j0O67N79J27j42k19l18l63j77J52M06N63P00P68P33O76N86K76
53136B47089k61o27m63P7N09O34O36P19Q44Q80P91O74P08J021J474J621J097R7
53118B57520o49n70K14J042J420J385J237J016N27k13q47j079j020r57r72r54
$$ plain form
53224 639853 631207 623470 616009 607962 599425 591028 582535 572808 561287 548686 535939 523141 509926
53211 509926 496361 482958 470099 457902 446530 436278 427463 420329 414794 410101 405048 398940 392111
53198 392111 385241 378394 371115 363281 355414 348142 341698 335998 330848 325963 321074 316200 311691 307789
53184 307789 304251 300609 296816 293422 290925 289087 287100 284502 281642 279154 277164 275241 272935 270118
53170 270118 266964 263927 261590 260103 258773 256621 253480 250207 247755 246379 245791 245573 245240 244358 243050
53155 243050 242085 242075 242742 243321 243448 243306 243087 242769 242406 242229 242381 242787 243350 244050 244818 245551 246227 246813 247089
53136 247089 246828 246201 245738 245815 246324 246958 247594 248313 249157 250037 250828 251502 252210 253231 254705 256326 257423 257520
53118 257520 256871 256301 256515 257557 258977 260362 261599 262615 263142 262929 262082 261003 259983 259026 258054 257100
53102B57100q61p24n85o25j151k148k944k796j830r94r62j422j572j052j49O63
53086B37948J094J118Q94O55M56J42l95r32j060o11J02N24L71j20n02o51q45j250
53068B36938j598j561j273j151j361j691j929j990j742j043j6R74J657J949J787
53053B27950J245P40O83Q82P81L41J68N33Q59N29k50q25r92r34o22J67J257K049
53035B34561K151J764J311R94P50M17o9n19o27l86k38n29r15o90K77J269J500
53018B41021R09R4l91m74m03l22j16K78O36P23O91Q39R67N19m48r67l34Q81J554
52999B45657J409J019P05K56l10n70m39l54m65l82n0m1n88r73n40K93P32Q11J120
52980B47290J671J933J821J733J672J156J78m83k93L32P15Q33J094J586J943J845
$$ plain form
53102 257100 256239 255515 254930 254305 253154 251006 248062 245266 243436 242442 241480 240058 238486 237434 237285 237948
53086 237948 239042 240160 241054 241709 242165 242307 241912 240980 239920 239309 239411 239935 240306 240186 239684 239033 238188 236938
53068 236938 235340 233779 232506 231355 229994 228303 226374 224384 222642 221599 221583 222557 224214 226163 227950
53053 227950 229195 229935 230618 231500 232281 232622 232790 233323 234182 234711 234461 233636 232644 231710 231088 231255 232512 234561
53035 234561 236712 238476 239787 240781 241531 241948 241879 241360 240733 240347 240109 239580 238665 237975 238252 239521 241021
53018 241021 241930 242024 241633 241159 240756 240434 240318 240596 241232 241955 242646 243485 244452 244971 244523 243556 243222 244103 245657
52999 245657 247066 248085 248790 249046 248736 248166 247727 247373 246908 246526 246476 246435 245847 244874 244334 244627 245359 246170 247290
52980 247290 248961 250894 252715 254448 256120 257276 257454 256971 256678 257010 257725 258558 259652 261238 263181 265026
52964B65026J349P77M45L76K71n6l51l27k62o92j453j715j163n10n05j017j514
52947B58679j930k408k670k339j638j152r95q34o09o11q95j172j273j251j023
52932B37879m60J55L02j04o31r40r84o61J55J144J666J530J138P88M07P6J30N24
52914B42114O73L23m2K6K71K95J67Q6o8l38l70nK75J29L8M92R03L34r37j512o28
52893B42226J010K251K609K248J538R09O49N67J94n24j127j341j406j518j465
52878B46820j015l55J55L53K72P8J61Q77K038K930L097K762K338J899J366Q77
52862B64653O19M77J83l29q98j400j829k233k659l034l079k580j805j373j598
52847B43115k205k742k949k658j811p81k81n30r29q65n04l90n69o36m41j93j1
$$ plain form
52964 265026 266375 267152 267597 267973 268244 268188 267837 267510 267248 266556 265103 263388 262225 261715 261210 260193 258679
52947 258679 256749 254341 251671 249332 247694 246542 245547 244713 244104 243493 242598 241426 240153 238902 237879
52932 237879 237419 237574 237876 237772 237141 236201 235217 234556 234711 235855 237521 239051 240189 240977 241384 241460 241590 242114
52914 242114 242787 243110 243068 243094 243365 243660 243827 243913 243845 243507 243137 243132 243407 243536 243574 244066 244969 245303 244366 242854 242226
52893 242226 243236 245487 248096 250344 251882 252791 253440 254007 254201 253677 252550 251209 249803 248285 246820
52878 246820 245805 245450 245605 245958 246230 246308 246469 247346 249384 252314 255411 258173 260511 262410 263776 264653
52862 264653 265272 265749 265932 265603 264705 263305 261476 259243 256584 253550 250471 247891 246086 244713 243115
52847 243115 240910 238168 235219 232561 230750 229969 229688 229158 228229 227364 226860 226470 225901 225265 224824 224631 224620
52830B24620R6p7p14j389j312l19Q55J474J525J312Q44J25l78j21P46J467J622
52813B30376J476J397J360J281J383J825K158J665K64j291k252k537k478k261
52799B32366j948j744j799j838j425n84J35K75p3n30p76o14kP89J246J077M83
52782B25038p9k37J22P80J156P70j14n99j68O63R53L61o67j518j794j384n77m2
52764B22664k28p59q48l11K80N10O30J015J537J833J860J808J682J433J276J444
52748B35826J690J501Q47K86J62J71l3j95K01J160K168K815K952K427J223m5m06
52731B52750L35J221J300Q57R38J833K625K305Q87p99j982k438k406k322k515
52716B52589k894k965k268q97M44R16K41r72j684j386n41P8L29O17J070J304J064
$$ plain form
52830 224620 224716 224639 223925 222536 221224 220905 221760 223234 224759 226071 226915 227040 226662 226541 227287 228754 230376
52813 230376 231852 233249 234609 235890 237273 239098 241256 242921 243185 241894 239642 237105 234627 232366
52799 232366 230418 228674 226875 225037 223612 223028 223163 223438 223365 222835 222059 221445 221443 222232 223478 224555 225038
52782 225038 224959 224722 224844 225624 226780 227550 227436 226837 226669 227332 228285 228646 227979 226461 224667 223283 222706 222664
52764 222664 222436 221677 220829 220518 220798 221308 221938 222953 224490 226323 228183 229991 231673 233106 234382 235826
52748 235826 237516 239017 239864 240150 240312 240483 240450 240255 240456 241616 243784 246599 249551 251978 253201 253156 252750
52731 252750 253085 254306 255606 256463 257401 259234 261859 264164 265051 264252 262270 259832 257426 255104 252589
52716 252589 249695 246730 244462 243565 244009 244925 245166 244194 242510 241124 240583 240661 240990 241607 242677 243981 245045
52699B45045O16L02J42J08L66Q56R97L70n57r08n51k67o24j194j173m48K61K37
52681B43578m98j257j412r29k88Q1K02L38N55O67N92M53L59J98o8j88J45Q18J330
52662B44676J336R96O54L87J22L8M76J362K033J944J358J003J139J291Q99Qq41
52645B58881j185j011o71n15n92o68n88m90n60p06o29j71N92J520K359K709K365
52628B60640J721J473J884K564K966K728J640k47k294l585l809l450k929k099
52614B57203r25r9l08j177j630j247o67n92r11j020o16M7M98M27n2m45k67M79
52596B48698J275J616J464J146R14O98L26j16k76N2O29J124J554K070K351J780
52580B65305L89q28r42k38K00j09m98j46Q21J473J181K63n54j016j392j763j759
$$ plain form
52699 245045 245661 245963 246105 246213 246579 247435 248432 248802 248245 247337 246786 246519 245895 244701 243528 243080 243341 243578
52681 243578 243080 241823 240411 239482 239194 239275 239477 239815 240370 241037 241629 242082 242441 242639 242571 242383 242528 243346 244676
52662 244676 246012 247008 247662 248049 248171 248209 248685 250047 252080 254024 255382 256385 257524 258815 259714 259722 258881
52645 258881 257696 256685 256014 255499 254907 254239 253651 253161 252601 251895 251266 251095 251687 253207 255566 258275 260640
52628 260640 262361 263834 265718 268282 271248 273976 275616 275369 273075 269490 265681 262231 259302 257203
52614 257203 256278 256179 255871 254694 253064 251817 251150 250558 249647 248627 248011 248058 248556 248983 248931 248486 248219 248698
52596 248698 249973 251589 253053 254199 255113 255811 256137 256021 255745 255797 256426 257550 259104 261174 263525 265305
52580 265305 265694 264866 263924 263686 263886 263777 263279 263133 263954 265427 266608 266871 266317 265301 263909 262146 260387
52563B60387j262p87p20n89J52R72Q54n5m99rM27M8m89m18k90r64j969k100j273
52544B51416m42k3L87Q00P11K67L10R19J112M64n8M28J295J291K12j041j673j530
52526B54845p24M95J575J888J334M66k7J31N52O08J56j30M34J566K306K297K168
52509B69940K476K943L019K622J891P93n50j537j709j435j524k210k928l003k290
52494B66498j212l70r8k86o55j114j591j766j375p08k29J46Q03J485J499R13O22
52477B62562R15J031O01M41J204K139K175J493R90Q49O86O16R76J319R04J08J59
52460B79168J386K699L048K446J393J39j162k236k910l158k877k120j509j712
52446B72595k502k959k575j639o22J05J16o00j156o43M56Q07J38m74m00k58m94
$$ plain form
52563 260387 259125 258338 257618 257029 257181 258153 259007 258952 258453 258444 258871 258919 258430 258012 257722 256758 254789 252689 251416
52544 251416 250974 250951 251338 252138 252849 253116 253426 254345 255457 255921 255863 256291 257586 258877 259089 258048 256375 254845
52526 254845 254121 254616 256191 258079 259413 259879 259852 259983 260535 261143 261299 261169 261603 263169 265475 267772 269940
52509 269940 272416 275359 278378 281000 282891 283684 283134 281597 279888 278453 276929 274719 271791 268788 266498
52494 266498 265286 264916 264818 264532 263877 262763 261172 259406 258031 257323 257094 257240 258043 259528 261027 261940 262562
52477 262562 263477 264508 265109 265550 266754 268893 271068 272561 273551 274400 275086 275702 276678 277997 278901 279009 279168
52460 279168 280554 283253 286301 288747 290140 290279 289117 286881 283971 280813 277936 275816 274307 272595
52446 272595 270093 267134 264559 262920 262298 262403 262519 261919 260763 260120 260576 261383 261521 261047 260647 260389 259895
52429B59895n80j68J08j63k67L42Q59M10l30l6J272K388K727K702K546K006J271
52412B74982J067J647K527L377M414N700O882P849Q912J0065J0608R905Q004N338
52398C61277K204j158m349o928q566r082q534p346o033m833l814l142k843k522
52384B94331j793q64k30J20N42R74J054R53J312K209K919K947K595K334K286K568
52368C14257L315L999L607K048O63N94J233J154R1r19j100o51L6Q98J663J673
52352C32561P31k91k33J073K611L239K798K100J943K291K540K458K466K971L793
52337C63051M489M898N115N272N626O541P849Q697Q551Q143Q711J0381J2045J2924
52323D72293J3463J4355J5392J5869J5733J5642J5991J6401J6334J5874J5647
$$ plain form
52429 259895 259315 259147 259255 259092 258825 259167 260026 260436 260106 260070 261342 263730 266457 269159 271705 273711 274982
52412 274982 276049 277696 280223 283600 288014 293714 300596 308445 317357 327422 338030 347935 355939 361277
52398 361277 363481 362323 357974 351046 342480 333398 324864 317518 311485 306652 302838 299696 296853 294331
52384 294331 292538 291674 291444 291564 292106 293080 294134 295087 296399 298608 301527 304474 307069 309403 311689 314257
52368 314257 317572 321571 325178 327226 327889 328483 329716 330870 330961 330042 328942 328291 328327 329225 330888 332561
52352 332561 333292 333001 332768 333841 336452 339691 342489 344589 346532 348823 351363 353821 356287 359258 363051
52337 363051 367540 372438 377553 382825 388451 394992 402841 411538 420089 428232 436943 447324 459369 472293
52323 472293 485756 500111 515503 531372 547105 562747 578738 595139 611473 627347 642994
52312F42994J6101J7065J8065J8887J9628K0167J9916J8482J6432J4997J4885
52301H37619J5602J6106J5807J4822J3517J2071J0421Q427O039L429R59j093k763
52288I50963m278n727o897p473p378o882o392o144o057n796m994l493j586J22
52274H77988J278K155L260M594N716O567P711R425J1012J1539J1052J0539J0706
52261I73542J1301J1689J1643J1489J1715J2496J3458J3878J3474J2816J2649
52250A110150J2820J2370J0696Q204N672L443J432m85k391m294n990p111p537
52237A136979p530p421p383p577q113q757q983q597p937p386p005o797o887p119
52223A029487o923n913m352k711j114M13J507J755J309P80O76J224K429L937N080
$$ plain form
52312 642994 659095 676160 694225 713112 732740 752907 772823 791305 807737 822734 837619
52301 837619 853221 869327 885134 899956 913473 925544 935965 944392 950431 953860 954819 953726 950963
52288 950963 946685 940958 934061 926588 919210 912328 905936 899792 893735 887939 882945 879452 877866 877988
52274 877988 879266 881421 884681 889275 894991 901558 909269 918694 929706 941245 952297 962836 973542
52261 973542 984843 996532 1008175 1019664 1031379 1043875 1057333 1071211 1084685 1097501 1110150
52250 1110150 1122970 1135340 1146036 1154240 1159912 1163355 1164787 1164302 1161911 1157617 1151627 1144516 1136979
52237 1136979 1129449 1122028 1114645 1107068 1098955 1090198 1081215 1072618 1064681 1057295 1050290 1043493 1036606 1029487
52223 1029487 1022564 1016651 1012299 1009588 1008474 1008887 1010394 1012149 1013458 1014238 1014914 1016138 1018567 1022504 1027584
52208A027584N522N649N880N883N111L952L499M098M875N022M896N316O260O891
52194A100438O775O388O315O441O189N365M340L397K289O75j227k799l777m514
52180A136295n454o594p625q288q472q176p540o750n830m768l865l557l768l847
52166A051761l352k480j509l85Q15J530J447J114J202J475J190L33l42m06j77
52151A052216k3R2K67M32O73J229J988K419K156J432P65M95N64N53k8j152k132
52134A061946k358j922j110L14K638N371P713R675J1799J3879J5109J5578J6476
52121A155108J8384K0474K1864K2757K3591K4042K3732K3140K2862K2538K1449
52110A399941J9794J8395J7430J6329J4804J3248J2135J1596J1468J1273J0336
$$ plain form
52208 1027584 1033106 1038755 1044635 1050518 1055629 1059581 1063080 1067178 1072053 1077075 1081971 1087287 1093547 1100438
52194 1100438 1107213 1113601 1119916 1126357 1132546 1137911 1142251 1145648 1147937 1148612 1147385 1144586 1140809 1136295
52180 1136295 1130841 1124247 1116622 1108334 1099862 1091686 1084146 1077396 1071566 1066798 1062933 1059376 1055608 1051761
52166 1051761 1048409 1045929 1044420 1044035 1044850 1046380 1047827 1048941 1050143 1051618 1052808 1053141 1052799 1052393 1052216
52151 1052216 1052193 1052285 1052552 1052984 1053657 1054886 1056874 1059293 1061449 1062881 1063646 1064141 1064705 1065258 1065230 1064078 1061946
52134 1061946 1059588 1057666 1056556 1056870 1059508 1064879 1072592 1082267 1094066 1107945 1123054 1138632 1155108
52121 1155108 1173492 1193966 1215830 1238587 1262178 1286220 1309952 1333092 1355954 1378492 1399941
52110 1399941 1419735 1438130 1455560 1471889 1486693 1499941 1512076 1523672 1535140 1546413 1556749
52099A556749Q440O196M284K643Q51j058k942n235q419j1927j4522j5796j6410
52086A502854j6847j6813j6081j5059j4104j2947j1259r273p445n875m429l042
52074A369680j608R6K047L842N206O419P936R829J1719J3156J3846J3843J3552
52061A469563J3391J3378J3309J3313J3744J4417J4469J3294J1160Q675O057L320
52049A608090P34j469l581o117r102j2062j4536j6259j7006j6876j6593j6913
$$ plain form
52099 1556749 1565189 1571385 1575669 1578312 1579163 1578105 1575163 1569928 1561509 1549582 1535060 1519264 1502854
52086 1502854 1486007 1469194 1453113 1438054 1423950 1411003 1399744 1390471 1383026 1377151 1372722 1369680
52074 1369680 1368072 1368168 1370215 1374057 1379263 1385682 1393618 1403447 1415166 1428322 1442168 1456011 1469563
52061 1469563 1482954 1496332 1509641 1522954 1536698 1551115 1565584 1578878 1590038 1598713 1604770 1608090
52049 1608090 1608824 1607355 1603774 1597657 1588555 1576493 1561957 1545698 1528692 1511816 1495223 1478310
$$ [...]
##END NTUPLES=NMR SPECTRUM
##END=
