
##TITLE=UV1229_M7_1357-1247_10_7230815_2GDWOkxkEZ
##JCAMPDX= 6.0         $$ Bruker NMR JCAMP-DX V2.0
##DATA TYPE= NMR SPECTRUM
##DATA CLASS= NTUPLES
##ORIGIN= BRUKER
##OWNER= Administrator
$$ 1.72 TOPSPIN		Version 2.1
$$ 2013-01-18 21:00:33.853 -0500  Administrator@X
$$ Compression mode = diff/dup
##.OBSERVE FREQUENCY= 400.02188249412
##.OBSERVE NUCLEUS= ^1H
##.ACQUISITION MODE= SIMULTANEOUS (DQD)
##.ACQUISITION SCHEME= undefined
##.AVERAGES= 8
##.DIGITISER RES= 22
##SPECTROMETER/DATA SYSTEM= spect
##.PULSE SEQUENCE= zg30
##.SOLVENT NAME= COFFEE_meoh
##.SHIFT REFERENCE= INTERNAL, COFFEE_meoh, 1, 14.98509
##AUDIT TRAIL= $$ (NUMBER, WHEN, WHO, WHERE, PROCESS, VERSION, WHAT)
$$ ##TITLE= Audit trail, TOPSPIN		Version 2.1
$$ ##JCAMPDX= 5.01
$$ ##ORIGIN= Bruker BioSpin GmbH
$$ ##OWNER= Administrator
$$ $$ E:\/data/COFFEE/nmr/UV1229_M7_1357-1247_10_7230815_2GDWOkxkEZ/20/pdata/1/auditp.txt
$$ ##AUDIT TRAIL=  $$ (NUMBER, WHEN, WHO, WHERE, PROCESS, VERSION, WHAT)
(   1,<2013-01-18 21:00:25.712 -0500>,<Administrator>,<X>,<go>,<TOPSPIN 2.1>,
      <created by zg
	started at 2013-01-18 20:59:18.415 -0500,
	POWCHK enabled, PULCHK disabled,
       configuration hash MD5:
       86 BA 57 50 F2 9D 5C 9B 26 00 A9 28 5F 66 2E 89
       data hash MD5: 64K
       69 76 EB 79 9A 70 5F 3D 14 E1 C6 3A 5C 0D 40 5F>)
(   2,<2013-01-18 21:00:28.806 -0500>,<Administrator>,<X>,<proc1d>,<TOPSPIN 2.1>,
      <Start of raw data processing
       efp LB = 0 FT_mod = 6 PKNL = 1 PHC0 = 0 PHC1 = 0 SI = 32K 
       data hash MD5: 32K
       2A 3F 6E 28 57 A9 3C 6F 37 D8 87 88 A9 5B 3D BB>)
(   3,<2013-01-18 21:00:29.290 -0500>,<Administrator>,<X>,<proc1d>,<TOPSPIN 2.1>,
      <pk PHC0 = 94.47144 PHC1 = 0 
       data hash MD5: 32K
       D3 CF C5 D0 87 C9 CA 37 76 7F 38 97 F1 E2 8F E8>)
(   4,<2013-01-18 21:00:29.509 -0500>,<Administrator>,<X>,<proc1d>,<TOPSPIN 2.1>,
      <abs ABSG = 1 
       data hash MD5: 32K
       0B 18 89 DD C7 5F 6E 10 F7 16 3E DE 73 4F FE B2>)
(   5,<2013-01-18 21:00:29.665 -0500>,<Administrator>,<X>,<proc1d>,<TOPSPIN 2.1>,
      <abs ABSG = 2 
       data hash MD5: 32K
       2E F3 B9 9C A2 C7 C1 5F 17 05 0F D6 89 9B 1D B7>)
(   6,<2013-01-18 21:00:29.806 -0500>,<Administrator>,<X>,<proc1d>,<TOPSPIN 2.1>,
      <abs ABSG = 3 
       data hash MD5: 32K
       29 F3 BA B6 C7 4B 16 63 DF DB E0 D6 F9 A4 BD 65>)
(   7,<2013-01-18 21:00:29.962 -0500>,<Administrator>,<X>,<proc1d>,<TOPSPIN 2.1>,
      <abs ABSG = 4 
       data hash MD5: 32K
       2E A4 FC 87 C3 59 BB EA 7C 83 A2 0F 3E A1 D4 2E>)
(   8,<2013-01-18 21:00:30.118 -0500>,<Administrator>,<X>,<proc1d>,<TOPSPIN 2.1>,
      <abs ABSG = 5 
       data hash MD5: 32K
       E6 23 6E E6 F4 08 D7 89 8B B8 2A 21 42 FA 83 29>)
$$ ##END=
$$ 
$$ $$ hash MD5
$$ $$ 22 B8 78 1C C7 98 EB FE 12 61 F3 E6 A1 A9 F5 43
##$RELAX= 
##$RELAX= 
##$RELAX= 
##$RELAX= 
##$RELAX= 
##$RELAX= 
##$RELAX= 
$$ Bruker specific parameters
$$ --------------------------
##$DU= <E:\>
##$EXPNO= 20
$$ [...]
##$TP= (0..7)
150 150 150 150 150 150 150 150
##$TP07= 0
##$TPNAME0= <>
##$TPNAME1= <>
##$TPNAME2= <>
##$TPNAME3= <>
##$TPNAME4= <>
##$TPNAME5= <>
##$TPNAME6= <>
##$TPNAME7= <>
##$TPOAL= (0..7)
0.5 0.5 0.5 0.5 0.5 0.5 0.5 0.5
##$TPOFFS= (0..7)
0 0 0 0 0 0 0 0
##$TUNHIN= 0
##$TUNHOUT= 0
##$TUNXOUT= 0
##$USERA1= <user>
##$USERA2= <user>
##$USERA3= <user>
##$USERA4= <user>
##$USERA5= <user>
##$V9= 5
##$VALIST= <valist>
##$VCLIST= <CCCCCCCCCCCCCCC>
##$VD= 0
##$VDLIST= <DDDDDDDDDDDDDDD>
##$VPLIST= <PPPPPPPPPPPPPPP>
##$VTLIST= <TTTTTTTTTTTTTTT>
##$WBST= 1024
##$WBSW= 4
##$XGAIN= (0..3)
0 0 0 0
##$XL= 0
##$YL= 0
##$YMAX_a= 650354
##$YMIN_a= -550858
##$ZGOPTNS= <>
##$ZL1= 120
##$ZL2= 120
##$ZL3= 120
##$ZL4= 120
##$ABSF1= 14.98509
##$ABSF2= -5.573092
##$ABSG= 5
##$ABSL= 3
##$ALPHA= 0
##$AQORDER= 0
##$ASSFAC= 0
##$ASSFACI= 0
##$ASSFACX= 0
##$ASSWID= 0
##$AUNMP= <proc_prof1d_extract_pilot.lims>
##$AXLEFT= 0
##$AXNAME= <>
##$AXNUC= <1H>
##$AXRIGHT= 0
##$AXTYPE= 0
##$AXUNIT= <>
##$AZFE= 0.1
##$AZFW= 0.1
##$BCFW= 0
##$BC_mod= 0
##$BYTORDP= 0
##$COROFFS= 0
##$CY= 15
##$DATMOD= 1
##$DC= 0
##$DFILT= <>
##$DTYPP= 0
##$F1P= 0
##$F2P= 0
##$FCOR= 0.5
##$FTSIZE= 32768
##$FT_mod= 6
##$GAMMA= 0
##$GB= 0
##$INTBC= 1
##$INTSCL= 1
##$ISEN= 128
##$LB= 0
##$LEV0= 0
##$LPBIN= 0
##$MAXI= 10000
##$MC2= 0
##$MEAN= 0
##$ME_mod= 0
##$MI= 0
##$NCOEF= 0
##$NC_proc= -8
##$NLEV= 6
##$NOISF1= 0
##$NOISF2= 0
##$NSP= 0
##$NTH_PI= 0
##$NZP= 0
##$OFFSET= 14.98509
##$PC= 1
##$PHC0= 94.47144
##$PHC1= 0
##$PH_mod= 1
##$PKNL= yes
##$PPARMOD= 0
##$PPDIAG= 0
##$PPIPTYP= 0
##$PPMPNUM= 2147483647
##$PPRESOL= 1
##$PSCAL= 4
##$PSIGN= 0
##$PYNMP= <proc.py>
##$REVERSE= no
##$SF= 400.02
##$SI= 32768
##$SIGF1= 0
##$SIGF2= 0
##$SINO= 400
##$SIOLD= 32768
##$SPECTYP= <>
##$SREGLST= <1H.CDCl3>
##$SSB= 0
##$STSI= 32768
##$STSR= 0
##$SW_p= 8223.68421052631
##$SYMM= 0
##$S_DEV= 0
##$TDeff= 65536
##$TDoff= 0
##$TI= <>
##$TILT= no
##$TM1= 0
##$TM2= 0
##$TOPLEV= 0
##$USERP1= <user>
##$USERP2= <user>
##$USERP3= <user>
##$USERP4= <user>
##$USERP5= <user>
##$WDW= 1
##$XDIM= 32768
##$YMAX_p= 463868015
##$YMIN_p= -767204
##$CURPLOT= <Network HP LaserJet P1505>
##$CURPRIN= <$Network HP LaserJet P1505>
##$DFORMAT= <normdp>
##$LAYOUT= <+/1D_H.xwp>
##$LFORMAT= <normlp>
##$PFORMAT= <normpl>
##$SURQMSG= 1
$$ End of Bruker specific parameters
$$ ---------------------------------
##NTUPLES= NMR SPECTRUM
##VAR_NAME=  FREQUENCY,     SPECTRUM/REAL,   SPECTRUM/IMAG
##SYMBOL=    X,             R,               I
##VAR_TYPE=  INDEPENDENT,   DEPENDENT,       DEPENDENT
##VAR_FORM=  AFFN,          ASDF,            ASDF
##VAR_DIM=   32768,         32768,           32768
##UNITS=     HZ,            ARBITRARY UNITS, ARBITRARY UNITS
##FACTOR=    0.250966925370066, 1,           1
##FIRST=     8223.43324360094, -6937,        -35934
##LAST=      0,             238929,          -16963
##MIN=       0,             -767204,         0
##MAX=       8223.43324360094, 463868015,    0
$$ Real data points
##PAGE= N=1
##DATA TABLE= (X++(R..R)), XYDATA
$$ [...]
19543b91419C72819a16402p3598F5992K6608K568a66343A1656c9117C26478b8592
19531h8350i872l7071h803C39967p6099c55351F2532A318d41524g3988k24172
19520b98160J00250j9297G0349i5223K5102E1206d8911G6226q556K5131K88028
19509C80829b50418c0256A83975G0048a58895A3475a76087l3509g0992j13920
19499a84912A12655e2469k66370k67593K32525h1908A49906a11945j44549J13979
19489a42515A41343i7144c422k37132A04136l8275b21476a8194p4124j34409Q1218
19478a45509p922A03505b58644B61672a86784A92079l252n4689a04810A9029d17129
19466a04494m8449j39303a07908g190j96954C5140b1885A14940l2256a61469N3216
$$ plain form
19543 -291419 372819 -116402 -190000 65992 92600 95168 -166343 11656 -39117 326478 -28592
19531 -88350 -9872 -46943 -8803 339967 263868 -355351 62532 1318 -441524 -73988 -298160
19520 -298160 -197910 -217207 70349 -95223 -70121 51206 -48911 76226 67670 92801 380829
19509 380829 -250418 -30256 183975 70048 -158895 13475 -176087 -209596 -70992 -184912
19499 -184912 112655 -52469 -318839 -586432 -353907 -81908 149906 -111945 -256494 -142515
19489 -142515 141343 -97144 -3422 -240554 104136 65861 -221476 -18194 -92318 -226727 -145509
19478 -145509 -153431 103505 -258644 261672 -186784 192079 188827 134138 -104810 19029 -417129
19466 -104494 -152943 -292246 -107908 -7190 -204144 35140 -21885 114940 82684 -161469 -108253
19455a08253P312D9484b39274J11353d8497l83224a63976P5569j75815C31823
19444B35488a97408P4973a4864B28464b9039k07801a06677k20888a55742k56137
19434d11879a36242D5632c609B16889b08093A78816a66166a1070m1493n5071D1187
19422d85949K24508i2971B24666i0398I7207h3693j42728B11596J07644A54046
19411b14354a05291p3287j57865e69o5841m6462j12198f6362K0860j54900e0606
19399A14740a99205h536k397q5751F276P6219a42170k03347B5499b26745j1073
19388b37818A36526F1554K12293G5776b45940a6126n9420C6344O3699j1832B9535
19376G3881b35716R9481L2939A0016O5339d9620k30793A37729D3606c31879e053
$$ plain form
19455 -108253 -100941 49484 -239274 -127921 -48497 -431721 -163976 -88407 -264222 331823
19444 235488 -197408 -122435 -14864 228464 -29039 -236840 -106677 -327565 -155742 -411879
19434 -411879 -136242 45632 -3609 216889 -208093 178816 -166166 -11070 -52563 -107634 41187
19422 -485949 -261441 -92971 224666 -90398 97207 -83693 -226421 211596 319240 154046
19411 -214354 -105291 -178578 -336443 -569 -66410 -112872 -225070 -66362 -45502 -200402 -50606
19399 114740 -199205 -8536 -10933 -96684 6276 82495 -142170 -345517 25499 -226745 -237818
19388 -237818 136526 61554 273847 75776 -245940 -16126 -75546 36344 100043 88211 29535
19376 73881 -235716 -136235 -103296 10016 75355 -49620 -280413 137729 43606 -331879 -5053
19364A3007d3301k6951F1960a02832j47885L173f7401R430l0019G1354a82455
19352c10917a52435n3496h2217Q88Q57b7801j8981n298j22411A44431a66761O1572
19340a05189l23006L5789g7608m8551B42694I0800a60883B24652a70453J1011
19330a59442o8475a01598H3351g6983C2906a26530B449J23404B0157b00345C06306
19318f7450I6344a33801A52118O96B659J54338c2432E3361Q2795c34508J28271
19307b06237j12838H8908a87926n3065A05096B773f0377n56193D4081c9004j93961
19296b32965k9198C27834f9828p77A49023b7743B94352A14940l9793A3681d4435
19284a69615O2804A25648c76364J50488A6797a4303j10712e6856q3026j10288
$$ plain form
19364 13007 -43301 -70252 61960 -102832 -250717 -247544 -67401 -57971 -87990 71354 -182455
19352 -310917 -152435 -205931 -82217 -81329 -80472 -27801 -46782 -52080 -174491 144431 -166761 -105189
19340 -105189 -428195 -392406 -77608 -126159 242694 90800 -160883 224652 -170453 -159442
19330 -159442 -227917 -101598 83351 -76983 32906 -126530 2449 125853 20157 -200345 306306
19318 -67450 96344 -133801 152118 152814 2659 156997 -32432 53361 136156 -334508 -206237
19307 -206237 -319075 88908 -187926 -240991 105096 2773 -60377 -616570 44081 -39004 -232965
19296 -232965 -262163 327834 -69828 -70605 149023 -27743 294352 114940 75147 13681 -44435
19284 -169615 -106811 125648 -376364 -225876 16797 -14303 -125015 -56856 -139882 -250170
19274b50170k42807A9850a28400N9151A80205h6060o9194A9777a45632A13828
19263b21953A79681l9046D9123R7497b72420b5404o5182A26632a63332g6126D6037
19251c67557J80250k5291a03538j45173a06G7109g2421F2773a38765e9454j15840
19240a75294f0899l23770a33181J3489A3615J19376a69459I7500e5396j90188
19230b45584i3121j09892Q6720C5782a53227B1619J74820a07091l81798H0970
19219h765j75492C5017Q499a75226f7201J7210q2725c0624j83362c8794J4025
19208b4769j13442E5837J15530K6640a87026g3172F3210d19259d4375j56182B48848
19196a4074r4638j89839L1842J25308D784e1713E8400f7271A15890b76894e5960
$$ plain form
19274 -250170 -492977 19850 -128400 -69249 180205 -86060 -155254 19777 -145632 113828
19263 -221953 179681 140635 49123 146620 -272420 -25404 -90586 126632 -163332 -76126 46037
19251 -367557 -187307 -212598 -103538 -248711 -106 77109 -72421 62773 -138765 -59454 -175294
19240 -175294 -60899 -384669 -133181 -119692 13615 132991 -169459 97500 -55396 -245584
19230 -245584 -93121 -203013 -116293 35782 -153227 21619 196439 -107091 -488889 80970
19219 -8765 -184257 35017 43516 -175226 -67201 -49991 -132716 -30624 -213986 -38794 -24769
19208 -24769 -138211 55837 171367 198007 -187026 -73172 63210 -419259 -44375 -200557 248848
19196 -14074 -108712 -298551 -266709 -141401 4784 -51713 58400 -67271 115890 -276894 -55960
19184b75986P1078f5866j19685N0287G1599a53394j81472A17072a60683r2481
19174b53164j08736a35929O2785j55866B94998d3996G4836a55668f5439A28196
19163A13714c20597g9188j23494k14394g2087j10905b9985B12369N9534a27755
19152f3171B14166L8212d4748J1913B8946a61128O006J8343b0738j53043j66401
19141c40182A27968a32064j61584h1938A36264f9879B15494b32596A60441c27487
19130a4452k26979b2650C1086g3339j96101d6934I6580c76459A24477K05544a45656
19118B34059b96043j4237a0697B11271A01357a96709C03865c37483a7757L75l09287
19107c26669D4521R8841J14910H7741i5015A72718b47492d3021G5064r991c2329
$$ plain form
19184 -275986 -204908 -65866 -185551 -135264 71599 -153394 -334866 117072 -160683 -253164
19174 -253164 -361900 -135929 -73144 -229010 294998 -43996 74836 -155668 -65439 128196
19163 113714 -320597 -79188 -202682 -417076 -72087 -182992 -29985 212369 271903 -127755
19152 -63171 214166 252378 -44748 -32835 28946 -161128 -155122 -136779 -20738 -173781 -340182
19141 -340182 127968 -132064 -293648 -81938 136264 -69879 215494 -232596 160441 -327487
19130 -14452 -241431 -22650 31086 -73339 -269440 -46934 96580 -376459 124477 330021 -145656
19118 234059 -296043 -310280 -10697 211271 101357 -196709 303865 -337483 -17757 -17382 -326669
19107 -326669 44521 143362 258272 87741 -95015 172718 -247492 -43021 75064 65073 -32329
19095a72572L2454n3736a9607G7416a70742k33289M6427F0082j7468d6607p2087
19084a18694E5502i3212B0475P7550B1680Q0401l1987K85518a69694a2263E9014
19072G9378d2167A09560b2631p4025n9594A01798a2760B30635q9109a05450N0739
19061e4711F1515k6526b40255j63602F9023b34061k324Q4226p2630j53887A44929
19049D7723f6800p1030G8188b25890N629h8481j69685f8053j13376P5549c2826
19037B57678j07300b3005q4715M9680k51841a8340E19570k23832B6971J173l285
19026B4859b1016l2209B12339h1342j1916q516K1381A67459a31128O1469A59529
19014c12564H1385f3693b9582A54515e390D3124J81624D0389c29149j78120A4
$$ plain form
19095 -172572 -140118 -193854 -19607 77416 -170742 -404031 -357604 60082 42614 -46607 -118694
19084 -118694 55502 -93212 20475 98025 21680 102081 70094 355612 -169694 -12263 59014
19072 79378 -42167 109560 -22631 -96656 -156250 101798 -12760 230635 141526 -105450 -54711
19061 -54711 61515 34989 -240255 -403857 69023 -234061 -236385 -152159 -224789 -378676 144929
19049 47723 -66800 -137830 78188 -225890 -220261 -88481 -258166 -68053 -181429 -105880 -32826
19037 257678 150378 -23005 -107720 -58040 -309881 -18340 519570 295738 26971 28144 24859
19026 24859 -21016 -53225 212339 -81342 -93258 -101774 -80393 167459 -131128 -69659 159529
19014 -312564 81385 -63693 -29582 154515 -5390 43124 224748 40389 -329149 -507269 14
19002c49193B25385a9001j84297Q6595B0585g8574J7143k12659G0780R8982F3137
18990A32761a20772m1367j05091D9736K19266c83469a13495G7334e4139k07925
18980b62064B00130C5658a29791B035e4879D324a25833A75010g3383B99658a19184
18968B09386d293B71476m1369c32084a64964P3278A16046b92245a15196C10821
18957a81428H761a57635j98634A34258a32524j12090A86336b50574A02528L0307
18947A32835E4181a22602j50692B0315K5641J28066J8395f9916A7573J31220A8025
18935A97009N1984A5447J44076b03867O4818A22116b23146B4143b41393B91538
18924A31415D1558J45956E1003b67361J4136c2631O134C113L16082A57797c1063
$$ plain form
19002 -349193 225385 -19001 -203298 -116703 20585 -78574 -61431 -274090 70780 169762 63137
18990 132761 -120772 -162139 -267230 49736 269002 -383469 -113495 77334 -54139 -262064
18980 -262064 200130 35658 -129791 2035 -54879 4324 -125833 175010 -73383 299658 -119184
18968 209386 -4293 271476 230107 -332084 -164964 -91686 116046 -292245 -115196 310821
18957 -181428 8761 -157635 -356269 134258 -132524 -244614 186336 -250574 102528 132835
18947 132835 54181 -122602 -273294 20315 45956 174022 192417 -69916 17573 148793 18025
18935 197009 248993 15447 159523 -203867 -139049 122116 -223146 24143 -241393 291538
18924 131415 41558 187514 51003 -267361 -253225 -32631 -26497 3113 319195 157797 -31063
18912a35874B58746d7143k66635N5591A81108F1153i0004j46583Q1874D0753a16506
18900a52054H19M5134b02484j15089J10088A46687I302a90689R5081b3234i277
18888c30257e4640p9017m8846l1310c0112m08753J27154P3226i1005c3317A60245
18876A00995e7891k42187n5929A38844b04804d7941o8438k0916B72656k5794H8111
18864a65917r5801A7571a25330q2783A73641a39617A29236c46824a51444F4989
18853A83250a3803j02606q4328I7295a35080O7099C07637d6566B10089I5179b32615
18841A68943e7798A56388c87816J75559d7325r8559B3598J65073g9414j66017
18831b45431a8214A64471i6597r3822c4428B64540e4816p9912f464B39665f2517
$$ plain form
18912 -135874 258746 -47143 -313778 -258187 181108 61153 -90004 -236587 -154713 40753 -116506
18900 -152054 819 45953 -202484 -317573 -207485 146687 9302 -190689 -95608 -23234 -9277
18888 -330257 -54640 -133657 -182503 -213813 -30112 -438865 -311711 -238485 -91005 -33317 160245
18876 100995 -57891 -300078 -356007 138844 -204804 -47941 -116379 -137295 272656 246862 88111
18864 -165917 -261718 17571 -125330 -208113 173641 -139617 129236 -346824 -151444 64989
18853 183250 -13803 -116409 -200737 97295 -135080 -67981 307637 -46566 210089 95179 -232615
18841 168943 -57798 156388 -387816 -212257 -47325 -145884 23598 188671 -79414 -245431
18831 -245431 -18214 164471 -96597 -190419 -34428 264540 -54816 -134728 -6464 239665 -62517
18819A70294C9041a54621C1858K63995B0809J04848J21496a65142A42711i7100
18808B47925m3356h1578E17852c48377a05302k65181i3814E595J86032c402j56155
18797a59557H4115b07950J6728B77635r3987a69694A5677b26042G616J58714b39881
18785a83833N5956p6137A95247c82237a7789k09630B6393K94671c47123J22578
18775b24545d2148H1466b69288i5503N625j99734B59977E3353c10519C4832J55370
18764A90202d7472j2057A22184b72636A98596c25005A67611b41853M2816a0466
18753i7777k8249F9143b36805C05233a47748j13722d8969J2847A76133B7596R0464
18742A18060c1946d520j36544k25968g8278j07461j38270f3275l9635d2886l0052
$$ plain form
18819 170294 39041 -154621 31858 295853 20809 125657 247153 -165142 142711 -97100
18808 247925 204569 -81578 517852 -348377 -105302 -370483 -93814 5595 191627 -3402 -159557
18797 -159557 84115 -207950 -191222 277635 183648 -169694 15677 -226042 7616 166330 -239881
18785 -183833 -127877 -204014 195247 -382237 -17789 -227419 26393 321064 -347123 -224545
18775 -224545 -42148 81466 -269288 -95503 -89878 -289612 259977 53353 -310519 34832 190202
18764 190202 -47472 -59529 122184 -272636 198596 -325005 167611 -241853 -199037 -10466
18753 -97777 -126026 69143 -236805 305233 -147748 -261470 -48969 -36122 176133 27596 118060
18742 118060 -31946 -4520 -141064 -367032 -78278 -185739 -324009 -63275 -102910 -42886 -72938
18731g2938c3235B4685d74541A96341a9654A0665a65032k30695A07682K4511d17214
18719a34752j83363a28312k22064J65409a2852k6313e786k70441H9702A4805b01019
18707a23736e6745M343B81193b74184b9230E5953f7573E6796b43009G9851a34594
18695I164c39486A74174b17801C592P583N2973J8163a92066B6045J67533c9549
18683B3258L3310a29767K716j88584l6233B13820D5560J08742a8422r1756A90300
18671d22938I8593b9496F3438j3110P6709f1598i013j87908A0819D459b45255
18659a68844b1282B5387c59276B75179a24661l1232q1065G593P9375d5609D4337
18647h6068J2906B11851i1398j45561B23824Q1279D8867c46423c0943G9101a58529
$$ plain form
18731 -72938 -33235 24685 -474541 196341 -19654 10665 -165032 -395727 107682 132193 -417214
18719 -134752 -318115 -128312 -350376 -184967 -12852 -39165 -5786 -276227 89702 14805 -201019
18707 -123736 -56745 -52402 281193 -274184 -29230 55953 -67573 56796 -243009 79851 -134594
18695 9164 -339486 174174 -217801 3592 11175 64148 82311 -192066 26045 193578 -39549
18683 23258 56568 -129767 -127051 -315635 -351868 213820 45560 154302 -18422 -110178 190300
18671 -422938 98593 -29496 63438 50328 127037 -61598 -9013 -196921 10819 4459 -245255
18659 -168844 -21282 25387 -359276 275179 -124661 -155893 -236958 7593 86968 -45609 44337
18647 -86068 -73162 211851 -91398 -236959 223824 305103 48867 -346423 -30943 79101 -158529
18635a97823k93926b05449P0174l3074n9367C931J38954a6144o2142L8814J0491
18624b8981C4713d7813j25852k56833h1231L358J7490l8326B749i87A57070a50323
18611B5567a67449j6796A4887c18741A33319m6527b97345A0155J09781E115h5721
18599I0332e8995G2344A9855c83848J48907A0012K24993d19244B24706h4519r1834
18588a76353I8740h9184A99836M186a2697k42736j44895A2432b0798A03696d69354
18576b28489J00328H1434g0302j78339G4001f18481B48386i8533k32040a31527
18565a31261F0023d06369A73057L25654E3995d5376m51j85699e7332j38091B0875
18553a93335K37H7633l0333b2049n43139A39405C3205d00659a8633A00196c89848
$$ plain form
18635 -197823 -491749 -205449 -135275 -168349 -227716 3931 142885 -16144 -78286 -39472 -28981
18624 -28981 34713 -47813 -173665 -430498 -81231 -77873 -60383 -98709 2749 -987 157070 -150323
18611 25567 -167449 -184245 14887 -318741 133319 86792 -297345 10155 119936 5115 -85721
18599 90332 -58995 72344 19855 -383848 -234941 10012 235005 -419244 224706 -84519 -176353
18588 -176353 98740 -89184 199836 204022 -12697 -255433 -400328 12432 -20798 103696 -469354
18576 -228489 -128161 81434 -70302 -248641 74001 -618481 248386 -98533 -330573 -131527
18565 -131261 60023 -406369 173057 498711 53995 -45376 -45827 -231526 -57332 -195423 20875
18553 -193335 -193098 87633 57300 -22049 -565188 139405 33205 -400659 -18633 100196 -389848
18541D2067h4443q3360I0889a88701G1064J41261b82443b8568k7432F1944J09672
18530A71616o5850f9833j02769A49416F8628a52402b4498o5955j45837B28510
18519B47342h0198F6671b43440R6007C28700B6708a7197j19321F5535A35J67781
18508A67916C9860b02841F9622J06130h851r726J816j10685m6346O9885e354k38560
18496b43914a15368n0690j79066f0622j1602B4390J94597O105e7628k9741j41808
18485b29177b1488j09967k3705b4406d203D0020c72495D6812b66001a05124n616
18474a10740A10681a88850A00548f2157D2488b11668A86363A3865m23a07781C26369
18462B6045k254a37158q5473A1180b9011J1695k89964i9407L474m708b8185k36951
$$ plain form
18541 42067 -84443 -167803 90889 -188701 71064 212325 -282443 -28568 -56000 61944 171616
18530 171616 105766 -69833 -172602 149416 68628 -152402 -24498 -90453 -236290 228510
18519 247342 -80198 66671 -243440 -147433 328700 26708 -17197 -136518 65535 135 167916
18508 167916 39860 -202841 69622 175752 -8851 -18577 -16761 -127446 -173792 -103907 -5354 -243914
18496 -243914 -115368 -166058 -345124 -60622 -72224 24390 218987 225092 -57628 -87369 -229177
18485 -229177 -21488 -131455 -155160 -24406 -4203 40020 -372495 46812 -266001 -105124 -110740
18474 -110740 110681 -188850 100548 -62157 42488 -211668 186363 13865 13442 -107781 326369
18462 26045 23791 -137158 -222631 11180 -29011 -17316 -307280 -99407 -95933 -100641 -28185 -265136
18450b65136B0729R7732f1627k48875a36940A59599I211a45665l04440a58587
18439a85863F0647q236g4640j05149a1138A65442F2785b35632P2996A27419a03270
18427d6938k05170q7550B77939F1649a15131j8339O6557B63547o7737B4882a55439
18415b8588j21155B59436E3724J3403a80826k9609g5868b6420j4993A8394L9083
18404E7477d56063E12450A39525a48157j06939J24107a2139k31275c2404H4224
18393B66502c80908C8376j3706c20084a25765c1433j05887A45794c55508A16377
18382A17789e5502j48691A5487b34555O3434I7220b02683D3305e2173j8983A1018
18370b62170j77805B78081h3285k0228H5232B5245N3558a93189e9318j02114B11322
$$ plain form
18450 -265136 20729 118461 -61627 -310502 -136940 159599 9211 -145665 -450105 -158587
18439 -185863 60647 52411 -74640 -179789 -11138 165442 62785 -235632 -162636 127419 -103270
18427 -46938 -252108 -339658 277939 61649 -115131 -133470 -66913 263547 195810 24882 -155439
18415 -28588 -149743 259436 53724 67127 -180826 -210435 -75868 -26420 -41413 18394 57477
18404 57477 -456063 512450 139525 -148157 -255096 -130989 -12139 -243414 -32404 84224
18393 266502 -380908 38376 24670 -320084 -125765 -31433 -137320 145794 -355508 116377
18382 117789 -55502 -204193 15487 -234555 -171121 97220 -202683 43305 -52173 -71156 11018
18370 -262170 -439975 278081 -83285 -103513 85232 25245 78803 -193189 -59318 -161432 211322
18358f7356j16433j21500h9011b996k27522K067A62811l2139E6710Q9064m8957
18347I6817b8365l53443a76139B44084a0406k47311C52417D9961a36076d5971
18336A33303n6666E412J53402G2905a62560I9215l9265d3071A49968L6177j1292
18325A74853b76347A57460a94587a69A92297h9371A07313P6423b55774J1230h0782
18313c35671a16344E4724J79462k2825H2566b4430j27110N5535K2679G0862J10522
18302A81384A4129d88965a88851I1471l9267B066R2612a25785K9279r2402B0881
18290b45752J08032A63352e2695j66518D6263K8274b62741R9221B18283f8642
18279c64888B07157d3639H862P1135i2043B43780c8596D3405c22153E2626b8565
$$ plain form
18358 -67356 -183789 -305289 -89011 -2996 -230518 -228451 162811 130672 56710 145774 96817
18347 96817 -28365 -381808 -176139 244084 -10406 -257717 352417 49961 -136076 -45971
18336 133303 76637 5412 158814 72905 -162560 99215 59950 -43071 149968 186145 174853
18325 174853 -276347 157460 -194587 -169 192297 -89371 107313 183736 -255774 -244544 -80782
18313 -335671 -116344 54724 234186 211361 82566 -24430 -151540 -96005 -73326 70862 181384
18302 181384 14129 -488965 -188851 91471 52204 2066 94678 -125785 -96506 -188908 20881
18290 -245752 -137720 163352 -52695 -219213 46263 74537 -262741 -163520 218283 -68642
18279 -364888 207157 -43639 8862 79997 -92043 243780 -38596 43405 -322153 52626 -28565
18267a2891j15242M1287l5059I4051b23962A14831J98b87681b7635B8620d4485
18255I6828i0266k4094A22213a15271b2604k96766A75969a41536A96128c5558
18244a41806e3325N703B97898e9735r5977j05130g0747A72538G7834a08451r0837
18233a99288g7142F2582a86037L8460D4896G435R9560c25007h3558A00390b25146
18221b29874K4675j17789K2393f5612A50858a09769j5494E5003g4500B7621K8233
18210E5854j6510a12759d2139I567a53779C3192b94128E1611a21584N9059A29949
18198b22339p1361A3533i9795I9418j3627c05822b0922j49406K3368F3705a12355
18186i9409k79247E742d8745B12276G3707a49251A57949c32886C61310b2776j3449
$$ plain form
18267 -12891 -128133 -86846 -121905 94051 -223962 114831 115029 -287681 -27635 28620 -44485
18255 96828 -90266 -114360 122213 -115271 -22604 -319370 175969 -141536 196128 -35558
18244 -141806 -53325 -47622 297898 -59735 -155712 -260842 -70747 172538 77834 -108451 -199288
18233 -199288 -77142 62582 -186037 -147577 44896 7435 106995 -325007 -83558 100390 -225146
18221 -229874 -205199 -322988 -300595 -65612 150858 -109769 -125263 55003 -74500 27621 55854
18210 55854 39344 -112759 -42139 9567 -153779 33192 -294128 51611 -121584 -62525 129949
18198 -222339 -293700 13533 -99795 99418 85791 -305822 -20922 -170328 -146960 63705 -112355
18186 -99409 -378656 5742 -48745 212276 73707 -149251 157949 -332886 361310 -22776 -36225
18175c6225j90762j82327C86b45513h5512j72017h1928I1901K1377i3141A33784
18163g0293f731r4108a6465k1827L426k09858j79104C33608d43971J29536j33065
18152d47500R3435a47949B7919h2801q1420l26379i4246A52272A7131c7800D272
18140a67350I7137c64951G0344b50397g1191F3316a56536N2173C27921b47292
18129g0668r4277k05853B44163a77901H0561b2598I9849c2883j84374B68447a35618
18117a08880j11542B2834c76893e359A86737b77252p4621e7566k54539R2877D6908
18105d8386F0926L2451K39564A26036B9316c544A11135J41495m4260a14620B12538
18093B04249r7895a10124B83696F8044d4694C10391K5015j65483A237h7161B69994
$$ plain form
18175 -36225 -226987 -409314 386 -245513 -85512 -257529 -81928 91901 113278 -93141 133784
18163 -70293 -6731 -100839 -16465 -38292 -34866 -244724 -423828 333608 -443971 -314435 -447500
18152 -447500 -354065 -147949 27919 -82801 -164221 -490600 -94246 152272 17131 -37800 4272
18140 -167350 97137 -364951 70344 -250397 -71191 63316 -156536 -104363 327921 -247292
18129 -70668 -164945 -370798 244163 -177901 80561 -22598 99849 -32883 -217257 268447 -135618
18117 -108880 -220422 22834 -376893 -5359 186737 -277252 -351873 -57566 -312105 -219228 46908
18105 -48386 60926 93377 332941 126036 29316 -3544 111135 252630 208370 -114620 212538
18093 204249 106354 -110124 283696 68044 -44694 310391 335406 169923 1237 -87161 269994
18081A13704c94892a88362B03701a30462J3288j03853J7615B5398b5647C9965
18070a5262A95232c02750e0669R161j24426k76498I4634a03277C22764j05012
18060B17752b40479d3994G3860a26400A66459a43361g876j1714A2266J95161r8385
18049A09042K02908a09303B43079b22306c4383n5816F9423e1794l0038A59259
18038B3662L45020a1005A61839L3732a80200C7938j0896J29801c0578j13239m2077
18027a85894d3312q9439B01416a91507a3757A68652a89506A02729H109L3943J79041
18016B21093i3288B4677a34322f0817B90566b27104h8679C7288R1576M222o4163
18005F8923J77509H2525g6285B72161j28800j5684d231l1922k29667d1391m8526
$$ plain form
18081 113704 -394892 -188362 203701 -130462 -117174 -221027 -203412 25398 -25647 39965
18070 -15262 195232 -302750 -50669 -41508 -165934 -442432 94634 -103277 322764 217752
18060 217752 -240479 -43994 73860 -126400 166459 -143361 -7876 -19590 12266 207427 109042
18049 109042 311950 -109303 243079 -222306 -34383 -90199 69423 -51794 -81832 159259
18038 23662 368682 -11005 161839 195571 -180200 37938 27042 156843 -30578 -143817 -185894
18027 -185894 -43312 -132751 201416 -191507 -13757 168652 -189506 102729 8109 42052 221093
18016 221093 -93288 24677 -134322 -60817 290566 -227104 -88679 37288 128864 133086 68923
18005 68923 246432 82525 -76285 272161 143361 127677 -4231 -36153 -265820 -41391 -89917
17994h9917b198j22133j00478L274c1532r7558E9699f2688p1431A43162c51154
17982B05179a47100E1562J69790A8091a95550B9373i7669k39705b4645j8492j19897
17971a63034k77601I8439G534Q827g8320A48955K02469A64109F8266a64630B3254
17959A31784J70631a56643G8323d7077o0381L8912m9918k38904a02689B24323
17948A1781J65498p0700c25770o3380a31723b3352j94515G7407O9774f2760j80848
17937b43608O4304P339l2282R4923d0908B4194i2417j62079a9126m1752B92122
17925i129A02447a70670G3905a17370j00930P0290B74363A10870b87291j66830
17915d54121i634F8686j0522a12500B4126L59609c15773I4552c1798E7369a21356
$$ plain form
17994 -89917 -2198 -124331 -224809 -221535 -31532 -129090 59699 -62688 -134119 143162 -351154
17982 205179 -147100 51562 221352 18091 -195550 29373 -97669 -337374 -24645 -43137 -163034
17971 -163034 -440635 98439 7534 16361 -78320 148955 351424 164109 68266 -164630 23254
17959 131784 302415 -156643 78323 -47077 -107458 -68546 -118464 -357368 -102689 224323
17948 11781 177279 106579 -325770 -389150 -131723 -23352 -217867 77407 147181 -62760 -243608
17937 -243608 -179304 -171965 -204247 -109324 -40908 24194 -92417 -254496 -19126 -60878 292122
17925 -9129 102447 -170670 73905 -117370 -218300 -148010 274363 110870 -287291 -454121
17915 -454121 -9634 68686 58164 -112500 24126 383735 -315773 94552 -31798 57369 -121356
17903d5644G5122N6967L86066C4428c4916B25691a48927A3133a19322k08055B62932
17891e6787k98909B14139K6941b45679I5033K4501L9409O6984a81725A15038O7434
17880A82472a55484e7353A81427i509A17744j8909h15H0445a45909c00C0266b73785
17867B913J29130N386b77988p1568C7614d79053h2084B960K75902H770N7694a18214
17854a30629q6834d3325F9749i2632A4573J05287b30104L6753j1043C30720g8464
17842B32338A10987K32238g286B52620d4699k864j63609Q0188a3247A58737M712
17831A63449d52j70888C29317h5199A42236b13400g0937G8372H359i7106B21626
17819b0259q4095a4833j72410E6508a12428A1790J17826d7955a64p5868p4319
$$ plain form
17903 -45644 75122 132089 518155 34428 -34916 225691 -148927 13133 -119322 -327377 262932
17891 -56787 -355696 214139 241080 -245679 95033 119534 158943 225927 -181725 115038 182472
17880 182472 -155484 -57353 181427 -9509 117744 98835 -815 80445 -145909 -300 30266 -273785
17867 2913 132043 137429 -277988 -349556 37614 -479053 -82084 2960 278862 8770 66464 -118214
17854 -130629 -217463 -43325 69749 -92632 14573 119860 -230104 -193351 -204394 330720 -78464
17842 232338 110987 343225 -7286 252620 -44699 -47563 -211172 -130984 -13247 158737 163449
17831 163449 -452 -171340 329317 -85199 142236 -213400 -70937 78372 8359 -97106 221626
17819 -20259 -104354 -14833 -187243 56508 -112428 11790 129616 -47955 -164 -76032 -150351
17808a50351K7064a2695D338J63934b10117p422A78725a2611G3444g581k58254
17797b65835a9326k50489C22538e2004G1253R6681G2283N4817a97622e9147k21101
17786b80248B1a16140A96641D546c16308R9599j09176J17191j06485M0315G1908
17774d8127b1792B49211O8737g9917B61754D5041N1714J21284p4069J1217a6650
17762a7283l48897B2274J66915A7008c42914i977A55618a444C4063i7902k4490
17751a22392A24926L7405m846c1124C15090h7767B80548j32409Q0854a45388B72929
17739b24741A21582Q417e3439a203A7728b23238B13021b41177F4519J16748h2968
17727D8695c72135A05452c66939f8420B73770I6686K599c70891a36701A81707
$$ plain form
17808 -150351 -123287 -12695 4338 168272 -210117 -217539 178725 -12611 73444 -7581 -265835
17797 -265835 -19326 -269815 322538 -52004 71253 167934 72283 127100 -197622 -59147 -280248
17786 -280248 21 -116140 196641 4546 -316308 -216709 -325885 -208694 -315179 -274864 71908
17774 -48127 -21792 249211 317948 -79917 261754 45041 96755 218039 143970 155187 -16650
17762 -17283 -366180 22274 189189 17008 -342914 -9977 155618 -1444 34063 -97902 -122392
17751 -122392 124926 162331 157485 -31124 315090 -87767 280548 148139 228993 -145388 272929
17739 -224741 121582 129999 -53439 -1203 17728 -223238 213021 -241177 64519 181267 -82968
17727 48695 -372135 105452 -366939 -68420 273770 96686 99285 -370891 -136701 181707
17716g3977B55398C9982q303g9219E2555J43675d6851B86940C160L85070A85262
17704b9052j55841I3559e664A66055a27035A71971E2512J76947F9177G092L13343
17693C20435C3204e1972b1672D91266a17007i297j59519B24394f6528B4249J26784
17682A51033a80545B60699a43848A55751J8661j3468b84189B37005B6544a15968
17671g7817G1239a10872C2252a4965A5631b346H6789J71323b07374e0100m3730
17660i3830B87584b0089A62777E9298b41790a6921A73552E7506M53744a74587
17649H0326J03198a23947A97433G087L46923a93404A57467b48172B24339G819
17638a58007C18474g3677A25894g2072E6101J18776b29B44439d0584A30271J6112
$$ plain form
17716 -73977 255398 39982 31679 -79219 52555 196230 -46851 286940 3160 388230 185262
17704 -29052 -184893 93559 -5664 166055 -127035 171971 52512 229459 69177 7092 320435
17693 320435 33204 -51972 -21672 491266 -117007 -9297 -168816 224394 -66528 24249 151033
17682 151033 -180545 260699 -143848 155751 174412 160944 -284189 237005 26544 -115968
17671 -77817 71239 -110872 32252 -14965 15631 -2346 86789 258112 -207374 -50100 -93830
17660 -93830 287584 -20089 162777 59298 -241790 -16921 173552 57506 511250 -174587
17649 80326 183524 -123947 197433 7087 354010 -193404 157467 -248172 224339 7819
17638 -158007 318474 -73677 125894 -72072 56101 174877 -229 244439 -40584 130271 146383
17627A46383j9709L3252E7804K45099a34081L9167p0555A7317M5016d56391B75078
17615B03012L7591D8737k3966J34985a22324B71065j06567J7575J947C3656J01370
17604A35026j327J86532e0591q3566m3001H8269i0494G5027d2340A39334a76439
17592f0634b209H4749A7717b53766C19556a39733A55109e5854C34092A26111e2547
17580I1453d1565r4248E0441a23713e6885q3405I0368b1899A7176b957j36696
17569a39653A63275p4149b10225b72A03515k515K25381C2324J96604L6967A17471
17557I2988J37061A1152f6513A21672c2348l56134F0039K46465d2037k79940A78557
17545b21519e3122E2937M3985J6596J77396R9829C0141O6574J5530a79868K1960
$$ plain form
17627 146383 126674 159926 57804 302903 -134081 -94914 -165469 17317 62333 -456391 275078
17615 203012 240603 48737 24771 159756 -122324 271065 164498 182073 184020 33656 135026
17604 135026 133699 320231 -50591 -134157 -177158 88269 -90494 75027 -42340 139334 -176439
17592 -60634 -2209 84749 17717 -253766 319556 -139733 155109 -55854 334092 126111 -52547
17580 91453 -41565 -135813 50441 -123713 -56885 -140290 90368 -21899 17176 -2957 -139653
17569 -139653 163275 89126 -210225 -272 103515 101000 326381 32324 228928 265895 117471
17557 92988 230049 11152 -66513 121672 -32348 -388482 60039 306504 -42037 -321977 178557
17545 -221519 -53122 52937 96922 113518 290914 390743 30141 96715 112245 -179868 -157908
17534a57908B41020c8713A17908c53457h399A04031L00292c93536A98296C100
17523E3923J25262i157C6366P515L7865i4184A15390r734O9954A2639J3175d1035
17510A78898J24590B9747h8309B20235b99239g9976k00323B70971H1208L1636
17500A12844Q1072a71637d3117C174M5906N8245b76439B00481f110E3456N9923
17489A13379D8532a50718A51238b20389i1534C80043c0251q776D44694F2296K88320
17478C50616a42661b0932A57992K77158A64536m1970g7268C01572p6691K8643
17468B53524H9685J23180g0290H6665h0503B16788E4401k4895K49896o4930O2343
17457B76815g8369i591o3516A47402J22101A05037J27720E8572J88144I4161J23088
$$ plain form
17534 -157908 241020 -38713 117908 -353457 -8399 104031 404323 -393536 198296 3100
17523 53923 179185 -9157 36366 43881 81746 -94184 115390 105656 175610 12639 25814 -41035
17510 178898 303488 29747 -88309 220235 -299239 -79976 -280299 270971 81208 112844
17500 112844 193916 -171637 -43117 3174 49080 107325 -276439 200481 -6110 53456 113379
17489 113379 48532 -150718 151238 -220389 -91534 380043 -30251 -39027 444694 62296 350616
17478 350616 -142661 -20932 157992 435150 164536 122566 -77268 301572 224881 253524
17468 253524 89685 212865 -70290 86665 -80503 216788 54401 29506 279402 214472 276815
17457 276815 -78369 -9591 -73107 147402 269503 105037 232757 58572 246716 94161 217249
17446B17249K7375p0948J25136l0509K2538J01365j77686K39783q7991A29182
17435B86713j06184l9391J78918J21698q5826D9832K84235a09832B77497E3774
17424C53091A07929J73804O7570q6696Q1484L3783A14615M17536a6664D51830
17413A01564N18025B22930f592A64566J40302O7038n74j81133C2756N26293j00341
17402D58708C0331K6008L37940m9136G3100P3721l5335K83727A42880N7009p5044
17391A24845K59205j15493b00229A46220J65790D8305M2288B0056a19107A88755
17380B50628a16137C918K09205q3704K89376A75987p0323K29750j43671J42763
17370C34506A61250M5179B4845K28438G3802k4725J42616M4655a94437C20905
$$ plain form
17446 217249 244624 173676 298812 268303 290841 392206 214520 454303 366312 129182
17435 286713 180529 141138 320056 441754 355928 49832 334067 -109832 277497 53774
17424 353091 107929 281733 349303 262607 344091 377874 114615 532151 -16664 451830
17413 101564 619589 222930 -6592 164566 304868 371906 371332 190199 32756 559049 458708
17402 458708 30331 56339 394279 345143 73100 146821 111486 395213 142880 199889 124845
17391 124845 384050 268557 -200229 146220 312010 48305 90593 20056 -119107 188755
17380 250628 -116137 3918 213123 129419 418795 175987 105664 335414 191743 334506
17370 334506 161250 206429 24845 253283 73802 49077 191693 236348 -194437 320905
17359C15331G6790a8358D297J53642K4012g8526H0809c2496j6457F3379O5245
17348A28624d8515I5654h4056D20732k07976m2348o6410m8879J26016d7482A20454
17336A0943P7466a03817B72499J12177b58116B44225B855J04514l132K7327a1886
17324A65908K42871H9087O0577P60J31780R635A15627l0889K3409K54259o5475
17313B96931A29553L8184c1098A05656J80314D0488c34185A97447J1371a93574
17302C62162J20326b0471j46A26022Q8410a42183G9847M5593A5275o917K46321
17291B54679P3966A47089b58160F7862K14639a31225o4182B75173f2948C05071
17280A98089J38208m8467r2094e7681D46692p2378q5333p0870p8537j7221a4626
$$ plain form
17359 315331 76790 -18358 4297 157939 181951 -78526 80809 -32496 -48953 63379 128624
17348 128624 -48515 95654 -84056 420732 212756 170408 103998 55119 181135 -47482 120454
17336 10943 88409 -103817 272499 384676 -258116 244225 2855 107369 104237 131564 -11886
17324 165908 408779 89087 149664 150424 282204 291839 115627 84738 108147 362406 296931
17313 296931 129553 167737 -31098 105656 285970 40488 -334185 197447 208818 -193574
17302 362162 482488 -20471 -20617 126022 214432 -142183 79847 125440 15275 8358 254679
17291 254679 328645 147089 -258160 67862 282501 -131225 -195407 275173 -62948 305071
17280 198089 336297 287830 195736 -57681 446692 374314 288981 218111 139574 122353 -14626
17268I8365L29777l038j69792L7143N1059g7372B94772o0339J59178A7022a03373
17256C73115J0142A83371l8235b9297d359A07244L5030J72725r3639i5835j6937
17245a12772A84142m8643a93225E37866j79949N7642A69977Q1570A05422J25094
17235B30516J25646j46946K034J32540j57788b60982A41938j7172L98513A17768
17224B08133P025J18516f3981E27035h0692I879K79022A25074O1318P2920J64587
17213D23899A75195k2074E7432J25817C8783J2090M12295j06594o3373E220L8631
17202D3851e9303C63256A75066K56322A53233K61243A84761k737K73194E4610
17191A93395P1522K8377J8856O2684A57468J70790j57901L43964q8179P6685B02808
$$ plain form
17268 98365 428142 425104 255312 292455 343514 -77372 294772 234433 393611 17022 -103373
17256 373115 383257 183371 145136 -29297 -4359 107244 142274 314999 221360 -95835 -112772
17245 -112772 184142 135499 -193225 537866 357917 415559 169977 251547 105422 230516
17235 230516 356162 209216 211250 343790 186002 -260982 141938 124766 523279 117768
17224 208133 215158 333674 -63981 527035 -80692 9879 288901 125074 186392 259312 423899
17213 423899 175195 153121 57432 183249 38783 50873 463168 356574 293201 5220 43851
17202 43851 -59303 363256 175066 431388 153233 414476 184761 182024 455218 54610
17191 193395 264917 293294 312150 374834 157468 328258 170357 514321 426142 502827 202808
17179F4589K31726J00465r2133K98474A60762K86433j39806L1472Q2016m3301
17169C77576n0093K58788k45945A60254K36091h0713A42176K71573M7716I1990
17158B84858B3761Q4591J27199l7044M1427j7301I5596J79463j11508M35431B96734
17146C14121j40349R355b0459D12068n4311j19544Q4216j8662Q38q140P7706K67825
17134F41996B72154o4461o0450J51154n9950k9991n709L94434k05371l3068j78334
17123A80408N16941l20133R7584K19813j58269N2899p2555M5328j83272J32863
17113E11607o1194J09272k53751J82451B39811J86118A40848N19932n7187r350
17103E94243B53721l9841Q9279P9267K17323j24290j61352M5062j7109j58304
$$ plain form
17179 64589 296315 396780 304647 603121 160762 447195 307389 338861 420877 377576
17169 377576 327483 586271 340326 160254 396345 -80713 142176 413749 461465 91990
17158 284858 23761 108352 235551 198507 239934 222633 95596 275059 163551 598982 296734
17146 314121 173772 183127 -20459 412068 357757 238213 322429 303767 304605 296465 374171 641996
17134 641996 272154 207693 147243 298397 238447 208456 202747 597181 391810 358742 180408
17123 180408 697349 377216 474800 694613 536344 589243 516688 562016 378744 511607
17113 511607 450413 559685 305934 488385 239811 425929 140848 660780 603593 594243
17103 594243 253721 213880 303159 382426 599749 475459 314107 359169 342060 183756
17093A83756P308Q4125J19895L15145j35301j03216j70653J7831M65184P2380
17083H56454B67178K21438L44445j88515j71002P2064k7885q1128K9387R3570
17073E59552j19715K43691k30463J96817k12737K10325k13165A83204N92715j49296
17063F26623O063k20884Q8446J76542k21198L31755l67248j38011J56033K24427
17053F62548j57221j27245J65842j9773L5868K83287k97549K89835p5767m5431
17043G14394J02551p4665l7377j11677Q8502K87338k10119o3513j28306J41026
17033G08154l2257J5823j7239l1023r8127K36498k54310R5738j18326J70948K36
17022F76115l246K55923k80765J88262k8608l01820L60188k75701B59091N99988
$$ plain form
17093 183756 191064 275189 395084 710229 574928 471712 301059 318890 784074 856454
17083 856454 267178 488616 833061 644546 473544 545608 517723 436595 465982 559552
17073 559552 439837 683528 453065 649882 437145 647470 434305 183204 775919 626623
17063 626623 632686 411802 500248 676790 455592 787347 420099 282088 438121 662548
17053 662548 505327 378082 543924 524151 560019 843306 545757 835592 759825 714394
17043 714394 816945 742280 704903 593226 681728 969066 758947 695434 567128 708154
17033 708154 675897 691720 674481 643458 545331 781829 527519 623257 504931 675879 676115
17022 676115 672869 928792 648027 836289 807681 505861 866049 590348 259091 859079
17012H59079j76052J83581j25669k15582K77961j27912N5929r8866O08662q6081
17002A155050E50869N97254j9240k01054j43436J48603k27299J57098K17259j01532
16992I78522k31956J69254k4996J29717k24761L5657o6322K84490j39681n3338
16982H56586O6063K2242k35542K42838O6292o3747P7431j13417j7329J76090m1990
16971A035517R2932j9909L3208k17454K42084r0682m0386O341k21471K44335R4926
16960A159441l6612k41800L45665k04727k2435K52146k76983J48726K03773j45694
16950A181500M2891J26804J78625l13491k80212N27845k54394L29258l16923J34267
16940A356170j12049K85768J5619k54703L5429k73935L69495k29693N1136K59250
$$ plain form
17012 859079 683027 866608 740939 525357 803318 675406 731335 632469 1241131 1155050
17002 1155050 550869 1148123 1128883 927829 784393 932996 705697 862795 1080054 978522
16992 978522 746566 915820 890824 1020541 795780 831437 765115 1049605 909924 856586
16982 856586 922649 944891 709349 952187 1018479 954732 1032163 918746 901417 1077507 1035517
16971 1035517 1128449 1108540 1141748 924294 1166378 1075696 1035310 1041651 820180 1064515 1159441
16960 1159441 1122829 881029 1226694 1021967 999532 1251678 974695 1123421 1327194 1181500
16950 1181500 1224391 1351195 1529820 1216329 936117 1463962 1209568 1538826 1221903 1356170
16940 1356170 1244121 1529889 1545508 1290805 1326234 1052299 1421794 1192101 1243237 1502487
16930A502487j43528K84284r779m37592j2354L32891k99507L37840K647J5875
16920A573264o9521K00590M3259k24805P396L15346k95683P3610J54863N1358
16910A829677m7982k59315L42400N6933k24159p3266P0003k5838Q2553L24672
16900B075678n4753M2437k40056L42166k31779J44257Q1144L9947n8156k64224
16890A876661R7320J55474q8402K79487L85996l25844r6514j12852L05977o3540
16880B413763J50822j85860P7069K50459l62890J2299J61625J60720j89379L92042
16870B880670j07678R8178k37263N5071l8515M70730j86670k7925L19319m35715
16860B790202K43965J10970R6384L22690j31667m51706K86240P4025M48089k72796
$$ plain form
16930 1502487 1358959 1643243 1633464 1195872 1183518 1516409 1216902 1554742 1557389 1573264
16920 1573264 1503743 1704333 1747592 1522787 1530183 1845529 1549846 1623456 1778319 1829677
16910 1829677 1781695 1522380 1864780 1921713 1697554 1624288 1694291 1668453 1751006 2075678
16900 2075678 2020925 2063362 1823306 2165472 1933693 2077950 2159094 2199041 2140885 1876661
16890 1876661 1973981 2129455 2041053 2320540 2706536 2380692 2284178 2171326 2477303 2413763
16880 2413763 2564585 2378725 2455794 2706253 2343363 2355662 2517287 2678007 2488628 2880670
16870 2880670 2772992 2871170 2633907 2688978 2650463 3121193 2934523 2906598 3225917 2790202
16860 2790202 3034167 3145137 3241521 3564211 3432544 2980838 3267078 3341103 3789192 3516396
16850C516396j7113J02114J85540J13172j19451j83384N68415j31098j40822Q7371
16840C981140K94199k39394k7330K78239J67460k0615O1961K53833j4544j02167
16830D632782J66724J63572K55021k7800L62229O0706j75208J96570K38333k8446
16820E844483l20856M67668J97595l76776N24359K95824p913k38720O50814K875
16810G039353L5782L98951p4243j9539M34735J29711L13924N4915N7981J69778
16800H541348K99963L70258k4626N85679n6427L05577J24708J20092L84220J67684
16790A0818476L88897P157O51935l3373P16737j83732P74366K29053M56092J52433
16780A3978041M51929M46961O15667M80726K06725P56102N13601N31738O03939
$$ plain form
16850 3516396 3499283 3601397 3786937 3900109 3780658 3597274 4165689 4034591 3893769 3981140
16840 3981140 4275339 4035945 4008615 4286854 4454314 4433699 4495660 4749493 4734949 4632782
16830 4632782 4799506 4963078 5218099 5190299 5552528 5613234 5438026 5634596 5872929 5844483
16820 5844483 5523627 5991295 6188890 5812114 6336473 6632297 6624384 6385664 7036478 7039353
16810 7039353 7075135 7474086 7399843 7380304 7815039 7944750 8258674 8313589 8371570 8541348
16800 8541348 8841311 9211569 9186943 9772622 9716195 10021772 10146480 10266572 10650792 10818476
16790 10818476 11207373 11214530 11866465 11833092 12549829 12366097 13140463 13369516 13825608 13978041
16780 13978041 14429970 14876931 15492598 15973324 16180049 16936151 17449752 17981490 18585429
16771A8585429K92983O56538O54788N67546R59227L99029J123367N73858Q47157
16762B4659922J119362J317105J003650P71090J331996J031305J473333J180583
16754C3888346J339247J384670K073227J568413J498557J742675K018728K038348
16746D7552211K227685K889225K817296K219624K945715L161380K938626L794824
16738G0546586L556249L839381L997859M380317M796810M566006N231854N243946
16730A06159008N564511N436292N886423O075196N829987N902339N938432N457266
16722A52249454N696596M730076M366909L407432K991154K172838J047290L86361
16714A77048110o59615j753497k743556l267013m233455m671100n184950n997417
$$ plain form
16771 18585429 18878412 19534950 20189738 20757284 21716511 22115540 23238907 23812765 24659922
16762 24659922 25779284 27096389 28100039 28871129 30203125 31234430 32707763 33888346
16754 33888346 35227593 36612263 38685490 40253903 41752460 43495135 45513863 47552211
16746 47552211 49779896 52669121 55486417 57706041 60651756 63813136 66751762 70546586
16738 70546586 74102835 77942216 81940075 86320392 91117202 95683208 100915062 106159008
16730 106159008 111723519 117159811 123046234 129121430 134951417 140853756 146792188 152249454
16722 152249454 157946050 162676126 167043035 170450467 173441621 175614459 176661749 177048110
16714 177048110 176388495 174634998 171891442 168624429 164390974 159719874 154534924 148537507
16706A48537507n770984n783036o450974n789650n916447o131917n702398n863385
16698A01128716n001837m757482n115308m523475m312769l909513l856739l547211
16690F6104382l658217k754287l016478k849407k728893k460815k287371k311866
16682D4037048k083828j637997j857449j903244j435552j423770j378127j353147
16674C0963934j199555j161781q37632j147548j272420j112992r39701o53002
16666B2639303j031449o11525o35158o90005q27572p84368l08944o11941o84134
16657A6454207o16727m91160k92405n46638n49374k0889l81443o57644j86808
16648A2711119m33438n33159m94899O5443p44243K06695l17170m31901l28803
$$ plain form
16706 148537507 142766523 136983487 130532513 124742863 118826416 112694499 106992101 101128716
16698 101128716 96126879 91369397 86254089 81730614 77417845 73508332 69651593 66104382
16690 66104382 62446165 59691878 56675400 53825993 51097100 48636285 46348914 44037048
16682 44037048 41953220 40315223 38457774 36554530 35118978 33695208 32317081 30963934
16674 30963934 29764379 28602598 27764966 26617418 25344998 24232006 23292305 22639303
16666 22639303 21607854 20996329 20361171 19671166 18843594 18059226 17750282 17138341 16454207
16657 16454207 15837480 15346320 15053915 14507277 13957903 13937014 13555571 12897927 12711119
16648 12711119 12277681 11744522 11249623 11315066 10570823 10777518 10460348 10028447 9699644
16639I699644j44534r4082m90484q6515O5033m94778k42802o1741l96637K6947
16629G780051l72441j50657k68431o7297l58128J5688k09340k36697k84920p4219
16619E773609J15198j96771K31773n61980J69794j22611k42322o7706l48222K98078
16609E048840k91131L9797j84001P4236l3149j94906p3486n6877o2690L5565j57854
16598D144344j32354p8628k95242R6976l15334M37944K6346l72101k67082J18565
16588C363434K84300o99078L92487j30791P1085J3933k96733J23299L7718l17319
16578B842335J19828M0841l05064L1729k02009J04280J034p8704J18037o12422
16568B059885M52701L3844j6996m08960K55362j559J67119n03179L08387j51123
$$ plain form
16639 9699644 9555110 9461028 8970544 8884029 8949062 8454284 8211482 8149741 7753104 7780051
16629 7780051 7407610 7256953 6988522 6921225 6563097 6578785 6369445 6132748 5847828 5773609
16619 5773609 5888807 5692036 5923809 5361829 5531623 5409012 5166690 5098984 4750762 5048840
16609 5048840 4757709 4797506 4613505 4687741 4654592 4459686 4386200 4329323 4266633 4302198 4144344
16598 4144344 4011990 3933362 3638120 3735096 3419762 3857706 3884052 3511951 3244869 3363434
16588 3363434 3647734 2948656 3341143 3210352 3281437 3295370 2998637 3121936 3159654 2842335
16578 2842335 2962163 3003004 2697940 2729669 2527660 2631940 2632974 2554270 2672307 2059885
16568 2059885 2512586 2546430 2529434 2120474 2375836 2374277 2541396 2038217 2346604 2195481
16558B195481j52838J99582j98814p6563M97220m02824k95949N2701k16368J75310
16548A776938L08544m80730n1128J40003K14078j93188j77492o645K10569L2222
16538A773171L8157k66972R742M51440l30495l18992M01696l73223N28019k77403
16528A635140j48395k99486L11468j40471j63562J40107J99419k37780l26874
16519I69566K31610O1912Q2829m0202k67439M73250k08455K9072R3277k22046
16509A203374J4478M0852j48882k36546L1453J51303K2814J22743k54409J75927
16499A123107j93768K83859k87014k0059M52146l83335O2227P3472m29069n8311
16489F23255L82846J33109k61139Q5834n5397J63616m44715j4327M86279l80041
$$ plain form
16558 2195481 2042643 2242225 2043411 1966848 2464068 2061244 1765295 1817996 1601628 1776938
16548 1776938 2085482 1604752 1553624 1693627 1907705 1714517 1537025 1530380 1740949 1773171
16538 1773171 1811328 1544356 1554098 2005538 1675043 1356051 1757747 1384524 1912543 1635140
16528 1635140 1486745 1187259 1498727 1358256 1194694 1334801 1534220 1296440 969566
16519 969566 1201176 1263088 1345917 1305715 1038276 1511526 1303071 1332143 1425420 1203374
16509 1203374 1217852 1258704 1109822 873276 904729 1056032 1078846 1201589 947180 1123107
16499 1123107 929339 1213198 926184 906125 1358271 974936 1037163 1110635 681566 623255
16489 623255 1006101 1139210 878071 963905 908508 1072124 627409 613082 1099361 719320
16479G19320N7394J73060J09851k88887L448R9504j34034m0702K35524j61046
16469G73432r2972J53138j10935K10483J439j00466k4696M56012C65086M67036
16459H32122j74048Q9944P8817j18489J17063l1547m6157Q2503J8014J27113p8361
16448H96974j68999J57155j93791m6923l6592J24858j32348R4082C22401K82376
16438F04777J51022K06541m26523o1290j31926K86660j95581L13387m9780J54957
16428H52244o3104k02306j86015K91759N6039C51805J58253k23392R0576J12015
16418D89257B41041L95697j97440j64681J42374L8902l8004J15975L5203Q5495
16408F54562r2243j35646m7338A61676M03795r0801m2240J75004n8471k9044k13718
$$ plain form
16479 719320 776714 949774 1059625 770738 774186 873690 739656 698954 934478 773432
16469 773432 680460 833598 722663 933146 934585 834119 809423 1265435 365086 832122
16459 832122 658074 748018 826835 708346 825409 793862 747705 830208 848222 975335 896974
16448 896974 727975 885130 691339 644416 607824 732682 600334 694416 322401 604777
16438 604777 755799 962340 535817 474527 342601 629261 433680 747067 697287 852244
16428 852244 789140 586834 400819 692578 748617 351805 510058 286666 377242 489257
16418 489257 241041 636738 439298 274617 416991 455893 417889 533864 569067 654562
16408 654562 562319 426673 379335 161676 565471 474670 432430 607434 548963 519919 306201
16397C06201k9104J34262K35537A28044o1193M36781k02371p9373K58156k37952
16387B42092R1283N8791r7206K6928N1033m0142L70989B10131J95406L2346Q1753
16376E19636k8615k40864j9016j02391j2698L32216A31844J18699O4469a13687
16365C76696N0404L797p4478J98954A83390K5096d1636D20650j89453R3524A44293
16353C72638j69266Q5371Q4971j2866j09080K1163i745A83794M1828P7084m8673
16342B54033M5002Q4922D5674a19815E23625F9994K59739j1676A49982K78336
16332D28318O4639B44750l7229l4230a4981A15996K88879A32907P2721J91254
16322C96882j35518d8817E02040A22057n9153N0833g7280C40249H5557J96203
$$ plain form
16397 306201 277097 411359 646896 128044 66851 503632 301261 221888 480044 242092
16387 242092 333375 392166 294960 321888 372921 332779 703768 210131 405537 437883 519636
16376 519636 491021 250157 231141 128750 116052 448268 131844 250543 315012 -113687
16365 376696 427100 430897 356419 555373 183390 208486 -41636 420650 231197 324721 144293
16353 372638 203372 288743 373714 360848 251768 272931 -9745 183794 225622 302706 254033
16342 254033 299035 383957 45674 -119815 523625 69994 329733 318057 149982 428318
16332 428318 492957 244750 207521 173291 -14981 115996 404875 132907 205628 396882
16322 396882 261364 -48817 502040 122057 62904 113737 -77280 340249 85557 281760
16312B81760q3969J86179q5703K562P6596C2624K04140o4755J42914A04231B1375
16300B22934J90190C9625a5267B02572H2213O591J43925M3863q4490a5110A42334
16288B90099p206I4942r970K48766q793b4889D04546r0814N4755j09771b1829
16276B82107A5584a2511A20670J1779a58875B73695D4737O4532a56262D19912
16265D35946j23312j37853D3990M0974J03050e9182A76071n2035a43343A56602
16254C03113G1744J03353a38678n4532D6364g6618l126A58301G3526N7504i4118
16242B54648a47073A62813c3943f2j29842A71764e0691B32212P1808A50014k7034
16231A22980R2553a07364G2137K74689q7382e8826a7946A65747p5974C4486K29968
$$ plain form
16312 281760 197791 383970 298267 300829 377425 32624 236764 172009 314923 104231 21375
16300 222934 413124 39625 -15267 202572 82213 88804 232729 276592 192102 -15110 142334
16288 290099 282893 94942 84972 333738 324945 -24889 404546 313732 368487 258716 -21829
16276 282107 15584 -12511 120670 132449 -158875 273695 44737 109269 -156262 419912
16265 435946 312634 174781 43990 84964 188014 -59182 176071 124036 -143343 156602
16254 303113 71744 175097 -138678 -193210 46364 -76618 -79744 158301 73526 131030 -94118
16242 254648 -147073 162813 -33943 -62 -129904 171764 -50691 232212 304020 150014 122980
16231 122980 215533 -107364 72137 346826 259444 -58826 -17946 165747 89773 34486 264454
16220B64454c9919A63584k9325J26954e3867j78180n925j6990A65238a43484C7794
16208H5721c7616A02392c5782A77823c6959o2060j41801R4213d4024A02166m6699
16197E5467i618j71590A05187d53017A57159j8955J16399a39967d6949j36541
16187a83490B76922H2049a32053A18129a35528j47357H6102c4245A24533P1458
16177A95991p4636i6691A82722O3011o0125h7567L1717P13A45955n7368O4301
16166A52888k6583Q6116G7973J23391m5392a90157B23940a98929D2855P9323m6760
16155G5418a8556k9111B89251A6372J20336n0646g289k35468G5747f0527k55724
16144c16251C5736e7729C73474a30880c2090a1451C45696F6885J69299M1100p831
$$ plain form
16220 264454 -39919 163584 134259 261213 -53867 -232047 -237972 -254962 165238 -143484 37794
16208 85721 -37616 102392 -35782 177823 -36959 -99019 -240820 -146607 -44024 102166 55467
16197 55467 -9618 -181208 105187 -453017 157159 138204 254603 -139967 -46949 -183490
16187 -183490 276922 82049 -132053 118129 -135528 -282885 86102 -34245 124533 195991
16177 195991 121355 -96691 182722 245733 185608 -87567 -55850 -55137 145955 88587 152888
16166 152888 126305 212421 77973 201364 155972 -190157 223940 -198929 42855 122178 75418
16155 75418 -18556 -47667 289251 16372 136708 86062 -7289 -242757 75747 -60527 -316251
16144 -316251 35736 -57729 373474 -130880 -32090 -11451 345696 66885 236184 277284 269453
16133B69453H0659d747B06823J2615f1312f879D5181K37966a40391b3194I1060
16121b5709n6204j34185A18299m1788J43912n436O4732b01244R0941l1350H7427
16109b68005B05236f2108A63145F2932O0670a60093H2034K49893j04164I5864
16098B04938H8689L48028F854J90364c6572r949k10675b3642A83350b2656A02551
16086f7751k04960A24432R7533J6377A14076e2362k15709A04535M2132D7980K24833
16075B72813a72314A08545n2407b14353R4047A68945e7636m1660j64271G6278
16064D2629J9982a39798A67851L6309D791b14946n4793O5443A22026J45286F4103
16052C58719b77576E8265b16628d2865C48405A01012P0707q2700a36801G4372
$$ plain form
16133 269453 80659 -4747 206823 219438 -61312 -6879 45181 283147 -140391 -23194 91060
16121 -25709 -81913 -216098 118299 76511 220423 214987 279719 -201244 -110303 -141653 87427
16109 -268005 205236 -62108 163145 62932 123602 -160093 82034 331927 227763 95864
16098 204938 88689 436717 6854 197218 -36572 -46521 -257196 -23642 183350 -22656 102551
16086 -67751 -272711 124432 221965 238342 114076 -52362 -268071 104535 146667 47980 272813
16075 272813 -172314 108545 56138 -214353 -120306 168945 -57636 -99296 -263567 76278
16064 42629 62611 -139798 167851 204160 4791 -214946 -269739 -204296 122026 267312 64103
16052 358719 -277576 58265 -216628 -42865 348405 101012 171719 89019 -136801 74372
16041H3665c6964q69n3799r7293l772d7519k28690a05289J5582j18913M3284K423
16029a62913A49964a83371b7771B58180h5174L8117F1967P4491h123A9723N8718
16018G8441E57a87104D2537J7709h1766C0311c3163n797E993a82137F0367M7112
16006A07479B0006I27f8265D35228A35507j8189a91326C83998F7126a11252q8911
15995b00163g3210j61665c9975E3133h384q5875P992E9443h8251I8474N5602o7289
15983H6787R8829J19668M058D6805N383K7165J08960D5937J89557C878P2369j4521
15971F1726c88015A33711b4532j23474B7437J74643F0258L48752I0721d3669C1591
15959I2282d2529A20746k3035b25787h374B06006c4329D6577d0191m4875k18902
$$ plain form
16041 83665 -36964 -37833 -91632 -188925 -192697 -47519 -276209 -105289 -89707 -208620 -165336 -162913
16029 -162913 149964 -183371 -27771 258180 -85174 -47057 61967 136458 -8123 19723 78441
16018 78441 557 -187104 42537 60246 -81766 30311 -33163 -38960 5993 -182137 60367 107479
16006 107479 20006 927 -68265 435228 135507 117318 -191326 383998 67126 -111252 -200163
15995 -200163 -73210 -234875 -39975 53133 -8384 -94259 -86267 59443 -88251 98474 154076 86787
15983 86787 185616 305284 309342 46805 52188 79353 188313 45937 235494 3878 76247 61726
15971 61726 -388015 133711 -24532 -148006 27437 202080 60258 409010 90721 -43669 31591
15959 92282 -42529 120746 97711 -225787 -8374 206006 -34329 46577 -40191 -85066 -303968
15948c03968f4042H5341h4162c7750B47872H5382a87686i409k10482B2605d28730
15936b82380e3924b468B6078J27491b55431f3212k3093o511a9729B72844G618
15924a05031N1885l39132A18130a31580B90523I6027i8523B23660a90907o8447
15914b59354J29442l103j07265h0855j8394k21625F449h8251j5971p2332A32201
15902b5000j95973Q9954n8928H2342J47166a82399b9330A9577J48117O0797c63997
15890b05326B4798K616e0426j64131A38609a42A44414A2193J08813c15939a01360
15878A28500b7855B5458K08731D5804a57637k44741B6770O0110f4916B9928a61934
15866A42412F2280a20048B86544b22150G9194N486a41957B72793F4429J0105B8762
$$ plain form
15948 -303968 -64042 85341 -84162 -37750 247872 85382 -187686 -9409 -219891 22605 -428730
15936 -282380 -53924 -2468 26078 153569 -255431 -63212 -86305 -92816 -19729 272844 7618
15924 -105031 -53146 -392278 118130 -131580 290523 96027 -98523 223660 -190907 -259354
15914 -259354 -129912 -133015 -240280 -80855 -99249 -320874 6449 -88251 -104222 -176554 132201
15902 -25000 -220973 -131019 -189947 82342 229508 -182399 -29330 19577 167694 228491 -363997
15890 -205326 24798 27414 -50426 -214557 138609 -142 144414 12193 121006 -315939 -101360
15878 128500 -27855 25458 234189 45804 -157637 -402378 26770 86880 -64916 29928 -161934
15866 142412 62280 -120048 286544 -222150 79194 84680 -141957 272793 64429 74534 28762
15854e985A1077Q6635d3871l28374a04544A38143N0808H3548a41791j67496Q3984
15843b25303a09214k749A2954a19498B3030a51141O5576g54k3367r2706G7209
15831H6365k4112f1002C0656k236a91041B951P4651a23889A60127b7874m9546
15820g7420r4348B73365F2213e7645r5739o580A02046l6266b39588o0708H8036
15808f6341A16266f5236j74681A23269b21030B23218b17495g6059A68819C7983
15797A5942b15483A07224a18653H8592j9774h8447B66869d2653j77341B71281
15786g8758G2481k9186j9191a68197j35723D21239p1630C4775a24214B52286a82214
15774A009J36288a02162A96249f3909j33134f4272j01645N3685A65891b85651
$$ plain form
15854 -5985 11077 97712 -43871 -372245 -104544 138143 188951 83548 -141791 -309287 -225303
15843 -225303 -109214 -111963 12954 -119498 23030 -151141 -85565 -754 -24121 -116827 77209
15831 86365 62253 -61002 30656 28420 -191041 2951 77602 -123889 160127 -27874 -77420
15820 -77420 -171768 273365 62213 -57645 -153384 -159964 102046 65780 -239588 -300296 88036
15808 -66341 116266 -65236 -239917 123269 -221030 223218 -217495 -76059 168819 37983
15797 15942 -215483 107224 -118653 88592 68818 -88447 266869 -42653 -219994 271281
15786 -78758 72481 43295 24104 -168197 -303920 421239 349609 34775 -124214 252286 -182214
15774 1009 137297 -102162 196249 -63909 -197043 -64272 -165917 -112232 165891 -285651
15763b26136B39935e17258a31166A29829P243J454J27352n4238N1878a90205B41933
15751g3291B09311n4495d1068m368c075B52730D4206K44583o0016J42330p1047
15740C00056G861d74498f8264j89159C6035c9424o691F3410i8881A71753o2254
15729A09499P6049a20416j71007d0325a3735P62C8817M3611a59151B21658G7133
15717a2211A06666l7244a0481A97830G5490b33442f6803k34887a09398b7670j92392
15706b20062K5000g7367j25765A63124a35971A86663b7774i038l373C6640g1828
15694e82623E9027g0733B05520a82005a0237A08470a90748A71957Q7188A6595
15683a75175f0938j92784A53275i3867B69410B0865R1798b44343H5915a00819
$$ plain form
15763 -226136 239935 -517258 -131166 129829 137072 138526 265878 211640 263518 -190205 241933
15751 -73291 209311 154816 -41068 -45436 -3075 252730 44206 288789 228773 371103 300056
15740 300056 7861 -474498 -68264 -257423 36035 -39424 -46115 63410 -98881 171753 109499
15729 109499 185548 -120416 -291423 -40325 -13735 -12973 38817 82428 -159151 221658 77133
15717 -12211 106666 69422 -10481 197830 75490 -233442 -66803 -301690 -109398 -27670 -220062
15706 -220062 -195062 -77367 -203132 163124 -135971 186663 -27774 -9038 -12411 36640 -71828
15694 -582623 59027 -70733 205520 -182005 -10237 108470 -190748 171957 259145 16595
15683 -175175 -60938 -253722 153275 -93867 269410 20865 112663 -244343 85915 -100819
15672F8875k6297a87828g5635j13461c5909A7908f5396j72277D0475a30042l7992
15661a68034o9018Q7302b6682A4414R3791a02683A52387a52831M2476A26436P4313
15650B00749a06469E0408k724b10405O6156A30035J21434j09876b15916R4273
15640a21643M6406p6490K7919F0621J19795a65709A16004i1879K4766A57492b55602
15628A2727L2318e9644A13101a73287I755a33467j07409P8656P9991c8098A54822
15616a66212I8411a17810M4036C0640e3671j06985A35908J80232D9814J92494
15606B42308e7841H5391a01455m5753e3360A08872a59490I3309b46608I2082l6774
15595E5308a71767A4554J0410Q3284d6051B44499P2466a51422B21078b58729A14945
$$ plain form
15672 68875 42578 -187828 -75635 -189096 -35909 17908 -65396 -237673 40475 -130042 -168034
15661 -168034 -237052 -149750 -26682 14414 108205 -102683 152387 -152831 -110355 126436 200749
15650 200749 -106469 50408 47684 -210405 -144249 130035 251469 141593 -215916 -121643
15640 -121643 -75237 -151727 -123808 60621 180416 -165709 116004 -91879 -67113 157492 -255602
15628 12727 45045 -59644 113101 -173287 9755 -133467 -240876 -162220 -82229 -38098 154822
15616 -166212 98411 -117810 -73774 30640 -53671 -160656 135908 316140 49814 242308
15606 242308 -57841 85391 -101455 -147208 -53360 108872 -159490 93309 -246608 92082 55308
15595 55308 -171767 14554 24964 108248 -46051 244499 316965 -151422 221078 -258729 114945
15583b35205d0920j26995A03436c37771C0231L0701I24d3391l13053A19461f7340
15571C76525a22205l838d3201q6755A9586a54243F291P891e16308C58577A25170
15559F9012b14904L5691e6262k5428I6608N3389i9678J442j09001A67181a41599
15547B60254c0864A34547a59158f6391j23802h7155G0014a7975j35235A59796
15536B04276n4562D9092h9233I5838K0887n5312a6216k41606A44748l9164f1259
15524C3087m798J7780J57307O8920a59322G7059C7955e8328h644A09398M915k3071
15512I1242a48090C6139a7718k76380A1534b09783A32238i2717j49889J09259
15502a33347A06429D7350A4955Q3749a01121B6474i5I273J09224B0602h8491E6912
$$ plain form
15583 -235205 -40920 -167915 103436 -337771 30231 60932 924 -43391 -356444 119461 -67340
15571 376525 -122205 -126043 -43201 -129956 19586 -154243 6291 14182 -516308 358577 125170
15559 69012 -214904 -179213 -56262 -81690 96608 149997 -99678 -98236 -207237 167181 -141599
15547 260254 -30864 134547 -159158 -66391 -190193 -87155 70014 -17975 -153210 159796
15536 204276 149714 49092 -89233 95838 116725 61413 -16216 -257822 144748 105584 -61259
15524 33087 28289 46069 203376 272296 -159322 77059 37955 -58328 -8644 109398 114313 91242
15512 91242 -148090 36139 -17718 -294098 11534 -209783 132238 -92717 -242606 -133347
15502 -133347 106429 47350 14955 98704 -101121 26474 -95 9273 118497 20602 -88491 56912
15489a32953A91166a4200l4008E8031K4325g3896a2704B29487G9384l2947j6919
15478B9518O4867b0510j40411B09840H7362L8463a0921k97396B89504A10036K91724
15467D01760D8609c4971A7179J17073b56546g1177A53719a55240A81409q8954
15457I2455l5483g7786A24536a13735k11050a39167b9700n6708A41052o5313k8047
15446D7692N5244b30148b269G1373P6756n6594a68063j07170A44426d4094k48605
15435b92699L3043n5959C8211a923p2059j13439M6723O8063G9081a24197B40142
15423B53211o0033D0939J16568a17513A76921b75699A46232G107a18751j26105
15413b44856C68939o7818b5410k51109c4565A58241a19517n3577o7298N3781A51473
$$ plain form
15489 -132953 191166 -14200 -48208 58031 82356 -73896 -12704 229487 79384 46437 29518
15478 29518 94385 -20510 -160921 209840 87362 125825 -10921 -308317 289504 110036 401760
15467 401760 48609 -34971 17179 134252 -256546 -71177 153719 -155240 181409 92455
15457 92455 56972 -77786 124536 -113735 -324785 -139167 -29700 -86408 141052 75739 47692
15446 47692 102936 -230148 -2269 71373 148129 91535 -168063 -275233 144426 -44094 -292699
15435 -292699 -259656 -315615 38211 -1923 -73982 -187421 -140698 -72635 79081 -124197 240142
15423 253211 193178 40939 157507 -117513 176921 -275699 146232 7107 -118751 -244856
15413 -244856 368939 301121 -25410 -276519 -34565 158241 -119517 -173094 -240392 -186611 151473
15401A16366J62306e8321B8428J74743O6508J06757a1175D6859b93244a08965
15390A1729a90574A08638N3887h4030j8251A37166J86606a23653A65052h1133
15379E6229a39769A32807L5798d2915C2703g1219n9383C30682a72003a7334A54100
15367C16830g4290m6342e8796B76352e406G5543k1633N9815b89282G659I5K86136
15355B86231F1451f5506o527A77780o3895R497k5685A4714J45758b36888d198
15343F2214b0305E1169R443N5012a57288G8282k1685J25956J1398C6383a48082
15331I1178b14201i4071A22427a61883j36033C02196h4327k81768F8513h9023
15320A22714a23389A67401a52677B59816c39114A90618P4759c0125A4426a13579
$$ plain form
15401 116366 278672 -58321 28428 203171 269679 376436 -11175 46859 -293244 -108965
15390 11729 -190574 108638 162525 -84030 -102281 137166 323772 -123653 165052 -81133
15379 56229 -139769 132807 168605 -42915 32703 -71219 -130602 330682 -172003 -17334 154100
15367 316830 -74290 -120632 -58796 276352 -5406 75543 53910 113725 -289282 7659 95 286231
15355 286231 61451 -65506 -72033 177780 113885 123382 97697 14714 160472 -236888 -4198
15343 62214 -20305 51169 60612 115624 -157288 78282 56597 182553 193951 36383 -148082
15331 91178 -214201 -94071 122427 -161883 -297916 302196 -84327 -366095 68513 -89023
15320 122714 -123389 167401 -152677 259816 -339114 190618 265377 -30125 14426 -113579
15309A06209C9831c44252B2423f9646F34042G5285M5251a22289e0109j63261A40347
15297e05813J06313A9391M381f2910G7306b431F0416a07096B00638n3488b42057
15285A73192g547k40594B12143L2879J52325b4390G9279a09090B37531I258a19462
15273A09001L5943J49630d7880N245h021l23888A71082b6187B8579O7657Q1198
15262A77434O4704A12920e5010I2080L1478a16277B89772A12618i7097B58221
15251A03201J29947J03587R5672O37289M35371k09431M06430m60294D09700j85447
15241B24253r2316J05834E5073e4628A48822A6995a96012B13083l8860b79512
15230C9751J00739b95595D4291a10462m7096d645j14685p5096O9432A61142L5920
$$ plain form
15309 106209 39831 -344252 22423 -69646 634042 75285 120536 -122289 -50109 -213370 140347
15297 -505813 -399500 19391 23772 -62910 77306 -2431 60416 -107096 200638 147150 -242057
15285 173192 -7547 -248141 212143 245022 397347 -24390 79279 -109090 237531 9258 -119462
15273 109001 144944 294574 -47880 -42635 -8021 -331909 171082 -26187 28579 96236 177434
15262 177434 242138 112920 -55010 92080 123558 -116277 289772 112618 -97097 258221
15251 103201 233148 336735 432407 1069696 1505067 1295636 1702066 1241772 409700 224253
15241 224253 131937 237771 55073 -54628 148822 16995 -196012 213083 174223 -279512
15230 39751 140490 -295595 44291 -110462 -157558 -4645 -119330 -194426 -124994 161142 197062
15219A97062E0618l811K90551g9015b59A46665m9739J06396B0149c36448d5418
15207C09568c06983A66714N930b26176i5938F8954d4703D51454A72931e8052C05460
15195e1776C2956a04570C8986J86814I4820Q5568J61591a93200Q7931D8904c0861
15183b16536C5724J69078M3589j18585j5819J00187C5524g570q7775a7705j20266
15172a37971O8553f440p3094I5707A4089b3437F8635J08705l9959C789K23294
15161B27083A4443K4451h5281A32407a24008F2136K58622j00792a90739B83827
15150E437O6525P7468P7299R1218I4789B3064M10220A13892J06689d8292A50232
15138G290J03093N4271K94582k23644D3114A5717J43353D7863M12415k25394J04375
$$ plain form
15219 197062 50618 46807 337358 -79015 -259 146665 96926 203322 20149 -336448 -45418
15207 309568 -306983 166714 172644 -226176 -95938 68954 -44703 451454 172931 -58052 305460
15195 -51776 32956 -104570 38986 225800 94820 180388 341979 -193200 -105269 48904 -30861
15183 -216536 35724 204802 248391 129806 113987 214174 35524 -7570 -95345 -17705 -137971
15172 -137971 -69418 -6440 -79534 95707 14089 -23437 68635 177340 137381 3789 227083
15161 227083 14443 38894 -85281 132407 -124008 62136 320758 219966 -190739 283827
15150 5437 71962 149430 226729 317947 94789 23064 433284 113892 220581 -48292 150232
15138 7290 110383 164654 459236 235592 43114 15717 159070 47863 460278 234884 339259
15127C39259n6933H3546j6443j967K28402G94J09314D3668L71798E6731k3474
15116C3257J72652o8999a18732C53976e4415D8765a70828c0500C1266d7658A30601
15104D0137P4157l3829a3271A93414e293C71700a15662B75653H4504A5082K25416
15093B40498J07374q6041L9034j14624H8020a24882l1289I9640J1380P6449J58088
15082C45557b2249A73110a02794M5066j87507C99656a9793l7421C02345A11741
15071A53051i5503B76692E5367K28365G9695P5924j6792K2802H0114J93721C1084
15059C44035c5090C02361j47817Q7171I0223K13772C9541L19924c7540H7629c2212
15047C27536A05116k7115J74126K96177o4016A65033n9312M80893j72633A12236
$$ plain form
15127 339259 282326 83546 67103 65136 293538 794 110108 43668 415466 56731 33257
15116 33257 205909 136910 -118732 353976 -54415 48765 -170828 -30500 31266 -47658 130601
15104 40137 114294 80465 -13271 193414 -5293 371700 -115662 275653 84504 15082 240498
15093 240498 347872 261831 300865 186241 88020 -124882 -156171 99640 111020 187469 345557
15082 345557 -22249 173110 -102794 -57728 -245235 399656 -19793 -57214 302345 111741
15071 153051 -95503 276692 55367 283732 79695 155619 138827 161629 80114 273835 31084
15059 344035 -35090 302361 154544 241715 90223 303995 39541 359465 -37540 87629 -32212
15047 327536 105116 78001 252127 548304 484288 165033 105721 586614 413981 112236
15036C12047l5278A18280i7309A75032J92413K7902b3197G4640J62480I8458J911
15025A00369Q4373a65096E9069F639J09102M26852B16494n4049F8651a61977E15923
15013B40010J86972o4202C4582K87208A32358A9258K7836J90675a01512B60753
15002E1212L65492a62087B85277C1505K7751O4173J93914g3846H4239K17260c0088
14990D26058r1052j19516k9898J14635j18536p285B7540M70844d021A47898P5911
14979B23809D6707K13142F8949K26984A07147Q4580J72781j6917l2584K39241
14969E54248E902L15946I2334K5142L12067q0597N8804r1699B1972O2621L47777
14958D32370A93134J55863n8246j12254K01469A30655N31417k40966A73503c7728
$$ plain form
15036 312047 276769 118280 -97309 175032 367445 395347 -23197 74640 237120 98458 100369
15025 100369 184742 -165096 59069 6639 115741 542593 216494 162445 68651 -161977 515923
15013 240010 426982 362780 34582 321790 132358 19258 47094 237769 -101512 260753
15002 51212 416704 -162087 285277 31505 59256 123429 317343 -73846 84239 301499 -30088
14990 426058 335006 215490 185592 300227 181691 174406 27540 498384 -4021 147898 223809
14979 223809 46707 259849 68949 295933 107147 191727 364508 347591 315007 554248
14969 554248 5902 321848 92334 117476 429543 348946 407750 316051 21972 84593 432370
14958 432370 193134 348997 290751 178497 379966 130655 662072 421106 173503 -37728
14947B49754A0768K65374l6816K67084k52712r6519K03825Q3144F6986M242R3704
14936A64932K16099r4252j552J90742k15914J80548j50505j29252k300K26164
14926C84710N9954j86846P5687a26721A72421D2371p131L32885A08449A9462a83642
14914B89335N7250r162o0422J68879A67590L66296j96372q2624K33450J8593A42681
14902A17688O2585N45648C14831P3055p6657O9R4336P4924j10036j0871A58821
14890B36401n9722G6780J36480L1912L26246k01949A67779K86357j19592J56959
14880D91503j46348j27107K25647E5673K37378I7423J76363k282J33644K33620
14870F38768q2816k55185M667j09511M28753B68176J49300K01186N9257j13157
$$ plain form
14947 249754 10768 276142 239326 506410 253698 157179 361004 444148 66986 71228 164932
14936 164932 381031 286779 285227 475969 260055 440603 290098 160846 158546 384710
14926 384710 444664 257818 333505 -126721 172421 42371 35240 368125 108449 19462 -183642
14914 289335 346585 337423 277001 445880 167590 533886 337514 254890 488340 506933 142681
14902 117688 180273 725921 314831 387886 311229 311298 405634 480558 370522 359651 158821
14890 236401 176679 76780 213260 245172 571418 369469 167779 454136 334544 491503
14880 491503 345155 218048 443695 55673 293051 97423 273786 271504 405148 638768
14870 638768 555952 300767 305434 195923 624676 268176 417476 618662 677919 564762
14860E64762j14919A62668L02614k29570L47687n7801J398M8258k52214P2441
14850C95481j8007j27813g943E33020j93090k5280L16893k70978L56816B83526
14839F85500B43975r1239K19389J14639J96774O2748A97997M69080B08750A6465
14828G78487C63087J39353k4492J09824A22781K51701Q5274L34961G5899P8994
14818A54893M01338Q5406k39565N177M04180k12332j59382B02316J38534K93544
14808F34394j29084J05817k67532K2991L14549C22035K35150M18881m77547B9167
14797G89773k25608A93395L27018J04635n1787r576j33437j39927K17743J34650
14787F42714L8827j11261R6537k02510J03303j15256K56376J6829J21463C89155
$$ plain form
14860 564762 449843 162668 465282 235712 583399 525598 526996 575254 323040 395481
14850 395481 377474 249661 -7943 533020 339930 314650 631543 360565 717381 283526
14839 685500 243975 152736 372125 486764 683538 746286 197997 667077 208750 16465
14828 778487 363087 502440 477948 587772 122781 374482 459756 794717 75899 154893
14818 154893 556231 641637 402072 407249 811429 599097 439715 202316 340850 634394
14808 634394 505310 611127 343595 366586 681135 322035 557185 976066 498519 29167
14797 789773 564165 193395 520413 625048 573261 563685 430248 290321 508064 642714
14787 642714 681541 570280 666817 464307 567610 452354 708730 725559 847022 389155
14776G06717j58082K0085k27887J74825R1584Q6622r1038J55189l21592J45994
14766E82417J8545j89189J76462J650o9172J29309J20029q9491k9066q7186L32344
14755H96652l39462j18321l3620K09750k99079M76416j13357k8387n4809K07882
14745H03665k09029J69388k6868K652P8174l68797K75126l7538j73217Q31708
14735A345264n29832k89759L65244l67704K34444l7862j37541K05423j95969J09955
14725G01663M2770j46915M0826N41050l44701J44110B20998O31379K51477n01722
14715F02132K66711J90145l16936L24256j18211l88500L66191O9724P163J50901
14705A153576j32251k28277L05164l32703j55569J3735Q1253J87794q6059K38222
$$ plain form
14776 706717 548635 568720 340833 515658 607242 693864 602826 758015 436423 582417
14766 582417 600962 411773 588235 589885 520713 650022 770051 680560 651494 564308 896652
14755 896652 557190 438869 405249 614999 315920 792336 678979 650592 595783 803665
14745 803665 594636 764024 737156 739808 817982 449185 724311 686773 513556 1345264
14735 1345264 815432 525673 890917 523213 757657 719795 582254 787677 591708 701663
14725 701663 744433 597518 638344 1179394 834693 978803 220998 852377 1103854 602132
14715 602132 868843 1058988 742052 1066308 948097 559597 925788 995512 1002675 1153576
14705 1153576 1021325 793048 1098212 765509 609940 623675 704928 892722 806663 1044885
14695A044885l9493l31539J07043K82939j63648K7795j46526L4324L57698k02212
14685I71266p9114J0701J31055J52321k23420k89619O53752l75153j01531J23255
14675I73513j91087P4471K10651J5443l52095Q4557L71788j45408k9985l02628
14665G09220L79018J53761r4126l7828k70728L14390J82363k34014j28193r2238
14655H81625R3012j06644K48258k25948N32633k17386l016J30840K48549m92830
14645A089093Q1749M23653l51071j45627l1180M21508k24792J42545j7714j90495
14635A197669P6913M41236j51509k06244l22157L12545j71577N1400J27821j25585
14625A230512K35572l73240p1123K82967K00324j31512R0409n0925J08942J59652
$$ plain form
14695 1044885 1005392 673853 780896 1063835 900187 927982 781456 815780 1173478 971266
14685 971266 892152 902853 1033908 1186229 962809 673190 1326942 951789 850258 973513
14675 973513 782426 856897 1067548 1082991 730896 815453 1187241 1041833 1011848 709220
14665 709220 1088238 1241999 1147873 1110045 839317 1153707 1336070 1102056 973863 881625
14655 881625 974637 867993 1116251 890303 1422936 1205550 1202534 1333374 1581923 1089093
14645 1089093 1170842 1594495 1243424 1097797 1066617 1488125 1263333 1405878 1388164 1197669
14635 1197669 1274582 1715818 1564309 1358065 1035908 1348453 1176876 1228276 1356097 1230512
14625 1230512 1466084 1092844 1021721 1304688 1505012 1373500 1463909 1412984 1521926 1681578
14615A681578n02870N08798j87829q3310R5920k46702L93646K31832k48554L6407
14605A678916K73583n14735L19777P4876O883l51165L04619l7361R3926k04722
14595A644597r2526L8532K25835l28097O91698n89318L03197M4669o6453j69826
14585A702308K21919j78998K86538k80448M02084m45236j85637M07089O04514
14576B534133n30185J69809l46677L87814J35449o4977K1949j56640J29050k6720
14566B253005J65860l8882l09542L85019k03226L83326p6196L06410l13252L85824
14556B938346J38931J65043Q19426J83930j46155O15532Q76560J592513L484663
14547A0668789Q114445J9312723J0287517k2381421A1368758D916410j665599
$$ plain form
14615 1681578 1178708 1687506 1499677 1416367 1512287 1265585 1659231 1891063 1642509 1678916
14605 1678916 1952499 1437764 1757541 1832417 1839300 1488135 1792754 1755393 1849319 1644597
14595 1644597 1552071 1590603 1816438 1488341 2180039 1590721 1893918 1938587 1872134 1702308
14585 1702308 1924227 1745229 2031767 1751319 2153403 1708167 1522530 1929619 2534133
14576 2534133 2003948 2173757 1827080 2214894 2350343 2285366 2307315 2150675 2279725 2253005
14566 2253005 2418865 2379983 2070441 2455460 2252234 2635560 2559364 2865774 2552522 2938346
14556 2938346 3077277 3242320 4061746 4245676 4099521 4715053 5591613 7184126 10668789
14547 10668789 18783234 38095957 48383474 26002053 11368758 4916410 3250811
14540C250811r75284l6268m00194J84033Q8043p7448L8354J35696l8320J285L45848
14529B516556m29383L49216l42928N4817K54081J43529J18215k72518M5834R3669
14519B531088L2058K16604j97670Q4910J3661k12838L73063k4871l4185k22864
14509B558956K57738j25433J03947K5766j60476K19850k8848J73351J12608K29280
14499C366739l30464j6136M82752k91871q876J67686j35514m2810N31943j68385
14489C555064N2895R3358j71961N8787L26075k13368l2382P305K11736j52143
14479C735366j38161N16035j37343K23158k79334K49272R2912O567l7532J20876
14469D351816M3989K5601J49116L30159m50807K62787j33401N8129Q5926K2658
$$ plain form
14540 3250811 2275527 2239259 1839065 2023098 2111141 2033693 2072047 2207743 2169423 2170708 2516556
14529 2516556 2087173 2436389 2093461 2148278 2402359 2545888 2664103 2391585 2437419 2531088
14519 2531088 2563146 2779750 2582080 2666990 2680651 2467813 2840876 2816005 2781820 2558956
14509 2558956 2816694 2691261 2795208 2820974 2660498 2880348 2851500 3024851 3137459 3366739
14499 3366739 3036275 3020139 3502891 3211020 3202144 3369830 3234316 3191506 3723449 3555064
14489 3555064 3607959 3701317 3529356 3588143 3914218 3700850 3668468 3675773 3887509 3735366
14479 3735366 3597205 4113240 3975897 4199055 3919721 4168993 4261905 4268472 4230940 4351816
14469 4351816 4395805 4421406 4570522 4900681 4449874 4712661 4579260 4637389 4723315 4745973
14459D745973M41042m28856L35844j34052L40585k4422R1271k00205K81459N2220
14449E500859R2409L59247k25699m3467M2936P0877o8199M92843q7720J03821
14439F237907j9243K32716j59852K49186k39296N40024J15732k17253K81749n1890
14429F969780K33562M02497k13346K01457K306q8397L25070l2842M4272L1473
14419G875832M90177K61070k95482J51390r9476J54339K90441k01437M24133M38018
14409I489005J02685r4984M87056j87265J08138O61481m59424L35211M8435L28946
14399A0819284J79582j55835N86436J81794r655L10129L63312P072R5582M56734
14389A2834435P2089M19837l4900L24802J33009K93830L40754N82027j87854J38050
$$ plain form
14459 4745973 5187015 4758159 5094003 4959951 5300536 5276114 5367385 5167180 5448639 5500859
14449 5500859 5593268 5952515 5726816 5683349 5726285 5797162 5728963 6221806 6134086 6237907
14439 6237907 6218664 6451380 6291528 6540714 6301418 6841442 6957174 6739921 7021670 6969780
14429 6969780 7203342 7605839 7392493 7593950 7596256 7507859 7832929 7800087 7844359 7875832
14419 7875832 8366009 8627079 8331597 8482987 8383511 8537850 8828291 8626854 9050987 9489005
14409 9489005 9591690 9496706 9983762 9796497 9904635 10566116 10106692 10441903 10490338 10819284
14399 10819284 10998866 10843031 11429467 11611261 11601606 11911735 12275047 12282119 12377701 12834435
14389 12834435 12906524 13326361 13291461 13616263 13749272 14043102 14383856 14965883 14778029 14916079
14379A4916079N21766N89565J36468M00967N226M78968L28746L33944K88841M56193
14369A8456763L13852K90595M73014P48891L35866L07059L74251M27410O43656
14360B2371357K50494O59914K80317O03174J019377L40413N59996N98014M04226
14351B7087282N41249O86535R24842J058055O58452N12664J176214N72606Q46170
14342C4064069O12034J288033O29022J234786J100843J248001R62961J226653
14334D2366402J207886J356205J193397J394000J694090J569644J391276J793965
14326E3966865J980343J679033J843993K305225J979903K080911K195879K381776
14318G0413928L072781K654655L252999K626124L033480L744513L572204L258886
$$ plain form
14379 14916079 15437845 16027410 16163878 16564845 16570071 17049039 17377785 17711729 18000570 18456763
14369 18456763 18770615 19061210 19534224 20283115 20618981 20926040 21300291 21727701 22371357
14360 22371357 22621851 23281765 23562082 24165256 25184633 25525046 26085042 26683056 27087282
14351 27087282 27628531 28315066 29239908 30297963 30956415 31469079 32645293 33217899 34064069
14342 34064069 34676103 35964136 36593158 37827944 38928787 40176788 41139749 42366402
14334 42366402 43574288 44930493 46123890 47517890 49211980 50781624 52172900 53966865
14326 53966865 55947208 57626241 59470234 61775459 63755362 65836273 68032152 70413928
14318 70413928 73486709 76141364 79394363 82020487 85053967 88798480 92370684 95629570
14310I5629570M380739L864275M472844M823270M784508N277618N900382N674314
14302A34807520O028583O671549P157120P075231Q131175Q324181Q769896Q858185
14294A95823440R837492J0385250J0405806J1616675J1642054J2290944J3211630
14287B75213291J3143484J3928001J4268054J4588226J4727689J4695229J4459407
14280C75023381J4343566J4195099J2589323J2266758J0866702R442207P749231
14273D56476267N185711K206037j199092l658983k629947l181223l893037p873390
14265D41432343r036826j1423988j2890156j4041283j4899436j5344616j5626448
14258C48169590j5465484j5245826j5262131j4338803j3291191j3422606j2888877
$$ plain form
14310 95629570 100010309 103874584 108347428 113170698 117955206 123232824 129133206 134807520
14302 134807520 140836103 147507652 154664772 161740003 169871178 178195359 186965255 195823440
14294 195823440 205660932 216046182 226451988 238068663 249710717 262001661 275213291
14287 275213291 288356775 302284776 316552830 331141056 345868745 360563974 375023381
14280 375023381 389366947 403562046 416151369 428418127 439284829 448727036 456476267
14273 456476267 461661978 463868015 462668923 459009940 456379993 453198770 449305733 441432343
14265 441432343 432395517 420971529 408081373 394040090 379140654 363796038 348169590
14258 348169590 332704106 317458280 302196149 287857346 274566155 261143549 248254672
14251B48254672j2352763j1516786j1044600j0660105r884097r416580q684539
14244A74695202p695611p891112p457238p181350o433889o413832n459798n140416
14236A21021956n466132m702654m683348m173026m285003l326279l512134l540526
14228H7332854m040784k876670l111382k751548l015456k014714k640626k379727
14220F4501947j852365k222498k041350k023744j753192j692824j487818j232417
14212E0195739j657066j780477j265733j528497p35807j168088o75830j627944
14204C9756297j352681q93026j417116m75269m74729j218642j139591j048131
14196C1737112q57427l51942q68643o94731o53206r50131l88301r41600m53569
$$ plain form
14251 248254672 235901909 224385123 213340523 202680418 192796321 183379741 174695202
14244 174695202 166999591 159108479 151651241 144469891 138036002 131622170 126162372 121021956
14236 121021956 115555824 110853170 106169822 101996796 97711793 94385514 90873380 87332854
14228 87332854 83292070 80415400 77304018 74552470 71537014 69522300 66881674 64501947
14220 64501947 62649582 60427084 58385734 56361990 54608798 52915974 51428156 50195739
14212 50195739 48538673 46758196 45492463 43963966 43228159 42060071 41384241 39756297
14204 39756297 38403616 37510590 36093474 35618205 35143476 33924834 32785243 31737112
14196 31737112 30879685 30527743 29659100 28964369 28311163 27361032 26972731 26031131 25577562
14187B5577562p93164k92549o19712n76585l83152l04024r77890m1088o75325
14178B0914073l84905k72264m82799m54493l01973o07365m94103l2515l42362
14169A7541294k82949k93813n69412J62666q41713j716Q87m68352m48599l09408
14159A4488885k63892k55273k02570j07814l80610o1872k88962l29928O925k03512
14149A2401377l79800j61442r1569k37508j23955J955k67266l6203l66653j65465
14139A0573471k33902l36515k53500N10782m26175l11441J82647k64439r6779
14130I344149j05197k72137j32003k43836J82582k00863j00245k03708l174n6466
14120H209102k81127j0009l02627p0474L68744l62791n01624J71650J1103j5911
$$ plain form
14187 25577562 24784398 24491849 23872137 23295552 22912400 22608376 21630486 21589398 20914073
14178 20914073 20529168 20256904 19774105 19319612 19017639 18410274 17916171 17883656 17541294
14169 17541294 17258345 16964532 16395120 16557786 15716073 15714357 15715244 15246892 14798293 14488885
14159 14488885 14224993 13969720 13767150 13659336 13278726 13216854 12927892 12597964 12604889 12401377
14149 12401377 12021577 11860135 11768566 11531058 11407103 11409058 11141792 11105589 10738936 10573471
14139 10573471 10339569 10003054 9749554 10260336 9834161 9522720 9705367 9440928 9344149
14130 9344149 9238952 8966815 8834812 8590976 8773558 8572695 8472450 8268742 8265568 8209102
14120 8209102 7927975 7917966 7615339 7544865 7913609 7550818 7049194 7220844 7231947 7216036
14110G216036j26540n64211J60421O8705K07131j50914p8388l65365j29643O5265
14100F302497k78768K23757k69510k64452K37690J21152k49371j6692j18214j04600
14090E583489J01696J6531l78774J83925j92085l9827j99019R0608l41327L78554
14080E203771m33793K82285N6399K8478j84825n62146N28965j47088j27224J46567
14070D791389l49724l37408j21788L61215P0743J43559k11866q314k33811J97393
14060D301388j8516k72591L21927Q039j53873k42601P091M9800n54329M79065
14050C925400k34727k94639K58244n0126k17841L38363k19775j77573j28641M08501
14040C607186n34050J74172l55669O62345l93654R7124J9091l83701P5049L26355
$$ plain form
14110 7216036 7089496 6525285 6685706 6754411 6961542 6810628 6732240 6366875 6237232 6302497
14100 6302497 6023729 6247486 5977976 5713524 5951214 6072366 5822995 5806303 5688089 5583489
14090 5583489 5685185 5701716 5322942 5506867 5314782 5274955 5075936 5166544 4825217 5203771
14080 5203771 4769978 5052263 5108662 5137140 4952315 4390169 4919134 4772046 4644822 4791389
14070 4791389 4441665 4104257 3982469 4343684 4414427 4557986 4346120 4337806 4103995 4301388
14060 4301388 4282872 4010281 4332208 4340247 4186374 3943773 3950864 4000664 3446335 3925400
14050 3925400 3690673 3396034 3654278 3604152 3386311 3724674 3504899 3327326 3198685 3607186
14040 3607186 3073136 3247308 2891639 3553984 3160330 3257454 3276545 2892844 2967893 3294248
14030C294248P8622j72123L24223n01998j86825O9683L03524k94134p8881j47126
14020B689213J44868k33364Q730J67717n6950q987j64054r2329M9708j58992K00922
14009B546482k23149Q5676K44538j31125j65418j90882L91838k04004k46522K19542
13999B326976j88526l4799j76056K04501O3877j62060J77413N28434l62671Q7063
13989B464152Q94499J797342O368631J8040732J8079715j7102341A4616999o162383
13981H454616k258427j275644p80434p45368j00561l88371L874k0075m14040K09842
13971B685412j35903j30758K45299p119k54071j28113j72495O4999K93042l89260
13961B071033j54872N6184L08120o39687L25908J67328j34953q3575l1733J6157
$$ plain form
14030 3294248 3372870 3200747 3524970 3022972 2836147 2905830 3209354 2915220 2836339 2689213
14020 2689213 2834081 2600717 2609447 2777164 2720214 2711227 2547173 2454844 2504552 2345560 2546482
14009 2546482 2323333 2409009 2653547 2522422 2357004 2166122 2557960 2353956 2107434 2326976
13999 2326976 2138450 2103651 1927595 2132096 2195973 2033913 2211326 2739760 2377089 2464152
13989 2464152 3358651 5155993 11524624 29565356 47645071 30542730 14616999 8454616
13981 8454616 6196189 4920545 4140111 3394743 3294182 2905811 2909685 2889610 2475570 2685412
13971 2685412 2549509 2418751 2664050 2656931 2402860 2274747 2102252 2167251 2460293 2071033
13961 2071033 1916161 1972345 2280465 1640778 1966686 2134014 1999061 1915486 1883753 1899910
13951A899910N3514M56831k77219l08070m6322J74704l4024j12122J14899L4207
13941A956308J61120n67786Q37758r5402l86387j36689J74700l28435K11218K60970
13931B087375k85290m2058J04491k94796P1187n0834J56259L9482j00002J84022
13921A869836j00748m4797r9316j7461Q0787J39221l81019J48592M5653j0671
13911A630077k10676k386L29734m07294l2539j93277L9689N01166j66090l60902
13901A127502R9348M16101j24314k06472Q6158r6550M00976o3333j69592j07642
13891A362182M2333l54683K66487k84507K87297M9948o8563K2425R5500l32883
13881A085536K6830k3695Q7708j49969K30569j44318K51583o0337l02189L66261
$$ plain form
13951 1899910 1953424 2410255 2133036 1824966 1778644 1953348 1919324 1807202 1922101 1956308
13941 1956308 2117428 1549642 2387400 2291998 1905611 1768922 1943622 1615187 1826405 2087375
13931 2087375 1802085 1760027 1864518 1569722 1640909 1590075 1746334 1785816 1685814 1869836
13921 1869836 1769088 1724291 1624975 1607514 1688301 1827522 1446503 1595095 1640748 1630077
13911 1630077 1419401 1417015 1746749 1339455 1306916 1113639 1153328 1654494 1488404 1127502
13901 1127502 1226850 1642951 1518637 1312165 1398323 1301773 1702749 1639416 1469824 1362182
13891 1362182 1404515 1049832 1316319 1031812 1319109 1369057 1300494 1322919 1418419 1085536
13881 1085536 1112366 1088671 1176379 1026410 1256979 1112661 1364244 1303907 1001718 1367979
13871A367979k91388R9148K2984Q8834l83252M30022l731n6067J02578F55068
13860A276990j01499k3565l24010O36836m31267J19839N9672P777j52728k03972
13850H64073J09740K79274k90481J45370k7158l68404M69997l57370L22744q0532
13840A067253m751k77632K24063J16961J26432m32514O28507l98355M05394n02943
13830I52415j84090J22422K95890k87549l74034M15027P9611k23172K46156k88719
13820G53957R6793j14817J01982L96363l22234m0002J96862l78413j9661J23712
13810G94542j23373K42351R2602j68154j03290K00180k03153p2020p1943L7389
13800F25131J08093R9728J33456C87785P6394K92794K45286n9108J36618l51875
$$ plain form
13871 1367979 1076591 1175739 1198723 1287557 904305 1334327 1330596 1274529 1377107 655068
13860 1276990 1175491 1151926 827916 1464752 1033485 1153324 1212996 1220773 1068045 864073
13850 864073 973813 1253087 962606 1107976 1080818 712414 1182411 825041 1147785 1067253
13840 1067253 1062502 784870 1008933 1125894 1252326 819812 1448319 1049964 1455358 952415
13830 952415 768325 890747 1186637 899088 525054 940081 1019692 796520 1042676 753957
13820 753957 850750 735933 837915 1234278 912044 872042 1068904 690491 670830 794542
13810 794542 671169 913520 1006122 837968 734678 934858 731705 659685 587742 625131
13800 625131 733224 832952 966408 387785 464179 756973 1002259 943151 1079769 727894
13790G27894J32015l43868N19412o3345L9264L2231k17344J35064k63387j11819
13780E86117L66231l37800N7454K40982R368k72921J63282r7092p25m1883P704
13769F80717J90334J75867k18993k03656J75141k07768K68807D00736M06388j8723
13759G88401j73732M6516R0829C25110N37564K813k22443O323j4119n1846P8614
13748F62016N3772j8562k80687L12132J9628K5770J64557m25605R6982K75750
13738H85753j48684j88069R6575K3844j51857K50485k62445K27865C60188J47339
13728E07527J32467k82634M29084j95951J16665r4758k81981M55373O9175k02755
13718F52212o0469K5694J89680N9589C49695J46057K18485j39455P4271J32445
$$ plain form
13790 727894 859909 516041 1035453 972108 1011372 1043603 826259 961323 697936 586117
13780 586117 952348 614548 672002 912984 922352 649431 812713 715621 714896 673013 680717
13769 680717 871051 1046918 827925 624269 799410 591642 860449 400736 807124 788401
13759 788401 614669 661185 752014 325110 862674 865487 643044 649367 635248 583402 662016
13748 662016 715788 697226 416539 728671 748299 774069 938626 513021 610003 885753
13738 885753 737069 549000 645575 669419 517562 768047 505602 733467 360188 507527
13728 507527 639994 357360 786444 590493 707158 612400 330419 785792 854967 652212
13718 652212 591743 617437 807117 866706 349695 495752 714237 574782 649053 781498
13708G81498r7685k84411p8361J94314j1978R5565n1595N2991m0750M24601m37944
13697E46245P4232J4430p864k16451P3020K47216l42191J66899k6988o3830L1656
13686D96374J22788j73298M3889Q4791B75922J74962L76542k06245B72962K42348
13676E15310j10935N7878q553j5490J95629j56601B37196K02933M9258C4098M07646
13665D41744L06493l37702r2477M94244j93737F2020P00012j76733k0830j38562
13655D25907n0476J73149j53361J42938B20787K45488P7713M709P4293q5956M2274
13644E79308p5700J7516j62973J13637j90483O8533J06400K33593L4221C30650
13633B42796L08137k18618R0757k10052K35032j70176Q57L6334K59258A96359
$$ plain form
13708 781498 683813 399402 321041 515355 503377 598942 547347 600338 559588 984189 546245
13697 546245 620477 634907 627043 410592 483612 730828 388637 555536 528548 464718 496374
13686 496374 619162 445864 489753 574544 275922 450884 827426 621181 272962 515310
13676 515310 404375 462253 453700 438210 633839 477238 237196 440129 489387 34098 441744
13665 441744 748237 410535 318058 812302 618565 62020 762032 585299 564469 425907
13655 425907 375431 548580 395219 538157 220787 466275 543988 548697 622990 537034 579308
13644 579308 503608 521124 358151 471788 281305 349838 456238 689831 724052 330650
13633 242796 550933 332315 423072 213020 448052 277876 278733 315067 574325 196359
13622E63630k06386j14968K61403j91768o8907L19385R5212q3578j00702J46883
13612F20204k0538B93985J44633j45232J34248P1677N8218q3806k32233J21529
13602C63019J24404B09151K60923k2366A22324K59685M1416A92273L99453k44214
13592C47512o4444p986K80659B01980J95072j62082J01833J33482j13867j40493
13582B15925k1945J95375A13285J55483R5729p2152N5614O0936j61234N2931O1163
13571C61755j79649O6541F2277M56466k37758C5302K14953f5301D89154j65491
13561C23663K6002j20552R4912j33031L2365J38507R3865C7824K86780j0794J3256
13550C27066J6185E5524K89012A48105L71003j07599N4514j00445j78053Q7897
$$ plain form
13622 563630 357244 242276 503679 311911 243004 562389 657601 574023 473321 620204
13612 620204 599666 293985 438618 293386 427634 499311 557529 473723 241490 363019
13602 363019 487423 209151 470074 447708 122324 382009 423425 192273 591726 347512
13592 347512 283068 275082 555741 201980 397052 234970 336803 470285 356418 215925
13582 215925 193980 389355 113285 268768 364497 292345 347959 408895 247661 300592 361755
13571 361755 182106 248647 62277 518743 280985 35302 250255 -65301 489154 323663
13561 323663 349665 229113 324025 190994 223359 361866 455731 37824 324604 313810 327066
13550 327066 343251 55524 344536 148105 519108 411509 466023 365578 187525 275422
13540B75422L69573A32547K02720p2060J01828j56447J10187K45788j18598A43111
13529b30316D24732p1086K40043B69405J99236L6096j80709j51552L92142k40112
13519C24506m1964m8521C4911Q8479K43064m2187A19257P1588D3352K95033k9809
13508C08576H1546L58101j96980J71582j92567K95522m6333M1184k41567j3783
13498B56705p3613J76176r3046q9833L68333k04745N344n4915A30447K25345o9792
13487B86000J16495j14087A42414K22117A10614L68921q8934A17477L36149B15428
13476D89671I4546J21340K70800B07611P6623k7057J6215J85049k17173r5705
13466A45563i826B75025L7011d1831B88931f1258D62143E8886j5018E90K5168
$$ plain form
13540 275422 644995 132547 335267 263207 365035 208588 318775 564563 445965 143111
13529 -230316 424732 353646 593689 269405 468641 504737 324028 172476 564618 324506
13519 324506 282542 234021 34911 123390 366454 324267 119257 190845 43352 338385 308576
13508 308576 81546 439647 242667 414249 221682 517204 470871 512055 270488 256705
13498 256705 183092 359268 266222 176389 544722 339977 345321 290406 130447 355792 286000
13487 286000 402495 288408 142414 364531 110614 479535 390601 117477 453626 215428
13476 489671 94546 215886 486686 207611 284234 257177 273392 458441 241268 145563
13466 145563 -9826 275025 312036 -41831 288931 -61258 462143 58886 43868 590 25758
13455B5758L85668J10085a08544B05125l6081J0776n4476Q8575K26269A87400
13444C92942B970K1808J91983L2118q532N6638A13308K1024K02628q3460j18348
13433A35152m6504R2742j3006m1324N52140I8747l2788d6864B66884q2808J45151
13422C29227A674J52747N28335B83223k1312J09166K3346j32826B9387i060C15724
13410B09128J8385A9264J81433K1192n3585K7831N526d3901B78408L0076A13216
13398G3725P9700K14829j05973J7094C2586J4695h688r4940m7347A93364J999
13387A95363L32867p6046A20632R3729Q2343n7356J29758a9790B60999J5521I9753
13375H073L67273h2234C67029Q0907A10949e243C24143j26128K12378A96833K3245
$$ plain form
13455 25758 411426 521511 -108544 205125 169044 179820 125344 213919 440188 187400
13444 392942 2970 24778 216761 248879 240347 296985 113308 134332 336960 253500 135152
13433 135152 88648 181390 168384 127060 679200 98747 65959 -46864 266884 184076 329227
13422 329227 1674 154421 682756 283223 261911 371077 394423 261597 29387 -9060 315724
13410 209128 227513 19264 200697 221889 168304 196135 201661 -43901 278408 308484 113216
13398 73725 153425 368254 262281 279375 32586 47281 -8688 -103628 -150975 193364 195363
13387 195363 528230 452184 120632 214361 296704 239348 369106 -19790 260999 276520 99753
13375 8073 375346 -82234 367029 447936 110949 -5243 324143 198015 410393 196833 220078
13364B20078K89174A52820f9430B00600K7322A04723K38685c6600C57356A00653
13353b31E57164A04721L18849k4756B9419L95581q7841L53252B37955k5331L30232
13342E42856j77311H2789M1696K9921L1728K31444N3777E2220d8331B78570i1633
13330A18930M2764M6500b68879B31897N2125A00787K36005E9193L46594q7601
13320C18186A09645e7336D61556a4169A15960J77155I8897L11783j1477A01227
13309D55547A25162n6555J10509k995J62447f2327F2686R5185A8291K80870q3635
13298B15526K71203A9970a11030F937J90055R5026A23682J34765k8697N5091j06452
13287A78389M2386k8704c70469f7892F9084J95453J39205b9007A27045M1509n7809
$$ plain form
13364 220078 509252 152820 -69430 200600 227922 104723 343408 -36600 357356 100653
13353 -231 557164 104721 423570 398814 29419 425000 337159 690411 237955 212624 542856
13342 542856 365545 82789 124485 154406 186134 417578 471355 52220 -48331 278570 -91633
13330 118930 161694 208194 -268879 231897 284022 100787 336792 59193 405787 318186
13320 318186 109645 -57336 461556 -14169 115960 293115 98897 410680 399203 101227
13309 455547 125162 68607 179116 176121 338568 -62327 62686 157871 18291 299161 215526
13298 215526 486729 19970 -111030 6937 196992 292018 123682 258447 229750 284841 178389
13287 178389 220775 192071 -370469 -67892 69084 264537 403742 -29007 127045 168554 110745
13276A10745K64340A60403j1825M02836j4706I9124a3390A57632p8472O4359a930
13264A77496A2932e4926m5612p6398C62577j50052H9583l7383j1323R2569K29048
13253C62494h2825j25796A13912L9825n3309a93440C82916a19038H9906a15522
13242i1529C61086p5276j31860c1408A73178R1963A21529F0532d3965k34071F0461
13230a27159D1953O6448M4594J0892M6439l2712B7750O6797K62023d6078C06639
13218a40510B63131p0983J01271D8307g8894A0136b7851B64616e1220H8309J38916
13207B27225f010E4912B4358M566J42809G7363R1850k8239f5244C43102e9443
13195A41945K34250F6736a76569j12167A8422P5297f9893B11782R2899n0152A9448
$$ plain form
13276 110745 375085 160403 148578 551414 536708 99124 -13390 157632 79160 143519 -1930
13264 177496 12932 -54926 -100538 -176936 362577 212525 89583 52200 40877 133446 362494
13253 362494 -82825 -208621 113912 153737 100428 -193440 382916 -119038 89906 -115522
13242 -91529 361086 285810 153950 -31408 173178 265141 121529 60532 -43965 -278036 60461
13230 -127159 41953 108401 152995 163887 210326 177614 27750 94547 356570 -46078 306639
13218 -140510 263131 192148 293419 48307 -78894 10136 -27851 264616 -51220 88309 227225
13207 227225 -6010 54912 24358 28924 171733 77363 169213 140974 -65244 343102 -59443
13195 141945 376195 66736 -176569 -288736 18422 93719 -69893 211782 304681 254529 19448
13183B82301i3154k05121A33529n4970P515K18004a28203A85348D0053a82908
13172e9657n8706C19764J39028A10043N1616J95332A20893a17278F0676J57043
13162B17719l8261J60935l2488K93923B39989l6072q8732g2147j31881i0260f652
13150f0330j27303C51756A35272A4638L16207r0503n7834p3092c819A35688m2323
13139I3365e629A88903R2669A40458Q2283a8989k8415j50463e0872B19587J28376
13128C47963B2092J01814a47067c1109l0745K8681l6457B90913P5609C9485O2405
13117A01890M8442Q0294j2686K74951B41318a08944B6666J65072J669J70086A31043
13105A7563R6934K02161j43336A0326B757P608b8437C62472A00682J78643j35854
$$ plain form
13183 282301 -93154 -298275 133529 78559 86074 304078 -128203 185348 40053 -182908
13172 -59657 -118363 319764 458792 110043 161659 356991 120893 -117278 60676 217719
13162 217719 179458 340393 307905 601828 239989 203917 115185 -72147 -204028 -90260 -6652
13150 -60330 -187633 351756 135272 14638 330845 240342 182508 109416 -3819 135688 93365
13139 93365 -5629 188903 281572 140458 222741 -18989 -47404 -197867 -50872 219587 347963
13128 347963 22092 123906 -147067 -31109 -61854 -33173 -69630 290913 366522 39485 101890
13117 101890 150332 230626 217940 492891 241318 -108944 26666 191738 193407 363493 131043
13105 17563 114497 316658 173322 10326 2757 10365 -28437 362472 100682 279325 143471
13094A43471E6811a92000g325C171J50870i7658j31279l9737B78086a80535G6037
13082h4670E6373g5018p7356B01437q9620a20723C10979K6019E9973A3008J30398
13071A43406K08281a37850N8837A81874A7428K15087j00351B9936J44984a37852
13060D25394j35714A39814J33898a7858H8815E770a8312A91430H0039K43484p8884
13049B44639A02345J2606a69607C23063j10880b2726E41a03830d6560E5932d8386
13037B24037a61220A66346o3881M5804l7561Q3986o7939J286L86718j48809A26843
13025D8518e2377A68700c398A62915J12049J55088A57595P41n7141R9332H1607
13013A28978C0438Q7692J3308e261A79141K2040I0036a55908b6480A99107q1062
$$ plain form
13094 143471 56811 -192000 -7325 3171 154041 -97658 -228937 -268674 278086 -180535 76037
13082 -84670 56373 -75018 -152374 201437 111817 -120723 310979 336998 59973 13008 143406
13071 143406 351687 -137850 -79013 181874 17428 232515 132164 29936 174920 -137852
13060 425394 289680 139814 273712 -17858 88815 5770 -18312 191430 80039 323523 244639
13049 244639 102345 114951 -169607 323063 212183 -22726 541 -103830 -46560 55932 -48386
13037 224037 -161220 166346 102465 148269 110708 194694 126755 128041 514759 365950 126843
13025 48518 -52377 168700 -3398 162915 274964 430052 157595 158336 101195 200527 81607
13013 128978 30438 118130 131438 -5261 179141 201181 90036 -155908 -26480 199107 118045
13002A18045K30766a4897I1565D5246O8915K9772Q7056E8468j8071b92907A0961
12990B07715q1237c33293f039A02406a2492A04972a22075a399B34947p2685C1707
12978A08250J4168a00989A16891b6802B22618f7048j34869P4670A96589I8271
12967h0425B54006a296A34427D2948i6197D29328c0908B11353m4180B0063L63893
12956C83956g7491o7009d6810C9546J5970L1127a18049B22122K66882b46676A45255
12944A83863K59820H6399a26792N5546B73583A04409b43686Q0166A24323K63536
12934C87859a07715A09582g1523B51655H1346n725R596Q5401b24712J3078Q6580
12923a25054B45431c6111A53676B6327j1887a03214D33474j72064A01291J10514
$$ plain form
13002 118045 348811 -14897 91565 45246 114161 143933 230989 58468 40397 -292907 10961
12990 207715 126478 -333293 -6039 102406 -12492 104972 -122075 -1399 234947 162262 31707
12978 108250 122418 -100989 116891 -26802 222618 -67048 -201917 -127247 196589 98271
12967 -80425 254006 -1296 134427 42948 -96197 429328 -30908 211353 167173 20063 383956
12956 383956 -77491 -144500 -46810 39546 55516 86643 -118049 222122 489004 -246676 145255
12944 183863 443683 86399 -126792 -71246 273583 104409 -243686 -163520 124323 387859
12934 387859 -107715 109582 -71523 251655 81346 75621 85217 170618 -224712 -211634 -125054
12923 -125054 245431 -36111 153676 26327 14440 -103214 433474 261410 101291 211805
12913B11805h7431E6425J58021E8357c19388A00902c0868A10991R2663l0831H109
12901e3386B15053j07005K54002g2062k9885p8365N3792G7379O07073A24334a8499
12889f1735n8209B15948a2352B55312D4099J4169N7259R0759q8710e1396B53265
12877a96013B1968N3407R2857A0738a61721a1157k76199B49436J28821j61219
12867B17038b49209B33075C3886b78814A33239a41328r2489B49825g6775c241
12856A71044b87404a09603I1025b2334j11753K5931a6832A72414a23147G6091
12845i530o597E684J78000k1157G3593B6836O9686a02521F496K0805a36328I4663
12832b91757d6451j59740R5071F6149a5343F7802A9570R2129j2836a81199D69194
$$ plain form
12913 211805 -87431 56425 214446 58357 -319388 100902 -30868 110991 203654 172823 8109
12901 -53386 215053 108048 362050 -72062 -101947 -180312 -126520 77379 684452 124334 -18499
12889 -61735 -119944 215948 -12352 255312 44099 58268 115527 206286 117576 -51396 253265
12877 -196013 21968 75375 168232 10738 -161721 -11157 -287356 249436 378257 217038
12867 217038 -249209 233075 33886 -278814 133239 -141328 -233817 249825 -76775 -3241
12856 171044 -287404 -109603 91025 -22334 -134087 -108156 -16832 172414 -123147 76091
12845 -9530 -16127 5684 183684 162527 73593 26836 96522 -102521 6496 27301 -136328 94663
12832 -291757 -46451 -206191 -111120 66149 -15343 67802 19570 111699 98863 -181199 469194
12820A39561L9431b78788c9906m4156A85980g523G7975M549l0330R9597E9239
12808C76055a15330C73101e045l8462E2731M388e3518A15183Q9633e0318j20021
12797a70339B2387a03049B02568a12996M0714B5675a12103j38971B03053e0051
12786F569b94165a2061B0955c04582C42851d3578A2509b77435a37776e6243B34744
12774a03090A32124b68655a19352B06831j3511M1070H2758K6811B1346N304N4425
12763H1075d5336C33052A3346J39850b3259C44588o1329a36087M1981d6181A88041
12751a81121A27285J2807L1799a90831I67K18793I1164l6711J97309I4751b37408
12739A58995a11386C61500i7387A24545K41249F8928a44236A93276l2042G186
$$ plain form
12820 139561 178992 -278788 -39906 -84062 185980 -7523 77975 82524 52194 151791 59239
12808 376055 -115330 373101 -5045 -43507 52731 57119 -53518 115183 204816 -50318 -170339
12797 -170339 22387 -103049 202568 -112996 -72282 25675 -112103 -251074 203053 -50051
12786 6569 -294165 -12061 20955 -304582 342851 -43578 12509 -277435 -137776 -56243 234744
12774 -103090 132124 -268655 -119352 206831 193320 234390 82758 109569 21346 26650 81075
12763 81075 -45336 333052 13346 153196 -23259 344588 283259 -136087 -94106 -46181 188041
12751 -181121 127285 140092 171891 -190831 967 219760 91164 54453 251762 94751 -237408
12739 158995 -111386 361500 -97387 124545 365794 68928 -144236 193276 161234 7186
12728F5717J22125E0360J28889k197B7519d2839C02647h8683D64462A41301J20581
12717B61882C0604d29774g0263B4056i2536k5887A1553L8109O9539J22606k8203
12706B13604b4008D45269A78876J07627J02716j66691r1699o2335N7611a7924
12695a701A11824d7741k6296A83052j8341K28990B9741e9889m6697M7913b3590
12683E7527J91673j5870g1749A35479J54063C0282K13518O6887a846B85379K7450
12672C12829d89888A49514a15246a6873A6787N5183J97398n2819M0020g5375C35361
12660B43254D4105K12136b6418F9390J56768a49220C2938a36919K1828A91826
12649a9286A90659j4491o6513E2026b56155B81497h5753l8512A77334q8601b93775
$$ plain form
12728 65717 187842 50360 179249 177052 27519 -42839 302647 -88683 464462 141301 261882
12717 261882 30604 -429774 -70263 24056 -92536 -118423 11553 49662 119201 241807 213604
12706 213604 -24008 445269 178876 286503 389219 222528 130829 68494 126105 -17924
12695 -1701 111824 -47741 -74037 183052 164711 393701 29741 -59889 -106586 -58673 -23590
12683 57527 249200 233330 -71749 135479 289542 30282 243800 310687 -1846 285379 312829
12672 312829 -489888 149514 -115246 -16873 16787 71970 269368 216549 256569 -75375 335361
12660 243254 44105 256241 -26418 69390 226158 -149220 32938 -136919 -115091 191826
12649 -19286 190659 176168 109655 52026 -256155 281497 -85753 -124265 177334 88733 -293775
12637A90202R6792i7417B98282d8519C00177r0451c1259E7592i7825B88887A38262
12625C58962A12046J05115j07828J59472a655A6778C371J00200l1809L1488a09679
12613h4393C9728d1195k3749C43925j55055b2265p1262l9443B42944a26601k14906
12602c41507C87497O1967A69314c3854F3582N2056O9727J59121h2745E9496K84453
12591C43949H7781C0429a50737H6874K64975E301k132J19804a02096b0439j71248
12580a91687N8538A04002A5495a25064M6494k41464g2802a7463D2689j1599b0504
12568a09383d9138A08527e982j02704A58605e2941r2044d5287j24636F1364M8837
12557A10201N4590b3066j38875e6786C73206c78433f7226o0508L9330C17776a69992
$$ plain form
12637 190202 286994 -97417 298282 -48519 300177 209726 -31259 57592 -97825 288887 138262
12625 358962 112046 217161 109333 268805 -1655 16778 3371 103571 71762 103250 -109679
12613 -84393 39728 -41195 -64944 343925 188870 -22265 -93527 -132970 242944 -126601 -341507
12602 -341507 387497 449464 169314 -33854 63582 115638 185365 344486 -82745 59496 343949
12591 343949 87781 30429 -150737 86874 351849 5301 3169 122973 -102096 -20439 -191687
12580 -191687 -133149 104002 15495 -125064 -78570 -320034 -72802 -17463 42689 31090 -20504
12568 -109383 -49138 108527 -5982 -108686 158605 -52941 -144985 -45287 -169923 61364 110201
12557 110201 164791 -23066 -161941 -56786 373206 -378433 -67226 -127734 -88404 317776 -169992
12545a70345A35557b0239I7123a35923F2319K16749j1232g431n9443Q775a667
12533A74079b59418M9806i1654l8186A10422k1552J99086a12299o54905g6670
12522D6675J09290A1227a545m20262J25457b4925l05991a4869C74212A44799J04070
12511B48869J92118a0669A32950b37404A10163b8874A75934b90342C30425G5736
12500H8185d1514D5776a15980B70399b39044D0259N8179M1824c8344H9452a56175
12488a5460B23022n8836A4384Q7340b08659A30736l4355N0381b7121j8350G9878
12476b14608H3584b1139j90445G9740K05184r5450l9454A0404f7983j55952C0512
12464b64039C13483r2752e6256A22885b07519A1552c98007A65553g7888B98114
$$ plain form
12545 -170345 135557 -20239 97123 -135923 62319 279068 267836 -7431 -66874 -58099 -1667
12533 174079 -259418 -209612 -91654 -129840 110422 88870 287956 -112299 -767204 -76670
12522 46675 155965 11227 -1545 -421807 -296350 -24925 -330916 -14869 374212 144799 248869
12511 248869 440987 -10669 132950 -237404 110163 -28874 175934 -290342 330425 75736
12500 88185 -41514 45776 -115980 270399 -239044 40259 98438 140262 -38344 89452 -156175
12488 -15460 223022 164186 14384 101724 -208659 130736 96381 146762 -27121 -45471 79878
12476 -214608 83584 -21139 -211584 79740 284924 189474 150020 10404 -67983 -223935 30512
12464 -264039 313483 220731 -56256 122885 -207519 11552 -398007 165553 -77888 298114
12453G6472B4002c24489J30708d9708i058j69996A02872a19250K8928D6449R4701
12442A41150j9637a81354p9042R2069j8847e1937a4482C5574J59857N3079J6995
12431B65505j20509a62974G4129D30K6297K14463h795j11172A23356d237B33203
12419A02029P4247K6162G79a67431e1368B2039a53612Q340A8551c6928E9154a73917
12406a82657h5847A86203m7047J25139A342L1153K52209c56813A85641B6479f0119
12394A19883a4320A93114c05098g2026J3454k05335c0572D7282K86293e7246H5316
12382f5514k01154a24739c0419l06232D9716L82313G8452a08766h52A7002P728
12371B4730b71297C45421A6861d69368b28144D9643L4153M4734J00232K2038A08657
$$ plain form
12453 76472 24002 -324489 -193781 -49708 -9058 -179054 102872 -119250 -90322 46449 141150
12442 141150 121513 -181354 -260396 -168327 -187174 -51937 -14482 35574 195431 248510 265505
12431 265505 144996 -162974 74129 430 26727 241190 -8795 -119967 123356 -4237 233203
12419 102029 176276 202438 779 -167431 -51368 22039 -153612 -145272 18551 -36928 59154 -173917
12406 -182657 -85847 186203 139156 264295 1342 32495 284704 -356813 185641 26479 -60119
12394 119883 -14320 193114 -305098 -72026 -58572 -263907 -30572 47282 333575 -57246 85316
12382 -65514 -266668 -124739 -30419 -336651 49716 432029 78452 -108766 -852 17002 24730
12371 24730 -271297 345421 16861 -469368 -228144 49643 83796 128530 228762 250800 108657
12359a58592A8122L33575A9636b37269j29390c9888j56929l8839A57d2381H0978
12347A36929b86683a15776B1127c08841B02848a23009M1113o822b7898p6440j0284
12336a14622B04152b08461A34139h4008B97079M7033H2329a76373H6110R5873
12326A81983j1062g8578q83D5256a05293D7871i1429k6817N3557A69257b02446
12314c49016A52970m1742N8853b81174A7810P4624a8603j74188A27191d5170j3466
12303e8636C8977e0858G8904B1144a19282C1214c2374j47323B28050a14829C04328
12291C19984m3246b15517A57383D221L22020j47442G7353K40041a66415l36032
12281e02447B29522D4628e6096B11926h6851A00833A8736J2303L0564J71846a56733
$$ plain form
12359 -158592 18122 351697 19636 -237269 -366659 -39888 -196817 -235656 157 -42381 80978
12347 136929 -286683 -115776 21127 -308841 202848 -123009 -81896 -88718 -27898 -104338 -114622
12336 -114622 204152 -208461 134139 -84008 297079 344112 82329 -176373 86110 181983
12326 181983 170921 -78578 -79461 45256 -105293 47871 -91429 -118246 -64689 169257 -202446
12314 -349016 152970 111228 170081 -281174 17810 92434 -18603 -192791 127191 -45170 -58636
12303 -58636 38977 -50858 78904 21144 -119282 31214 -32374 -179697 228050 -114829 304328
12291 319984 276738 -215517 157383 4221 326241 178799 77353 317394 -166415 -502447
12281 -502447 229522 44628 -56096 211926 -86851 100833 18736 31039 61603 233449 -156733
12269i6113B18468j01662E7932b5487B37573k8420r9497J2921K3086g9557H4086
12257H6237n448J0703a13625A86943a15222B26759B3384g3479B31979A6612c1006
12245B37124J74711g251D8587g957k746A61536E1183K8341N527i7940j37055B53919
12232I7431K27408F0758j067K18151H7364K55936a60716B62495i6374A26347D3152
12220B51375K8987j20138J04093p5072o6674L81344A00706N9569k073m6940a72687
12208C45837b33330A81879f1578F0890J30972l9037K58160m9793B8153K20201
12198B48354p0169n5383J48709A3450J18414m564e7444D22288a91808B28219A00276
12186E1705a00032N748I5670K00028E7821P4774C2149K90256F1003P4063n8547
$$ plain form
12269 -96113 218468 116806 57932 -25487 237573 209153 109656 122577 145663 -79557 84086
12257 86237 80789 91492 -113625 186943 -115222 226759 23384 -73479 231979 16612 -31006
12245 237124 411835 -7251 48587 -7957 -10703 161536 51183 79524 85051 -97940 -234995 253919
12232 97431 324839 60758 59691 277842 87364 343300 -160716 262495 -96374 126347 43152
12220 251375 280362 160224 264317 189245 122571 503915 100706 160275 158202 111262 -172687
12208 345837 -233330 181879 -61578 60890 191862 152825 410985 361192 28153 248354
12198 248354 178185 122802 271511 13450 131864 127300 -57444 422288 -191808 228219 100276
12186 51705 -100032 -94284 95670 295698 57821 132595 32149 322405 61003 135066 76519
12175G6519K08182E8843P194J61607i9517B05074l0618o7478L3907K05198A17596
12163b81486C03615j1657j43933b771k008j96765F2811B5993b76988A60585b6627
12151A88273O2343j08918D0195g577B15503h0868o8750B2526a30562L7584A68557
12139E8764J79765B982J30081J5011C5278b3282A99190a12277A10567b29875A57481
12127a41722B07102a85693D856Q8522J19285a42948B32098b9783C6038P1409N9719
12116A67166a76020E876c54270a6059k6146G1912N4513A0261J09407a33591F2883
12104a37451j653B37891c2974A70532b87805L2061d21k64403E2867J94583H4876
12092c1212A74404E8494i2689B49063D5502J1662J2372Q3993a46186B55426I9920
$$ plain form
12175 76519 284701 58843 66037 227644 -99517 205074 174456 106978 140885 346083 117596
12163 -281486 303615 291958 148025 -2771 -4779 -201544 62811 25993 -276988 160585 -26627
12151 188273 250616 141698 40195 -7577 215503 -80868 -149618 22526 -130562 -92978 168557
12139 58764 238529 2982 133063 148074 35278 -23282 199190 -112277 110567 -229875 157481
12127 -141722 207102 -185693 4856 93378 212663 -142948 232098 -29783 36038 107447 167166
12116 167166 -176020 5876 -354270 -16059 -42205 71912 126425 10261 119668 -133591 62883
12104 -137451 -139104 237891 -32974 170532 -287805 -255744 -421 -264824 52867 247450 84876
12092 -31212 174404 58494 -92689 249063 45502 57164 69536 153529 -146186 255426 99920
12080C10843f4190j19262F18370R36686O33855F43351k71765A38477a94626I6193
12069A39891f6493F4161d6981j97168B46465b0753k69475D3871a984C3602J83545
12058B17147j07140b20762B37121c1007B32728a41737B09522a04001D2820M9873
12048I2693c3315G8216N9077a76440g6064k4583M4744l68165a46571C8899a32705
12036D1706b3543j64277g2472j74741h9306k3211j46403E3030K01081a01351o6601
12025a67952B12223F7102c67475a29884E4434d616p1678A0267P4220J89663O3327
12014C37477G3628c4550q3865d3792b0034j16023A11214f653H2877g351A56360
12002I7669d19689E2892D238h6005k78544P5675A00724c70196E2977P8203O5523
$$ plain form
12080 310843 -64190 -183452 618370 1555056 2188911 643351 371586 138477 -194626 96193
12069 139891 -66493 64161 -46981 -244149 246465 -20753 -290228 43871 -1984 33602 217147
12058 217147 110007 -220762 237121 -31007 232728 -141737 209522 -104001 42820 92693
12048 92693 -33315 78216 137293 -176440 -76064 -100647 -55903 -424068 -146571 38899 -132705
12036 41706 -23543 -187820 -72472 -247213 -89306 -112517 -258920 53030 254111 -101351 -167952
12025 -167952 212223 67102 -367475 -129884 54434 -4616 -76294 10267 84487 274150 337477
12014 337477 73628 -34550 -118415 -43792 -20034 -136057 111214 -6653 82877 -7351 156360
12002 97669 -419689 52892 4238 -86005 -364549 -288874 100724 -370196 52977 131180 196703
11991A96703a26444A88040B3273b12670J1678A38451K1372f7214j09139q7821
11981b64174C98819A59806a83980e8266F0965K0228J545d5954A67261a85007A69231
11969h8831c9563G7891N6703c9617k18585j31000g8814l8881j13640A44839l1943
11958A12896f9610m338D14820j17132a96754R3136H5101i026C93291e6512r7928
11947a54440m9364P5494f546j7078A5552P7171P2114C3045L6468J12107O7016
11936B48636b50623h0643A98350c90027B10014b58915B76462b27333Q99a13082
11925i1266b4949j99749A87899a42838A47612A6473b79168J24917Q072k64526
11915d10705e4623C38985a83330A7957f4051k42033H1053K70031G1640a55721
$$ plain form
11991 196703 -126444 188040 23273 -212670 -200992 138451 159823 -67214 -176353 -264174
11981 -264174 398819 159806 -183980 -58266 60965 81193 82738 -45954 167261 -185007 169231
11969 -88831 -39563 77891 134594 -39617 -258202 -389202 -78814 -117695 -231335 144839 112896
11958 112896 -69610 -73948 414820 297688 -196754 -103618 85101 -9026 393291 -56512 -154440
11947 -154440 -203804 -128310 -6546 -23624 15552 92723 164837 33045 69513 181620 248636
11936 248636 -250623 -80643 198350 -390027 210014 -258915 276462 -227333 -226434 -113082
11925 -91266 -24949 -224698 187899 -142838 147612 16473 -279168 -154251 -146179 -410705
11915 -410705 -54623 338985 -183330 17957 -64051 -306084 81053 351084 71640 -155721
11904A67722n9054a9939A26037N2074a47651A72739E2922b3233n7629l61119i3838
11892I5360N7387o2761a23347j16644Q9882b7813C84937a52353j46619A1914J19708
11881A31622a31641d685B46J36188a25837a1943A45505e5319l13477A73431b42769
11869a60502j07403R8122H7611i5370k08013e1169k72388P7981D2979d9111A41492
11857A58390J20302f4417A33898C2330a97541H6221j5999a48968M4503k468q6085
11846a93018F306L29205j45087k8274c17280c04k57324D04461a13517F9544a27070
11834b78198c5566B75984b9702A23021I429a53060d2315B91023F0511a46272M3261
11823a03011A87018g9431k4952B3888I947a10179A2758J90333a26946k4370A41598
$$ plain form
11904 167722 108668 -19939 126037 178111 -147651 172739 52922 -23233 -80862 -441981 -93838
11892 95360 152747 89986 -123347 -239991 -150109 -27813 384937 -152353 -298972 11914 131622
11881 131622 -131641 -4685 246 136434 -125837 -11943 145505 -55319 -368796 173431 -242769
11869 -160502 -267905 -169783 87611 -95370 -303383 -51169 -323557 -245576 42979 -49111 141492
11857 158390 278692 -64417 133898 32330 -197541 86221 70222 -148968 -104465 -106933 -193018
11846 -193018 6306 335511 190424 162150 -317280 -304 -257628 404461 -113517 69544 -127070
11834 -278198 -35566 275984 -29702 123021 9429 -153060 -42315 291023 60511 -146272 -103011
11823 -103011 187018 -79431 -104383 23888 9947 -110179 12758 203091 -126946 -151316 141598
11811b61388A95148f4652K2302n9942j24041A54698a11410e5129k18197a7781
11800d2319j42441A98857c76308a18956A97112c04330A63235o3803P5525H2572
11789a07679A9660a18373B67939A30394h5120A65896b62896g1597F582a98832
11778b25714h0659D9324b74246A24329Q9379i5687I4555a51771j29607f098B04242
11766c4440a2660p8623o0768e8227k33303H307N5887f4829F3312O4856d9866E8705
11753a04737A0067L005J08969M2026l4411d2212j87171E7957O9311J11066a93772
11741e27631B77891a34455E7800K3961K2362a16364m9447N4014A82404a25845
11730A68393H0193b5604m8050b655j6938k01675a3657A08049j1978i8192I6633
$$ plain form
11811 -261388 195148 -64652 -42350 -102292 -226333 154698 -111410 -55129 -273326 -17781
11800 -42319 -184760 198857 -376308 -118956 197112 -304330 163235 99432 174957 82572
11789 -107679 19660 -118373 267939 130394 -85120 165896 -262896 -71597 6582 -198832
11778 -225714 -80659 49324 -274246 124329 213708 -95687 94555 -151771 -281378 -6098 204242
11766 -34440 -12660 -91283 -152051 -58227 -291530 8307 64194 -64829 63312 128168 -49866 58705
11753 -104737 10067 13072 122041 164067 129656 -42212 -229383 57957 127268 238334 -193772
11741 -527631 277891 -134455 57800 81761 104123 -116364 -165811 -111797 182404 -125845
11730 168393 80193 -25604 -73654 -2655 -19593 -221268 -13657 108049 96071 -98192 96633
11718c8541D27998B18J98873a05705D4131c9745H1546J04179o3426b31123C83488
11706c6333E9659J40564l0842D5004J93907a18033D4665K07821I0498J01892b5974
11694a71326o9425b9404D59877a62872P1891c8570C6670J33039e107E8108c9137
11682d14023a08915A37736l7356Q8071o8013N8147J21576a6814j2797B83072D7446
11670i0636B38166a35191I6508c54163A05870l4036R876L49728f1733m2440r3494
11659a97667d9965k73153f6234j6067e110j21202A15664C2409J23100J12730b3279
11647b06484A34312d5609j20001A10921m1542P3602c63183C8178d1173k17132
11637b58305A06114a7806B68706P6604a25810B04867m9852a05488K2779B31810
$$ plain form
11718 -38541 427998 218 199091 -105705 44131 -39745 81546 185725 122299 -231123 383488
11706 -36333 59659 200223 169381 45004 238911 -118033 44665 252486 90498 192390 -25974
11694 -171326 -240751 -29404 459877 -162872 -90981 -38570 36670 169709 -5107 58108 -39137
11682 -414023 -108915 137736 100380 188451 120438 178585 300161 -16814 -29611 283072 47446
11670 -90636 238166 -135191 96508 -354163 105870 71834 81710 431438 -61733 -104173 -197667
11659 -197667 -49965 -323118 -66234 -82301 -5110 -126312 115664 32409 155509 268239 -23279
11647 -206484 134312 -45609 -165610 110921 69379 142981 -363183 38178 -41173 -258305
11637 -258305 106114 -17806 268706 345310 -125810 204867 155015 -105488 -82709 231810
11626F6481J11126J57169k1916c9125A98200a12668p2921k2025L7971G2709A7439
11614A19827d9490E7078a88880A68237q0585O2727I774J64840b68755L7491K8617
11603b02647E3195b24661K155F6176O615b29230B17172a74099A53924l658m0029
11592A10237J15888D1307J9944a94026B5968K49938I6594P8481J79434j26457
11582B28052J40834j44572l7106e1455D8988a03328G2089J72820q9690a28128
11571a45709E75047E3286a57048A2336b28351C3185J41676a21874A30470J52787
11561B83257i2341A55002J18429F6459a21820K7507B55252D4352a26771b9833
11550c4691B4687O3925I767N2888d5252C21964A08130L51831i6719A2968J09645
$$ plain form
11626 66481 177607 334776 312860 -39125 198200 -112668 -185589 -207614 -169643 72709 17439
11614 119827 -49490 57078 -188880 168237 87652 150379 9774 174614 -268755 -231264 -202647
11603 -202647 53195 -224661 -222506 66176 72791 -229230 217172 -174099 153924 150266 110237
11592 110237 226125 41307 61251 -194026 25968 275906 96594 175075 354509 228052
11582 228052 368886 224314 187208 -51455 48988 -103328 72089 244909 155219 -128128
11571 -145709 575047 53286 -157048 12336 -228351 33185 174861 -121874 130470 283257
11561 283257 -92341 155002 273431 66459 -121820 -94313 255252 44352 -126771 -29833
11550 -34691 24687 88612 9767 62655 -45252 321964 108130 459961 -96719 12968 122613
11539A22613N967b34048C42868f0871m3018B25717C3151c9690m6620E9080a64054
11527A98954a2365A16932b60099a27216B25963p8444D4405J29553g1990A62007
11516A7569a53031k26199E7519L84279A35229K50945f8984A37451l2031J6177
11506A21597j5970g3566B51470f410q3505B10256p5733J23348A14294J84621H3764
11494F0928j9277K69399a39285k36660I4322l3306a32791B84428B4809K5137A696
11482a38371b0717B62132p4590p6616N6364c7881C57306A38092J3284O4032J03536
11471C18944i4966B7838J05845J88199A35924L9546a12092B46378j06006i8783
11460D9822J94558E3522k805J45579A1964a83376B32499G5594A3720J40869g286
$$ plain form
11539 122613 128580 -234048 342868 -60871 -103889 225717 33151 -39690 -86310 59080 -164054
11527 198954 -12365 116932 -260099 -127216 225963 147519 44405 173958 -71990 162007
11516 17569 -153031 -379230 57519 441798 135229 386174 -68984 137451 105420 121597
11506 121597 105627 -73566 251470 -6410 -89915 210256 134523 257871 114294 298915 83764
11494 60928 41651 311050 -139285 -375945 94322 61016 -132791 284428 24809 49946 1696
11482 -138371 -20717 262132 187542 110926 167290 -37881 357306 138092 151376 215408 318944
11471 318944 -94966 27838 133683 321882 135924 175470 -112092 246378 140372 -98783
11460 49822 244380 53522 50717 196296 11964 -183376 232499 75594 13720 154589 -7286
11448a81040D692N5557m330j9731J26609J91786C6170P2673K6149K52788c9489
11436A3761i4088A91772L1958b54094g7668b442p6673A82221b28125K5288A78822
11424A48282n8604b26946N8362H2987K62142b22739B60494J34276b95251g73j45258
11413a46031l8338B67728c4972j29133d260A15521M1929a645G2253i9344a0595
11401B23819N1346c43211A82781n479p359q293i3673A50142k4987d2867q2639
11390a25506k62963B4219c5917j22847d4325k0779F4359k1479f3519C08808j31104
11379A77704q6645J33302a6350C32112g6667A18939a11897A62742m1444b64408
11368b55818I8536C6744D605K20677m620K7873f0918q069j39662k9067e1105k5292
$$ plain form
11448 -181040 4692 60249 55919 36188 162797 354583 36170 108843 134992 387780 -39489
11436 13761 -94088 191772 223730 -254094 -77668 -2442 -79115 182221 -228125 -202837 178822
11424 148282 89678 -226946 -168584 82987 345129 -222739 260494 394770 -295251 -773 -146031
11413 -146031 -184369 267728 -34972 -164105 -4260 115521 157450 -1645 72253 -99344 -10595
11401 223819 275165 -343211 182781 177302 169943 161650 -93673 150142 125155 -42867 -125506
11390 -125506 -388469 24219 -35917 -158764 -44325 -65104 64359 42880 -63519 308808 177704
11379 177704 91059 224361 -16350 332112 -76667 118939 -111897 162742 121298 -264408
11368 -255818 98536 36744 4605 225282 220662 248535 -60918 -68987 -208649 -237716 -51105 -76397
11356g6397A39396n8466b4711M045k25010h2038j58913B93596q8132O0997G068
11344b4967l7787j14168A93465b12235A46722k9042J62176k8791d36044B36460
11333g2453A80595k180d1711j06227B1834g3762j05366D72316j97222a41042O3818
11322g7224a4631G0758j6583J48223J3494F6516K06708a39019L1423C7072f7926
11310G8539A0777L11568b67170g6379B5462a64359I6238b29499E3740g722A83724
11298h2546G0345a88095b9463j41562Q595j76958e6946A91666c02446a27136O598
11287a20538l8767C0742L30224A7463a33384a7441j49213p8371c3556l22591B095
11275b76369e7727j0676A35609d410E8313R2540n6492f6951A44931n8167a27577
$$ plain form
11356 -76397 139396 80930 -24711 -20666 -245676 -82038 -240951 293596 205464 266461 7068
11344 -24967 -62754 -176922 193465 -212235 146722 117680 279856 251065 -436044 236460
11333 -72453 180595 178415 -41711 -147938 21834 -73762 -179128 472316 275094 -141042 -77224
11322 -77224 -14631 70758 54175 202398 215892 66516 273224 -139019 -107596 37072 -67926
11310 78539 10777 322345 -267170 -76379 25462 -164359 96238 -229499 53740 -7722 183724
11298 -82546 70345 -188095 -29463 -171025 -162430 -339388 -56946 191666 -302446 -127136 -120538
11287 -120538 -159305 30742 360966 17463 -133384 -17441 -166654 -245025 -33556 -356147 2095
11275 -276369 -57727 -68403 135609 -4410 58313 150853 94361 -66951 144931 86764 -127577
11263B43667c08302A55825B4356h0899I5184N4939e3579B43197H6223H646B518
11251b11279P1593K4050g294A90617E054J91775D9586e0859C22028c05132a40059
11239c29553E4466b94359A43791p1244K75493n514A36755m6220B0348J61715g7105
11227A02338c1974A52976b390F3600f279r0295o1761A15579b81407A87549e21261
11215B82310A26257b19846L776c1083o145J1158A6216c96237H2788j8489i6242
11203c18416M2377B67814c36950N1216O5574l0957e5447A74216b85193a5478j51479
11192a66957A58640b3683j23082J9988j91129N5203G6258i0176A06850b15935
11181B25373E9440h1501o871D3509K2448a542k24347c0958A12330a17715A51137
$$ plain form
11263 243667 -308302 155825 24356 -80899 95184 150123 -53579 243197 86223 8646 2518
11251 -211279 -139686 -115636 -7294 190617 5054 196829 49586 -50859 322028 -305132 -140059
11239 -329553 54466 -294359 143791 72547 348040 342526 136755 90535 20348 182063 -77105
11227 102338 -31974 152976 -2390 63600 -6279 -96574 -158335 115579 -281407 187549 -521261
11215 282310 126257 -219846 -216070 -31083 -37228 -26070 16216 -396237 82788 64299 -96242
11203 -318416 -276039 267814 -336950 -285734 -220160 -251117 -55447 174216 -285193 -15478 -166957
11192 -166957 158640 -23683 -146765 -126777 -317906 -262703 76258 -90176 106850 -215935
11181 225373 59440 -81501 -88372 43509 65957 -1542 -225889 -30958 112330 -117715 151137
11169g7774B40584a11867l18698B5008h4121c7680e261j46268A03188e7668A9209
11157b36540B17200h2595q4134d9926F1469h3770A58064B499Q6106d13447e5151
11145a71747M051P3639J5216C3239a61147D9149b27795E397Q8202N331L28923
11134D27853A82487B3554J0348b2273l95041N293G1059K2534b50374A36970g267
11122b2461C77613a9085n8569l3676b5485C55923A62039b41591f7154a6132k30853
11111b46985c9118q6659M6691A89076a21008E9204K97007g056E06074k22138G6010
11099B90569k5843j31356N6352J63996a5344k7128j17247A16069P5866n0403C7734
11087D32230A33921L93448G167L15338j15504H0395R6101L277B4496M3059J72504
$$ plain form
11169 -77774 240584 -111867 -430565 25008 -84121 -37680 -5261 -151529 103188 -57668 19209
11157 -236540 217200 -82595 -166729 -49926 61469 -83770 158064 2499 88605 -413447 -55151
11145 -171747 -167696 -94057 -78841 33239 -161147 49149 -227795 5397 93599 98930 427853
11134 427853 182487 23554 33902 -22273 -417314 -412021 71059 93593 -250374 136970 -7267
11122 -22461 377613 -19085 -77654 -111330 -25485 355923 162039 -241591 -67154 -16132 -246985
11111 -246985 -39118 -125777 -79086 189076 -121008 59204 356211 -7056 506074 283936 76010
11099 290569 264726 133370 189722 353718 -15344 -42472 -159719 116069 191935 141532 37734
11087 432230 133921 527369 7167 322505 207001 80395 176496 179773 24496 67555 240059
11076B40059O2990J25570J16225A95790F4086A4062L77936i4373B27502J51084
11066C78586n8145L89667k96916j95694A00307K53671J67992k11632J50648R8295
11056E59281M8417J82507k32343r1086J35361P91309F29092K37143l81377J53893
11046F38751j74437O4729M66026l25675J17191j24885K87496D20681O04925j78186
11036H47420k24010n6983k5373l3664R971J37966j73437J03166J1783l8557J91707
11025G49989B87227L65356n4002j58766J11166L84497l28279j27458m0510q1617
11015C57614L51774K0122n2069K13496m07949L61185k52185j48799L77561C92652
11004F39199j64520K99393q1889B80063J80398M11933j40412J16113j91230k98630
$$ plain form
11076 240059 303049 428619 544844 195790 64086 14062 391998 -94373 227502 378586
11066 378586 320441 710108 413192 217498 100307 353978 521970 310338 460986 559281
11056 559281 607698 790205 557862 466776 602137 1393446 629092 866235 484858 638751
11046 638751 464314 529043 995069 669394 786585 661700 949196 420681 1025606 847420
11036 847420 623410 566427 541054 507390 517361 655327 481890 585056 596839 558282 749989
11025 749989 287227 652583 598581 439815 550981 935478 607199 479741 439231 357614
11015 357614 709388 729510 677441 890937 482988 844173 591988 443189 820750 392652
11004 639199 474679 774072 692183 280063 460461 872394 731982 848095 656865 358235
10994C58235O15588l58325k9054K51728j63331n2605R8901j65919J17254J86289
10984H58761j26572K95782K49298k78462j09373J75705j18549Q35357m81199O35898
10974A936646J57766L69472j92449K73844K41193m30458J55227j95339l01463
10965B014439l5575k61662M3311k10553k7373M31613k44808J48877l18570J87936
10955A727635O0963m63031J94090l23915l76178K59005l40759J06195k29852k68734
10945C45419J30786j35807K27875B52055J48834m7946m3452q285j06883n1210
10935A43113Q1782H3736e9339H1488J93053a44698A36937J9774m1579P0K7859
10924A43061a45205I5672C210f3641J3799A15890h8513A25046J99328A51743p3808
$$ plain form
10994 358235 973823 615498 586444 838172 674841 622236 721137 555218 672472 858761
10984 858761 732189 1027971 1277269 998807 889434 1065139 946590 1781947 1300748 1936646
10974 1936646 2094412 2463884 2271435 2545279 2786472 2356014 2511241 2315902 2014439
10965 2014439 1978864 1717202 1760513 1549960 1522587 1954200 1709392 1858269 1539699 1727635
10955 1727635 1788598 1325567 1519657 1195742 819564 1078569 737810 844005 614153 345419
10945 345419 476205 340398 568273 252055 400889 352943 309491 301206 194323 143113
10935 143113 224895 83736 -59339 81488 274541 -144698 136937 156711 115132 115202 143061
10924 143061 -145205 95672 3210 -63641 -49842 115890 -88513 125046 324374 151743 77935
10913G7935i7271A33004h2339K6846A82200G8135e9281j18027A55304F8880L8582
10902A07462A5062a21231l22353a14759A98963b98244h1851A33260d7161J9961
10892b7200r599A01341d8047j67628A42914a03635B53260a20744e0160j70790
10882b20950A06341N8452a39053j685A16383K4874b91830B243K4961a99549n8572
10871b58121I5334L1366O0877h696I6632K45058m1944i0699C03585b3395D6849
10859H492K60117d2718n6933p0689J752j0347j7210n5692h6490b9170D18202b3191
10846C8894h4949l4608L5551p4123e7683a6501D4395a94796h3274n4076B1473
10834g3255k52416B3751L4698K81003d75792C26514n6505A17849c34011c4268
$$ plain form
10913 77935 -97271 133004 -82339 -55493 182200 78135 -59281 -177308 155304 68880 107462
10902 107462 15062 -121231 -443584 -114759 198963 -298244 -81851 133260 -47161 -27200
10892 -27200 -36799 101341 -48047 -215675 142914 -103635 253260 -120744 -50160 -220950
10882 -220950 106341 164793 -139053 -140738 116383 141257 -291830 2243 27204 -199549 -258121
10871 -258121 95334 126700 187577 -8696 96632 341690 299746 -90699 303585 -23395 46849
10859 8492 268609 -42718 -99651 -170340 -168588 -178935 -196145 -251837 -86490 -29170 418202 -23191
10846 38894 -84949 -119557 -84006 -158129 -57683 -16501 44395 -194796 -83274 -137350 21473
10834 -73255 -325671 23751 58449 339452 -475792 326514 270009 117849 -334011 -34268
10823A19372D3818b0323j41802h2A82394f5963A22678D2753L07171b9340k34340
10812b63680a12830A1724a28358K6768B95244a29737D3021c02062J37475f4717
10801a88039E258J42104K061c74879A05285a6161C17337c2956C43865b5128L316
10790b1812j85785A05504J86888C5369J1166b43941A60657b0623k10544a08836
10779a34873J7891j66748I8181b37752g9292A47713b53714C8556M837O6992O0190
10768A70575q0318d9541k17092J03195B11524g6631k17185f8505l81219F0361
10757c15382A82209a13644k35g895l2991j57363A28576G450g5906B6854h6391
10745B4728L84723a486D14488d9268r1053j10915F2606b05191C2162i5687p7892
$$ plain form
10823 119372 43818 -20323 -162125 -82 182394 -65963 122678 42753 349924 -29340 -263680
10812 -263680 -112830 11724 -128358 -101590 295244 -129737 43021 -302062 -164587 -64717
10801 -188039 5258 147362 149423 -374879 105285 -16161 317337 -32956 343865 -25128 -21812
10790 -21812 -207597 105504 292392 35369 46535 -243941 160657 -20623 -231167 -108836
10779 -134873 -116982 -283730 98181 -237752 -79292 147713 -253714 38556 43393 110385 170575
10768 170575 90257 -49541 -266633 -163438 211524 -76631 -293816 -68505 -449724 60361
10757 -315382 182209 -113644 -113879 -7895 -40886 -198249 128576 7450 -75906 26854 -86391
10745 24728 409451 -1486 414488 -49268 -140321 -251236 62606 -205191 32162 -95687 -173579
10734a73579h3040n7312F0251J83281A11951D7395L8468a452k16223K2348A05949
10722B01598l4781b08902C1362Q5672e73299a95974A85300M5765f6600B08861
10711b25489h4759a7034o2078F901i379r7456j93731a32730A87406M0378i2890
10699A97254c14431b0250j77490d0099m6934p7238A78097C0304a36322M551j82998
10688c14769E2005R784f8244C8350N7573j0891c82145J23972J8952c5414k67827
10677c03241N5859e6784A4925b82140e541j4889o5130c2989p7267K4493A9162
10665A77814f3985A5243L945c1523a2665A71421A3683J06026D1333A8471m125
10654A4346J17103B8932K93163g2349q3817B79717F106e2163R303A0822a41891
$$ plain form
10734 -173579 -83040 -140352 60251 243532 111951 47395 85863 -1452 -217675 -195327 105949
10722 201598 166817 -208902 31362 117034 -573299 -195974 185300 231065 -66600 208861
10711 -225489 -84759 -17034 -79112 6901 -9379 -106835 -300566 -132730 187406 227784 -92890
10699 197254 -314431 -20250 -197740 -40099 -87033 -164271 178097 30304 -136322 -131771 -314769
10688 -314769 52005 61789 -68244 38350 95923 85032 -382145 -258173 -239221 -35414 -303241
10677 -303241 -247382 -56784 14925 -282140 -5541 -20430 -85560 -32989 -110256 -85763 19162
10665 177814 -63985 15243 19188 -31523 -12665 171421 13683 119709 41333 18471 14346
10654 14346 131449 28932 322095 -72349 -156166 279717 6106 -52163 -42860 10822 -141891
10642C13585A9030b11310G4819O6436c14965e6444K4392C73297a22643d8584j07556
10631a56140b9563j1888q9440O2022j89118H4106J44497A1683J33564b8915n2964
10620h1879L2662P699B07967b6855m01662a86453P0398p7598c6212m4806j40606
10609b21624f6922m2617F8949b03290C432g553A27047e9483j69399O6823d1352
10597a31357L515A21703J13641D585K15573h3243k00346b084G025a44701O374
10586a38327A9826O4235b58499J21900j2332c7329k71105P2981A5579h976r5525
10575a04501A48455l51D578c3107k17919a3104p9761B69379j1423o2040m49l9650
10563A55817a75035m1554K3380e7848p9092N7068B59024a14539B16687F5762g1208
$$ plain form
10642 313585 19030 -211310 74819 141255 -314965 -56444 -32052 373297 -122643 -48584 -156140
10631 -156140 -29563 -41451 -130891 -68869 -257987 84106 228603 11683 145247 -28915 -81879
10620 -81879 -49217 -41518 207967 -26855 -428517 -186453 -116055 -193653 -36212 -81018 -221624
10609 -221624 -66922 -109539 68949 -203290 3432 -7553 127047 -59483 -228882 -162059 -41352
10597 -131357 -127842 121703 235344 4585 220158 -83243 -283589 -2084 7025 -144701 -138327
10586 -138327 19826 84061 -258499 -136599 -148931 -37329 -308434 -235453 15579 -8976 -104501
10575 -104501 148455 148104 4578 -33107 -251026 -13104 -92865 269379 257956 195916 195467 155817
10563 155817 -175035 -216589 -193209 -57848 -136940 -79872 259024 -114539 216687 65762 -71208
10551a31662J3256A14163e1779j96151C64423b1844j00028B44566G2280N7690
10541A29970n0623L2397K9622J07037g9250H7676j8484a08657p4213m8647Q1750
10530a49767N3818A47236c91408H1688g9060j50416M1485a0944A7446K63553b97229
10518f1667C53630b79998C22883h6159E5143b99246A5085c93818f5067k19038
10508b84105I6295b35942A01179a50669j45538A68610c65349A36166j5786A9940
10497A72523M6302f3650j1895K1671A32636c02758j9231J23577A0470c35643a21128
10485C33996J8371o7637j20436m3538K12921B9089M16516P306f0296D04859p8625
10474C26234I138K32417o6677J51849b0292C592N6481d1571k23044P4838g2739
$$ plain form
10551 -131662 -118406 114163 -51779 -247930 364423 -21844 -121872 244566 72280 129970
10541 129970 79347 111744 141366 248403 -79250 87676 69192 -108657 -182870 -231517 -149767
10530 -149767 -95949 147236 -391408 81688 -79060 -229476 -187991 -10944 17446 280999 -297229
10518 -61667 353630 -279998 322883 -86159 55143 -299246 15085 -393818 -65067 -284105
10508 -284105 96295 -235942 101179 -150669 -296207 168610 -365349 136166 120380 19940
10497 172523 218825 -63650 -75545 -53874 132636 -302758 -321989 -198412 10470 -335643 -121128
10485 333996 352367 284730 164294 120756 333677 29089 445605 452911 -60296 404859 326234
10474 326234 9138 241555 174878 326727 -20292 3592 60073 -41571 -264615 -189777 -72739
10462C6917c78504a37789j99985H8191B8207e1110A1594K35072f3144K6743l19236
10451c55637b39D7969c8824j025k77311J26401c5062l8092L1528j25414E6566
10439c16354a17283A61547E8029J7177Q7578b61679O0094K629d0058B15718o1165
10428A54553b74761M7376j43917J65878A55487a04219H2196h7371j02296C83495
10417d9706A06852i846j47884B64969I65a73226E0548h7219A46341J3293a8874
10405B9167J37691b59172A06496b27764a10429B43705j3477k4964d8728o0601
10395a09329F1578j6367g1652B89557a81168A68516b6303A30928L7713L14855
10385D83496a35830B14975p0130B6441j3148L50135r7227G9645J90162f1655k08094
$$ plain form
10462 36917 -378504 -137789 -337774 88191 28207 -51110 11594 246666 -63144 -36401 -355637
10451 -355637 -239 47969 -38824 -39849 -317160 -190759 -35062 -73154 -41626 -167040 56566
10439 -316354 -117283 161547 58029 75206 162784 -261679 -201585 -198956 -40058 215718 154553
10428 154553 -274761 -227385 -371302 -205424 155487 -104219 82196 -87371 -189667 383495
10417 -49706 106852 -9846 -157730 264969 965 -173226 50548 -87219 146341 159634 -18874
10405 29167 166858 -259172 106496 -227764 -110429 243705 230228 205264 -48728 -109329
10395 -109329 61578 45211 -71652 289557 -181168 168516 -26303 130928 168641 483496
10385 483496 -135830 214975 144845 26441 13293 363428 266201 79645 269807 -61655 -269749
10374b69749A59681d5671D27005P9652e571E19664A02272J84822o1851J09997
10364C35240J83774j40142J84895B20521p2295J00920I6056e5429B99231l1984
10354B67247P1352m6653A04673N86057l1843n503k13488k5432A94855J01097L62123
10343F58075B45292K09750I965L32099F7792N5375K16354b13742B22161J8717
10333B40878b05304B75542k9577A1146b52930I2597b24300A38643D173L3213R38
10322C8324a22534B08251a18999C32209A06147N6970J01971N4437J44993H1955
10311C536M4914b15902c6184j10441O1386C20859h1460K0385D3583b57850h3365
10299A49901D1295A1433K24548a45987in8695A35432n8676N6368d6677p5951m0634
$$ plain form
10374 -269749 159681 -45671 427005 506657 -5571 519664 102272 287094 225243 335240
10364 335240 519014 378872 563767 220521 148226 249146 96056 -55429 299231 267247
10354 267247 338599 291946 104673 690730 658887 653384 439896 414464 194855 295952 658075
10343 658075 245292 455042 9965 342064 67792 123167 339521 -213742 222161 240878
10333 240878 -205304 275542 245965 11146 -252930 92597 -224300 138643 4173 37386 38324
10322 38324 -122534 208251 -118999 332209 106147 163117 265088 319525 464518 81955
10311 3536 48450 -215902 -36184 -146625 -85239 320859 -81460 -61075 43583 -257850 -83365
10299 149901 41295 11433 235981 -145987 -9 -58704 135432 76756 133124 -46677 -122628 -163262
10287a63262j18130h8834F3790a5916j19176n9288a1572j80100d4282j04683B18761
10275F3502L45424H7260a53069I2072d3758b152r0293I3987P2295m7309j1232
10264A07741i7340j1227M3747C25812A39917K47450n3225C5633J20515C9754J73052
10253B12806J01186P1556j72756D6788a24023p1692A7330K79603j46988d8777
10242F8708D158N8312i5489G5872A5890g4234o2871n2826D9214c78141a59752
10230C8077d4867j69804L0741d5687k81387a4090k93668D2482M3906J5479a43268
10218a38020M1507B8011K7791b31887J04047p0142B61439D0348J93748A5498d01880
10206B78240L7155b33554J00793A01063c73334a73973k42707B1779J27120R2677
$$ plain form
10287 -163262 -281392 -88834 63790 -15916 -135092 -194380 -11572 -191672 -44282 -148965 218761
10275 63502 408926 87260 -153069 92072 -43758 -2152 -92445 93987 166282 118973 107741
10264 107741 -97340 -108567 -64820 325812 139917 387367 334142 35633 156148 39754 212806
10253 212806 313992 385548 212792 46788 -124023 -195715 17330 296933 149945 -48777
10242 68708 4158 62470 -95489 75872 15890 -74234 -137105 -189931 49214 -378141 -159752
10230 38077 -44867 -214671 -183930 -45687 -327074 -14090 -307758 42482 86388 101867 -143268
10218 -138020 -96513 28011 55802 -231887 -127840 -197982 261439 40348 234096 15498 -401880
10206 278240 315395 -233554 -132761 101063 -373334 -173973 -416680 21779 148899 241576
10196B41576a15783A56103C4757J29056c20449l0110M8469J46267F6253b54378
10185A0433h6732B07678h2232A33954b95903h3938p2429L7671b7024n0838A33592
10173a73649a7268E1841L8184b05239k10087B70191b54926A16876i4297m4038
10163a38335j03558B9907b90021b201p9051B75737r5718a92430g1191G0029J418
10152G1447a29483C12485a70992j19598N097A97113j0143b1248j4029k49266C27763
10140b427I2074i2495B30760D2148c2587k9377m2710j4107C1078a21458P556j06197
10128b20099C5561c3083B14430f4596k45310A7120a3367l04497G1683A1540a6979
10116c17334a8458N008A93765a17447k701a2502k04560P2238P0983H7787B874
$$ plain form
10196 241576 -115783 156103 34757 163813 -320449 -350559 -302090 -155823 66253 -254378
10185 10433 -86732 207678 -82232 133954 -295903 -83938 -156367 -118696 -27024 -77862 133592
10173 -173649 -17268 51841 90025 -205239 -415326 270191 -254926 116876 -94297 -138335
10163 -138335 -241893 29907 -290021 -2201 -81252 275737 180019 -192430 -71191 70029 71447
10152 71447 -129483 312485 -170992 -290590 -285493 197113 186970 -21248 -35277 -284543 327763
10140 -2427 92074 -92495 230760 42148 -32587 -61964 -104674 -118781 31078 -121458 -113902 -220099
10128 -220099 35561 -33083 214430 -64596 -309906 17120 -13367 -317864 71683 11540 -16979
10116 -317334 -18458 -13450 193765 -117447 -120148 -12502 -217062 -144824 -73841 87787 2874
10104d00086a26848E3741N9747a99932L5099d4845B10093A9794K9445J15622A9390
10092a50144O4508A29773d40673I8633a43333A09689e1125D5156c57995c547I6974
10080d8361j74686Q5827j02193C7863d84172a58751l7951A13378k2647b8421A38951
10068E7405e437G6196a16444I2920K87816a10198C9636G583P8761a77682E7058
10056C26437h9062n7835A95893b07359B05602n157I0067a04691e192G0876a09876
10044A41139j7943c57015a48274a8247j8422G1491K2525i7874A98723A028i837
10032D3576a18755A1805a12833k18549J18559A7589L20899c45378j27736A86351
10021b25884A70856b87471a21050A87120F045J14287J7436a41876j25411J20975
$$ plain form
10104 -400086 -126848 53741 113488 -199932 -164833 -44845 210093 19794 49239 164861 19390
10092 -150144 -85636 129773 -440673 98633 -143333 109689 -51125 45156 -357995 -3547 96974
10080 -48361 -223047 -137220 -239413 37863 -484172 -158751 -196702 113378 90731 -28421 138951
10068 57405 -5437 76196 -116444 92920 380736 -110198 39636 7583 86344 -177682 57058
10056 326437 -89062 -146897 195893 -207359 205602 200445 90067 -104691 -5192 70876 -109876
10044 141139 123196 -357015 -148274 -18247 -36669 71491 94016 -97874 198723 1028 -9837
10032 43576 -118755 11805 -112833 -331382 -212823 17589 338488 -345378 -473114 186351
10021 -225884 170856 -287471 -121050 187120 6045 120332 137768 -141876 -267287 -146312
10011a46312A86261b81223d1871p9797d2572A50137M6358O3606e3679J6448B30192
9999a7912j08894j11686l1155J04905H5955K20882a26761n7364H1444c86904a0911
9987a45648A42596b6582l21288C250i9967l5847B4590f7021q6613A25256c9198
9975b81816j7791L7588E5354b73366A10266b18107b4279k16169J15622j18687
9965b43513A65182B6473J31127b41673C953e9541a6664j96298a6067j26795F3133
9953b16149n1682i2290n727C6052L8487M9210H397a15851j17254n6247B84118
9941b49250Q9233d2544B13075a32331p4942E8048a80709H7343c7773D01195a29429
9929i3054b4792j85215h6022j01714A96102c70481J70567E7450b86985e8631A36530
$$ plain form
10011 -146312 186261 -281223 -41871 -121668 -42572 150137 196495 260101 -53679 -37231 230192
9999 -17912 -126806 -238492 -269647 -164742 85955 306837 -126761 -184125 81444 -386904 -10911
9987 -145648 142596 -26582 -347870 3250 -99967 -135814 24590 -67021 -153634 125256 -39198
9975 -281816 -299607 -262019 55354 -273366 110266 -218107 -24279 -240448 -124826 -243513
9965 -243513 165182 26473 157600 -241673 3953 -59541 -16664 -212962 -16067 -142862 63133
9953 -216149 -267831 -92290 -98017 36052 74539 123749 8397 -115851 -233105 -289352 284118
9941 -249250 -160017 -42544 213075 -132331 -207273 58048 -180709 87343 -37773 401195 -129429
9929 -93054 -24792 -210007 -86022 -187736 196102 -370481 -199914 57450 -286985 -58631 136530
9917f711p3594c4335j47796M2845C4913d129B5224f5355k0054m9071j60444i3833
9904a31794A13753a94024B1479a41144K7222D1346a59842N4267j50172J7A0186
9892b7540B31937b61578e2966b0256l87312A53304a08424B6140J18353a70382
9881g9889n691D8956J37255a65931P0057D4955L50251a07550A76730j9422k5234
9870A32074a95100F8432d0271k7585p882B71436c56601R7228f5493k3105j99414
9859b88012A13784a06271A62863a61914B8949C078a60432E7888K44528m8400f5325
9847A81423a32585a5207k3798A73942A4137h4191e799A38612i7562B19010H379
9835b22019I3813k1541a5551j24274F9022c36239h9517a6896j5028k1441A10072
$$ plain form
9917 -6711 -80305 -34335 -182131 -139286 34913 -4129 25224 -65355 -85409 -134480 -294924 -93833
9904 -131794 113753 -194024 21479 -141144 -113922 41346 -159842 -105575 -255747 -255730 10186
9892 -27540 231937 -261578 -52966 -20256 -407568 153304 -108424 26140 144493 -170382
9881 -79889 -85580 48956 186211 -165931 -95874 44955 395206 -107550 176730 157308 132074
9870 132074 -195100 68432 -40271 -67856 -75738 271436 -356601 -259373 -65493 -88598 -288012
9859 -288012 113784 -106271 162863 -161914 28949 3078 -160432 57888 302416 254016 -65325
9847 181423 -132585 -15207 -39005 173942 14137 -84191 -5799 138612 -97562 219010 8379
9835 -222019 93813 72272 -15551 -139825 69022 -336239 -89517 -16896 -31924 -53365 110072
9823a44616E7969d00558J18345A5800c42918B28273c13031e1095K3731k59832
9813b87196a08980j87989a11928r0403j12718a11295A79109O2187a81994D8044
9802F846b75596C9623J23010a69063G4604e6006D6726b10350l0032n0407c7714
9790A06959i6348k63261a51212p4380i265j64453j37052B71959N3016a52230A5716
9778b03648A10819A7443b7843j51607K3276a5675k07046N9693k9253P5124j520
9767a18677o2348k86673h5746l9631B85103r8063A8520L9789b73572d3889j15417
9756a59306A7370b51611d0800J3410j11883j55315j3173j28885h4832a2528A3073
9744A26043b29915A60233c00342d2904l9961B33623a13138A29951a73096p8023
$$ plain form
9823 -144616 57969 -400558 -282213 15800 -342918 228273 -313031 -51095 -27364 -287196
9813 -287196 -108980 -296969 -111928 -202331 -315049 -111295 179109 241296 -181994 48044
9802 6846 -275596 39623 162633 -169063 74604 -56006 46726 -210350 -240382 -290789 -37714
9790 106959 -96348 -359609 -151212 -225592 -9265 -173718 -310770 271959 324975 -152230 15716
9778 -203648 110819 17443 -27843 -179450 -156174 -15675 -222721 -163028 -192281 -117157 -118677
9767 -118677 -181025 -467698 -85746 -125377 285103 187040 18520 58309 -273572 -43889 -159306
9756 -159306 17370 -251611 -40800 -27390 -139273 -294588 -307761 -436646 -84832 -12528 13073
9744 126043 -229915 160233 -300342 -42904 -82865 233623 -113138 129951 -173096 -251119
9734b51119c4946l03109a39341B77417a48455B0754a37776o9152f9452C15141
9723c44388J17246K1809F1116M2689b61588k23598J97079b6056j64611m8465c9849
9711b41927G9962d58236B1687e056B43994A18509d6957o388C9587a90480P355
9700a83125E3602H752a68245n7137G568K76577c40982f3396k37837a4143B20421
9688E9135e4989A67670b15190A08654a01562j77642Q3311C9736a76610P3700A41172
9676A02941K57880j36260A09848b07494Q4365k17370A48925a09945m9826k9775
9666a89546n5714n5834P1169P6602g2430l8376L7987D2562g5398q810C9487K49643
9654B89130G3437K56833A48304a83204R243c1479I0965d16557A85900d9140q1035
$$ plain form
9734 -251119 -34946 -338055 -139341 277417 -148455 20754 -137776 -206928 -69452 315141
9723 -344388 -227142 -205333 61116 103805 -261588 -485186 -288107 -26056 -190667 -239132 -39849
9711 -241927 79962 -458236 21687 -5056 243994 118509 -46957 -53345 39587 -190480 -183125
9700 -183125 53602 8752 -168245 -225382 7568 284145 -340982 -63396 -301233 -14143 220421
9688 59135 -54989 167670 -215190 108654 -101562 -279204 -195893 39736 -176610 -102910 141172
9676 102941 360821 224561 109848 -207494 -123129 -340499 148925 -109945 -159771 -189546
9666 -189546 -245260 -301094 -229925 -153323 -72430 -110806 -72819 42562 -75398 -84208 39487 289130
9654 289130 73437 330270 148304 -183204 -173961 -31479 90965 -416557 185900 -49140 -130175
9643a30175A02133C7213J26604a53045H3154a57222g6282J5868j52100b5253A31107
9631A01548C2217b56234o6324c6238k80609P0450a05947d0067C601b3919R238
9620a4681A6556a85572L1176H5580d00420A21994a38036A5212M6939c20276A82083
9608A8473e8459k85860a38946c7177j50474f6720n3289A42301b34606K9925j21706
9597c26387a09129A61788j0441J5083l5978Q3300a34170p9504J06802r9348i4281
9585B57636a59223P6900R372L5798A30016g0819C4602h610A69651R1453c63924
9573F9499d2868B3494g9829l58312a39697a6117j47243j42460A05649P3178a06411
9561E416b60485a08016O823A34081a23452K0743B78465b37524A86350a07690D257
$$ plain form
9643 -130175 102133 37213 163817 -153045 83154 -157222 -76282 -60414 -212514 -25253 131107
9631 101548 32217 -256234 -322558 -36238 -316847 -246397 -105947 -40067 3601 -23919 -14681
9620 -14681 16556 -185572 -154396 85580 -400420 121994 -138036 15212 62151 -320276 182083
9608 18473 -58459 -344319 -138946 -37177 -187651 -66720 -120009 142301 -234606 -204681 -326387
9597 -326387 -109129 161788 151347 166430 130452 213752 -134170 -213674 -106872 -206220 -94281
9585 257636 -159223 -82323 -72951 -37153 130016 -70819 34602 -8610 169651 261104 -363924
9573 69499 -42868 23494 -79829 -438141 -139697 -16117 -163360 -305820 105649 178827 -106411
9561 5416 -260485 -108016 -101193 134081 -123452 -102709 278465 -237524 186350 -107690 4257
9549A69542b45932g9171g603k06807d7258p3461d6805j64958P8533N8040j40413
9538b15603L371I6828N5265i8891H5794c55547a31628A45336f7841j307K9912
9527c9236D4393A0568b06179A77852d4953r8698a8846j52044A55349b56158l21527
9516e77685d3009j06593O6674o4735a5224n471j08763q4282h7978A49551F4069
9504g2820o7962j3983C734K52207e8356J0881j93574C4123j3813K21947c47284
9492D2068b75159D6622h9904H4412d0952C07385H5383a04688B11604a91941D0693
9480i1878n6414G9453a45887K120c0881j43720O8594G0786C26a79396A36923g6655
9467a48993e9684l63632E3940J14273A1707a15963A53962a55755k8485A6675e7201
$$ plain form
9549 169542 -245932 -79171 -7603 -214410 -47258 -120719 -46805 -211763 -133230 -75190 -215603
9538 -215603 -212232 96828 152093 -98891 85794 -355547 -131628 145336 -67841 -69148 -39236
9527 -39236 44393 10568 -206179 177852 -44953 -143651 -18846 -170890 155349 -256158 -577685
9516 -577685 -43009 -149602 -82928 -147663 -15224 -20695 -129458 -213740 -87978 149551 64069
9504 -72820 -140782 -154765 3734 255941 -58356 -47475 -241049 34123 20310 242257 -347284
9492 42068 -275159 46622 -89904 84412 -40952 307385 85383 -104688 211604 -191941 40693
9480 -91878 -148292 79453 -145887 -143767 -30881 -174601 -106007 70786 326 -179396 136923 -76655
9467 -148993 -59684 -423316 53940 168213 11707 -115963 153962 -155755 -184240 16675 -57201
9455a72908F1161i3114F6459b90024B2080a35394D6574f5028b8821m2911G1980
9443b33931j4121J03082j22A06481p758a47865O6110p2217p8183E1591b75571
9431b56481A43268f5557o3134j31772j5109J07981C24368A55503b06773n4752
9421b61525F0814b05224h0323j66039d8601k20661k24627d718A0171N06090C714
9409C53447a31697e4164k5572q8820B06099G3070j4670a7813k30151B49698a55931
9397e7845A292a65085l7342E1981b08711A20299k4138J30723A02125D4274p959
9386C6315c4963m03137f8772J2449p4072O167k10175M9584J20166c4337j24418
9375a58755K5135L6718G2524g3959p2992b8271F9222k2758b86929R146A697J42595
$$ plain form
9455 -172908 61161 -93114 66459 -290024 22080 -135394 46574 -65028 -28821 -71732 71980
9443 -233931 -248052 -144970 -145092 106481 98723 -147865 -81755 -153972 -232155 51591 -275571
9431 -256481 143268 -65557 -128691 -260463 -275572 -167591 324368 155503 -206773 -261525
9421 -261525 60814 -205224 -80323 -246362 -48601 -269262 -493889 -4718 10171 516261 3714
9409 353447 -131697 -54164 -79736 -168556 206099 73070 58400 -17813 -247964 249698 -155931
9397 -57845 1292 -165085 -202427 51981 -208711 120299 96161 226884 102125 44274 36315
9386 36315 -34963 -438100 -68772 -56323 -130395 -124228 -334403 -284819 -164653 -34337 -158755
9375 -158755 -133620 -96902 72524 -73959 -146951 -28271 69222 46464 -286929 -277783 1697 144292
9363A44292b7497g163n50346a85389k842O5742N8367r5965f569r050l57561A06347
9350e4080D1437A0099a18995j63652N6004a19j35400q8970p2023J22786K1738
9339a51988G540a74914j05756C9994K14179H8380O7318l2816J05935B1614K9999
9328E1613a39804K7091k0320k27927f2389k68664I7196O8239a38066B16894g7
9316I5482e693k34963A7787J06489i5220p1887r8659L3367J08724K2254b5656
9304I9805a85128l57332d5193g457j75182J4917A11574b06830h1562l11977e9213
9292B68939c44948A92561b08101J308A06342j7733b68723i1485p2369k25309R7658
9281b91505C9199a00228o2390m9334B69331b69653F5184f0692j80010o875M8053
$$ plain form
9363 144292 -27497 -7163 -557509 -185389 -188231 -122489 -64122 -160087 -6569 -15619 -373180 106347
9350 -54080 41437 10099 -118995 -282647 -226643 -119 -135519 -224489 -296512 -173726 -151988
9339 -151988 7540 -174914 -280670 39994 254173 88380 155698 122882 228817 21614 51613
9328 51613 -139804 -112713 -133033 -360960 -62389 -331053 97196 165435 -138066 216894 -77
9316 95482 -5693 -240656 17787 124276 -95220 -167107 -265766 -232399 -123675 -101421 -25656
9304 99805 -185128 -542460 -45193 -7457 -182639 -167722 111574 -206830 -81562 -393539 -59213
9292 268939 -344948 192561 -208101 -206793 106342 88609 -268723 -91485 -163854 -389163 -291505
9281 -291505 39199 -100228 -162618 -211952 269331 -269653 65184 -60692 -240702 -247577 -199524
9270a99524I8749N7420c35920A11583J71282g1129j3989L1176A04334c05708K907
9259c02801i2962j6830A37351K8210c62949d5965l1889k43239M4934I8697J99616
9248B98313A17128d4259j60621F9418a89450A0398J08409d69507A31239I268N6052
9237F5320j8991a40465c0904R693m54853A32758a6615B75347B0200O8142J03455
9226A91797e94l06460c938l96558A17097J2137C102a85607A78400G9517a17494
9214I2514j7057L25714c54371r6502a26094A53317i0916j21307I9655C609R531
9203A3140b63295H6215c63290R6359L1534A16218c60280L6599E3061b44917b8773
9191F6071a61166j05651I3313N161a45092j54312g7348K7570j63937m1367G7703
$$ plain form
9270 -199524 98749 156169 -335920 111583 282865 -71129 -85118 -53942 104334 -305708 -302801
9259 -302801 -92962 -109792 137351 165561 -362949 -45965 -77854 -321093 -276159 98697 298313
9248 298313 117128 -44259 -204880 69418 -189450 10398 118807 -469507 131239 9268 65320
9237 65320 46329 -140465 -30904 -21211 -476064 132758 -16615 275347 20200 88342 191797
9226 191797 -594 -307054 -3938 -400496 117097 129234 3102 -185607 178400 79517 -117494
9214 92514 75457 401171 -354371 -450873 -126094 153317 -90916 -212223 99655 3609 13140
9203 13140 -263295 86215 -363290 -266931 -235397 116218 -360280 -323681 53061 -244917 -28773
9191 66071 -161166 -266817 93313 98474 -145092 -299404 -77348 -49778 -213715 -255082 77703
9179a69209A12547b29025j91101J10031i1353A04276M8502c41555n2702a84382
9168a57171n4245a04981E4617d1775A58577b38811M4866f8955j15321K6201A0336
9156a55183D52J46602J5184E3127b57881N2084G2245D355J2096L75235d1952l53171
9144c95123Q5427c8957k03122A29946r734e726l2250j4744I5389K01911H2808
9132b67471O0265g2007I0577m2106J36390c41634c6109j32045B64811k4663F2864
9120a18543j30165j68384A0845K48575j10629c58388J65354d1831f612D5402c43479
9108C88025c78341i0543j08579A55356K55069a33437k0149e5724l9126q7933K5856
9097a56927N488M3897J6869j6494p0151I4051a54972j7937O7668B2851c3432P533
$$ plain form
9179 -169209 112547 -229025 -420126 -310095 -91353 104276 152778 -341555 -394257 -184382
9168 -157171 -211416 -104981 54617 -41775 158577 -238811 -193945 -68955 -184276 -158075 10336
9156 -155183 452 147054 162238 53127 -257881 -205797 72245 4355 16451 391686 -41952 -395123
9144 -395123 -309696 -38957 -242079 129946 120212 -5726 -37976 -52720 95389 297300 82808
9132 -267471 -207206 -72007 90577 48471 184861 -341634 -36109 -168154 264811 240148 62864
9120 -118543 -248708 -417092 10845 259420 148791 -358388 -193034 -41831 -6612 45402 -343479
9108 388025 -378341 -90543 -199122 155356 410425 -133437 -153586 -55724 -94850 -182783 -156927
9097 -156927 -151439 -107542 -90673 -107167 -177318 94051 -154972 -172909 -105241 22851 -33432 -25899
9085b5899q950n86a7203j1993i525j4609j08773n4860m1330A68044j1677R7870
9073B54237b25939j249j45849J04009a13222j53091b2586l69869J78166K6950
9063a87339l8709A19077C2156c51342g4797B14860c45843E2633a07188G5230Q7105
9052A62335a18144o7801Q5888c3232Q793B0581a7486f041H9868J09409a64930
9040A26660a57801q7023N663I3210L4968a4955p0014B46591C5957L4474c09383
9028G8533a26704A00018d8475j50846j1160J0324B77553a28490B73914a79616
9017a90117A6157a15147d8375k14602E8159b10236j4820B1244f0317j49651A2756
9005h9748J122k4594L0146j07937H1580A1071Q7589K60494a90190A38179b28586
$$ plain form
9085 -25899 -34849 -35435 -17203 -29196 -9525 -24134 -132907 -187767 -229097 168044 156367 254237
9073 254237 -225939 -227188 -373037 -269028 -113222 -266313 -22586 -392455 -214289 -187339
9063 -187339 -226048 119077 32156 -351342 -74797 214860 -345843 52633 -107188 75230 162335
9052 162335 -118144 -185945 -100057 -33232 -24439 20581 -17486 -6041 89868 199277 -164930
9040 126660 -157801 -244824 -239161 93210 128178 -14955 -84969 246591 35957 70431 -309383
9028 78533 -126704 100018 -48475 -199321 -210481 -200157 277553 -128490 273914 -179616
9017 -190117 16157 -115147 -48375 -262977 58159 -210236 -225056 21244 -60317 -209968 12756
9005 -89748 -88626 -113220 -83074 -191011 81580 11071 98660 359154 -190190 138179 -228586
8993A40430c24434G795a12605L7836I2321h4215o2868A11542M7001B1692h5092
8981a92871b1688B6701a0667A45901c21028B68338B1596g334l6839G2752B2439
8969a33124c7781j6982j57229O1580q4801j18380J42863l1818j21480a18568L5955
8958h2613k06784e0170j23171g594k1502J0633E058g248F6569i3199j43085J02577
8946a33707J8981A90314b21997A22336l427B5699J5172a61759r3237B75288B7751
8934C61005L87773C68638c13757C74342E0395P2300C2295L54413o6689P33244
8924A053263j66376J958820O717834J1379849I542821B852759A111565E44097
8915C58278l1870a2586E2956N2384O5019K084a71090B82922E3283d9305G9133
$$ plain form
8993 140430 -324434 7795 -112605 -74769 92321 -84215 -147083 111542 158543 21692 -85092
8981 -192871 -21688 26701 -10667 145901 -321028 268338 21596 -7334 -44173 72752 22439
8969 -133124 -37781 -54763 -211992 -150412 -235213 -353593 -210730 -242548 -364028 -118568 -82613
8958 -82613 -289397 -50170 -173341 -7594 -29096 -18463 5058 -7248 66569 -93199 -236284 -133707
8946 -133707 -114726 190314 -221997 122336 118909 25699 40871 -161759 -254996 275288 27751
8934 361005 748778 368638 -313757 374342 50395 122695 32295 386708 320019 1053263
8924 1053263 886887 2845707 9563541 20943390 9542821 2852759 1111565 544097
8915 358278 326408 -12586 52956 105340 170359 172443 -171090 282922 53283 -49305 79133
8903H5801a21170l46270K03923c2528h462k55705F0146R8154J28133F9855a9354
8891H0412g9806k01202F5288a66115A18732J17204D7933a58702K8851l15102A18576
8879A09151a28769C3929b35128B60227D8242a10239k90163E0844b22004h6944
8868a81713B56522a19146j40120C04724a67185o0503P6501a8795A13885J45145
$$ plain form
8903 85801 -121170 -467440 -263517 -32528 -8462 -264167 60146 158300 286433 69855 -19354
8891 80412 -79806 -281008 65288 -166115 118732 235936 47933 -158702 -129851 -444953 118576
8879 109151 -128769 33929 -235128 260227 48242 -110239 -400402 50844 -222004 -86944
8868 -181713 256522 -119146 -259266 304724 -167185 -227688 -151187 -18795 113885 259030
$$ [...]
##END NTUPLES=NMR SPECTRUM
##END=
