
##TITLE=UV1230_M7_1357-1247_20_7230859_pB3h3UzOJw
##JCAMPDX= 6.0         $$ Bruker NMR JCAMP-DX V2.0
##DATA TYPE= NMR SPECTRUM
##DATA CLASS= NTUPLES
##ORIGIN= BRUKER
##OWNER= Administrator
$$ 1.72 TOPSPIN		Version 2.1
$$ 2013-01-18 19:11:52.750 -0500  Administrator@X
$$ Compression mode = diff/dup
##.OBSERVE FREQUENCY= 400.02188249412
##.OBSERVE NUCLEUS= ^1H
##.ACQUISITION MODE= SIMULTANEOUS (DQD)
##.ACQUISITION SCHEME= undefined
##.AVERAGES= 8
##.DIGITISER RES= 22
##SPECTROMETER/DATA SYSTEM= spect
##.PULSE SEQUENCE= zg30
##.SOLVENT NAME= COFFEE_meoh
##.SHIFT REFERENCE= INTERNAL, COFFEE_meoh, 1, 14.98509
##AUDIT TRAIL= $$ (NUMBER, WHEN, WHO, WHERE, PROCESS, VERSION, WHAT)
$$ ##TITLE= Audit trail, TOPSPIN		Version 2.1
$$ ##JCAMPDX= 5.01
$$ ##ORIGIN= Bruker BioSpin GmbH
$$ ##OWNER= Administrator
$$ $$ E:\/data/COFFEE/nmr/UV1230_M7_1357-1247_20_7230859_pB3h3UzOJw/20/pdata/1/auditp.txt
$$ ##AUDIT TRAIL=  $$ (NUMBER, WHEN, WHO, WHERE, PROCESS, VERSION, WHAT)
(   1,<2013-01-18 19:11:44.547 -0500>,<Administrator>,<X>,<go>,<TOPSPIN 2.1>,
      <created by zg
	started at 2013-01-18 19:10:38.578 -0500,
	POWCHK enabled, PULCHK disabled,
       configuration hash MD5:
       86 BA 57 50 F2 9D 5C 9B 26 00 A9 28 5F 66 2E 89
       data hash MD5: 64K
       D8 12 6E 72 27 43 60 27 18 9E 2B 36 19 98 68 06>)
(   2,<2013-01-18 19:11:47.703 -0500>,<Administrator>,<X>,<proc1d>,<TOPSPIN 2.1>,
      <Start of raw data processing
       efp LB = 0 FT_mod = 6 PKNL = 1 PHC0 = 0 PHC1 = 0 SI = 32K 
       data hash MD5: 32K
       17 01 CC 05 7B 2A 1C 45 C6 C5 3F CC F4 4A 58 F1>)
(   3,<2013-01-18 19:11:48.156 -0500>,<Administrator>,<X>,<proc1d>,<TOPSPIN 2.1>,
      <pk PHC0 = 93.8562 PHC1 = 0 
       data hash MD5: 32K
       3A 86 E4 69 B5 54 0E C5 E6 30 29 A6 38 95 53 2B>)
(   4,<2013-01-18 19:11:48.391 -0500>,<Administrator>,<X>,<proc1d>,<TOPSPIN 2.1>,
      <abs ABSG = 1 
       data hash MD5: 32K
       61 2D 38 92 F8 94 AA 3F D9 15 F2 C3 15 A0 69 5F>)
(   5,<2013-01-18 19:11:48.531 -0500>,<Administrator>,<X>,<proc1d>,<TOPSPIN 2.1>,
      <abs ABSG = 2 
       data hash MD5: 32K
       0F B0 D5 42 00 CA C9 B1 8A EE F0 65 B4 74 CB 09>)
(   6,<2013-01-18 19:11:48.672 -0500>,<Administrator>,<X>,<proc1d>,<TOPSPIN 2.1>,
      <abs ABSG = 3 
       data hash MD5: 32K
       D9 2A 11 5F CA C3 1D FC 43 E7 43 18 43 69 FE B7>)
(   7,<2013-01-18 19:11:48.813 -0500>,<Administrator>,<X>,<proc1d>,<TOPSPIN 2.1>,
      <abs ABSG = 4 
       data hash MD5: 32K
       03 AE 46 68 5A FB 08 61 AC A3 3A 08 FD CF 2F 54>)
(   8,<2013-01-18 19:11:48.985 -0500>,<Administrator>,<X>,<proc1d>,<TOPSPIN 2.1>,
      <abs ABSG = 5 
       data hash MD5: 32K
       79 A9 6B 93 18 DC 24 BB A6 3E 42 14 A5 91 8B C2>)
$$ ##END=
$$ 
$$ $$ hash MD5
$$ $$ 3E 52 9C BA BA 2D 7A 68 AA 6F 12 CE C7 A4 2D FF
##$RELAX= 
##$RELAX= 
##$RELAX= 
##$RELAX= 
##$RELAX= 
##$RELAX= 
##$RELAX= 
$$ Bruker specific parameters
$$ --------------------------
##$DU= <E:\>
##$EXPNO= 20
$$ [...]
##$TP= (0..7)
150 150 150 150 150 150 150 150
##$TP07= 0
##$TPNAME0= <>
##$TPNAME1= <>
##$TPNAME2= <>
##$TPNAME3= <>
##$TPNAME4= <>
##$TPNAME5= <>
##$TPNAME6= <>
##$TPNAME7= <>
##$TPOAL= (0..7)
0.5 0.5 0.5 0.5 0.5 0.5 0.5 0.5
##$TPOFFS= (0..7)
0 0 0 0 0 0 0 0
##$TUNHIN= 0
##$TUNHOUT= 0
##$TUNXOUT= 0
##$USERA1= <user>
##$USERA2= <user>
##$USERA3= <user>
##$USERA4= <user>
##$USERA5= <user>
##$V9= 5
##$VALIST= <valist>
##$VCLIST= <CCCCCCCCCCCCCCC>
##$VD= 0
##$VDLIST= <DDDDDDDDDDDDDDD>
##$VPLIST= <PPPPPPPPPPPPPPP>
##$VTLIST= <TTTTTTTTTTTTTTT>
##$WBST= 1024
##$WBSW= 4
##$XGAIN= (0..3)
0 0 0 0
##$XL= 0
##$YL= 0
##$YMAX_a= 660730
##$YMIN_a= -559578
##$ZGOPTNS= <>
##$ZL1= 120
##$ZL2= 120
##$ZL3= 120
##$ZL4= 120
##$ABSF1= 14.98509
##$ABSF2= -5.573092
##$ABSG= 5
##$ABSL= 3
##$ALPHA= 0
##$AQORDER= 0
##$ASSFAC= 0
##$ASSFACI= 0
##$ASSFACX= 0
##$ASSWID= 0
##$AUNMP= <proc_prof1d_extract_pilot.lims>
##$AXLEFT= 0
##$AXNAME= <>
##$AXNUC= <1H>
##$AXRIGHT= 0
##$AXTYPE= 0
##$AXUNIT= <>
##$AZFE= 0.1
##$AZFW= 0.1
##$BCFW= 0
##$BC_mod= 0
##$BYTORDP= 0
##$COROFFS= 0
##$CY= 15
##$DATMOD= 1
##$DC= 0
##$DFILT= <>
##$DTYPP= 0
##$F1P= 0
##$F2P= 0
##$FCOR= 0.5
##$FTSIZE= 32768
##$FT_mod= 6
##$GAMMA= 0
##$GB= 0
##$INTBC= 1
##$INTSCL= 1
##$ISEN= 128
##$LB= 0
##$LEV0= 0
##$LPBIN= 0
##$MAXI= 10000
##$MC2= 0
##$MEAN= 0
##$ME_mod= 0
##$MI= 0
##$NCOEF= 0
##$NC_proc= -8
##$NLEV= 6
##$NOISF1= 0
##$NOISF2= 0
##$NSP= 0
##$NTH_PI= 0
##$NZP= 0
##$OFFSET= 14.98509
##$PC= 1
##$PHC0= 93.8562
##$PHC1= 0
##$PH_mod= 1
##$PKNL= yes
##$PPARMOD= 0
##$PPDIAG= 0
##$PPIPTYP= 0
##$PPMPNUM= 2147483647
##$PPRESOL= 1
##$PSCAL= 4
##$PSIGN= 0
##$PYNMP= <proc.py>
##$REVERSE= no
##$SF= 400.02
##$SI= 32768
##$SIGF1= 0
##$SIGF2= 0
##$SINO= 400
##$SIOLD= 32768
##$SPECTYP= <>
##$SREGLST= <1H.CDCl3>
##$SSB= 0
##$STSI= 32768
##$STSR= 0
##$SW_p= 8223.68421052631
##$SYMM= 0
##$S_DEV= 0
##$TDeff= 65536
##$TDoff= 0
##$TI= <>
##$TILT= no
##$TM1= 0
##$TM2= 0
##$TOPLEV= 0
##$USERP1= <user>
##$USERP2= <user>
##$USERP3= <user>
##$USERP4= <user>
##$USERP5= <user>
##$WDW= 1
##$XDIM= 32768
##$YMAX_p= 463903507
##$YMIN_p= -654300
##$CURPLOT= <Network HP LaserJet P1505>
##$CURPRIN= <$Network HP LaserJet P1505>
##$DFORMAT= <normdp>
##$LAYOUT= <+/1D_H.xwp>
##$LFORMAT= <normlp>
##$PFORMAT= <normpl>
##$SURQMSG= 1
$$ End of Bruker specific parameters
$$ ---------------------------------
##NTUPLES= NMR SPECTRUM
##VAR_NAME=  FREQUENCY,     SPECTRUM/REAL,   SPECTRUM/IMAG
##SYMBOL=    X,             R,               I
##VAR_TYPE=  INDEPENDENT,   DEPENDENT,       DEPENDENT
##VAR_FORM=  AFFN,          ASDF,            ASDF
##VAR_DIM=   32768,         32768,           32768
##UNITS=     HZ,            ARBITRARY UNITS, ARBITRARY UNITS
##FACTOR=    0.250966925370066, 1,           1
##FIRST=     8223.43324360094, -8746,        -28938
##LAST=      0,             94884,           -168267
##MIN=       0,             -654300,         0
##MAX=       8223.43324360094, 463903507,    0
$$ Real data points
##PAGE= N=1
##DATA TABLE= (X++(R..R)), XYDATA
$$ [...]
19550e9861A98342r6487B200c5800o7741G3759J64756b54206h6481A34800D1873
$$ -59861 198342 101855 2200 -35800 -103541 73759 238515 -254206 -86481 134800 41873
19538C10325C7445J69299l9896a60896j37401P3367g6783a5024j53400a8621k38469
$$ 310325 37445 206744 166848 -160896 -298297 -224930 -76783 -15024 -168424 -18621 -257090
19527b57090L3289C10802a93795e1141A33142O10c54541J3034c5055o255L597
$$ -257090 -223801 310802 -193795 -51141 133142 133752 -354541 -341507 -35055 -41310 -37713
19516c7713C5062J77451n6210d19636A17660a06209p9475j70985g056A19594K56825
$$ -37713 35062 212513 156303 -419636 117660 -106209 -185684 -356669 -7056 119594 376419
19505C76419c99m31158P7073D0849b8149E78a54975A1362a74054j62043D0661
$$ 376419 -399 -431557 -354484 40849 -28149 578 -154975 11362 -174054 -336097 40661
19493c41251G6010b74375E2967b30920a05832A86577g729q6793k52144f972m8821
$$ -341251 76010 -274375 52967 -230920 -105832 186577 -7729 -94522 -346666 -6972 -55793
19482e5793j68400B29297K9400a46172c543j79416l03838C8264a78465A41543
$$ -55793 -224193 229297 258697 -146172 -3543 -182959 -486797 38264 -178465 141543
19471I2328J27842h7250r9256h5084J9729G3800a87012K3996H5181i766m8925
$$ 92328 220170 -87250 -186506 -85084 -65355 73800 -187012 -163016 85181 -9766 -58691
19460e8691j29979N3116D03074c52441a64940H3800b94400L7418c0391A6256d6684
$$ -58691 -188670 -135554 403074 -352441 -164940 83800 -294400 -256982 -30391 16256 -46684
19448c37683a17762K2060g865B40770F8136b1870q0640l16581J59023D0746L01765
$$ -337683 -117762 -95702 -7865 240770 68136 -21870 -102510 -419091 -260068 40746 342511
19437C42511c4647G4267C763a50830e3506C2783K30122b78003a32451J8589l2806
$$ 342511 -34647 74267 3763 -150830 -53506 32783 262905 -278003 -132451 -113862 -146668
19426a46668n8936j84783A84484a0212k03411A34727b33431J12387B12675E8869
$$ -146668 -205604 -390387 184484 -10212 -213623 134727 -233431 -121044 212675 58869
19415c13929A02874d39310C5540d17998I4341m2841d0834j93298c8527E8635k9144
$$ -313929 102874 -439310 35540 -417998 94341 51500 -40834 -234132 -38527 58635 29491
19404B9491h9503d2749A18378b07961C73791c34049Q9374C09549b16590g5627
$$ 29491 -89503 -42749 118378 -207961 373791 -334049 -244675 309549 -216590 -75627
19393a48338c9570j54057H3759i4232j83066H6695a7318k62126H910J1958h532
$$ -148338 -39570 -193627 83759 -94232 -277298 86695 -17318 -279444 8910 20868 -8532
19381a5385N338l8539m7256n4497r3247A77803G1304i1310a3774k51007q5326
$$ -15385 -10047 -48586 -95842 -150339 -243586 177803 71304 -91310 -13774 -264781 -350107
19370c50107B76345B1809o372b57809A6349J34005l9817B5060b89032c8511n0040
$$ -350107 276345 21809 15437 -257809 16349 150354 110537 25060 -289032 -38511 -88551
19359h8551d1203m0220l8117B18159E6457b91982a01261C19052A1793c5663j40100
$$ -88551 -41203 -81423 -119540 218159 56457 -291982 -101261 319052 11793 -35663 -175763
19348a75763E3164K32413h7728A00469d9070A89772J34095d500I2152a58279j21054
$$ -175763 53164 285577 -87728 100469 -49070 189772 323867 -4500 92152 -158279 -279333
19337b79333B7882J95729H3381a6702j58883A22738b60481N4799h817E8894h3609
$$ -279333 27882 223611 83381 -16702 -175585 122738 -260481 -205682 -8817 58894 -83609
19325C9899c12269B8076g5408q2036P4613c5863A87065d1446H8980c18305f6202
$$ 39899 -312269 28076 -75408 -157444 -82831 -35863 187065 -41446 88980 -318305 -66202
19313f512m9096p335o647j77106K5589A84716c29667A79058D0293K22893a24889
$$ -6512 -55608 -62943 -69590 -246696 -221107 184716 -329667 179058 40293 263186 -124889
19301D432d29861H9585k4669j5060a71017d7802G2482d7051j8805k18211B39353
$$ 4432 -429861 89585 64916 49856 -171017 -47802 72482 -47051 -65856 -284067 239353
19289h2457F2804J94589b42011B5783c59386C7770P8046M629c01018a00630d6313
$$ -82457 62804 257393 -242011 25783 -359386 37770 115816 120445 -301018 -100630 -46313
19277A98900b33303I2440D2904b16949J3262h1370B06960C4161b06920B79688
$$ 198900 -233303 92440 42904 -216949 -203687 -81370 206960 34161 -206920 279688
19266C25300a67B97064c58919G897b7164B40850R9624A61075b8042j9323k24253
$$ 325300 -167 297064 -358919 7897 -27164 240850 340474 161075 -28042 -47365 -271618
19255b71618l3506e728B1352g9110j23325k55234A03560L6178i9569E5990a07566
$$ -271618 -305124 -5728 21352 -79110 -202435 -457669 103560 139738 -99569 55990 -107566
19243d44096H9494O6564I883m550a09774l1978l9876d7645j24743A16374a47452
$$ -444096 89494 156058 9883 5333 -109774 -141752 -181628 -47645 -172388 116374 -147452
19231a89167A08324a11428k78575D9870a96543j23309a10270L0718B0238J27759
$$ -189167 108324 -111428 -390003 49870 -196543 -319852 -110270 -79552 20238 147997
19221A47997G719K99802c12410A6885J03548b28567R2077m2778O1839A90043B0269
$$ 147997 7719 307521 -312410 16885 120433 -228567 -136490 -179268 -117429 190043 20269
19209a8774k56867D975b2075A4591b2495k20354B98802a47431P1864l9712C5825
$$ -18774 -275641 4975 -22075 14591 -22495 -242849 298802 -147431 -75567 -115279 35825
19197A10477a64500A35428D3499i1102A73921a43027k57412A76257a08751A1996
$$ 110477 -164500 135428 43499 -91102 173921 -143027 -400439 176257 -108751 11996
19186a41501k30987C4996a81428B29031b29255f1749j00638M6640d039j97596
$$ -141501 -372488 34996 -181428 229031 -229255 -61749 -162387 -115747 -4039 -201635
19176b01635M866P3772l51690f6710k1169E0221K37683b33356a7531l7733D5519
$$ -201635 -196769 -122997 -474687 -66710 -87879 50221 287904 -233356 -17531 -55264 45519
19164b08553C9753d1758j12681B94856j10745D5581b83180M3276F8959d2488k08188
$$ -208553 39753 -41758 -154439 294856 184111 45581 -283180 -239904 68959 -42488 -250676
19153b50676j4301J28365k28879d9205D0113a19286L4575A41449l7392L9176a70753
$$ -250676 -264977 -136612 -365491 -49205 40113 -119286 -84711 141449 104057 143233 -170753
19141C6120a34917D683d18732O1207J3113a62469B5619J10825K2431b18454m551
$$ 36120 -134917 4683 -418732 -357525 -344412 -162469 25619 136444 158875 -218454 -223005
19130b23005N3159J0909N7280d6353A71983a93171k699O1114d6111A12490b80137
$$ -223005 -169846 -158937 -101657 -46353 171983 -193171 -195870 -134756 -46111 112490 -280137
19118a20387A5314a35589a0569j37022M3494l62273B96969A8106R0903g6890B06517
$$ -120387 15314 -135589 -10569 -147591 -104097 -466370 296969 18106 109009 -76890 206517
19106C5006J75468E5922B6075N5387R3632E8376c2269q4628A93J00423i7011j06799
$$ 35006 210474 55922 26075 81462 175094 58376 -32269 -116897 193 100616 -97011 -203810
19094b03810L9164c6385M25A28940A7916b2835q059E0441K20865d02008e3045
$$ -203810 -164646 -36385 -35960 128940 17916 -22835 -30894 50441 271306 -402008 -53045
19082f4629k35940J46035C21274c5558H7100j4692E428K57642f65B12362b2727
$$ -64629 -300569 -154534 321274 -35558 87100 72408 5428 263070 -665 212362 -22727
19070h7683E0934b34684j00924g6585A29837E550a02128l3966f6955m6752A10929
$$ -87683 50934 -234684 -335608 -76585 129837 5550 -102128 -136094 -66955 -113707 110929
19058f8652j05854P2364E1850i0381k76139J24986P4099j08949J34633F9857A6535
$$ -68652 -174506 -102142 51850 -90381 -366520 -241534 -167435 -276384 -141751 69857 16535
19046a12455m7286H0393b23A7144a3112l4699I9147N1393E1261r705a10066j01804
$$ -112455 -159741 80393 -223 17144 -13112 -47811 99147 150540 51261 41556 -110066 -211870
19034b11870A35671b99011A72429F5855g2117F6317K1219J27309b70542h3707
$$ -211870 135671 -299011 172429 65855 -72117 66317 87536 214845 -270542 -83707
19023A50474P3081A9420J0288a3573j04186B41274i4258j04948A87422h3878p0564
$$ 150474 223555 19420 29708 -13573 -117759 241274 -94258 -199206 187422 -83878 -154442
19012a54442L0956j25326K8746J03606B38380a57501E3852L6334c33144J23403
$$ -154442 -123486 -248812 -220066 -116460 238380 -157501 53852 90186 -333144 -209741
19002b09741B76086A31712J8668b16581Q6254k87045a61528j10352B1184b36150
$$ -209741 276086 131712 150380 -216581 -130327 -417372 -161528 -271880 21184 -236150
18991G7108l0285i397l1104p6975b3720m07868e3848a0895k31008e8710j17497
$$ 77108 46823 -9397 -40501 -117476 -23720 -431588 -53848 -10895 -241903 -58710 -176207
18980a76207f8333G5416a41477I8171M9122h8905m2387p4413B5164J399a02328
$$ -176207 -68333 75416 -141477 98171 147293 -88905 -131292 -205705 25164 26563 -102328
18968d5615j42840O6350j27045E3454a25860a9867A53814e7913A83609K19301
$$ -45615 -188455 -122105 -249150 53454 -125860 -19867 153814 -57913 183609 402910
18958D02910j74657e0434B18664b37831l1740b4087j00812c4171k41804i391A00803
$$ 402910 228253 -50434 218664 -237831 -269571 -24087 -124899 -34171 -275975 -9391 100803
18946c071j20405k80190a43715f0196l4014J1758k93175a48579A6431b25002j02676
$$ -3071 -123476 -403666 -143715 -60196 -94210 -82452 -375627 -148579 16431 -225002 -327678
18935c27678e1791l5568l7263C73034A2685Q9780a5298m06500D8368K63945b22031
$$ -327678 -51791 -87359 -124622 373034 12685 102465 -15298 -421798 48368 312313 -222031
18923B91625i249k14699L1045R2943A24587K8081J28204a02590K9445Q615A03637
$$ 291625 -9249 -223948 -192903 -99960 124587 152668 280872 -102590 -73145 -64530 103637
18911b49980a00350n638K3661B6789f4803k40611R8611A65016h7381n5166a9467
$$ -249980 -100350 -105988 -82327 26789 -64803 -305414 -206803 165016 -87381 -142547 -19467
18899b0720n0663A64262H1432g1982J3452k28352a14257A08065c2085I4985D6277
$$ -20720 -71383 164262 81432 -71982 -58530 -286882 -114257 108065 -32085 94985 46277
18887a17518A91584a59806c6885j0326k70356a57808B04829b039p4115j55492
$$ -117518 191584 -159806 -36885 -47211 -317567 -157808 204829 -2039 -76154 -231646
18877b31646g6082k69931B20462k3723h3221c6515l3672j10053C3571L36800A32792
$$ -231646 -76082 -346013 220462 196739 -83221 -36515 -70187 -180240 33571 370371 132792
18865i6632c2547o648n21355a41867B8649a35559C7738c37828A29968b18865A38182
$$ -96632 -32547 -39195 -560550 -141867 28649 -135559 37738 -337828 129968 -218865 138182
18853F7784l126J8202J37421a9385A3375L64288d6077A23216G0L15664d30465
$$ 67784 64658 82860 220281 -19385 13375 377663 -46077 123216 70 315734 -430465
18841a73265h3287L4557J1708E1249J29568k6665k1976K6247a37155O6056B48488
$$ -173265 -83287 -48730 -37022 51249 180817 154152 132176 158423 -137155 -71099 248488
18829b15409n7145B5366K0546e7486B3188J14713c59157E7893i8626G2101P1369
$$ -215409 -272554 25366 45912 -57486 23188 137901 -359157 57893 -98626 72101 143470
18818A43470i0156I2015b35928b704I8896J7168J56311b4086o0337A30795a10567
$$ 143470 -90156 92015 -235928 -2704 98896 116064 272375 -24086 -84423 130795 -110567
18806i4254J1603H4302k168h8065j59m7855K0167N6818A63019b3194i678j66879
$$ -94254 -82651 84302 82134 -88065 -88224 -136079 -115912 -59094 163019 -23194 -9678 -176557
18794a76557E6637c47044h6816i480k41321g8413B63731a66798B8472N5107c960
$$ -176557 56637 -347044 -86816 -9480 -250801 -78413 263731 -166798 28472 83579 -3960
18782e6145k69646B07150g2432A26058k6468b22145A48694a11700J9884l89464
$$ -56145 -325791 207150 -72432 126058 99590 -222145 148694 -111700 -91816 -481280
18772d81280g7808j7261k40250c4890j56703B8346Q5238a90585B37926a03485
$$ -481280 -77808 -95069 -335319 -34890 -191593 28346 113584 -190585 237926 -103485
18761F619a71293N5815p1153I4010K29919c73415G2498a19234j65058e7050B6068
$$ 6619 -171293 -115478 -186631 94010 323929 -373415 72498 -119234 -284292 -57050 26068
18749b54544a16863L0322e828F0259J43153a50156e1516a4475A52262F1643a19396
$$ -254544 -116863 -86541 -5828 60259 203412 -150156 -51516 -14475 152262 61643 -119396
18737c9455j64369O5138f4147D6880M681b9004j35038m63313a6451j27307j58863
$$ -39455 -203824 -138686 -64147 46880 51561 -29004 -164042 -627355 -16451 -143758 -302621
18726c02621Q9887f7540k58368f6360b1561j238A34303b71691P528C828e3799
$$ -302621 -212734 -67540 -325908 -66360 -21561 -22799 134303 -271691 -264163 3828 -53799
18714I6001d00736a18269J6666A20142a926l0445k11773n4698i6182A594g9663
$$ 96001 -400736 -118269 -101603 120142 -1926 -32371 -244144 -298842 -96182 1594 -79663
18702a91600B49227f7185A8709N5246a58223A10195A7844b51602k05381H1855
$$ -191600 249227 -67185 18709 73955 -158223 110195 17844 -251602 -456983 81855
18691a98059N2550a9310r7837A04572a16221m5906I4288f19835a54199m1303j55656
$$ -198059 -145509 -19310 -117147 104572 -116221 -162127 94288 -619835 -154199 -195502 -351158
18680c51158J61504A67612D6031j0998J10612i9676j09968A41188a97304a3758
$$ -351158 -189654 167612 46031 35033 145645 -99676 -209644 141188 -197304 -13758
18669h4090j28611j05329J13313P747n72r1240B5784J53518b41911A46331A9502
$$ -84090 -212701 -318030 -204717 -196970 -197542 -288782 25784 179302 -241911 146331 19502
18657I9099B5233a98441Q9877A00005a44702A02880g606A14313c7975j6997k58615
$$ 99099 25233 -198441 -108564 100005 -144702 102880 -7606 114313 -37975 -54972 -313587
18646c13587a54199O8420l5887k52764f3560j47095B09557C1595J34280H1587
$$ -313587 -154199 -85779 -121666 -374430 -63560 -210655 209557 31595 165875 81587
18635a66770C62929C7576J3635a98430A60281c28230a08569c7789A27135g5259
$$ -166770 362929 37576 51211 -198430 160281 -328230 -108569 -37789 127135 -75259
18624a56039G1621A2728K69895a53123q4203k8386A31842c41687O0941B33614
$$ -156039 71621 12728 282623 -153123 -237326 -265712 131842 -341687 -280746 233614
18613A82491l3282b8360F9c03441b8203a0715j7311n9974j98707b0015j0505A48255
$$ 182491 149209 -28360 69 -303441 -28203 -10715 -28026 -88000 -286707 -20015 -30520 148255
18600b6144k82914L8046A3192a63196c4099j2565C38281q4565f567j54188A86699
$$ -26144 -309058 -271012 13192 -163196 -34099 -46664 338281 253716 -6567 -160755 186699
18588a66308m7060m578I0342a16495D6519i9789E2362a45192a5289E2176d64444
$$ -166308 -213368 -217946 90342 -116495 46519 -99789 52362 -145192 -15289 52176 -464444
18576A19644b08680K5525L110B17718J3038b55279i8416k90528h256j50686l5560
$$ 119644 -208680 -183155 -180045 217718 230756 -255279 -98416 -388944 -8256 -158942 -194502
18565a94502o1722A55253a19129A24075K4680i7420I8744a52850R242H6904E394
$$ -194502 -256224 155253 -119129 124075 148755 -97420 98744 -152850 -143608 86904 5394
18553A14179b03112F8210J65101b0314B92576c09850h3600E5475L1823m2199C83
$$ 114179 -203112 68210 233311 -20314 292576 -309850 -83600 55475 87298 45099 383
18541B14556a88181B30173a12835a3998C2767m208L0092r01N205r996a21409A20248
$$ 214556 -188181 230173 -112835 -13998 32767 28559 58651 57750 62955 52959 -121409 120248
18528A02206d11509a51702N3176o3055g4761o1078f2192n6328L9566B50592o2269
$$ 102206 -411509 -151702 -98526 -161581 -74761 -135839 -62192 -118520 -78954 250592 188323
18517A88323a65433D04683f3441B7811a74336L4097N3064G26a57219c3478m978
$$ 188323 -165433 404683 -63441 27811 -174336 -140239 -87175 726 -157219 -33478 -38456
18506c8456q9567H205h6971p7181A07283f3710A0229a96111j83367G1119g4628
$$ -38456 -128023 8205 -86971 -164152 107283 -63710 10229 -196111 -379478 71119 -74628
18494g3108m1815K2715G4598B7342b40618A92189c9941A51732a90714f5337D0828
$$ -73108 -114923 -92208 74598 27342 -240618 192189 -39941 151732 -190714 -65337 40828
18482a58729q4571D8776a73783J6442O4185B05926a07952k1544G0510J6206c38788
$$ -158729 -243300 48776 -173783 -157341 -93156 205926 -107952 -129496 70510 86716 -338788
18470A47904K15592a31628L0307r7014D489b81747h7583k0644C5493L11805g5051
$$ 147904 363496 -131628 -101321 -198335 4489 -281747 -87583 -108227 35493 347298 -75051
18458b28834A57744b3043k436j91750j20641a03638p5166f0047A14920c0825a1147
$$ -228834 157744 -23043 -25479 -217229 -337870 -103638 -178804 -60047 114920 -30825 -11147
18446a37259n6686E0974b14060C3739N0285g5345Q383j1560A23531b34979D2220
$$ -137259 -193945 50974 -214060 33739 84024 -75345 -66962 -78522 123531 -234979 42220
18434c67817a25258A17940b63225N1617I9327a33502j78053d5065E7776b48142
$$ -367817 -125258 117940 -263225 -211608 99327 -133502 -311555 -45065 57776 -248142
18423f5264I4384d57944b5946o6875j70489D1550a56421D0057L7435a98931B71256
$$ -65264 94384 -457944 -25946 -92821 -263310 41550 -156421 40057 77492 -198931 271256
18411a46600F4647a65239A66772a6686l14438A33625P8893L0034a15479F0821
$$ -146600 64647 -165239 166772 -16686 -331124 133625 212518 242552 -115479 60821
18400c68134A23964l8930a12037b7716n3284A67322a97136G739f8455L1833C3821
$$ -368134 123964 85034 -112037 -27716 -81000 167322 -197136 7739 -68455 -36622 33821
18388a15076b6587k10493p3049G0523a14172b1579j08824f3513J8592j67656A65703
$$ -115076 -26587 -237080 -310129 70523 -114172 -21579 -130403 -63513 -44921 -212577 165703
18376g0062A16374J88820a76738A39675f9244B90535G4030L8351j3191e0519j10473
$$ -70062 116374 305194 -176738 139675 -69244 290535 74030 112381 99190 -50519 -160992
18365a60992J275O7052b2910n9644c6528d502A49984j5122C6074i2616F6516B6601
$$ -160992 -159717 -92665 -22910 -82554 -36528 -4502 149984 134862 36074 -92616 66516 26601
18352b25275a347C74938j39468b00443N9487B2323J81122b23634E2219d9820D1198
$$ -225275 -1347 374938 235470 -200443 -140956 22323 203445 -223634 52219 -49820 41198
18340i1561j44011h922C47566a48892f7628A67589c13199N8164H6605b99210l9615
$$ -91561 -235572 -8922 347566 -148892 -67628 167589 -313199 -255035 86605 -299210 -338825
18329c38825g0681p8479m3801b6830B595J99030d13143a32998H2932a10990q3471
$$ -338825 -70681 -149160 -192961 -26830 2595 201625 -413143 -132998 82932 -110990 -194461
18318a94461I2836d7523q4286f3631a6973k1869E1223F849f4259b8797k61594
$$ -194461 92836 -47523 -131809 -63631 -16973 -38842 51223 6849 -64259 -28797 -290391
18307b90391K2560j5594C834R44L6311a74164A29684d8324j23850H955a07115
$$ -290391 -267831 -283425 3834 4778 41089 -174164 129684 -48324 -172174 8955 -107115
18295D5681R1066h0714j11015k1929J06037G2628a05399A25902a25196r5237A21716
$$ 45681 136747 -80714 -191729 -213658 -107621 72628 -105399 125902 -125196 -220433 121716
18283A43e1627K4056q5989E4497K89053d0925B73566i1668G6933B3092b19270
$$ 143 -51627 -27571 -113560 54497 343550 -40925 273566 -91668 76933 23092 -219270
18271C668d06824J56832j8813i535k79416h6037l09556A14771k2456D546a06172
$$ 3668 -406824 -249992 -268805 -9535 -288951 -86037 -395593 114771 92315 4546 -106172
18259C31643c704k0886G9655A9298L9975b66343p4499D1775a95413h637p1983
$$ 331643 -3704 -24590 79655 19298 59273 -266343 -340842 41775 -195413 -8637 -80620
18248h0620A5167K36607F5269k2334a06127A00679a98538c80j09935R58I5269
$$ -80620 15167 251774 65269 42935 -106127 100679 -198538 -380 -110315 -109357 95269
18236g7498n9075L8898B65733D1676c79062M2278a26835e6069j83043h4202b7606
$$ -77498 -136573 -97675 265733 41676 -379062 -336784 -126835 -56069 -239112 -84202 -27606
18224e4101B87554j07851c15911A52491b86105i2437k6973j8389o0179c1814k9408
$$ -54101 287554 179703 -315911 152491 -286105 -92437 -119410 -137799 -197978 -31814 -61222
18213f1222A50518h5117C78934a29976B9169i0983p1183j46932c3185l89764J00768
$$ -61222 150518 -85117 378934 -129976 29169 -90983 -162166 -309098 -33185 -422949 -322181
18202c22181L301b4534H1725e07035a94810j35205A96200B2343a61195o8774G7452
$$ -322181 -318880 -24534 81725 -507035 -194810 -330015 196200 22343 -161195 -229969 77452
18190a05536j8934L7591I1104J30287A04913K95232a67872j04930Q5139F498d858
$$ -105536 -124470 -86879 91104 221391 104913 400145 -167872 -272802 -187663 6498 -4858
18178A71355o9856f1594A94458a45377A70974c54161A11278a37457l571A6591
$$ 171355 101499 -61594 194458 -145377 170974 -354161 111278 -137457 -141028 16591
18167B3210Q3419D4035J22352R3584L6144b45093a22437j43010r4469f2427A03318
$$ 23210 106629 44035 166387 259971 296115 -245093 -122437 -265447 -359916 -62427 103318
18155i1486k84787J50339N8269B6713a95933F1410h1888k38309A58495k4339J0121
$$ -91486 -376273 -225934 -167665 26713 -195933 61410 -81888 -320197 158495 134156 144277
18144A44277P4377i3296l4317A53343d1756B08892g0252A13499J49683D2767a19376
$$ 144277 218654 -93296 -127613 153343 -41756 208892 -70252 113499 263182 42767 -119376
18132a7980B64391a61819B59616b57825f3971j21206b4923B80971b01472Q2649
$$ -17980 264391 -161819 259616 -257825 -63971 -185177 -24923 280971 -201472 -118823
18122a18823B19790a17635j99530b9842A78154J73949b40082H4224b7484B79545
$$ -118823 219790 -117635 -317165 -29842 178154 352103 -240082 84224 -27484 279545
18111C3967g2874I3502h7022B59955a95337B7464i1273B16161m9839J1828A0096
$$ 33967 -72874 93502 -87022 259955 -195337 27464 -91273 216161 166322 178150 10096
18099a28186c566H3632d046j42973d5911D8737a53410d0143k86186H8989a24242
$$ -128186 -3566 83632 -4046 -147019 -45911 48737 -153410 -40143 -326329 88989 -124242
18087b73408a01194d8252k85378A09233a33807o0711B73176A32237b66434E5789
$$ -273408 -101194 -48252 -333630 109233 -133807 -194518 273176 132237 -266434 55789
18076c9494j52474l7009q075A09270a84314B67649b42070j60668O9592A70242
$$ -39494 -191968 -228977 -237052 109270 -184314 267649 -242070 -402738 -333146 170242
18065b35919G8555J871a81455k2875O8065B5667J69851b09556R7255D47691a24257
$$ -235919 78555 80426 -181455 -204330 -136265 25667 195518 -209556 -112301 447691 -124257
18053B09606a43944e9376C5491L0151d3513G9424B2724L3410L3413J62378b33772
$$ 209606 -143944 -59376 35491 65642 -43513 79424 22724 56134 89547 251925 -233772
18041a25985i129A23081A7788K79488a686j1341A21129K6588l3669m4606B5434
$$ -125985 -9129 123081 17788 297276 -1686 -13027 121129 147717 114048 69442 25434
18029b42360a20922A19407a48220a933o7622J6576l6542H9581L33787A23517K52121
$$ -242360 -120922 119407 -148220 -1933 -69555 -52979 -89521 89581 423368 123517 375638
18018C75638b17602A11630a54299A71898b20779O7144p8802G498K58014q5496
$$ 375638 -217602 111630 -154299 171898 -220779 -153635 -232437 7498 265512 180016
18008A80016d315j19278K1788A99368b42660D11553b8934C73234E8289P553O2102
$$ 180016 -4315 -123593 -101805 199368 -242660 411553 -28934 373234 58289 65842 127944
17997A27944a23535A18141J58614A6163K52570F5103g9066o0838R007e9775l41976
$$ 127944 -123535 118141 276755 16163 268733 65103 -79066 -139904 -130897 -59775 -401751
17986d01751A51482A685a12447A59192M6034k0792i8104N615G175i9733J9547
$$ -401751 151482 1685 -112447 159192 205226 184434 -98104 -92489 7175 -99733 -80186
17975h0186F8282J63361A3056b37996C6645J64140a60696j8865a9828B60419a88650
$$ -80186 68282 231643 13056 -237996 36645 200785 -160696 -179561 -19828 260419 -188650
17963a45294A35561F7284M9917d5616p3177d1676B8395a97093A77969o3541K10370
$$ -145294 135561 67284 117201 -45616 -118793 -41676 28395 -197093 177969 114428 324798
17952C24798H2301L6769E7101h353C5759a09169A30067a74533I4755D2294e9868
$$ 324798 82301 119070 57101 -8353 35759 -109169 130067 -174533 94755 42294 -59868
17940A3330a5545o6181B9324d4470j07797M1010L4643p8706B31023b75990A97094
$$ 13330 -15545 -81726 29324 -44470 -152267 -111257 -76614 -155320 231023 -275990 197094
17928c0616B6689E870B72J6774b11052C7371J01599m1716L27906F0953a27803
$$ -30616 26689 5870 272 17046 -211052 37371 138970 97254 425160 60953 -127803
17916B07426A815M07473a40215l05343b19723O3163G9720J21977o4151n6094J21952
$$ 207426 1815 409288 -140215 -445558 -219723 -156560 79720 201697 137546 81452 203404
17905B03404e2046A02395K692a66578n7868b4279j97975A94101G7860a04288A38312
$$ 203404 -52046 102395 105087 -166578 -224446 -24279 -222254 194101 77860 -104288 138312
17893c03617o1783A38060J99572a10379A09523B6440b71141Q8262d1345A57838
$$ -303617 -365400 138060 337632 -110379 109523 26440 -271141 -182879 -41345 157838
17882I4079c49354a19080A02493a67642A13602C0644c2901A96310E4354a36804
$$ 94079 -349354 -119080 102493 -167642 113602 30644 -32901 196310 54354 -136804
17871D3041c8442l45593a34381L8217j46228a14791g405j37184J1923j4158B90825
$$ 43041 -38442 -384035 -134381 -96164 -242392 -114791 -7405 -144589 -132666 -146824 290825
17859C817K1663r319M2675A892e6573A95038E2535J01575b01760C55137b10697
$$ 3817 25480 16161 58836 1892 -56573 195038 52535 154110 -201760 355137 -210697
17847G862g479A13286K0028b04499A22006Q9935g0563l1760G8826R0468a70274
$$ 7862 -7479 113286 133314 -204499 122006 211941 -70563 -102323 78826 169294 -170274
17835i5184l7126m970J5170j17909E1984d6477k28091N1777a1691C825b87159
$$ -95184 -132310 -137280 -122110 -240019 51984 -46477 -274568 -222791 -11691 3825 -287159
17823c1187c695j78462E4583a11293j39439A42749c08100E17962I3989b18592
$$ -31187 -3695 -182157 54583 -111293 -250732 142749 -308100 517962 93989 -218592
17812C4690g2290E1692J11414d4134B7253h9678A41073a21419N2891r0507H1321
$$ 34690 -72290 51692 163106 -44134 27253 -89678 141073 -121419 -68528 -159035 81321
17800f8123C6579b49839d1080A65291K1204k2386c54388d974A28198e614H0284
$$ -68123 36579 -249839 -41080 165291 186495 164109 -354388 -4974 128198 -5614 80284
17788a37332j23408k037A28957b36533a05346d2799A09743i4330L3790A78669
$$ -137332 -260740 -262777 128957 -236533 -105346 -42799 109743 -94330 -60540 178669
17777b04584H5529m2058O4058J0679J87386a749C8078L11858A04084a22390D00000
$$ -204584 85529 43471 107529 118208 305594 -1749 38078 349936 104084 -122390 400000
17765A24636f9806B58341b7300D05564A47565d3208l7777A07103l8093h3364j4772
$$ 124636 -69806 258341 -27300 405564 147565 -43208 -80985 107103 69010 -83364 -98136
17754i8136c6519B19764b1120j39441e1945A01685Q0591J2392J21708b1648E057
$$ -98136 -36519 219764 -21120 -160561 -51945 101685 182276 194668 316376 -21648 5057
17742C34973a23464j10446A04740b3727C3706b76875J17795P2008m70343B31472
$$ 334973 -123464 -233910 104740 -23727 33706 -276875 -159080 -87072 -557415 231472
17731B78924a11339m6806O2217B04206a9423j8547D2218P9355J06849a61480d3159
$$ 278924 -111339 -158145 -95928 204206 -19423 -37970 42218 121573 228422 -161480 -43159
17719B23293P568I1652m2994c25316J26283A15724b3720j9063B14229F0299J25526
$$ 223293 230861 91652 48658 -325316 -199033 115724 -23720 -42783 214229 60299 185825
17708A85825i7068A00302J23723i6971b4767E4875J15862K1469g2295B02190G7133
$$ 185825 -97068 100302 224025 -96971 -24767 54875 170737 192206 -72295 202190 77133
17696A35625L61010a24685c6939H2800Q461A2772c23262A277K34600j12004f5097
$$ 135625 496635 -124685 -36939 82800 91261 12772 -323262 1277 235877 123873 -65097
17684F7142K53741c1675m12237a89765B8233B674e2714B27070a43510f9131j85869
$$ 67142 320883 -31675 -443912 -189765 28233 2674 -52714 227070 -143510 -69131 -255000
17673b55000A35363f9982C16187e5956A50708F7900L29081I5703a72875B55391
$$ -255000 135363 -69982 316187 -55956 150708 67900 396981 95703 -172875 255391
17662E0091A7201a08371H3783j0998K53411I3151Q3440a1999B34203j4068C7486
$$ 50091 17201 -108371 83783 72785 326196 93151 176591 -11999 234203 220135 37486
17650B57456h3965A08192a39020A68920f5354A92746H0314d8162j12287I5048
$$ 257456 -83965 108192 -139020 168920 -65354 192746 80314 -48162 -160449 95048
17639A59310a25512B90611a47038B78224b09560A37423b83605D2546c01591J10035
$$ 159310 -125512 290611 -147038 278224 -209560 137423 -283605 42546 -301591 -191556
17629a91556j0293M0656A22821R4184b5565r462f237A6423a04114p3095O8720
$$ -191556 -201849 -161193 122821 217005 -25565 -35027 -6237 16423 -104114 -177209 -108489
17618a08489B86060I1913e5493B88905I1038J17315L1741a26091A32424a16100
$$ -108489 286060 91913 -55493 288905 91038 208353 240094 -126091 132424 -116100
17607B76881f6578A33602M5281e8600B4150N2120k8628E508J06996b20850A72377
$$ 276881 -66578 133602 178883 -58600 24150 76270 47642 5508 112504 -220850 172377
17595A56270k2361n033b95693i0202A67092O6720D4120b3354A38387N5396p2837
$$ 156270 133909 128876 -295693 -90202 167092 233812 44120 -23354 138387 193783 120946
17584A20946J28023J24095j01392e1213j87417B72936A07492g6779k88668e9542
$$ 120946 248969 373064 271672 -51213 -238630 272936 107492 -76779 -365447 -59542
17573b28698i5199G5383h910A9798J98361H810c1809m6849B93427a0571d787A0424
$$ -228698 -95199 75383 -8910 19798 218159 8810 -31809 -78658 293427 -10571 -4787 10424
17560B41418C4740a20092G2868f4708G8056a74050A32671E9326i9148A5422K36216
$$ 241418 34740 -120092 72868 -64708 78056 -174050 132671 59326 -99148 15422 251638
17549B51638a06242C04289H6892m2509b5059E6032L39690a5341B46338G730c6918
$$ 251638 -106242 304289 86892 44383 -25059 56032 395722 -15341 246338 7730 -36918
17537B11278I1788k9402g41A07114J15947K84R2340c5498A70637E1578M1823a94239
$$ 211278 91788 62386 -741 107114 223061 223345 315685 -35498 170637 51578 93401 -194239
17524d1942n9727c0098r940B93142A34650D2526g8373m2061B55958I0542C4933
$$ -41942 -101669 -30098 -40038 293142 134650 42526 -78373 -120434 255958 90542 34933
17512A41768e7746A53951f652G4035J2615J06293m2357D1364a54058A27611m4250
$$ 141768 -57746 153951 -6652 74035 86650 192943 150586 41364 -154058 127611 83361
17501H3361c19697a41711A89443q1991C7910d5014D30882b31100j4822a04100
$$ 83361 -319697 -141711 189443 107452 37910 -45014 430882 -231100 -245922 -104100
17490E3495L06100D009L7456Q9721J98939E7161a9035d301A44883f4797B14422
$$ 53495 359595 4009 41465 131186 330125 57161 -19035 -4301 144883 -64797 214422
17478B95018n8877I3482b52331d9337B2060M56987A85042O2823E3719f010o7637
$$ 295018 236141 93482 -252331 -49337 22060 479047 185042 247865 53719 -6010 -73647
17467g3647F2881Q8080B9607K17191a13537A52978I194K69382j24648K99540j70602
$$ -73647 62881 150961 29607 246798 -113537 152978 9194 278576 153928 453468 282866
17456B82866E9265J24857a7189D56258D9999B3218L46889D1322J75869j9472J89886
$$ 282866 59265 184122 -17189 456258 49999 23218 370107 41322 217191 197719 387605
17445C87605j8343n2892n0825K41010j38868A19559R684N9352R6074K17281G4349
$$ 387605 369262 316370 265545 506555 367687 119559 129243 188595 284669 501950 74349
17433B08990P1130j21908a81884A95464C31J63380J06154o4009O9867J12483a2288
$$ 208990 280120 158212 -181884 195464 331 163711 269865 205856 275723 388206 -12288
17421D91906p4213F3650L45272J18251A56353k1259J8645E3587H410L67992J436
$$ 491906 417693 63650 408922 527173 156353 135094 153739 53587 8410 376402 377838
17410C77838D9871K42969l6763H9251N0912K23343l0440M9054A8740H48P7753
$$ 377838 49871 292840 256077 89251 140163 363506 333066 382120 18740 848 78601
17399G8601J56079H5756c1266F7770a6521A37865K02303a44541A66008p8297L24281
$$ 78601 234680 85756 -31266 67770 -16521 137865 340168 -144541 166008 87711 411992
17388D11992g8400D14795E6093L4094J64142H6141l4846N0878m5419P2803f0985
$$ 411992 -78400 414795 56093 90187 254329 86141 51295 102173 56754 129557 -60985
17376F1079L81421f4654D04006j71047n6939J03669A8704K00080E3112K1737i281
$$ 61079 442500 -64654 404006 232959 176020 279689 18704 218784 53112 74849 -9281
17364A79942G546K12124q0027d3298D2304O7369m6711J13389p9979a40823B14128
$$ 179942 7546 219670 139643 -43298 42304 109673 62962 176351 96372 -140823 214128
17352E7530O4437Q3028J87929j22382A11743R7413j5733K27424r8156J1013d4178
$$ 57530 121967 204995 392924 270542 111743 209156 193423 420847 322691 333704 -44178
17340A58162J20455K37872j42864j14371J0404o468j22376r611B7641K17739q1205
$$ 158162 278617 516489 373625 259254 269658 263190 140814 131203 27641 245380 164175
17329A64175J89367I703L14946b89127J10201C14249A00165J26938N6797M4800
$$ 164175 353542 9703 324649 -289127 -178926 314249 100165 227103 283900 328700
17319C28700P3763g9489E60233m9749F5370K58386q9368J03581e8198C74382J78623
$$ 328700 402463 -79489 560233 510484 65370 323756 234388 337969 -58198 374382 553005
17308E53005j79918A40564C8115b2348H447J43366O3336p769k6913N76d1256B9862
$$ 553005 373087 140564 38115 -22348 8447 151813 215149 207380 180467 181043 -41256 29862
17295F2793K26242b83113C92553q5088j03259J72066A37484n2192J58836F3776
$$ 62793 289035 -283113 392553 307465 204206 376272 137484 85292 244128 63776
17284C22560p1320J56250G3659e2925A73392Q2055J23611r0353A35860K7270L02555
$$ 322560 251240 407490 73659 -52925 173392 255447 379058 288705 135860 163130 465685
17273D65685A15876K1623K13484A05206R0217J6736k5715J44831j15848K23840
$$ 465685 115876 137499 350983 105206 195423 212159 186444 331275 215427 439267
17263D39267g2791B32758f3911A96328Q1726q5619K59798j76287A29886J69015
$$ 439267 -72791 232758 -63911 196328 278054 192435 452233 275946 129886 298901
17253B98901L13243j10608A09738P883M2816J82535A65947o4312k2337K69590
$$ 298901 612144 501536 109738 117621 160437 342972 165947 101635 79298 348888
17243C48888J6183Q6908k07198f9220B23526K09146p3348j62037K378J58153b12605
$$ 348888 365071 451979 244781 -69220 223526 432672 359324 197287 199665 357818 -212605
17231C05880j00392J49027j68162L84543B35488P6883K34596A92559C7384J13021
$$ 305880 205488 354515 186353 570896 235488 312371 546967 192559 37384 150405
17221A50405J11108F2793K04823J17577j03877H4497L56035A68065k6571L86200
$$ 150405 261513 62793 267616 385193 281316 84497 440532 168065 141494 527694
17211E27694j81558j62664K0048d1151D17870K1113j31903K41536c6580C42656
$$ 527694 346136 183472 203520 -41151 417870 438983 307080 548616 -36580 342656
17200C26694J41184B04769N602F8010o899K08963m1558q4751M96284G1244K21743
$$ 326694 467878 204769 210371 68010 61111 270074 228516 143765 640049 71244 292987
17189B92987J47316G3458J38318J50786J53616B19387K66970R8006A93581a01201
$$ 292987 440303 73458 211776 362562 516178 219387 486357 584363 193581 -101201
17178C03892n6149P7247j05437Q8794O8422J69254k60484L3876l7471K4776k6665
$$ 303892 247743 324990 219553 308347 376769 546023 285539 319415 281944 306720 280055
17167B80055J21515j53364A11920K08558p1020F9787K26137j25683K44473F3067
$$ 280055 401570 248206 111920 320478 249458 69787 295924 170241 414714 63067
17156B53007n593A13575J65633K7291j7332M5219A09686J80919K50809k07001
$$ 253007 247414 113575 279208 306499 289167 334386 109686 290605 541414 334413
17146C34413Q5623J36523k46642O6407O206J65874M4657B53481K24876p0081L0086
$$ 334413 420036 556559 309917 376324 382530 548404 593061 253481 478357 408276 438362
17135D38362j8437J37763B77780J40327P2811k27681K59489B3132N20027k50651
$$ 438362 419925 557688 277780 418107 490918 263237 522726 23132 543159 292508
17125B92508K75584j99467M9080H0065K24356r2158M26436k45866J04575k36836
$$ 292508 568092 368625 417705 80065 304421 212263 638699 392833 497408 260572
17115B60572K3733K25188A98909K75335j76885o251K08555p3840j41550J04500
$$ 260572 284305 509493 198909 474244 297359 291108 499663 425823 284273 388773
17105C88773Q0464j25470R7564n2093K89563B47426J16922J10004k3042M318k12921
$$ 388773 469237 343767 441331 389238 678801 247426 364348 474352 451310 455628 242707
17094B42707J60016N2431N3028n1791K10696l21131q2304M13006j64911O7248
$$ 242707 402723 455154 508182 456391 667087 345956 263652 676658 511747 578995
17084E78995K09254l38907j68272L59709B68526l8286J61055J86204J00454n9575
$$ 578995 788249 449342 281070 640779 268526 230240 391295 577499 677953 618378
17074F18378j8851p6388O6425Q6201l24255p4581J77502K39873k97481P7016j60075
$$ 618378 599527 523139 589564 675765 351510 276929 454431 694304 396823 473839 313764
17063C13764J90130j12273L51865q6338m8193k05614M57996l67260K09893L4621
$$ 313764 503894 391621 743486 657148 608955 403341 861337 494077 703970 738591
17053G38591j75986M56953j80635q3189L17058q9757k01507j63572L04095m13804
$$ 738591 562605 1019558 838923 755734 1072792 983035 781528 617956 922051 508247
17043E08247K26281p5903B91052K24393p8866K13970l6967j73758L38244j05419
$$ 508247 734528 658625 291052 515445 436579 650549 613582 439824 778068 672649
17033F72649L1486l8207j09137J00603J19103l7971j11891M59896C96239L48980
$$ 672649 704135 665928 556791 657394 776497 738526 626635 1086531 396239 745219
17023G45219o3450J53887j29313l2570j25738K56576j7956J36776r823j29418
$$ 745219 681769 835656 706343 673773 548035 804611 786655 923431 913608 784190
17013G84190L737J12457p7908l37783L32074K00122l95057J18184M1278J37831
$$ 784190 787927 900384 822476 484693 816767 1016889 621832 740016 781294 919125
17003I19125p1146k13589J38112j2072k2192M1749J74228n4617O4463L0735P2038
$$ 919125 847979 634390 772502 760430 738238 779987 954215 899598 964061 994796 1066834
16992A066834j30472j65212J214j48421K12112M01071j68172K53066n17238L67200
$$ 1066834 936362 771150 772364 623943 836055 1237126 1068954 1322020 804782 1171982
16982A171982k82049k9220K10298n4306K0439K83494m23687L34190j43818L2303
$$ 1171982 889933 860713 1071011 1016705 1037144 1320638 896951 1231141 1087323 1119626
16972A119626r0330j60881O5692L27930k40625J47732o6423J90431m25202K6521
$$ 1119626 1029296 868415 934107 1262037 1021412 1169144 1102721 1293152 867950 894471
16962H94471K20813K76963m31639N7006K57118J7355J88176j12432r2932l910
$$ 894471 1115284 1392247 960608 1017614 1274732 1292087 1480263 1367831 1274899 1270989
16952A270989J33100k6464J36340Q95l09769M82505n93040J99768j03575K67678
$$ 1270989 1404089 1377625 1513965 1514860 1205091 1687596 1094556 1294324 1190749 1458427
16942A458427m3406Q069q3606k38341K64840L5952j3758K3182j49916L95867k02201
$$ 1458427 1415021 1423090 1339484 1101143 1365983 1401935 1388177 1411359 1261443 1657310 1455109
16931A455109J3160R4612K07452k48499K04051R4071j7708k60716L2953n6525
$$ 1455109 1468269 1562881 1770333 1521834 1725885 1819956 1802248 1541532 1574485 1517960
16921A517960q5724K18411M260l9468J23094J30822l1610l8544K9784j89996J99933
$$ 1517960 1432236 1650647 1654907 1615439 1738533 1869355 1837745 1799201 1828985 1638989 1838922
16910A838922k9287k88354K14409L83573j50919j19828P2342o2516L27256k61219
$$ 1838922 1809635 1521281 1735690 2119263 1968344 1848516 1920858 1858342 2185598 1924379
16900A924379J20173n1539J47186K45589j58329l70284O75623k35004J34356k27909
$$ 1924379 2044552 1993013 2140199 2385788 2227459 1857175 2532798 2297794 2432150 2204241
16890B204241L67861m72621J43565L01138J68820m40712K57192o6923J38954O0859
$$ 2204241 2572102 2099481 2243046 2544184 2713004 2272292 2529484 2462561 2601515 2662374
16880B662374R1959J99232l75169p9671K34377L30368n45289K47617J99580r0794
$$ 2662374 2754333 2953565 2578396 2498725 2733102 3063470 2518181 2765798 2965378 2874584
16870B874584J33301l30154L42417R0325O6447j29596J39014K53335j62034Q5374
$$ 2874584 3007885 2677731 3020148 3110473 3176920 3047324 3186338 3439673 3277639 3363013
16860C363013j67910K62195K972j40667J60499J83974l5278K53924N0098n73336
$$ 3363013 3195103 3457298 3460270 3319603 3480102 3664076 3628798 3882722 3932820 3359484
16850C359484N65087n28121O29791J76812r1464j52877P2629J11593L54564l15516
$$ 3359484 3924571 3396450 4026241 4203053 4111589 3958712 4031341 4142934 4497498 4181982
16840D181982J40385J71078J58630j69785o1763L86326R8726O8318k06456K33539
$$ 4181982 4322367 4493445 4652075 4482290 4420527 4806853 4905579 4973897 4767441 5000980
16830E000980l2246J82184N55305q7227j89352Q2938J69553K14823J43889J2348
$$ 5000980 4968734 5150918 5706223 5618996 5429644 5512582 5682135 5896958 6040847 6053195
16820F053195J21495J16471J11678j34612L48629P7971P9618O4966L17159J76069
$$ 6053195 6174690 6291161 6402839 6268227 6616856 6694827 6774445 6839411 7156570 7332639
16810G332639O2088L60069O6640J90293K38999P6397Q5585K56307J57062K85862
$$ 7332639 7394727 7754796 7821436 8011729 8250728 8327125 8412710 8669017 8826079 9111941
16800I111941K28918J66903L02610K9420L3614N14124K78501K07369K61178K69629
$$ 9111941 9340859 9507762 9810372 9839792 9873406 10387530 10666031 10873400 11134578 11404207
16790A1404207M62596j05373P03280O1433J97902O53667Q8331L60064M87848P03482
$$ 11404207 11866803 11761430 12464710 12526143 12724045 13377712 13466043 13826107 14313955 15017437
16780A5017437L59002M70700L11328L97719M96741Q96368J95253P18394M44633
$$ 15017437 15376439 15847139 16158467 16556186 17052927 17949295 18144548 18862942 19307575
16771A9307575Q77924K66659Q41085R43575O20117N28814J082215P20405J261218
$$ 19307575 20185499 20452158 21293243 22236818 22856935 23385749 24467964 25188369 26449587
16762B6449587Q58667J035163R99630J164845J150377J448584J376938J607504
$$ 26449587 27308254 28343417 29343047 30507892 31658269 33106853 34483791 36091295
16754C6091295J179622J392330J735167J751796K300451J809472K366331K252819
$$ 36091295 37270917 38663247 40398414 42150210 44450661 46260133 48626464 50879283
16746E0879283K447021K365056K837131K917281L190488L281125L497141L602891
$$ 50879283 53326304 55691360 58528491 61445772 64636260 67917385 71414526 75017417
16738G5017417L744677M178915M128748M806086M676169N486890M984543N823654
$$ 75017417 78762094 82941009 87069757 91875843 96552012 102038902 107023445 112847099
16730A12847099N205131N860805O244089O224241O130763N657496N569027N681275
$$ 112847099 118052230 123913035 130157124 136381365 142512128 148169624 153738651 159419926
16722A59419926N079115M500374L826410L362396K413901J139159O40208p01126
$$ 159419926 164499041 168999415 172825825 176188221 178602122 179741281 180381489 179680363
16714A79680363j497461k645181l451005l931281m580560n612957n689229n908853
$$ 179680363 178182902 175537721 172086716 168155435 163574875 157961918 152272689 146363836
16706A46363836o649714n704359o283667o447649n987923n910193n623896n281155
$$ 146363836 139714122 134009763 127726096 121278447 115290524 109380331 103756435 98475280
16698I8475280n242178n034122m440187m404212m365190l971565l569391l453962
$$ 98475280 93233102 88198980 83758793 79354581 74989391 71017826 67448435 63994473
16690F3994473l415735l054134k726959k607172k516583k132792k566972k071710
$$ 63994473 60578738 57524604 54797645 52190473 49673890 47541098 44974126 42902416
16682D2902416j867983j926897j430869j556969j912476j343405j491648j302618
$$ 42902416 41034433 39107536 37676667 36119698 34207222 32863817 31372169 30069551
16674C0069551j035899j139209j438411j072676k92947j223536j142160j49955
$$ 30069551 29033652 27894443 26456032 25383356 25090409 23866873 22724713 22574758
16666B2574758j034705j098118o02653n68580p84170l18631m98965q98575o76962
$$ 22574758 21540053 20441935 19839282 19270702 18486532 18167901 17668936 16770361 16093399
16657A6093399l26120p00121m23080l17329l69675j74597o53542L0384q02000
$$ 16093399 15767279 15067158 14644078 14326749 13957074 13782477 13128935 13159319 12357319
16648A2357319k98766m3058p07632l24365K40591r39154j55218o47217O4085Q9071
$$ 12357319 12058553 12015495 11307863 10983498 11224089 10284935 10129717 9482500 9546585 9635656
16638I635656m08928m83510m7548j23818k26142j62264j81320J78644k36505p07603
$$ 9635656 9226728 8743218 8695670 8571852 8345710 8183446 8002126 8180770 7944265 7236662
16628G236662J79642m92678l45605J24268N5686k44507k46610j12917P7343M2619
$$ 7236662 7416304 6923626 6578021 6702289 6757975 6513468 6266858 6153941 6231284 6273903
16618F273903m14334j82813j25661J30630J9738l98192n9081n43629L18809j4505
$$ 6273903 5859569 5676756 5551095 5681725 5701463 5303271 5244190 4700561 5019370 5004865
16608E004865j41293j08222J31520k74855m8936l54939j07548L05933q2362j08049
$$ 5004865 4863572 4755350 4886870 4612015 4563079 4208140 4100592 4406525 4324163 4216114
16598D216114k64953l3662j83595K5115k26434J91781l52238L09060l76825J43289
$$ 4216114 3951161 3917499 3733904 3759019 3532585 3724366 3372128 3681188 3304363 3447652
16588C447652k26610J91523q7146j67967j48405j38936k9096K44217k81310J11036
$$ 3447652 3221042 3412565 3325419 3157452 3009047 2870111 2841015 3085232 2803922 2914958
16578B914958M0715l2404J05084l88249J35869k50830K2072M2236j19745k65528
$$ 2914958 2955673 2923269 3028353 2640104 2775973 2525143 2547215 2589451 2469706 2204178
16568B204178K87658o3357j55805Q3789j74598M4039J27264q7280k92172j06769
$$ 2204178 2491836 2428479 2272674 2356463 2181865 2225904 2353168 2265888 1973716 1866947
16558A866947M54419l23995J06823k44807J88734k53227M17395m41866J07315
$$ 1866947 2321366 1997371 2104194 1859387 2048121 1794894 2212289 1770423 1877738
16549A877738R0362j33453p4815K47226k95234L758K18585q6356k16729k7376
$$ 1877738 1968100 1834647 1759832 2007058 1711824 1715582 1934167 1847811 1631082 1603706
16539A603706K0985j91621N67152n50159L44765k60806k54439J82565J08288j31228
$$ 1603706 1624691 1433070 2000222 1450063 1794828 1534022 1279583 1462148 1570436 1439208
16529A439208K88601l74518O1206K39703j38763k1606k70004J53666J07664l67962
$$ 1439208 1727809 1353291 1414497 1654200 1515437 1493831 1223827 1377493 1485157 1117195
16519A117195K54426n6477J77333k55090J53611m90563r949L37799O5763M6771
$$ 1117195 1371621 1315144 1492477 1237387 1390998 900435 890486 1228285 1294048 1340819
16509A340819j48445n5649j3170j79795j40250M46937j80930k5823K949L1178
$$ 1340819 1192374 1136725 1123555 943760 803510 1250447 1069517 1043694 1046643 1077821
16499A077821J61148k84568n59j43528L06154o6837K06350l05942l1244r1317
$$ 1077821 1238969 954401 953842 810314 1116468 1049631 1255981 950039 918795 827478
16489H27478J67028K8389r5271J30989r583l5947O305p3218n5098R7350K75218
$$ 827478 994506 1022895 927624 1058613 1049030 1013083 1019388 946170 891072 988422 1263640
16478A263640C13228P77986q6680l36708J38588j75158l1114k3303J31860m0701
$$ 1263640 313228 1091214 1004534 667826 806414 631256 600142 576839 708699 667998
16468F67998n0411K17011j05854L1173q9835N878R4388O8513m1725l46649M84239
$$ 667998 617587 834598 728744 759917 670082 675960 770348 838861 797136 450487 934726
16457I34726k05223o56k38648k29622M79284j68927j1559k06163K60033Q91K86555
$$ 934726 729503 728847 490199 260577 739861 570934 559375 353212 613245 614136 900691
16446I00691l24119Q5293m3597j35768P5710Q3952m5671q7996j92429K87971J92330
$$ 900691 576572 661865 618268 482500 558210 642162 596491 508495 316066 604037 796367
16435G96367o7635j12822j12886N7023j27167j28211J62973A85375K07765k2684
$$ 796367 728732 615910 503024 560047 432880 304669 467642 185375 393140 370456
16425C70456j43839L64713B69311K69160m995j35566K57458B76725J90472N3889
$$ 370456 226617 591330 269311 538471 533476 397910 655368 276725 467197 521086
16415E21086j45764J19503M1875o2109k0781K74985r2904j28071B44636K33824
$$ 521086 375322 494825 536700 474591 453810 728795 635891 507820 244636 478460
16405D78460k16127J74395P9645o1710j66000K22071n2428j6741P1800B04147
$$ 478460 262333 436728 516373 454663 288663 510734 458306 441565 513365 204147
16394C76306l8154C1874J63709K01734J67448B19467H5827K67254C8911L80695
$$ 376306 338152 31874 195583 397317 564765 219467 85827 353081 38911 419606
16384D19606N5375I9625K22803J6723A14075P9008q710K33184M71858C24624B7563
$$ 419606 474981 99625 322428 339151 114075 193083 184373 417557 889415 324624 27563
16372B76198J06329O0433B15585J20209d0380C84707A25997J29470N9098C23L50082
$$ 276198 382527 442960 215585 335794 -40380 384707 125997 255467 314565 323 350405
16361C50405K5042H8973N2493K97305j39445O4090d4718B90221K24291k13695
$$ 350405 375447 88973 141466 438771 299326 363416 -44718 290221 514512 300817
16351C00817m2861j6918J8375K01123A75013K80953A58743M00047k34802q8721
$$ 300817 257956 241038 259413 460536 175013 455966 158743 558790 323988 235267
16341B35267J9413K352f0155B60947o5356M10467a61828B48157m0137J7774A12668
$$ 235267 254680 257032 -60155 260947 195591 606058 -161828 248157 208020 225794 112668
16329B41192J39410A70507m4058Q0909n3980a34799C05323i1900A13294L4895
$$ 241192 380602 170507 126449 207358 153378 -134799 305323 -91900 113294 148189
16319A48189L15908O9630A7020K04864p8641m3017J60135Q0683C1495K08139j1340
$$ 148189 464097 533727 17020 221884 143243 100226 260361 341044 31495 239634 228294
16308B28294A3564f8190D17303G4923C1389L30728j78860o7699J03979K18761
$$ 228294 13564 -68190 417303 74923 31389 362117 183257 115558 219537 438298
16298D38298A11626d9299A64672F0115P2778J26271J45975j37058o4193r3093
$$ 438298 111626 -49299 164672 60115 132893 259164 405139 268081 203888 110795
16288A10795B0218P2475J61708A2716L76124j16041A02658K77540A76225N6581
$$ 110795 20218 92693 254401 12716 388840 272799 102658 380198 176225 232806
16278B32806a1753B15750R7567Q8876j73116c1908B32302b73284J09219B69840
$$ 232806 -11753 215750 313317 402193 229077 -31908 232302 -273284 -164065 269840
16267C0531K62251j30225b14757A13630O0032a04487b9407D23524C278J56138
$$ 30531 292782 162557 -214757 113630 173662 -104487 -29407 423524 3278 159416
16257A59416L3105K10258A05897J8611A5181J42713e6370A48622o6658J76716
$$ 159416 192521 402779 105897 124508 15181 157894 -56370 148622 81964 258680
16247B58680A3654K5604J82100J35216o8003F67O0297M1173J53324n6448a3960
$$ 258680 13654 39258 221358 356574 288571 667 60964 102137 255461 199013 -13960
16235B01297g5987a8685A3025J60406a21572B45949j11278H654a56957G596J88908
$$ 201297 -75987 -18685 13025 173431 -121572 245949 134671 8654 -156957 7596 196504
16224A96504k6428c04853B07491J60334j47376d0776a2908l6200A07436a39367
$$ 196504 170076 -304853 207491 367825 220449 -40776 -12908 -49108 107436 -139367
16213B11580B9092P0521J18728K4291F829J78770J00853a51764A89646d5320j42280
$$ 211580 29092 99613 218341 242632 6829 185599 286452 -151764 189646 -45320 -187600
16202a87600A88708H1962b23531G5676A5862i1583c5304A06250e5191B04529A4715
$$ -187600 188708 81962 -223531 75676 15862 -91583 -35304 106250 -55191 204529 14715
16190B85455a15282B43232c386A09677a77509E0348b8962A22682c99803C8150
$$ 285455 -115282 243232 -3386 109677 -177509 50348 -28962 122682 -399803 38150
16179A49184a19596A47220Q9507r8227n1419L6642m4876C8341e8802j7000A29582
$$ 149184 -119596 147220 236727 138500 87081 123723 78847 38341 -58802 -75802 129582
16167B81451C0271J21426b7264D3859M8527R9189a55696d6057J8026B6669P1897
$$ 281451 30271 151697 -27264 43859 92386 191575 -155696 -46057 -28031 26669 98566
16156I8566b8678l1122A57091k9898K22625a35523O0146K4867A43637e9193B25773
$$ 98566 -28678 -59800 157091 127193 349818 -135523 -75377 -50510 143637 -59193 225773
16144G3093J91884m5765c5407B01727a98916I719c76951a29571B57742c74072
$$ 73093 264977 219212 -35407 201727 -198916 9719 -376951 -129571 257742 -374072
16133H3186J46156F5138b46873N802Q1413J2233A55857j2017a4846j97122n910
$$ 83186 229342 65138 -246873 -241071 -159658 -147425 155857 143840 -14846 -211968 -217878
16122b17878C24998j45898c535j88135I4197r706I084D495L0578k287N8311K46091
$$ -217878 324998 179100 -3535 -191670 94197 84491 9084 4495 35073 32786 91097 337188
16110C37188d5855D5049K45848P8858j50869j3611a08159H2920a25318C14603
$$ 337188 -45855 45049 290897 369755 218886 205275 -108159 82920 -125318 314603
16099A92367F570K74897c7006o9D4200g1913C05830c4783A55486R0315c13952
$$ 192367 6570 281467 -37006 -37075 44200 -71913 305830 -34783 155486 245801 -313952
16087I378d7616j98333Q1397D38847c8442j5605k4110k8798B09214a35083j3211
$$ 9378 -47616 -245949 -164552 438847 -38442 -54047 -78157 -106955 209214 -135083 -148294
16076a48294A66047a57349j2894H4528K00354a00626A81128p7886a28784C4124
$$ -148294 166047 -157349 -170243 84528 284882 -100626 181128 103242 -128784 34124
16065e3662m54502A27167J58546n1355H4333r263c36904a00351D3516e2084B79506
$$ -53662 -508164 127167 285713 234358 84333 75070 -336904 -100351 43516 -52084 279506
16053a02332r5276a5910r7261m9708A52745a8237j81648j51823a01071j56671
$$ -102332 -197608 -15910 -113171 -162879 152745 -18237 -199885 -351708 -101071 -257742
16043b57742f9011A79538h3078k54998O4328A48768F7468J1029a71845D1937f4895
$$ -257742 -69011 179538 -83078 -338076 -273748 148768 67468 78497 -171845 41937 -64895
16031A41278b15366b7270I6807b76062G194Q001b59592J12955B5209R7662b90031
$$ 141278 -215366 -27270 96807 -276062 7194 15195 -259592 -146637 25209 122871 -290031
16019D9307e5658r1037A61206D4518J35841J01154c05590a05880p291j12065Q5334
$$ 49307 -55658 -146695 161206 44518 180359 281513 -305590 -105880 -113171 -225236 -139902
16008a39902H3145h679B37560j10490D189a2594B29157a632A24415b24644b541
$$ -139902 83145 -8679 237560 127070 4189 -12594 229157 -1632 124415 -224644 -2541
15996B4917a82097i0830b9303D07537b71218A53283a21973o4227j2931k9012i9750
$$ 24917 -182097 -90830 -29303 407537 -271218 153283 -121973 -186200 -199131 -228143 -99750
15984D5374a65514B23847A8557K04169j7216L50476b25569H2142M7685a81607
$$ 45374 -165514 223847 18557 222726 205510 555986 -225569 82142 129827 -181607
15973A77871a33823J9495c7934O878B00050a26213A89239a26954p8901g1696q2047
$$ 177871 -133823 -114328 -37934 -31056 200050 -126213 189239 -126954 -205855 -71696 -153743
15962a53743M2243j50057B78554b8592I4348a53047D8211a1731m1084A56127b26985
$$ -153743 -111500 -261557 278554 -28592 94348 -153047 48211 -11731 -52815 156127 -226985
15950a54413B39686a34293l4154F6022g9462A57029b76263f7648I6080R9286b97261
$$ -154413 239686 -134293 -168447 66022 -79462 157029 -276263 -67648 96080 195366 -297261
15938b70430A24237J63416c18570a41755C7822J53764b49478o5875i2876k51471
$$ -270430 124237 287653 -318570 -141755 37822 191586 -249478 -315353 -92876 -344347
15928c44347a09073J8431j55691B26594b16675B60769a30492A48076a46746n4477
$$ -344347 -109073 -90642 -246333 226594 -216675 260769 -130492 148076 -146746 -201223
15918b01223j51235J70953k73583L6653d5366n2804C3858a70856A87589C4294
$$ -201223 -352458 -181505 -455088 -418435 -45366 -98170 33858 -170856 187589 34294
15907C2554c51507J12032A03670a35761M0946A23401d8530H035L3744L62962a93648
$$ 32554 -351507 -239475 103670 -135761 -94815 123401 -48530 8035 41779 404741 -193648
15895B69731j26492g520A06224F109e6478D4724c32697J58007d0296j7024o7297
$$ 269731 143239 -7520 106224 6109 -56478 44724 -332697 -174690 -40296 -57320 -124617
15884a24617r3807B75974G6962B5980b13746A14615K43589h1928b1701A90285
$$ -124617 -218424 275974 76962 25980 -213746 114615 358204 -81928 -21701 190285
15873c0578k70123C63047H3594c3959j97498B25285N3773o2340A5569g1230l25797
$$ -30578 -300701 363047 83594 -33959 -231457 225285 279058 216718 15569 -71230 -397027
15862c97027J56195B3015O0653b10731g0678F2454F408a09165o841B01758a72331
$$ -397027 -240832 23015 83668 -210731 -70678 62454 6408 -109165 -116006 201758 -172331
15850A17781h0817B63837a73997g5554o0628B95873i7890l4939F0560a12820A91405
$$ 117781 -80817 263837 -173997 -75554 -136182 295873 -97890 -132829 60560 -112820 191405
15838a26601A73233F5385Q0212Q7335b6509j81080F0650P8557b53461I847K01324
$$ -126601 173233 65385 145597 232932 -26509 -207589 60650 139207 -253461 9847 211171
15827B11171g1897A94516b40285A1323f2194B75296a48714B57341b43939b7328
$$ 211171 -71897 194516 -240285 11323 -62194 275296 -148714 257341 -243939 -27328
15816a70281r5035D7797A6494i2553r3036G5436b13207M2020A82910A6362g8965
$$ -170281 -265316 47797 16494 -92553 -185589 75436 -213207 -171187 182910 16362 -78965
15804c64244B07897a40259A71836J9310f7132A63186p8502d00996g6689D9439
$$ -364244 207897 -140259 171836 191146 -67132 163186 84684 -400996 -76689 49439
15793a7556j87529N4241p8833C48215a84774G0529b1123m8172k4748A63815a05663
$$ -17556 -205085 -150844 -229677 348215 -184774 70529 -21123 -69295 -94043 163815 -105663
15781a22833m9942k00257J76407L0435k43157c3412D7062N3175a33910k4241l66045
$$ -122833 -172775 -373032 -196625 -166190 -409347 -33412 47062 100237 -133910 -158151 -524196
15770e24196a17426C7098a20365C39775b33547B7437J38689a93137L4114k51100
$$ -524196 -117426 37098 -120365 339775 -233547 27437 166126 -193137 -159023 -410123
15760d10123i156E912M3577c16167e0701A2536h8638C79194a07353n0193B71094
$$ -410123 -9156 5912 49489 -316167 -50701 12536 -88638 379194 -107353 -157546 271094
15748A99570r4173K70439A32585J5098i4113a809o3749q0071I8354a81959I5420
$$ 199570 105397 375836 132585 147683 -94113 -1809 -65558 -145629 98354 -181959 95420
15736a92883d5973b436k41965F3242j5315N7322M5865m6521C9988a08020a3282
$$ -192883 -45973 -2436 -244401 63242 47927 105249 151114 104593 39988 -108020 -13282
15724D2580a75242b6761j88375A28279c473j96832a4789j64543r5301b5602j96299
$$ 42580 -175242 -26761 -215136 128279 -3473 -200305 -14789 -179332 -274633 -25602 -221901
15713b21901r5786a917k58561g046F298L85570b49426C37196c10407A16812g7908
$$ -221901 -317687 -1917 -260478 -7046 6298 391868 -249426 337196 -310407 116812 -77908
15701a22678p7131R8065r308j42254J03696A81853a97781K0153A02779A6814J64566
$$ -122678 -199809 -101744 -111052 -253306 -149610 181853 -197781 -177628 102779 16814 181380
15690A81380J0799g0944B7146e1449j24438j52720A12701d17363H525e0178q9007
$$ 181380 192179 -70944 27146 -51449 -175887 -328607 112701 -417363 8525 -50178 -139185
15679a39185L6130j14922A056J52651b25911B0282K05736D6355J77780d1978B86266
$$ -139185 -103055 -217977 1056 153707 -225911 20282 226018 46355 224135 -41978 286266
15667A79953K61162e3313k68965d6092B49279a20645A57819e32804b18884J6630
$$ 179953 441115 -53313 -322278 -46092 249279 -120645 157819 -532804 -218884 -202254
15657b02254j27420a00634a443k42090C32427c21699a27022M9539C85983H2298
$$ -202254 -329674 -100634 -1443 -243533 332427 -321699 -127022 -77483 385983 82298
15646A82762c4498k29888C21660A06462a208n06212b9866l3704G6466a11106k8651
$$ 182762 -34498 -264386 321660 106462 -1208 -507420 -29866 -63570 76466 -111106 -139757
15635a39757C634g4112A16840n1141c8084fm7459E7950G116c16120b117A55530
$$ -139757 3634 -74112 116840 65699 -38084 -6 -47465 57950 7116 -316120 -2117 155530
15622a31003A80413D3574K11879n3091l1966i4104A46646i8374A0617J32943R7275
$$ -131003 180413 43574 255453 202362 170396 -94104 146646 -98374 10617 143560 240835
15611B40835H6252a90536F4554a62775H5927i2057m773j16726A14852c76732A31189
$$ 240835 86252 -190536 64554 -162775 85927 -92057 -96830 -213556 114852 -376732 131189
15599A24415D6951J11266i547r399A36515a64446B49700B9828g4800A2632L6665
$$ 124415 46951 158217 -9547 -18946 136515 -164446 249700 29828 -74800 12632 49297
15588D9297J97890J95000f257I0874a03378B49015e3122r1783f9461A15596e6182
$$ 49297 247187 442187 -6257 90874 -103378 249015 -53122 -144905 -69461 115596 -56182
15576B74503q6210M3817c29273R5047J4117j00068A28902a61519A44232J00660
$$ 274503 188293 232110 -329273 -234226 -220109 -320177 128902 -161519 144232 244892
15566B44892A7114L13748g3842a2862j99128J4396g4744m5242E479J96504a4546
$$ 244892 17114 330862 -73842 -12862 -211990 -197594 -74744 -119986 5479 201983 -14546
15554c3519A7543b47629c3783k11691L7134A49427A9657P2193a3345A92464c0303
$$ -33519 17543 -247629 -33783 -245474 -208340 149427 19657 91850 -13345 192464 -30303
15542a64961b4520B77812i8980B42451i4035m0364B68208o3981a25497A65462
$$ -164961 -24520 277812 -98980 242451 -94035 -134399 268208 204227 -125497 165462
15531c3302j82464A65665p2810d9505I8412B6748P7672b49735A87534D627b28740
$$ -33302 -215766 165665 92855 -49505 98412 26748 104420 -249735 187534 4627 -228740
15519e3967C4324J75693a56874A25480c81901F0J56876B5951g4122j00541o1477
$$ -53967 34324 210017 -156874 125480 -381901 60 156936 25951 -74122 -174663 -236140
15508b36140h6816E1606L9252D2096f4419m4055D4715b15720c123j19137O907
$$ -236140 -86816 51606 90858 42096 -64419 -108474 44715 -215720 -3123 -122260 -115353
15497a15353b2526F221J025M1538b05985i126j61113A05471d6247I2934A2691
$$ -115353 -22526 6221 7246 48784 -205985 -9126 -170239 105471 -46247 92934 12691
15485b96742D03170b21148j70685J70169P5980A00250f4038h258g91D4272l711
$$ -296742 403170 -221148 -391833 -221664 -145684 100250 -64038 -8258 -791 44272 40561
15474D0561b60045B97216b022B49846q8707p8203a76731P0609L2917A18216a95784
$$ 40561 -260045 297216 -2022 249846 161139 82936 -176731 -106122 -73205 118216 -195784
15462B03610c32673B61026A16162K9479m1267j2967M7260J20955a86942Q179A5753
$$ 203610 -332673 261026 116162 145641 104374 91407 138667 259622 -186942 -178763 15753
15450A6062b11603B04022i0778C8626a58125e470B93988a65750B9895g950G4729
$$ 16062 -211603 204022 -90778 38626 -158125 -5470 293988 -165750 29895 -7950 74729
15438A91599a63400L9282A79510a24058G5619K55466d0474E809K42186c43830
$$ 191599 -163400 -124118 179510 -124058 75619 331085 -40474 5809 247995 -343830
15427A13397b97888A30138c8940q3095I7020a185I144a9247A64979E414M2988
$$ 113397 -297888 130138 -38940 -122035 97020 -1185 9144 -19247 164979 5414 48402
15416D8402d84668c0857C37726a61963R948B24809a27660A20213L8891J58068
$$ 48402 -484668 -30857 337726 -161963 -152015 224809 -127660 120213 159104 317172
15406C17172q123a77434O5757E1053c3323k28775c9532m9211A62274a6305C42065
$$ 317172 309049 -177434 -111677 51053 -33323 -262098 -39532 -88743 162274 -16305 342065
15394b16828A14534K25569C4655O2471f2732b3230C5680J73005b36483b282B14474
$$ -216828 114534 340103 34655 97126 -62732 -23230 35680 208685 -236483 -2282 214474
15382A20232L471h4883k05493B4941f4486k689B84733a88746B43142C6761b39647
$$ 120232 123703 -84883 -290376 24941 -64486 -67175 284733 -188746 243142 36761 -239647
15370H6427a29141A9659f7138j33275C68924j26704a71401E6372g2130B98308
$$ 86427 -129141 19659 -67138 -200413 368924 242220 -171401 56372 -72130 298308
15359A3301a57153H6855Q3124b38989d2030k0128b6949k77563A33206k9536m1426
$$ 13301 -157153 86855 169979 -238989 -42030 -62158 -26949 -304512 133206 103670 62244
15348F2244a78940D7006j5605N24869a41278L1255B1473c926m33196a91515A46409
$$ 62244 -178940 47006 31401 556270 -141278 -110023 21473 -3926 -437122 -191515 146409
15336C28908A55563a22663d8835j1697A81855c2116A14251L0545o5271J64162
$$ 328908 155563 -122663 -48835 -60532 181855 -32116 114251 144796 79525 243687
15326B43687a04695j3486a6540H1162C4030l297a02018k777C64459A33945K3343
$$ 243687 -104695 -118181 -16540 81162 34030 30733 -102018 -104795 364459 133945 157288
15315A57288b285E7763e7340A44422i7975A15460A6006K41795H7390b40715A02996
$$ 157288 -2285 57763 -57340 144422 -97975 115460 16006 257801 87390 -240715 102996
15303I1089b51648D0984e7530k71169J31599C75019a39903B4397A0231b36982
$$ 91089 -251648 40984 -57530 -328699 -197100 375019 -139903 24397 10231 -236982
15292C07002j33866j2218b89993i109C2892K9125b9348j17689A55998H17K65598
$$ 307002 173136 160918 -289993 -9109 32892 62017 -29348 -147037 155998 817 266415
15281B66415I2865L37864A19808J15637D0072K03870I8468A1853L9930Q6422E6740
$$ 266415 92865 430729 119808 235445 40072 243942 98468 11853 51783 138205 56740
15269E7511d0010j89404A92286b6225j39674A88880o1657B0893a29045C07475
$$ 57511 -40010 -229414 192286 -26225 -165899 188880 127223 20893 -129045 307475
15258C46628F0520r804a72379B12378f8526B10084a81174B39371H4038M14664
$$ 346628 60520 50716 -172379 212378 -68526 210084 -181174 239371 84038 498702
15248D98702K62861J119488p9633l55940J50936k57999C71543i537D95024A91682
$$ 498702 761563 1881051 1801418 1445478 1596414 1338415 371543 -9537 495024 191682
15237A54343K36747A72075a59823k37508g4235C2052P4237b02180C01819A24796
$$ 154343 391090 172075 -159823 -397331 -74235 32052 106289 -202180 301819 124796
15226a59033M8345A19837d5470B95560A31308n1708K78094C9688f9971C7712J76747
$$ -159033 -110688 119837 -45470 295560 131308 79600 357694 39688 -69971 37712 214459
15215B14459a63029B48793a61827g1524A50447f9841e495A1712K5802J0783a38353
$$ 214459 -163029 248793 -161827 -71524 150447 -69841 -5495 11712 37514 48297 -138353
15203D62401a67952B04413K07740j13342r4374b13500R8190A46425R0178b2208
$$ 462401 -167952 204413 412153 298811 204437 -213500 -115310 146425 236603 -22208
15192d0486j28425o4883B52707b9914B42117l5157e1618A35056C8082a07955B67375
$$ -40486 -168911 -233794 252707 -29914 242117 206960 -51618 135056 38082 -107955 267375
15180B10482o3805J32202d6968r7433c9723A01006N454a83892h8823I8158b00949
$$ 210482 146677 278879 -46968 -144401 -39723 101006 106460 -183892 -88823 98158 -200949
15168a44477C38114j27173J22696r5533o8226J03499j36376C483a029n0937F5065
$$ -144477 338114 210941 333637 238104 169878 273377 137001 3483 -1029 -51966 65065
15156B01138q6924J88916a09299D98486k16470e822A65482A8461J75298j2725
$$ 201138 114214 303130 -109299 498486 282016 -5822 165482 18461 193759 181034
15146A81034R228k1710E9458k4931k331J12382E8543K29578F4415a90790C14050
$$ 181034 190262 168552 59458 34527 32196 144578 58543 288121 64415 -190790 314050
15134A57484K07454A31721K50888l8896a15228B41429e6605C15953g9629A43131
$$ 157484 364938 131721 382609 343713 -115228 241429 -56605 315953 -79629 143131
15123F4914f2575B86994m5368H3750J00857J90808D4722J01814b6437C55855A7953
$$ 64914 -62575 286994 241626 83750 184607 375415 44722 146536 -26437 355855 17953
15111B97458n7196A02186D0858L06658G4681B9045L6066k0289M375g6319D5695
$$ 297458 240262 102186 40858 347516 74681 29045 65111 44822 49197 -76319 45695
15099b51910A65422a22675C01312b03300B46170c1544C1066J96455J70286j35265
$$ -251910 165422 -122675 301312 -203300 246170 -31544 31066 227521 397807 262542
15089B62542k4749F0509K56824b94D23545p6680j17075o7861J79866A38709l2978
$$ 262542 237793 60509 317333 -294 423545 346865 229790 161929 341795 138709 105731
15078A05731Q9039J95907c4490A43781Q9878K256B2799K56531R0718I7826a3578
$$ 105731 194770 390677 -34490 143781 233659 235915 22799 279330 370048 97826 -13578
15066A51884M80841b0519A07331D6139c094D89602e8434D82260q3571G8124J24260
$$ 151884 632725 -20519 107331 46139 -3094 489602 -58434 482260 398689 78124 202384
15055B02384o006J36381a39169A9819K31130b5246N449B8410f9789A08294l4187
$$ 202384 196378 332759 -139169 19819 250949 -25246 -19797 28410 -69789 108294 74107
15044G4107M9065J02962j10173L22905A63575a7263B85766N9567n8000A09606
$$ 74107 123172 226134 115961 438866 163575 -17263 285766 345333 287333 109606
15033B9822J59424l7016K13416c7211C07119B7808g0368J0530E73217A59437J06255
$$ 29822 189246 152230 365646 -37211 307119 27808 -70368 -59838 573217 159437 265692
15022B65692b1147B11882h3952D87428c273A60237J10291G6663J00555H3588J39709
$$ 265692 -21147 211882 -83952 487428 -3273 160237 270528 76663 177218 83588 223297
15011B23297L3303P9842N4456o7190l2044A23097R5267a76020B02351F0992M5124
$$ 223297 256600 336442 390898 323708 291664 123097 218364 -176020 202351 60992 106116
15000A06116J40237F2092J02073J88617B5339K92980j40440m1720N3384J12816
$$ 106116 246353 62092 164165 352782 25339 318319 177879 136159 189543 302359
14990C02359K6650K48858j54012A59565M61220A52030a0945D66216H7482Q2775
$$ 302359 329009 577867 423855 159565 620785 152030 -10945 466216 87482 170257
14980A70257K09478A61575J4939J88467M0196j32056D5760M92861e0014B53478
$$ 170257 379735 161575 176514 364981 405177 273121 45760 538621 -50014 253478
14969B42905M710H2603Q7361j2267j4757K27045N3087l5736j61068K0274J94375
$$ 242905 247615 82603 169964 157697 142940 369985 423072 387336 226268 246542 440917
14958D40917j52928o5121o3635L57093B9758J86875N2878p4178O5790j16333L17659
$$ 440917 287989 222868 159233 516326 29758 216633 269511 195333 261123 144790 462449
14947D62449j95049J58719j85524J8319h5869C91804J78836B27640Q8697R9092
$$ 462449 267400 426119 240595 258914 -85869 391804 570640 227640 316337 415429
14937D15429J5865Q1006A64137l3401K4462K09944A70457p3766L31849k0605A03029
$$ 415429 431294 512300 164137 130736 155198 365142 170457 96691 428540 407935 103029
14925C37817l7198H8136M28056n9779j65012r9352k331J7212L57479j99573r7868
$$ 337817 300619 88136 516192 456413 291401 192049 189718 206930 564409 364836 266968
14914B66968K25722F9910K42758A46099N7656J21011j4077K39030j88829J94094
$$ 266968 492690 69910 312668 146099 203755 324766 310689 549719 360890 554984
14904E54984J5488k58003l5762A35698j3838N33885j71091j38433A35729L03220
$$ 554984 570472 312469 276707 135698 121860 655745 484654 346221 135729 438949
14894D38949A70103L16229A19299K82317o7935j23687n3748J55479q530K77455
$$ 438949 170103 486332 119299 401616 333681 209994 156246 311725 303195 580650
14884E80650k35842L06720j65014R4897k3696m3813p1388Q0386A43042Q1628M08452
$$ 580650 344808 651528 486514 581411 557715 513902 442514 522900 143042 224670 633122
14873F33122j92173B05490K19964j58548R1188J73176G6120M46636A85918K40697
$$ 633122 440949 205490 425454 266906 358094 531270 76120 522756 185918 426615
14863D26615q1541r4823o7496L35877B35830L2381K3537L09803m4636k30839J16750
$$ 426615 345074 250251 182755 518632 235830 268211 291748 601551 556915 326076 442826
14852D42826A50943K14027N08088k76608k33297J83736J00909l20459M31183B00143
$$ 442826 150943 364970 873058 596450 363153 546889 647798 327339 758522 200143
14841B64699M31807I1296O07933l43312J49870j2017r410l1800J33552K61589
$$ 264699 696506 91296 699229 355917 505787 493770 484360 452560 586112 847701
14831H47701l04096j5104M8180p5093n2099J1264F4305O26625K06410l84067Q1958
$$ 847701 543605 528501 576681 501588 449489 460753 64305 690930 897340 513273 595231
14820E95231r1805o7074m0128O31883D82884J26457k05737A05124M95813p2076
$$ 595231 503426 436352 396224 1028107 482884 609341 403604 105124 600937 528861
14810E28861r8905M34780B88717J84313o9771J36310L43094l32802k06409K73355
$$ 528861 429956 864736 288717 473030 403259 539569 882663 549861 343452 616807
14800F16807j06937L15207j1917F4002P21541B72968M21785k74567J74803k74448
$$ 616807 509870 825077 813160 64002 785543 272968 694753 420186 594989 320541
14790C20541J7915J15703J68662J7317j65958M29773m32181K97292l30949J7333
$$ 320541 338456 454159 622821 640138 474180 903953 471772 769064 438115 455448
14780D55448O5898j45709A43364R24867k68562J8090m02832L54216L9078l03195
$$ 455448 521346 375637 143364 1068231 799669 817759 414927 769143 808221 505026
14770E05026L40997j6981J7914k14840O1494O6787N318J5371m1580l54373K81693
$$ 505026 846023 829042 846956 632116 693610 760397 765715 781086 739506 385133 666826
14759F66826J460M9683O7611J72406j68789k86064N36450j26857o1257l32732
$$ 666826 668286 717969 785580 957986 789197 503133 1039583 912726 851469 518737
14749E18737L21103O4120k30496J65278k76649P8166q9815q8476M60094D33083
$$ 518737 839840 903960 673464 838742 562093 640259 550444 461968 922062 433083
14738D33479K06877K19416J3278M4276l53160J41155j21313M86265L1914l47681
$$ 433479 640356 859772 873050 917326 564166 705321 584008 1070273 1102187 754506
14728G54506L8312K63657k19021k39938O856K39011j24306r6498P1730P4736n4407
$$ 754506 792818 1056475 837454 597516 604372 843383 719077 622579 694309 769045 714638
14717G14638r5197N07353J3345m21069R0556J43390o9408K10549j44528l823j36786
$$ 714638 619441 1126794 1140139 719070 809626 953016 883608 1094157 949629 945806 809020
14706H09020J47852J45929l77674N56598l26189l5378j95230O10522l86968P7324
$$ 809020 956872 1102801 725127 1281725 955536 920158 724928 1335450 948482 1025806
14696A025806J17878o0686m80653K51786K08670k71156K78119j7438L12032k27022
$$ 1025806 1143684 1082998 602345 854131 1062801 791645 1069764 1052326 1364358 1137336
14686A137336l03280J91986K3777j77928k22605N43945E38003L89334L25332o1159
$$ 1137336 834056 1026042 1049819 871891 649286 1193231 538003 927337 1252669 1191510
14676A191510k89976k10851L29773Q119K72864j12246j03438K38624j18938j69475
$$ 1191510 901534 690683 1020456 1028575 1301439 1189193 1085755 1324379 1205441 1035966
14666A035966r4992J24594R5534J60965M82518n17440J07839k77803L60724j71152
$$ 1035966 940974 1065568 1161102 1322067 1804585 1287145 1394984 1117181 1477905 1306753
14656A306753n92182Q00761m62469J94195K54160n29462N46768l93106k28164
$$ 1306753 714571 1515332 1052863 1247058 1501218 971756 1518524 1125418 897254
14647H97254N22136K3887j94374L20979l58381K53890M2930r4074L1354l2812
$$ 897254 1419390 1443277 1248903 1569882 1211501 1465391 1508321 1414247 1445601 1412789
14637A412789k6738P6167n9048k76014K54966M61247n94876j30329L79897l67419
$$ 1412789 1386051 1462218 1403170 1127156 1382122 1843369 1248493 1118164 1498061 1130642
14627A130642N03804j81426R263q7593K21455n5457p3069L46702k78029P9619
$$ 1130642 1634446 1453020 1462283 1374690 1596145 1540688 1467619 1814321 1536292 1615911
14617A615911r5927j34296o7508K27954L9655q2426P0821j85016J1279K37338
$$ 1615911 1519984 1385688 1318180 1546134 1585789 1503363 1574184 1389168 1400447 1637785
14607A637785L9224M7225j74539J97073J29680q5567J00277q8781L2094p6136
$$ 1637785 1677009 1724234 1549695 1746768 1876448 1790881 1891158 1802377 1834471 1758335
14597A758335j86119K42342P8555k3236J48639l7810k6012j8062j63373K64416
$$ 1758335 1572216 1814558 1893113 1869877 2018516 1980706 1954694 1936632 1773259 2037675
14587B037675l46738O8734J17536J62337j63337M74898j08684M0918l21696P2608
$$ 2037675 1690937 1759671 1877207 2039544 1876207 2351105 2242421 2283339 1961643 2034251
14577B034251J55341O7196K2151J99838k80568k97885M39151J59190j53296P6418
$$ 2034251 2189592 2256788 2278939 2478777 2198209 1900324 2339475 2498665 2345369 2421787
14567B421787k12093J0539L42318L61250j3933o1104J7000L69187j56139l3425
$$ 2421787 2209694 2220233 2562551 2923801 2909868 2848764 2865764 3234951 3078812 3045387
14557C045387Q8562k0832P25951j18746j48378O62149Q77993P25855J747706L353178
$$ 3045387 3133949 3113117 3839068 3720322 3571944 4234093 5112086 5837941 7585647 10938825
14547A0938825Q864965J7299262J3238709k4091924A1528795n254342k992724
$$ 10938825 19803790 37103052 50341761 26249837 11528795 6274453 3281729
14540C281729p15097n73393j9470j09088L37213M2187j97881L65429J99846l17277
$$ 3281729 2566632 1993239 1973769 1864681 2201894 2244081 2046200 2411629 2611475 2294198
14530B294198J6904L30737n00435M9130L67997m97245M03058K28517j22266J19414
$$ 2294198 2311102 2641839 2141404 2190534 2558531 2061286 2464344 2692861 2570595 2690009
14520B690009j85103L35931K43056n04182N70436l04283O1854l28960O16302k21476
$$ 2690009 2504906 2840837 3083893 2579711 3150147 2845864 2907718 2578758 3195060 2973584
14510B973584j65856M90706J5862r5218k828K89931m58658J76014J91520l00877
$$ 2973584 2807728 3298434 3314296 3219078 3216250 3506181 3047523 3223537 3415057 3114180
14500C114180J64819K34792j16328J281L14055L8516j31003r0658L54665j74123
$$ 3114180 3278999 3513791 3397463 3398744 3712799 3751315 3620312 3529654 3884319 3710196
14490C710196O798K55718k58377K31139j86836L67289j18736K48683M2708k5511
$$ 3710196 3716994 3972712 3714335 3945474 3758638 4125927 4007191 4255874 4298582 4273071
14480D273071j1639K40364k29166J17143K11268p2683N4198k89442L5972L74195
$$ 4273071 4261432 4501796 4272630 4389773 4601041 4528358 4582556 4293114 4329086 4703281
14470D703281l04634M59747P9262l55060L33850K27154k37378K55076m53987M21904
$$ 4703281 4398647 4858394 4937656 4582596 4916446 5143600 4906222 5161298 4707311 5129215
14460E129215N1394k7290L5768J82958q9143J96016j56750P6823K54294k00600
$$ 5129215 5180609 5153319 5189087 5372045 5282902 5478918 5322168 5398991 5653285 5452685
14450E452685N54601p3208k7623M31478j78141j66154K56090J31815j46561N6140
$$ 5452685 6007286 5934078 5906455 6337933 6159792 5993638 6249728 6381543 6234982 6291122
14440F291122M38980R8470k86188M61555m74651O53457J32219o3393K9648K86999
$$ 6291122 6730102 6828572 6542384 7003939 6529288 7182745 7314964 7251571 7281219 7568218
14430G568218j2511p2129J72909j29714N13671j30285j1777q8275O62805k54986
$$ 7568218 7555707 7483578 7656487 7526773 8040444 7910159 7898382 7810107 8472912 8217926
14420H217926K05478o5795K72256M33892J01341J94559o8040l8554r8780M09271
$$ 8217926 8423404 8357609 8629865 9063757 9165098 9359657 9291617 9253063 9154283 9563554
14410I563554K11889j37749N62067m6108K31852j15934M64686K06809R0737J17365
$$ 9563554 9775443 9637694 10199761 10153653 10385505 10269571 10734257 10941066 11031803 11149168
14400A1149168M73878k05232O99690k11338J11602O20982j27285L52685J04697
$$ 11149168 11623046 11417814 12117504 11906166 12017768 12638750 12511465 12864150 12968847
14391A2968847N06407k62729J47041J31317M96432K325M55076K00285R18163j09469
$$ 12968847 13475254 13212525 13359566 13490883 13987315 13989640 14444716 14645001 15563164 15453695
14381A5453695O8094M62028M70813k92731Q05102L02372K73432L54275K59304
$$ 15453695 15521789 15983817 16454630 16161899 16967001 17269373 17542805 17897080 18156384
14372A8156384K01196L93733M58027L70866M05063L60632K81476O24005O49825
$$ 18156384 18357580 18751313 19209340 19580206 19985269 20345901 20627377 21251382 21901207
14363B1901207K83721M7926N13404P31683Q53625J98411O63959O20081O95694
$$ 21901207 22184928 22232854 22746258 23477941 24331566 24529977 25193936 25814017 26509711
14354B6509711K50752R93539P13841N56764O34790P39609P91010P44238Q56651
$$ 26509711 26760463 27754002 28467843 29024607 29659397 30399006 31190016 31934254 32790905
14345C2790905Q73649P70995R75933R45652J062861J062075P04011J198074J537914
$$ 32790905 33664554 34435549 35411482 36357134 37419995 38482070 39186081 40384155 41922069
14336D1922069O62935J786324J256086J368855J047998J691810J397852J513766
$$ 41922069 42585004 44371328 45627414 46996269 48044267 49736077 51133929 52647695
14328E2647695K026952J576956K057006J833446K035856K581926J791755K576719
$$ 52647695 54674647 56251603 58308609 60142055 62177911 64759837 66551592 69128311
14320F9128311K337329K422627K770153K889359L062262L098736L178997L675967
$$ 69128311 71465640 73888267 76658420 79547779 82610041 85708777 88887774 92563741
14312I2563741L625104L861329M529966L896059M745148M884399M926568N603469
$$ 92563741 96188845 100050174 104580140 108476199 113221347 118105746 123032314 128635783
14304A28635783N630118N900128O414369O718859O966248P774477P881494Q351319
$$ 128635783 134265901 140166029 146580398 153299257 160265505 168039982 175921476 184272795
14296A84272795Q500600R720845R530802J0082174J0696281J1573231J1595700
$$ 184272795 192773395 202494240 212025042 222107216 232803497 244376728 255972428
14289B55972428J2453278J2693429J2823193J3869085J3880159J4057783J4167512
$$ 255972428 268425706 281119135 293942328 307811413 321691572 335749355 349916867
14282C49916867J4433435J3946954J3708401J3506282J2732083J1228540J0569817
$$ 349916867 364350302 378297256 392005657 405511939 418244022 429472562 440042379
14275D40042379Q932854P495336N533556J899382k920653l713008j489205j949453
$$ 440042379 448975233 456470569 462004125 463903507 460982854 457269846 455780641 453831188
14267D53831188m753880p831343r723447j1189099j3104216j4302877j4721799
$$ 453831188 449077308 441245965 431522518 420333419 407229203 392926326 378204527
14260C78204527j5400505j5119711j5234976j5350786j4813936j4325393j3256091
$$ 378204527 362804022 347684311 332449335 317098549 302284613 287959220 274703129
14253B74703129j2701543j2398947j2403763j1447057j0898081j0403793j0053442
$$ 274703129 262001586 249602639 237198876 225751819 214853738 204449945 194396503
14246A94396503q929809q936582q032152p429428p258735p349418o498101o040177
$$ 194396503 185466694 176530112 168497960 161068532 153809797 146460379 139962278 133922101
14238A33922101n699862n183777n221049m917048m649272m386195m296791l387625
$$ 133922101 128222239 123038462 117817413 112900365 108251093 103864898 99568107 96180482
14230I6180482l681727l767550l385238k960143l140852k727694k974326k502032
$$ 96180482 92498755 88731205 85345967 82385824 79244972 76517278 73542952 71040920
14222G1040920k596109j980454k316246k165106k112736j895400j913893j502173
$$ 71040920 68444811 66464357 64148111 61983005 59870269 57974869 56060976 54558803
14214E4558803j375634j732771j469015j817930j357884j492689j025613o84172
$$ 54558803 53183169 51450398 49981383 48163453 46805569 45312880 44287267 43603095
14206D3603095j012173j736231j164270j507722p18828p60637m97445j172497
$$ 43603095 42590922 40854691 39690421 38182699 37463871 36703234 36205789 35033292
14198C5033292j160821p85022p38567q27941p51616p94123q31046r77250l14364
$$ 35033292 33872471 33087449 32348882 31520941 30769325 29975202 29144156 28166906 27852542
14189B7852542o61552m36066j042155m08482m93912p24199m10787l91329n36627
$$ 27852542 27190990 26754924 25712769 25304287 24810375 24086176 23675389 23284060 22747433
14180B2747433j68999p72139l53011p92207l1297l53178l66140m01894o20685
$$ 22747433 22578434 21806295 21453284 20661077 20629780 20276602 19910462 19508568 18887883
14171A8887883j37030n48981m15012j06980n34626n94607j36395l43478j81172
$$ 18887883 18750853 18201872 17786860 17679880 17145254 16550647 16414252 16070774 15889602
14162A5889602n9704m57763j87326p09238J89457m10862k52799j41611l51397
$$ 15889602 15829898 15372135 15184809 14475571 14665028 14254166 14001367 13859756 13508359
14153A3508359l14228m13824j7367l43146j0404j06243l74577k40440l8772k03142
$$ 13508359 13194131 12780307 12762940 12419794 12409390 12303147 11928570 11688130 11649358 11446216
14143A1446216j16331j36146k34316J22103m14331j25966m18120k57574J35466
$$ 11446216 11329885 11193739 10959423 11081526 10667195 10541229 10123109 9865535 10001001
14134A0001001j86678j2726k14637J7790k77611p7791j06460j35996L3770R3926
$$ 10001001 9814323 9801597 9586960 9604750 9327139 9249348 9142888 9006892 9040662 9134588
14124I134588l92901l76175l1587k1781k50646K20497k31441k52801j06764n5269
$$ 9134588 8741687 8365512 8333925 8312144 8061498 8281995 8050554 7797753 7690989 7635720
14114G635720j29738j00585P7034j42874p133J0101l43086k72126N53905l80733
$$ 7635720 7505982 7405397 7482431 7339557 7332424 7342525 6999439 6727313 7281218 6900485
14104F900485j81684k42186Q2199Q1070m60781j18826P1487J62957l13980K299
$$ 6900485 6718801 6476615 6558814 6639884 6179103 6060277 6131764 6294721 5980741 5983040
14094E983040j20958K33029k00195n0258o35477N14741l77766K6778J93298l84591
$$ 5983040 5862082 6095111 5894916 5844658 5209181 5723922 5346156 5372934 5566232 5181641
14084E181641J11569j48085j14530J19249m12070N24516l72307L74844j92373
$$ 5181641 5293210 5145125 5030595 5149844 4737774 5262290 4889983 5264827 5072454
14075E072454k61135k8655J41563l47499n732k4355n6090j49522N4767j87699
$$ 5072454 4811319 4782664 4924227 4576728 4570996 4546641 4490551 4341029 4395796 4208097
14065D208097J69575m7092k35219L1785K19400J1045j05641J35735o32285Q21369
$$ 4208097 4377672 4330580 4095361 4127146 4346546 4357591 4251950 4387685 3755400 4576769
14055D576769m78826k33856K31389j31865j64685j88023k8629l50585M60275O3788
$$ 4576769 4097943 3864087 4095476 3963611 3798926 3610903 3582274 3231689 3691964 3755752
14045C755752k13209K20589k92134j43442j18634J74758k02980R3122K5029R5698
$$ 3755752 3542543 3763132 3470998 3327556 3208922 3383680 3180700 3273822 3298851 3394549
14035C394549j83522Q8316L1218K670j94698m1574j10972J99793j26894j94889
$$ 3394549 3211027 3299343 3330561 3333231 3138533 3096959 2985987 3185780 3058886 2863997
14025B863997j16808O04212l19482j84401J44845k71469j72054J27109K49433
$$ 2863997 2747189 3351401 3031919 2847518 2992363 2720894 2548840 2675949 2925382
14016B925382m14674J03618j50771L003r0917K10351j23382J59909k92490K17493
$$ 2925382 2510708 2614326 2463555 2466558 2375641 2585992 2462610 2622519 2330029 2547522
14006B547522j70374J63398k93578K85759j81641P22j17105j38919J43640o67222
$$ 2547522 2377148 2540546 2246968 2532727 2351086 2351808 2234703 2095784 2239424 1572202
13996A572202N02246K30454j23710j20557L74817j8513J90252Q88040J565933
$$ 1572202 2074448 2304902 2181192 2060635 2435452 2416939 2607191 3495231 5061164
13987E061164O920976J6493259K0669320j6138075A5044792o549123k393879j350752
$$ 5061164 11982140 28475399 49144719 33006644 15044792 8495669 6101790 4751038
13979D751038p27149p15334M33957p05493j30769J26552m1952k67608k97858L34385
$$ 4751038 4023889 3308555 3742512 3037019 2906250 3032802 2990850 2723242 2425384 2759769
13969B759769L5277r3605j39703J7522l55313L30759o5031k13662K02137l40411
$$ 2759769 2795046 2701441 2561738 2579260 2223947 2554706 2489675 2276013 2478150 2137739
13959B137739j35033K18618j28992J42681P736l89114L90769l76822L47885k15323
$$ 2137739 2002706 2221324 2092332 2235013 2242749 1853635 2244404 1867582 2215467 2000144
13949B000144o3397K42120l05215k633j01542L80374j15193o197Q4363L8350l25138
$$ 2000144 1936747 2178867 1873652 1871019 1769477 2149851 2034658 2028461 2112824 2151174 1826036
13938A826036K39718o34635N82632j16357m19871M5653M45713k50062K40731r5837
$$ 1826036 2065754 1431119 2013751 1897394 1477523 1523176 1968889 1718827 1959558 1863721
13928A863721j50682p9395J13452K21278j10263q6811J8615l76035M78405m99266
$$ 1863721 1713039 1633644 1747096 1968374 1858111 1771300 1789915 1413880 1892285 1393019
13918A393019r7299J23110R9019K441R0007O7060k21328j28616L26975j5712J41068
$$ 1393019 1295720 1418830 1517849 1520290 1610297 1677357 1456029 1327413 1654388 1638676 1779744
13907A779744j59253j28693o5147l13198M94044O387k18325J67127J47808k15469
$$ 1779744 1620491 1491798 1426651 1113453 1607497 1613884 1395559 1562686 1710494 1495025
13897A495025R4989m32657K1543M1812k0559Q4631p1113K3856L50361j47217o9938
$$ 1495025 1590014 1157357 1178900 1220712 1200153 1284784 1213671 1237527 1587888 1440671 1370733
13886A370733J8377l25825L41958j24869P4016k95947J08726Q86L73726m93701
$$ 1370733 1389110 1063285 1405243 1280374 1354390 1058443 1167169 1168055 1541781 1048080
13876A048080M98808l00174N5755j41576j67951J30149P0731K5634j33521R8812
$$ 1048080 1546888 1246714 1302469 1160893 992942 1123091 1193822 1219456 1085935 1184747
13866A184747m7905L09717o66922L79896k46447J23760N5431J24065l86576K26374
$$ 1184747 1136842 1446559 779637 1159533 913086 1036846 1092277 1216342 829766 1056140
13856A056140o7998J74206L8808m70614K97910j50441O8178L25216k75310J84359
$$ 1056140 988142 1162348 1201156 730542 1028452 878011 946189 1271405 996095 1180454
13846A180454k03245J28915k86408J68452J15807Q4466r6118k05408J26567J92863
$$ 1180454 977209 1106124 819716 988168 1103975 1188441 1092323 886915 1013482 1206345
13836A206345k09315N8361l6787k62928J60681J31161q8184Q6604N9959k53636
$$ 1206345 997030 1055391 1018604 755676 916357 1047518 959334 1045938 1105897 852261
13826H52261O1873o736q7906K12693O3420n0212j36310q7824m6395K28324L8802
$$ 852261 914134 907398 819492 1032185 1095605 1045393 909083 821259 774864 1003188 1041990
13815A041990l57188J30841K81597k26960l87973K69401Q6577J63110j32580K7483
$$ 1041990 684802 815643 1097240 870280 482307 751708 838285 1001395 868815 896298
13805H96298k9896J20133j67862Q765K03272l01781J2308J69740L0664D52691
$$ 896298 866402 986535 818673 827438 1030710 728929 741237 910977 941641 452691
13794F29353J52518J94706q5809L33798k03486j69185J01818j25549r0946R2176
$$ 629353 781871 976577 890768 1224566 1021080 851895 953713 828164 737218 829394
13784H29394j20436K49229l10973L27832j33297k04565M27815j96419k52424M18764
$$ 829394 708958 958187 647214 975046 841749 637184 1064999 868580 616156 1034920
13774A034920D61971L72748j46986p6270J01025j87266K59222j19745k74460M26107
$$ 1034920 461971 834719 687733 611463 712488 525222 784444 664699 390239 816346
13764H16346m5690R5976C70643J45257J57439Q3620C09906N66419n5940K06191
$$ 816346 770656 866632 370643 515900 673339 756959 309906 876325 820385 1026576
13754A026576D24046L08246O431j10354k20793M00324j20288J7870j72995Q6753
$$ 1026576 424046 732292 738723 628369 407576 807900 687612 705482 532487 619240
13744F19240m0405J59925r4963j06542O112J88460j39378M94908m06327J81189
$$ 619240 578835 738760 643797 537255 543367 731827 592449 1087357 681030 862219
13734H62219j19246j99224P1216j56265L45314j90893j15528P8411P8492K17755
$$ 862219 742973 543749 614965 458700 804014 613121 497593 576004 654496 872251
13724H72251j03091C08754m2387M23569A18019M21927J15810k02825K1164K43370
$$ 872251 769160 308754 266367 689936 118019 539946 655756 452931 474095 717465
13714G17465k52630o8747J59775L6238J0111j77516L29696r6126l19884L95006
$$ 717465 464835 396088 555863 592101 602212 424696 754392 658266 338382 733388
13704G33388p1448o1824k1132j23795J43611j9379j76838A88747M17452K1623
$$ 733388 661940 600116 578984 455189 598800 579421 402583 188747 606199 627822
13694F27822j41151k2649L34405C54371L48060j01244K69018l68428J723M46613
$$ 627822 486671 464022 798427 354371 702431 601187 870205 501777 503500 950113
13684I50113l60865l7327K22740m0071B23234L48521j60026L11669j6236o6796
$$ 950113 589248 551921 774661 734590 223234 571755 411729 723398 707162 640366
13674F40366k95109R5793J34253J15554l17561J28090Q6425J6537J1271J18508
$$ 640366 345257 441050 575303 690857 373296 501386 587811 604348 615619 734127
13664G34127k26109M6307r4330R1530j31838K35707k03829j86073M31905B60464
$$ 734127 508018 554325 459995 551525 419687 655394 451565 265492 697397 260464
13653C56002J25705J22628k86941L05451l10157K83206B78367L78566r5980J63359
$$ 356002 481707 604335 317394 622845 312688 595894 278367 656933 560953 724312
13643G24312B11149J41225K17107j11783k07218L29215k36280K18215j45707j16235
$$ 724312 211149 352374 569481 457698 250480 579695 343415 561630 415923 299688
13633B99688J01102A85517L30902B09809J70037j22365J35318L65925C56022A43293
$$ 299688 400790 185517 516419 209809 379846 257481 392799 758724 356022 143293
13622D47199J03508j7992j86306G6227B4458N48876k09652M1327L7318m4092j16378
$$ 447199 550707 532715 346409 76227 24458 573334 363682 405009 442327 398235 281857
13611B81857J14639j00508J21667O5236E1008J10973M32223j94026p5980c158
$$ 281857 396496 295988 417655 482891 51008 161981 594204 400178 324198 -3158
13600C98269K74214k19000M006A68801K11863p240J67042J28185k16751j51314
$$ 398269 672483 453483 457489 168801 380664 373424 540466 668651 451900 300586
13590C00586K24250e6084A08064J75058l8962J12329n5828m3629M090J63509l6716
$$ 300586 524836 -56084 108064 283122 244160 356489 300661 257032 261122 424631 387915
13579C87915A70406K86076j64373K00668k35862o7396M44941e0670D79392A41771
$$ 387915 170406 456482 292109 492777 256915 189519 634460 -50670 479392 141771
13568B29629L16802q4537l4141l7614J09177j68339A43603K9986L07923j34826
$$ 229629 546431 461894 427753 390139 499316 330977 143603 173589 481512 346686
13558C46686N9250N8396j87153K05918A69510a23345D40472F6979K59898N8906
$$ 346686 405936 464332 277179 483097 169510 -123345 440472 66979 326877 385783
13548C85783p0064j02185L3709m7345M61768j82833A76853L43564B9167R7141
$$ 385783 315719 213534 247243 199898 661666 478833 176853 520417 29167 126308
13538A26308J99771f2526B45139A9831O6886a6224E05766j72343L3779o5916A29521
$$ 126308 326079 -62526 245139 19831 86717 -16224 505766 333423 367202 301286 129521
13526A34642J05648J61362G0859Q3134K48105A93532n461J09179a28265B21405
$$ 134642 240290 401652 70859 153993 402098 193532 188071 297250 -128265 221405
13515B08105G5227O7310R6166I3195K66461g7317E49320k40942M0175l9548I857
$$ 208105 75227 142537 238703 93195 359656 -77317 549320 308378 348553 309005 9857
13503A20701M80602B41928N5003j37380J39528n1484m085J1635j11913J86423
$$ 120701 601303 241928 296931 159551 299079 247595 243510 255145 143232 329655
13493C29655K48514A59002K26072H3121N17809A97436R7629O7279A13681m0832
$$ 329655 578169 159002 385074 83121 600930 197436 295065 362344 113681 72849
13483G2849K10070j09411J54316q3745E0591K55864A14970J98348a84050B21364
$$ 72849 282919 173508 327824 244079 50591 306455 114970 313318 -184050 221364
13472F62023k85454J08661A37238K6564K87371b6106B53291K38154f7701B57925
$$ 662023 376569 485230 137238 163802 451173 -26106 253291 491445 -67701 257925
13461d1949B91348P2562D3359L4286K78589A03629c6868C38514A15808K16117
$$ -41949 291348 363910 43359 77645 356234 103629 -36868 338514 115808 331925
13451C31925o1754L98409B64221b2696C68273I3413K85874e6896A72628f9443
$$ 331925 270171 668580 264221 -22696 368273 93413 379287 -56896 172628 -69443
13440F090M9921K45468A40894M82088k99821C5267J36337n7574J26791j9173j8569
$$ 6090 56011 301479 140894 622982 323161 35267 171604 114030 240821 221648 203079
13429B03079L00032A26815n5427J84874A23902J5757J63436A32671K11703m6653
$$ 203079 503111 126815 71388 256262 123902 139659 303095 132671 344374 297721
13419B97721P5299j22109J9469o6664N7377l6825N6954q3448J88602e0088B26114
$$ 297721 373020 250911 270380 203716 261093 224268 281222 197774 386376 -50088 226114
13407B26056P058m1336F2617b36957C83416H5754L44072j75202G2781b5665G1914
$$ 226056 233114 191778 62617 -236957 383416 85754 429826 254624 72781 -25665 71914
13395D67547G7990J77367a07667B90766A13881K73084C3772L4324K55531A22954
$$ 467547 77990 255357 -107667 290766 113881 386965 33772 68096 323627 122954
13384A79549J87648j09021N3086K4076C2384N7042L47338A57223K52098j50053
$$ 179549 367197 258176 311262 335338 32384 89426 436764 157223 409321 259268
13374B59268K5076K0618j51523a12538A91430G7698A4013O7629b3747B06949r6725
$$ 259268 284344 304962 153439 -112538 191430 77698 14013 81642 -23747 206949 110224
13363A10224J14833n9288g77E5975R0270L19442A07104J20860J27571C2658K49659
$$ 110224 225057 165769 -777 55975 146245 465687 107104 227964 355535 32658 282317
13352B82317r7692G510L87036E0693j5413J64514J62885r3971J8249F9465L33005
$$ 282317 184625 7510 394546 50693 35280 199794 362679 268708 286957 69465 402470
13341D02470n0327c6685B23489N7033L66615A55226K17395J2190j83481N5743
$$ 402470 352143 -36685 223489 280522 647137 155226 372621 384811 201330 257073
13331B57073L9976J13568A07917N6783M75509B84064E075J77967F1253p432L06104
$$ 257073 297049 410617 107917 164700 640209 284064 5075 183042 61253 53821 359925
13320C59925f496E96367M5139k28070b1959A22481B5453N1835Q1545P5949b2455
$$ 359925 -6496 596367 641506 413436 -21959 122481 25453 77288 158833 234782 -22455
13308C71527j68869a10292D84763A59961f7758M102C97913i4682A51742N8944
$$ 371527 202658 -110292 484763 159961 -67758 -63656 397913 -94682 151742 210686
13298B10686a30580k1070B97094P9991h8994A68182a46900a5826A32039B7206
$$ 210686 -130580 -151650 297094 377085 -88994 168182 -146900 -15826 132039 27206
13287D23726o441A26753N8647D9144e6367E4089J69229O4566p2050b9636j27762
$$ 423726 417285 126753 185400 49144 -56367 54089 223318 287884 215834 -29636 -157398
13276a57398B90348J955g7256D52781a30792B43486i8797c3455p8006A45454J09524
$$ -157398 290348 292303 -77256 452781 -130792 243486 -98797 -33455 -111461 145454 254978
13265B54978f0318A37428m0290i9574A86655e8211A98492P1140F8127K8875K26695
$$ 254978 -60318 137428 97138 -99574 186655 -58211 198492 269632 68127 97002 323697
13254C23697A00006m8795g2789k4010B86849j10249J52410a21366C47435n3206
$$ 323697 100006 51211 -72789 -96799 286849 176600 329010 -121366 347435 294229
13244B94229l038D575L03264r2925j01053K07757J72733p917a40021A83952b55837
$$ 294229 291191 4575 307839 214914 113861 321618 494351 486434 -140021 183952 -255837
13232B31166o958H4106J90949j04663G8963N7704K65898j0683n7339q1626d6866
$$ 231166 224208 84106 275055 170392 78963 136667 402565 391882 334543 252917 -46866
13220I043b3716A22454g9501A68250q2566b43562D20708G5864b800A93642M4472
$$ 9043 -23716 122454 -79501 168250 85684 -243562 420708 75864 -2800 193642 238114
13209B38114L0849r2564N8908A13324A6599b69669G1958k9081M8880R6781l6188
$$ 238114 268963 176399 235307 113324 16599 -269669 71958 42877 91757 188538 152350
13198A52350J49647b8073j28966b3267c43o8943H5137d6444B1242N621L95928
$$ 152350 301997 -28073 -157039 -23267 -343 -69286 85137 -46444 21242 26863 422791
13187D22791A56992Q5772p7448A3204K9899Q9751B4899q913L9030M8622K63728
$$ 422791 156992 242764 165316 13204 43103 132854 24899 15986 55016 103638 367366
13176C67366A59373J43918b65588Q4571P0587a2098j29814A42775K30140A23337
$$ 367366 159373 303291 -265588 -181017 -110430 -12098 -141912 142775 372915 123337
13165I4538j9595M3679d0179A45782a71702O1262k1897B20429a80610A12348g4431
$$ 94538 74943 118622 -40179 145782 -171702 -110440 -132337 220429 -180610 112348 -74431
13153A53141R7912q2584b7310D4621A0936L92803A37478J49652d9785B35725j05028
$$ 153141 251053 168469 -27310 44621 10936 403739 137478 287130 -49785 235725 130697
13142A30697k4703a78551B58491m2605a72382D4565J95523j7765n3364m2520j6806
$$ 130697 105994 -178551 258491 215886 -172382 44565 240088 222323 168959 126439 109633
13131A09633k8765O3762Q4351B2459a0439F7698a54006C22366F4631a56256n9067
$$ 109633 80868 144630 228981 22459 -10439 67698 -154006 322366 64631 -156256 -215323
13120b15323A85425b62544i3819B02460d797A93363i04B79471f2669A37580L9451
$$ -215323 185425 -262544 -93819 202460 -4797 193363 -904 279471 -62669 137580 177031
13109A77031b53086F5248L4441A812a00126A81704R8558A8389L9217e06815B36525
$$ 177031 -253086 65248 99689 1812 -100126 181704 280262 18389 57606 -506815 236525
13097a73435C75971A2663i5204D23022A22570c5097B13379a93053A01977L077
$$ -173435 375971 12663 -95204 423022 122570 -35097 213379 -193053 101977 105054
13087A05054M6643C5465c8348C2630J48167r718p1947b2139A8169L8805K38986
$$ 105054 151697 35465 -38348 32630 180797 171079 99132 -22139 18169 56974 295960
13076B95960b1215A51952O3142p6904Q2145j3262G3906a25228B42161F5737L00128
$$ 295960 -21215 151952 215094 138190 220335 207073 73906 -125228 242161 65737 365865
13065C65865j82372e8849B79400b9883r3465j1736F4164L79926k13451p9124n3377
$$ 365865 183493 -58849 279400 -29883 -123348 -135084 64164 444090 230639 151515 98138
13054I8138g0371I5143Q494L2980M885L5956R5415D0949o138L4930N4410J01252
$$ 98138 -70371 95143 103637 136617 141502 177458 272873 40949 34811 69741 124151 225403
13042B25403R0073d0478A91132L3288A12085R5606K63767k30414o0453B7291J20255
$$ 225403 315476 -40478 191132 224420 112085 207691 471458 241044 180591 27291 147546
13031A47546m3439k8810r282P5567Q2141r8741k5778J8827B1906K61998L6173
$$ 147546 104107 75297 66015 141582 223723 124982 99204 118031 21906 283904 320077
13020C20077A50518K3573j8957K11053a37055F2875K27269J34101b11355B98004
$$ 320077 150518 174091 155134 366187 -137055 62875 290144 424245 -211355 298004
13009A45361c5651B55208a23796j74613B93205i3916A69898a69121A36715J76443
$$ 145361 -35651 255208 -123796 -298409 293205 -93916 169898 -169121 136715 313158
12999C13158C399c9671A07047J62388H6803i4495C02560b33977A73062a6216G4521
$$ 313158 3399 -39671 107047 269435 86803 -94495 302560 -233977 173062 -16216 74521
12987c91386J29057A15195m9509c6217k3531D21372D7364L404l141a22985K324
$$ -391386 -262329 115195 65686 -36217 -59748 421372 47364 50768 47627 -122985 -120661
12976a20661A30760l7301j2906a32079M8136C76678B2294a52154A99492a42261
$$ -120661 130760 93459 80553 -132079 -83943 376678 22294 -152154 199492 -142261
12965b31362b7196A43530a40246d3042j85907A50976o1399G541b24227B34033
$$ -231362 -27196 143530 -140246 -43042 -228949 150976 89577 7541 -224227 234033
12954a17041A84635q7863K49661j47618J20150p0282b3524I3203i4372q9907g3485
$$ -117041 184635 96772 346433 198815 318965 248683 -23524 93203 -94372 -184279 -73485
12942B9160J6793a12717P966k08943B99425a45272A11272L0717j3053P9745E8613
$$ 29160 45953 -112717 -104751 -313694 299425 -145272 111272 141989 128936 208681 58613
12930a03790q187I8678j3209a7011A67905H1275J3956J2378K49987b17334A89460
$$ -103790 -111977 98678 85469 -17011 167905 81275 95231 107609 357596 -217334 189460
12918c93746a89546A88071G6704J43984c4954m9782o0946j9667n0221A22997h255
$$ -393746 -189546 188071 76704 220688 -34954 -84736 -145682 -165349 -215570 122997 -8255
12906b01336M8063B00949a73000B73535d929j81038A71709d41194F5438J18814
$$ -201336 -153273 200949 -173000 273535 -4929 -185967 171709 -441194 65438 184252
12896A84252f3221o0837A42140E1733c2253A20874a14110D0934b12423D5360Q5916
$$ 184252 -63221 -124058 142140 51733 -32253 120874 -114110 40934 -212423 45360 131276
12885A31276J03792A15764a96939m7275C08781D7829b18172A50812B3105R5695
$$ 131276 235068 115764 -196939 -244214 308781 47829 -218172 150812 23105 118800
12875A18800J42665b44850J16975n4963c5508k3729A10568A7703K18229j01016
$$ 118800 261465 -244850 -127875 -182838 -35508 -59237 110568 17703 235932 134916
12865A34916a37883C85523j52641C1630b25186A43301J90733A06834E1083O6815
$$ 134916 -137883 385523 232882 31630 -225186 143301 334034 106834 51083 117898
12855A17898M0714o0297C0943b8315k25594B4221J80279a43828A4478e8581K4251
$$ 117898 158612 98315 30943 -28315 -253909 24221 204500 -143828 14478 -58581 -34330
12844c4330C27273a0806E16863a6990B40807I4873d6570N017B50925H6044K57781
$$ -34330 327273 -10806 516863 -16990 240807 94873 -46570 -41553 250925 86044 343825
12833C43825b36124B1499a61955e631H1315h4883B11911m0181G8094k0008R5497
$$ 343825 -236124 21499 -161955 -5631 81315 -84883 211911 171730 78094 58086 153583
12822A53583b64213a05418A34391F595c24967A71726i9409C0696j0948J5370b3453
$$ 153583 -264213 -105418 134391 6595 -324967 171726 -99409 30696 19748 35118 -23453
12810a61278K6515O4198j21320E4788O5451b4785A90877J40823L7362j60687H4549
$$ -161278 -134763 -70565 -191885 54788 120239 -24785 190877 331700 369062 208375 84549
12798A98177a63109J1386b754k68935B25627f1203B07503O1857h1427A15593e2387
$$ 198177 -163109 -151723 -2754 -271689 225627 -61203 207503 269360 -81427 115593 -52387
12786H6595J65753j21220J7811b9358B31149J76458b87161F2323h2379A24940
$$ 86595 252348 131128 148939 -29358 231149 407607 -287161 62323 -82379 124940
12775B9L56455H3262b5064A20353a44967m1106K5034K4117B7060f0431K1019A60157
$$ 29 356484 83262 -25064 120353 -144967 -186073 -161039 -136922 27060 -60431 -39412 160157
12762a42643l3599L1163a8695B13925a44755B3637a43118B30767p6138A4312a57167
$$ -142643 -176242 -145079 -18695 213925 -144755 23637 -143118 230767 154629 14312 -157167
12750B63655F4086d4757B19998J07435b52551J22821B27032h4619a5885l0741
$$ 263655 64086 -44757 219998 327433 -252551 -129730 227032 -84619 -15885 -46626
12740d6626q4170D36953A28068A9961K14896r1990F9511J3588N4233b461C8330
$$ -46626 -130796 436953 128068 19961 234857 142867 69511 83099 137332 -2461 38330
12728i6267D6858e0763B16883b94150a06555b6540B58272H4152e3881A03433b11936
$$ -96267 46858 -50763 216883 -294150 -106555 -26540 258272 84152 -53881 103433 -211936
12716C97702a63608b8992C06610e5536I7804P654b4555C22518r6668a3067B12591
$$ 397702 -163608 -28992 306610 -55536 97804 105458 -24555 322518 225850 -13067 212591
12704e0031a1597C20576A23537A2822J08425a47526B94392r9355a76262l26502
$$ -50031 -11597 320576 123537 12822 121247 -147526 294392 195037 -176262 -502764
12694e02764A94575r0553J13111C1012N8221e1205A13215h0434k05269a9984D5237
$$ -502764 194575 104022 217133 31012 89233 -51205 113215 -80434 -285703 -19984 45237
12682b12589B78808I32J33929b1403B0211d2435B52031h0872C72684Q9825b37208
$$ -212589 278808 932 134861 -21403 20211 -42435 252031 -80872 372684 462509 -237208
12670e3886A39760l4157R6202k9837J1787A7633b35435I6766h4586H3764J01491
$$ -53886 139760 105603 201805 171968 183755 17633 -235435 96766 -84586 83764 185255
12659A85255b50970B24574j01705J38260J70601k01842b1180A08258Q337K6101
$$ 185255 -250970 224574 122869 261129 431730 229888 -21180 108258 116595 142696
12649A42696a19039B70709A19100b21253D9555P1142m6016B2377J33837M247B1532
$$ 142696 -119039 270709 119100 -221253 49555 120697 74681 22377 156214 160461 21532
12637a22138A10010f3869E42301I3289P3251n5031g4832B31589L5650q8338p6875
$$ -122138 110010 -63869 542301 93289 166540 111509 -74832 231589 267239 178901 102026
12626A02026J21328K606A09461J56277H9952C9970K12453b20308i3927G6197K26460
$$ 102026 223354 225960 109461 265738 89952 39970 252423 -220308 -93927 76197 302657
12615C02657b87179A51941c21680J03179G9312B5767L691d8167C61519a17509
$$ 302657 -287179 151941 -321680 -218501 79312 25767 29458 -48167 361519 -117509
12604C56131C47a81631K5970G9098a68159D65050F5405B4971M1651j759N9995
$$ 356131 347 -181631 -155661 79098 -168159 465050 65405 24971 66622 64863 124858
12593A24858a65553g4824k2052E4134f0760A63373E5856G772J64216q5478a5984
$$ 124858 -165553 -74824 -96876 54134 -60760 163373 55856 7772 171988 86510 -15984
12581B15623b20995b9869D0703K58824B9521J85780G1738e5779b7340H9454a30460
$$ 215623 -220995 -29869 40703 299527 29521 215301 71738 -55779 -27340 89454 -130460
12569A22800b31636e9549B4992b47467c5109B03578F2706J24382q3438R8245a33925
$$ 122800 -231636 -59549 24992 -247467 -35109 203578 62706 187088 103650 201895 -133925
12557A33045N9495g9377A4774L9194J6521K12313A05541l4952R0700N6388f3223
$$ 133045 192540 -79377 14774 53968 70489 282802 105541 70589 161289 217677 -63223
12545E7184a66600F305K67656b79518A86604F5436K21833D4647J23769J22118
$$ 57184 -166600 6305 273961 -279518 186604 65436 287269 44647 168416 290534
12535B90534a78735L4574a7698H0645b1134A20608b077l6365j49415A75036c6737
$$ 290534 -178735 -144161 -17698 80645 -21134 120608 -2077 -38442 -187857 175036 -36737
12523C4955M0882b60623G9420b03550C48507b4801A02490L85943c4721r4202l52013
$$ 34955 75837 -260623 79420 -203550 348507 -24801 102490 488433 -34721 -128923 -480936
12512d80936B8032K47962j16888A3515K43327b9050q9408j73M8247n7279A3231
$$ -480936 28032 275994 159106 13515 256842 -29050 -118458 -118631 -70384 -127663 13231
12500b77k31733b6200o7934k8922k90143A18900a17880H0855N3746e2286d27B01126
$$ -277 -232010 -26200 -94134 -123056 -413199 118900 -117880 80855 134601 -52286 -427 201126
12487D11445d0115E3022h1109m03061A54360B5942a41132A62697f6609I7488e3082
$$ 411445 -40115 53022 -81109 -484170 154360 25942 -141132 162697 -66609 97488 -53082
12475A68044k7732c8884j05686j017A28146C5474d7954j44947O4810B51627c8135
$$ 168044 140312 -38884 -144570 -145587 128146 35474 -47954 -192901 -128091 251627 -38135
12463e9082j31198f4715j00419e3556A63911i3543k0907C7158d84k23659B0458
$$ -59082 -190280 -64715 -165134 -53556 163911 -93543 -114450 37158 -484 -224143 20458
12451A00575L1521A0143K76821a57638C24557f4850A7129J61167D6683d625j30444
$$ 100575 132096 10143 286964 -157638 324557 -64850 17129 178296 46683 -4625 -135069
12440a35069B8322J20121E2622a19107F5847b53929J11925d0555D8498a54520
$$ -135069 28322 148443 52622 -119107 65847 -253929 -142004 -40555 48498 -154520
12429b39248B87017E7331f4106D4385c28803c3378I2136R5398i7984A22426A1825
$$ -239248 287017 57331 -64106 44385 -328803 -33378 92136 187534 -97984 122426 11825
12417C16018b91821A05229k3774O3149D120N636f2254C01403d18111C69323B9700
$$ 316018 -291821 105229 81455 144604 4120 9756 -62254 301403 -418111 369323 29700
12405b1118D14693a84694N2194O5165n2789j64725f9065E5748b9917B23504a6849
$$ -21118 414693 -184694 -132500 -67335 -120124 -284849 -69065 55748 -29917 223504 -16849
12393a75339F9648K80411i8998j20808A24293K9316c6976p2321D14744b18267
$$ -175339 69648 350059 -98998 -219806 124293 153609 -36976 -109297 414744 -218267
12382b9131h176p9512A97747g7646A4434J63220h2686m0431B6273K2537A6000
$$ -29131 -8176 -87688 197747 -77646 14434 177654 -82686 -123117 26273 48810 16000
12370C13879a50131o1425n3893A26547k511a88508f4503b6166A78889i9736A41004
$$ 313879 -150131 -211556 -265449 126547 124036 -188508 -64503 -26166 178889 -99736 141004
12358b36519Q6721B15595b67449J22640g1126B95453a09084A18774J1993a03299
$$ -236519 -149798 215595 -267449 -144809 -71126 295453 -109084 118774 130767 -103299
12347E8837R4555B1167K65384E7617g8285A7994O1530a64495C31895A39175J64188
$$ 58837 153392 21167 286551 57617 -78285 17994 79524 -164495 331895 139175 303363
12336C03363A15341G932a81908A16686J37254c03599J23167f2358l8772B92562
$$ 303363 115341 7932 -181908 116686 253940 -303599 -180432 -62358 -101130 292562
12325b96081C1648R7082J26206j16906a08614q0443a0710k9161m43547K25142
$$ -296081 31648 128730 254936 138030 -108614 -189057 -10710 -39871 -483418 -258276
12315b58276A57718a67687M8125b578C8093Q2044c01858B19962c27566a37607
$$ -258276 157718 -167687 -119562 -2578 38093 120137 -301858 219962 -327566 -137607
12304d89709a38157b2158A25560J5899O4804P0256c2701l7122A05508b532A4453
$$ -489709 -138157 -22158 125560 141459 206263 276519 -32701 -69823 105508 -2532 14453
12292a46089P2638k6573H0176f96F8060J20655h170E8818a59245c2021F615N10304
$$ -146089 -73451 -100024 80176 -696 68060 188715 -8170 58818 -159245 -32021 6615 516919
12280E16919c02233A80650g3280A99853N7953r5215c2689q9443A04377J19817
$$ 516919 -302233 180650 -73280 199853 257806 162591 -32689 -122132 104377 224194
12270B24194J19087b056q4253A12642i5601B90765N8616c98036A73836a6351A28269
$$ 224194 343281 -2056 -86309 112642 -95601 290765 349381 -398036 173836 -16351 128269
12258f2450g94B71511L7466F2708e2263E3823P6617J53399a31015n6805A29495
$$ -62450 -794 271511 308977 62708 -52263 53823 130440 283839 -131015 -187820 129495
12246B02221K75398E0547a92839C40675B7637e1184E5588L09297j68602J90660
$$ 202221 477619 50547 -192839 340675 27637 -51184 55588 364885 196283 386943
12236C86943d3134B60205J65982C2502a68835b8723A9119J08042j6606N0185F8187
$$ 386943 -43134 260205 426187 32502 -168835 -28723 19119 127161 110555 160740 68187
12224A41790d7302m4366E69478c0067F7516N3791J61364l2564J97738I1979J62131
$$ 141790 -47302 -91668 569478 -30067 67516 121307 282671 250107 447845 91979 254110
12213B54110J46862c641A27148E7253a8369A74420b16083G9893L55981p6565a68086
$$ 254110 400972 -3641 127148 57253 -18369 174420 -216083 79893 435874 359309 -168086
12201A50467d9479J8875D0461K57003D0207J32630n8546J19400H5213r620B2739
$$ 150467 -49479 -30604 40461 297464 40207 172837 114291 233691 85213 75593 22739
12189a83931A64260R0949F7504K77582K5904A02745J57385m9934J19939j19728
$$ -183931 164260 255209 67504 345086 370990 102745 260130 210196 330135 210407
12179B10407R8075j47278C9169J90187a30711B33810F6429P0120l027J00991H7132
$$ 210407 308482 161204 39169 229356 -130711 233810 66429 136549 133522 234513 87132
12167D82742k05128D3503M0525b19457d74F7740N0661b20865e6461I6625g1843
$$ 482742 277614 43503 84028 -219457 -474 67740 118401 -220865 -56461 96625 -71843
12155C67382I2372o658j388h2840A92609G2265a262C20016l88m9348o3437b2498
$$ 367382 92372 85714 84326 -82840 192609 72265 -1262 320016 319628 270280 206843 -22498
12142f4417C663J13052k14A9863J38095n1651D4244J01038m7757K56370A71367
$$ -64417 3663 116715 116501 19863 157958 106307 44244 145282 97525 353895 171367
12130E841O9525K1028J39079H0423b14589L3616d7924C36034i1965D1111J84055
$$ 5841 75366 96394 235473 80423 -214589 -180973 -47924 336034 -91965 41111 225166
12119B25166B142a3422B33821b20707O9898A1876a76345C29759a57989k90018
$$ 225166 2142 -13422 233821 -220707 -150809 11876 -176345 329759 -157989 -448007
12109d48007i8951A30684a6253k5360A48969a68603j6256A88796C7274O6983m8244
$$ -448007 -98951 130684 -16253 -41613 148969 -168603 -184859 188796 37274 104257 56013
12098E6013K14826A31210j9008a56959g6196A6223a77640o5510b3414B96794g6032
$$ 56013 270839 131210 112202 -156959 -76196 16223 -177640 -243150 -23414 296794 -76032
12086A08833p251k6947j0753a84072e3928C46661a65371I0083a143E99465J101034
$$ 108833 101582 74635 63882 -184072 -53928 346661 -165371 90083 -1143 599465 1700499
12075A700499L66745H69423B99181A1235b5599H6911J56871g2765A82873O2346
$$ 1700499 2067244 869423 299181 11235 -25599 86911 243782 -72765 182873 245219
12065B45219D96J46944c2564I2757J3360l7461J5585f6670F4541a16682d8949
$$ 245219 496 147440 -32564 92757 106117 68656 84241 -66670 64541 -116682 -48949
12053b51342E1016a25187k4505j77157e9392p3550A0264O4166l6476a87005a691
$$ -251342 51016 -125187 -149692 -326849 -59392 -132942 10264 74430 37954 -187005 -1691
12041C79396d9314j16859L21B27252B9077f7722q6600j57472C7833i1690l1781
$$ 379396 -49314 -166173 -165852 227252 29077 -67722 -154322 -311794 37833 -91690 -123471
12030a23471k72136F1020J49056b3327B51974I1190K5531b04268B67984I1476
$$ -123471 -395607 61020 210076 -23327 251974 91190 116721 -204268 267984 91476
12019a57386A98906Q2679b51579H1313a74494j22727A22681c06586A00489A8707
$$ -157386 198906 281585 -251579 81313 -174494 -297221 122681 -306586 100489 18707
12008A36160I527a62984j48008J37969k77086a91172c5441j88798A07060g1974
$$ 136160 9527 -162984 -310992 -173023 -450109 -191172 -35441 -224239 107060 -71974
11997B98638d2473k9546j2745E7224f1365K4080J3402j68271B1859K23332c0386
$$ 298638 -42473 -72019 -84764 57224 -61365 -37285 -23883 -192154 21859 245191 -30386
11985A90841c16946g0908K4494k0064p6021j12994A04212a82106C95008a41002
$$ 190841 -316946 -70908 -46414 -66478 -142499 -255493 104212 -182106 395008 -141002
11974h646B93864p0239q7551d70j55794j05115F5233c3472o717A13065R1204H686
$$ -8646 293864 223625 136074 -470 -156264 -261379 65233 -33472 -40189 113065 204269 8686
11961B720K78280d24870A2074b14359k84101C3950A180J56169H997N3922C115
$$ 2720 281000 -424870 12074 -214359 -498460 33950 1180 157349 8997 62919 3115
11949a47718B25598A11129a42131B16443b63790G9954g2482A3408K5287a51844
$$ -147718 225598 111129 -142131 216443 -263790 79954 -72482 13408 38695 -151844
11938C5841h275A58010o4584J70470r2290g3046A244a11897A79123c1243r8671
$$ 35841 -8275 158010 93426 263896 171606 -73046 1244 -111897 179123 -31243 -129914
11927a29914D03102A09362O0364c6915k76351h5673H9405a22122j03246g9942
$$ -129914 403102 109362 169726 -36915 -313266 -85673 89405 -122122 -225368 -79942
11916a01550l7159j93363A09780b3862B57287L4135b88197A45167G0589R570a69089
$$ -101550 -138709 -332072 109780 -23862 257287 291422 -288197 145167 70589 80159 -169089
11904b47032J10397f375j05905B96326B435J13823b49305I0526b40585N2314b7444
$$ -247032 -136635 -6375 -112280 296326 2435 116258 -249305 90526 -240585 -188271 -27444
11892B6395e3431A5869m042g9403m1910B87884E3343a2842j03701B41309d5532
$$ 26395 -53431 15869 11827 -79403 -121313 287884 53343 -12842 -116543 241309 -45532
11880e4957j2442j172D3211b62223B99007D3391b84747D2321c08576A2396N551
$$ -54957 -67399 -68571 43211 -262223 299007 43391 -284747 42321 -308576 12396 17947
11869A7947b24108q0697c0380r0557p0052O7203A41524l5467K46498h9437k2776
$$ 17947 -224108 -304805 -30380 -120937 -190989 -123786 141524 106057 352555 -89437 -112213
11858a12213E9609J27031j7982o710i4066p5246A31976M3247J61025b29969e9313
$$ -112213 59609 186640 168658 161948 -94066 -169312 131976 175223 336248 -229969 -59313
11846a04551b8879m2319j58660L3975o4029g9255B19218c59484B36384b14384
$$ -104551 -28879 -71198 -229858 -195883 -259912 -79255 219218 -359484 236384 -214384
11835b5958B1114J04404f8249n469c2727m5994A09363q074a35537H5319b89366
$$ -25958 21114 125518 -68249 -73718 -32727 -78721 109363 101289 -135537 85319 -289366
11823a31101I212b1406A29344m8913h5933k96326d3160A74442c3653a2618j47680
$$ -131101 9212 -21406 129344 80431 -85933 -382259 -43160 174442 -33653 -12618 -160298
11812a60298a4980k73023A0676J90897J83121H4909g0542j09440n2574a4797l10932
$$ -160298 -14980 -288003 10676 201573 384694 84909 -70542 -179982 -232556 -14797 -325729
11801c25729J58197K3623j59716j5325J03328G1940d0067j508o7489R208D30117
$$ -325729 -167532 -143909 -303625 -318950 -215622 71940 -40067 -41575 -109064 -99856 430117
11789c07759J04576D9290a02277B50465g4992N074j87723J03521j6868A24914
$$ -307759 -203183 49290 -102277 250465 -74992 -69918 -257641 -154120 -170988 124914
11778d6776q5410A01203K73584h2130A51747a63697H5081O0268a48330J7085q9867
$$ -46776 -132186 101203 374787 -82130 151747 -163697 85081 145349 -148330 -131245 -221112
11767b21112f9870p0206E24373b2538n0267r0095O498d9398k81101G6113P2017
$$ -221112 -69870 -140076 524373 -22538 -72805 -162900 -156402 -49398 -330499 76113 148130
11756A48130J58084b57107f9661j1466B7755h1558I44J83898I538f7381k63040
$$ 148130 306214 -257107 -69661 -81127 27755 -81558 944 184842 9538 -67381 -330421
11745c30421i3415B39167c17290J53132C01815D6535a14425j11062o2052G2347
$$ -330421 -93415 239167 -317290 -164158 301815 46535 -114425 -225487 -287539 72347
11734G2273l1883a56351A64623J39994b71122A64021L1902a89248B74668k2656
$$ 72273 40390 -156351 164623 304617 -271122 164021 195923 -189248 274668 252012
11724B52012c15553g5115F777J85777D0910c74517c8336B31039J8592E7569I000
$$ 252012 -315553 -75115 6777 192554 40910 -374517 -38336 231039 249631 57569 9000
11712A21840a02919A89547K29708a81671A65847B1839J4076K54176a22339I0733
$$ 121840 -102919 189547 419255 -181671 165847 21839 35915 290091 -122339 90733
11701B99230A10148G241K43588b6101A77251d4789H485J54779b5233A2929a40086
$$ 299230 110148 7241 250829 -26101 177251 -44789 8485 163264 -25233 12929 -140086
11689G2625A9993J21833n2218J13665A6219d4334n7588B63853J51557A71143a09617
$$ 72625 19993 141826 89608 203273 16219 -44334 -101922 263853 415410 171143 -109617
11677E0315c7908B30850F2403N0836k0330a00278I9230M004O7344P5769k9889
$$ 50315 -37908 230850 62403 113239 92909 -100278 99230 103234 170578 246347 216458
11666B16458a61998A2306N6714M2910D5427a06861C05146A41949a44294E41683
$$ 216458 -161998 12306 69020 111930 45427 -106861 305146 141949 -144294 541683
11655a47207f5579G8794b21377A74537I412K28090A06824J0024l8894a03806C51969
$$ -147207 -65579 78794 -221377 174537 9412 237502 106824 116848 77954 -103806 351969
11643B6961K7769b10754l83a7256G9628d35732A55283f1421a0226E9410h3022
$$ 26961 54730 -210754 -211137 -17256 79628 -435732 155283 -61421 -10226 59410 -83022
11631a03563k72684J66192B1488e8577F7954L7070J01728A6969e6265B32898h5694
$$ -103563 -376247 -210055 21488 -58577 67954 105024 206752 16969 -56265 232898 -85694
11619C78899E5978J74990i1395B50329A422K91460b85010F2761d4408D2232M1139
$$ 378899 55978 230968 -91395 250329 1422 292882 -285010 62761 -44408 42232 83371
11608H3371b4844j1630j19612O0949a528B32486H9172a06856B62641j15048R9267
$$ 83371 -24844 -36474 -156086 -95137 -1528 232486 89172 -106856 262641 147593 246860
11597B46860i0671A32406a67655B2181e1590p7684B57551G3565a54936e2944A25145
$$ 246860 -90671 132406 -167655 22181 -51590 -129274 257551 73565 -154936 -52944 125145
11585A27725J98720j30511K02179j78006f444A87819Q8680a03360B84897a19555
$$ 127725 326445 195934 398113 220107 -6444 187819 276499 -103360 284897 -119555
11574c58420d0626o3824m7695B57094i4282p7304b190B33088J80366C2236L09220
$$ -358420 -40626 -104450 -152145 257094 -94282 -171586 -2190 233088 413454 32236 341456
11563C41456C7742J64608N8014a34946A34237J6127l9497N3264b17935b9284A53053
$$ 341456 37742 202350 260364 -134946 134237 150364 110867 164131 -217935 -29284 153053
11551A98098B7412b12677G3308a52183A94579p3335I132K80284C7285L37805A63541
$$ 198098 27412 -212677 73308 -152183 194579 121244 9132 289416 37285 375090 163541
11539B59234Q140D8370A8219K08723P4714j11492h5486j46839B2122b67959a19077
$$ 259234 267374 48370 18219 226942 301656 190164 -85486 -232325 22122 -267959 -119077
11527H9165d8026B12784C1354a22687C6103K9638J27457K98323a5662B08725c4006
$$ 89165 -48026 212784 31354 -122687 36103 65741 193198 491521 -15662 208725 -34006
11515I0498j2694P2506k7424J48723k4837R2563p9358f2048n0495A27134J24455
$$ 90498 77804 150310 122886 271609 246772 339335 259977 -62048 -112543 127134 251589
11504B51589M4998b61799A24363a4523m8139A05088J60473d56774I7714a05031
$$ 251589 296587 -261799 124363 -14523 -62662 105088 265561 -456774 97714 -105031
11493a86394C45112A69007m7999e3064q813G0137J11307D1100J75423G4630M7482
$$ -186394 345112 169007 121008 -53064 -61877 70137 181444 41100 216523 74630 122112
11482A22112R0739J61393A65654K27537b1708B30796g3325C54302J2783j43712
$$ 122112 212851 374244 165654 393191 -21708 230796 -73325 354302 367085 223373
11472B23373o5219P057H1214P1011Q6684E8904H169a19614B28963C2314K17064
$$ 223373 158154 165211 81214 152225 238909 58904 8169 -119614 228963 32314 249378
11461B49378f051I4433K07734C2726J96058i7564C44995F8189a50842B89905a65038
$$ 249378 -6051 94433 302167 32726 228784 -97564 344995 68189 -150842 289905 -165038
11449A03151J62867n1306d1630C5897a8145B36362k715k0539m7073P743P712A1808
$$ 103151 266018 214712 -41630 35897 -18145 236362 233647 213108 166035 173778 181490 11808
11436A69596a48451E8948J9991k9026J34290A737J08981J03000K9993F0192g4349
$$ 169596 -148451 58948 78939 49913 184203 1737 110718 213718 243711 60192 -74349
11424f6221D37834A93522H8672K0211a22119e0127a7859H3159J57b7146j12786
$$ -66221 437834 193522 88672 108883 -122119 -50127 -17859 83159 83316 -27146 -139932
11413a39932A14727a55313A71041a5095g062k5419j11077l1528C7780b7692A28786
$$ -139932 114727 -155313 171041 -15095 -7062 -32481 -143558 -175086 37780 -27692 128786
11401E1207J28978J18004a97175f474B09263f2634B05602E4034a92830A87574
$$ 51207 180185 298189 -197175 -6474 209263 -62634 205602 54034 -192830 187574
11390E5077J755i3450j09945E4222b83203F6003a92156j99968e4669E4910c26555
$$ 55077 56832 -93450 -203395 54222 -283203 66003 -192156 -392124 -54669 54910 -326555
11378I5162a6090D43855D9117C305J63631b00p1914B78456I8523d4262p4716l2741
$$ 95162 -16090 443855 49117 3305 166936 -200 -72114 278456 98523 -44262 -118978 -151719
11366a51719N7577B67520a41507A62325B6592J80222c06842A0074M3801c45269
$$ -151719 -94142 267520 -141507 162325 26592 206814 -306842 10074 53875 -345269
11355c68763a22024A36517c02576f9865l8384D21944A09581I428J61840c55675
$$ -368763 -122024 136517 -302576 -69865 -108249 421944 109581 9428 171268 -355675
11344b76740f7259B04330g2183B30416A03452m8699b53137c3971A13401d11933
$$ -276740 -67259 204330 -72183 230416 103452 54753 -253137 -33971 113401 -411933
11333A69835p839k8002E1300f1845k10798A02719M7164b08006A13333b92824A19583
$$ 169835 161996 133994 51300 -61845 -272643 102719 149883 -208006 113333 -292824 119583
11321B45434l5156d82519h4447A6107a62442I8616i4604A05539B9753K18205a03494
$$ 245434 210278 -482519 -84447 16107 -162442 98616 -94604 105539 29753 247958 -103494
11309A37520J39009D5572e56527B5189i8359m7581d271F1477N4643a32705j85088
$$ 137520 276529 45572 -556527 25189 -98359 -145940 -4271 61477 116120 -132705 -317793
11298c17793J40653L9161A51079b29238N0726j43357A3518P2630M7717h6983E2553
$$ -317793 -177140 -137979 151079 -229238 -178512 -321869 13518 86148 133865 -86983 52553
11286c05847A37902a29659j26571h3578K9623B87517b14637p9080e6405k32678
$$ -305847 137902 -129659 -256230 -83578 -53955 287517 -214637 -293717 -56405 -289083
11276b89083c0682C8546R5074E206a07378A37879a16896j01871A04928m3034k9511
$$ -289083 -30682 38546 133620 5206 -107378 137879 -116896 -218767 104928 61894 32383
11265C2383a35299M1028c148q4866k90924a44225j34280B00077c587j16548k09112
$$ 32383 -135299 -94271 -3148 -88014 -378938 -144225 -278505 200077 -3587 -120135 -329247
11254c29247c9979j64540f0492A31724a56631j061L3803k38765e0438A17199H329
$$ -329247 -39979 -204519 -60492 131724 -156631 -157692 -123889 -362654 -50438 117199 8329
11242B55932a51369M9631K468A20883c4313g873j29182K6976A10541b90479A20308
$$ 255932 -151369 -101738 -99270 120883 -34313 -7873 -137055 -110079 110541 -290479 120308
11230D2905K9309a12606F7102a605B55577F9371a17836j00399m8175o17a29297
$$ 42905 72214 -112606 67102 -1605 255577 69371 -117836 -218235 -266410 -267027 -129297
11218a87394n594g614A25765k1461n1297A24K86967b39799B51813p1218b9291
$$ -187394 -192988 -7614 125765 104304 53007 124 287091 -239799 251813 180595 -29291
11206a77260Q1306O853k5561r5146A08904K04052c5819m2673A9994c18222b8059
$$ -177260 -95954 -89101 -114662 -209808 108904 312956 -35819 -78492 19994 -318222 -28059
11194B84008c4373D7722K44631a60221A09408h0698q4812j86432f9084c2602j5105
$$ 284008 -34373 47722 292353 -160221 109408 -80698 -165510 -351942 -69084 -32602 -47707
11183d7707A07524K86188g9354J7291G6642c8264A1202a34525A59021b11852h245
$$ -47707 107524 393712 -79354 -62063 76642 -38264 11202 -134525 159021 -211852 -8245
11171b17645L0460O998g6371I501J09198A4660J97089a50928k45204A3426K1085
$$ -217645 -187185 -180187 -76371 9501 118699 14660 211749 -150928 -396132 13426 34511
11160C4511M1755b61715A31344B9812d48069d440C7241a2748k7755A76957F2959
$$ 34511 76266 -261715 131344 29812 -448069 -4440 37241 -12748 -40503 176957 62959
11148f8564J8648A02264b08962k03446a10326k7552I7891f8622B70759j32140
$$ -68564 -49916 102264 -208962 -412408 -110326 -137878 97891 -68622 270759 138619
11138A38619a05091F865b08112F6417c15844A17140e0075B80061k9672A9718p6
$$ 138619 -105091 6865 -208112 66417 -315844 117140 -50075 280061 250389 19718 19642
11127A9642a21405B69771G6890J3748d24573D771a94950A80213r821R807h0549
$$ 19642 -121405 269771 76890 90638 -424573 4771 -194950 180213 170392 180199 -80549
11115b21549L1084B05656L1205h2552A92167F3467A1605b8274A12506a00080A15221
$$ -221549 -190465 205656 236861 -82552 192167 63467 11605 -28274 112506 -100080 115221
11103D7835L7708K22006h5078L3711j26862C06193i2875B88520A02521J59604
$$ 47835 85543 307549 -85078 -51367 -178229 306193 -92875 288520 102521 262125
11093B62125q1785g3567j00684A17342a77405g574A44689e7378C31981H2075B8574
$$ 262125 180340 -73567 -174251 117342 -177405 -7574 144689 -57378 331981 82075 28574
11081D81645A74070E4198M646O08755j30238j83107A54349M9735J11216E4604
$$ 481645 174070 54198 58844 667599 537361 354254 154349 204084 315300 54604
11070C3672K54665r6456J47707A22468K05464A61421K0626J39886K49822k66245
$$ 33672 288337 191881 339588 122468 327932 161421 182047 321933 571755 305510
11060C05510J12408K51364j47784k260r4294p2384J29375O3175J3348M1676K564
$$ 305510 417918 669282 521498 519238 424944 352560 481935 545110 558458 600134 602698
11049F02698J10739j26424m208j88926N70674k79497L0159k32009R8359o1997
$$ 602698 713437 587013 582805 393879 964553 685056 715215 483206 581565 519568
11039E19568J76347J2304j92272j06970L82415k64407J59965L6246j03114K7344
$$ 519568 695915 708219 515947 408977 791392 526985 686950 723196 620082 647426
11029F47426j27139Q5279j2076N7587K58145k00954q6775K16801q4273j66274
$$ 647426 520287 605566 593490 651077 909222 708268 621493 838294 754021 587747
11019E87747J75698l5343n4453j30660j6166K46546k93015M52578l65548j30178
$$ 587747 763445 728102 673649 542989 526823 773369 480354 932932 567384 437206
11009D37206M2261q8455J95448o6508K22578j61395K5606k1767o7904K06566p9215
$$ 437206 479467 391012 586460 519952 742530 581135 606741 584974 517070 723636 644421
10998F44421K59611l45727K1938K28824k24373k9922K97657j67933l8813j90004
$$ 644421 904032 558305 580243 809067 584694 554772 852429 684496 645683 455679
10988D55679Q8787L23611j98995K26628K99022E97154N04262k97387K05110p8288
$$ 455679 544466 868077 669082 895710 1194732 597154 1101416 804029 1009139 930851
10978I30851L29656K30185j57294J9516L83815K80523O7293M15534R6753j62042
$$ 930851 1260507 1490692 1333398 1352914 1736729 2017252 2084545 2500079 2596832 2434790
10968B434790K70161o22583j98284K63936l64211j87786J15881l65429M83678
$$ 2434790 2704951 2082368 1884084 2148020 1783809 1596023 1711904 1346475 1830153
10959A830153k94551J20934J17089j47743k26841K32268o7934k52968o7350k75099
$$ 1830153 1535602 1656536 1773625 1625882 1399041 1631309 1563375 1310407 1243057 967958
10949I67958j70249o14B92757J33126j54482j05707K52238A016M23302k09595
$$ 967958 797709 797095 292757 425883 271401 165694 417932 1016 424318 214723
10939B14723J85648K59343b5759B9126L52371i2860A01565K27388c12054F686
$$ 214723 400371 659714 -25759 29126 381497 -92860 101565 328953 -312054 6686
10928E0806b17948R4347A53489K5381d88076a74330B8975J6881G838L4649K4382
$$ 50806 -217948 -123601 153489 178870 -488076 -174330 28975 45856 7838 42487 66869
10917F6869h4404A08531k9459b38682A34793b87448G3092b02794n781C14389G9214
$$ 66869 -84404 108531 79072 -238682 134793 -287448 73092 -202794 -208575 314389 79214
10905A49563J16974A10064L3342i4858b9179B00231e2734k71171d9381n8978e619
$$ 149563 266537 110064 143406 -94858 -29179 200231 -52734 -323905 -49381 -108359 -5619
10893B80635d6006a9158d93j91549A27522b22162d8662B21972b89161B60210q2280
$$ 280635 -46006 -19158 -493 -192042 127522 -222162 -48662 221972 -289161 260210 177930
10882A77930b05566E4936J08011a37234H6600C3932b0900A88371i5440A77880
$$ 177930 -205566 54936 162947 -137234 86600 33932 -20900 188371 -95440 177880
10871B08731A1965c9123B09791d0622A5145a58236g267n9837B35956a32941f1167
$$ 208731 11965 -39123 209791 -40622 15145 -158236 -7267 -67104 235956 -132941 -61167
10859H0087c7477k0898B64062b37796O3528j31070M7914R5868D0719a07425j03217
$$ 80087 -37477 -58375 264062 -237796 -174268 -305338 -257424 -161556 40719 -107425 -210642
10848b10642G9326b47314h5543F5693J27120a81087A81552h1488A79376i6599
$$ -210642 79326 -247314 -85543 65693 192813 -181087 181552 -81488 179376 -96599
10837b59296F0731Q46K02782c3909k41073J34248d0621m0005A93666j1471p6895
$$ -259296 60731 61577 264359 -33909 -274982 -140734 -40621 -80626 193666 182195 105300
10826A05300K6043a5719k46751j20078H2484a39957G6807g4196C13936g4797k31337
$$ 105300 131343 -15719 -262470 -382548 82484 -139957 76807 -74196 313936 -74797 -306134
10815c06134c7729k2540j30469D9465c885B04474a92735G1653K02354A24395d584
$$ -306134 -37729 -60269 -190738 49465 -3885 204474 -192735 71653 274007 124395 -4584
10803D34450I8450a64556F705i9826j08947n3597k6488B66700I8325B0314G910
$$ 434450 98450 -164556 6705 -99826 -208773 -262370 -288858 266700 98325 20314 7910
10791A02498h0145A67972a6993m86097g1324D9612c60016A2523d11510B71832
$$ 102498 -80145 167972 -16993 -503090 -71324 49612 -360016 12523 -411510 271832
10780B69794b34275C5485J56706B4052J38446o3074d51119d9816A04286b37354
$$ 269794 -234275 35485 192191 24052 162498 99424 -451119 -49816 104286 -237354
10769b12620D20059A17355a23900k07907A4657N241L82939A00265K23448I1276
$$ -212620 420059 117355 -123900 -331807 14657 19898 402837 100265 323713 91276
10758A35153n3717b3054j42804a4213G945J34244D5833a19077j91440e0169j148
$$ 135153 81436 -23054 -165858 -14213 7945 142189 45833 -119077 -310517 -50169 -51317
10747e1317E0133c1266A26785l5717j3719Q4813e3506a8099I9800b56616D57510
$$ -51317 50133 -31266 126785 91068 77349 162162 -53506 -18099 99800 -256616 457510
10735a67298m1004C279J75025D0660a69811B4633J20194b26225B83104h2952C47587
$$ -167298 -208302 3279 178304 40660 -169811 24633 144827 -226225 283104 -82952 347587
10723f6263B04576b58054B91707E6932c76726P962h5882A22975f9894j85114A28823
$$ -66263 204576 -258054 291707 56932 -376726 -368764 -85882 122975 -69894 -255008 128823
10711A61417R9805A11459D424K9705c20159f6460A8043a53093C802e2102A74752
$$ 161417 261222 111459 4424 34129 -320159 -66460 18043 -153093 3802 -52102 174752
10699g2156b6986l64135r185i730m77193A88915c11945B09031a05521j13703L4522
$$ -72156 -26986 -391121 -400306 -9730 -486923 188915 -311945 209031 -105521 -219224 -184702
10688a84702A20479a40736B17157d2218G0696g2463l5277M2772A41694a46920
$$ -184702 120479 -140736 217157 -42218 70696 -72463 -107740 -64968 141694 -146920
10677i4186j3124B5325a89426b916m12720A67052i7512j80969r6974A53271L6272
$$ -94186 -107310 25325 -189426 -2916 -415636 167052 -97512 -278481 -375455 153271 189543
10666A89543h9155n0315H5549a6784k10156B729P4496b50291M14B5613b40383
$$ 189543 -89155 -139470 85549 -16784 -226940 2729 77225 -250291 -249877 25613 -240383
10654a6786c612A66840c38728f0472j5540k15127j32363B7869b85911i4672k67828
$$ -16786 -3612 166840 -338728 -60472 -76012 -291139 -423502 27869 -285911 -94672 -362500
10643c62500M9928A72048b74091L8761C2210b23007H2414K41388b7697j97271
$$ -362500 -312572 172048 -274091 -235330 32210 -223007 82414 323802 -27697 -224968
10633b24968B42468a30783A73665A61K90131I0810m2658K16572c18445N1299J16342
$$ -224968 242468 -130783 173665 161 290292 90810 48152 264724 -318445 -267146 -150804
10622a50804k60307P7949J1827a26281a0047r522A02644c1481A88380B4392b43957
$$ -150804 -411111 -333162 -321335 -126281 -10047 -19569 102644 -31481 188380 24392 -243957
10610b27531i7652P663k5756A8545i3935F2133J7031a42489H9033K7128b01843
$$ -227531 -97652 -89989 -115745 18545 -93935 62133 79164 -142489 89033 116161 -201843
10598A51981e0122j64063M5191f0294L646H0091J10410h6232A16149P360a5329
$$ 151981 -50122 -214185 -168994 -60294 -56648 80091 190501 -86232 116149 123509 -15329
10586a43810R934d5744G24b60960A74810b52361B3181b67317k5677q7573b9361
$$ -143810 -133876 -45744 724 -260960 174810 -252361 23181 -267317 -292994 -380567 -29361
10574A34666c6244b697k32019g345r4730F0330a05272K9452A52789c7018k10149
$$ 134666 -36244 -2697 -234716 -7345 -102075 60330 -105272 -75820 152789 -37018 -247167
10563b47167j6836J2611J00327j3208A17630M2700a88362j73491i4691C8377a57799
$$ -247167 -264003 -251392 -151065 -164273 117630 160330 -188362 -361853 -94691 38377 -157799
10551g0121A04614h7825b5014n7649j07594J1438B2305a59114e153m548j57467
$$ -70121 104614 -87825 -25014 -82663 -190257 -178819 22305 -159114 -5153 -9701 -167168
10540a67168B74578b61255A08185c41660a39729A16477c28799E6764a01935C6251
$$ -167168 274578 -261255 108185 -341660 -139729 116477 -328799 56764 -101935 36251
10529B13985a11948c6148l07140A97927a35513O6313A94598a10789g685j30580
$$ 213985 -111948 -36148 -343288 197927 -135513 -69200 194598 -110789 -7685 -138265
10519a38265A35191a8305p6348j28384J05017l19941h7633j23497F7668K14082
$$ -138265 135191 -18305 -94653 -223037 -118020 -437961 -87633 -211130 67668 281750
10509B81750f9266q4730L8030k785A28168K50417N4984b3283k28186g080C17633
$$ 281750 -69266 -153996 -115966 -118751 128168 378585 433569 -23283 -251469 -7080 317633
10497F5957c88803f2528l6979j8531K3052J0710I4554J7869g7198j65455N1707
$$ 65957 -388803 -62528 -99507 -118038 -94986 -84276 94554 112423 -77198 -242653 -190946
10486a90946O6917A23550b04827O0028B29593H8317P2156K54916j05955j37574
$$ -190946 -124029 123550 -204827 -144799 229593 88317 160473 415389 309434 171860
10476A71860c9646A04078b37271B06157a6664A12244J87272a15885a5465j45701
$$ 171860 -39646 104078 -237271 206157 -16664 112244 299516 -115885 -15465 -161166
10466a61166E5318a28310k358B1828h9568j80236h7313G0970b65078A79111A6688
$$ -161166 55318 -128310 -130668 21828 -89568 -269804 -87313 70970 -265078 179111 16688
10454E3551a97118G1982i6577k3481A99084K209J01025a0096j16931B8608J00849
$$ 53551 -197118 71982 -96577 -120058 199084 201293 302318 -10096 -127027 28608 129457
10443A29457P0205J23923j52917F5736a58183A14665b7847j42952B45881j13399
$$ 129457 199662 323585 170668 65736 -158183 114665 -27847 -170799 245881 132482
10433A32482j7295P9718p8679m1304A3296a92645R4084A73308a76751A50238a77825
$$ 132482 115187 194905 116226 74922 13296 -192645 -98561 173308 -176751 150238 -177825
10421c0473j68465H7334a83670A26170k7410a54629O0039j3570E4041A1137J4321
$$ -30473 -198938 87334 -183670 126170 98760 -154629 -94590 -108160 54041 11137 25458
10410B5458a36674D9234M0569a42587B2598a84135d1560l27086a44512f2049B31958
$$ 25458 -136674 49234 89803 -142587 22598 -184135 -41560 -368646 -144512 -62049 231958
10398A04202h0460l2265A32047D8436i9169E2057J78938l1319C6928J81235M9421
$$ 104202 -80460 -112725 132047 48436 -99169 52057 230995 199676 36928 218163 267584
10387B67584b71899A35531F6776A1121j853L01719A22540L1663i3175Q190k5238
$$ 267584 -271899 135531 66776 11121 9268 310987 122540 154203 -93175 -84985 -110223
10376a10223A03316J35434J31123j20934j028q1907L2417P9435J23140A36826
$$ -110223 103316 238750 369873 248939 247911 166004 198421 277856 400996 136826
10365D19845L9916j56222Q1130j08164K61826A21110L39226j89361j20641K67864
$$ 419845 459761 303539 384669 276505 538331 121110 460336 270975 150334 418198
10355D18198f6013o1917E11131k43096K13047K5855J00398j1263j88738I3687
$$ 418198 -66013 -127930 511131 268035 481082 506937 607335 596072 407334 93687
10344C40721n6154J31840j43429G1681J41147Q0507i0851b9055B02001d4623C21203
$$ 340721 284567 416407 272978 71681 212828 293335 -90851 -29055 202001 -44623 321203
10332d5418A48174J42630e176B59708l9011H4883K859F191K0253b36943B82763
$$ -45418 148174 290804 -5176 259708 220697 84883 87742 6191 26444 -236943 282763
10320A22457l2901A8518M5603J56249n9804A8619J4355J86082j9642d18190I10
$$ 122457 89556 18518 64121 220370 160566 18619 32974 219056 199414 -418190 910
10308d1917A8027Q8489b207j5593m25966D5L08322A26438a18160A39456R9791
$$ -41917 18027 106516 -2207 -17800 -443766 45 308367 126438 -118160 139456 239247
10297B39247a20949M5158l7524q3472K5730A24839b1047B19421c48748a53509
$$ 239247 -120949 -75791 -113315 -196787 -171057 124839 -21047 219421 -348748 -153509
10286B05907E3331a94330A20053o379l1703a33943B00354h297E1727c20176D5903
$$ 205907 53331 -194330 120053 113674 81971 -133943 200354 -8297 51727 -320176 45903
10274b32993a2515F278a45945L0079n2144A2922J587J10697b76073N7042h8885
$$ -232993 -12515 6278 -145945 -115866 -168010 12922 14509 125206 -276073 -219031 -88885
10262C70216b89773c3959I7038K83065I2128L8532L66465B13945J83065j97820
$$ 370216 -289773 -33959 97038 380103 92128 130660 497125 213945 397010 199190
10252A99190L040h3600A21684F0838a53212B6199b66617i6671j46928B64766a09996
$$ 199190 202230 -83600 121684 60838 -153212 26199 -266617 -96671 -243599 264766 -109996
10240h0135q3440I9114d42775a12603c8385j43416A77224a30599N5460A12630
$$ -80135 -163575 99114 -442775 -112603 -38385 -181801 177224 -130599 -75139 112630
10229b12862B99100j08868g1907k98461I0618a94407d134j52839N7779k57888
$$ -212862 299100 190232 -71907 -370368 90618 -194407 -4134 -156973 -99194 -357082
10219c57082d9842B8046a67079b392B08619b90709o2315F987i7556j55923o0318
$$ -357082 -49842 28046 -167079 -2392 208619 -290709 -353024 6987 -97556 -253479 -313797
10208c13797A00999L1847B5184e1272m15690e7119A17733l1998b81481Q8248c583
$$ -313797 100999 132846 25184 -51272 -466962 -57119 117733 85735 -281481 -193233 -3583
10196a78330b1353j33230P6860D1574K6400d69726J89079B14035b13381h4592
$$ -178330 -21353 -154583 -77723 41574 67974 -469726 -280647 214035 -213381 -84592
10185A0920M3276N9711J0550B1520g8079m781A54420b11077B33358h1775B69145
$$ 10920 54196 113907 124457 21520 -78079 -82860 154420 -211077 233358 -81775 269145
10173D06433F8955A7442b06033B1959c2112l7723B5979a38747N2033A2115a06665
$$ 406433 68955 17442 -206033 21959 -32112 -69835 25979 -138747 -86714 12115 -106665
10161A24247b71125c3938l54959d9540j7884A19917n4595b02800g8165k72728
$$ 124247 -271125 -33938 -388897 -49540 -67424 119917 65322 -202800 -78165 -350893
10151c50893E4383b73295D8650b01526R3177c5712j24445B45527E4260J58529
$$ -350893 54383 -273295 48650 -201526 -108349 -35712 -160157 245527 54260 212789
10141B12789j03710g7412A37859b2923A26763a21775b8008R549A78653a02439
$$ 212789 109079 -77412 137859 -22923 126763 -121775 -28008 -18459 178653 -102439
10130A57340B4222Q518g4803B7540b19095p2591J5a44191d7651F2260N0051a78250
$$ 157340 24222 32740 -74803 27540 -219095 -291686 -291671 -144191 -47651 62260 112311 -178250
10117a35127A97172a00276A27379Q5151j01612c00099K9641a15179b6391A00904
$$ -135127 197172 -100276 127379 212530 110918 -300099 -270458 -115179 -26391 100904
10106a06028C19393i3201C8738a12634C4915P7771A7921J51564p7720c05647E7703
$$ -106028 319393 -93201 38738 -112634 34915 112686 17921 169485 91765 -305647 57703
10094a3357B2511b61375o9504a41880j3407M4042l3981L2968D6758L03037c81485
$$ -13357 22511 -261375 -330879 -141880 -155287 -111245 -145226 -112258 46758 349795 -381485
10082a9395j62048D96917c61954A01981J16263d13360f9357A9277c15253C6273
$$ -19395 -181443 496917 -361954 101981 218244 -413360 -69357 19277 -315253 36273
10071B5254a56113B0620a6488j04768g071j65546c5441j89278H1879c4939d165
$$ 25254 -156113 20620 -16488 -121256 -7071 -172617 -35441 -224719 81879 -34939 -4165
10059F3027Q2222a09369c2508A82863b8037j90169R7638q3973b2146G4121a61870
$$ 63027 145249 -109369 -32508 182863 -28037 -218206 -120568 -204541 -22146 74121 -161870
10047d38137A54608J4651a19915D009a67409e3543j38286D6846f1868K1561j93143
$$ -438137 154608 169259 -119915 4009 -167409 -53543 -191829 46846 -61868 -40307 -233450
10036b33450A70025f1791r6386e0832G04J45995b10240A15912b21121J5944H5766
$$ -233450 170025 -61791 -158177 -50832 704 146699 -210240 115912 -221121 -205177 85766
10024C99811d42381a77850f5701r1008j52360j79855g5590k3241j85481J33381
$$ 399811 -442381 -177850 -65701 -156709 -309069 -488924 -75590 -98831 -284312 -150931
10014a50931k77877d2248j71518B58087a6101C2194J6230b94733o1893B14411
$$ -150931 -428808 -42248 -213766 258087 -16101 32194 48424 -294733 -356626 214411
10003b31860H0384a86190j89621a18651H967J90612D1435Q9992b37219h3762F6547
$$ -231860 80384 -186190 -375811 -118651 8967 199579 41435 131427 -237219 -83762 66547
9991i949j52252j22326F7891a8561r546A48587b28319A28909L5719e60245B97239
$$ -9949 -162201 -284527 67891 -18561 -28107 148587 -228319 128909 164628 -560245 297239
9979f16723a50133d9637G8869c17369B3815N0307b04260F8572g0134I8449c27796
$$ -616723 -150133 -49637 78869 -317369 23815 74122 -204260 68572 -70134 98449 -327796
9967A15747b67859D6341e1139j21243B0703c67687A61004a70613j67721G0841
$$ 115747 -267859 46341 -51139 -172382 20703 -367687 161004 -170613 -338334 70841
9956a95250B4542a55174N0746D4097a90070H1553R9863c46661k3183J52394H3513
$$ -195250 24542 -155174 -104428 44097 -190070 81553 181416 -346661 -369844 -217450 83513
9944B37616p1825c63944A07773b64708H7524R9966i5427A02511b55131A57902
$$ 237616 165791 -363944 107773 -264708 87524 187490 -95427 102511 -255131 157902
9933A51097g6284I310i7432A39056a11081L8833j43611D74593d6904k14825a06399
$$ 151097 -76284 9310 -97432 139056 -111081 -72248 -215859 474593 -46904 -261729 -106399
9921b40557j6701d2068k40135a18644M443b4557o7973j00206j6023J9363A7891
$$ -240557 -257258 -42068 -282203 -118644 -114201 -24557 -92530 -192736 -208759 -189396 17891
9909a75731B25704c01200b0770p0022o190B27155c33451b0937j25820A4530K0259
$$ -175731 225704 -301200 -20770 -90792 -96982 227155 -333451 -20937 -146757 14530 34789
9898C4789a03239M9762m0669N164r1351A21426a77454K0084L097A77540c12327
$$ 34789 -103239 -53477 -94146 -88982 -180333 121426 -177454 -157370 -154273 177540 -312327
9886C7537J73931a22943D2441a79933A26802f0771j48602E1256O8280b3321G175
$$ 37537 211468 -122943 42441 -179933 126802 -60771 -209373 51256 119536 -23321 7175
9874f7340j35860M8082D9975b56416b0009j50255C8182J30486g7783l7674K7495
$$ -67340 -203200 -155118 49975 -256416 -20009 -170264 38182 168668 -77783 -115457 -87962
9863h7962p6456A61846a5486j96676J06055K2296m3910D1955N3020a63616j41097
$$ -87962 -164418 161846 -15486 -212162 -106107 -83811 -127721 41955 94975 -163616 -304713
9852c04713k44733K23002A99514g4898l8715A31289h804j98505R4859D0389b33628
$$ -304713 -549446 -326444 199514 -74898 -113613 131289 -8804 -207309 -112450 40389 -233628
9840g8910j68879A43136D8409a08451A96503G0050C1416a49105e3730C3956g3368
$$ -78910 -247789 143136 48409 -108451 196503 70050 31416 -149105 -53730 33956 -73368
9828A19599K4412a74439h4564k14723b6201r0012i708A19760a30274M1416Q773
$$ 119599 144011 -174439 -84564 -299287 -26201 -116213 -9708 119760 -130274 -88858 -80085
9817h0085q8179B05288B2901N1498a657F1419b83316D7579i888l1406l70850B309
$$ -80085 -168264 205288 22901 74399 -1657 61419 -283316 47579 -9888 -41294 -412144 2309
9804a12709F1154k0415c22182a35103B48849d40668a70542k2305j01627a24474
$$ -112709 61154 40739 -322182 -135103 248849 -440668 -170542 -192847 -294474 -124474
9793a0893c002k86814A40345c66248B54632a43050f2532K2088j74677g1601K0466
$$ -10893 -3002 -289816 140345 -366248 254632 -143050 -62532 -40444 -215121 -71601 -51135
9782e1135k50354H9935J6017d1054A41953F7217K5846B7145d4518k32645h3249
$$ -51135 -301489 89935 105952 -41054 141953 67217 93063 27145 -44518 -277163 -83249
9770a60716A32139c51476J25447E846a23038I8762h0833A47176a29177A60775
$$ -160716 132139 -351476 -226029 5846 -123038 98762 -80833 147176 -129177 160775
9759D4071a95969C228L9730b97159M9325I2414c89332A90668b37027h9477j32753
$$ 44071 -195969 3228 42958 -297159 -247834 92414 -389332 190668 -237027 -89477 -222230
9748b22230R8363f895r6539j83413L522I4530c20125L8544g3431A37670N6640
$$ -222230 -123867 -6895 -103434 -286847 -283325 94530 -320125 -281581 -73431 137670 194310
9737A94310B9101d4214C5857a76187j68144J32301R2788d6732D41099b16890b6505
$$ 194310 29101 -44214 35857 -176187 -344331 -212030 -119242 -46732 441099 -216890 -26505
9725a61875Q376D7482g5511H9444C6853a38106j4662m3080D0207m277a44825f2661
$$ -161875 -153499 47482 -75511 89444 36853 -138106 -152768 -195848 40207 35930 -144825 -62661
9712b90748C0244a69929I2942c90965g961l76643a83205N1989j09512g6690m7891
$$ -290748 30244 -169929 92942 -390965 -7961 -384604 -183205 -131216 -240728 -76690 -124581
9701a24581B4286c5600A83908b04640Q3343L9683k39255i0923j61334H7080a2300
$$ -124581 24286 -35600 183908 -204640 -121297 -81614 -320869 -90923 -252257 87080 -12300
9689F2766a21909A37131d9279q2070j2551r083A10992K48954f3023j35929f1699
$$ 62766 -121909 137131 -49279 -131349 -143900 -152983 110992 359946 -63023 -198952 -61699
9677a19489D9844a53136N3208c3736j73709C65274e0074p2498A39019F3994a40925
$$ -119489 49844 -153136 -99928 -33736 -207445 365274 -50074 -122572 139019 63994 -140925
9665F6492G008L251c11428f5502J7076A42307a50014j8042l4651A03101D6478
$$ 66492 7008 10259 -311428 -65502 -48426 142307 -150014 -168056 -202707 103101 46478
9653b07113C2467c2463k24220q6361a01708B28531e9093r1050O4588A6079f04055
$$ -207113 32467 -32463 -256683 -343044 -101708 228531 -59093 -150143 -85555 16079 -604055
9641d8917A06243Q9586G295b78445F4748d01390J86487K4249r706F7223a2261
$$ -48917 106243 195829 7295 -278445 64748 -401390 -214903 -190654 -200360 67223 -12261
9629A83345j291a07469B90241A03294a4721l38021A81989a7703k31734l6410c7722
$$ 183345 182054 -107469 290241 103294 -14721 -352742 181989 -17703 -249437 -285847 -37722
9617b52611B5031a16095j33489h7772B9210a27640l06773A48377a00846A40245
$$ -252611 25031 -116095 -249584 -87772 29210 -127640 -434413 148377 -100846 140245
9606b32326b7810o7660E9167g0015B4001a93224L1028j08421F1842J45435b9730
$$ -232326 -27810 -95470 59167 -70015 24001 -193224 -162196 -270617 61842 207277 -29730
9594I7554K7669e04q7032r4205C83322a82634r5834Q5159N9316A13582J47126
$$ 97554 125223 -504 -87536 -181741 383322 -182634 -278468 -193309 -133993 113582 260708
9583B60708A16954a58668r0438A72105c04276J07784A41451a00150a6052k66396
$$ 260708 116954 -158668 -249106 172105 -304276 -196492 141451 -100150 -16052 -282448
9573b82448d6173B35127a68131B28813j05758a66207O9712G9643A7263b1399B06128
$$ -282448 -46173 235127 -168131 228813 123055 -166207 -96495 79643 17263 -21399 206128
9561a26085b9101a933C09287a96759A58744a40426J1526k72856O1902C99261e8022
$$ -126085 -29101 -1933 309287 -196759 158744 -140426 -128900 -401756 -339854 399261 -58022
9549a58219c6213I6416a71613A23692a16705p9275A2371N296b53845B3857b04099
$$ -158219 -36213 96416 -171613 123692 -116705 -195980 12371 17667 -253845 23857 -204099
9537e2875o3064A56042b49267g8441B44204a72471C3631L7287R61A660J9116K79176
$$ -52875 -115939 156042 -249267 -78441 244204 -172471 33631 70918 71879 1660 20776 299952
9525B99952A17662J0320B5132c42195J14241g0649a6342n0468p3819j1825L4781
$$ 299952 117662 127982 25132 -342195 -227954 -70649 -16342 -66810 -140629 -152454 -117673
9514a17673E1620b10419A2500P9988a42371A32547a816j44472j02998a20219b7560
$$ -117673 51620 -210419 12500 92488 -142371 132547 -1816 -146288 -249286 -120219 -27560
9502a57593l3382A0937O7565l7794M4793h8795A23975n6079A217b34986A9514
$$ -157593 -190975 10937 78502 40708 85501 -88795 123975 67896 1217 -234986 19514
9490I9644a11313n6712I7627b88214J37814j85593J22931q7075h2982j43845j3523
$$ 99644 -111313 -168025 97627 -288214 -150400 -335993 -213062 -300137 -82982 -226827 -240350
9479b40350A89948l7459g9194k9816o8143A59089i25n2158E9887J89640E710a90183
$$ -240350 189948 152489 -79194 -109010 -177153 159089 -925 -53083 59887 249527 5710 -190183
9466a93284B38346h0748k93846k9353a72648L7161d3335B70K43851c12851J24747
$$ -193284 238346 -80748 -374594 -403947 -172648 -135487 -43335 270 244121 -312851 -188104
9455a88104d5473k36852P8899j9419j20817a44384A26178O2363E9460a00282k01628
$$ -188104 -45473 -282325 -203426 -222845 -343662 -144384 126178 188541 59460 -100282 -301910
9444c01910e0622a8011p1072k79644A21998a00854r5944f6994A03934a49333q4789
$$ -301910 -50622 -18011 -89083 -368727 121998 -100854 -196798 -66994 103934 -149333 -234122
9433b34122i2529q8557j49430A40808a3976m4434H2144c00981D71673I0127A35
$$ -234122 -92529 -181086 -330516 140808 -13976 -58410 82144 -300981 471673 90127 135
9421C8795b19420a05541k9080B31333b15262J02287j12217L6677Q7306j10806
$$ 38795 -219420 -105541 -134621 231333 -215262 -112975 -225192 -188515 -101209 -212015
9411b12015c1948A99344a57735M3258K0832j17912E8932M0809C6556f355a581
$$ -212015 -31948 199344 -157735 -114477 -93645 -211557 58932 99741 36556 -6355 -1581
9399A8212c2261C373b0220k15638g4075F5841d6894C40147p5686d1604j47099
$$ 18212 -32261 3373 -20220 -235858 -74075 65841 -46894 340147 264461 -41604 -188703
9388a88703i0082D8688e4356l7996a315q9663A05299l1255Q574a03143A73836
$$ -188703 -90082 48688 -54356 -92352 -1315 -90978 105299 74044 82618 -103143 173836
9376g3385j15821L8168O9446b2402D0195K32362a32299o7497C744K8781a0264
$$ -73385 -189206 -151038 -81592 -22402 40195 272557 -132299 -199796 3744 32525 -10264
9364A63578a04694M1435b9428A88174a84429P301L2459A35528f426F6307b71034
$$ 163578 -104694 -63259 -29428 188174 -184429 -177128 -144669 135528 -6426 66307 -271034
9352i1445j63357M3206B4923L0515c23780a36797j41530r676C6290c41194E4293
$$ -91445 -254802 -211596 24923 55438 -323780 -136797 -278327 -288003 36290 -341194 54293
9340d908B86923a69454o3427G2895A818J07046b05223e2625A70061d29721b01913
$$ -4908 286923 -169454 -232881 72895 1818 108864 -205223 -52625 170061 -429721 -201913
9328E9772a55155d4083j85538B55007I1835b74711K7904A27079E2243D682K6092
$$ 59772 -155155 -44083 -229621 255007 91835 -274711 -246807 127079 52243 4682 30774
9317C0774c11552b3081A54657h5908j40649B1285P6139K47992j59330a76595E2227
$$ 30774 -311552 -23081 154657 -85908 -226557 21285 97424 345416 186086 -176595 52227
9305E6227a40400L1453j19758a8106k17757G1920L859d25675A22895R6092a75430
$$ 56227 -140400 -108947 -228705 -18106 -235863 71920 75779 -425675 122895 218987 -175430
9293g390A50607b39272a09686A59271D9918d60000J64033o7250a29567k60031
$$ -7390 150607 -239272 -109686 159271 49918 -460000 -295967 -363217 -129567 -389598
9283c89598C4330h8478D3711a37985D570h474j36958B14125f7927k91263o2546
$$ -389598 34330 -88478 43711 -137985 4570 -8474 -145432 214125 -67927 -359190 -421736
9272d21736D6568P0299d6965B3662b90847a27484B5747K46001a70768H9674g1706
$$ -421736 46568 116867 -46965 23662 -290847 -127484 25747 271748 -170768 89674 -71706
9260b45759q6163A77416b1874l77126B3508c9249I0415d7980a5262n82158B3567
$$ -245759 -331922 177416 -21874 -399000 23508 -39249 90415 -47980 -15262 -597420 23567
9248C0772N9090b15121A0208a98236B0612i7617I3667K12408c8261A83453a59544
$$ 30772 89862 -215121 10208 -198236 20612 -97617 93667 306075 -38261 183453 -159544
9236A80871g8984K3973k08542e7721A73932c7649p901I3136e8663F6404d7420
$$ 180871 -78984 -55011 -263553 -57721 173932 -37649 -45550 93136 -58663 66404 -47420
9224a66893C73497b28564e5674B7926i1991j6575B32141b9323l68616a94555j50734
$$ -166893 373497 -228564 -55674 27926 -91991 -108566 232141 -29323 -397939 -194555 -345289
9213c45289J68813h5191k61240b2393B9533Q3278B5704i3710c6735l3300B7852
$$ -345289 -176476 -85191 -346431 -22393 29533 112811 25704 -93710 -36735 -70035 27852
9201B11253a1214k14409J6784O4091K1898I3793L6107h1212A8296J02863a3973
$$ 211253 -11214 -225623 -208839 -144748 -122850 93793 129900 -81212 18296 121159 -13973
9189a1772j02077m3904C74115e393A0554c083B43932b64235j8500O0458b2333
$$ -11772 -113849 -157753 374115 -5393 10554 -3083 243932 -264235 -282735 -222277 -22333
9177a46619L811K5151L7146H3629c8654j60973D19493g0354o6630j76694e4886
$$ -146619 -142808 -117657 -80511 83629 -38654 -199627 419493 -70354 -136984 -313678 -54886
9165b4428C4119a47740A56313e4296M847m0271I3960b0224A9116a45672A64993
$$ -24428 34119 -147740 156313 -54296 -49449 -89720 93960 -20224 19116 -145672 164993
9153B10611g3057A19367a21506L2485m7364d9180g449l40467M4908j1517E4654
$$ 210611 -73057 119367 -121506 -89021 -136385 -49180 -7449 -347916 -303008 -314525 54654
9141a40632F9147a79936L634g1327J4h934E2071B4728e0110D609a91996a4942
$$ -140632 69147 -179936 -176302 -71327 -71313 -8934 52071 24728 -50110 4609 -191996 -14942
9128F9720f5358h410k6497I2156i3635j20836G1189R8056c066j21222j2676A11122
$$ 69720 -65358 -8410 -34907 92156 -93635 -214471 71189 169245 -3066 -124288 -136964 111122
9115a24546E0520K9185b13329J7442B35236E8251A4612b91063B24344o1836d22907
$$ -124546 50520 79705 -213329 -195887 235236 58251 14612 -291063 224344 162508 -422907
9103b59451C82885b05227g9231l4483A43607a72017A84427a37974A23359M8970
$$ -259451 382885 -205227 -79231 -113714 143607 -172017 184427 -137974 123359 172329
9093A72329H332b3457A68821b12986f0745B80175H3540J41919c0165o7599j50948
$$ 172329 8332 -23457 168821 -212986 -60745 280175 83540 225459 -30165 -97764 -248712
9082b48712A52851b28075K8687D911b15281A82491a37232m2301B4191R9431A8327
$$ -248712 152851 -228075 -199388 4911 -215281 182491 -137232 -179533 24191 123622 18327
9070a80743B3661e0403A04348a65771f7614j11597M1697A70206B0468b09057p6533
$$ -180743 23661 -50403 104348 -165771 -67614 -179211 -137514 170206 20468 -209057 -285590
9059b85590C5881J704i1756j64468h1107p2117a2929B8417b96953g7215N545L149
$$ -285590 35881 37585 -91756 -256224 -81107 -153224 -12929 28417 -296953 -77215 -71670 -68521
9047f8521j2137M232j19727C4661c41273e5432j60163i1404A82629D3780a56051
$$ -68521 -80658 -76426 -196153 34661 -341273 -55432 -215595 -91404 182629 43780 -156051
9035e8116k14824H9484b45622c5630j92969E1678J3038b2898A36338d41720B4793
$$ -58116 -272940 89484 -245622 -35630 -228599 51678 64716 -22898 136338 -441720 24793
9023a04303H1737C976c13834f7228p0256n1861J9014c9344I4724D5522a93965
$$ -104303 81737 3976 -313834 -67228 -137484 -189345 -170331 -39344 94724 45522 -193965
9011a80689J3642D7750K5999b75896c249j60258A72260b96270A12488d32236K05228
$$ -180689 -167047 47750 73749 -275896 -3249 -163507 172260 -296270 112488 -432236 -227008
9000b27008I6491a12750p1067b4024J1466j3411j23083D6622K163h8802J7854
$$ -227008 96491 -112750 -183817 -24024 -12558 -25969 -149052 46622 48785 -88802 -70948
8989g0948G6900M5640i8194k00082I6442e6305q188k41174I4729k2590A300a42094
$$ -70948 76900 122540 -98194 -298276 96442 -56305 -64493 -305667 94729 72139 1300 -142094
8976A42990c82552J59901C3802c20246p5412E2349J19303j5031i2771j52668i0417
$$ 142990 -382552 -222651 33802 -320246 -395658 52349 171652 156621 -92771 -245439 -90417
8964f2168j5025j95141j0376J36627k77416K03137A07713a75616A21828D1736
$$ -62168 -77193 -272334 -282710 -146083 -423499 -220362 107713 -175616 121828 41736
8953f9871q9387A74074c67352h2668E239c88245d7878j19584A88154J48848C9511
$$ -69871 -159258 174074 -367352 -82668 5239 -388245 -47878 -167462 188154 337002 39511
8941G9176J10216a1433j28199j13749J07210A17839L7926J32546j43602i3513
$$ 79176 189392 -11433 -139632 -253381 -146171 117839 155765 288311 144709 -93513
8930a37023d0246p9203A85862J35037j8790j6056K22047J016583L946086Q543406
$$ -137023 -40246 -119449 185862 320899 302109 286053 508100 1524683 5470769 14014175
8920A4014175R8682D089280A141262D17517R7076j74462A49064a91919k5481c051
$$ 14014175 14112857 4089280 1141262 417517 514593 340131 149064 -191919 -217400 -3051
8909A27730R8693K22796q7378j70014a1072k64807A39156i6428A82176b5103A75752
$$ 127730 226423 449219 361841 191827 -11072 -275879 139156 -96428 182176 -25103 175752
8897d6139D5157a37082B7077a72713J6485B270a33711m6330J9890I3300c70217
$$ -46139 45157 -137082 27077 -172713 -156228 2270 -133711 -180041 -160151 93300 -370217
8885a28089a0939I7216j6581c24830J58708g1153r9217I8275a656j77391M3272
$$ -128089 -10939 97216 80635 -324830 -166122 -71153 -170370 98275 -1656 -179047 -135775
8874a35775d3538C71799A36657e99633F9453d2926A61136f4779A68016J5259i7532
$$ -135775 -43538 371799 136657 -599633 69453 -42926 161136 -64779 168016 183275 -97532
$$ [...]
##END NTUPLES=NMR SPECTRUM
##END=
