
##TITLE=UV1230_M7_1357-1247_20_7230859_pB3h3UzOJw
##JCAMPDX= 6.0         $$ Bruker NMR JCAMP-DX V2.0
##DATA TYPE= NMR SPECTRUM
##DATA CLASS= NTUPLES
##ORIGIN= BRUKER
##OWNER= Administrator
$$ 1.72 TOPSPIN		Version 2.1
$$ 2013-01-18 19:24:55.908 -0500  Administrator@X
$$ Compression mode = diff/dup
##.OBSERVE FREQUENCY= 400.02188249412
##.OBSERVE NUCLEUS= ^1H
##.ACQUISITION MODE= SIMULTANEOUS (DQD)
##.ACQUISITION SCHEME= undefined
##.AVERAGES= 64
##.DIGITISER RES= 22
##SPECTROMETER/DATA SYSTEM= spect
##.PULSE SEQUENCE= noesygpps1d.comp
##.SOLVENT NAME= COFFEE_meoh
##.SHIFT REFERENCE= INTERNAL, COFFEE_meoh, 1, 14.96151
##AUDIT TRAIL= $$ (NUMBER, WHEN, WHO, WHERE, PROCESS, VERSION, WHAT)
$$ ##TITLE= Audit trail, TOPSPIN		Version 2.1
$$ ##JCAMPDX= 5.01
$$ ##ORIGIN= Bruker BioSpin GmbH
$$ ##OWNER= Administrator
$$ $$ E:\/data/COFFEE/nmr/UV1230_M7_1357-1247_20_7230859_pB3h3UzOJw/22/pdata/1/auditp.txt
$$ ##AUDIT TRAIL=  $$ (NUMBER, WHEN, WHO, WHERE, PROCESS, VERSION, WHAT)
(   1,<2013-01-18 19:24:50.080 -0500>,<Administrator>,<X>,<go>,<TOPSPIN 2.1>,
      <created by zg
	started at 2013-01-18 19:13:20.621 -0500,
	POWCHK enabled, PULCHK disabled,
       configuration hash MD5:
       86 BA 57 50 F2 9D 5C 9B 26 00 A9 28 5F 66 2E 89
       data hash MD5: 64K
       BE 9D E6 55 7D DA 57 0D 84 28 BA E2 4C A5 DC B4>)
(   2,<2013-01-18 19:24:53.143 -0500>,<Administrator>,<X>,<proc1d>,<TOPSPIN 2.1>,
      <Start of raw data processing
       efp LB = 0.3 FT_mod = 6 PKNL = 1 PHC0 = 0 PHC1 = 0 SI = 128K 
       data hash MD5: 128K
       F8 50 F6 34 34 37 77 8A 58 80 C4 21 E7 AC C2 54>)
(   3,<2013-01-18 19:24:54.189 -0500>,<Administrator>,<X>,<proc1d>,<TOPSPIN 2.1>,
      <pk PHC0 = -84.14978 PHC1 = 0 
       data hash MD5: 128K
       F1 5F D3 48 76 0E 8E E9 96 0C 74 4F E3 F3 3F 64>)
(   4,<2013-01-18 19:24:54.846 -0500>,<Administrator>,<X>,<proc1d>,<TOPSPIN 2.1>,
      <abs ABSG = 1 
       data hash MD5: 128K
       1F 5E 45 B3 15 0D 93 6B CF 9F 75 82 74 3F BA 59>)
(   5,<2013-01-18 19:24:55.018 -0500>,<Administrator>,<X>,<proc1d>,<TOPSPIN 2.1>,
      <abs ABSG = 2 
       data hash MD5: 128K
       AF F9 08 4D EF B8 18 F8 0B 3D A2 E5 F8 B1 13 BF>)
(   6,<2013-01-18 19:24:55.189 -0500>,<Administrator>,<X>,<proc1d>,<TOPSPIN 2.1>,
      <abs ABSG = 3 
       data hash MD5: 128K
       F7 C0 BD 4B 8C A5 B6 0A 96 EC F6 18 FD EC 17 E2>)
(   7,<2013-01-18 19:24:55.361 -0500>,<Administrator>,<X>,<proc1d>,<TOPSPIN 2.1>,
      <abs ABSG = 4 
       data hash MD5: 128K
       B5 28 0C 98 F5 B7 18 A1 0E 22 DE 56 13 89 BE 57>)
(   8,<2013-01-18 19:24:55.564 -0500>,<Administrator>,<X>,<proc1d>,<TOPSPIN 2.1>,
      <abs ABSG = 5 
       data hash MD5: 128K
       26 FB D1 88 62 F1 7D 6B 4E 36 8F 10 51 E7 50 61>)
$$ ##END=
$$ 
$$ $$ hash MD5
$$ $$ FA 7F 42 22 37 07 F8 C1 A7 69 79 EF E3 F2 7D A4
##$RELAX= 
##$RELAX= 
##$RELAX= 
##$RELAX= 
##$RELAX= 
##$RELAX= 
##$RELAX= 
##$RELAX= 
$$ Bruker specific parameters
$$ --------------------------
##$DU= <E:\>
##$EXPNO= 22
$$ [...]
##$TP07= 0
##$TPNAME0= <>
##$TPNAME1= <>
##$TPNAME2= <>
##$TPNAME3= <>
##$TPNAME4= <>
##$TPNAME5= <>
##$TPNAME6= <>
##$TPNAME7= <>
##$TPOAL= (0..7)
0.5 0.5 0.5 0.5 0.5 0.5 0.5 0.5
##$TPOFFS= (0..7)
0 0 0 0 0 0 0 0
##$TUNHIN= 0
##$TUNHOUT= 0
##$TUNXOUT= 0
##$USERA1= <user>
##$USERA2= <user>
##$USERA3= <user>
##$USERA4= <user>
##$USERA5= <user>
##$V9= 5
##$VALIST= <valist>
##$VCLIST= <CCCCCCCCCCCCCCC>
##$VD= 0
##$VDLIST= <DDDDDDDDDDDDDDD>
##$VPLIST= <PPPPPPPPPPPPPPP>
##$VTLIST= <TTTTTTTTTTTTTTT>
##$WBST= 1024
##$WBSW= 4
##$XGAIN= (0..3)
0 0 0 0
##$XL= 0
##$YL= 0
##$YMAX_a= 6009106
##$YMIN_a= -13134088
##$ZGOPTNS= <>
##$ZL1= 120
##$ZL2= 120
##$ZL3= 120
##$ZL4= 120
##$ABSF1= 14.96151
##$ABSF2= -5.596672
##$ABSG= 5
##$ABSL= 3
##$ALPHA= 0
##$AQORDER= 0
##$ASSFAC= 0
##$ASSFACI= 0
##$ASSFACX= 0
##$ASSWID= 0
##$AUNMP= <proc_prof1d_extract.lims>
##$AXLEFT= 0
##$AXNAME= <>
##$AXNUC= <1H>
##$AXRIGHT= 0
##$AXTYPE= 0
##$AXUNIT= <>
##$AZFE= 0.1
##$AZFW= 0.1
##$BCFW= 0
##$BC_mod= 0
##$BYTORDP= 0
##$COROFFS= 0
##$CY= 15
##$DATMOD= 1
##$DC= 0
##$DFILT= <>
##$DTYPP= 0
##$F1P= 0
##$F2P= 0
##$FCOR= 0.5
##$FTSIZE= 131072
##$FT_mod= 6
##$GAMMA= 0
##$GB= 0
##$INTBC= 1
##$INTSCL= 1
##$ISEN= 128
##$LB= 0.3
##$LEV0= 0
##$LPBIN= 0
##$MAXI= 10000
##$MC2= 0
##$MEAN= 0
##$ME_mod= 0
##$MI= 0
##$NCOEF= 0
##$NC_proc= -2
##$NLEV= 6
##$NOISF1= 0
##$NOISF2= 0
##$NSP= 0
##$NTH_PI= 0
##$NZP= 0
##$OFFSET= 14.96151
##$PC= 1
##$PHC0= -84.14978
##$PHC1= 0
##$PH_mod= 1
##$PKNL= yes
##$PPARMOD= 0
##$PPDIAG= 0
##$PPIPTYP= 0
##$PPMPNUM= 2147483647
##$PPRESOL= 1
##$PSCAL= 4
##$PSIGN= 0
##$PYNMP= <proc.py>
##$REVERSE= no
##$SF= 400.020009430863
##$SI= 131072
##$SIGF1= 0
##$SIGF2= 0
##$SINO= 400
##$SIOLD= 131072
##$SPECTYP= <>
##$SREGLST= <1H.CDCl3>
##$SSB= 0
##$STSI= 131072
##$STSR= 0
##$SW_p= 8223.68421052631
##$SYMM= 0
##$S_DEV= 0
##$TDeff= 65536
##$TDoff= 0
##$TI= <>
##$TILT= no
##$TM1= 0
##$TM2= 0
##$TOPLEV= 0
##$USERP1= <user>
##$USERP2= <user>
##$USERP3= <user>
##$USERP4= <user>
##$USERP5= <user>
##$WDW= 1
##$XDIM= 131072
##$YMAX_p= 453463777
##$YMIN_p= -11900
##$CURPLOT= <Network HP LaserJet P1505>
##$CURPRIN= <$Network HP LaserJet P1505>
##$DFORMAT= <normdp>
##$LAYOUT= <+/1D_H.xwp>
##$LFORMAT= <normlp>
##$PFORMAT= <normpl>
##$SURQMSG= 1
$$ End of Bruker specific parameters
$$ ---------------------------------
##NTUPLES= NMR SPECTRUM
##VAR_NAME=  FREQUENCY,     SPECTRUM/REAL,   SPECTRUM/IMAG
##SYMBOL=    X,             R,               I
##VAR_TYPE=  INDEPENDENT,   DEPENDENT,       DEPENDENT
##VAR_FORM=  AFFN,          ASDF,            ASDF
##VAR_DIM=   131072,        131072,          131072
##UNITS=     HZ,            ARBITRARY UNITS, ARBITRARY UNITS
##FACTOR=    0.0627417313425164, 1,          1
##FIRST=     8223.62146879497, 2202,         -63780
##LAST=      0,             3555,            -64038
##MIN=       0,             -11900,          0
##MAX=       8223.62146879497, 453463777,    0
$$ Real data points
##PAGE= N=1
##DATA TABLE= (X++(R..R)), XYDATA
$$ [...]
65076 174689 174566 175478 176735 177622 177966 177980 177875 177856 178251 179279 180746 182220 183513 184739 185927 186839 187333
65059 187333 187648 188113 188625 188677 188007 186990 186226 185855 185568 185256 185234 185673 186175 186223 185826 185295 184559 183200 181158
65040 181158 178931 177010 175540 174564 174099 173739 172670 170429 167383 164223 161367 159124 157964 158047 158739 159161
65024 159161 159105 158911 158604 157736 156145 154308 152833 152021 152053 153098 154968 157067 158972 160796 162712 164418
65008 164418 165517 166253 167451 169680 172769 176158 179460 182545 185277 187394 188664 189137 189184 189207 189302 189297 189223
64991 189223 189562 190823 192944 195422 198064 201248 205200 209322 212633 214848 216602 218523 220433 221679
64977 221679 221914 221239 219750 217353 214028 209975 205508 201054 197235 194578 193001 191865 190658 189332 187886
64962 187886 185988 183433 180698 178596 177389 176633 175931 175433 175393 175494 175004 173585 171739 170295 169482 168688
64946 168688 167219 165183 163378 162300 161604 160718 159657 158925 158779 159075 159771 161092 163030 165049 166552 167394
64930 167394 167725 167558 166894 166137 165966 166704 167998 169214 169956 170158 169912 169446 169127 169219 169587 169808 169654 169346
64912 169346 169281 169579 170076 170651 171434 172677 174603 177434 181410 186655 193027 200156 207566 214780 221498 227805
64896 227805 234092 240537 246725 252011 256305 260306 264838 270083 275522 280376 283929 285615 285211 283092
64882 283092 280072 276786 273246 269113 264255 258908 253361 247792 242416 237548 233357 229779 226882 225166
64868 225166 225169 226727 228818 230245 230384 229330 227529 225358 222861 219747 215743 211006 206079 201418 197105
64853 197105 193103 189553 186660 184405 182566 180931 179426 178219 177786 178585 180316 181770 181898 181027 180541
64838 180541 181227 182385 182814 182288 181632 181549 181900 182158 182144 182101 182292 182831 183819 185415 187681 190458 193468 196491
64820 196491 199434 202289 205135 208232 212032 216972 223177 230346 237987 245759 253565 261332 268786 275433
64806 275433 280666 283851 284529 282799 279437 275372 270935 265853 260012 253942 248289 243116 238082 233196
64792 233196 228971 225836 223769 222502 221721 220959 219762 218267 217297 217560 218874 220372 221238 221096 220031 218695
64776 218695 218193 219364 222090 225579 229268 233195 237635 242802 248877 255857 263234 270206 276424 282296
64762 282296 288420 294922 301482 307696 313289 318254 323022 328227 333987 339551 343893 346519 347441 346600 343779
64747 343779 339103 333178 326484 318846 309819 299570 289118 279607 271444 264245 257586 251653 247067 244204
64733 244204 242818 242316 242295 242732 243725 245086 246232 246633 246420 246387 247230 248932 251142 253961 257920 263128 268928
64716 268928 274556 279755 284518 288611 291783 294160 295938 296757 295877 293047 288829 283902 278411 272208 265511
64701 265511 259056 253558 249100 245047 240566 235376 230002 225252 221471 218469 216086 214518 213978 214316 215200
64686 215200 216470 218100 219954 221913 224259 227657 232585 238883 245909 253105 260403 268212 276975 286595
64672 286595 296170 304475 310769 315014 317209 316827 313321 307103 299554 291896 284395 276879 269661 263470
64658 263470 258624 254771 251486 248780 246862 245799 245519 245894 246610 247292 247999 249372 251990 255756 260219
64643 260219 265300 271380 278755 287364 297012 307458 318268 328864 338815 347829 355475 361299 365316
64630 365316 368048 369867 370582 369814 367519 363860 358851 352437 344821 336417 327595 318709 310267 302764 296358
64615 296358 290961 286624 283592 281980 281628 282272 283604 285097 286089 286243 285822 285386 285263 285366 285340 284813 283590
64598 283590 281756 279559 277217 274919 273007 271926 271823 272303 272743 272871 272972 273560 274943 277057 279668 282666
64582 282666 286155 290235 294749 299291 303419 306775 309082 310255 310515 310199 309393 307908 305627 302673 299110
64567 299110 294775 289590 283803 277713 271409 265090 259422 255062 251784 248526 244498 240033 236196 233790
64553 233790 232835 232771 232907 232738 232068 230944 229578 228372 227899 228516 229932 231382 232349 232976 233687 234639 235702
64536 235702 236728 237589 238104 238188 237984 237575 236642 234693 231757 228639 226399 225553 225768 226254 226496 226620 227043
64519 227043 227803 228518 229070 229978 231747 234124 236442 238620 241276 244763 248648 252422 256284 260795 266039
64504 266039 271688 277808 284997 293452 302268 310023 316018 320602 324292 326866 327584 326135 322990 318760
64490 318760 313520 307065 299676 292332 286196 282117 280479 280986 282508 283613 283686 283342 283404 283659 282985 280590
64474 280590 276764 272426 268330 264818 261936 259552 257492 255772 254637 254293 254697 255686 257180 259173 261625
64459 261625 264469 267557 270485 272644 273650 273681 273196 272393 271149 269478 267795 266590 265991 265807 265953 266666
64443 266666 268260 270712 273600 276505 279466 282970 287471 293023 299422 306595 314678 323714 333554 344210
64429 344210 356172 370104 386177 403923 423019 444192 469151 499547 536182 579404 630000
64418 630000 689299 758309 837111 925124 1021337 1123676 1228337 1330512 1426220 1513449 1591744
64407 1591744 1661173 1721677 1772559 1811922 1836888 1845035 1835823 1810470 1770697 1718000 1653781 1579299
64395 1579299 1495225 1401954 1300947 1195550 1090063 988198 892664 805659 728807 662381
64385 662381 605229 555952 513917 478874 449933 425539 404478 386463 371515 359128 348419
64374 348419 338979 331119 325130 320558 316415 311931 306895 301328 295167 288419 281483 275111 269958 266083
64360 266083 262931 259880 256876 254401 252799 251960 251876 253159 256431 261282 266420 270998 275247 279650 284064
64345 284064 288080 291658 294745 296523 295826 292375 287190 281759 277141 273689 271035 268297 264900 261438
64331 261438 259275 259142 260478 262292 264168 266220 268619 271600 275488 280111 284419 287256 288457 288758 288723
64316 288723 288265 287285 286219 285637 285582 285589 285193 284179 282341 279272 274647 268695 262278 256308 251078 246271
64300 246271 241578 237065 232980 229523 226956 225568 225223 225190 224803 224175 223974 224606 225939 227711 229799 232152
64284 232152 234826 238106 242237 246996 251910 256926 262403 268348 274163 279483 284845 291035 297942 304470
64270 304470 309563 313003 315202 316555 317157 317029 316422 315821 315589 315673 315801 315960 316475 317498 318569 318849 317709
64253 317709 314973 310753 305196 298419 290646 282467 274836 268523 263434 258760 253943 249251 245231 241966
64239 241966 239199 236920 235286 234131 233069 232134 231828 232410 233585 235074 237066 239702 242422 244315 245104
64224 245104 245469 246264 247647 249094 250160 251000 252003 253033 253380 252654 251516 251070 251633 252484 252949 253190 253648
64207 253648 254200 254438 254577 255386 257088 258888 259859 259999 260078 260690 261832 263264 264895 266743 268921 271874
64191 271874 276365 282881 291104 300246 309948 320579 332464 345010 356811 366499 373309 376955 377393
64178 377393 374824 369644 362165 352545 341159 328916 316935 305936 296069 287220 279263 272057 265460
64165 265460 259418 253919 248842 244060 239712 236213 233851 232509 231855 231688 231983 232748 234030 235967 238645
64150 238645 241910 245511 249414 253743 258300 262385 265323 267085 268195 269086 269741 269947 269593 268693 267428
64135 267428 266278 265819 266063 266284 265835 264940 264268 263915 263409 262693 262432 263076 264291 265768 268035 271783 276687
64118 276687 281671 286296 291206 297117 304014 311522 319461 327615 335404 342333 348586 354663 360451 365061
64104 365061 367745 368761 369200 370103 371935 374783 378720 383741 389465 395269 400748 405707 409632 411701 411717
64089 411717 410623 409482 408170 405785 402239 398594 395668 393099 390122 386586 382659 378144 372778 366856
64075 366856 360950 355249 349739 344765 340772 337614 334720 331865 329239 326869 324596 322632 321462 321054
64061 321054 320762 320194 319673 319646 320149 321106 322628 324649 326675 328328 329941 332309 336056 341392 348161 355831
64045 355831 363741 371758 380539 390881 402909 416119 429963 444081 458146 471815 484765 496548
64033 496548 506567 514404 520030 523445 524372 522635 518705 513526 507870 502133 496613 491574 487044 482834
64019 482834 478704 474281 469011 462581 455295 447645 439703 431419 423323 416145 409676 402828 395170 387696
64005 387696 381595 376863 372715 368876 365720 363445 361884 361049 361118 361872 362832 364087 366366 370018 374455
63990 374455 378878 383098 387336 391655 396024 400634 405774 411587 418244 426028 434859 443976 452590 460709
63976 460709 468963 477758 487119 497182 508225 520139 532481 545280 559299 575152 592490 610410
63964 610410 628481 647122 667163 689318 713987 741280 771187 803779 839287 878125 921077
63953 921077 969415 1024500 1087217 1158050 1237751 1327587 1428916 1542949 1671116 1815222 1977018
63942 1977018 2157882 2358890 2580409 2821114 3077991 3347854 3628477 3917631 4211401
63933 4211401 4504074 4789217 5060093 5309398 5529887 5715751 5863010 5968738 6030685 6047667
63923 6047667 6019517 5946480 5829499 5671326 5476607 5250615 4998663 4727043 4443392 4155094
63913 4155094 3867591 3584705 3309973 3046815 2797745 2564325 2347902 2149841 1971047
63904 1971047 1811687 1671208 1548206 1440479 1345901 1263301 1192089 1131139 1078551 1032559
63894 1032559 992125 956522 924826 896054 869534 844871 821690 799546 778100 757346 737699
63883 737699 719713 703639 689354 676780 666089 657358 650355 644984 641656 640885 642693 646775 653098
63870 653098 661989 673741 688426 705854 725443 746424 768644 792936 820088 849641 880293 911341
63858 911341 943045 975542 1008084 1039527 1068965 1095686 1119103 1139076 1155881 1169522 1179348 1184572
63846 1184572 1184858 1180302 1171216 1158146 1141698 1122014 1098713 1071570 1041011 1007733 972168 934575
63834 934575 895446 855542 815689 776674 739121 703321 669412 637773 608822 582311 557305
63823 557305 533269 510782 490766 473281 457547 442961 429631 417934 407960 399422 391824 384716
63811 384716 377973 371791 366280 361165 356064 350934 345978 341244 336590 332017 327710 323723 319822 315723
63797 315723 311399 307158 303445 300477 297977 295359 292320 289125 286202 283522 280563 276924 272921 269559
63783 269559 267758 267475 267622 267162 266178 265563 265694 265935 265595 264760 263875 263016 262109 261463 261415 261627 261351 260358 259094
63764 259094 257902 256647 255188 253766 252714 252098 251777 251592 251433 251371 251739 252777 254130 255039 255114 254687 254314
63747 254314 254222 254372 254711 255162 255665 256482 258217 261126 264501 267116 268451 269286 270911 273809 277229 280006
63731 280006 281657 282561 283305 284186 285400 287298 290122 293600 297149 300489 303875 307693 311982 316413 320565
63716 320565 324169 327163 329536 331194 332071 332328 332219 331699 330448 328424 326076 323787 321446 318945 316728
63701 316728 315344 314684 314222 313939 314339 315567 317213 319175 322021 326096 330769 335065 338743 342265 345831
63686 345831 348902 350719 351074 350532 349919 349503 348697 346801 344064 341683 340613 340717 341219 341612 341815 341795 341518
63669 341518 341164 341011 341107 341268 341353 341372 341437 341812 342801 344302 345566 345676 344211 341385 337741 333986 330808 328380
63651 328380 326103 323235 319774 316392 313540 311037 308590 306302 304458 303159 302427 302423 303280 304790 306514
63636 306514 308198 309963 312017 314337 316766 319426 322866 327534 333151 338946 344645 350899 358405 366878
63622 366878 375379 383575 392191 402192 413941 427322 442247 458723 476691 496112 517090 539706
63610 539706 563801 589118 615571 643201 671856 700880 729092 755067 777587 795864 809290
63599 809290 817244 819544 817043 811311 803552 794238 783956 773954 765286 757665 749710 740187 728505
63586 728505 714230 696944 676876 655106 632744 610224 587761 566168 546715 530185 516437
63575 516437 504957 495536 488284 483221 480127 478777 479113 481040 484103 487601 491197 495296 500516 506720
63561 506720 512839 517961 522456 527773 535066 544297 554765 566243 579352 594935 613471 635161 660230
63548 660230 688797 720542 754819 791103 828909 866906 902262 931253 950844 959865 959047 950340
63536 950340 936249 919346 901819 885172 870239 857364 846465 837032 828202 818899 807927 794171
63524 794171 776997 756546 733510 708629 682472 655587 628567 601875 575869 551102 528330
63513 528330 507990 489874 473595 459156 446675 435690 425320 415228 405949 397992 391075 384636
63501 384636 378772 374131 370972 368820 367077 365519 364118 362781 361455 360218 359099 358023 357054 356444 356329
63486 356329 356583 357104 357936 358973 359879 360624 361810 364086 367322 370740 373784 376605 379703 383320 387190
63471 387190 390690 393236 394664 395154 394746 393192 390463 387044 383338 379091 373936 368346 363424 359720 356895
63456 356895 354638 353279 353229 354344 356245 358826 362021 365446 368782 372355 376865 382658 389573 397433 406271
63441 406271 416116 426971 439081 452984 469169 487820 509027 533130 560615 591275 623231 653068
63429 653068 677603 695789 708702 717677 723160 725621 726830 729410 735317 745380 760041 779674 804084
63416 804084 832363 863392 896001 928570 959118 986068 1008421 1025037 1034475 1036181 1031441 1022539
63404 1022539 1011148 997996 983791 969615 956103 942817 928813 913566 896907 878244 856483
63393 856483 831003 802472 772402 742107 712353 683812 657198 632788 610295 589566 571036
63382 571036 555108 541466 529571 519617 512404 508225 506419 506055 506565 507698 509483 512487 517604 525215
63368 525215 534830 545788 557973 571617 586792 603412 621496 641156 662567 686166 712574 741953
63356 741953 773662 806743 840405 873719 905217 933293 956865 975273 987819 994055 994489 990497
63344 990497 983421 974136 963433 952215 941010 929625 917531 904326 889596 872631 852708 829648
63332 829648 803921 776244 747313 717959 689288 662434 638192 616975 599102 584848 574138
63321 574138 566521 561782 560276 561992 565035 565658 560478 548750 532344 513786 494735 476087 458666
63308 458666 443236 429958 418309 407743 398357 390745 385159 380989 377296 373754 370748 368525 366658
63295 366658 364589 362349 360340 358635 356947 355221 353731 352494 350952 348519 345300 342117 339855 338801
63281 338801 338513 338291 337835 337454 337596 338261 338911 338895 337890 336140 334405 333487 333596 334287 335234 336780 339367
63264 339367 342606 345486 347568 349452 351840 354591 357057 359026 360878 362916 365027 367088 369284 371832
63250 371832 374629 377488 380570 384225 388456 392943 397697 403271 409994 417299 424292 430834 437626 445255
63236 445255 453735 463070 473707 486152 500471 516392 533583 551702 570543 590295 611201 632772
63224 632772 653907 674084 693819 713492 732439 749943 766661 784144 803135 823131 843454
63213 843454 863821 883832 902748 920083 935855 950027 962175 971747 978133 980448 977818 970038
63201 970038 957502 940551 919622 896045 871818 848216 825236 802728 781360 762099 745365
63190 745365 731250 720059 712156 707632 706527 708876 714122 721101 729196 739102 751845 767452 785214
63177 785214 804849 826467 849553 872954 896098 919472 943526 967583 990306 1011067 1030490
63166 1030490 1049551 1068308 1085690 1100605 1112988 1123294 1131034 1134504 1132281 1124444 1111804 1094471
63154 1094471 1071938 1044375 1013031 979299 944038 907922 871877 836861 803572 772535 744130
63143 744130 718375 695018 674024 655659 639927 626231 613873 602743 593260 585686 579642 574303
63131 574303 569015 563787 559235 556082 554763 555442 558065 562135 566660 570758 574367 578149 582714 588103
63117 588103 593908 599522 604307 607949 610805 613665 617009 620666 624179 627218 629615 631308 632469 633437
63103 633437 634354 635041 635312 635198 634689 633600 631952 630259 629076 628343 627529 626426 625456 625080 625186 625321 625361
63086 625361 625675 626607 628034 629542 630866 631960 632760 633136 633213 633548 634870 637605 641599 646173 650513 654297
63070 654297 658032 662547 668029 673811 679338 685024 691809 700077 709492 719830 731396 744436 758708
63057 758708 774023 790930 810376 832700 857369 883801 912212 943488 978350 1016747 1058000
63046 1058000 1101329 1146208 1192331 1239398 1286986 1334591 1381738 1428082 1473498 1518071 1561894
63035 1561894 1604798 1646307 1686009 1724075 1761375 1798916 1836973 1874642 1910157 1941655 1967748
63024 1967748 1987575 2000449 2005449 2001431 1987558 1963882 1931271 1890808 1843489 1790663 1734400 1677062
63012 1677062 1620530 1566002 1514381 1466523 1423255 1385467 1354046 1329300 1310612 1297248 1289556
63001 1289556 1288770 1295426 1308549 1326693 1349241 1376206 1407185 1441162 1477207 1514872 1553910 1594012
62989 1594012 1634827 1675947 1716815 1756894 1795947 1834017 1871089 1906773 1940143 1969752 1994055
62978 1994055 2011987 2023003 2026479 2021348 2006568 1981735 1947093 1903303 1851543 1793550 1731154 1665809
62966 1665809 1598756 1531394 1465139 1401098 1340080 1282622 1228659 1177547 1128869 1082998 1040476
62955 1040476 1001206 964791 931319 901022 873329 847041 821519 797016 773869 752167 732318
62944 732318 714988 699990 685910 671441 656687 642686 630073 618784 608725 600015 592529 585738
62932 585738 579202 572998 567543 563069 559305 555703 552050 548792 546540 545278 544317 543115 541809 540815 540228
62917 540228 539855 539557 539167 538193 536000 532437 528142 524141 521106 518887 516701 513871 510488 507320 505048
62902 505048 503678 502731 501833 501015 500481 500244 500075 499865 499905 500571 501690 502575 502937 503436 504846 506879 508388
62885 508388 508771 508611 508745 509223 509537 509458 509244 509177 509279 509422 509449 509199 508552 507474 505964 504081 502075 500303
62867 500303 498853 497379 495488 493216 490969 489077 487582 486458 485824 485791 486106 486210 485816 485370 485661 486932
62851 486932 488655 490247 491616 492801 493527 493546 493085 492470 491533 489935 487910 486073 484639 483439 482637 482645 483236
62834 483236 483552 483256 482969 483208 483557 483412 482961 482839 483205 483752 484372 485243 486349 487400 488216 488920 489865 491543
62816 491543 494325 497990 501753 505079 508260 511897 516129 520697 525491 530508 535441 539808 543582 547309
62802 547309 551584 556637 562348 568373 574290 579908 585443 591253 597480 604171 611623 620333 630627 642567
62788 642567 656200 671735 689529 710089 733919 761180 791594 824916 861423 901742 946329
62777 946329 995299 1048627 1106156 1167452 1231915 1299082 1368645 1440092 1512353 1583724 1652102
62766 1652102 1715409 1771887 1820005 1858265 1885440 1900985 1904764 1896319 1874988 1841038 1796203 1742674
62754 1742674 1682001 1615488 1545192 1473631 1402516 1332391 1263608 1197040 1133719 1074270 1019015
62743 1019015 968229 921935 879658 840706 804771 772149 743393 718749 697882 680134 664958
62732 664958 651967 640602 630121 620091 610723 602508 595703 590305 586271 583484 581698 580771 580782 581703
62718 581703 583209 585110 587732 591573 596837 603688 612597 623828 636724 650142 663705 678257 695033
62705 695033 714772 737627 763510 792428 824754 861148 901899 946457 994048 1044743 1099527
62694 1099527 1159332 1224462 1294899 1370438 1450170 1532256 1614573 1695302 1772677 1844452 1908005
62683 1908005 1960937 2001484 2028561 2041557 2040013 2023454 1991779 1945929 1888028 1820802 1746916
62672 1746916 1668718 1588214 1507066 1426725 1348564 1273714 1202799 1136066 1073774 1016196 963258
62661 963258 914608 870173 830340 795376 764855 737760 713066 690220 669280 650563 633996
62650 633996 618874 604469 590723 577954 566040 554518 543619 534453 527776 522955 518571 513789
62638 513789 508806 504269 500712 498331 496762 495075 492420 488862 485320 482578 480547 478546 476077 473156
62624 473156 470041 467013 464482 463007 462857 463638 464676 465798 467351 469324 470989 471852 472588 474429 477697
62609 477697 481519 484899 487516 489483 491054 492900 496095 501328 508333 516400 525262 535323 547304 561851
62595 561851 579146 598623 619439 641606 666361 694912 726947 760838 795238 829987 865344
62584 865344 900740 934589 965140 991257 1012465 1028485 1038898 1043231 1041204 1032850 1018451 998525
62572 998525 973911 945784 915469 884108 852330 820228 787840 755776 725129 696586 669917
62561 669917 644696 621331 600812 583461 568515 555067 542940 532361 523238 515204 508151 502244
62549 502244 497427 493270 489397 485910 483277 481785 481066 480294 478967 477471 476637 476776 477412 478003 478556 479344
62533 479344 480304 480990 481054 480662 480495 481372 483727 487440 492292 498467 506315 515724 526204 537648 550577
62518 550577 565514 582614 602063 624282 649319 676563 705628 737205 772467 811774 854509
62507 854509 900029 948100 998221 1049039 1098759 1145873 1189290 1227975 1260790 1286733 1305286
62496 1305286 1316543 1321117 1319917 1314010 1304617 1293096 1280784 1268872 1258422 1250477 1246047 1245936 1250483
62483 1250483 1259432 1272135 1287927 1306108 1325283 1342914 1355991 1362476 1362066 1355650 1344198 1327980
62471 1327980 1306302 1277833 1241586 1197968 1148891 1096857 1044027 991886 941137 891756 843704
62460 843704 797920 756223 719873 688585 661232 637124 616181 598344 583430 571427 562264 555360
62448 555360 549886 545517 542448 540659 539664 539186 539664 541771 545621 550642 556132 561767 567649 573912 580297
62433 580297 586109 590627 593520 594816 594574 592702 589049 583606 576624 568545 559739 550317 540377 530389
62419 530389 521042 512616 504802 497325 490449 484617 479810 475528 471267 466831 462417 458615 456106 455000
62405 455000 454647 454326 453921 453641 453455 453290 453608 455131 457897 461097 463940 466313 468435 470375 472207 474340
62389 474340 477279 481139 485705 490921 497007 503925 511036 517594 523599 529805 536742 544093 551355 558792
62375 558792 567110 576283 585421 593947 602196 610549 618675 626286 634134 643483 654815 667760 682199
62362 682199 698723 718002 740370 766201 796044 830089 867895 908974 953372 1001321 1052387
62351 1052387 1105090 1157320 1207100 1253093 1294460 1330283 1359304 1380359 1392923 1397126 1393532 1383299
62339 1383299 1368226 1349994 1329048 1304532 1275521 1242267 1206336 1169736 1133898 1099264 1065750
62328 1065750 1033562 1003347 975470 949570 925111 902046 880472 859928 839617 819164 798654
62317 798654 778008 756995 735873 715439 696301 678574 662350 647924 635380 624411 614711 606134
62305 606134 598424 591339 585236 580957 578907 578708 580057 583339 588923 596307 604506 613053 622131 631924
62291 631924 642307 653156 664547 676551 688954 701135 712190 721414 728842 735137 740794 745595
62279 745595 748967 750620 750633 749169 746375 742480 737847 733013 728664 725310 722915 721157 720172 720687 723348
62264 723348 728351 735940 746699 760978 778538 799255 823790 852947 886725 924662 966835 1013662
62252 1013662 1064730 1118534 1173478 1228329 1281419 1330171 1372040 1405662 1430751 1447307 1455450
62241 1455450 1455759 1449100 1435989 1416453 1390541 1358665 1321373 1279131 1232581 1182904 1131812 1081174
62229 1081174 1032599 987131 945205 906959 872642 842574 816600 793814 773198 754534 738443
62218 738443 725410 715049 706408 698672 691303 683821 676010 668338 661690 656490 652376 648921 646325 645050
62204 645050 645016 645538 646068 646650 647580 648932 650593 652616 655332 659073 663886 669511 675584 681878 688415 695396
62188 695396 702972 711046 719318 727599 736013 744796 753937 763149 772186 780964 789329 796943 803588 809389
62174 809389 814517 818869 822328 825327 828911 834378 843035 856080 874168 896992 923674 953699 987180
62161 987180 1024100 1063617 1104301 1144672 1183260 1218444 1248649 1272727 1290007 1300219 1303604 1300965
62149 1300965 1293315 1281463 1265972 1247225 1225243 1199693 1170493 1138450 1105001 1071383 1038385
62138 1038385 1006817 977681 951659 928790 908888 891960 877939 866284 856260 847441 839536 831876
62126 831876 823697 815085 807065 800353 794446 788458 782597 778152 776016 775844 776870 779000 782701 788226
62112 788226 795409 803973 813501 823021 831044 836135 837446 834943 829486 822688 816217 810973 806976 803904
62098 803904 801458 799246 796681 793192 788421 782262 775039 767732 761680 757757 755932 755777 757202 760468
62084 760468 765590 772053 779243 786954 795368 804632 814738 825872 838599 853376 869905 887373 905412
62071 905412 924491 945201 967429 990409 1013258 1035287 1056262 1076827 1098339 1121726 1146585
62060 1146585 1171783 1196572 1220470 1242376 1260710 1274516 1283688 1288017 1286976 1280812 1271007 1258920
62048 1258920 1244429 1226532 1204939 1180393 1153633 1124646 1093037 1058734 1022345 985078 948281
62037 948281 912769 878546 845243 812779 781543 752148 725124 700638 678402 658046 639693
62026 639693 623886 610834 600054 590920 583212 576873 571624 567168 563431 560202 556817 552668 547889
62013 547889 543142 538865 535063 531668 528629 525802 523199 521342 520937 522151 524518 527516 530902 534494
61999 534494 538049 541499 545035 548839 552837 556706 559944 562017 562712 562338 561355 559861 557655 554646 550836
61984 550836 545954 539571 531658 522747 513447 504200 495560 488223 482435 477590 472789 467704 462707 458317
61970 458317 454828 452386 451000 450280 449375 447494 444588 441443 439072 438033 438226 439087 439843 439787 438678 436994
61954 436994 435635 435286 436122 438020 440776 444098 447768 451968 457172 463555 470794 478757 488049 499411
61940 499411 512712 526975 541475 556438 572602 590396 609660 629840 650256 670352 689860
61929 689860 708616 726150 741706 754879 766019 775693 783840 789824 793333 794779 794553 792317 787529
61916 787529 780525 772535 764640 757321 751177 747321 746559 748690 753241 760397 770363 782098 793783 804666
61902 804666 815506 826881 837896 846955 853016 855570 854169 848887 840776 831037 819911 807088 792904
61889 792904 778319 763800 749114 734400 720608 708507 697800 687667 677826 668505 659627 650624
61877 650624 641207 631856 623204 615088 606754 598124 590415 585017 581986 580176 578770 578011 578324 579475 581064
61862 581064 583335 586929 592125 598857 607196 617310 629038 642040 656358 672516 691062 712200
61850 712200 735717 761030 787412 814432 842042 870173 898505 926715 954465 980842 1004350
61839 1004350 1023871 1039217 1050283 1056298 1056683 1052275 1044845 1035597 1024898 1013360 1002361 993361 987297
61826 987297 984613 985325 989091 995720 1005442 1018004 1031699 1044087 1053663 1060066 1062842 1061075 1054402 1043308
61812 1043308 1028075 1008359 984358 957562 929743 901824 874265 847851 823363 800863 780008
61801 780008 760802 743463 727784 713147 699148 685870 673713 663170 654494 647303 640786 634560
61789 634560 629017 624534 620748 616969 612998 609113 605509 602140 598961 595997 593346 591298 590120 589473
61775 589473 588414 586400 583930 581772 579907 577809 575490 573619 572613 572212 572010 572011 572557 574028 576576 579847
61759 579847 583007 585409 587247 589264 591829 594662 597407 599995 602253 603595 603389 601506 598300 594197
61745 594197 589515 584594 579851 575584 571802 568362 565248 562653 560667 559015 557297 555547 554356 554298 555281
61730 555281 556522 557090 556496 554998 553548 553258 554510 556504 557875 558034 557826 558694 561137 564237 566815 568721
61714 568721 570559 572363 573284 572762 571287 569525 567300 564142 560421 557019 554011 550522 546028 541019 536185
61699 536185 531666 527412 523613 520293 516936 512956 508315 503402 498610 494221 490369 486909 483598 480519
61685 480519 477912 475485 472473 468643 464722 461492 458977 456835 455035 453653 452446 451140 449830 448695
61671 448695 447681 446802 446304 446101 445578 444503 443628 443744 444549 445174 445485 446005 446770 447155 446849 446263 445888 445907
61653 445907 446476 447707 449227 450319 450742 451045 451971 453918 456931 460727 464685 468202 471133 473557 475316
61638 475316 476285 476918 477776 478548 478323 476952 475291 473861 472087 469390 466235 463388 460659 457220 453011
61623 453011 449047 446300 444829 444110 443768 443747 443958 444000 443296 441571 439239 437172 435983 435591 435469 435061 433851
61606 433851 431389 427628 423105 418439 413703 408599 403238 398387 394740 392169 389946 387648 385581 384231
61592 384231 383419 382274 380155 377468 375343 374458 374333 373906 372679 371119 369992 369518 369275 368767 367896 366914
61576 366914 366144 365840 366096 366664 366963 366527 365462 364314 363489 363045 362965 363276 363788 364104 364170 364542 365739 367493
61558 367493 369036 370089 371202 372975 375239 377212 378351 378860 379380 380337 381672 383111 384524 385940 387362
61543 387362 388744 390056 391217 392039 392451 392708 393153 393866 394860 396471 399065 402343 405463 408014 410376 412884
61527 412884 415192 416802 417728 418145 417806 416386 414157 411773 409514 407208 404796 402492 400450 398702 397332
61512 397332 396340 395446 394451 393647 393408 393500 393355 393000 393105 393971 394989 395327 394764 393623 392235 390775 389433
61495 389433 388514 388349 389115 390595 392176 393258 393691 393733 393736 394065 395078 396822 398854 400687 402310 403957 405554
61478 405554 406856 408030 409575 411624 413755 415584 417042 418039 418290 417727 416730 415835 415456 415889 417124 418501
61462 418501 419012 418213 416622 415080 414023 413517 413648 414532 416079 417947 419629 420595 420574 419767 418610 417326
61446 417326 415925 414626 413901 414044 414943 416336 417990 419644 421124 422602 424383 426430 428461 430589 433342
61431 433342 436871 440566 443706 446168 448258 450179 451932 453485 454775 455740 456553 457574 458899 460189 461153
61416 461153 461956 462948 464146 465179 465593 465117 463828 462149 460545 459191 458074 457299 456944 456730 456267 455645
61400 455645 455256 455055 454552 453670 452905 452396 451562 450125 448906 448932 450117 451433 452159 452392 452484 452565 452669 452911
61382 452911 453449 454374 455608 456825 457725 458523 459872 462117 464932 467885 470980 474322 477686 480832 483934
61367 483934 487230 490518 493440 496057 498689 501439 504305 507557 511470 515748 519706 522986 525859 528967
61353 528967 533029 538554 545409 552913 560724 569325 579177 589723 599892 609258 617956 625575 631092 634095
61339 634095 635373 635984 636286 636110 635378 634182 632530 630214 626757 621582 614663 606999 599860 593526 587327
61324 587327 581042 575531 571628 569049 566917 564961 563642 563353 564056 565574 567835 570782 574342 578524 583475
61309 583475 589527 597213 606951 618607 631623 645692 660981 677474 694412 710652 725279 737636
61297 737636 747174 753735 757758 759716 759519 756823 751769 744968 736906 727857 718338 709082 700447 692287
61283 692287 684487 677188 670320 663385 656055 648771 642442 637684 634597 633186 633676 636274 640647 645748
61269 645748 650422 654326 658089 662322 666731 670657 674353 679009 685374 692970 701028 709603 719267 730107
61255 730107 741656 753444 764863 774567 780798 782607 780468 775647 769282 761946 753658 744276 734291
61242 734291 725035 717529 711241 704803 697950 691870 687385 683883 680565 677777 676212 675531 674821 673981 673608
61227 673608 673867 674576 676303 680163 686311 693565 700767 707650 714122 719669 724110 728296 733418 739903 747354
61212 747354 755114 762491 768901 774249 778967 783369 787291 790650 793925 797691 801981 806561 811646 817980
61198 817980 826337 837105 850112 864729 880505 897815 917382 938899 960703 981134 999573 1015677
61186 1015677 1028437 1036981 1041901 1044732 1046220 1045954 1043576 1039427 1033840 1026685 1017931 1007956 996980 984718
61172 984718 970929 955777 939404 921748 903223 885029 868135 852122 835682 818223 800511
61161 800511 783664 767967 752975 738503 725087 713403 703548 695200 688324 683388 680810 680498 682117
61148 682117 685449 690236 695909 701785 707307 711817 714306 713900 710587 705149 698443 691044 683484 676422
61134 676422 670542 666567 665227 666796 670654 675799 681892 689449 698965 710290 723081 737404 753597
61121 753597 771680 791208 811663 832952 855496 879727 905343 931271 956642 981614 1006887
61110 1006887 1032563 1057942 1082316 1105302 1126374 1144783 1160286 1173444 1184798 1194105 1200639 1203939
61098 1203939 1203927 1200514 1193447 1182434 1167289 1148146 1125699 1101090 1075514 1050095 1025874 1003348
61086 1003348 981949 960635 939306 919142 901368 886244 873560 863326 855391 848982 843481 839314
61074 839314 837342 837588 839346 842324 846864 853034 860359 868657 878440 890128 903355 917335 931620
61061 931620 946256 961605 978261 996850 1017574 1040050 1063744 1088495 1114620 1142695 1173185
61050 1173185 1206017 1240530 1276173 1313250 1352559 1394283 1437667 1481949 1527083 1573187 1619700
61039 1619700 1665598 1710328 1754129 1797376 1839885 1880901 1919635 1955729 1989283 2020522 2049549
61028 2049549 2076445 2101449 2124828 2146710 2167292 2187182 2207246 2228129 2250143 2273512 2298395
61017 2298395 2324800 2353016 2384207 2420205 2462825 2513905 2575834 2651064 2740762 2844712 2962959
61006 2962959 3097125 3250327 3427333 3635709 3886106 4191157 4565738 5029481 5607355
60997 5607355 6325808 7208925 8278893 9556586 11057014 12784566 14733643 16882461
60989 16882461 19161797 21414270 23399148 24877015 25728616 26013190 25921960 25678925 25469940
60980 25469940 25417411 25557670 25802667 25933526 25676081 24830712 23365354 21409788 19175244
60971 19175244 16869958 14654606 12632853 10856164 9334412 8051562 6981005 6093928
60963 6093928 5361669 4757291 4257581 3843323 3498083 3207944 2962059 2752059 2570611
60954 2570611 2411276 2269584 2143181 2030635 1930603 1841909 1763452 1693820 1631533 1575575
60944 1575575 1524919 1477663 1431504 1385217 1338925 1292883 1246941 1201383 1157307 1115654 1076579
60933 1076579 1040129 1006804 976933 950125 925923 904446 885842 869580 854894 841577 829690
60922 829690 818783 808056 797256 787001 778198 771375 766399 762583 759193 756010 753235 750879 748649
60909 748649 746535 744915 743850 742823 741563 740595 740421 740550 739862 737645 733884 728921 723282 717469 711368
60894 711368 704155 695298 685353 675282 665355 655291 645128 635228 625660 616302 607442 599551 592567
60881 592567 586028 579864 574340 569276 564054 558517 553183 548440 544150 540212 536885 534229 531783 529155
60867 529155 526585 524623 523516 523149 523330 523959 525087 526915 529545 532776 536409 540701 546080 552387 558835
60852 558835 564871 570603 576206 581306 585339 588335 590975 593965 597479 601175 604593 607485 609746 611057
60838 611057 610785 608386 603816 597472 589989 582223 575010 568573 562372 555987 549875 544747 540419 535976
60824 535976 531054 526315 522517 519666 517235 514718 511753 508147 504017 499602 494854 489559 483902 478410
60810 478410 473202 467830 462113 456590 451785 447451 442985 438381 434301 431331 429448 428178 427050 425950
60796 425950 425176 425101 425742 426732 427705 428555 429306 429966 430517 430898 431074 431342 432409 434770 438047 441383 444489
60779 444489 447817 451544 454929 457004 457634 457580 457720 458379 459305 460123 460812 461664 462680 463262 462856 461681 460388
60762 460388 459182 457892 456753 456276 456242 455663 454136 452523 451827 451964 452144 451909 451188 449826 447873 446086
60746 446086 445377 445725 446264 446494 446801 447520 447986 446971 443923 439403 434281 428851 422976 416905 411467 407310
60730 407310 404297 401870 399760 398022 396723 395964 395889 396208 396056 395018 394022 394395 396128 398005 399445 401166
60714 401166 403740 406532 408709 410470 412528 414969 417423 419935 422909 426401 430095 433821 437564 441101
60700 441101 444104 446491 448335 449559 450050 449927 449441 448801 448290 448182 448295 448033 447160 446145 445352 444385 442750
60683 442750 440804 439431 438991 439132 439484 440051 441067 442865 445711 449354 452979 455966 458453 460718 462442
60668 462442 463131 462933 462303 461098 458764 455330 451515 447815 444218 440838 438123 436204 434700 433432 432782
60653 432782 432953 433371 433292 432743 432445 432970 434361 436549 439600 443286 446607 448246 447673 445608 443124 440497
60637 440497 437325 433608 430102 427480 425698 424490 423968 424326 425337 426574 427848 429073 430014 430554 430972
60622 430972 431560 432289 433201 434693 436831 438769 439558 439389 439355 440002 440762 440851 440149 439065 438011 437227 436778 436589
60604 436589 436620 436941 437417 437518 436844 435711 434846 434563 434657 434996 435728 436875 438189 439531 441116 443247 446029
60587 446029 449269 452448 454949 456562 457661 458670 459557 460172 460756 461646 462721 463665 464653 466210 468483 471174
60571 471174 474149 477617 481762 486703 492808 500466 509537 519483 530090 541639 554383 568335 583383
60558 583383 598986 613716 625887 634828 641020 644871 646009 644065 639461 632997 625208 616646 608434
60545 608434 601943 597925 596239 596301 597602 599958 603554 608763 615861 624983 636317 650195 666935 686776
60531 686776 709851 735957 764299 793667 822867 850698 875596 895708 909575 916646 917202 912032
60519 912032 902211 888878 873071 855807 838155 821018 804939 790391 778074 768482 761226 755302
60507 755302 750192 746428 744936 746038 749233 753842 759815 767959 779360 794653 814069 838145 867856
60494 867856 903751 945383 992006 1043385 1099404 1159139 1220895 1282791 1342756 1398251 1446884
60483 1446884 1487415 1519757 1544183 1560951 1570290 1571894 1564498 1546705 1518238 1479796 1432020 1375513
60471 1375513 1311880 1243841 1174221 1105436 1039754 978914 923300 872426 826479 786439 752469
60460 752469 723221 697260 674300 654452 637114 621352 606882 593976 582795 573257 565257 558584
60448 558584 552885 547910 543467 539104 534472 530064 526841 524849 523029 520723 518537 517170 516184 514650
60434 514650 512387 509904 507623 505806 504828 504819 505327 505809 506153 506364 506218 505685 505194 504983 504622 503703 502509 501558
60416 501558 501029 501095 502146 504002 505531 505898 505699 506126 507459 509187 511092 513197 515002 515851 515983 516313
60400 516313 517213 518341 519574 521206 523201 525096 526782 528641 530778 532874 534978 537703 541388 545597
60386 545597 549680 553317 556349 558588 560099 561286 562585 564368 567090 570963 575421 579505 582923 586203
60372 586203 589630 592700 594960 596799 598899 601270 603364 604905 606110 607175 607983 608429 608745 609390 610702
60357 610702 612688 615083 617620 620317 623536 627744 633156 639599 646765 654648 663643 673950 684840 694775
60343 694775 702458 707611 710621 711694 710642 707376 702241 695833 688653 681015 673180 665565 658733 653005
60329 653005 648078 643256 638143 632908 627876 623188 619003 615548 612635 609526 605785 602067 599522 598449
60315 598449 598067 597739 598091 600527 605747 612989 620855 628778 637420 647708 659862 673624 688897 705494
60301 705494 722460 738479 753059 766658 779505 791001 800433 807468 811548 811600 806976 798149 785987
60288 785987 770958 753667 735534 718124 702138 687659 674839 663606 653246 643253 634262 627186
60276 627186 621674 616417 610829 605446 600678 596246 592054 588616 586252 584534 582858 580944 578573 575526
60262 575526 572163 569502 568341 568654 569972 571847 573749 575095 575740 576068 576462 577097 578312 580465 583134
60247 583134 585110 585625 585132 584482 583822 582770 581201 579271 576939 574108 571106 568570 566897 566168 566471 567844
60231 567844 569952 572257 574583 577130 579921 582616 585094 587836 591350 595383 599155 602413 605844 610198
60217 610198 615331 620514 625534 630949 637255 644293 651703 659451 667562 675733 683637 691338 699023 706577
60203 706577 713866 721161 728678 735811 741470 745268 747904 750247 752478 754204 754984 754526 752695 749583 745438
60188 745438 740469 734860 728907 722897 716859 710728 704695 699075 693885 688960 684517 681121 678877 677055
60174 677055 674792 672002 669361 667492 666376 665484 664363 663041 661931 661341 661191 661154 660937 660344 659320 658093
60158 658093 657058 656297 655471 654437 653687 653822 654782 656074 657557 659499 661911 664377 666647 668947 671526
60143 671526 674234 676787 679210 681795 684726 687839 690788 693521 696596 700818 706363 712493 718327 723705
60129 723705 729061 734659 740311 745598 750018 753048 754473 754656 754299 754093 754733 756813 760259 764097 767301
60114 767301 769751 772019 774525 777312 780290 783056 784820 785163 784652 783975 782712 779806 775175 769902 764738
60099 764738 759391 753575 747948 743410 740091 737482 735281 733639 732853 733103 734341 736232 738238 739796 740393
60084 740393 739771 738344 737074 736428 735776 734344 732400 730686 728908 725816 720821 714537 707478 699206 689237
60069 689237 678140 667241 657681 650011 644089 639063 633926 628435 623075 618093 613216 608484 604584 601974
60055 601974 600374 599493 599591 600826 602636 604277 605612 606962 608662 611039 614274 617919 621104 623662 626486
60040 626486 630325 634812 639136 643043 646531 649099 650081 649405 647374 644032 639441 634337 629737 625934 622376
60025 622376 618485 614113 609234 603678 597274 590038 582283 574650 567748 561566 555546 549457 543822 539111
60011 539111 534950 530652 526262 522555 520102 518780 518123 517773 517582 517542 517629 517618 517201 516429 515754 515514 515610 515876
59993 515876 516409 517382 518855 520976 523948 527557 531121 534195 536973 539727 542268 544278 545719 546583 546645
59978 546645 545852 544517 542761 540224 536831 533398 530849 529116 527395 525272 523109 521446 520494 520093 519920
59963 519920 519908 520654 522997 526872 531078 534597 537631 540815 543934 546154 547153 547255 546692 545531 544227 543462
59947 543462 543410 543748 544354 545349 546431 546794 545898 543942 541494 539021 536771 534785 532957 531319 530180 529771
59931 529771 529982 530750 532426 535308 539045 542986 547017 551575 556955 563042 569587 576240 582367 587288 590703
59916 590703 592614 593015 592072 590445 588986 588213 588367 589643 591861 594280 596459 599061 602955 607554 610928
59901 610928 611807 610806 609438 608535 608020 607718 607839 608807 610884 614017 617963 622600 627969 633865 639655 644844
59885 644844 649697 654888 660709 667042 673946 681698 690224 699038 707808 716569 725229 733258 739992 744992
59871 744992 748109 749559 749916 749617 748368 745464 740796 735208 729746 724870 720469 716275 712012 707392 702234
59856 702234 696583 690705 685055 680162 676325 673439 671255 669807 669457 670636 673664 678670 685475 693662
59842 693662 702910 713067 723803 734501 744668 754063 762141 767940 771127 772854 774957 778491 783500
59829 783500 789782 796952 803789 808446 809709 807647 802964 796192 787692 777933 767523 757125 747277 737960
59815 737960 728414 717888 706605 695638 685861 677422 670159 663978 658674 653820 649061 644300 639641
59802 639641 635472 632417 630812 630252 630013 629770 629422 628492 626431 623531 620827 618976 617775 616802 615846 614659
59786 614659 613047 611475 610898 611582 612661 613197 613160 613022 612933 612801 612835 613488 614986 617191 619761 622299 624613
59769 624613 626970 629746 632751 635345 637415 639660 642558 645575 647920 649674 651570 653950 656549 659261
59755 659261 662461 666492 671284 676628 682403 688309 693716 698155 701926 705939 710901 716782 723109 729494
59741 729494 735693 741312 745927 749545 752643 755582 758300 760774 763349 766236 768976 770925 772121 773208
59727 773208 774607 776243 778031 780019 781878 782777 782145 780379 778510 777234 776345 775042 772777 769795 766823
59712 766823 764260 761887 759451 757114 755086 753180 751185 749374 748168 747467 746850 746318 746229 746522 746572 746004
59696 746004 745231 744986 745550 746532 747253 747373 747206 747218 747123 745939 743284 740126 737656 735818 733678 730953 728271
59679 728271 725996 723640 720586 716701 712068 706814 701337 696145 691233 686109 680549 674885 669473 664411
59665 664411 659877 656199 653485 651624 650615 650333 650145 649447 648698 649126 651281 654537 658096 661722 665288
59650 665288 668539 671633 675125 678885 681660 682165 680175 676240 670991 665126 659392 653981 648369 642287
59636 642287 636428 631718 628274 625505 623002 620866 619349 618436 617600 615890 612666 608396 604304 601049 598188
59621 598188 595031 591462 587715 584015 580723 578260 576496 574702 572434 569970 567675 565575 563918 563419
59607 563419 564440 566446 568708 570997 573255 575278 577219 579693 582703 585124 586024 585988 586365 587664 589444
59592 589444 591349 593406 595523 597495 599379 601195 602509 602951 602928 603066 603166 602434 600666 598474 596391 594453
59576 594453 592655 591102 589665 588123 586761 586205 586550 587223 587887 588839 590227 591417 591654 591135 590900 591616
59560 591616 592723 592990 591820 589840 588125 587105 586492 586026 585719 585325 584310 582671 581275 580976 581840 583644
59544 583644 586591 590898 596106 601686 608212 617185 629522 644767 661885 680313 699907 720100 739244
59531 739244 754781 764285 766817 763523 756807 748932 741377 735068 730580 727985 726834 726535 726676 726953 726927
59516 726927 725885 722998 717763 710436 701899 692994 684005 674768 665105 655159 645527 637091 630374 624923
59502 624923 619648 613984 608496 604168 601333 599494 597961 596398 594900 593717 592842 591895 590578 589199 588450
59487 588450 588683 589702 591173 592760 593980 594535 594932 596132 598424 601219 604118 607502 611773 616705 621934
59472 621934 627475 633277 638897 644105 649209 654237 658399 661045 662676 664313 666326 668595 671438 675389
59458 675389 680218 685028 689396 693789 698782 704436 710562 717096 724027 731181 738166 744415 749365 752741
59444 752741 754520 754557 752549 748525 743015 736537 729350 721970 715372 710218 706233 702765 699662 697178 695427
59429 695427 694495 694817 696936 701002 706862 714445 723739 734641 747129 761391 777506 795298 814676
59416 814676 835717 858182 881442 905075 929120 953552 978136 1002704 1026425 1046303 1057670
59405 1057670 1057460 1046750 1029687 1010714 993298 979885 971446 967498 967682 972676 982150 992279 997014
59392 997014 992221 977866 956611 931697 906148 882317 861274 843067 827710 815250 805023 795932
59380 795932 787685 780890 775742 771516 767651 764445 762244 760661 759127 757672 756743 756635 757426 759198 762058
59365 762058 766046 771022 776500 781801 786733 791932 798156 805515 813823 823333 834499 847266 861223
59352 861223 876248 892380 909309 926699 944727 963551 982477 1000433 1017034 1032377 1046075
59341 1046075 1057454 1066511 1073620 1078392 1079897 1077967 1073222 1065721 1054744 1040182 1023039 1004250 983969
59328 983969 962439 940637 919509 899249 879702 860866 842708 825190 808795 794362 782061
59317 782061 771129 760862 751238 742356 733962 725827 717996 710432 702983 695932 689962 685359 681784 678929
59303 678929 676846 675615 675381 676712 680127 685303 691621 699522 710234 724025 739866 757020 775559
59290 775559 794583 811141 821919 825407 821908 812500 798989 784080 770352 759136 750867 746001
59278 746001 744837 746908 751366 757778 766008 775709 786508 798419 811485 825335 839582 854309 869614
59265 869614 884972 899517 912654 923843 932229 937135 938784 937975 935221 930698 924769 917957 910467
59252 910467 902350 894133 886724 880555 875177 869909 864659 860052 856858 855365 855192 855705 856679 858493 861650
59237 861650 866116 871192 876005 880072 883337 885577 885986 883769 879113 873008 865869 856957 845638 832542
59223 832542 818809 804806 790529 776838 765047 755265 746222 736963 727861 719816 713308 708500 705433
59210 705433 703683 702456 701341 700539 700212 700128 700097 700213 700646 701684 703861 707328 711240 714587 717533 720967
59194 720967 724767 727668 729046 729702 730568 731722 733029 734622 736190 736885 736592 736420 737263 738654 739629 739934
59178 739934 739733 738917 737420 735669 734172 733161 732966 734048 736285 739022 742242 746756 752759 759172 764978
59163 764978 770185 774783 777872 778807 778295 777248 775272 771382 765616 758882 751693 744052 736172 728273 720043
59148 720043 711177 702135 693488 684949 676008 667172 659559 653454 648254 643669 639938 636852 633535 629527
59134 629527 625402 622054 619806 618371 617341 616574 616328 617012 618687 620976 623532 626363 629589 633330 638013
59119 638013 644287 652352 661791 672278 683966 696949 710939 725746 741442 757700 773580 788303
59107 788303 801637 813339 823089 831320 839092 846533 852296 855210 855594 854279 851372 846916 841804 836851
59093 836851 831611 825296 818389 812241 807445 803634 800575 798429 797088 796067 794852 792745 788941 783540
59079 783540 777933 773221 768689 762827 755425 747604 740161 733072 726453 720798 716171 712064 708170 704583
59065 704583 701250 697943 694734 691893 689394 687003 684618 682042 678866 675232 672153 670350 669221 667795
59051 667795 666118 664755 663504 661846 660281 659848 660439 660817 660376 659672 659123 658304 656850 655082 653427 651964
59035 651964 650839 650371 650477 650589 650450 650534 651555 653915 657694 662783 669016 676405 685084 694803 704925
59020 704925 715285 726429 738380 749790 759134 766234 771691 775277 776104 774181 770731 766928 763177
59007 763177 759563 756145 752828 749736 747696 747665 749772 753549 758811 765468 772747 779562 785606 791268 796611
58992 796611 801206 804864 807697 809618 810566 811009 811380 811238 809819 807217 804165 800991 797802 795412 794916
58977 794916 796409 799156 802948 808260 815228 823565 833391 844976 857661 870219 882370 894875 908073
58964 908073 921444 934723 948251 961996 975256 987545 998728 1008133 1014591 1017666 1017847 1015268 1009203
58951 1009203 999188 985735 969662 951578 932283 912825 893807 875332 857714 841514 826800
58940 826800 813267 801146 791070 783021 776420 771267 768081 766558 765512 764433 763939 764297 764654 764229
58926 764229 763238 762048 760386 758009 755315 752703 749982 746943 743906 741297 739296 738132 738030 738593 738995
58911 738995 739022 739209 739828 740631 741840 744407 748958 755333 763535 774110 787080 801414 816177 831482
58897 831482 847751 864724 881792 898753 915738 932873 950411 968752 988050 1008247 1029540
58886 1029540 1052189 1075722 1099022 1121272 1142055 1160439 1174972 1184912 1190599 1192296 1189521 1181973
58874 1181973 1170353 1155787 1139059 1120747 1101532 1082056 1062960 1045174 1029562 1016225 1004795
58863 1004795 995309 987893 981660 975013 967218 958693 949657 939637 928554 917160 906021 895098 884602
58850 884602 875074 866220 856822 846409 835989 826585 817981 809442 800704 791683 782147 772206 762338 752522
58836 752522 742316 732093 723154 716100 710185 704761 700183 696721 693743 690853 688797 688353 689198 690599
58822 690599 692396 694530 696501 698130 700120 703157 707095 711561 716493 721491 725573 728356 730674 733382
58808 733382 736300 738899 741097 742721 743165 742336 740988 739422 736845 732832 728342 724308 720189 714974 708747
58793 708747 702214 695528 688723 682554 677686 673636 669673 666263 664511 664576 665707 667532 670292 674058 678606
58778 678606 683908 689967 696311 702295 707659 712323 715945 718125 718636 717083 712942 706375 698431 689988
58764 689988 681224 672492 664799 658740 653837 649659 646815 646007 646881 648606 650937 653871 656870 659292 661036
58749 661036 662163 662574 662717 663750 666143 668950 671316 673922 677957 683444 689669 696560 704472 713103 721810
58734 721810 730653 740077 749859 759329 768455 777792 787465 796885 805347 812404 817960 822451 826628 830822
58720 830822 834897 839085 844091 850010 856121 862235 869169 877204 885160 891841 897319 901799 904302 903780
58706 903780 900761 896557 891288 883781 872984 858532 840532 819827 798047 776470 755198 734130
58694 734130 713992 695567 678634 662734 648391 636521 627139 619516 613095 607420 601820 596102 590951
58681 590951 586817 583119 579351 576135 574158 572942 571813 571313 572412 574960 578191 582259 588049 595856
58667 595856 605320 616269 628646 642116 656593 672495 689500 705666 718759 727841 732720 732841
58655 732841 727965 719204 708126 695491 681939 669040 658191 649126 640812 633205 626878 621663 617155
58642 617155 613926 612694 612826 613125 613631 615156 617469 619465 620855 622220 623622 624485 624683 624519 623911 622726
58626 622726 621569 621083 620899 620437 620192 620918 622044 622274 621373 620089 618808 617679 617611 619627 623428 627836
58610 627836 632351 637094 641652 645346 648254 650749 652422 652701 652084 651511 650984 650018 648841 647874 646671 644732
58594 644732 642732 641601 641133 640895 641629 644170 647845 651738 656792 664724 675491 687724 701043 715867
58580 715867 731442 746176 759671 772531 784494 794746 803653 812087 819453 824614 828612 834142 842397
58567 842397 852668 865097 881395 902407 927102 954467 984480 1016645 1049278 1080710 1109767
58556 1109767 1134877 1154330 1167665 1175378 1177325 1173144 1164256 1153601 1143130 1133072 1123532 1114922
58544 1114922 1106670 1097383 1086585 1074717 1061416 1045560 1027098 1007065 985755 962795 939084 916723
58532 916723 896685 878379 861685 847573 836372 827162 819201 812408 806402 800756 796187 793725 792741
58519 792741 791587 790032 789042 788365 786630 783862 781524 779776 777031 772623 767734 763227 758741 754352 750947
58504 750947 748443 745727 742814 741027 740603 740198 739153 738151 737302 735836 734145 733799 734996 736290 737388
58489 737388 739888 744531 750096 755831 762716 771466 781460 792490 805406 820172 835382 850563 866877
58476 866877 884665 902337 918396 932452 943481 949398 949385 944717 936549 925030 911273 897797 885934
58463 885934 874973 864796 857134 853179 852137 853233 857019 863622 871800 880865 891605 904314 917814
58450 917814 931127 943959 954794 960904 961318 957686 951458 942546 931527 920405 910094 899699 889431
58437 889431 881552 877128 874468 872183 871200 872256 874052 875601 877939 881758 885752 889106 893359 899960
58423 899960 908081 916450 925129 933700 939948 942314 941812 939851 936074 929922 922382 914522 906174 897464
58409 897464 889631 882969 876086 868517 861854 856947 852406 847374 843336 841576 841263 841615 843447 846905 850243
58394 850243 852684 855977 861299 867092 871825 876331 881406 885740 888357 890708 894212 898054 901419 905461
58380 905461 911051 917041 922752 929564 937953 945639 950970 955494 960876 966008 969719 973734 980161 988371
58366 988371 996924 1006293 1017207 1028587 1039613 1051532 1065082 1078551 1090731 1103142 1116790 1129370
58354 1129370 1138438 1144861 1150487 1154959 1157581 1159770 1162782 1165432 1166791 1168680 1172767 1177781 1182367 1188085
58340 1188085 1196760 1207501 1219169 1233050 1250145 1268527 1286363 1304781 1324810 1344410 1361651
58329 1361651 1377870 1394483 1409627 1421213 1430359 1438544 1444457 1447080 1448755 1451717 1454709 1456418 1458885
58316 1458885 1463921 1469696 1474700 1481448 1492183 1504598 1516059 1528323 1543519 1559318 1573116 1587369
58304 1587369 1605448 1625557 1644128 1662074 1682173 1703332 1722989 1742346 1763638 1785028 1803784
58293 1803784 1821794 1842310 1864014 1883973 1903685 1926385 1951068 1975063 1999817 2028179 2058629
58282 2058629 2088233 2118590 2152755 2188954 2223655 2258206 2296136 2336601 2377001 2419347 2467285
58271 2467285 2519268 2571288 2623796 2679342 2736265 2791722 2848272 2910308 2976503 3042727 3109584
58260 3109584 3179910 3251749 3321317 3390054 3461376 3533520 3603105 3672478 3745782 3821403 3896337
58249 3896337 3974104 4059808 4151434 4244967 4343816 4453557 4571717 4692876 4819600 4957681
58239 4957681 5104915 5255842 5413419 5584212 5766103 5952947 6147479 6357099 6580843
58230 6580843 6813527 7058693 7323936 7607574 7903975 8217776 8558121 8923443 9307569
58221 9307569 9716266 10161354 10643231 11156586 11708433 12312157 12968944 13674752 14440392
58212 14440392 15283997 16209622 17215974 18320600 19551483 20921502 22438067 24132099
58204 24132099 26049775 28223961 30686785 33504958 36771501 40576214 45029515 50313949
58196 50313949 56680520 64422574 73918815 85687216 100313012 118304907 140060597
58189 140060597 165914918 196082890 230542040 269044271 311026516 354894334 396926673
58182 396926673 431165551 451283532 453463777 438072196 408997586 371632900 331129852
58175 331129852 291521483 255354330 223596487 195970992 171659768 149938026 130410811
58168 130410811 112939216 97495632 84051073 72506406 62688951 54398423 47436309
58161 47436309 41601170 36695957 32556527 29056777 26085329 23539468 21343171 19447180
58153 19447180 17805705 16370157 15105529 13991826 13005843 12118797 11313137 10583775 9920643
58144 9920643 9306705 8734844 8210077 7732396 7292391 6885646 6516266 6183394 5878065
58135 5878065 5595967 5340256 5109201 4893413 4687588 4493358 4308708 4126449 3945571
58126 3945571 3773088 3612273 3459233 3312762 3177192 3053350 2936472 2825034 2722432
58117 2722432 2628355 2537723 2449719 2368885 2295762 2225336 2156260 2092839 2036218 1982011 1928319
58106 1928319 1877856 1830564 1782181 1731827 1683355 1637746 1591744 1545279 1502508 1464116 1426147
58095 1426147 1387925 1353567 1324192 1296119 1268437 1244876 1226260 1208355 1189212 1171743 1157080
58084 1157080 1142210 1126205 1112048 1100091 1086187 1068508 1050055 1032383 1013028 991277 970275
58073 970275 951113 930729 908040 886511 868313 851370 834377 819380 807178 795390 783184
58062 783184 772811 764584 755558 745212 737169 733016 729454 723745 717003 709964 700631 688628 677199
58049 677199 668307 659955 650526 641514 633941 626409 618708 612997 609448 604955 598086 591059 585113 578419
58035 578419 570428 563648 559020 554088 547874 542960 540333 536755 529843 521547 514018 506276 497590 489967
58021 489967 484408 478592 471093 464216 459870 456324 451840 447844 445633 443446 439781 436345 434753 433478
58007 433478 430965 428716 428305 428242 426734 424930 424590 425062 425179 425666 427117 428027 427346 426556 426921 427186 426279
57990 426279 425691 426736 428010 428008 427741 428214 427774 424673 420174 416609 414217 412082 410130 408074 404559 399502
57974 399502 395181 392973 391285 388681 386536 386300 386606 385599 383973 383117 382358 380613 378921 378799 379667 380197
57958 380197 380579 381404 382006 381907 382098 382945 382705 380123 376529 373408 370012 365598 361827 360445 360390 359724 358778
57941 358778 359054 360666 363201 367501 374169 381744 388705 395919 404946 415405 426146 437550 450226
57928 450226 462692 472596 479263 483202 484378 482835 479658 475361 468661 458697 447060 435789 424914
57915 424914 413887 403766 395794 389256 382918 377252 373196 370125 367145 364983 364502 364778 364809 365582 368084
57900 368084 370697 371086 369609 368405 368113 367870 367579 367781 368063 367950 368712 372054 377555 383303 388544 393890
57884 393890 399643 405696 412366 419587 425945 430067 432177 432943 431992 429105 425493 422104 417976 412156 405864
57869 405864 400697 396039 390511 384804 380740 378449 376745 375427 374990 374960 374706 375122 377340 380616 383650
57854 383650 387121 392611 399760 406811 413337 420161 427123 433208 438371 443126 446809 448424 448769 449556 450864
57839 450864 451475 451246 451047 450809 449765 448226 447040 445762 443480 440993 439934 440094 439779 438570 437487 436656
57823 436656 435110 432884 431115 429926 428206 425617 422921 420273 417093 413709 411249 409657 407536 404193
57809 404193 400365 396755 393203 389234 384077 376483 366108 354848 345170 337331 329741 321749 314298 308036
57795 308036 302597 297726 293495 289463 285186 281480 279712 279934 281125 282915 285535 288513 291090 293680
57781 293680 297272 301731 306367 311718 318906 327536 336164 344620 353866 363749 372843 380548 387435 393521
57767 393521 398152 401624 405004 408183 409881 409744 408684 407104 404611 401576 399156 397491 395582 393139
57753 393139 390878 388875 386380 383388 380637 377799 373484 367422 361038 355520 350827 346816 343816 341775
57739 341775 340226 339310 339490 340301 340741 340734 340737 340227 338443 336340 335780 336815 337837 338414 339738 342098 344205
57722 344205 345527 347105 349506 351999 354347 357346 360923 363756 365588 367928 371553 375210 377752 379736
57708 379736 381852 383503 384099 384192 384122 382946 379896 375759 371786 368326 365370 363279 362014 360703 358826
57693 358826 356946 355571 354294 352618 350574 347986 344327 339928 336165 333785 332120 330470 329145 328596
57679 328596 328743 329807 332635 337578 344214 352779 364787 381642 403836 432034 467697 511825 564211
57666 564211 624609 693514 770765 853755 936915 1011688 1067037 1092501 1083085 1041595 976354 897437
57654 897437 814486 735269 664128 602011 548621 503955 467671 438382 414501 395029 379125
57643 379125 365876 354938 346391 339648 333626 328299 324718 322992 321571 319211 316435 314389 313333 312903
57629 312903 312772 312430 311313 309707 308563 308080 307571 306956 307059 307994 308645 308248 307126 305452 302792 299510
57613 299510 297077 296158 295711 294682 293265 291812 289986 287837 286343 286001 286116 286191 286679 287562 287686 286455
57597 286455 284922 284256 284340 284618 284979 284982 283666 281037 278389 276361 274174 271552 269646 268943 268067 265963 263602
57580 263602 262063 260566 258056 255253 253325 251785 249560 247090 245508 244583 243197 241208 239314 237730
57566 237730 236445 236035 236712 237257 236336 234248 232091 229980 227526 225311 224275 224126 223841 223339 223262 223544 223524
57549 223524 223178 222986 222907 222613 222425 222996 224362 226154 228297 230700 232865 234676 236960 240385 244470 248424
57533 248424 252089 255234 256936 256756 255587 254341 252827 250941 249767 250076 250854 250836 250565 251410 253430 255850
57517 255850 258793 262858 267631 272335 277365 283555 290435 296830 302707 308825 315080 320836 326440 332684
57503 332684 339031 344033 347293 349522 350917 351071 350317 349604 349113 348290 347064 345749 344083 341760 339494
57488 339494 338090 336884 334768 332306 330965 330434 328739 325236 321611 319519 318871 318944 319640 320958 322435
57473 322435 323778 325179 326643 327843 328856 330202 331961 333677 335148 336580 338013 339432 341296 344079
57459 344079 347503 351091 355122 359996 365004 368979 371962 375030 378638 382310 385781 389197 392345 394907
57445 394907 397321 400206 403111 405091 406376 408117 410590 413042 415196 417504 419904 421786 423287 425233
57431 425233 427683 429863 431659 433797 436394 438720 440673 443125 446502 450241 453966 457943 462070 465674
57417 465674 468686 471932 475873 480103 484339 488809 493371 497379 500784 504348 508453 512656 516697 520961
57403 520961 525642 530349 534812 539120 543209 546954 550794 555253 559930 564030 567864 572581 578435 584587
57389 584587 590681 597206 604110 610491 616019 621409 627123 632843 638541 644769 651566 658335 665196 673075
57375 673075 681974 690516 697836 704663 711850 719006 725429 731329 737322 743506 749822 756589 763981 771545
57361 771545 778765 785686 792730 800459 809520 819981 830706 840364 849177 858635 869347 880328 890636
57348 890636 900495 910430 920474 930657 941161 951581 961179 970273 980184 991347 1002681 1013375
57336 1013375 1024031 1035367 1046961 1058164 1069227 1080752 1092840 1105539 1119245 1133904 1148540
57325 1148540 1162288 1175295 1188124 1201017 1214135 1227723 1241557 1255045 1268277 1282106 1296800
57314 1296800 1311606 1326111 1340969 1356673 1372655 1388335 1404186 1420940 1438462 1456092 1473467
57303 1473467 1490509 1507278 1524326 1542497 1561952 1582085 1602640 1623971 1645869 1667245 1687554
57292 1687554 1707491 1727799 1748332 1768926 1790111 1812217 1834723 1857182 1879959 1903417 1927246
57281 1927246 1951261 1975898 2001243 2026494 2051198 2076118 2102010 2128359 2154199 2179523 2205078
57270 2205078 2231325 2258396 2286461 2315447 2344845 2374354 2404227 2434617 2465258 2496210 2528110
57259 2528110 2561167 2594643 2627818 2660754 2693737 2726795 2760222 2794622 2829859 2864859 2898971
57248 2898971 2932694 2966574 3000383 3033987 3068069 3103353 3139897 3177656 3216792 3257002 3297655
57237 3297655 3339085 3382529 3428132 3474291 3519772 3565178 3611391 3657895 3703910 3750082 3797696
57226 3797696 3846884 3896745 3946563 3995940 4044509 4092550 4141223 4191183 4241574 4291182 4339803
57215 4339803 4387608 4434052 4478554 4521641 4564438 4607618 4651617 4697033 4743736 4790255 4835154
57204 4835154 4878582 4921746 4965490 5010239 5056636 5105196 5155737 5207811 5261116 5314954 5368263
57193 5368263 5420976 5474487 5529840 5586299 5642532 5698194 5753291 5806921 5858033 5906981 5955273
57182 5955273 6004158 6054232 6105741 6158226 6210282 6260478 6308175 6353057 6394684 6433151 6469359
57171 6469359 6503853 6536197 6566072 6594029 6620443 6644663 6665950 6684244 6699342 6710489 6717633
57160 6717633 6721866 6723670 6721873 6715385 6704922 6692163 6678439 6665208 6654436 6647248 6643266 6642337 6645596
57147 6645596 6653767 6665835 6680692 6698697 6720294 6744547 6770580 6799044 6830411 6862808 6892966
57136 6892966 6918121 6935698 6942872 6938630 6925439 6907419 6887975 6870507 6859547 6858740 6868456 6886939
57124 6886939 6912721 6944418 6979798 7017165 7056522 7097647 7138481 7177489 7216197 7257509 7303213
57113 7303213 7355303 7417960 7495417 7589064 7699024 7827291 7977193 8151723 8355469 8596946
57103 8596946 8886528 9233824 9650126 10152191 10761495 11502497 12405587 13510189 14861725
57094 14861725 16507228 18496360 20882236 23714258 27028728 30845894 35168297 39973911
57086 39973911 45213840 50823388 56732643 62863195 69127649 75446804 81748709 87903022
57078 87903022 93628250 98485892 102013926 103905528 104090630 102684131 99884128 95906149
57070 95906149 90965347 85277172 79059027 72529629 65901390 59365407 53078767 47160851
57062 47160851 41693985 36723914 32263729 28303224 24817981 21773907 19130312 16844255
57054 16844255 14873581 13177366 11716957 10458589 9374081 8438563 7629138 6926148
57046 6926148 6313852 5778915 5309379 4895397 4529388 4204720 3915182 3655918 3423526
57037 3423526 3214823 3026502 2856081 2702039 2562863 2436963 2323445 2221880 2131423 2051278
57027 2051278 1981812 1923958 1877837 1843286 1821382 1813763 1820508 1840137 1871078 1910401 1950031 1976225
57015 1976225 1974890 1938046 1866189 1766642 1650538 1529511 1412551 1304536 1207061 1120168 1043491
57004 1043491 976735 919577 871033 829159 791969 758558 728872 702719 679741 659953 643426
56993 643426 629480 617026 605688 595945 588336 583242 581229 582750 587544 594972 604893 617522 632492
56980 632492 648421 663037 673174 675407 667955 652054 630837 607022 582202 557671 534659 513779
56968 513779 495188 479288 466571 456970 450178 446509 446716 451149 459792 472755 489826 509858 531599
56955 531599 554839 579475 603292 621731 630321 627013 612498 589333 561013 530943 501586 474446
56943 474446 450574 430657 414898 403371 396326 393755 395038 399676 408112 421221 439288 462065
56931 462065 489503 521640 557848 596317 633592 664070 681038 679919 660940 628362 587582 543365
56919 543365 499633 459024 422366 389448 360351 335428 314410 296579 281655 269563 259471
56908 259471 250094 240966 232662 225741 220177 215655 211720 207828 203939 200842 199229 198850 199326 201267 205597
56893 205597 212216 220419 230322 242707 257768 275296 295958 321014 350675 383781 418901 454327
56881 454327 486774 511735 526039 529488 523826 511150 493802 474741 456930 442312 431523 424274
56869 424274 420053 418974 422063 430426 444412 464125 490423 524500 566573 615919 672181 735450
56857 735450 804224 873432 934650 978422 997435 989219 956896 907387 848582 787536 729858 679376
56845 679376 638115 606927 585999 574700 571940 577627 593310 620703 660271 712022 776736 855067
56833 855067 946039 1047605 1157434 1270385 1374763 1453477 1491162 1481218 1427452 1341056 1236141
56822 1236141 1125620 1018637 920578 834706 762956 705566 661403 629306 608679 599020 599971
56811 599971 612014 636100 672267 719440 776728 843892 919746 1000035 1076455 1137284 1170270
56800 1170270 1167593 1129747 1064750 983527 895935 809526 729460 658408 597375 547049 507826
56789 507826 478817 458222 445047 439446 441260 449504 463678 484336 511711 544741 581859 621432
56777 621432 660339 692839 712051 712897 694011 657973 610299 557386 504315 454126 408593 368783
56765 368783 334823 306104 282163 262890 247817 235939 226395 218605 211715 204806 197861 191676 186546
56752 186546 181897 177456 173837 171559 170266 169348 168616 167953 166978 165470 163655 161793 159991 158496 157523
56737 157523 156677 155243 153212 151359 150255 149915 150409 151864 153710 154866 154977 154725 154741 155019 155523 156455 157692
56720 157692 158859 160187 162412 165577 168893 172017 175456 179341 182834 185315 187269 189456 191928 194359
56706 194359 196650 198688 200163 201044 201725 202355 202581 202137 201118 199546 197353 194952 193080 191932 191126 190551
56690 190551 190407 190346 189589 188133 186961 186845 187715 189358 191714 194320 196409 197853 199167 200461 201294 201661
56674 201661 202103 202740 203275 204002 205577 207605 208782 208761 208601 209040 209619 209892 210104 210185 209452 207970 206921 206978
56656 206978 207523 208065 208993 210221 210462 208861 206132 203128 199421 194296 188037 181152 173324 164315 155121
56641 155121 147113 140624 135290 131107 128283 126695 126252 127169 129170 131153 132424 133589 135473 137857 139977
56626 139977 141513 142416 142527 142125 142143 143059 144223 144910 145353 146077 147009 147957 149225 151031 152981 154736 156484
56609 156484 158203 159218 159157 158587 158124 157656 157028 156672 156896 157297 157434 157421 157460 157597 158240 159885 161993 163283
56591 163283 163504 163710 164429 165044 165545 167147 170253 173398 175319 176632 178272 179722 180146 180068 180428 181041 181404
56574 181404 182105 184011 186839 189787 192760 195808 198248 199645 200861 202948 205745 208702 212204 216871
56560 216871 222416 228348 235016 242739 250772 258276 265464 272574 278662 282684 284972 286498 287631 288742
56546 288742 290874 294363 297778 299648 300296 300598 300135 298245 295822 294163 292835 290546 287465 284784 282539
56531 282539 279721 276174 272665 269391 266032 262907 260557 258593 256468 254874 254732 255273 254857 253366 252151
56516 252151 251833 251729 251230 250180 248148 244830 241009 237747 234876 231614 228243 225687 223790 221509 218547
56501 218547 215363 211996 208322 205057 202988 201575 199826 198067 197260 197118 196664 196230 197011 198874 200487
56486 200487 201453 202529 203821 204632 205113 206335 208579 211064 213301 215218 216197 215702 214688 214638 215329 215374 214835
56469 214835 215217 216769 217852 217415 216278 215474 214987 214625 214564 214579 214097 213439 213615 214627 215368 215499 215982 217384
56451 217384 219018 220177 220980 221657 222147 222662 223542 224399 224468 223843 223296 223022 222726 222712 223520 224735 225578 226428
56433 226428 228186 230354 231438 231138 230543 230266 230142 230513 231863 233212 232991 231688 231556 233341 235369 236311
56417 236311 236833 237855 239093 240151 241392 242904 244046 244693 245504 246458 246597 245805 245292 245688 246122 245880 245613
56400 245613 246195 247586 249400 251425 253146 253965 254260 255119 256733 258299 259636 261416 263593 265207 266170
56385 266170 267672 270332 273351 275912 277980 279278 278976 276938 273961 270342 265538 259720 254317 250573
56371 250573 248641 248242 248919 249591 249388 249145 250574 253785 257115 259553 261662 263987 266289 268636 271473
56356 271473 274277 275826 276123 276417 277141 277611 277935 279210 281467 283346 284254 284939 285655 285794 285715 286743 288842
56339 288842 290414 291009 292006 293986 295738 296688 297992 300143 301729 301780 301405 301868 302856 303808 305203 307428
56323 307428 309982 312729 316232 320052 322620 323672 324824 326784 328068 327636 326808 327242 328843 330891 333440
56308 333440 336322 338548 339993 342060 345485 349190 352357 355922 360780 366309 371838 377824 384386 390434
56294 390434 395444 400394 405854 410977 415514 420797 427423 433999 439618 445637 453413 462077 470141 477615
56280 477615 485004 491953 498446 505731 514445 523396 531632 540056 549525 559058 567574 575878 585361 596291
56266 596291 608794 623858 641730 660925 680426 701365 725012 750781 777932 807744 842144
56255 842144 881492 925367 974368 1029611 1091528 1160503 1237589 1323456 1417787 1520579 1632574
56244 1632574 1753573 1881908 2016309 2156300 2299875 2442974 2582331 2716609 2843568
56235 2843568 2958540 3057150 3137269 3196921 3232925 3243516 3230088 3194666 3137991 3061787 2970323
56224 2970323 2867548 2754947 2634190 2509427 2384642 2260914 2138526 2019558 1906092
56215 1906092 1797977 1694723 1597616 1507727 1423909 1345017 1272038 1205802 1144822 1087708 1035503
56204 1035503 989230 947409 908440 873084 842033 813514 786092 761456 741402 724433 708448
56193 708448 694468 684261 676313 667709 658319 649815 642179 634522 627727 622954 618992 614297 610143 608527
56179 608527 608459 607572 605941 605077 604659 603546 602575 603035 603824 603475 603489 606181 610585 614028 616509 619956 624348
56162 624348 628248 632215 638082 645569 652972 660439 669404 679558 689482 699446 710668 722823 735171
56149 735171 748934 765592 784130 803068 823851 849132 879096 912744 951443 997894 1052924
56138 1052924 1116494 1190352 1276322 1373332 1479295 1594134 1717402 1844496 1968768 2085734
56128 2085734 2192067 2283112 2356235 2415203 2466942 2514868 2558674 2598135 2632297 2656589 2665945
56117 2665945 2660301 2643228 2616739 2581679 2541269 2498757 2452074 2395296 2324751 2240037 2141015
56106 2141015 2028993 1909938 1791696 1678609 1572553 1477159 1395855 1327232 1267588 1216890
56096 1216890 1177250 1147034 1122002 1101201 1086250 1075871 1066709 1058753 1054443 1053250 1052538 1052800 1056396
56083 1056396 1062039 1066277 1069592 1075274 1083221 1090751 1098556 1109559 1122620 1133783 1143237 1154704 1168506
56070 1168506 1181738 1194777 1210889 1229578 1247060 1263283 1281807 1302708 1322271 1339837 1358274
56059 1358274 1377536 1394383 1408659 1423324 1438286 1450754 1461594 1474472 1488960 1501501 1512966
56048 1512966 1527922 1546617 1565192 1583655 1605788 1631138 1655172 1677703 1703125 1731947 1760285
56037 1760285 1788139 1819826 1855662 1891599 1927673 1968283 2013434 2058367 2102434 2149556 2199347
56026 2199347 2246990 2292603 2341426 2393919 2445166 2494743 2547332 2602827 2656174 2708048 2765253
56015 2765253 2829353 2895375 2962718 3036252 3115518 3194447 3273215 3358643 3451410 3545068 3639303
56004 3639303 3741458 3853036 3967775 4085092 4211917 4348971 4489194 4632262 4786235
55995 4786235 4952226 5122535 5296820 5484418 5687479 5898137 6115998 6351409 6607405
55986 6607405 6876017 7156837 7460900 7791358 8139358 8504380 8899075 9328534 9785514
55977 9785514 10271924 10803256 11385511 12010908 12683211 13422864 14240001 15128866 16097190
55968 16097190 17173250 18375400 19705374 21182188 22850874 24747971 26895273 29341421
55960 29341421 32173320 35477435 39339128 43902816 49394600 56084076 64296380 74486829
55952 74486829 87221705 103029392 122314768 145414676 172597765 203932501 239250982
55945 239250982 278187967 319739257 361152931 397231149 421462371 428790230 417975464
55938 417975464 391772638 355201981 313556299 271236694 231347488 195655950 164809521
55931 164809521 138745696 117057857 99175248 84462676 72336822 62329423 54052341
55924 54052341 47160789 41377921 36509752 32402451 28909689 25914391 23343579 21136498
55916 21136498 19222384 17543955 16073552 14787727 13649260 12628412 11717483 10908723
55908 10908723 10178992 9509851 8901950 8355633 7856245 7391360 6964354 6578150 6222202
55899 6222202 5887577 5579086 5300856 5044547 4802622 4579031 4376306 4185740 4000649
55890 4000649 3826559 3668552 3520856 3378340 3246247 3129111 3021331 2917723 2822719 2740522
55880 2740522 2666608 2597291 2537539 2491074 2452348 2415971 2384295 2357729 2327150 2284318 2231492
55869 2231492 2173360 2108097 2034002 1956578 1881095 1805468 1727688 1653019 1586711 1526376 1468158
55858 1468158 1413800 1365437 1320176 1275929 1236107 1202802 1172012 1141099 1114011 1093330 1074116
55847 1074116 1051577 1028128 1006906 985053 959728 934460 913132 893442 872376 852441 836423
55836 836423 821488 804400 787369 772988 758665 741792 725375 712858 702212 690611 680057
55825 680057 672920 666719 658752 651188 646278 641216 633135 624575 618589 612973 604799 596238 590362 585359
55811 585359 578466 571711 568313 567116 565839 566172 570433 576717 582431 589155 598981 609517 617513 624072
55797 624072 631337 637299 638723 636041 630710 621135 606048 588672 572699 557233 540372 524449 512774
55784 512774 504313 496539 490487 487896 486163 481290 473493 465153 455851 444327 432936 425158 420691 417432
55770 417432 416080 418274 422452 426061 429656 434347 437460 435409 428909 420966 411856 400528 388832 379484
55756 379484 371570 362574 353277 346214 340835 334598 327448 321023 314766 307051 298880 292503 287533 282147
55742 282147 276728 272687 269192 264777 260646 258688 257829 256027 254218 254414 255585 255338 254106 253776 253697 251978
55726 251978 249301 247503 245846 242611 238910 236854 235352 231852 227027 223614 221697 219251 216399 215032
55712 215032 215038 214840 214913 216974 220426 223281 225798 229561 233893 236902 239162 242551 246199 247427 245981 243670
55696 243670 240526 235170 228387 222570 218082 213669 209823 208112 207841 207064 206286 207479 210039 211570 212211
55681 212211 214423 218801 223810 229285 236325 243943 249600 253032 256007 258458 258591 256677 254974 253841
55667 253841 251546 248079 245506 244355 243161 241841 241950 243326 243953 243609 244290 246641 249220 251613 254881
55652 254881 258492 260249 259906 259611 260081 259429 256543 252545 248150 242517 235541 228492 221600 213658 204730
55637 204730 196745 190749 185993 182106 179545 177506 174145 169506 165692 163655 162301 161113 160932 161663 161940
55622 161940 161641 162090 163120 162656 159962 156807 154585 152667 150335 148009 145845 143338 140954 139990 140237
55607 140237 139944 138522 137106 136144 134765 132973 132018 132090 131919 131133 130702 130651 129729 127838 126458 126191 126149 126087
55589 126087 126702 127507 127029 125578 125200 126313 127049 126550 126184 126720 127003 126428 126217 127135 128243 128931 129996
55572 129996 131807 133578 135248 137861 141411 144652 147707 152239 158140 162738 164497 165029 166092 167090 166945
55557 166945 166101 164992 162557 158018 152493 147505 143415 140395 139149 139423 139523 138567 137662 137872 138655 139321
55541 139321 140302 141919 143473 144565 145758 147095 147602 147046 146450 146150 145268 143820 143275 144043 144466 143338
55525 143338 141415 139400 136575 132713 129226 126951 124733 121688 119017 117929 117491 116205 114244 112471
55511 112471 110628 108090 105276 102853 100617 98371 96769 96107 95500 94331 93342 93213 93305 92896 92414 92442 92747
55494 92747 93264 94688 97055 99051 99701 99494 99012 97959 96501 95959 96963 98332 98942 99295 100138 101068 101738
55477 101738 102987 105368 107796 109057 109487 109966 110382 110323 110121 109991 109224 107411 105444 104243 103548 102933 102792
55460 102792 103282 103468 102659 101527 100923 100641 100279 100152 100436 100596 100531 101045 102329 103312 103310 102941 102576 101539 99794
55441 99794 98727 99078 99718 99661 99654 100437 101149 101037 101156 102670 104819 106231 107006 107845 108336 107803 106857 106491 106571
55422 106571 106570 106782 107436 107772 107432 107602 109291 111658 113504 115156 117250 118953 119278 119037 119518 120081 119102
55405 119102 116610 114126 112391 110998 109768 108778 107458 105269 102963 101762 101652 101714 101600 101390 100637 99005
55389 99005 97305 96549 96483 96334 96382 97364 98839 99557 99090 97925 96465 95093 94602 95275 96070 95882 95080 94700
55371 94700 94871 95196 95880 97209 98653 99855 101638 104640 107730 109372 109838 110451 111261 111178 109994 108564
55355 108564 107271 105891 104799 104794 105727 106594 106951 107138 107310 107304 107220 107224 107076 106696 106598 106821 106258 104150 101533 99888
55335 99888 99116 98151 96876 95991 95641 95620 96343 98091 99848 100418 100225 100479 101092 101014 100251 99802 99848 99640 99076
55316 99076 98802 98811 98434 97778 97780 98793 100262 101754 103188 104218 104549 104671 105170 105567 104980 103577 102177 100872
55298 100872 99360 98260 98553 99966 101287 102107 102914 103716 104045 104185 104936 106189 107063 107356 107592 107716 107136
55281 107136 106021 105270 105192 105423 105947 106955 107861 107818 107117 106722 106545 105601 103844 102418 102009 102251 102790 103597
55263 103597 104172 103827 102915 102540 102998 103650 104286 105238 106136 106042 105081 104596 105378 106841 108119 108841 108738 107735
55245 107735 106585 106251 106495 106248 105425 105059 105517 105912 105619 105049 104571 103874 102870 102162 102113 102280 102109 101487
55227 101487 100488 99453 99265 100547 102512 103667 103743 103865 104754 105917 106773 107373 107755 107728 107615 108149 109282
55210 109282 110040 109948 109682 109981 110760 111585 112194 112319 111761 110942 110680 111198 111913 112195 111760 110541 108921 107869
55192 107869 107886 108042 107001 104845 102931 102172 102493 103641 105261 106368 106095 104959 104205 104004 103561 102868 102833
55175 102833 103647 104464 104884 105330 105819 105805 105481 105806 106899 107800 108188 108906 110363 111808 112774 113927 115787
55158 115787 117760 119073 119695 119783 119196 118085 117027 116103 114793 113186 112346 112978 114558 116132 117184 117508
55142 117508 117135 116607 116441 116194 115042 113270 112056 111658 111133 110010 108912 108261 107748 107414 107889 109061 109871
55125 109871 109922 109969 110360 110391 109815 109493 109808 109862 109189 108964 110412 112976 115128 116116 116093 115353 114420 114144 114830
55106 114830 115730 116010 115636 114974 114301 114128 115022 116565 117394 116827 115633 114770 114349 114321 115072 116655 118435 120062
55088 120062 121830 123536 124184 123559 122939 123374 124278 124601 124386 124235 124202 124186 124557 125343 125581 124490 122668 121283
55070 121283 120731 120897 121908 123634 125106 125475 125062 124627 124188 123457 122833 122906 123339 123196 122245 121168 120641 120692
55052 120692 120797 120278 118952 117617 117351 118167 119062 119573 120230 121138 121332 120278 118972 118611 119054 119527 119949
55035 119949 120525 120768 120109 119003 118401 118487 118820 119343 120326 121574 122524 122960 122986 122572 121694 120686 119924 119453
55017 119453 119229 119314 119478 119220 118574 118277 118696 119327 119808 120578 121904 123066 123308 122906 122533 122227 121864 122006
54999 122006 123347 125670 128111 130117 131523 132133 131885 131063 129814 127979 125865 124523 124588 125418 126020 126243
54983 126243 126438 126569 126432 126216 126134 125978 125691 125839 126842 128262 129512 130725 132286 134021 135497 136613
54967 136613 137333 137437 137112 137162 137959 138822 139048 138853 138683 138376 137825 137700 138601 140080 141292 142058 142546 142583 142115
54948 142115 141716 141833 142132 142280 142609 143202 143157 141791 139909 138869 138954 139579 140469 141609 142691 143570 144721
54931 144721 146393 148014 149402 151698 155947 161508 167137 172905 179656 187195 194517 201459 208622 215884
54917 215884 222323 227410 231012 232452 230913 226737 221106 214534 206832 198444 190556 183859 178177 173207
54903 173207 168687 164085 159324 155584 154125 154415 154624 153902 152935 152361 151976 151660 151755 152268 152786 153429 154830
54886 154830 157019 159392 161943 165454 170176 175404 180693 186456 192909 199355 205005 209764 213762 216829
54872 216829 218845 219999 220222 218859 215323 209793 203120 196370 190435 185623 181504 177405 173027 168416
54858 168416 163705 159334 156060 154142 152818 151254 149583 148292 147070 145240 143014 141239 140050 138802
54844 138802 137235 135713 134332 132811 131333 130510 130418 130523 130593 130868 131257 131305 131042 131011 131308 131352 130745 129672
54826 129672 128469 127556 127677 129290 131735 133860 135411 136887 138097 138113 136854 135548 135193 135480 135672 135672 135695
54809 135695 135668 135464 135232 135072 134864 134689 134920 135684 136717 137910 139490 141461 143419 145036 146326 147319 147959
54792 147959 148378 148800 149169 149256 149065 148680 147897 146666 145706 145957 147453 149327 150837 151837 152511 153352 155200
54775 155200 158469 162450 166133 169515 173340 177826 182644 187938 194278 201596 209188 216758 224424 231694
54761 231694 237482 241233 242982 242298 238350 231308 222684 213973 205815 198519 192296 186719 181011 175219
54747 175219 170222 166420 163461 161400 160847 161563 162143 161761 161198 161486 162473 163398 164032 164518 164811 165005 165642
54730 165642 167046 168860 170764 173197 176864 181937 188080 194852 201831 208712 215425 221725 226708 229361
54716 229361 229505 227541 223511 217481 210680 204807 199898 194270 187154 180049 174704 170951 167545 164163
54702 164163 161449 159666 158428 157414 156500 155430 154017 152487 151158 150053 149143 148635 148623 148839 149012 149053
54686 149053 148712 147652 146111 144890 144365 144120 143763 143455 143347 143221 142977 142768 142347 141125 139247 137748 137183
54669 137183 136902 136254 135616 135582 135891 135926 135678 135577 135837 136533 137714 138938 139319 138644 137859 137882 138519 139083 139342
54650 139342 139285 138656 137587 137029 137731 139216 140562 141694 143039 144365 144960 144813 144729 145193 145787 145846 145258 144489
54632 144489 144076 144077 143958 143153 141743 140271 138986 137814 136996 136962 137383 137204 135979 134435 133325 132566 132000
54615 132000 132139 133389 135165 136521 137240 137733 138308 139076 140071 140989 141319 141174 141383 142309 143274 143709 144099 145078
54597 145078 146267 146807 146501 145711 144676 143687 143352 143865 144474 144446 144065 143894 143643 142713 141444 140816 141171 142127
54579 142127 143442 145015 146228 146343 145606 145064 145182 145332 144788 143619 142478 141975 142326 143258 144249 145078 145943
54562 145943 146883 147486 147548 147540 147960 148600 149022 149299 149701 150055 150088 150091 150543 151365 152200 153147 154492 155927 156853 157342
54542 157342 158050 159174 160185 160669 160834 161040 161302 161473 161605 161902 162419 162829 162563 161398 159879 158795 158192
54525 158192 157382 155991 154426 153164 152275 151886 152312 153329 154048 154059 153947 154193 154339 153914 153367 153289 153421 153348
54507 153348 153459 154162 154737 154120 152539 151272 150989 151262 151490 151430 150982 150329 150124 150690 151244 150786 149563 148707
54489 148707 148622 148672 148390 147999 147680 147315 147083 147489 148624 150074 151651 153456 155074 155562 154588 153054 152277
54472 152277 152857 154447 156219 157478 158172 158835 159835 160836 161306 161298 161320 161668 162312 163175 164048 164508 164413 164166
54454 164166 164015 163427 161752 159203 156661 154793 153878 153972 154647 155045 154898 155005 155984 157170 157660 157789 158436
54437 158436 159387 159728 159511 159636 160236 160629 160811 161495 162492 162539 161243 159826 159399 159655 159912 160279 160980 161519
54419 161519 161420 161157 161457 162216 162832 163152 163374 163409 163097 162800 163131 164118 165197 166028 166895 168259 170158 172115
54401 172115 173479 173895 173473 172559 171485 170595 170290 170749 171763 173043 174483 175868 176631 176379 175467 174592 173982
54384 173982 173429 172915 172636 172525 172343 172159 172296 172842 173704 174959 176602 178080 178708 178563 178456 179019 180210
54367 180210 181673 183076 184241 185388 187120 189736 192808 195896 199211 202904 206133 207781 207913 207613 207423
54352 207423 206853 205391 203103 200181 196767 193367 190677 188808 187336 186068 185091 184103 182548 180504 178660
54337 178660 177389 176568 176242 176566 177021 176726 175708 175036 175386 176288 176918 176858 175946 174280 172598 171824 171991 172389
54319 172389 172835 173836 175335 176393 176444 175893 175110 173916 172516 171764 171862 171827 171013 170191 170277 170829 170826 170237 169797
54300 169797 169689 169432 168803 167990 167012 165783 164681 164386 165093 166304 167352 167826 167693 167333 167341 168032 169248 170709
54282 170709 172244 173580 174329 174411 174126 173662 172966 172167 171610 171316 170960 170608 170836 171816 172910 173541 173931 174637
54264 174637 175899 177764 180257 182954 184973 185864 186122 186453 187040 187856 189099 190763 192267 193005 192880 191978
54248 191978 190248 187998 186131 185334 185387 185727 186173 186620 186558 185634 184296 183215 182315 181011 179227 177632 176993
54231 176993 177645 179313 181083 181932 181779 181683 182481 183648 184047 183486 182767 182421 182163 181664 181170 181157 181789 182888
54213 182888 184128 185128 185588 185501 185138 184776 184439 183902 182998 181972 181379 181437 181646 181458 181127 181364 182239 183059
54195 183059 183374 183383 183172 182382 181042 180021 180067 180862 181560 181867 182089 182487 183078 183797 184425 184681 184653 184804 185216
54176 185216 185260 184434 183085 181849 180823 179870 179301 179568 180469 181258 181487 181229 180615 179674 178645 177959 177736 177563
54158 177563 176910 175722 174590 174296 175050 176237 177116 177633 178201 178832 179083 178849 178499 178076 177146 175756 174830
54141 174830 175071 175995 176615 176688 176807 177547 178942 180473 181220 180410 178258 176035 174967 175276 176463 178055 179770
54124 179770 181387 182833 184168 185276 185942 186366 187094 188275 189558 190905 192771 195152 197235 198476 199369
54109 199369 200616 202184 203689 205094 206469 207706 209103 211554 215469 220107 224700 229646 235784 242996
54095 242996 250327 256888 261786 263722 261880 257120 251368 245887 240875 236398 232790 230150 228306 227306
54081 227306 227240 227674 227979 228191 228808 229810 230520 230469 229719 228369 226419 224180 222164 220483 218866 217324 216208
54064 216208 215527 214749 213492 212002 210783 209981 209285 208357 207387 207183 208372 210404 211833 211866 211169 210869 211350
54047 211350 212547 214718 218065 221988 225536 228480 231303 234354 237697 241588 246336 251765 257346 262763
54033 262763 267929 272714 277198 281903 287200 292782 298245 303691 309060 313422 315960 317333 319041 321560
54019 321560 324098 326070 327735 329262 330240 330416 330100 329512 328397 326498 323805 320211 315519 309960 304145
54004 304145 298419 292801 287510 282833 278454 273651 268358 263385 259470 256721 254997 254078 253276 251685 249197
53989 249197 246680 244864 243603 242454 241372 240454 239571 238662 238002 237807 237835 237643 236988 235816 234228 232652
53973 232652 231673 231461 231596 231603 231417 231243 231238 231524 232329 234028 237097 241900 248280 255563 263308 271934 282301
53956 282301 294831 309404 325884 344014 362636 379364 391284 396144 393379 384474 372198 359044
53944 359044 346403 335106 325968 319205 313996 309467 305828 303803 303392 304082 305889 309072 312978 316353
53930 316353 318885 321416 324474 327599 330340 332910 335509 337862 339902 342176 345143 348668 352529 356852
53916 356852 361675 366650 371498 376315 381318 386765 393166 400788 408815 415844 421532 426945 432836 438352
53902 438352 442054 443639 443967 443792 443114 441592 439091 435819 432149 428252 423903 418887 413461 408001 402242
53887 402242 395445 387410 378757 370132 361701 353597 346162 339463 333118 326964 321431 316898 313145 309693
53873 309693 306327 302991 299539 295871 292065 288255 284618 281427 278727 276027 272854 269535 266804 264684
53859 264684 262460 259766 256879 253877 250438 246790 243911 242325 241417 240415 239334 238513 237909 237409 237168
53844 237168 237045 236270 234375 232010 230233 229346 228959 228831 229026 229503 230069 230623 231071 231174 230797 230145 229522 229077
53826 229077 228920 229135 229564 229945 230418 231398 232877 234416 235967 237994 240491 242602 243620 243733 243441 242981
53810 242981 242815 243823 246218 248938 250990 252910 255973 260328 264903 269026 273201 278205 284150 290606
53796 290606 297085 303247 309032 314721 320527 326125 330853 334379 336895 338711 340001 340952 341774 342477 342784
53781 342784 342387 341198 339365 337101 334457 331265 327350 322804 317959 313125 308549 304489 301050 297951
53767 297951 294681 290910 286642 282135 277951 274746 272593 270663 268098 264953 261786 258662 255320 252050
53753 252050 249439 247365 245261 243376 242643 243035 243254 242453 241249 240450 239807 238733 237414 236421 235884 235742
53737 235742 236171 237081 237774 237793 237596 237777 238161 238306 238322 238559 238991 239546 240526 242027 243431 244142 244371 244610 244938
53718 244938 245419 246480 248087 249257 249305 249003 249513 250720 251736 252549 253938 256005 258086 260111 262812 266374
53702 266374 269941 272816 275300 277996 280961 283925 286826 289800 292936 296158 299065 301015 301764 301986 302677
53687 302677 304121 305848 307454 308882 309992 310450 310147 309314 308206 306978 305815 304859 304131 303772 304028 304618
53671 304618 304571 303304 301572 300660 300906 301711 302723 304090 305563 306335 306092 305524 305441 305810 305992 305635 305046 304781
53653 304781 304918 304792 303727 302086 301139 301565 302623 303273 303595 304373 305818 307558 309571 312074 314563 316021
53637 316021 316287 316301 316791 317478 317938 318484 319717 321689 323911 325913 327478 328612 329566 330778 332655 335482
53621 335482 339386 344130 349094 353843 358666 364144 370300 376588 382632 388468 394054 399047 403199 406598
53607 406598 409402 411658 413415 414839 416141 417545 419170 420795 421997 422777 423749 425401 427521 429631 431524
53592 431524 432928 433242 432338 431194 430868 431100 430806 429686 428437 427487 426542 425474 424652 424120 423294 421825 420124
53575 420124 418709 417584 416517 415390 414069 412396 410550 408944 407602 406097 404236 402358 400815 399570
53561 399570 398436 397305 396079 394787 393786 393459 393727 394266 395049 396153 397114 397193 396329 395234 394567 394549 395321
53544 395321 396914 398856 400552 402121 404117 406394 408122 409055 409874 411033 412273 413707 416392 421114 427263
53529 427263 433605 439650 445670 451861 458234 465035 472652 481175 490431 500287 510637 521284 532081
53516 532081 543058 554379 566483 580121 595668 612279 628505 644028 660168 678302 698408
53505 698408 719595 741310 763370 785304 806538 827038 847211 867293 887300 907369 927573
53494 927573 947500 966536 984610 1002323 1020282 1038548 1056721 1074393 1091561 1108649 1126044
53483 1126044 1143547 1160546 1176753 1192535 1208392 1224398 1240312 1255956 1271317 1286452 1301395
53472 1301395 1315936 1329527 1341731 1352675 1362588 1370873 1376300 1378352 1377778 1375479 1371435 1365172 1356792
53459 1356792 1346962 1336151 1324403 1311780 1298596 1285238 1271942 1258639 1244884 1230190 1214543
53448 1214543 1198365 1181933 1165176 1148139 1131134 1114217 1096995 1079250 1061359 1043841 1026981
53437 1026981 1011152 996950 984576 973591 963817 955997 950901 948093 946241 944451 942738 941399 940669
53424 940669 940916 942576 945744 950273 956238 963881 973119 983546 994941 1007361 1020715 1034699 1049240
53411 1049240 1064631 1081133 1098844 1118031 1139098 1161950 1185752 1209720 1234044 1259708 1287495
53400 1287495 1317407 1349002 1382001 1416439 1452497 1490389 1530360 1572535 1616719 1662472 1709422
53389 1709422 1757332 1805897 1854746 1903826 1953504 2004011 2054870 2105171 2154240 2201786 2247515
53378 2247515 2291072 2332404 2371816 2409491 2445125 2478098 2507878 2534252 2557272 2576930 2592762
53367 2592762 2603959 2610080 2611428 2608404 2600707 2587613 2568835 2544627 2515174 2480568 2441439 2399041
53355 2399041 2354521 2308522 2261511 2214023 2166474 2119202 2072781 2027851 1984589 1942883 1902950
53344 1902950 1865045 1828468 1791717 1754084 1716394 1679707 1643902 1608108 1572082 1536566 1502607
53333 1502607 1471035 1442264 1416011 1391371 1367604 1344812 1323600 1304359 1287183 1272167 1259212
53322 1259212 1247580 1236051 1223649 1210200 1196318 1182928 1170505 1158639 1146550 1134041 1121642
53311 1121642 1109857 1098844 1089017 1081279 1076217 1073524 1072520 1072780 1073898 1075301 1076944 1079753 1084624 1091279
53297 1091279 1098778 1106947 1116507 1127847 1140467 1153875 1168474 1185134 1204155 1224907 1246416 1268162
53285 1268162 1290293 1313039 1335982 1358126 1378793 1398182 1416831 1434769 1451453 1466413 1479664
53274 1479664 1491441 1501691 1509812 1514899 1516443 1514844 1511046 1505589 1498244 1488603 1476718 1462994 1447676
53261 1447676 1430600 1411279 1389237 1364632 1338594 1312579 1287190 1261949 1236278 1210317 1184603
53250 1184603 1159458 1134919 1110882 1087080 1063251 1039553 1016459 994100 972139 950408 929100
53239 929100 908139 887009 865559 844402 824038 804146 784268 764709 746164 728825 712448
53228 712448 697012 682761 669842 658391 648725 640913 634341 628073 621528 614442 606506 597490 587520
53215 587520 576849 565584 553976 542621 531959 521755 511468 500861 490014 479144 468740
53204 468740 459413 451124 442990 434338 425593 417658 410837 404852 399389 394017 388055 381256 374230 367556
53190 367556 360923 353923 347156 341518 336734 331717 326257 321260 317238 313640 309890 306147 302749 299725
53176 299725 297240 295739 295165 294589 293121 290898 288820 287523 286856 286161 284947 283388 282072 281127 279894
53161 279894 277853 275552 274025 273547 273626 273994 274727 275381 275039 273559 271984 271264 271206 271095 270780 270564 270408 269851
53143 269851 268602 266849 265058 263709 263124 263365 264284 265684 267280 268600 269230 269245 269091 269076 269222 269602 270410
53126 270410 271603 272851 273947 274989 276026 276905 277652 278667 280298 282404 284564 286599 288716 291186 293916
53111 293916 296312 297621 297544 296445 294864 292980 290748 288354 286132 284146 282245 280546 279438 279018 278819
53096 278819 278261 277175 275820 274615 273888 273700 273720 273425 272527 271273 270323 270201 270715 271039 270630 269994 270077 270906
53078 270906 271429 270860 269563 268218 266847 265244 263753 262860 262387 261917 261702 262226 263087 263213 262215 260720 259287
53061 259287 257848 256389 255343 254948 254837 254647 254591 255058 256031 257161 258112 258626 258613 258360 258354 258711 259062 259177 259412
53042 259412 260296 261850 263468 264408 264339 263493 262325 261113 259993 259265 259199 259491 259495 259244 259629 261078 262720 263512
53024 263512 263618 263821 264132 264071 263993 264837 266520 267713 267506 266335 265031 263871 262991 262847 263690 265108 266524
53007 266524 267658 268312 268264 267749 267476 267838 268536 269154 269577 269665 269171 268325 267853 268073 268479 268608 268733 269259 269979
52988 269979 270442 270670 270977 271399 271785 272196 272781 273468 274129 274820 275575 276190 276523 276799 277349 278206 279188 280148 280941
52969 280941 281390 281554 281853 282686 284035 285573 287051 288466 289977 291640 293123 293795 293348 292204 290993 289805
52953 289805 288313 286481 284649 283029 281685 280924 281051 281739 282241 282273 282067 281517 280051 277607 275043 273265
52937 273265 272468 272402 272829 273415 273732 273683 273504 273246 272755 272221 272076 272170 271798 270797 269901 269666 269766 269719 269613 269685
52917 269685 269839 270058 270640 271515 271924 271374 270437 270097 270751 272195 274009 275440 275578 274302 272585 271358 270540
52900 270540 269730 269115 268973 268903 268464 268104 268489 269266 269553 269508 270342 272667 275695 278278 280015 281048 281458 281278
52882 281278 280713 279933 278844 277354 275746 274576 274182 274316 274368 274068 273874 274466 275835 277253 278212 278990 280148
52865 280148 281841 283910 286249 288667 290680 291812 292069 291873 291631 291482 291263 290613 289313 287601 285850 283961
52849 283961 281438 278178 274697 271504 268684 266241 264289 262695 261049 259253 257675 256497 255416 254174
52835 254174 252870 251579 250235 249109 248720 249017 249346 249506 250094 251482 253272 255098 257030 258702 259122 258115
52819 258115 256979 256809 257069 256798 256344 256658 257598 258338 259052 260748 263572 266553 269011 271035 272503 272737
52803 272737 271405 268916 265806 262482 259554 257544 256162 254700 253233 252543 252738 252855 252188 251211 250774 250986
52787 250986 251296 251209 250603 249746 249248 249673 251016 252816 254795 256983 259226 261062 262212 262786 262954 262762 262282
52770 262282 261573 260558 259326 258511 258809 260062 261238 261378 260231 258096 255564 253436 252311 252078 252081 251855
52754 251855 251471 251309 251844 253472 256039 258620 260286 261040 261624 262540 263714 264995 266389 267850 269306 270845
52738 270845 272441 273661 274154 274287 274712 275473 276150 276796 277967 279796 281733 283315 284609 285763 286645 286986
52722 286986 286454 284672 281737 278694 276744 275906 275030 273251 270859 268690 267276 266705 266706 266751 266558 266550 267284 268498
52704 268498 269413 269920 270651 271780 272673 272967 273130 273553 273903 273853 273718 273782 273631 272791 271621 270910 270906 271293 271889
52685 271889 272845 274209 275674 276788 277248 277127 276856 276799 276816 276505 275827 275089 274289 273014 271221 269616 268960
52668 268960 269246 269806 269999 269709 269444 269962 271446 273062 273839 273955 274545 276126 277933 279138 280026 281437 283552
52651 283552 285825 287820 289541 291022 292031 292234 291505 290075 288420 286919 285681 284830 284646 285062 285318 284818
52635 284818 284163 284505 285849 286983 287331 287899 289789 292634 295281 297350 299252 301036 302116 302040 300833 298657
52619 298657 295715 292511 289673 287517 286100 285555 285848 286288 285887 284392 282609 281517 281313 281472 281441 281014
52603 281014 280194 279017 277700 276809 276947 278097 279461 280190 280232 280218 280649 281538 282777 284373 286162 287674 288593
52586 288593 289149 289843 290887 292083 293164 294109 295098 296123 296715 296304 295002 293693 293045 292757 292226 291614 291511
52569 291511 291725 291309 289949 288528 287919 287882 287577 286735 285856 285522 285884 286590 286955 286516 285596 285074 285392 286081
52551 286081 286405 286138 285543 285000 284885 285420 286344 287050 287343 287754 288802 290222 291188 291102 289991 288423 287222
52534 287222 286986 287612 288467 289149 289800 290631 291536 292352 293177 294158 295237 296224 296928 297157 296932 296718 296984 297501
52516 297501 297539 296871 296067 295691 295835 296597 298277 300733 303206 305267 307379 310040 312856 314982 316009 315925
52500 315925 314666 312253 309064 305419 301296 296989 293550 291847 291386 290819 289482 287850 286593 285910 285829
52485 285829 286516 287997 289941 291883 293506 294671 295370 295688 295734 295683 295853 296450 297150 297367 297209 297653 299356
52468 299356 301639 303257 303909 304398 305453 307018 308766 310705 313023 315679 318377 320826 322849 324243 324613
52453 324613 323430 320510 316444 312290 308721 305741 303294 301668 300961 300558 299644 298103 296545 295542 295130
52438 295130 294988 294818 294612 294696 295401 296562 297512 297729 297261 296398 295185 293516 291517 289621 288393 288298 289305
52421 289305 290621 291246 290971 290448 290208 290221 290626 292105 294897 298131 300913 303704 307708 313106 318757 323703
52405 323703 328289 333644 340645 349522 359897 370830 381065 389491 395342 398014 397025 392348 384743 375621
52391 375621 366450 358152 350962 344913 340234 337058 334942 333160 331477 330145 329162 328151 327118 326641 327041
52376 327041 327955 329048 330422 331954 333042 333689 335091 338330 342965 347696 351914 355654 358454 359475 358774
52361 358774 357514 356705 356391 356145 355652 354758 353581 352712 352723 353410 354081 354595 355465 356851 358160 358926 359501 360551
52343 360551 362247 364325 366591 369048 371697 374456 377226 379937 382654 385616 389033 392895 397142 401918
52329 401918 407451 413814 421029 429242 438495 448492 458873 469584 480647 491752 502476 512782 522933
52316 522933 533044 543086 553255 563866 574970 586437 598358 611002 624437 638562 653463
52305 653463 669366 686183 703468 720802 738016 755162 772519 790482 809040 827468 844837
52294 844837 860772 875413 888769 900453 909987 917120 922020 925350 927964 930184 931592 931749 930761 928906
52280 928906 926184 922762 919371 916619 914219 911552 908763 906636 905503 904979 904648 904417 904284 904379 905178 907064
52264 907064 909668 912207 914465 917012 920590 925754 932892 942029 952641 964204 976756 990425 1004743
52251 1004743 1019108 1033619 1048638 1063687 1077598 1089705 1100130 1109030 1116398 1122519 1127742 1131805
52239 1131805 1134272 1135600 1136804 1138035 1138535 1138091 1137477 1137116 1136363 1134572 1131929 1128753 1124835 1119999 1114647
52224 1114647 1109225 1103814 1098626 1094160 1090359 1086330 1081471 1076260 1071419 1066923 1062455 1058274 1054981 1052835
52210 1052835 1051826 1051976 1053139 1054931 1057321 1060765 1065257 1069818 1073568 1076834 1080568 1085058 1089876 1094817
52196 1094817 1100203 1106401 1113615 1121995 1131437 1141316 1150782 1159216 1166183 1171273 1174339 1175627 1175397 1173695
52182 1173695 1170732 1166971 1162522 1156932 1150066 1142670 1135502 1128409 1120942 1113466 1106814 1101152 1096015 1091275
52168 1091275 1087239 1083831 1080540 1077289 1074592 1072725 1071514 1071170 1072509 1075796 1079910 1083237 1085072 1085742
52154 1085742 1085757 1085399 1084907 1084391 1083605 1082339 1081128 1080978 1082157 1083750 1084790 1085450 1086582 1088351 1089965 1090734
52138 1090734 1090738 1090325 1089564 1088490 1087307 1085996 1084259 1082310 1081194 1081761 1083795 1086832 1091351 1098210 1107226
52123 1107226 1117363 1128324 1140914 1155557 1171369 1187065 1202109 1216617 1230846 1245159 1259904
52112 1259904 1274868 1289387 1303348 1317554 1332654 1348226 1363438 1378199 1393179 1408988 1425731
52101 1425731 1443115 1460538 1477315 1493119 1508050 1522045 1534424 1544180 1550486 1552935 1551812 1548254
52089 1548254 1543585 1538165 1531352 1522787 1513119 1503174 1493148 1483101 1473601 1465124 1457284 1449316 1441008
52076 1441008 1432592 1424116 1415724 1408226 1402549 1398590 1395278 1391855 1388622 1386396 1385740 1386793 1389430 1393467
52062 1393467 1398875 1405826 1414373 1424258 1435235 1447314 1460311 1473447 1485838 1497317 1508280 1518759
52050 1518759 1528054 1535303 1540085 1542446 1542716 1541411 1539082 1536083 1532482 1528166 1523002 1516995 1510316 1503062
52036 1503062 1495021 1485986 1476353 1466993 1458340 1449906 1440875 1430891 1420068 1408634 1396877 1385029 1372810
52023 1372810 1359383 1344282 1328223 1312606 1298257 1284920 1271833 1258547 1245314 1232910 1221908
52012 1221908 1211961 1202074 1191798 1181800 1172904 1164852 1156385 1146330 1134259 1120335 1105015 1088818
52000 1088818 1072061 1054855 1037523 1020824 1005498 991764 979445 968217 957367 945670 932104
51989 932104 916715 900449 884156 867961 851436 834120 815963 797449 779147 761066 742752
51978 742752 724176 706070 689143 673405 658685 645319 633849 624381 616874 611742 609508 609906 611965
51965 611965 615006 619031 624041 629426 634270 637997 640579 642169 642575 641133 637294 631402 624663 618244
51951 618244 612659 608057 604590 602242 600808 600487 602132 606481 613319 621775 631245 641776 653867 668196
51937 668196 685212 704670 725785 748051 771457 795736 820008 843567 866387 888275 907954
51926 907954 923418 932589 933199 923113 901999 872438 838389 802677 766584 731243 698134 668211
51914 668211 641622 618408 598753 582510 569267 558985 551892 547780 546026 546188 547860 550120 552010
51901 552010 553519 555143 556442 556021 553053 547890 540950 532051 521275 509594 498069 487083 476762
51888 476762 467493 459566 452951 447931 445329 445527 447750 450902 454793 460030 467065 475833 486047 497276
51874 497276 508843 520034 530348 539246 545860 549311 549363 546592 541979 536403 530437 524517 519278 515489
51860 515489 513418 512395 511399 510055 508739 507808 507253 507072 507364 507852 507726 506205 502969 498031 491667 484544
51844 484544 477421 470523 463598 456704 450383 444922 440038 435645 432317 430533 429945 429912 430402 431791 434050
51829 434050 436685 439378 442053 444307 445369 444888 443448 442048 441184 440656 440123 439624 439453 439738 440355 441234
51813 441234 442521 444261 446072 447303 447478 446536 444836 442991 441511 440404 439295 438042 436947 436195 435464
51798 435464 434509 433837 434281 435966 438089 439650 440130 439618 438716 438170 438226 438417 438283 438045 438122 438294 437967 437115
51780 437115 436374 436225 436697 437811 439740 442509 446082 450764 456933 464333 472159 479883 487444 494708 501316
51765 501316 507154 512323 516432 518463 517533 513509 506960 498980 490879 483401 476195 468626 460940 453933
51751 453933 447644 441406 435236 430106 426536 423912 421544 419489 417907 416601 415778 416354 418665 421606 423866
51736 423866 425485 427414 430033 432924 435757 438558 441243 443578 445501 446971 447700 447608 447333 447750 449040
51721 449040 450692 452233 453473 454175 454089 453388 452601 452015 451442 450604 449518 448422 447516 446852 446413 446307 446797
51704 446797 448019 449794 451987 454944 459098 464040 468438 471080 471728 470915 469384 467843 466794 466311 466269
51689 466269 466752 467751 468430 467459 464401 460171 455856 451759 447933 444854 442782 441038 438709 435847 433345
51674 433345 431788 430928 430114 428834 427016 425229 424424 425220 427600 431476 437047 444316 452599 460884 468290
51659 468290 473961 477124 477699 476364 473594 469331 464157 459992 458735 460621 464692 470386 477646 485819
51645 485819 493544 499728 503675 504353 500605 492492 481731 470483 460161 451382 444331 438783 434285 430665
51631 430665 428188 427118 427386 428621 430195 431330 431623 431389 431149 430880 430227 429199 427967 426119 422901 418388
51615 418388 413660 409559 405852 401947 397904 394361 391814 390350 389779 389694 389611 389346 389174 389523 390639 392602
51599 392602 395395 398878 402972 408003 414631 423271 433745 445505 457892 470041 480777 488872 493356
51586 493356 493711 490145 483854 476732 470494 466055 463715 463608 465758 469919 475725 483069 492186 503284
51572 503284 516142 530110 544502 558986 573604 588459 603430 618196 632421 645964 659109
51561 659109 672748 688203 706715 729079 755723 786844 822040 859722 897061 930786 958330
51550 958330 978480 991103 996310 993970 984013 966955 943802 915543 883102 847731 811033 774449
51538 774449 739075 706020 676506 651297 630297 612988 599068 588442 580776 575232 570540 565305
51526 565305 558626 550569 541831 532855 523594 514173 505223 497266 490211 483767 478002 473124 468974 465056
51512 465056 460900 456262 451279 446558 442649 439222 435297 430542 425787 421883 418735 415943 413709 412337
51498 412337 411382 410222 409150 409020 409903 410894 411231 410931 410366 409949 410282 411905 414611 417444 419524 420617
51482 420617 420980 421064 421284 421593 421339 420001 417980 416166 414842 413587 412236 411240 410892 410741 410022 408325 405662
51465 405662 402237 398341 394297 390382 386918 384322 382774 381872 380888 379368 377290 374880 372610 371173 371045
51450 371045 372114 374056 376958 381176 386790 393588 401463 410404 420305 431178 443329 456686 470074
51437 470074 481756 490727 497147 501793 505741 510303 516228 522587 527009 527374 523084 514871 504062 492166
51423 492166 480495 469737 459994 451317 443934 438005 433500 430249 427760 425171 421962 418671 416303 415046
51409 415046 414150 413099 412211 411939 412165 412495 412796 413195 413906 415205 417257 419923 423034 426769 431327 436312
51393 436312 441059 445618 450838 457357 465005 473290 481984 491243 501705 514556 530908 550992 574431
51380 574431 601245 631956 666695 705009 746648 791742 839932 890011 940588 990183 1036340
51369 1036340 1075622 1105251 1124296 1132838 1130692 1117601 1094146 1061708 1021869 976408 927489 877097
51357 877097 826396 776125 727457 682018 641164 605522 574978 548811 526100 506382 489750
51346 489750 476117 464737 454731 445750 437790 430756 424585 419438 415327 411875 408910 406911 406343 406787
51332 406787 407344 407802 408798 410806 413447 415827 417203 417276 416222 414572 412821 411001 408730 405693 402008
51317 402008 398154 394640 391720 389395 387745 387144 387926 389821 391974 393646 394693 395330 395754 396123 396575 397040
51301 397040 397204 396829 395952 394720 393275 391831 390539 389126 386991 383864 380188 376776 374343 373379 374025
51286 374025 375786 377748 379425 381206 383783 387355 391599 396221 401228 406757 412751 418724 423797 427173
51272 427173 428663 428692 427957 427221 427175 428010 429220 430347 431787 434221 437362 440012 441536 442432 443175 443279 442008
51255 442008 439386 435963 432126 428105 424235 420634 416963 413042 409386 406603 404523 402414 400000 397826
51241 397826 396700 396948 398123 399302 399857 399995 400287 400771 401050 401227 401976 403535 405379 407179 409196 411266
51225 411266 412324 411717 410276 409211 408519 407365 405549 403598 401713 399694 397834 396923 397262 398381 399818
51210 399818 401562 403656 405949 408321 410718 412942 414868 416820 419292 422305 425433 428409 431282 434101
51196 434101 436843 439517 441869 443226 443155 442185 441304 440799 440110 438716 436663 434324 432255 431187 431472 432441
51180 432441 432908 432450 431703 431326 431275 431241 431302 431859 433215 435322 437648 439272 439561 438803 437803 436821 435394 433289
51162 433289 431148 429965 430270 431872 433942 435242 434797 432744 430228 428214 426565 424545 421928 419329 417517
51147 417517 416677 416332 415827 414818 413323 411459 409371 407447 406322 406376 407333 408524 409440 409933 410139 410477 411437
51130 411437 413075 414886 416444 417899 419499 420996 422035 422852 423936 425173 426050 426687 427929 430232 433040
51115 433040 435515 437386 438919 440540 442718 445727 449137 451897 453292 453655 453921 454722 456096 457755 459339
51100 459339 460561 461428 462244 463296 464649 466287 468163 469888 470668 469968 468166 466271 464960 464147 463515 463158
51084 463158 463431 464339 465438 466416 467439 468701 469869 470396 470322 470348 470988 472022 472924 473575 474325 475580 477532
51067 477532 480121 483130 486523 490719 496280 503262 511322 520563 531735 545264 560653 577234 594973
51054 594973 613817 632616 649436 662976 673225 680933 687041 692531 698144 703944 709391 713821 716680
51041 716680 717517 716192 712995 708155 701473 692875 683189 673896 666197 660676 657461 655872 653999 649558
51027 649558 641621 631159 619818 608673 598223 588912 581174 575264 571351 569617 570133 572848 577777
51014 577777 584985 594313 605299 617353 629848 642183 654101 665833 677606 689105 699787 709562
51002 709562 718664 726883 733463 737836 740039 740393 739188 736717 733180 728476 722461 715477 708358 701960
50988 701960 697061 694512 694877 697833 702420 707987 714539 722283 731457 742623 756419 772677 790212
50975 790212 807653 824181 839519 853955 868645 885354 905363 928873 955602 985613 1019301
50964 1019301 1056841 1097914 1141874 1188229 1237173 1289457 1345242 1403119 1460789 1516688 1570397
50953 1570397 1621566 1669302 1712874 1752272 1787623 1818638 1845126 1867604 1886943 1903718 1918303
50942 1918303 1931378 1944015 1957378 1972330 1988810 2005308 2019389 2029163 2034179 2034847 2031481 2024189
50930 2024189 2013227 1999010 1981843 1961717 1938120 1909978 1876215 1836556 1791496 1741560 1687217
50919 1687217 1629617 1570655 1511861 1453786 1396833 1342083 1290670 1242875 1198531 1157958 1121771
50908 1121771 1089912 1061501 1035639 1011836 989711 968846 949137 930881 914270 899020 884723
50897 884723 871498 860063 851012 844113 838544 833880 830459 828530 827429 826182 824633 823367 822628 822082
50883 822082 821667 821859 822935 824738 827432 831666 837590 844428 851580 859460 868645 878825 889312 900163
50869 900163 912037 925206 939396 954441 970518 987888 1006880 1027996 1051572 1077442 1105344
50858 1105344 1135466 1168311 1204289 1243827 1287594 1336188 1389841 1448820 1513805 1585466 1664010
50847 1664010 1749546 1842439 1942663 2049233 2161005 2277742 2399536 2525266 2652448 2778541
50837 2778541 2901538 3019187 3128505 3226489 3310894 3380264 3433986 3472732 3498273 3512435 3516641
50826 3516641 3512806 3504152 3494495 3486834 3482974 3484209 3491671 3505853 3526097 3550711 3577269 3602680 3623172
50813 3623172 3634625 3633176 3615810 3580787 3527805 3457731 3371881 3271416 3157485 3031895 2897450
50802 2897450 2757613 2616046 2476409 2342022 2215236 2097286 1989007 1891396 1805124 1729893
50792 1729893 1664859 1609437 1563052 1524393 1491878 1464956 1444033 1428918 1418196 1410486 1405408 1402714
50780 1402714 1401213 1399363 1396479 1392653 1387868 1381918 1374993 1367610 1359947 1351698 1342472 1331952 1319780
50767 1319780 1305658 1289502 1271325 1251257 1230024 1208966 1189080 1170215 1151604 1132900 1114368
50756 1114368 1096448 1079740 1065185 1053613 1045108 1039196 1035487 1033808 1034063 1036494 1041889 1050969 1063710
50743 1063710 1079702 1098897 1121443 1147079 1175441 1206874 1242122 1281206 1323314 1367967 1415591
50732 1415591 1466714 1521174 1578466 1638350 1700674 1764774 1829433 1893482 1956395 2018332 2079455
50721 2079455 2139062 2195516 2247175 2293147 2332797 2364847 2387502 2399446 2400353 2390687 2371766 2346117
50709 2346117 2317171 2288259 2261988 2240366 2224917 2216434 2214982 2220253 2231629 2247825 2266872 2286559
50697 2286559 2304552 2318038 2323809 2319192 2302927 2275036 2236058 2186576 2127410 2060141 1987410 1912540
50685 1912540 1838547 1767380 1700028 1637191 1579723 1528616 1484783 1448758 1420413 1399132 1384366
50674 1384366 1375858 1373289 1376225 1384742 1399558 1420846 1447108 1475796 1504975 1533841 1561930 1588647
50662 1588647 1613677 1637081 1658648 1677661 1693632 1706930 1718430 1728892 1738845 1748657 1758295 1767190
50650 1767190 1774752 1781095 1787136 1793970 1802253 1812258 1824473 1839818 1858984 1881714 1907170 1935097
50638 1935097 1966068 2000404 2037338 2075601 2114369 2153267 2191952 2230227 2268131 2305364 2341082
50627 2341082 2374831 2407251 2439190 2470653 2501314 2531033 2558098 2577095 2580581 2564139 2529430
50616 2529430 2482331 2429258 2375609 2325931 2283575 2249964 2224964 2207935 2198023 2193786 2193376 2195250
50604 2195250 2198318 2201321 2202415 2199462 2190552 2174241 2149538 2115965 2073854 2024557 1969982 1911655
50592 1911655 1850433 1787343 1724260 1663101 1604533 1548099 1493597 1441642 1392791 1346874 1303518
50581 1303518 1262895 1225679 1192614 1164262 1140727 1121416 1105484 1092648 1083231 1077415 1074949 1075653
50569 1075653 1079566 1086391 1095362 1105954 1118166 1131848 1146370 1161350 1177209 1194570 1213504 1233742
50557 1233742 1255220 1278001 1302072 1327640 1355234 1385075 1416644 1449244 1482635 1516576 1550099
50546 1550099 1581946 1611682 1639935 1667484 1694588 1721272 1747968 1775653 1805419 1837937 1873344
50535 1873344 1911648 1953157 1998312 2047231 2099717 2155730 2215624 2280006 2349728 2425920 2509501
50524 2509501 2600497 2698153 2801562 2909630 3020493 3131774 3241607 3348698 3451085 3545565
50514 3545565 3628815 3698465 3752750 3789820 3808165 3807337 3787705 3749806 3694481 3623305 3538422 3442351
50502 3442351 3338439 3231062 3124730 3023184 2929662 2847445 2779296 2726630 2689934 2669752
50492 2669752 2666473 2679211 2705662 2743107 2788868 2839622 2890786 2936850 2972120 2991343 2990435 2967154
50480 2967154 2921249 2854073 2768231 2667340 2555612 2437443 2317290 2199407 2087101 1982217
50470 1982217 1885470 1797018 1716422 1642544 1574240 1511181 1453569 1401207 1353314 1309171 1268504
50459 1268504 1231408 1198480 1170893 1149628 1134428 1123923 1116846 1112733 1111545 1113175 1117465 1124179
50447 1124179 1132825 1142929 1154584 1168320 1184395 1202731 1223571 1247433 1274001 1301516 1327675
50436 1327675 1350909 1370560 1386297 1397796 1404841 1407458 1406198 1402465 1398197 1394753 1392228 1390104 1388328
50423 1388328 1387421 1387716 1389058 1391356 1395120 1401319 1410855 1424312 1442099 1464699 1492557 1525622 1563112
50410 1563112 1604096 1648451 1696930 1750082 1807315 1867274 1928787 1990946 2052404 2111294 2166131
50399 2166131 2216356 2261704 2301329 2333859 2357998 2372561 2376102 2367141 2345079 2310564 2264875 2209346
50387 2209346 2145702 2076640 2005504 1935247 1867846 1804613 1746757 1695584 1652309 1617709 1591857
50376 1591857 1574293 1564616 1562844 1568933 1581978 1600078 1620944 1642299 1661699 1676389 1683728 1681780
50364 1681780 1669635 1647464 1616470 1578566 1535795 1489942 1442652 1395679 1350799 1309382 1272079
50353 1272079 1239020 1210355 1186482 1167508 1152588 1140117 1128569 1116607 1102358 1083547 1059229
50342 1059229 1031004 1001729 973275 946269 921570 900591 883944 870836 860324 852302 846830 843363
50330 843363 841334 840876 842273 845191 849052 853713 859164 865001 870849 877003 883989 891795 900053 908693
50316 908693 917773 926954 935766 944199 952393 960001 966537 972178 977530 982680 987227 991275 995619 1000733
50302 1000733 1006185 1011333 1016197 1021314 1027006 1033028 1038874 1044378 1050049 1056599 1064013 1071455 1078299 1084773
50288 1084773 1090938 1095452 1096202 1092217 1084352 1074173 1062903 1051520 1041049 1032227 1025304 1020414 1017820
50275 1017820 1017646 1019735 1023867 1029729 1036612 1043685 1050847 1058871 1068430 1079273 1090550 1101614 1112343
50262 1112343 1123108 1134714 1148006 1163178 1179700 1197150 1215790 1235962 1257216 1278452 1298789
50251 1298789 1317892 1335534 1351340 1365133 1377261 1388320 1398651 1408256 1417059 1424957 1431425 1435311
50239 1435311 1435360 1431000 1422407 1409897 1393745 1374838 1355095 1336763 1321325 1309233 1300334 1294099 1289601
50226 1289601 1285653 1280880 1273380 1260785 1241526 1216229 1187497 1158181 1130063 1103784 1079260 1056035
50214 1056035 1033856 1013112 994254 976805 959675 942687 927056 913892 902775 892313 881699
50203 881699 871162 861220 852054 843542 835424 827442 819617 812311 805782 799823 794096 788634 783664 779104
50189 779104 774675 770408 766635 763439 760548 757872 755729 754293 753180 751928 750707 750168 750626 751737 753034
50174 753034 754423 755940 757380 758565 759806 761657 764178 766846 769220 771278 773006 774209 775060 776378
50160 776378 778845 782199 785642 788859 792202 796075 800662 806129 812626 820144 828832 839375 852463 867838
50146 867838 884360 901125 918131 935924 955179 976759 1001565 1029987 1061791 1096658 1134417
50135 1134417 1174575 1216138 1258215 1300463 1342751 1384734 1425954 1466006 1504348 1540180 1572598
50124 1572598 1600338 1621284 1632842 1633333 1622723 1601854 1571609 1533283 1489135 1441725 1392925 1344108
50112 1344108 1296919 1253051 1213335 1177716 1146079 1118464 1094482 1073222 1053813 1035490 1017107
50101 1017107 997435 976419 955547 936489 919745 904972 892050 881135 871941 863775 856349 849979
50089 849979 844872 840747 837355 834859 833357 832411 831474 830572 830139 830338 831028 832308 834592 837995 842140 846792
50073 846792 852327 859221 867312 875902 884461 892977 901784 911308 921778 932765 943081 951598 958266
50060 958266 963962 969244 973603 976204 977049 977008 976735 975910 973744 970048 965598 961395 957774 954322 950505
50045 950505 946210 941848 938266 936494 937119 939815 943831 949094 956403 966344 978445 991710 1005552 1019825
50031 1019825 1034427 1049544 1065931 1084207 1103856 1123619 1142927 1162412 1182953 1204746 1227426
50020 1227426 1250597 1273964 1297328 1320589 1343517 1365426 1385367 1402675 1417124 1428688 1437641
50009 1437641 1444833 1451302 1457447 1462899 1467073 1469216 1467900 1461267 1448177 1428727 1403593 1373453 1339313
49996 1339313 1302697 1265036 1227270 1190263 1154986 1121847 1090452 1060595 1032967 1008214 985702
49985 985702 964003 942450 921530 901829 883308 865736 849268 834301 821064 809519 799482
49974 799482 790719 783004 776126 769872 764122 759022 754821 751411 748276 745079 742015 739377 737134 735300
49960 735300 734427 735257 737927 741963 747044 753380 761291 770683 781037 791757 802406 812565 821452 827839
49946 827839 830817 830808 829461 828214 827170 825545 822752 818564 812610 804508 794615 784072 773894 764221
49932 764221 754470 743917 732144 719365 706474 694522 683984 674667 666353 659290 653964 650600 648986
49919 648986 648673 649281 650704 653035 656204 659780 663355 667077 671564 677152 683502 690052 696739 704112 712788
49904 712788 722927 734167 745844 757211 767561 776460 783980 790653 796973 802933 808031 811634 813179
49891 813179 812115 807996 800747 790753 778658 765219 751258 737506 724361 712022 700851 691320
49879 691320 683484 676718 670156 663271 656063 648914 642356 636779 632279 628904 626926 626534 627294 628424 629751
49864 629751 631973 635749 640926 646974 653827 661970 671947 683983 697737 712122 725752 737950 749022
49851 749022 759188 767654 773380 776520 778456 780301 781850 782108 780429 776899 771787 764884 755578 743783
49837 743783 730744 718552 708632 700929 694663 689390 685030 681394 678362 676304 675728 676526 678060 680004
49823 680004 682655 686444 691538 697926 705522 714143 723618 733841 744419 754462 763144 770396 776638
49810 776638 782002 786317 789711 792515 794440 794545 792251 787908 782158 775262 767366 758933 750446 742019
49796 742019 733685 725793 718677 712180 705989 700266 695399 691143 686645 681607 677028 674328 673882 674777 675997
49781 675997 677411 679419 682018 684685 687128 689727 693073 697356 702398 708047 714219 720707 727194 733447
49767 733447 739302 744508 748786 752046 754389 755861 756324 755593 753565 750141 745057 738003 729158 719569 710610
49752 710610 702744 695054 686470 677306 668973 662205 656325 650575 645331 641347 638379 635509 632662 630854
49738 630854 630768 631787 632773 633326 633910 635025 636675 638584 640672 643236 646707 651254 656662 662640 669134
49723 669134 676295 684256 693035 702530 712410 722100 731067 739133 746422 752982 758512 762392 764070 763508
49709 763508 761212 757538 752160 744658 735622 726531 718299 710566 702819 695627 690113 686591 684429 683050
49695 683050 682425 682621 683556 685309 688181 692291 697428 703347 709929 717026 724425 731969 739499 746815 753969
49680 753969 761509 770156 780275 791886 804967 819443 835070 851550 868444 884529 897570 905480
49668 905480 907789 905695 900853 894598 888081 882349 878000 875140 873686 873306 873133 872021 869185 864191 856454
49653 856454 845394 831318 815685 800221 785980 773270 762060 752296 744032 737403 732327 728411
49641 728411 725457 723851 724020 725656 727986 730662 733748 736770 738512 738035 735437 731410 726462 720872 715020
49626 715020 709451 704650 700755 697350 693696 689514 685433 682282 680105 678341 676809 675903 675789 676048 676252
49611 676252 676355 676429 676475 676614 677032 677681 678489 679756 681804 684239 686245 687650 689032 690628 691914 692479 692651
49594 692651 692995 693810 695290 697454 699657 700931 701260 701784 703270 705114 706378 707092 707767 708216 707877 707064
49578 707064 707013 708534 711165 713742 715532 716804 718518 721421 725347 729602 734063 739482 746473 754624 762978
49563 762978 771119 779527 789034 800095 812235 824012 833876 841229 846318 849135 849168 846463 842127 837202
49549 837202 831708 825476 819323 814534 811468 809499 808152 807532 807641 807994 808128 808023 807911 807998 808426 809216 810227
49532 810227 811429 813247 816471 821883 830017 840986 854307 869110 884902 902083 921625 944334
49520 944334 970306 998519 1026609 1051504 1070810 1083586 1089896 1090358 1086562 1081212 1076872 1074523 1073711
49507 1073711 1073723 1074025 1073832 1072060 1067837 1060619 1049933 1035644 1018583 1000493 983089 967277 953111
49494 953111 940176 928100 917048 907638 900100 893702 887423 881128 875685 871976 870155 869890 870861 872882
49480 872882 875743 879081 882407 885409 888284 891507 895040 898082 899928 900828 901620 902727 904001 905395 907278
49465 907278 909975 913330 916791 919762 921926 923489 925017 926777 928269 928647 927572 925446 922837 919897
49451 919897 916353 911958 906885 901680 896810 892378 888386 885033 882419 880275 878568 878201 880278 884581
49437 884581 889683 894743 900278 906782 913681 920364 927314 935253 943803 952050 959952 968178 976863 985483
49423 985483 993784 1002038 1010589 1019836 1030125 1040548 1048145 1049651 1044400 1034812 1024054 1014058 1005624
49410 1005624 999156 994799 992649 993219 997136 1004206 1013441 1024156 1036448 1050504 1066189 1083421 1102184
49397 1102184 1121875 1141368 1159998 1177890 1195114 1211232 1225915 1239275 1251248 1261301 1269129
49386 1269129 1275006 1279049 1280714 1279434 1275278 1268619 1259666 1248704 1236335 1223088 1209223 1195283 1182427
49373 1182427 1171810 1163922 1158684 1155698 1154228 1153534 1153627 1155224 1158630 1163154 1167949 1172755 1177297 1180524
49359 1180524 1181256 1179379 1175832 1171513 1166646 1161076 1154767 1148099 1141850 1136681 1132459 1128408 1124184 1120373
49345 1120373 1117671 1116054 1115204 1115238 1116322 1117857 1118802 1118844 1118632 1118682 1118452 1116683 1112512 1106178 1098778 1091420
49329 1091420 1084639 1078695 1074265 1072450 1074079 1079316 1088044 1100184 1115483 1133444 1153660 1175587 1197520
49316 1197520 1216268 1228569 1232935 1230056 1221865 1210529 1197782 1184358 1169994 1154371 1137970 1121803
49304 1121803 1106585 1092657 1080385 1070042 1061387 1053989 1048005 1044068 1042255 1041615 1040901 1039521 1037664
49291 1037664 1035787 1034153 1032647 1030902 1028651 1025996 1023198 1020235 1016725 1012336 1007176 1001878 997320 994149
49277 994149 992408 991713 991885 993255 996234 1000745 1006301 1012470 1019096 1026172 1033652 1041297 1048553 1054706 1059273
49262 1059273 1062092 1063128 1062632 1061606 1061600 1063664 1067854 1074058 1082727 1094147 1107434 1121047 1134121 1146418
49248 1146418 1156949 1163556 1164306 1158903 1148530 1134813 1119219 1102911 1086674 1071010 1056455 1043489
49236 1043489 1032080 1021735 1012358 1004729 999741 997324 996533 996609 997667 1000367 1005184 1012011 1020295 1029489
49222 1029489 1039384 1049955 1060884 1071522 1081516 1091122 1100498 1108868 1114981 1118508 1120531 1122415 1124629
49209 1124629 1127014 1129849 1133990 1140009 1147747 1156910 1167720 1180640 1195739 1212633 1230891 1250139
49197 1250139 1269825 1289258 1308006 1326044 1343424 1359934 1375257 1389348 1402486 1414906 1426439
49186 1426439 1436585 1444945 1451596 1457062 1462042 1467260 1473441 1481105 1490383 1501349 1514683 1531679 1553406
49173 1553406 1580135 1611813 1648688 1690861 1737262 1785436 1832202 1874121 1907680 1930103 1940697
49162 1940697 1941275 1935018 1924998 1913596 1902524 1892774 1884575 1877722 1871870 1866506 1861082 1855603 1850998
49149 1850998 1848485 1848542 1850711 1854431 1859745 1867047 1876278 1886597 1897036 1907427 1918556 1931270 1945526
49136 1945526 1960426 1975120 1989569 2004462 2020550 2037936 2055878 2073312 2089719 2105382 2120772
49125 2120772 2135978 2150995 2166171 2181884 2198064 2214591 2232064 2251509 2273312 2297075 2322647
49114 2322647 2350683 2382092 2417642 2458493 2506495 2563446 2630447 2708519 2799346 2904256 3021597
49103 3021597 3144966 3264785 3373330 3469827 3560448 3651210 3738911 3808903 3843140 3832134 3780959
49092 3780959 3705032 3619893 3532932 3442548 3344132 3236919 3125746 3017516 2917342 2827945
49082 2827945 2750828 2686459 2633863 2591290 2557314 2530602 2509059 2490348 2473358 2458364 2445626
49071 2445626 2434546 2424321 2414691 2405726 2397416 2389826 2383287 2378072 2373987 2370397 2366596 2362230 2357533
49058 2357533 2353061 2348980 2344884 2340563 2336667 2334139 2333226 2333568 2335114 2338239 2342913 2348477 2354481 2361213
49044 2361213 2369013 2377337 2384763 2389757 2391243 2388729 2382361 2373012 2362208 2351689 2342788 2336145 2332083
49031 2332083 2331109 2333593 2338934 2345586 2352260 2358748 2365310 2371755 2377591 2382627 2386766 2389564 2390732 2390894
49017 2390894 2391144 2391921 2392968 2394338 2396684 2400488 2405605 2411686 2418448 2425502 2432498 2439605 2447291 2455488
49003 2455488 2463570 2471247 2478864 2486583 2493908 2500381 2506284 2512206 2518221 2523818 2528390 2531589 2533499 2534643
48989 2534643 2535625 2536592 2537284 2537583 2537655 2537512 2536840 2535346 2532863 2529105 2523841 2517439 2510663 2503712 2495959 2486844
48973 2486844 2476500 2465237 2452976 2439640 2425698 2411949 2399022 2387341 2377182 2368443 2360800 2354399
48961 2354399 2350049 2348412 2349420 2352810 2358698 2367121 2377444 2388858 2401244 2415018 2430364 2447138
48949 2447138 2465346 2485053 2505797 2526512 2546112 2563948 2579904 2594488 2608746 2623688 2639749
48938 2639749 2657064 2676070 2697459 2721588 2748293 2777227 2808091 2840654 2874947 2911404 2950415
48927 2950415 2991683 3034326 3077658 3121735 3167220 3215014 3265889 3320030 3376845 3435368 3494825
48916 3494825 3554651 3614245 3673199 3731762 3790596 3849959 3909427 3968437 4026639 4083591 4138588
48905 4138588 4191170 4241574 4290384 4337788 4383486 4427216 4469177 4509767 4548970 4585930 4619158
48894 4619158 4647306 4669937 4687656 4701549 4712542 4721208 4727922 4733035 4736919 4739919 4742175 4743394 4742833
48881 4742833 4739680 4733552 4724523 4712670 4697747 4679456 4657922 4633555 4606384 4575843 4541379 4503064
48869 4503064 4461422 4416931 4370020 4321332 4271559 4221049 4169960 4118703 4067859 4017749 3968571
48858 3968571 3920885 3875294 3831551 3788638 3746039 3704342 3664244 3625615 3588073 3551959 3518065
48847 3518065 3486693 3457653 3431009 3407193 3386494 3368960 3354751 3343982 3336200 3330564 3326643 3324619
48835 3324619 3324667 3326634 3330424 3336261 3344295 3354253 3365596 3377794 3390418 3403361 3417065 3432188 3448853
48822 3448853 3466450 3484305 3502258 3520470 3538996 3557807 3577021 3596805 3617061 3637329 3657019
48811 3657019 3675802 3693922 3712061 3730658 3749387 3767559 3785082 3802755 3821603 3842223 3864722
48800 3864722 3888861 3914021 3939437 3964732 3989976 4014994 4038911 4060724 4080193 4097897 4114571
48789 4114571 4130636 4146126 4160747 4174074 4186017 4196946 4206966 4215171 4220050 4220750 4217572 4211155
48777 4211155 4201683 4189238 4174485 4158377 4141159 4122104 4100422 4076133 4049899 4022231 3993131
48766 3993131 3962284 3929334 3894021 3856391 3816947 3776395 3735192 3693448 3651192 3608505 3565466
48755 3565466 3522358 3480018 3439553 3401429 3365101 3329839 3295619 3262858 3231494 3200848 3170428
48744 3170428 3140500 3111833 3085248 3061440 3040862 3023476 3008768 2996126 2985166 2975773 2968011 2962000
48732 2962000 2957690 2954793 2953132 2952989 2954799 2958447 2963173 2968233 2973402 2978739 2984168 2989456 2994463 2999352
48718 2999352 3004669 3011152 3019101 3027813 3035966 3042709 3048178 3052938 3057304 3061362 3065218 3068893 3072287 3075519
48704 3075519 3079050 3083188 3087715 3092330 3097166 3102462 3107928 3112944 3117361 3121741 3126778 3132721 3139255 3145599
48690 3145599 3150815 3154472 3157060 3159400 3161674 3163451 3164762 3166597 3170039 3175177 3181210 3187313 3193014 3197852
48676 3197852 3201211 3202732 3202737 3202077 3201530 3201325 3201082 3200140 3198052 3194918 3191315 3187755 3184056 3179149 3171587 3160310
48660 3160310 3145007 3125934 3103578 3078486 3051089 3021415 2989065 2953815 2916369 2878380 2841596
48649 2841596 2806933 2774359 2743601 2714779 2688304 2664212 2641812 2620125 2598554 2577037 2555699
48638 2555699 2534649 2514064 2494103 2474633 2455322 2436101 2417262 2398941 2380747 2362097 2342711
48627 2342711 2322592 2301849 2280829 2260188 2240523 2222068 2205009 2189780 2176644 2165184 2154703
48616 2154703 2145122 2137085 2131217 2127643 2126130 2126257 2127309 2128413 2128892 2128326 2126355 2122818 2118038 2112610 2106921
48601 2106921 2101294 2096480 2093351 2091937 2091243 2090207 2088376 2085586 2081629 2076619 2071114 2065357 2058773 2050676
48587 2050676 2041090 2030406 2018648 2005779 1992515 1979996 1968567 1957455 1945931 1934338 1923692
48576 1923692 1914551 1906638 1899468 1893139 1888406 1886062 1886274 1888518 1892075 1896427 1901204 1906045 1910608 1914502
48562 1914502 1916971 1916854 1913193 1905846 1895326 1882139 1866595 1849324 1831712 1815507 1801823 1790436
48550 1790436 1780105 1769658 1758702 1747193 1734624 1720188 1703782 1686442 1669453 1653309 1637712
48539 1637712 1622354 1607422 1593530 1581316 1570911 1561704 1552940 1544704 1538005 1533669 1531508 1530888 1531735
48526 1531735 1534688 1540580 1550118 1563753 1581400 1602497 1626598 1653334 1681064 1705860 1722698 1728000
48514 1728000 1721073 1703789 1679732 1653364 1628665 1607843 1591440 1579638 1572923 1571491 1574738 1581683
48502 1581683 1591459 1603313 1616705 1631734 1648986 1668710 1690483 1713729 1737610 1759678 1775185
48491 1775185 1778893 1768179 1744418 1711663 1674388 1636201 1599620 1566138 1536289 1509941 1486774
48480 1486774 1466569 1449151 1434229 1421430 1410476 1401289 1393883 1388115 1383444 1378994 1374165 1369379 1365880
48467 1365880 1364417 1364320 1364401 1364598 1366010 1369264 1373729 1378646 1384219 1390873 1398058 1404522 1409471 1412815 1414628
48452 1414628 1414992 1414118 1412004 1408195 1402486 1395596 1388504 1381381 1373845 1365949 1358061 1349890 1340583 1329858
48438 1329858 1318305 1306423 1294094 1281199 1268192 1255872 1244968 1235924 1228582 1222114 1215744 1209458
48426 1209458 1203564 1197806 1191616 1185045 1178656 1172577 1166431 1160146 1154041 1148152 1142333 1136976 1132665 1128961
48412 1128961 1124465 1118371 1111236 1104060 1097446 1091810 1087469 1084065 1080627 1076585 1072175 1067668 1062864 1057654
48398 1057654 1052426 1047702 1043863 1041310 1040265 1040280 1040549 1040707 1040699 1040074 1038261 1035575 1033039 1031208 1029939 1029228
48382 1029228 1029243 1029577 1029546 1029252 1029363 1029850 1030053 1029913 1030015 1030461 1030984 1031994 1034081 1036614 1038497 1040292 1043717
48365 1043717 1048902 1054163 1059018 1065406 1075225 1088473 1104538 1123446 1144872 1167678 1191288 1215800
48353 1215800 1239739 1259544 1272522 1279091 1281325 1280965 1279707 1279618 1281927 1286635 1293973 1304788 1318998
48340 1318998 1335479 1354153 1376315 1402504 1432196 1465960 1505373 1550355 1599453 1653227 1714210
48329 1714210 1783070 1858564 1942027 2037785 2148233 2273210 2415460 2581442 2775317 2998476
48319 2998476 3257818 3568867 3949303 4418227 5005825 5754408 6703531 7881535 9314557
48310 9314557 11028836 13034766 15323326 17882886 20673898 23523450 26040326 27704023
48302 27704023 28117742 27218336 25268380 22677854 19832992 17026068 14448855 12198171
48294 12198171 10293632 8712511 7418241 6368007 5515315 4819788 4252677 3790602 3410402
48285 3410402 3093577 2829627 2610794 2427594 2272030 2140367 2029528 1934552 1852066 1782282
48275 1782282 1724839 1676048 1632672 1595228 1565048 1540846 1520411 1503147 1488873 1476393 1465105
48264 1465105 1455971 1449394 1444248 1440212 1438727 1440344 1443464 1447010 1452013 1459189 1467310 1475409 1484363 1494686
48250 1494686 1504761 1512632 1517554 1518451 1513108 1500750 1483725 1465050 1445888 1426701 1408954 1393887
48238 1393887 1381073 1369786 1360515 1353766 1348752 1344609 1341602 1339855 1338207 1335650 1332637 1329768 1326411
48225 1326411 1321811 1316350 1310556 1304105 1296803 1289210 1281144 1270986 1257688 1242172 1225537 1207292 1186740
48212 1186740 1164761 1142699 1120531 1097570 1074016 1050538 1027297 1004588 983393 964044 945393
48201 945393 926601 908620 892623 878142 864232 851311 840142 829992 819630 809421 800616 793122
48189 793122 785744 778280 771643 766068 760753 755261 749922 744952 740392 736811 734818 733860 732624 730594
48175 730594 728270 725969 723489 720959 718990 717801 716946 715954 714620 712783 710589 708889 708648 709840 711378
48160 711378 712185 712041 711567 711635 712506 713371 713210 712230 711743 712301 712887 712472 711460 710858 710836 710963 711031 710791 709652
48141 709652 707725 706460 707055 708743 709791 709803 709858 710674 711869 712938 713899 714901 716073 717755 720117 722599
48125 722599 724383 725431 726432 727897 729793 731887 733907 735560 736841 738027 739047 739413 739201 739407 740683
48110 740683 742499 744302 746706 750480 755061 759293 763214 767881 773698 780095 786682 793550 800545 807328
48096 807328 814243 822078 830924 840107 849260 858597 868152 877679 887402 897982 909594 921786 934351
48083 934351 947569 961437 975387 988961 1002258 1015538 1028820 1041876 1054199 1065149 1074701 1083915
48071 1083915 1094038 1105169 1116372 1126987 1137241 1147667 1158564 1170097 1182301 1194825 1206988
48060 1206988 1218146 1227810 1235654 1241686 1246182 1249271 1250993 1251917 1252886 1253630 1252473 1248214 1241555 1233859
48046 1233859 1225325 1215586 1205398 1196138 1187833 1179156 1169438 1159347 1149329 1138622 1126277 1112315
48034 1112315 1097480 1082502 1067820 1053420 1038771 1023430 1007702 992145 976714 961093 945638
48023 945638 931031 917132 903173 889064 875512 862798 850433 838196 826550 815792 805612
48012 805612 795698 785956 776103 765957 756288 748380 742391 736977 730827 723836 716595 709650 703567 698796
47998 698796 695005 691258 687252 683714 681277 679684 678420 677398 676650 676066 675791 676196 677102 677677 677449 676748
47982 676748 675860 674478 672423 670167 668247 666749 665695 665202 664900 664034 662627 661720 661859 662138 661456 659960
47966 659960 658485 657142 655437 653378 651576 650445 650000 650205 650837 651201 650666 649397 648041 646894 645958 645648
47950 645648 646668 649155 652501 656135 659993 664120 668294 672268 676051 679747 683327 686837 690691 695535
47936 695535 701706 708927 716661 724756 733475 742754 751745 759527 766158 772600 779541 786698 793284 798702
47922 798702 802590 804713 805216 804732 803846 802511 800195 796595 792025 787150 782427 777847 773190 768396 763481
47907 763481 758124 751828 744742 737909 732212 727384 722596 717778 713707 710845 708753 706739 704525 702270
47893 702270 700442 699722 700487 702263 704147 705814 707640 709922 712601 715765 719659 724004 728031 731527 735186
47878 735186 739640 744683 749852 755139 760679 766229 771508 776680 781988 787109 791342 794287 796004 796631
47864 796631 796145 794442 791498 787489 782750 777481 771526 764748 757550 750669 744334 737953 730717 722265
47850 722265 712870 703356 694777 687726 681876 676570 671676 667400 663524 659631 656094 653948 653623 654524 656029
47835 656029 658045 660345 662371 664251 667143 671835 677620 683245 688446 693824 699677 705782 712096 718879
47821 718879 726201 733947 742263 751446 761394 771634 781988 792871 804977 818959 835374 854574
47809 854574 876496 900586 925952 951615 976796 1001062 1024055 1045129 1063543 1079041 1091918
47798 1091918 1102366 1110055 1114490 1115472 1113050 1107337 1098608 1087447 1074653 1061062 1047348 1033831 1020515
47785 1020515 1007529 995269 983847 972869 962357 953447 947226 943062 939121 934582 930201 926594 923274
47772 923274 919947 917481 916566 916261 914923 912078 908403 904267 899299 893240 886346 878870 870708 861652 851659
47757 851659 841012 830518 821256 813701 807262 801027 794788 789011 784171 780477 777953 776358 775282 774682
47743 774682 774949 776064 777136 777425 777504 778732 781719 785953 790843 796401 802834 810130 818435 828348 840288
47728 840288 853607 866747 878550 889337 900378 912231 923986 934434 943563 952326 961134 969255
47716 969255 975693 979949 981872 981520 979426 976397 972756 968208 962491 955495 946773 935936 923785 912069
47702 912069 901610 891537 880868 869895 859292 848890 838327 828237 819727 813061 807809 803858
47690 803858 801352 800018 799561 800506 803659 808769 814625 820508 826811 834164 842680 852150 862354 873090
47676 873090 884311 896291 909233 922831 936566 950263 963921 977149 989303 1000113 1009723 1018213
47664 1018213 1025451 1031268 1035413 1037500 1037409 1035527 1032279 1027655 1021532 1014132 1005831 996875 987667 978762
47650 978762 970115 960903 950764 940598 931395 922890 914400 906480 900403 896166 892358 888288 885118 884443
47636 884443 886653 891178 897589 905813 915712 927125 940195 955349 972983 993293 1016240 1041477
47624 1041477 1068333 1095960 1123645 1151156 1178707 1206117 1231965 1254108 1271218 1283236 1290092
47613 1290092 1290867 1284869 1272777 1255822 1234312 1207928 1177147 1143358 1107736 1070896 1033583 996809
47601 996809 961216 927058 894870 865446 839126 815626 794583 775743 758772 743490 730143
47590 730143 718887 709193 700396 692520 685906 680356 675495 671627 669192 667589 665620 663052 660621 658531
47576 658531 656145 653356 651034 649696 648728 647400 645849 644620 643985 644012 644539 644722 643427 640451 636740 633151
47560 633151 629738 626391 623188 619734 615197 609575 604074 599593 595661 591507 587324 583648 580225 576454
47546 576454 572467 568882 565857 563209 561115 559854 559074 558144 557071 556310 555794 554960 553726 552646 551911 550940
47530 550940 549312 547528 546425 546164 546229 546243 546363 546849 547610 548285 548622 548645 548594 548816 549540 550519 551103 551051 551150 552433
47510 552433 554740 556680 557309 557178 557305 557758 557962 557820 557649 557339 556546 555554 555055 555083 555044 554802 554878 555510 556408
47491 556408 557570 559387 561676 563495 564347 564792 565478 566332 567227 568608 570748 572939 574189 574472 574713 575768
47475 575768 577893 580994 584857 589212 593895 598884 604030 608973 613534 617931 622447 627089 631736 636339
47461 636339 640745 644604 647657 650001 651922 653663 655348 656901 658060 658766 659542 661152 663859 667346 671328
47446 671328 675897 681327 688011 696493 707040 719172 732116 745696 760297 776077 792837 810633
47434 810633 829680 849560 869163 887588 904476 919488 932207 942673 951222 957630 961288 962414
47422 962414 962107 960844 957883 952722 946271 939917 934117 928502 922736 916627 909955 902863 895938 889348
47408 889348 882360 874202 864940 854974 844309 832917 821341 810198 799468 788866 778613 769211
47396 769211 760706 752724 745075 737915 731562 726398 722563 719474 716181 712589 709795 708778 709347 710851
47382 710851 713232 716707 720978 725610 730857 737320 745017 753440 762251 771329 780347 788916 796991 804670
47368 804670 811833 818328 824131 828839 831482 831449 829238 825762 821337 815940 809888 803333 795470 785231
47354 785231 772742 759322 746078 733194 720515 708040 695727 683482 671535 660420 650482 641650
47342 641650 633565 625730 617813 610229 604031 599740 596520 593055 588955 584778 581074 578131 576326 575840
47328 575840 576031 575837 574897 573732 572928 572732 573378 575137 577963 581603 585939 590675 594822 597328 598328 599137
47312 599137 600812 603191 605412 606812 607116 606279 604466 601988 599134 596178 593471 591215 589251 587333 585421
47297 585421 583491 581403 579398 578319 578676 579762 580498 580997 582491 585690 590051 594879 600306 606756 614043
47282 614043 621577 629213 637564 647571 659886 674444 690512 707342 724912 743914 764981 787869
47270 787869 811116 832189 848282 857528 859711 855922 847822 837349 826473 816499 807576 799236 791266
47257 791266 783756 776678 769994 763934 758636 753691 748621 743576 738964 734604 729937 724939 720105 715559
47243 715559 710964 706332 702223 698978 696402 694300 692725 691574 690619 690151 690925 693150 696036 698702 701128
47228 701128 703922 707577 712307 718286 725611 734092 743277 752710 762162 771713 781558 791702 802016 812661
47214 812661 824049 836092 847891 858577 868042 876328 882819 886863 888817 889558 889073 886614 882170 876700
47200 876700 870636 863235 853925 843432 832976 823047 813627 805033 797801 792015 787357 783639 780813 778648
47186 778648 776877 775601 775203 775870 777465 779918 783549 788957 796523 805989 816583 827692 839314 851830
47172 851830 865574 880791 897644 915776 934176 952032 969574 987502 1005675 1022975 1038411
47161 1038411 1051713 1062823 1071509 1077663 1081442 1082936 1082182 1079590 1075808 1070975 1064647 1056634 1047414 1037562
47147 1037562 1027253 1016517 1005513 994424 983468 973084 963585 954633 945675 936943 929299 922988
47135 922988 917372 912124 907822 904915 902983 901666 901611 903640 907434 911839 916241 920984 926566 933035 940040
47120 940040 946965 953018 957682 961131 963875 965949 966668 965188 961219 955254 948189 940595 932370 923209
47106 923209 913292 903117 892768 881955 870867 860351 850868 841782 832111 821669 811099 801112
47094 801112 792017 783684 775576 767084 758182 749559 741843 734979 728681 723148 718868 715861 713574 711513
47080 711513 709716 708646 708750 710051 712043 714142 716304 719026 722601 726734 731009 735400 740028 744672
47066 744672 748872 752382 755282 757742 759883 761769 763333 764339 764465 763441 761281 758613 756552 755754 755675
47051 755675 755307 754658 754820 756410 758652 760468 761905 763932 767203 771580 776601 781907 787296 792855 799007
47036 799007 806073 813770 821335 828182 834334 840233 846229 852203 857718 862651 867507 872916 878965 885413
47022 885413 892313 899878 907795 915369 922373 929119 935552 941076 945542 949590 953593 956992 959201 960503
47008 960503 961401 961662 960715 958566 955568 951671 946678 941059 935679 930799 926025 921269 917140 914218 912362
46993 912362 910880 909168 907206 905644 905310 906349 907950 909183 909967 911037 913204 916892 922067 928197 934520
46978 934520 940787 947572 955447 964050 972487 980581 989187 999188 1010551 1022401 1033784 1044303 1054288
46965 1054288 1064394 1074915 1085497 1095529 1104609 1112562 1119314 1125009 1129989 1134389 1137999 1140734 1142937
46952 1142937 1144903 1146433 1147211 1147357 1147194 1146746 1145902 1144876 1143944 1142934 1141540 1140140 1139792 1141286 1144529 1148832
46936 1148832 1153460 1157908 1162106 1166518 1171766 1177954 1184504 1190742 1196603 1202732 1209927 1218357 1227287 1235675
46922 1235675 1243108 1250011 1256953 1264074 1271288 1278530 1285413 1290949 1294070 1294392 1292253 1288180 1282590 1275795
46908 1275795 1267976 1259171 1249509 1239343 1228985 1218523 1208019 1197681 1187693 1178253 1169958 1163757 1160112
46895 1160112 1158506 1158175 1159129 1162113 1167835 1176521 1187888 1201129 1215227 1229785 1245439 1263049 1282645
46882 1282645 1303420 1324467 1345069 1364570 1382552 1399090 1414425 1428536 1441331 1453022 1463788
46871 1463788 1473240 1480727 1486124 1489859 1492322 1493760 1494744 1496223 1498946 1503092 1508437 1514665 1521591 1529371
46857 1529371 1538397 1548802 1560247 1572376 1585156 1598484 1611842 1624794 1637513 1650314 1662943
46846 1662943 1674792 1685532 1694919 1702294 1706995 1709147 1709446 1708276 1705693 1702196 1698641 1695242 1691263 1685919
46832 1685919 1679137 1671370 1663219 1655451 1648862 1643831 1640200 1637730 1636470 1636719 1638840 1643013 1648912 1655841
46818 1655841 1663620 1673047 1684976 1699116 1714306 1729795 1745516 1761269 1776483 1790879 1804560 1817226
46806 1817226 1828034 1836486 1842789 1847088 1849048 1848569 1846305 1842941 1838464 1832641 1825772 1818475 1811029 1803441
46792 1803441 1795899 1788652 1781598 1774474 1767409 1760883 1755098 1749752 1744510 1739528 1735390 1732601 1731245 1731126
46778 1731126 1732113 1734185 1737065 1740138 1742973 1745810 1749203 1753227 1757317 1760880 1763772 1766231 1768649 1771534
46764 1771534 1775352 1780239 1785865 1791663 1797174 1802368 1807813 1814369 1822608 1832604 1844377 1858068 1873402
46751 1873402 1889450 1905455 1921614 1938507 1956043 1973647 1991253 2009283 2027640 2045535 2062432
46740 2062432 2078416 2093369 2106468 2116952 2124888 2130760 2134758 2136901 2137591 2137600 2137516 2137403 2136912 2135737 2134156
46725 2134156 2133100 2133422 2135177 2137904 2141480 2146140 2151712 2157503 2163261 2169708 2177733 2187299 2197345 2206491
46711 2206491 2213708 2218696 2221877 2223811 2224434 2223098 2219347 2213257 2204908 2194000 2180252 2163882 2145425
46698 2145425 2125318 2103749 2080652 2055787 2029166 2001475 1973646 1945872 1917563 1888461 1859349
46687 1859349 1831297 1804595 1778808 1753599 1729124 1705823 1684140 1664343 1646335 1629684 1613954
46676 1613954 1598904 1584360 1570153 1556277 1542878 1530094 1518153 1507561 1498727 1491264 1484175 1476961
46664 1476961 1470233 1465024 1461896 1460850 1461636 1463770 1466566 1469611 1473109 1477587 1483438 1490846 1499736 1509569
46650 1509569 1519477 1528900 1537804 1546060 1552929 1557573 1559821 1560149 1559094 1557061 1554474 1551704 1548848 1545813
46636 1545813 1542665 1539723 1537443 1536346 1536991 1539862 1545282 1553376 1563975 1576568 1590666 1606223 1623418
46623 1623418 1642044 1661517 1681591 1702550 1724345 1745901 1765633 1782478 1796125 1806520 1813570
46612 1813570 1817304 1817976 1815911 1811305 1804155 1794325 1781797 1766877 1750154 1732311 1714030 1695860 1677841
46599 1677841 1659498 1640649 1622143 1605251 1590339 1576647 1563454 1550843 1539191 1528571 1518965
46588 1518965 1510473 1502897 1495605 1488137 1480566 1472873 1464569 1455532 1446781 1439613 1434060 1428805 1422674 1415759
46574 1415759 1409016 1403200 1398351 1394041 1389853 1385653 1381541 1377696 1374349 1371764 1370011 1368792 1367783 1367093
46560 1367093 1367140 1368098 1369838 1372259 1375202 1378087 1380244 1381791 1383553 1386007 1388934 1392276 1396535 1401868 1407557
46545 1407557 1413032 1418839 1425845 1433903 1442082 1449976 1458045 1466820 1476525 1487434 1499902 1513832 1528604
46532 1528604 1543735 1559325 1575778 1593284 1611631 1630399 1649486 1669552 1691652 1716146 1742241
46521 1742241 1768961 1796305 1825003 1855308 1886503 1917598 1948127 1978232 2008271 2038299 2067706
46510 2067706 2095394 2120521 2142950 2162855 2180161 2194708 2206664 2216341 2223712 2228553 2231007 2231639
46498 2231639 2230992 2229377 2227039 2224123 2220459 2215740 2209943 2203410 2196533 2189519 2182329 2174570 2165591 2155019
46484 2155019 2143158 2130589 2117476 2103515 2088468 2072299 2054748 2035133 2012811 1987755 1960629
46473 1960629 1932331 1903380 1873680 1842911 1811184 1779145 1747440 1716330 1685906 1656376 1627973
46462 1627973 1600935 1575809 1553521 1534851 1520062 1509154 1502099 1498529 1497585 1498582 1501651 1507386 1516074
46449 1516074 1527578 1541599 1557559 1574429 1591244 1607699 1623875 1639550 1654250 1667746 1679904
46438 1679904 1690174 1697894 1703207 1707059 1710098 1712009 1712120 1710232 1706571 1701328 1694665 1687005 1679007 1671203
46424 1671203 1663773 1656652 1649817 1643558 1638540 1635519 1634919 1636624 1640131 1644937 1650957 1658713 1669051 1682545
$$ [...]
##END NTUPLES=NMR SPECTRUM
##END=
