
##TITLE=UV1233_M7_1357-1247_70_7230903_WchUKA3BT3
##JCAMPDX= 6.0         $$ Bruker NMR JCAMP-DX V2.0
##DATA TYPE= NMR SPECTRUM
##DATA CLASS= NTUPLES
##ORIGIN= BRUKER
##OWNER= Administrator
$$ 1.72 TOPSPIN		Version 2.1
$$ 2013-01-18 21:36:32.321 -0500  Administrator@X
$$ Compression mode = diff/dup
##.OBSERVE FREQUENCY= 400.02188249412
##.OBSERVE NUCLEUS= ^1H
##.ACQUISITION MODE= SIMULTANEOUS (DQD)
##.ACQUISITION SCHEME= undefined
##.AVERAGES= 8
##.DIGITISER RES= 22
##SPECTROMETER/DATA SYSTEM= spect
##.PULSE SEQUENCE= zg30
##.SOLVENT NAME= COFFEE_meoh
##.SHIFT REFERENCE= INTERNAL, COFFEE_meoh, 1, 14.98509
##AUDIT TRAIL= $$ (NUMBER, WHEN, WHO, WHERE, PROCESS, VERSION, WHAT)
$$ ##TITLE= Audit trail, TOPSPIN		Version 2.1
$$ ##JCAMPDX= 5.01
$$ ##ORIGIN= Bruker BioSpin GmbH
$$ ##OWNER= Administrator
$$ $$ E:\/data/COFFEE/nmr/UV1233_M7_1357-1247_70_7230903_WchUKA3BT3/20/pdata/1/auditp.txt
$$ ##AUDIT TRAIL=  $$ (NUMBER, WHEN, WHO, WHERE, PROCESS, VERSION, WHAT)
(   1,<2013-01-18 21:36:24.103 -0500>,<Administrator>,<X>,<go>,<TOPSPIN 2.1>,
      <created by zg
	started at 2013-01-18 21:35:18.009 -0500,
	POWCHK enabled, PULCHK disabled,
       configuration hash MD5:
       86 BA 57 50 F2 9D 5C 9B 26 00 A9 28 5F 66 2E 89
       data hash MD5: 64K
       88 B9 73 B8 D1 49 D6 02 98 20 4E 97 C0 44 F9 4D>)
(   2,<2013-01-18 21:36:27.103 -0500>,<Administrator>,<X>,<proc1d>,<TOPSPIN 2.1>,
      <Start of raw data processing
       efp LB = 0 FT_mod = 6 PKNL = 1 PHC0 = 0 PHC1 = 0 SI = 32K 
       data hash MD5: 32K
       FB 29 AE 79 55 79 FC 2F D7 09 BD 44 D6 C1 D2 5C>)
(   3,<2013-01-18 21:36:27.571 -0500>,<Administrator>,<X>,<proc1d>,<TOPSPIN 2.1>,
      <pk PHC0 = 92.43347 PHC1 = 0 
       data hash MD5: 32K
       79 E4 F9 50 31 CE 13 BA CB C8 31 DE 27 89 B0 B9>)
(   4,<2013-01-18 21:36:27.790 -0500>,<Administrator>,<X>,<proc1d>,<TOPSPIN 2.1>,
      <abs ABSG = 1 
       data hash MD5: 32K
       0E E7 51 52 9D 90 77 E4 31 F9 2C B2 D4 08 84 03>)
(   5,<2013-01-18 21:36:27.946 -0500>,<Administrator>,<X>,<proc1d>,<TOPSPIN 2.1>,
      <abs ABSG = 2 
       data hash MD5: 32K
       35 6B F4 BF E9 A3 9A 0B 31 5E D4 39 E9 BB 96 81>)
(   6,<2013-01-18 21:36:28.087 -0500>,<Administrator>,<X>,<proc1d>,<TOPSPIN 2.1>,
      <abs ABSG = 3 
       data hash MD5: 32K
       FA D2 4F AF 55 38 E0 2E F1 FC 5C 4C A5 6E BD 90>)
(   7,<2013-01-18 21:36:28.228 -0500>,<Administrator>,<X>,<proc1d>,<TOPSPIN 2.1>,
      <abs ABSG = 4 
       data hash MD5: 32K
       DD 00 6A 2B 90 95 53 0E 6F 45 8F A7 DB DB B0 C4>)
(   8,<2013-01-18 21:36:28.384 -0500>,<Administrator>,<X>,<proc1d>,<TOPSPIN 2.1>,
      <abs ABSG = 5 
       data hash MD5: 32K
       27 DB B3 B6 4A 62 87 D7 40 6A 07 D7 E2 13 2D 20>)
$$ ##END=
$$ 
$$ $$ hash MD5
$$ $$ F5 24 10 CB 70 35 0A 1B B7 11 F7 D9 38 90 0A E2
##$RELAX= 
##$RELAX= 
##$RELAX= 
##$RELAX= 
##$RELAX= 
##$RELAX= 
##$RELAX= 
$$ Bruker specific parameters
$$ --------------------------
##$DU= <E:\>
##$EXPNO= 20
$$ [...]
##$TP= (0..7)
150 150 150 150 150 150 150 150
##$TP07= 0
##$TPNAME0= <>
##$TPNAME1= <>
##$TPNAME2= <>
##$TPNAME3= <>
##$TPNAME4= <>
##$TPNAME5= <>
##$TPNAME6= <>
##$TPNAME7= <>
##$TPOAL= (0..7)
0.5 0.5 0.5 0.5 0.5 0.5 0.5 0.5
##$TPOFFS= (0..7)
0 0 0 0 0 0 0 0
##$TUNHIN= 0
##$TUNHOUT= 0
##$TUNXOUT= 0
##$USERA1= <user>
##$USERA2= <user>
##$USERA3= <user>
##$USERA4= <user>
##$USERA5= <user>
##$V9= 5
##$VALIST= <valist>
##$VCLIST= <CCCCCCCCCCCCCCC>
##$VD= 0
##$VDLIST= <DDDDDDDDDDDDDDD>
##$VPLIST= <PPPPPPPPPPPPPPP>
##$VTLIST= <TTTTTTTTTTTTTTT>
##$WBST= 1024
##$WBSW= 4
##$XGAIN= (0..3)
0 0 0 0
##$XL= 0
##$YL= 0
##$YMAX_a= 643728
##$YMIN_a= -545060
##$ZGOPTNS= <>
##$ZL1= 120
##$ZL2= 120
##$ZL3= 120
##$ZL4= 120
##$ABSF1= 14.98509
##$ABSF2= -5.573092
##$ABSG= 5
##$ABSL= 3
##$ALPHA= 0
##$AQORDER= 0
##$ASSFAC= 0
##$ASSFACI= 0
##$ASSFACX= 0
##$ASSWID= 0
##$AUNMP= <proc_prof1d_extract_pilot.lims>
##$AXLEFT= 0
##$AXNAME= <>
##$AXNUC= <1H>
##$AXRIGHT= 0
##$AXTYPE= 0
##$AXUNIT= <>
##$AZFE= 0.1
##$AZFW= 0.1
##$BCFW= 0
##$BC_mod= 0
##$BYTORDP= 0
##$COROFFS= 0
##$CY= 15
##$DATMOD= 1
##$DC= 0
##$DFILT= <>
##$DTYPP= 0
##$F1P= 0
##$F2P= 0
##$FCOR= 0.5
##$FTSIZE= 32768
##$FT_mod= 6
##$GAMMA= 0
##$GB= 0
##$INTBC= 1
##$INTSCL= 1
##$ISEN= 128
##$LB= 0
##$LEV0= 0
##$LPBIN= 0
##$MAXI= 10000
##$MC2= 0
##$MEAN= 0
##$ME_mod= 0
##$MI= 0
##$NCOEF= 0
##$NC_proc= -8
##$NLEV= 6
##$NOISF1= 0
##$NOISF2= 0
##$NSP= 0
##$NTH_PI= 0
##$NZP= 0
##$OFFSET= 14.98509
##$PC= 1
##$PHC0= 92.43347
##$PHC1= 0
##$PH_mod= 1
##$PKNL= yes
##$PPARMOD= 0
##$PPDIAG= 0
##$PPIPTYP= 0
##$PPMPNUM= 2147483647
##$PPRESOL= 1
##$PSCAL= 4
##$PSIGN= 0
##$PYNMP= <proc.py>
##$REVERSE= no
##$SF= 400.02
##$SI= 32768
##$SIGF1= 0
##$SIGF2= 0
##$SINO= 400
##$SIOLD= 32768
##$SPECTYP= <>
##$SREGLST= <1H.CDCl3>
##$SSB= 0
##$STSI= 32768
##$STSR= 0
##$SW_p= 8223.68421052631
##$SYMM= 0
##$S_DEV= 0
##$TDeff= 65536
##$TDoff= 0
##$TI= <>
##$TILT= no
##$TM1= 0
##$TM2= 0
##$TOPLEV= 0
##$USERP1= <user>
##$USERP2= <user>
##$USERP3= <user>
##$USERP4= <user>
##$USERP5= <user>
##$WDW= 1
##$XDIM= 32768
##$YMAX_p= 460192022
##$YMIN_p= -754199
##$CURPLOT= <Network HP LaserJet P1505>
##$CURPRIN= <$Network HP LaserJet P1505>
##$DFORMAT= <normdp>
##$LAYOUT= <+/1D_H.xwp>
##$LFORMAT= <normlp>
##$PFORMAT= <normpl>
##$SURQMSG= 1
$$ End of Bruker specific parameters
$$ ---------------------------------
##NTUPLES= NMR SPECTRUM
##VAR_NAME=  FREQUENCY,     SPECTRUM/REAL,   SPECTRUM/IMAG
##SYMBOL=    X,             R,               I
##VAR_TYPE=  INDEPENDENT,   DEPENDENT,       DEPENDENT
##VAR_FORM=  AFFN,          ASDF,            ASDF
##VAR_DIM=   32768,         32768,           32768
##UNITS=     HZ,            ARBITRARY UNITS, ARBITRARY UNITS
##FACTOR=    0.250966925370066, 1,           1
##FIRST=     8223.43324360094, -237364,      207276
##LAST=      0,             76685,           -70522
##MIN=       0,             -754199,         0
##MAX=       8223.43324360094, 460192022,    0
$$ Real data points
##PAGE= N=1
##DATA TABLE= (X++(R..R)), XYDATA
$$ [...]
$$ plain form
19572 -114308 203062 -11920 56614 -230069 -171251 41635 -120809 19052 -106971 -79610 -301249
19561 -301249 -226853 6699 95040 211639 291004 91365 -262441 -10456 -179730 -42791 -190076
19550 -190076 -67515 166504 101114 50868 -141759 -65213 81658 -96075 26566 141496 -339257
19538 68565 -55135 -241891 -174865 -193633 177629 -162295 -72178 -182805 -286490 -372099 -14459
19526 -195218 64300 -104216 119706 -311766 -191928 -203895 -58694 -93801 -101042 -214000 91267
19514 -245363 58513 202063 169300 187353 -143620 5791 -316271 -6850 127436 116026 -174890
19502 -49687 208086 5158 232900 -61572 -323366 44364 337311 7380 27598 135751 -246129
19490 1310 -125687 -37828 39165 317600 -97900 -266444 -336181 -273433 -34367 -17126 -69632
$$ packed form
19572a14308B03062a1920E6614b30069N8818D1635a20809A9052a06971K7361k21639
19561c01249P4396F699Q8341J16599P9365I1365b62441a0456j69274d2791j47285
19550a90076f7515A66504o5390n0246a41759f5213H1658i6075B6566J14930c39257
19538F8565e5135j86756O7026j8768A77629a62295g2178j10627j03685q5609a4459
19526a95218F4300a04216A19706c11766J19838j1967e8694l5107p241j12958I1267
19514b45363E8513J43550l2763J8053a43620E791c16271f850A27436j1410a74890
19502d9687B08086E158K27742f1572k61794D4364K92947G380K0218J08153b46129
19490A310a25687c7828C9165K78435i7900j68544o9737O2748c4367a7126n2506
$$ plain form
19479 -69632 122525 -177145 -98946 83343 -166223 -122802 79840 -170475 99117 -167894 -140929
19468 -140929 80830 -236011 -163702 136021 -165209 129930 -416784 283321 -268078 180769
19457 22161 114938 -327921 94301 -321771 49801 -3306 -27029 167742 117872 155192 -48334
19445 223971 205062 13069 -43916 -87038 -123542 -96341 -125305 -127438 -78763 -24755 -108005 -109435
19433 -109435 192877 -15791 51755 -155579 -41339 259082 -134105 -101098 181969 -50186
19422 249876 104203 55083 -303266 166012 -142042 -134578 -67975 41338 -228410 -349336
19412 -349336 -329179 144476 28080 -176515 -43704 -303630 58596 -204878 -250 -85983 37286
19400 116400 298180 163844 -144653 85106 -148972 19982 -150272 -56206 -99748 -130898
$$ packed form
19479f9632A22525a77145P8199H3343a66223M3421G9840a70475I9117a67894K6965
19468a40929H0830b36011P2309A36021a65209A29930d16784B83321b68078A80769
19457B2161R2777c27921I4301c21771D9801c306k3723A67742m9870L7320d8334
19445B23971j8909A3069d3916m3122l6504K7201k8964k133M8675b4755q3250j430
19433a09435A92877a5791E1755a55579d1339B59082a34105L3007A81969e0186
19422B49876A04203m9120c03266A66012a42042P464O6603D1338b28410j20926
19412c49336K0157A44476B8080a76515d3704k59926E8596b04878b50q5733C7286
19400A16400J81780j34336a44653H5106a48972A9982a50272e6206m3542l1150
$$ plain form
19390 -130898 173599 -261594 -42390 -3476 -12081 -195809 -49106 -147705 -366873 -224114 -108071
19378 -37692 -1987 102412 -91455 40697 -115434 -10281 -15875 -240080 -59240 124587 -146268
19366 -28288 -273983 -42176 85984 -39710 -224759 -169067 -189271 140553 73908 315254 -269911
19354 -143463 -89716 -292045 37465 -212978 -447601 133889 -23279 -79179 -111518 -222743
19344 -222743 75385 -231652 3346 85932 86973 -172617 221551 -216896 -21731 -148566 -39166
19332 -500948 15176 -10213 -171654 -94767 -392799 -169123 -179266 38735 47445 60694 -58974
19320 -13045 -271237 -386094 45024 38992 101516 -102671 -177440 69873 -16948 -31362 -140215
19309 -140215 42649 -10575 -25927 388900 -43820 -248587 16117 -64698 39637 -178776 -279158
$$ packed form
19390a30898A73599b61594d2390c476q605j83728d9106r8599k19168J42759a08071
19378c7692a987A02412i1455D0697a15434a0281n594k24205e9240A24587a46268
19366b8288k45695d2176H5984c9710j85049N5692k0204A40553o6645K41346b69911
19354a43463N3747k02329C7465b12978k34623A33889b3279n5900l2339j11225
19344b22743G5385b31652C346Q2586J041a72617B21551b16896b1731j26835c9166
19332e00948A5176a0213j61441P6887k98032a69123j0143C8735Q710J3249e8974
19320a3045k58192j14857D5024o032O2524a02671p4769F9873a6948j4414j08853
19309a40215D2649a0575j5352C88900d3820k04767A6117f4698C9637a78776j00382
$$ plain form
19298 -279158 -183522 58645 -1621 -99 143846 -411777 198677 -17632 -314938 -107861 -290154
19287 -290154 44947 -21820 88548 -175778 -107083 68356 -150383 -166365 16265 -304959 -135436
19275 -152155 -81611 144353 -232935 142394 -295004 -158490 198014 -431525 -14656 -355562
19265 -355562 41240 -208016 85964 -83356 -68815 -86405 91494 -175825 198350 -388300 -356540
19254 -356540 -114714 -4306 -170867 -206146 -195809 72194 97773 115709 -113224 -44596 -86770
19243 -86770 -513403 -15954 -172684 53126 -2158 -182930 3211 -166821 148264 116176 -87419
19231 -20723 129206 -84515 -159211 -196879 -133105 433999 -33044 -265637 -19881 176133 176498
19220 176498 -35536 -55163 -274230 60429 193916 39327 -313760 -78423 -95652 -128783 439849
$$ packed form
19298b79158R5636E8645a621i9A43846d11777A98677a7632k97306a07861j82293
19287b90154D4947b1820H8548a75778O8695F8356a50383j5982A6265c04959a35436
19275a52155P0544A44353b32935A42394b95004J36514A98014d31525a4656l40906
19265c55562D1240b08016H5964h3356J4541j7590I1494a75825A98350c88300L1760
19254c56540a14714d306j66561l5279J0337G2194K5579J7936a13224d4596m2174
19243h6770m26633a5954j56730E3126b158j80772C211a66821A48264l2088h7419
19231b0723A29206h4515p4696l7668O3774D33999c3044k32593a9881A76133L65
19220A76498c5536j9627k19067F0429J33487C9327c13760g8423j7229l3131D39849
$$ plain form
19208 -63400 192096 -494601 -42548 -208792 -210867 -302909 -212778 -52707 95803 331579 -437409
19196 40974 -199009 -200151 66479 103344 117439 64474 -132285 -29525 -79916 -251958 56527
19184 56342 -498006 67785 -69225 -180361 -19540 -14199 -48686 194253 -116398 55141 155510
19173 155510 198335 -26928 -214869 -27426 -308577 8747 -87747 -125988 74529 -189573 56115
19161 -7885 31934 -352177 46115 49220 128120 -246592 77126 -236487 164974 66137 103214
19150 103214 -3263 55141 231901 -142174 173942 -193175 -56958 -99350 213518 -157982
19139 -213363 -142326 -53849 -313494 45158 18221 4329 -115045 -661 -11314 15298 46938 -168553
19126 81209 -70918 -82676 60097 176763 -150824 175741 -373886 -4466 -104137 -191507 30398
$$ packed form
19208f3400A92096d94601d2548j66244k075r2042R0131e2707I5803K35776d37409
19196D0974a99009j142F6479L6865J4095n2965a32285b9525n0391j72042E6527
19184E6342d98006F7785f9225j11136a9540N341l4487A94253a16398E5141J00369
19173A55510M2825b6928j87941b7426k81151H747h7747l8241G4529a89573E6115
19161g885C1934c52177D6115L105P8900b46592G7126b36487A64974F6137L7077
19150A03214c263E5141J76760a42174A73942a93175e6958m2392B13518a57982
19139b13363P1037e3849k59645D5158A8221D329a15045f61j0653A5298L1640a68553
19126H1209g0918j1758F0097J16666a50824A75741c73886d466r9671q7370C0398
$$ plain form
19114 -1995 -192449 257302 -196842 63189 -105084 -50799 -362811 -141750 -66264 126849
19103 -238215 -166662 -62551 -119804 52613 193122 -17207 -175923 -195993 -57140 -228835 -217617
19092 -217617 -197739 -223748 -207489 -105726 -110606 57574 11419 -92040 60817 -213034 48423
19080 12905 -362772 -42623 -226600 -44974 -164888 -38215 -63286 -23400 -300516 -218704 -80373
19068 80149 84299 -307084 -304551 196804 -30552 -121754 -84524 129425 162049 -444701 -147804
19056 -36037 -158468 -132829 -42236 -20673 57322 19334 -191253 35745 -320908 -193631 -40502
19044 -151292 45244 62358 -141617 -59012 -42142 -142198 31104 -116411 -210577 217779 -205825
19032 39888 -157827 283908 -117555 44632 -6985 -129576 81932 -214810 -158708 120859 92883
$$ packed form
19114a995j90454B57302a96842F3189a05084e0799l12012a41750f6264A26849
19103b38215P1553f2551n7253E2613J40509a7207j58716k0070e7140j71695J1218
19092b17617J9878k6009J6259J01763m880E7574A1419i2040F0817b13034D8423
19080A2905c62772d2623j83977d4974j19914c8215k5071b3400k77116Q1812h0373
19068H0149M150c07084K533A96804c0552r1202L7230A29425L2624d44701a47804
19056c6037j22431K5639d2236b0673E7322A9334a91253C5745c20908J27277d0502
19044a51292D5244J7114a41617e9012J6870j00056C1104a16411r4166B17779b05825
19032C9888a57827B83908a17555D4632f985j22591H1932b14810N6102A20859k7976
$$ plain form
19021 92883 -378964 -141277 335722 36244 258792 -34220 -85005 -105671 -60139 178407 61432
19009 -191414 -4066 184743 -186196 28958 -9624 -66428 -94117 -162008 94635 -102455 -74904
18998 -74904 211066 -78901 124765 -173459 -54852 -46121 -17701 -168734 -387712 -321592 -106996
18986 179703 14128 154762 -76535 120481 -106918 -424282 -214647 186171 2609 -229560
18975 -5671 48758 -124050 -113928 -330795 81505 92258 -29466 -105074 76199 403360 313797
18964 313797 -49834 -107959 58422 -139061 132035 -256519 -333564 -286253 -357351 198160 -319691
18952 -45322 134507 235633 105842 -36565 -4012 25623 -61965 141955 6623 206669 -269443
18940 -236175 200798 -120973 -105710 37843 -391209 -27068 -244966 20718 20431 -98258 -114470
$$ packed form
19021I2883c78964a41277C35722C6244K22548c4220n0785k0666M5532A78407F1432
19009a91414d066A84743a86196B8958i624n6804k7689o7891I4635a02455K7551
18998g4904B11066g8901A24765a73459e4852Q731a7701j51033k18978O6120a06996
18986A79703A4128J40634g6535A20481a06918l17364K09635A86171B609b29560
18975e671D8758a24050J0122k16867H1505J0753b9466p5608G6199L27161q9563
18964C13797d9834n8125E8422a39061A32035b56519p7045M7311p1098A98160c19691
18952d5322A34507J01126A05842c6565d012B5623f1965A41955F623K00046b69443
18940b36175B00798a20973J5263C7843c91209b7068k17898B0718k87i8258j6212
$$ plain form
18929 -114470 49879 -266382 -184848 -242189 -116787 -247756 -95748 6451 -100721 267907 -378363
18917 -78274 12416 264682 116194 -263693 -28183 -233925 -59463 13666 46193 -194760 32309
18905 -53083 -33302 -321035 -199123 2025 -144229 5138 170236 -29031 407811 -448776 77832
18893 -205195 152435 -298888 63271 -134829 -65740 11782 -284223 142523 107750 -305012
18882 75203 -37785 -55044 -136003 -202273 -135817 -18773 -219387 -52256 -200699 -204399 25970
18870 -381541 -406736 21477 -39982 15498 319538 258627 -291119 -1916 -117256 86249 -28373
18858 443060 -32569 75895 -159629 54937 -153998 192108 293522 -71436 71896 345329
18848 345329 -98055 -8843 -132772 -71379 67981 227026 156617 145043 -193627 292934 31175
$$ packed form
18929a14470D9879b66382Q1534n7341a16787j30969i5748F451a00721B67907c78363
18917g8274A2416K52266A16194b63693b8183k05742e9463A3666L2527a94760C2309
18905e3083J9781k87733J21912B025a44229E138J65098b9031D07811d48776G7832
18893b05195A52435b98888F3271a34829f5740A1782b84223A42523l4773c05012
18882G5203c7785j7259q0959o6270O6456a8773k00614e2256j48443l700B5970
18870c81541k5195B1477c9982A5498L04040o0911b91119a916j15340H6249b8373
18858D43060c2569G5895a59629E4937a53998A92108J01414g1436G1896K73433
18848C45329i8055h843j23929O1393F7981J59045p0409j1574a93627B92934C1175
$$ plain form
18836 133106 -63299 -16841 -303644 -942 -93515 92530 -145305 12413 -160065 -53053 79398
18824 10661 89236 -122002 205457 -75968 256672 -192961 -90055 -207828 -79295 -10642 -88051
18813 -88051 -12771 171722 71641 3499 -16755 289180 118244 -277704 -81481 -61437 57639
18801 -360796 -90138 -30064 -521882 62269 -138213 -120687 170292 -44897 67370 -4811 4833
18789 5593 81879 -23799 -73742 -268341 39654 -241612 4086 -83498 -272637 170287 -162869
18777 -42097 -37103 -69188 62925 -90632 -326867 125932 -72845 -176185 1285 -99688 -314394
18766 -314394 -280299 91945 -130694 -143625 153348 -107012 -256767 102710 145451 -206443
18755 -73172 -116975 -112764 -174769 -12138 -7269 -170485 252644 35538 -15479 72358 -183887
$$ packed form
18836A33106f3299a6841k86803i42r2573I2530a45305A2413a60065e3053G9398
18824A0661P8575a22002B05457g5968B56672a92961i0055j17773g9295a0642p7409
18813h8051a2771A71722G1641C499a6755B89180A18244b77704h1481K0044E7639
18801c60796i0138c0064m91818F2269a38213J7526A70292d4897F7370d811D833
18789E593P6286b3799m9943j94599C9654b41612D086h3498j89139A70287a62869
18777d2097M994l2085F2925i0632k36235A25932g2845j03340A285i9688k14706
18766c14394L4095I1945a30694j2931A53348a07012j49755A02710M2741b06443
18755g3172m3803M211o2005a2138M869j63216B52644C5538a5479G2358a83887
$$ plain form
18743 117441 -8660 -135954 181836 -15361 85261 -394942 -45516 -139045 -17668 -27853 -54726
18732 -54726 -123345 133930 62681 -23858 -33836 143114 104227 -168521 8695 -273895 -228252
18721 -228252 -163238 -294204 -26957 -179333 145759 -71492 -158393 -214709 -284745 -118596 154576
18709 101942 -111474 60900 6722 -199131 32808 -204983 -382734 -151388 -31351 -118361 -189787
18698 -189787 -172873 123795 -21579 -142134 -171144 -249508 130973 -294452 33492 178260
18688 178260 -172862 -108005 -171942 -17856 -44813 -4119 -63937 59039 21415 -51266 5234 100483
18676 100483 -353088 -100583 142166 267109 318558 -124495 158645 -350457 -453933 -405427
18666 -405427 123565 116144 9804 -192778 -52320 -223094 -78844 -119777 190021 30210 -159531
$$ packed form
18743A17441h660j27294A81836a5361H5261c94942d5516r3529a7668j0185k6873
18732e4726o8619A33930F2681b3858r978A43114l8887a68521H695b73895M5643
18721b28252O5014j30966b6957j52376A45759g1492q6901n6316p0036a18596A54576
18709A01942a11474F0900F722a99131C2808b04983j77751a51388c1351q7010p1426
18698a89787J6914A23795b1579j20555k9010p8364A30973b94452C3492J44768
18688A78260a72862O4857o3937a7856k6957d119n9818E9039B1415e1266E234R5249
18676A00483c53088a00583A42166J24943N1449a24495A58645c50457j03476M8506
18666d05427A23565p421I804a92778e2320j70774g8844m0933A90021C0210a59531
$$ plain form
18654 170806 -96820 -41315 -134934 -142305 -201551 121123 162245 -133360 -105100 278132 -113447
18642 531 76095 -141033 -47856 144478 -14795 12503 91815 -377558 281289 -247023 -249215
18631 -249215 -51828 167611 -116321 -87806 74962 -169235 289046 310130 -47128 -149416
18621 -149416 45023 -27727 389376 -303533 -64062 210073 4306 -106946 -134089 -26991 -223740
18610 -223740 -51737 45502 -74099 -102134 -490251 -54501 23651 79753 -177458 -144789 -40714
18598 -6886 -231223 -13452 -132455 96308 190601 -181586 -247291 12026 222184 -44515 79361
18586 309050 46997 -41899 -154240 -53233 -357353 22300 -76937 -74525 119307 104232 52296
18575 52296 35442 30457 -147574 -101608 13832 53846 -183507 -59804 -167593 95589 297906
$$ packed form
18654A70806i6820d1315r3619p371n9246A21123M1122a33360K8260B78132a13447
18642E31P5564a41033d7856A44478a4795A2503P9312c77558B81289b47023k192
18631b49215e1828A67611a16321K8515G4962a69235B89046K1084d7128j02288
18621a49416D5023b7727C89376c03533f4062B10073D306a06946k7143b6991j96749
18610b23740e1737D5502g4099k8035l88117e4501B3651N6102a77458L2669d0714
18598f886k24337a3452j19003I6308R4293a81586o5705A2026K10158d4515G9361
18586C09050D6997d1899j12341e3233l04120B2300g6937K412A19307j5075n1936
18575E2296j6854m985a47574M5966A3832M0014a83507e9804j07789I5589K02317
$$ plain form
18564 297906 -34011 190810 -2710 185370 -399821 90134 -428263 -99127 47123 -14597 90053
18552 43791 172583 -306647 -233695 -214698 -272497 30163 114428 -154318 -314708 127128 -168875
18540 -70244 -37210 -51604 -467777 16453 -85948 86046 -258521 277393 -4662 36942 165797
18529 165797 -12963 -202689 -151920 178344 187709 124807 -45304 -380559 313588 -84915 -209263
18518 -209263 -163514 -202635 13098 -116778 -61455 28461 -68625 -158791 -38902 -52012 -367348
18507 -367348 -81706 448141 15522 7548 -141720 -244129 52280 -25949 -141878 -24706 -63978
18496 -63978 95601 14631 80983 87628 8531 -56634 108874 -12219 -144555 -101179 4067 -38687
18483 -93887 -32098 -68461 89924 -194336 354519 -179784 -309723 -112183 -413419 85101
$$ packed form
18564B97906c4011A90810b710A85370c99821I0134d28263i9127D7123a4597I0053
18552D3791J28792c06647P2952J8997n7799C0163Q4265a54318j60390A27128a68875
18540g0244L3034j4394m16173A6453h5948H6046b58521B77393d662C6942J28855
18529A65797a2963j89726N0769A78344R365o2902d5304l35255C13588h4915j24348
18518b09263M5749l9121A3098a16778N5323B8461f8625r0166c8902j3110l15336
18507c67348h1706D48141A5522G548a41720j02409E2280b5949j15929b4706l9272
18496f3978I5601A4631O6352O645H531e6634A08874a2219j32336M3376D067c8687
18483i3887c2098l6363H9924a94336C54519a79784j29939a12183l01236H5101
$$ plain form
18472 -33998 -139394 -12438 -163019 -318567 -212377 -119104 56682 45218 -209337 -71045 -17933
18460 -399269 -61555 -181866 21355 -47445 -54819 -42170 3256 334030 -101706 -88329 -125777
18449 -125777 -83298 45625 134052 -35311 109072 -304695 -64971 104323 191342 -196463 43580
18437 -200104 -55821 -108788 -46094 47565 -324547 -73393 -67046 -444187 14572 -175268 -136296
18426 -136296 -89113 137258 149897 271092 -120185 42996 -30480 -197285 -2820 -225418 16308
18414 136814 -326772 -205652 -38953 47932 -96161 214392 246052 -73614 228361 -379638
18403 189100 3775 49644 134 -38843 37367 251906 10981 -20827 -33559 -5329 6085 -27131
18390 -5244 149233 -420305 -13203 -110350 -105514 -58291 353659 -112117 292061 -157114 259060
$$ packed form
18472c3998j05396a2438j50581j55548J06190R3273E6682j1464b09337g1045a7933
18460c99269f1555j20311B1355d7445p374J2649C256L30774a01706J3377l7448
18449a25777M2479D5625Q8427c5311A09072c04695f4971A04323Q7019a96463D3580
18437b00104e5821n2967d6094D7565c24547g3393O347l77141A4572a75268L8972
18426a36296M7183A37258J2639J21195a20185D2996c0480j66805b820k22598A6308
18414A36814c26772J21120c8953D7932i6161B14392L1660g3614B28361c79638
18403A89100C775M5869A34c8843C7367K14539A0981b0827j2732e329F085b7131
18390e244A49233d20305a3203r7147M836M7223C53659a12117B92061a57114B59060
$$ plain form
18378 -285268 -200524 118611 49793 78791 -61471 104548 -308992 -31937 -60906 -38404 -73974
18367 -73974 -155427 -70655 -85914 92760 -264550 326716 98712 113424 -86725 -233598 -118726
18356 -118726 10320 -110818 -44525 -114850 32376 -118157 -235547 22472 108558 -27069 -117690
18345 -117690 -130268 -308328 -86558 -72514 90501 -218482 255116 -326999 -346054 103500
18334 175005 -227874 116590 -88955 -142208 -69116 -241102 12638 -586518 -83868 -220494
18324 -220494 -224191 -104553 53219 74893 186319 -213837 37687 -54372 140733 -103913 25268
18312 -11126 82495 -73943 57204 103061 -198731 -96670 -7722 -176925 -119605 -73663 -137004
18301 -137004 302758 -299901 106785 -135713 48903 154934 -304826 315414 -95862 167363
$$ packed form
18378b85268Q4744A18611D9793K8998f1471A04548c08992c1937k8969K2502l5570
18367g3974q1453g0655j5259I2760b64550C26716I8712J4712h6725j46873J14872
18356a18726A0320a10818d4525p0325C2376a18157j17390B2472Q6086b7069r0621
18345a17690j2578j78060h6558J4044I0501b18482B55116c26999j9055A03500
18334A75005b27874A16590h8955n3253f9116j71986A2638e86518h3868j36626
18324b20494l697a04553E3219K1674J11426b13837C7687e4372A40733a03913B5268
18312a1126H2495g3943E7204M5857a98731i6670g722j69203N7320M5942o3341
18301a37004C02758b99901A06785a35713D8903J06031c04826C15414i5862A67363
$$ plain form
18290 -335374 -179482 -20658 -247406 -10098 -140495 -246173 -144522 23392 84429 338127
18280 338127 628429 -229339 143178 -273135 25334 103898 -204264 -69664 27953 -17940
18269 -132648 -43084 -15017 -3518 -66805 -53863 -26075 -178695 -110675 6674 -177448 -307623
18258 -307623 233713 -252925 -89424 -87686 -159937 -215838 44246 3073 18152 131730 -220467
18246 -252421 90206 168094 85751 50001 -40064 235437 -150507 -97369 90954 -238872 -158330
18235 -158330 -110453 187064 -236241 -58954 -51985 145245 -5866 -165064 45421 -136034 64853
18223 139345 -79216 -209262 31659 -12927 -224146 268024 -207239 147371 -178634 19239
18212 14430 -105635 -231861 -44992 216412 122576 -50174 51306 -377833 -117040 74081 182788
$$ packed form
18290c35374J55892b0658k26748a0098j30397j05678J01651B3392O1037K53698
18280C38127K90302b29339A43178b73135B5334P8564b04264f9664B7953a7940
18269a32648d3084a5017c518o3287J2942b6075j52620O8020F674a77448j30175
18258c07623B33713b52925h9424J738p2251n5901D4246C073J5079J13578b20467
18246b52421I0206P7888q2343l5750d0064B35437a50507N3138I0954b38872Q0542
18235a58330M7877A87064b36241e8954O969A45245e866j59198D5421a36034F4853
18223A39345g9216j30046C1659a2927k11219B68024b07239A47371a78634A9239
18212A4430a05635j26226d4992B16412r3836e0174E1306c77833a17040G4081J08707
$$ plain form
18201 182788 3448 -301174 104649 100169 -40687 -118017 156323 57092 76068 -97310 -58280
18190 -58280 -58465 25899 130312 -12275 -181341 132704 -40951 -177129 -326334 55994 -181728
18178 -255387 140697 -60963 110535 -211354 -103278 -94961 -92179 226663 98259 -4130 -70258
18167 -70258 -219469 134355 -464667 -62568 -49044 -194790 79411 -151702 -37652 -269236
18157 -269236 214739 113917 174685 113098 162454 136653 -121088 143273 -73370 -172457 38738
18145 -213478 72818 7417 -111566 62255 -24299 -88701 -211967 -151420 23833 -489 -165794
18134 -165794 99990 -137834 250824 -168128 -141083 -19711 25283 -164352 -151606 -147557 304172
18122 50998 -51069 9089 -31620 105577 -208340 -91732 177459 10368 -132132 2643 -236033
$$ packed form
18201A82788C448c01174A04649m480d0687p7330A56323E7092J8976i7310L9030
18190e8280j85B5899J04413a2275j69066A32704d0951j36178j49205E5994a81728
18178b55387A40697f0963A10535b11354a03278Q317K782B26663I8259d130o6128
18167g0258j49211A34355d64667f2568J3524j45746G9411a51702c7652k31584
18157b69236B14739j00822O0768o1587M9356k5801a21088A43273g3370r9087C8738
18145b13478G2818G417a11566F2255b4299o4402j23266O0547B3833d89j65305
18134a65794I9990a37834B50824a68128K7045a9711B5283a64352J2746M049C04172
18122E0998e1069I089c1620A05577b08340i1732A77459A0368a32132B643b36033
$$ plain form
18110 -41972 71792 12134 -171477 133055 137683 -385177 82298 -124296 -185595 50898 -205734
18098 168296 43464 -266471 6571 119558 121511 195340 -175608 42840 104439 -219782 87866
18086 -2998 -225090 -152056 68074 -152798 -56137 -146123 161726 -266101 -58254 -124435 -50510
18074 -287939 49828 79698 135142 -102127 -208503 -80374 9870 135634 142278 50121 25796
18063 25796 41177 -59899 -47991 -182789 -82797 -35459 -33825 -309209 -117043 -263102 63254
18051 243457 -57260 405051 -136507 -61235 -50452 144355 36746 -119520 39527 -245192
18040 169240 -194552 -112104 42919 138603 287453 -42455 -203346 268751 -388953 -107589
18029 -167305 81032 68343 -276960 112909 -133761 36906 -196161 61210 131685 65594 341613
$$ packed form
18110d1972G1792A2134a71477A33055M628c85177H2298a24296o1299E0898b05734
18098A68296D3464b66471F571J12987J953P3829a75608D2840O1599b19782H7866
18086b998k22092P3034F8074a52798e6137q9986A61726b66101e8254o6181e0510
18074b87939D9828K9870N5444a02127j06376h0374I870J25764O644E0121k4325
18063B5796J5381e9899J1908j34798h2797c5459J634k75384a17043j46059F3254
18051B43457e7260D05051a36507f1235J0783A44355C6746a19520C9527b45192
18040A69240a94552Q2448D2919R5684J48850d2455j60891B68751c88953a07589
18029a67305H1032j2689b76960A12909a33761C6906a96161F1210P0475F5594K76019
$$ plain form
18018 341613 16977 -50423 -26163 -60394 -247342 -291210 -27923 -106424 -93548 103646 354549
18007 354549 -5443 -422031 -145295 61486 -78325 -128352 -20419 -41017 -30031 -65644 218368
17995 -289429 -163564 242634 180545 27730 -246215 -204350 54277 -219660 2984 -147943 41772
17983 -257375 -257056 24567 3119 -124002 -550378 381814 135252 41478 -79191 -238537 126636
17971 -316233 9382 354721 -98714 158310 -87325 333281 -70972 -35946 3114 -64280 -51340
17960 -51340 -60436 -146040 121232 -3809 -37564 85031 -214593 349653 466234 119014 -80394
17948 19281 -137914 -130832 -67591 -3362 57768 75017 -46400 -15225 106465 39308 34533 81571
17936 81571 20916 -612460 41463 -29419 -463486 -108344 -35649 -142881 -86138 -96764 -89140
$$ packed form
18018C41613A6977e0423K4260l4231j86948m3868b7923p8501J2876A03646K50903
18007C54549e443m16588a45295F1486g8325n0027b0419k0598J0986l5613B18368
17995b89429J25865B42634o2089B7730b46215M1865E4277b19660B984a47943D1772
17983b57375L19B4567C119a24002m26376C81814A35252D1478g9191j59346A26636
17971c16233I382L45339i8714A58310h7325C33281g0972L5026C114f4280J2940
17960e1340r096q5604A21232c809l3755H5031b14593C49653J16581A19014h0394
17948A9281a37914P082O3241c362E7768J7249d6400a5225A06465C9308m775M7038
17936H1571B0916f12460D1463b9419m34067a08344c5649j07232N6743j0626P624
$$ plain form
17925 -89140 -79925 -204197 20244 -36290 -221468 8046 -257971 93243 201473 38466 157247
17914 157247 -35923 97045 174055 323191 -62799 159837 97457 92993 -217189 -94582 365750
17902 -122238 38732 -178727 -235405 248689 25641 -183976 98039 -320290 -99275 -288092
17892 -288092 -232151 21097 216217 191593 -74665 -342244 97009 -8146 -106039 43326 -190269
17880 50179 133521 194790 -63656 137304 16171 -222207 -276279 175844 -115699 -23139 -286140
17869 -286140 10489 65910 -113131 452331 -214207 126126 -89832 208037 -133127 18890
17858 136632 124154 -226867 6548 12034 -103564 -301557 -171968 58408 -80086 -218024 96170
17846 86178 245832 102918 127342 192086 300519 -155433 -59860 112479 194364 493641
$$ packed form
17925h9140R215j24272B0244c6290j85178H046b57971I3243J08230C8466J18781
17914A57247c5923I7045P7010J49136f2799A59837o2380m464b17189i4582C65750
17902a22238C8732a78727n6678B48689B5641a83976I8039c20290i9275j88817
17892b88092N5941B1097J95120k4624g4665k67579I7009h146r7893D3326a90269
17880E0179Q3342O1269f3656A37304A6171b22207n4072A75844a15699b3139k63001
17869b86140A0489N5421a13131D52331b14207A26126h9832B08037a33127A8890
17858A36632j2478b26867F548N486a03564j97993J29589E8408h0086j37938I6170
17846H6178J59654A02918K4424O4744J08433a55433e9860A12479Q1885K99277
$$ plain form
17836 493641 -127129 153464 -112725 -144319 111349 136225 114210 -223843 -155354 113844
17825 -257222 -8100 9631 -56480 -56595 -214536 -261678 158754 269933 -299123 -277365 -9307 -217888
17813 -217888 -41918 -27429 19790 -121107 -18808 94450 119100 58291 320046 17672 -37570
17801 -64582 163425 -73204 188032 572313 69157 -159443 56669 -77023 -129633 -104513 4481
17789 64856 -188449 -275550 208561 86314 -99709 1205 -18119 -12177 -29888 51023 115883 -69844
17776 30318 -181277 -236026 16062 148487 120744 103347 -150344 -168874 412448 242966 -369359
17764 366031 -248547 -42028 144570 313908 128082 -72108 -358631 14033 28980 -226218
17753 289900 -74279 -45138 -121742 133197 101766 235741 -160447 31580 6885 57485 177376
$$ packed form
17836D93641a27129A53464a12725l1594A11349K4876k2015b23843O8489A13844
17825b57222h100I631e6480j15j57941m7142A58754J11179b99123K1758i307k08581
17813b17888d1918J4489A9790a21107a8808I4450K4650E8291K61755A7672c7570
17801f4582A63425g3204A88032L84281F9157a59443E6669g7023n2610K5120D481
17789F4856a88449q7101B08561H6314i9709A205a8119N942j7711E1023O4860f9844
17776C0318a81277n4749A6062J32425k7743j7397a50344j8530D12448j69482c69359
17764C66031b48547d2028A44570J69338A28082g2108k86523A4033J4947b26218
17753B89900g4279K9141p6604A33197l1431J33975a60447C1580F885N0600J19891
$$ plain form
17742 177376 116926 404327 -238713 22515 -74359 -3804 14867 -305604 358484 -162849 131575
17730 -98708 -49038 104729 75089 186014 -120235 -103175 -99033 39157 -420126 -171552 332109
17718 205618 21035 -96174 55116 198056 248247 196459 101467 314058 -457662 16603 50213
17707 50213 26749 259133 257228 -103951 -23490 -12040 45339 347379 -34009 -233950 127609
17695 -23185 80764 17847 -38246 312715 -30687 83038 -58751 -245974 68895 -255002 105312
17683 -178362 73496 428892 145040 -13999 247313 2132 -39741 394470 35088 -8136 -20088
17672 -20088 172891 -136248 -203775 86135 -16906 105853 64656 -114039 40515 -217727 267414
17660 -184802 -239642 -23181 -296310 -190979 108623 -80603 50536 -476008 82724 140210 -24019
$$ packed form
17742A77376o0450K87401b38713B2515g4359c804A4867c05604C58484a62849A31575
17730i8708d9038A04729k9640J10925a20235J7060M142C9157d20126a71552C32109
17718B05618B1035i6174E5116J42940N0191n1788r4992K12591d57662A6603L3610
17707E0213k3464K32384j905a03951b3490J1450D5339L02040c4009j99941A27609
17695b3185H0764A7847c8246C12715c0687H3038e8751j87223F8895b55002A05312
17683a78362G3496L55396A45040a3999B47313B132c9741C94470C5088h136j1952
17672b0088A72891a36248o7527H6135a6906A05853m1197a14039D0515b17727B67414
17660a84802n4840b3181k73129J05331A08623h0603E0536d76008H2724N7486b4019
$$ plain form
17648 -138692 22964 52341 109181 92965 62854 -16848 98246 85523 386963 -160638 80399
17636 92458 56691 50796 5788 138883 107576 -160622 -672280 47939 -68086 251691 48917
17624 168776 -125499 -165177 -7082 44152 148849 198272 234043 262410 -62310 249693 70410
17612 54803 -86773 -50728 108247 189914 167276 199501 181600 309094 -292599 -94471 187667
17600 139396 -426979 17019 -22943 16594 250623 -143475 -354714 673 184648 154627 172532
17589 172532 -194780 -22868 63490 146095 -156299 384492 -86968 92732 35683 171749 -65371
17577 -97165 9272 92808 44165 330852 -146765 -109121 -199869 236377 -18188 146085 -227698
17565 93891 66734 -29701 -57712 -115131 49980 184817 172045 75659 162787 -157944 112869
$$ packed form
17648a38692B2964K9377N6840j6216l0111a6848I8246j2723L01440a60638H0399
17636I2458l5767n895E788J33095l1307a60622n11658D7939f8086B51691D8917
17624A68776a25499l9678g082D4152J04697M9423L5771K8367f2310B49693G0410
17612E4803h6773L6045A08247Q1667k2638L2225j7901J27494b92599i4471A87667
17600A39396d26979A7019b2943A6594K34029a43475k11239F73J83975l0021J7905
17589A72532a94780b2868F3490Q2605a56299C84492h6968I2732C5683J36066f5371
17577i7165I272Q3536D4165K86687a46765L7644r0748B36377a8188A46085b27698
17565I3891k7157b9701k8011n7419D9980J34837j2772G5659Q7128a57944A12869
$$ plain form
17553 -102001 -44478 106605 34802 68242 15153 -17838 -249823 67383 61448 -278725 -70381
17541 -51094 134660 169867 22532 -171579 110967 28190 -48626 -195146 751 -122842 -23502
17529 -169116 2005 137336 399514 -71988 -40522 54923 47595 26643 -5088 152712 107273
17518 107273 334038 146101 152164 363921 67520 -315628 -127366 160556 -222257 181997
17507 174100 -164741 -8992 -8122 51949 111871 1874 1971 -175885 -17792 286526 61120 38001
17495 38001 81143 54795 -60284 213693 107041 41250 397357 236173 101299 -24214 173526
17483 52431 37357 266384 23840 264220 -132400 -61816 197963 442576 119062 -209836
17472 92709 181515 -84722 -41873 -1272 307127 210189 -135752 -48347 -117382 72703 33845
$$ packed form
17553a02001d4478A06605C4802L3440A5153a7838k31985F7383n935b78725g0381
17541e1094A34660L5207B2532a71579A10967B8190d8626j46520G51a22842b3502
17529a69116B005J35331K62178g1988L1466E4923p328k0952e088A52712m5439
17518A07273K26765A46101O063K11757F7520c15628a27366A60556b22257A81997
17507A74100a64741h992Q70E1949N9922A874R7a75885a7792B86526F1120k3119
17495C8001M3142k6348f0284B13693j06652D1250L56107j61184A01299b4214A73526
17483E2431j5074K29027B3840K40380a32400f1816A97963K44613A19062b09836
17472I2709Q8806h4722d1873a272C07127r6938a35752d8347o9035G2703C3845
$$ plain form
17460 333034 317467 225351 296676 115286 298273 367488 238704 288357 133225 325055
17450 325055 64824 21286 217332 -224825 408576 348084 77995 217491 465938 214872
17439 297399 112473 221189 247683 166728 401659 156834 333159 409946 173187 156277
17429 156277 462040 -39040 -18030 242036 11270 319173 95479 369134 205685 310337
17419 310337 195418 169544 367857 90545 244496 389032 -54353 17886 163386 370914
17409 370914 -8413 100791 258141 453913 61108 250122 297589 90680 264781 -13979 205420
17397 328442 -101189 51288 172082 100222 124978 -24744 55283 9689 201126 112019 184442
17386 184442 85693 123047 268561 8976 116319 253147 395801 65995 424746 211011
$$ packed form
17460C33034j5567r2116P1325A15286J82987O9215j28784M9653A33225J91830
17450C25055F4824B1286J96046b24825D08576o0492G7995J39496K48447B14872
17439B97399A12473J08716K6494q0955K34931A56834J76325P6787A73187j6910
17429A56277L05763c9040a8030B42036A1270L07903I5479K73655j63449J04652
17419C10337j14919k5874J98313I0545J53951J44536e4353A7886J45500K07528
17409C70914h413A00791J57350J95772F1108J89014M7467I0680J74101a3979B05420
17397C28442a01189E1288J20794p1860K4756b4744E5283I689J91437q9107P2423
17386A84442H5693L7354J45514H976J07343J36828J42654F5995L58751B11011
$$ plain form
17375 448672 34442 11509 381438 -116 212241 468925 434495 -142419 78458 270084 194567
17364 194567 -199095 122493 147515 1538 299167 244463 111238 -213124 96682 252060
17354 252060 228959 396129 -19151 182637 175407 144447 -21345 -45028 335575 181674 -15496
17342 306902 145939 335707 -353539 280592 164247 215700 113363 429947 185204 243694
17332 243694 -58768 65642 173579 139661 259631 527379 225687 76077 80100 -144929 187604
17320 -89399 245856 69822 90398 170706 -131045 89231 226505 106472 219525 34309 32067
17309 32067 -100841 58398 45539 253869 167493 -67237 88167 283912 125956 251021 -171293
17297 122973 60714 282735 -228579 -210525 300156 276247 167819 354454 222848 117891
$$ packed form
17375D48672C4442A1509L69929a16B12241K56684l4430a42419G8458J91626p5517
17364A94567a99095A22493K5022A538K97629n4704A11238b13124I6682J55378
17354B52060k3101J67170a9151A82637p230l0960b1345k3683C35575j53901a5496
17342C06902A45939J89768c53539B80592j16345N1453j02337L16584A85204N8490
17332B43694e8768F5642J07937l3918J19970K67748B25687G6077M023a44929A87604
17320h9399B45856F9822K0576Q0308a31045H9231J37274A06472J13053C4309k242
17309C2067a00841E8398j2859K08330q6376f7237H8167J95745A25956J25065a71293
17297A22973F0714K22021b28579J8054C00156k3909j08428J86635j31606j04957
$$ plain form
17287 117891 149571 255335 -57693 -131055 273622 134170 239018 -64300 164511 9581 -7150
17275 111787 169126 109540 60380 547374 4274 254521 -20780 361135 196839 14884 299938
17264 299938 257268 33318 154800 349234 192578 583456 12877 326529 123991 181419
17254 181419 153042 14895 311000 -36136 347366 226306 466490 37281 209776 24874
17243 138425 318649 126931 220630 348489 417645 124594 56302 403464 198434 352622
17233 352622 146255 232193 -42023 602900 -182425 227779 120870 112683 117588 170125 81378
17221 245359 517500 150149 178494 218627 -19625 284749 591377 -152009 206263 -85168
17210 188106 30597 -142021 551826 369979 182638 20755 296067 372136 141238 63385
$$ packed form
17287A17891L1680J05764e7693p3362B73622A34170J04848f4300A64511I581g150
17275A11787N7339n9586m9160M86994D274K50247b0780C61135j64296A4884K85054
17264B99938m2670C3318J21482J94434j56656L90878A2877L13652A23991N7428
17254A81419k8377A4895K96105c6136C47366j21060K40184C7281J72495B4874
17243A38425J80224A26931R3699J27859O9156A24594E6302L47162A98434J54188
17233C52622A46255Q5938d2023F02900a82425B27779j06909q187M905N2537H1378
17221B45359K72141A50149K8345M0133a9625B84749L06628a52009B06263h5168
17210A88106C0597a42021E51826j81847A82638B0755K75312P6069A41238F3385
$$ plain form
17199 9770 212313 299227 201776 380272 405525 167338 214670 391057 463614 359133 286021
17188 286021 473129 554217 159866 327400 255508 285412 396469 560027 -51168 438462
17177 535665 538267 92282 361260 213475 80355 209402 351514 126438 465983 332298
17167 332298 346946 201343 105082 356172 347822 168903 263175 294247 130224 376812 331041
17156 331041 407364 196064 189322 303373 310221 557166 393672 161156 213107 236408 360756
17145 360756 373936 289230 734808 456440 413892 369936 303340 419805 288436 363018 200121
17134 200121 400628 487420 273653 113887 252379 249938 508734 410768 604331 186905
17123 628439 518354 112000 497049 788779 410515 491527 339695 470708 265010 480260
$$ packed form
17199I770K02543Q6914r7451J78496K5253A67338M7332J76387P2557j04481p3112
17188B86021J87108Q1088A59866J67534p1892K9904J11057J63558e1168D38462
17177E35665K602I2282K68978j47785H0355J29047J42112A26438L39545j33685
17167C32298J4648j45603r6261K51090q350A68903R4272L1072A30224K46588m5771
17156C31041P6323A96064o742J14051O848K46945j63494A61156N1951K3301J24348
17145C60756J3180q4706M45578k78368m2548m3956o6596J16465j31369P4582j62897
17134B00121K00507Q6792k13767A13887J38492k441K58796r7966J93563A86905
17123F28439j10085A12000L85049K91730l78264Q1012j51832J31013k05698K15250
$$ plain form
17113 480260 518658 646394 -28184 291045 221362 523746 180852 292207 631695 194731
17102 132211 405466 441342 522393 344277 298007 463976 558435 485663 329945 575597
17092 575597 412900 649270 662707 468724 341870 530777 368566 408667 378609 474918
17082 474918 485771 285109 226061 415517 497886 545450 373804 355970 361263 309900 775232
17071 775232 362835 736135 403291 831275 382286 491110 397616 589684 471649 734827
17061 734827 596709 597777 651240 793845 238059 785954 396701 656286 384867 535975
17051 535975 657908 882871 809442 279070 555211 699460 787082 648072 604277 479341
17041 479341 574299 745761 789467 837103 355853 619774 701487 719188 700054 543689 300031
$$ packed form
17113D80260L8398J27736b8184B91045o9683L02384A80852J11355L39488A94731
17102A32211K73255L5876Q1051j78116m6270J65969R4459p2772j55718K45652
17092E75597j62697K36370J3437j93983j26854J88907j62211M0101l0058R6309
17082D74918J0853k00662n9048J89456Q2369M7564j71646j7834N293n1363M65332
17071G75232C62835L73300l32844M27984C82286J08824r3494J92068j18035K63178
17061G34827j38118J068N3463J42605B38059N47895l89253K59585k71419J51108
17051E35975J21933K24963p3429B79070K76141J44249Q7622j39010m3795j24936
17041D79341R4958J71462M3706M7636C55853K63921Q1713J7701j9134j56365k43658
$$ plain form
17030 300031 861189 569710 451813 501938 883507 568373 823670 853536 598197 798936
17020 798936 1126629 363377 646082 727284 637730 753573 512023 586811 666580 620542
17010 620542 765215 694313 844089 1082121 1179376 820449 897520 586391 936775 1163493
17000 1163493 887540 529701 732861 1024850 715841 787969 1060737 736327 1056581 896620
16990 896620 1111675 513284 1057790 846540 625187 1045544 902877 975853 1051522 1219962
16980 1219962 801457 1140422 1194726 839928 1090262 818013 1440274 1238679 651936 895141
16970 895141 898668 1132218 1002908 961047 1014359 1209537 1378848 856079 873567 880399 1053659
16959 1053659 1150628 1086549 1109247 1069995 1150375 1423619 1426301 1040686 1147534 1208167 1239379
$$ packed form
17030C00031N61158k91479j17897N0125L81569l15134K55297K9866k55339K00739
17020G98936L27693C63377K82705Q1202q9554J15843k41550P4788P9769m6038
17010F20542J44673p0902J49776K38032R7255l58927P7071l11129L50384K26718
17000A163493k75953l57839K03160K91989l09009P2128K72768l24410L20254j59961
16990H96620K15055E13284N44506k11250k21353M20357j42667P2976P5669J68440
16980A219962m18505L38965N4304l54798K50334k72249O22261k01595n86743K43205
16970H95141L527K33550j29310m1861N3312J95178J69311n22769J7488O832J73260
16959A053659R6969o4079K2698l9252Q0380K73244K682l85615J06848O0633L1212
$$ plain form
16948 1239379 1008320 1327257 1123751 1039983 1300701 1056397 1416311 1491942 1339042 1431803
16938 1431803 1505747 1521051 1475235 1407928 1362519 1431618 1220618 1541951 1400303 1576512
16928 1576512 1636471 1561662 1608952 1398616 1619390 1669841 1664076 1504658 1614267 1429044
16918 1429044 1525081 1536395 1484467 1498661 1422475 2058130 2025624 1658779 1699624 1840924 1891408
16907 1891408 1737378 1664138 1873293 1783048 2027586 2025851 1679821 2280243 1995702 2112462
16897 2112462 2024593 2225316 2007808 2122462 2168027 2315388 2435944 2224429 2254111 2402467
16887 2402467 2329932 2382755 2274657 2316941 2376240 2363438 2557245 2708311 2619553 2232737
16877 2232737 2288658 2468642 2678806 2618408 2202039 2590332 2734007 2452954 2960001 3010733
$$ packed form
16948A239379k31059L18937k03506q3768K60718k44304L59914P5631j52900R2761
16938A431803P3944J5304m5816o7307m5409O9099k11000L21333j41648J76209
16928A576512N9959p4809M7290k10336K20774N0451n765j59418J09609j85223
16918A429044R6037J1314n1928J4194p6186O35655l2506l66845M0845J41300N0484
16907A891408j54030p3240K09155r0245K44538j735l46030O00422k84541J16760
16897B112462q7869K00723k17508J14654M5565J47361J20556k11515K9682J48356
16887B402467p2535N2823j08098M2284N9299j2802J93807J51066q8758l86816
16877B232737N5921J79984K10164o0398m16369L88293J43675k81053N07047N0732
$$ plain form
16867 3010733 3156023 2676565 3126750 3274097 3136914 3214913 3254446 3144018 3518852 3249052
16857 3249052 3170433 3390328 3497036 3407377 3567515 3397500 3891658 3685769 3700802 3855764
16847 3855764 3833290 3854262 3928552 3817740 4093980 3982480 4499848 4781002 4245492 4242812
16837 4242812 4786138 4725660 4227081 4883589 4688925 5082910 5367939 5153722 5255905 5614479
16827 5614479 5429479 5270740 5937858 5642156 5967602 5885295 5856862 6328818 6255616 6275541
16817 6275541 6437544 6568095 6686510 6886866 7217519 7257821 7432385 7579344 7635590 7812072
16807 7812072 7902627 8195499 7999594 8533668 8460221 8762347 9098678 9516014 9568313 9800023
16797 9800023 10185054 10174832 10370514 10826793 11243502 11476422 11654704 12167712 12264544 12502027
$$ packed form
16867C010733J45290m79458M50185J47347j37183P7999L9533j10428L74834k69800
16857C249052p8619K19895J06708q9659J60138j70015M94158k05889J5033J54962
16847C855764k2474K0972P4290j10812K76240j11500N17368K81154n35510k680
16837D242812N43326o0478m98579O56508j94664L93985K85029k14217J02183L58574
16827E614479j85000j58739O67118k95702L25446q2307k8433M71956p3202J9925
16817F275541J62003J30551J18415K00356L30653M0302J74564J46959N6246J76482
16807G812072R0555K92872j95905N34074p3447L02126L36331M17336N2299K31710
16797I800023L85031j0222J95682M56279M16709K32920J78282N13008R6832K37483
$$ plain form
16787 12502027 12850899 13236826 13634264 14095399 14068955 14933608 14922998 15654194 16229853 16955449
16777 16955449 17416794 17991801 18268249 19174369 19643771 20164006 20959847 21421786 22150949
16768 22150949 22952334 24180540 24787257 25674254 26711236 28045457 28727989 29805955 30981057
16759 30981057 32271142 33775903 35228370 36460790 37959950 39503374 41482893 43117338
16751 43117338 45302360 47636766 49620867 52254684 54234193 57309980 59774077 63060108
16743 63060108 66193115 69627821 73248815 77030666 81279258 85081158 89880300 94449863
16735 94449863 98937699 104387222 109811122 115237325 120935892 126790605 132288550 138077085
16727 138077085 143768553 149143493 154240080 158814954 162727943 166268509 169265013 171445302
$$ packed form
16787A2502027L48872L85927L97438M61135k6444Q64653j0610P31196N75659P25596
16777A6955449M61345N75007K76448R06120M69402N20235P95841M61939P29163
16768B2150949Q01385J228206O06717Q86997J036982J334221O82532J077966J175102
16759C0981057J290085J504761J452467J232420J499160J543424J979519J634445
16751D3117338K185022K334406J984101K633817J979509L075787K464097L286031
16743F3060108L133007L434706L620994L781851M248592L801900M799142M569563
16735I4449863M487836N449523N423900N426203N698567N854713N497945N788535
16727A38077085N691468N374940N096587M574874L912989L540566K996504K180289
$$ plain form
16719 171445302 172468669 172843957 172276508 170432000 168449468 165267473 161613056 157014461
16711 157014461 152298568 146902199 141263488 135909630 130086875 124194457 118285570 112920291
16703 112920291 107169878 101789807 96838723 91710772 86965480 82637792 78456566 74408404
16695 74408404 70456783 67048037 63883904 60271543 57548456 54732418 52025922 50151992
16687 50151992 47559532 45321078 43290910 41604065 39531868 37749021 35934760 34890077
16679 34890077 33278249 31898485 30734395 29139622 28328844 27036571 26308808 25422541
16671 25422541 24187566 23532240 22645288 21827344 20866390 20440361 19838010 18761800 18196841
16662 18196841 17614264 17065331 16598086 16205467 15316489 14940181 14786023 14027590 13637350
$$ packed form
16719A71445302J023367L75288n67449j844508j982532l181995l654417m598595
16711A57014461m715893n396369n638711n353858n822755n892418n908887n365279
16703A12920291n750413n380071m951084n127951m745292m327688m181226m048162
16695G4408404l951621l408746l164133l612361k723087k816038k706496j873930
16687E0151992k592460k238454k030168j686845k072197j782847j814261j044683
16679C4890077j611828j379764j164090j594773q10778j292273p27763q86267
16671B5422541j234975o55326q86952q17944r60954m26029o02351j076210n64959
16662A8196841n82577n48933m67245l92619q88978l76308j54158p58433l90240
$$ plain form
16653 13637350 13462721 13154808 12774657 12184975 12052028 11934621 11461395 11478646 11140075
16644 11140075 10426435 10186416 9834994 9510960 9512492 9440455 8880378 8480602 8346629 8220774
16634 8220774 8391767 7956277 7766993 7680774 7568300 7264378 7320602 6723610 6892665 6629940
16624 6629940 6569409 7047980 6116831 6121406 6107391 5900037 5859287 5696569 5252605 5434172
16614 5434172 5590992 5187242 5031379 4952688 5222291 4751305 4829631 4583418 4707540 4788169
16604 4788169 4611577 4408106 4453811 4303631 3979472 4153835 3860239 3882815 3838697 3921232
16594 3921232 3533992 3545524 3684216 3359608 3510716 3471467 3400204 3589517 3047079 2883854
16584 2883854 2974389 3348540 3195192 3304673 3108328 3280848 2915969 3006652 2782471 2816800
$$ packed form
16653A3637350j74629l07913l80151n89682j32947j17407m73226J7251l38571
16644A1140075p13640k40019l51422l24034J532p2037n60077l99776j33973j25855
16634H220774J70993m35490j89284q6219j12474l03922N6224n96992J69055k62725
16624F629940o0531M78571r31149M575j4015k07354m0750j62718m43964J81567
16614E434172J56820m03750j55863p8691K69603m70986P8326k46213J24122Q0629
16604D788169j76592k03471M5705j50180l24159J74363k93596K2576m4118Q2535
16594C921232l87240J1532J38692l24608J51108l9249p1263J89313n42438j63225
16584B883854R0535L74151j53348J09481j96345J72520l64879R0683k24181L4329
$$ plain form
16574 2816800 2613129 2761394 2830144 2593188 2601584 2572434 2306352 2486688 2417498 2393631
16564 2393631 2288227 2118416 1915711 1987331 2338238 2464596 2416977 1987348 1934530 1772076
16554 1772076 1790035 1876624 1875864 2032349 1935156 2302384 2035269 1889345 1897545 1774920 1979915
16543 1979915 1847947 2126319 1882088 1639542 1777365 1703455 1637108 1657340 1457066 1489224
16533 1489224 1675075 1578419 1432915 1308389 1377116 1299854 1583972 1538143 1419402 1658002
16523 1658002 1307060 1566186 1238120 1367213 1644655 1483764 1452425 1435598 1463804 1440155
16513 1440155 1318112 1094577 1470182 884529 1283575 1433459 960200 956605 953943 1072914
16503 1072914 993458 1119284 1014110 1265945 998510 1092460 1246394 1070828 1057872 1393776
$$ packed form
16574B816800k03671J48265O8750k36956Q396k9150k66082J80336o9190k3867
16564B393631j05404j69811k02705P1620L50907J26358m7619m29629n2818j62454
16554A772076J7959Q6589p60J56485r7193L67228k67115j45924Q200j22625K04995
16543A979915j31968K78372k44231k42546J37823p3910o6347K0232k00274L2158
16533A489224J85851r6656j45504j24526O8727p7262K84118m5829j18741K38600
16523A658002l50942K59126l28066J29093K77442j60891l1339j6827K8206k3649
16513A440155j22043k23535L75605n85653L99046J49884m73259l595k662J18971
16503A072914p9456J25826j05174K51835k67435R3950J53934j75566j2956L35904
$$ plain form
16493 1393776 1062525 982093 986531 990443 999326 1256579 977363 1142140 696622 985856 1272642
16482 1272642 603216 778365 755465 1068674 1053454 1131757 1040924 986489 835796 901679
16472 901679 913579 931353 1024844 834776 894188 850579 546322 817865 957036 615590
16462 615590 521963 656855 805015 694398 754977 888991 805497 882568 883103 558525 936035
16451 936035 639168 686798 852777 462205 604589 647658 380918 693062 725221 841204
16441 841204 691874 638747 586229 630153 422151 646150 549957 956041 426287 725361
16431 725361 629675 541193 660524 454852 605961 750764 509777 498651 552386 299771
16421 299771 396965 272119 521801 286136 467302 375470 553723 738811 323985 599629
$$ packed form
16493A393776l31251q0432M438L912Q883K57253k79216J64777m45518K89234K86786
16482A272642F03216J75149k2900L13209j5220P8303r0833n4435j50693O5883
16472I01679J1900J7774R3491j90068N9412m3609l04257K71543J39171l41446
16462F15590r3627J34892J48160j10617O0579J34014q3494P7071N35l24578L77510
16451I36035k96867M7630J65979l90572J42384M3069k66740L12144L2159J15983
16441H41204j49330n3127n2518M3924k08002K23999r6193M06084D26287K99074
16431G25361r5686q8482J19331k05672J51109J44803k40987j1126N3735k52615
16421B99771R7194j24846K49682k35665J81166r1832J78253J85088C23985K75644
$$ plain form
16411 599629 280563 541831 382828 266559 381179 296879 343915 516663 626233 665567
16401 665567 159775 615572 218382 389747 541605 143395 256765 529965 441426 416438
16391 416438 380172 636216 235353 657555 714924 491153 552285 632347 115944 371126
16381 371126 669663 470614 369180 400338 407099 418420 268962 340064 272780 278252 372021
16370 372021 590655 484092 298302 733572 529241 442106 156468 478987 503932 461004
16360 461004 343961 380929 43291 304909 521487 394852 429078 348599 356114 90726 473820
16349 473820 550549 353873 268052 296620 250452 629955 527101 458024 162611 315107
16339 315107 79132 199197 264038 514365 193180 356037 362409 388850 445694 162867 386411
$$ packed form
16411E99629B80563K61268j59003j16269J14620q4300M7036J72748J09570L9334
16401F65567A59775M55797B18382J71365J51858A43395J13370K73200q8539k4988
16391D16438l6266K56044B35353M22202N7369k23771O1132Q0062A15944K55182
16381C71126K98537j99049j01434L1158O761J1321j49458P1102o7284N472R3769
16370C72021K18634j06563j85790M35270k04331q7135A56468L22519K4945m2928
16360D61004j17043L6968D3291K61618K16578j26635L4226q0479P515I0726L83094
16349D73820P6729j96676q5821K8568m6168L79503j02854o9077A62611J52496
16339C15107G9132J20065O4841K50327A93180J62857O372K6441N6844A62867K23544
$$ plain form
16328 386411 117305 260617 362043 353085 463884 655662 366950 86865 106473 259896
16318 259896 176582 143076 203392 136609 91708 182305 -10066 460130 61076 331227 -102979
16306 130732 529663 466283 545905 11376 -154616 404096 439587 -28744 238858 34106 421074
16295 421074 442730 291194 365610 -95768 29150 -13501 381962 299596 417067 303639 339743
16284 339743 124853 -6934 247532 441287 257315 156226 243045 -95640 134591 -16354
16273 135651 144281 38988 44017 75675 21603 -13147 62909 222531 114482 154948 132977
16262 132977 86147 93957 -13417 -212660 92076 416141 346440 127957 76787 131489 -66023
16250 290000 -19021 493570 372838 -112042 496914 234647 40621 337081 22335 206738
$$ packed form
16328C86411A17305J43312J01426q958J10799J91778k88712H6865J9608J53423
16318B59896q3314l3506O0316o6783m4901R0597a0066D60130F1076K70151a02979
16306A30732L98931o3380P9622A1376a54616D04096L5491b8744B38858C4106L86968
16295D21074K1656j51536P4416i5768B9150a3501C81962q2366J17471j13428L6104
16284C39743A24853f934B47532J93755j83972j01089Q6819i5640A34591a6354
16273A35651Q630C8988N029L1658B1603a3147F2909J59622j08049M0466k1971
16262A32977m6830P810a3417j99243I2076L24065o9701A27957n1170N4702f6023
16250B90000a9021D93570j20732a12042D96914B34647D0621K96460B2335J84403
$$ plain form
16240 206738 161318 -30176 333869 150476 -46782 -240611 50219 -153118 -74026 250331
16229 78175 426909 84213 -69422 121810 71033 48895 212246 215962 99833 120999 392484
16218 392484 304275 458115 -309893 -5711 238565 154143 463713 -219767 199321 54099
16207 449075 -19116 36309 45602 6054 30075 29591 203116 153332 406505 61197 236445 -79632
16194 150209 239080 169398 609601 -67564 -95520 389067 240477 171611 120420 -104556 76631
16182 104612 112706 26620 96389 315442 129206 259348 -208561 -75060 -41627 -1451 -114671
16171 -114671 432381 402295 83552 -87720 147980 -308326 -24241 175795 -71902 -20349 -157017
16160 -157017 295114 -145715 -58252 -90907 76875 71388 -58576 -28507 168863 -69387 483356
$$ packed form
16240B06738m5420c0176C33869A50476d6782j93829E0219a53118g4026B50331
16229G8175L48734H4213f9422A21810n0777k2138J63351L716I9833K1166K71485
16218C92484q8209J53840c09893e711B38565q4422L09570b19767A99321E4099
16207D49075a9116C6309R293F054K4021m84J73525m9784K53173F1197J75248g9632
16194A50209Q8871o9682M40203f7564k7956C89067j48590o8866n1191a04556G6631
16182A04612Q094B6620O9769K19053A29206J30142b08561g5060L3433a451j13220
16171a14671D32381l0086H3552h7720A47980c08326b4241A75795g1902b0349j36668
16160a57017B95114a45715e8252l2655G6875n487e8576b8507A68863f9387D83356
$$ plain form
16148 -214387 367357 -26896 218729 -64442 91326 -102931 120214 93070 67303 -83094 360856
16136 185413 217746 -24419 84106 229582 257481 136630 38755 197138 147111 -197197 239204
16124 7929 -70223 191175 122683 1967 -49420 -14067 -140915 -126042 275233 169285 -9346
16112 -279661 202472 32160 235984 253827 -60029 405042 30966 -104055 98949 174153 197633
16101 197633 -103860 115181 98626 165958 -46251 243789 57162 143351 -201786 -135526 23146
16089 132603 -36160 -224107 19698 15204 79084 180075 37127 434720 88617 87519 -151952
16077 -145169 -54613 -150901 -45924 71904 91276 2279 -14427 -42402 147347 65534 65928 1772
16064 258166 184241 -139041 209887 -286922 425728 -9816 -97468 -120944 194063 15078 -1546
$$ packed form
16148b14387C67357b6896B18729f4442I1326a02931A20214k7144k5767h3094C60856
16136A85413L2333b4419H4106J45476K7899j20851C8755J58383n0027a97197B39204
16124G929g0223A91175o8492A967d9420a4067j26848J4873B75233j05948i346
16112b79661B02472C2160K03824J7843f0029D05042C0966a04055I8949P5204K3480
16101A97633a03860A15181j6555O7332d6251B43789E7162Q6189b01786O6260B3146
16089A32603c6160j87947A9698m494O3880J00991C7127L97593H8617j098a51952
16077a45169e4613r6288d5924G1904J9372B279a4427k7975A47347F5534L94A772
16064B58166p3925a39041B09887b86922D25728i816q7652k3476A94063A5078a546
$$ plain form
16052 -74800 40422 -3518 90532 243462 211567 79869 -39360 -252795 -490711 122594 -80471
16040 -108766 -42891 229970 158396 -29522 25498 -76619 -5539 -82907 -138043 219162 -92651
16028 102079 97478 -461055 166244 -30843 -74252 447075 -337395 332769 168465 -77842
16017 103551 -282186 194348 273367 -119728 32828 201712 103833 51947 -231970 -139890
16007 -139890 170284 -387391 131683 89067 -49754 -52763 -167399 1275 -134964 -54980 128409
15995 -121644 -92072 12283 -129554 -197253 -24973 -187759 153221 27412 -11307 -60807 -39996
15984 -39996 220682 414742 594897 185167 63712 583677 450362 138767 103034 -241850
15973 20252 317434 51580 121187 -202203 68943 24345 65546 -177637 -217857 -195926 466000
$$ packed form
16052g4800D0422c518I0532J52930l1895G9869c9360k13435k37916A22594h0471
16040a08766d2891B29970p1574b9522B5498g6619e539p7368n5136B19162i2651
16028A02079m601d61055A66244c0843m3409D47075c37395C32769j64304g7842
16017A03551b82186A94348P9019a19728C2828J68884r7879n1886b31970R2080
16007a39890A70284c87391A31683m2616d9754l009j14636A275a34964e4980A28409
15995a21644K9572A2283a29554o7699b4973j62786A53221B7412a1307m9500K0811
15984c9996B20682J94060J80155A85167F3712N19965j33315A38767l5733b41850
15973B0252K97182E1580O9607b02203F8943B4345M1201a77637m0220K1931D66000
$$ plain form
15961 -19490 -8376 -43377 212479 228509 76918 130180 -127952 95192 -200164 -87276 -113383
15950 -113383 -244108 2199 115139 -108440 -95013 -202702 172462 -75282 27710 -125872
15939 102935 65436 -15601 8123 20546 -84657 -196198 -198291 44312 -88077 2819 -67320 -201302
15927 -201302 -186171 -346469 -26377 29551 -329070 71983 -264615 -284065 -235710 278295 -215948
15915 -18919 40273 -280190 257952 -129016 53055 -3008 -64265 41200 -120763 -234946 137559
15903 210642 112782 34232 -243130 -35277 69375 221843 77106 -55775 -234768 -196268 10233
15891 -443658 -156156 -2431 157805 -91216 -7142 -56995 -137160 -14178 171180 26923 -86033
15879 -7674 -323794 25654 203260 -55708 109871 96582 -36086 287385 90649 67360 56613
$$ packed form
15961a9490h376l5001B12479J6030G6918N3262a27952I5192b00164h7276k6107
15950a13383j30725B199J12940a08440J3427j07689A72462g5282B7710a25872
15939A02935l7499a5601H123J2423h4657j11541k093D4312h8077B819f7320j33982
15927b01302J5131j60298b6377B9551c29070G1983b64615j9450M8355B78295b15948
15915a8919D0273b80190B57952a29016E3055c008o1257D1200a20763j14183A37559
15903B10642r7860C4232b43130c5277F9375J52468G7106e5775j78993L8500A0233
15891d43658a56156b431A57805i1216g142m9853q0165a4178A71180B6923h6033
15879g674l16120B5654J77606e5708A09871j3289c6086B87385I0649k3289j0747
$$ plain form
15868 56613 -265285 -101152 37002 195277 150330 123481 73388 158588 381248 -256349 -132183
15857 -132183 67137 -64171 -139212 -160416 -50638 -84627 -186024 346597 99204 125684 167217
15846 167217 246437 405509 -204625 223964 58035 -64930 50650 1665 91314 243594 -8333
15834 -118651 -331184 335502 406828 -26671 -107806 -127240 -45181 -186853 -122084 138117 -117911
15822 70751 -89225 414504 -179697 -187488 -107152 129960 23853 132258 187464 -155286 292688
15810 7430 126744 95838 -135449 -196560 188451 15864 32898 45780 -197981 -288243 -113614
15798 77903 -316285 -16313 -277976 191947 78127 -26001 328021 -41284 -159544 -120502 -268851
15787 -268851 -18946 -258717 -24645 -65274 402183 188000 -67744 -285745 30727 -192784
$$ packed form
15868E6613b65285a01152C7002J58275m4947k6849n0093Q5200K22660b56349J24166
15857a32183F7137f4171p5041k1204e0638l3989j01397C46597I9204K6480M1533
15846A67217P9220J59072b04625B23964E8035f4930E0650A665Q9649J52280h333
15834a18651k12533C35502P1326b6671q1135j9434d5181j41672O4769A38117a17911
15822G0751h9225D14504a79697p791Q0336A29960B3853J08405N5206a55286B92688
15810G430J19314l0906a35449o1111A88451A5864J7034J2882a97981r0262a13614
15798G7903c16285a6313k61663A91947G8127b6001C28021d1284j18260L9042j48349
15787b68851a8946k39771b4645m0629D02183A88000f7744k18001C0727a92784
$$ plain form
15776 197185 255663 -209375 -119327 -10863 -151839 193469 87151 81056 -161185 51100 -121794
15764 66261 -111798 4406 -174870 82408 -281894 119214 -25453 -301841 182312 57451 -35518
15752 -140049 41427 307809 -346437 -61788 -237216 39699 -149014 152877 68105 55837
15742 55837 -11221 -249564 -94909 204815 15913 -23292 -139539 181032 -4927 84227 -211115
15730 -114241 -23689 -374357 -131990 -400030 266546 -122936 -46055 204529 -6287 -70195
15720 -70195 -45751 -197499 -102321 54779 108682 136109 192637 98293 -265846 -72200 -124011
15709 -124011 -1487 -157156 -180485 -565 65072 -171451 -265533 42024 -15559 -355126 -298403
15698 -298403 127453 -184751 8444 53228 69049 -401087 -53173 955 11518 -138914 139318
$$ packed form
15776A97185N8478b09375R0048a0863j40976A93469H7151o095a61185E1100a21794
15764F6261a11798D406a74870H2408b81894A19214b5453k76388A82312E7451c5518
15752a40049D1427K66382c46437f1788j75428C9699a49014A52877F8105j2268
15742E5837a1221k38343i4909B04815A5913b3292j16247A81032d927H4227b11115
15730a14241b3689l50668a31990k68040B66546a22936d6055B04529f287o3908
15720g0195K4444j51748R5178E4779N3903K7427N6528r4344b65846g2200n1811
15709a24011a487j55669k3329e65F5072a71451r4082D2024a5559l39567N6723
15698b98403A27453a84751H444M4784J5821d01087e3173I55J0563a38914A39318
$$ plain form
15686 -25361 191220 184271 -147826 -354900 385178 286185 -81024 73335 -84804 12897 -124385
15674 -62984 -171016 123521 37763 -133715 -50201 -50429 69023 60066 66654 -3558 47626 -165729
15661 185556 -273555 -14650 -203394 -105937 29993 176011 32112 -16075 -3822 -52092 -304178
15650 -304178 -13540 102906 -13740 36463 168251 84739 -164806 -19829 -161559 -97478 -306048
15639 -306048 -24737 195427 -21946 -10218 -52688 2876 -69132 65161 -8783 -218410 -197178
15628 -197178 243530 -48184 -147876 64935 -278436 26226 300656 37350 -74151 1651 23298
15617 23298 42371 367578 -79758 -112767 166303 -221136 -37587 91129 17027 -136315 141135
15605 1976 -44176 343820 -11496 -421026 -192244 -34880 79831 -137582 357767 -96388 84378
$$ packed form
15686b5361A91220o949a47826k07074C85178r8993h1024G3335h4804A2897a24385
15674f2984j08032A23521C7763a33715e0201k28F9023q957O588c558D7626a65729
15661A85556b73555a4650j88744R7457B9993J46018C2112a6075c822m8270k52086
15650c04178a3540A02906a3740C6463J31788q3512a64806a9829j41730O4081k08570
15639c06048b4737A95427b1946a0218m2470B876f9132F5161h783k09627K1232
15628a97178B43530d8184r9692F4935b78436B6226K74430C7350g4151A651K1647
15617B3298J9073L25207g9758l3009A66303b21136c7587I1129A7027a36315A41135
15605A976d4176C43820a1496m09530a92244c4880G9831a37582C57767i6388H4378
$$ plain form
15593 -48516 -259544 167798 98106 -78994 -127227 -40563 -338192 -80031 170834 -174008 310589
15581 -127966 -228303 -17075 114713 151263 -196133 11848 -190411 -172346 140511 -119620
15570 -9780 -97127 135226 -64606 -113958 128022 -386770 -60960 -250917 124824 254088 -73407
15558 -27630 44062 -768 -53246 139015 -264561 75697 49631 -98847 301432 -260896 -62184
15546 -166331 -89496 22881 156552 -46019 -497711 104643 41275 124875 -95935 207435 308722
15535 308722 -19589 -46943 151709 -46504 182400 249035 -53222 45069 33676 -152881 -45125
15523 31043 86360 42509 210999 -178179 42962 -239688 -166 -392089 -22620 67857 89942
15512 89942 -140566 -157231 472754 -150926 -2393 6823 158936 -199080 405579 -170467 -264749
$$ packed form
15593d8516k11028A67798o9692g8994m8233d0563k97629h0031A70834a74008C10589
15581a27966j00337a7075A14713L6550a96133A1848a90411J8065A40511a19620
15570i780q7347A35226f4606m9352A28022c86770f0960j89957A24824J29264g3407
15558b7630D4062g68n2478A39015b64561G5697k6066i8847C01432b60896f2184
15546a66331P6835B2881J33671d6019m51692A04643D1275Q3600i5935B07435J01287
15535C08722a9589k7354A51709d6504A82400O6635e3222D5069j1393a52881d5125
15523C1043N5317D2509J68490a78179D2962b39688a66l91923b2620F7857K2085
15512H9942a40566j6665D72754a50926b393F823J52113a99080D05579a70467r4282
$$ plain form
15501 -264749 145694 -424316 -28504 -68506 281582 40909 417423 241113 -96550 -52950
15491 -52950 -167004 -214919 -95664 120133 55912 -418441 51290 31812 -206979 104829 31851
15479 115837 -20391 10429 82462 242546 46820 371915 -201102 15825 364203 319977 -194421
15467 -114698 -314524 -279356 -63033 -130112 155447 -336719 -31248 -84645 36404 14864 57527
15456 57527 83059 299477 85504 269290 -277487 -70080 1967 50788 41483 128311 -116150
15444 85 -190843 -42557 -150995 -116354 -120250 -199316 182092 -286058 -251046 70937 167292 94091
15432 94091 -192773 -82061 74981 85471 -212125 -73626 -97932 -84861 -210132 -160278 -483803
15421 -483803 146352 -15191 18075 -50492 87065 -85115 -104591 -162349 -302691 279848 182161
$$ packed form
15501b64749A45694d24316b8504m0002B81582D0909L76514j76310i6550M3600
15491e2950j14054m7915i5664A20133E5912d18441E1290j9478b06979A04829C1851
15479A15837b0391A0429P2033J60084D6820L25095b01102A5825L48378m4226a94421
15467a14698j99826L5168f3033o7079A55447c36719c1248n3397C6404A4864M2663
15456E7527K5532K16418H5504J83786b77487g0080A967M8821r305Q6828a16150
15444H5a90843d2557j08438L4641l896p9066A82092b86058L5012G0937R6355p3201
15432I4091a92773h2061G4981J0490b12125g3626k4306J3071j25271M9854l23525
15421d83803A46352a5191A8075e0492H7065h5115j9476n7758j40342B79848r7687
$$ plain form
15410 182161 56763 -41534 -47513 58687 -11090 25829 -136639 73864 240222 190494 -197910
15398 -171027 174400 135849 111994 -136953 116633 -290297 60315 -59577 -75237 -33620 50435
15386 349777 211327 88737 184013 69464 145009 8535 105570 -176129 18039 25269 290143
15375 290143 184985 -214339 118169 -173513 179385 -56777 220716 -418546 37050 -54043
15364 220784 141555 113600 97136 -187782 49992 179088 24977 85440 -113214 -335969 -253196
15353 -253196 -41349 15792 -174010 75955 19670 308066 8396 166143 81045 235318 69176
15341 -41364 -163438 204067 -49620 -250052 198211 -196064 13391 136723 266469 -54003
15330 129685 286898 83457 59566 310265 21090 283960 347525 -93981 -9880 -49904 163699
$$ packed form
15410A82161E6763d1534n979E8687a1090B5829a36639G3864J66358m9728a97910
15398a71027A74400l8551k3855a36953A16633b90297F0315e9577j5660c3620E0435
15386C49777j38450H8737R5276F9464P5545H535R7035a76129A8039P230K64874
15375B90143j05158b14339A18169a73513A79385e6777B20716d18546C7050e4043
15364B20784p9229k7955j6464a87782D9992J29096B4977O0463a13214k22755Q2773
15353b53196d1349A5792a74010G5955A9670K88396H396J57747H1045J54273F9176
15341d1364j22074B04067d9620k00432A98211a96064A3391J23332J29746e4003
15330A29685J57213H3457k3891K50699B1090K62870O3565i3981i880m0024A63699
$$ plain form
15318 -144230 -132791 12356 89653 -123025 -22667 369736 8195 -154910 107357 113189 125558
15307 125558 406822 -348517 38493 46675 -10545 105495 -169803 172388 256640 76957 206284
15296 206284 -203175 39092 352167 375198 65415 81794 115118 -29625 212370 220892 -36720
15284 161559 -126167 427507 92203 277658 96442 -160910 -118271 -112608 -12186 87355 75760
15273 75760 147883 37539 96293 40549 -154423 -14362 -191458 162557 67410 61429 -13956
15261 -189642 217079 179992 4239 -25613 -69007 257735 352922 -122826 -30805 181960 273243
15250 273243 189942 211597 462522 1055723 1671788 2001247 1771635 2195741 1277287 597515
15239 377228 257320 -190953 73991 82066 -34123 30227 89049 19996 10522 -86531 162931
$$ packed form
15318a44230J1439A2356P7297a23025b2667C69736H195a54910A07357N832J2369
15307A25558K81264c48517C8493Q182a0545A05495a69803A72388Q4252G6957J29327
15296B06284b03175C9092L13075K3031F5415J6379L3324b9625B12370Q522c6720
15284A61559a26167D27507I2203J85455I6442a60910M2639N663a2186H7355j1595
15273G5760P2123C7539N8754D0549a54423a4362j77096A62557F7410n981a3956
15261a89642B17079l7087D239b5613m3394B57735R5187a22826c0805A81960R1283
15250B73243q3301K1655K50925N93201O16065L29459k29612M24106r18454E97515
15239C77228j19908a90953G3991Q075c4123C0227N8822A9996r474h6531A62931
$$ plain form
15227 -22432 -20493 -90396 349980 -59388 -13637 122165 181086 211703 291390 12006 21914 122032
15215 122032 82197 -15712 58330 172782 146804 -354 100139 87760 -198967 221192 -94227
15203 135705 40755 -34636 -28616 -62126 -96199 87240 221222 -87077 80825 343890 17607
15191 -160708 259728 56119 -1033 435315 485027 230348 77877 -49926 -53219 78689 103764
15180 103764 -141398 -53613 -189339 88913 -361504 -131749 60619 -120304 18781 -6313 -48192
15169 -48192 -23545 420425 129039 260101 -38491 112076 -237883 167791 -140833 74467
15158 484642 170258 146287 -179539 117638 3191 82908 290020 51039 60776 -59020 -71604
15147 -71604 -28864 -73912 -174644 -185148 227371 46727 -140463 -161621 30188 212175 138621
$$ packed form
15227b2432J939o9903C49980e9388a3637A22165N8921L0617P9687A2006R908J00118
15215A22032l9835a5712E8330J14452k5978c54A00139j2379a98967B21192i4227
15203A35705D0755c4636O020l3510l4073H7240J33982h7077H0825K63065A7607
15191a60708B59728E6119a033D35315M9712B30348G7877d9926l293G8689K5075
15180A03764a41398e3613j35726H8913c61504a31749F0619a20304A8781f313m1879
15169d8192b3545D20425A29039J31062c8491A12076b37883A67791a40833G4467
15158D84642A70258k3971a79539A17638C191P9717K07112E1039R737e9020j2584
15147g1604b8864m5048j00732j0504B27371D6727a40463k1158C0188J81987p3554
$$ plain form
15136 138621 -47620 -227636 -156190 4639 191357 240305 446278 -32888 51770 279531 127873
15124 197969 234520 15659 171885 266765 86743 132713 80741 65653 62305 -19081 203779
15112 184087 258156 93626 346334 18306 95035 57816 50442 -239749 258294 25107 142116
15101 142116 158737 -157554 -35189 191736 -20827 -38672 107657 150654 -367389 84822 -9831
15089 134424 312853 251004 383639 173945 292055 203388 70456 506765 193811 566053
15079 566053 559589 366231 255053 373081 149196 -135897 168373 284824 363067 147061
15068 356392 -78950 338529 119790 -119950 191336 98871 33535 228595 -30961 126025
15057 95936 205427 224863 -10963 373987 -58814 89737 194639 422724 -17081 -31686 29930
$$ packed form
15136A38621d7620j80016P1446D639J86718M8948K05973c2888E1770K27761A27873
15124A97969L6551A5659J56226R4880H6743M5970n1972j5088l348a9081B03779
15112A84087P4069I3626K52708A8306P6729l7219p374b39749B58294B5107J17009
15101A42116J6621a57554c5189A91736b0827j7845A07657M2997c67389H4822i831
15089A34424J78429o1849J32635A73945J18110q8667G0456M36309A93811L72242
15079E66053o464j93358j11178J18028A49196a35897A68373J16451P8243A47061
15068C56392g8950C38529A19790a19950A91336r2465C3535J95060c0961A26025
15057I5936J09491J9436a0963C73987e8814H9737J04902K28085a7081j4605B9930
$$ plain form
15045 238078 304408 104365 256785 163009 34792 95505 151891 336220 -11546 -7722 241510
15033 364213 -48306 86150 62826 9258 322688 -121343 64297 228208 337496 -4900 282776
15021 262533 -131821 90757 341707 329311 33537 6664 134051 -68670 264861 217657 222811
15010 222811 313430 273905 454861 -939 -95000 432233 458053 25658 193352 55227 258672
14999 258672 317958 264028 463044 190975 296308 269289 249153 185188 -36294 159155 -77919
14987 270285 236313 165744 -106629 64068 -2372 80154 428001 214760 15359 290962 571360
14976 571360 405559 76449 183879 199079 61499 470208 -3528 189777 297002 -42583 482667
14964 159533 275174 160755 424167 26696 233510 265292 51741 65147 18703 292169
$$ packed form
15045B38078O6330A04365J52420r3776C4792O0713N6386J84329a1546L824B41510
15033C64213d8306H6150k3324I258L13430a21343F4297J63911J09288d900B82776
15021B62533a31821I0757K50950j2396C3537F664J27387f8670B64861m7204N154
15010B22811R0619l9525J80956i39r4061D32233K5820B5658J67694E5227K03445
14999B58672N9286n3930J99016A90975J05333k7019k0136o3965c6294A59155g7919
14987B70285l3972p0569a06629F4068b372H0154L47847k13241A5359K75603K80398
14976E71360j65801G6449J07430J5200F1499M08709c528A89777J07225d2583D82667
14964A59533J15641j14419K63412B6696K06814L1782E1741J3406A8703K73466
$$ plain form
14954 292169 456651 303271 377493 9741 150323 512193 247027 362490 611 349257 128240
14942 265123 572414 372942 515114 527508 194962 127926 174081 70805 341733 461938
14932 461938 323865 230684 68394 180510 265416 327703 -20301 399777 375166 451505 231721
14921 231721 384523 336809 484669 196041 442931 618984 342441 220651 148774 258481
14911 258481 466540 646201 577549 228745 379324 481906 445656 488995 306017 427388
14901 427388 326806 76262 138830 611444 587730 249480 398988 445666 463963 195423
14890 521168 316911 191382 210050 134721 475131 327581 272033 304504 288569 446557
14880 446557 169738 145892 242856 366773 319898 183866 394121 269485 365141 318148
$$ packed form
14954B92169J64482j53380P4222I741J40582L61870B47027J15463F11L48646A28240
14942B65123L07291j99472J42172J2394A94962o7036M6155G0805K70928J20205
14932D61938j38073r3181F8394J12116Q4906O2287b0301C99777k4611P6339k19784
14921B31721J52802m7714J47860A96041K46890J76053k76543j21790p1877J09707
14911B58481K08059J79661o8652B28745J50579J02582l6250M3339j82978J21371
14901D27388j00582G6262O2568M72614k3714B49480J49508M6678J8297A95423
14890E21168k04257j25529J8668p5329L40410j47550n5548L2471j5935J57988
14880D46557A69738k3846R6964J23917m6875j36032K10255j24636R5656m6993
$$ plain form
14870 318148 624547 463617 195459 346023 521811 639605 604307 462447 430574 63774
14859 247171 648326 517691 196091 281650 408730 397177 406464 192037 659050 759652
14849 759652 242951 590813 389034 37033 736212 549237 16560 310726 735488 464953
14839 464953 288717 282017 468453 380393 652619 471828 593664 205565 869259 320684
14828 357463 677865 532661 401179 284363 151452 480237 565173 659192 512904 555368
14818 555368 443327 116420 296518 963657 659372 342461 691592 375223 494258 227634
14807 521051 574658 561993 572472 247818 274627 479988 635947 621099 533807 656379 652013
14796 652013 397300 479355 370673 238442 417308 556759 408736 540192 383065 707923
$$ packed form
14870C18148L06399j60930A95459J50564J75788J17794l5298j41860l1873F3774
14859B47171M01155j30635A96091Q5559J27080j1553R287A92037M67013J00602
14849G59652B42951L47862k01779C7033O99179j86975A6560K94166M24762k70535
14839D64953j76236o700J86436q8060K72226j80791J21836B05565O63694C20684
14828C57463L20402j45204j31482j16816j32911L28785Q4936R4019j46288M2464
14818E55368j12041A16420J80098O67139l04285l16911L49131l16369J19035B27634
14807E21051N3607j2665J0479B47818K6809K05361J55959j4848q7292J22572m366
14796F52013k54713Q2055j08682j32231J78866J39451j48023J31456j57127L24858
$$ plain form
14786 707923 663890 320451 531579 512011 431859 401945 297293 482943 627300 504482
14776 504482 745398 942697 499055 480069 776778 390697 576945 808708 677418 522209
14766 522209 783656 673615 579163 477760 151246 231714 600635 475823 435248 428277
14756 428277 715627 440653 624838 643475 480876 681740 740225 674697 681771 676083 785307
14745 785307 591528 717365 943317 618480 843573 587289 537516 796836 716781 843459
14735 843459 752093 953885 969060 745369 845009 544516 677927 824222 669875 785444
14725 785444 681938 782046 632630 508403 470087 957449 644331 782856 306840 650079
14715 650079 835255 751677 713911 946151 640214 624849 539772 873052 1031250 975051
$$ packed form
14786G07923m4033C20451K11128j9568q0152k9914j04652J85650J44357j22818
14776E04482K40916J97299m43642j8986K96709l86081J86248K31763j31290j55209
14766E22209K61447j10041r4452j01403A51246Q0468L68921j24812m0575o971
14756D28277K87350k74974J84185J8637j62599K00864N8485o5528P074n688J09224
14745G85307j93779J25837K25952l24837K25093k56284m9773K59320q0055J26678
14735H43459r1366K01792J5175k23691R9640l00493J33411J46295j54347J15569
14725G85444j03506J00108j49416j24227l8316M87362l13118J38525C06840L43239
14715F50079J85176q3578l7766K32240l05937j5365q5077L33280J58198n6199
$$ plain form
14705 975051 851742 911931 835237 740587 1239464 848203 708302 707587 978620 856361 896510
14694 896510 614614 1017131 465914 1279847 878924 842518 898226 891685 849942 1199554
14684 1199554 1085238 625824 1036948 1315948 895688 1181535 1109472 1161801 1007369 1132293
14674 1132293 755697 1046016 1113180 1254335 896768 974685 971934 1036860 534386 1048809
14664 1048809 820320 1015301 1297021 991770 1113801 1044191 843345 1233534 1104083 1303403
14654 1303403 834004 1061887 1183406 864946 1232067 886218 970920 1338170 1276605 1227464
14644 1227464 1596283 1296633 1002737 1084713 1381959 1386154 873522 1270280 1623594 1243894
14634 1243894 1274217 1282945 1400064 1419198 1284460 1493189 1413089 1453216 1193565 1726079
$$ packed form
14705I75051j23309O0189p6694r4650M98877l91261j39901p15K71033j22259M0149
14694H96510k81896M02517D65914Q13933m00923l6406N5708o541m1743L49612
14684A199554j14316m59414M11124K79000m20260K85847p2063N2329j54432J24924
14674A132293l76596K90319O7164J41155l57567P7917k751O4926n02474N14423
14664A048809k28489J94981K81720l05251J22031o9610k00846L90189j29451J99320
14654A303403m69399K27883J21519l18460L67121l45849Q4702L67250o1565m9141
14644A227464L68819k99650k93896Q1976K97246M195n12632L96758L53314l79700
14634A243894L0323Q728J17119J9134j34738K08729q0100M0127k59651N32514
$$ plain form
14624 1726079 1367777 1434334 1198647 1506295 1544571 1584555 1548724 1384875 1259457 1373415
14614 1373415 1418168 1385652 1414871 1722299 1439944 1414602 1291444 1684653 1515233 1694922
14604 1694922 1545005 1553208 1434182 1766247 1840746 1631084 1456329 1637783 1672546 1597662
14594 1597662 1496991 1799652 1830013 1892703 1741342 1805300 1588049 2123000 1487332 2211326
14584 2211326 2130695 2334232 2018536 1693807 2113625 2084373 2182552 1992468 2065447 2043006
14574 2043006 2157750 2002685 2279645 1824638 2383412 2375185 2572182 2718362 1913594 2603475
14564 2603475 2612316 2732261 2377521 2470087 2595953 2877432 2612188 2854495 3160576 3374819
14554 3374819 2980798 3604521 4308307 4673814 5317242 7647136 11882650 20771873 35021859
$$ packed form
14624A726079l58302O6557k35687L07648L8276L9984l5831j63849j25418J13958
14614A373415M4753l2516K9219L07428k82355k5342j23158L93209j69420J79689
14604A694922j49917Q203j19026L32065P4499k09662j74755J81454L4763p4884
14594A597662j00671L02661L0361O2690j51361O3958k17251N34951o35668P23994
14584B211326q0631K03537l15696l24729M19818k9252R8179j90084P2979k2441
14574B043006J14744j55065K76960m55007N58774q227J96997J46180q04768O89881
14564B603475Q841J19945l54740R2566J25866K81479k65244K42307L06081K14243
14554C374819l94021O23723P03786L65507O43428K329894M235514Q889223J4249986
$$ plain form
14545 35021859 45023988 26640956 11237186 7249765 6254426 3596831 2587377 1975189
14537 1975189 1768662 1903207 1821600 1674754 2477033 1977742 2076100 2006761 2139500 2197661
14527 2197661 2503525 2361036 2026121 2629689 2735479 2419490 2309230 2726409 2424613
14518 2424613 2832972 2465746 2632133 2787595 2429241 2769529 2840350 3260166 2733290 3157529
14508 3157529 2868563 2787635 3201286 3021569 2880630 3224408 3230209 2922151 3289521 2962528
14498 2962528 3348144 3270209 3325924 3202687 3748818 3393025 3687089 3312092 3487409 3812279
14488 3812279 3832524 3719120 3793140 3844881 3596575 3783739 3688212 4199973 3940393 3401576
14478 3401576 3699504 4072128 3981236 4124491 4263762 4514822 4483734 4373579 4244178 4826245
$$ packed form
14545C5021859J0002129j8383032A1237186l987421r95339k657595j009454o12188
14537A975189k06527J34545q1607j46846Q02279m99291R8358o9339J32739N8161
14527B197661L05864j42489l34915O03568J05790l15989j10260M17179l01796
14518B424613M08359l67226J66387J55462l58354L40288P0821M19816n26876M24239
14508C157529k88966q0928M13651j79717j40939L43778N801l08058L67370l26993
14498B962528L85616p7935N5715j23237N46131l55793K94064l74997J75317L24870
14488C812279K0245j13404P4020N1741k48306J87164r5527N11761k59580n38817
14478C401576K97928L72624r0892J43255J39271K51060l1088j10155j29401N82067
$$ plain form
14468 4826245 4784302 4287421 4468813 4638264 4529409 4773955 4719528 4895785 4828270 5197516
14458 5197516 5210832 5132091 4842472 5372129 5270166 5410711 5452951 5431965 5557061 5321233
14448 5321233 5527463 5576977 5917961 6007307 6119717 6088607 6103201 6144331 6230090 6186490 6216096
14437 6216096 6365530 6438865 6552198 6607708 7098738 6973628 6763186 7298179 7362237 6986939
14427 6986939 7588713 7377770 7626758 7564658 7911088 7451714 8159640 8011824 8246652 8160190
14417 8160190 8366396 8691997 8732230 8968386 8824046 9220754 9315911 9529729 9418360 9375771
14407 9375771 10028066 9565533 10154462 10295641 10436406 10398132 10429757 10820660 11129003 10997579
14397 10997579 11413980 11156715 11697092 12001984 12225307 12187871 12389199 12863861 13033705
$$ packed form
14468D826245m1943m96881J81392J69451j08855K44546n4427J76257o7515L69246
14458E197516J3316p8741k89619N29657j01963J40545M2240k0986J25096k35828
14448E321233K06230M9514L40984Q9346J12410l1110J4594M1130Q5759m3600K9606
14437F216096J49434P3335J13333N5510M91030j25110k10442N34993O4058l75298
14427F986939O01774k10943K48988o2100L46430m59374P07926j47816K34828q6462
14417H160190K06206L25601M0233K36156j44340L96708R5157K13818j11369m2589
14407I375771O52295m62533N88929J41179J40765l8274L1625L90903L08343j31424
14397A0997579M16401k57265N40377L04892K23323l7436K01328M74662J69844
$$ plain form
14388 13033705 13183248 13628157 13588141 14035571 13882567 14162145 14858337 14897479 15254277 15463097
14378 15463097 15570522 15983039 16470459 16835682 16654130 17366759 17623245 17761768 18306533
14369 18306533 18732354 18891388 19503938 19587792 20146722 20483937 21237577 21913512 22262592
14360 22262592 22580000 22969513 23532190 24083504 24846241 25348804 25839193 26253657 27107116
14351 27107116 27886051 28283015 29288319 30058125 31006336 31682268 32405794 33212919 34224899
14342 34224899 35167902 35980582 37092661 37893689 39022370 40234349 41449989 42617304
14334 42617304 43785713 45101363 46341831 48076172 49225128 50614338 52601543 54348355
14326 54348355 56124015 58125012 60025842 61834464 64074243 66265200 68873670 71334223
$$ packed form
14388A3033705J49543M44909m0016M47430j53004K79578O96192L9142L56798K08820
14378A5463097J07425M12517M87420L65223j81552P12629K56486J38523N44765
14369A8306533M25821J59034O12550Q3854N58930L37215P53640O75935L49080
14360B2262592L17408L89513N62677N51314P62737N02563M90389M14464Q53459
14351B7107116P78935L96964J005304P69806R48211O75932P23526Q07125J011980
14342C4224899R43003Q12680J112079Q01028J128681J211979J215640J167315
14334D2617304J168409J315650J240468J734341J148956J389210J987205J746812
14326E4348355J775660K000997J900830J808622K239779K190957K608470K460553
$$ plain form
14318 71334223 73890504 77195523 79361947 82690856 85982779 89284075 92823811 96559568
14310 96559568 100631149 105080154 109606685 114166577 119595438 124912634 130308203 136219505
14302 136219505 142910424 149531313 156604258 164016074 172230213 180457166 189033919 198587064
14294 198587064 208788984 218949119 230189208 241798261 253761530 266522415 279740661
14287 279740661 293436831 307511663 321953415 336503528 351310287 366270821 380462271
14280 380462271 394764932 408368947 421092052 432513171 442699667 450770968 457333805
14273 457333805 460192022 458055696 453696359 450879501 448788950 445832518 441465428 434780748
14265 434780748 424982930 413239909 400260503 386364356 371890804 356321901 340767365
$$ packed form
14318G1334223K556281L305019K166424L328909L291923L301296L539736L735757
14310I6559568M071581M449005M526531M559892N428861N317196N395569N911302
14302A36219505O690919O620889P072945P411816Q214139Q226953Q576753R553145
14294A98587064J0201920J0160135J1240089J1609053J1963269J2760885J3218246
14287B79740661J3696170J4074832J4441752J4550113J4806759J4960534J4191450
14280C80462271J4302661J3604015J2723105J1421119J0186496Q071301O562837
14273D57333805K858217k136326m359337k816858k090551k956432m367090o684680
14265D34780748r797818j1743021j2979406j3896147j4473552j5568903j5554536
$$ plain form
14258 340767365 325824888 310879866 296135113 281970501 268228247 255169492 243703497
14251 243703497 232466993 220902283 209473982 199676596 189983693 180907105 172383619
14244 172383619 164516305 157126778 149617730 143019902 136502318 130545550 124940539 119784373
14236 119784373 114648765 109636524 105098285 100787578 96734672 93713373 89745020 86233095
14228 86233095 82705394 79955844 76879604 73964222 71616511 68625217 66291955 64159050
14220 64159050 62268165 60445147 58296688 56053819 54495654 52930969 51301972 50286920
14212 50286920 48623064 46596224 45479167 43918176 42707567 42349573 41018715 39935246
14204 39935246 38354248 37597486 36710025 35603323 35137569 33944739 33036570 32174905 31170976
$$ packed form
14258C40767365j4942477j4945022j4744753j4164612j3742254j3058755j1465995
14251B43703497j1236504j1564710j1428301r797386r692903r076588q523486
14244A72383619p867314p389527p509048o597828o517584n956768n605011n156166
14236A19784373n135608n012241m538239m310707m052906l021299l968353l511925
14228H6233095l527701k749550l076240k915382k347711k991294k333262k132905
14220F4159050j890885j823018k148459k242869j558165j564685j628997j015052
14212E0286920j663856k026840j117057j560991j210609l57994j330858j083469
14204C9935246j580998p56762q87461j106702m65754j192830r08169q61665j003929
$$ plain form
14195 31170976 30477006 30002970 29265952 28402266 27650234 27159228 26632951 25949691 25389883
14186 25389883 24908905 24178460 23596259 23359808 22470057 22281397 22033762 21366977 20817329
14177 20817329 20384947 20217010 19779730 19300083 18701198 18453265 18229572 18051431 17235538
14168 17235538 17363362 16794256 16509217 16067379 15866045 15738714 15308733 15091623 14640222
14159 14640222 14829858 14246247 13872518 13813292 13653258 13181502 12895104 12779610 12785465 12405156
14149 12405156 12104747 11949911 11763614 11906244 11477641 11584499 11228285 10764455 10784323
14140 10784323 10749921 10430110 10411954 10029952 10198578 9975525 9793076 9271744 9415252 9520598
14130 9520598 9223947 9072560 8681881 8992953 8538502 8506628 8325976 8380862 8290081 7932473
$$ packed form
14195C1170976o93970m74036p37018q63686p52032m91006n26277o83260n59808
14186B5389883m80978p30445n82201k36451q89751j88660k47635o66785n49648
14177B0817329m32382j67937m37280m79647n98885k47933k23693j78141q15893
14168A7235538J27824n69106k85039m41838k01334j27331m29981k17110m51401
14159A4640222J89636n83611l73729n9226j60034m71756k86398j15494N855l80309
14149A2405156l00409j54836j86297J42630m28603J06858l56214m63830J9868
14140A0784323l4402l19811j8156l82002J68626k23053j82449n21332J43508J05346
14130I520598k96651j51387l90679L11072m54451l1874j80652N4886r0781l57608
$$ plain form
14120 7932473 8261493 7718272 8117262 7770290 7454707 7575030 7518013 7088057 6817786 7277336
14110 7277336 7055221 7077943 7012963 7067846 6785498 6713079 6557959 6608364 6234295 6395197
14100 6395197 6159531 6221057 6351382 6057424 6196710 5774729 5552783 5557318 6270845 5572911
14090 5572911 5499686 5268461 5253707 5330248 5321257 5217574 5377615 5268226 5262105 5165458 5114082
14079 5114082 4954057 4875290 5085967 4893072 4958259 4819688 4829755 4681750 4580923 4804705
14069 4804705 4634134 4365324 4363124 4474847 4421195 4286158 4192004 4388837 4182802 4148550
14059 4148550 4327854 4294842 4115742 4397531 4153531 4017768 3913047 3545676 3926035 3733917
14049 3733917 3676143 3686572 3773835 3537438 3531043 3421704 3435221 3241590 3045142 3606980
$$ packed form
14120G932473L29020n43221L98990l46972l15583J20323n7017m29956k70271M59550
14110G277336k22115K2722o4980N4883k82348p2419j55120N0405l74069J60902
14100F395197k35666O1526J30325k93958J39286m21981k21946M535P13527o97934
14090E572911p3225k31225j4754P6541q991j03683J60041j09389o121r6647n1376
14079E114082j60025p8767K10677j92895O5187j38571J0067j48005j00827K23782
14069D804705j70571k68810k200J11723n3652j35037r4154J96833k06035l4252
14059D148550J79304l3012j79100K81789k44000j35763j04721l67371L80359j92118
14049C733917n7774J0429Q7263k36397o395j09339J3517j93631j96448N61838
$$ plain form
14039 3606980 3596928 3435708 3419345 3125288 3158679 3340089 3042258 3212189 3147648 3325734
14029 3325734 3132640 2938604 3048526 3048572 2791542 3293818 2880661 2908749 2864895 2719682
14019 2719682 2634576 2715174 2630198 2678394 2790195 2619090 2858246 2595544 2577428 2481926
14009 2481926 2281237 2519604 2700343 2489705 2496167 2371789 2352796 2226551 2401184 2201960
13999 2201960 1956560 2183405 2060519 1934508 2057165 2122997 2222174 1704755 2547063 2310371
13989 2310371 3131118 6223437 13658932 27465291 43775386 32304315 16007040 9156899
13981 9156899 6586859 4877449 4410052 3671154 3733140 3432665 3230522 2921543 3034165
13972 3034165 2981085 2712176 2747445 2856484 2682188 2448174 2569471 2685611 2401047 2281156
$$ packed form
14039C606980j0052j61220j6363k94057L3391J81410k97831J69931o4541J78086
14029C325734j93094j94036J09922M6k57030N02276m13157K8088m3854j45213
14019B719682q5106Q0598q4976M8196J11801j71105K39156k62702j8116r5502
14009B481926k00689K38367J80739k10638O462j24378j8993j26245J74633j99224
13999B201960k45400K26845j22886j26011J22657O5832R9177n17419Q42308k36692
13989B310371Q20747L092319P435495J3806359J6310095j1471071A6007040o850141
13981I156899k570040j709410m67397p38898O1986l00475k02143l08979J12622
13972C034165n3080k68909L5269J09039j74296k34014J21297J16140k84564j19891
$$ plain form
13962 2281156 1996710 2184953 2430984 2527557 2328672 2342365 1895315 2116887 2024372 2021899
13952 2021899 2062529 2256747 1870639 1998675 2163103 1941587 1910821 1998235 1751014 1875519
13942 1875519 2297734 1900768 2107748 1718465 1762859 1557467 1755483 1988520 1624283 1794217
13932 1794217 1822702 1823634 1512078 2033828 1659845 1618319 1708421 1629778 1720417 1545980 2038763
13921 2038763 1554544 1578087 1623155 1559322 1675260 1475777 1489952 1640810 1365622 1477995
13911 1477995 1657273 1259721 1751443 1333605 1369055 1366979 1353245 1580198 1674414 1515601
13901 1515601 1312035 1534048 1569153 1135621 1629061 1383707 1261466 1516689 1333632 1523482
13891 1523482 1394985 1167713 1387971 1553402 1279584 1314942 1192095 1545397 1211618 1411014
$$ packed form
13962B281156k84446J88243K46031R6573j98885J3693m47050K21572r2515k473
13952B021899M0630J94218l86108J28036J64428k21516l0766Q7414k47221J24505
13942A875519M22215l96966K06980l89283M4394k05392J98016K33037l64237J69934
13932A794217K8485R32l11556N21750l73983m1526R0102p8643R0639j74437M92783
13921B038763m84219K3543M5068o3833J15938j99483J4175J50858k75188J12373
13911A477995J79278l97552M91722m17838L5450k076j3734K26953R4216j58813
13901A515601k03566K22013L5105m33532M93440k45354j22241K55223j83057J89850
13891A523482j28497k27272K20258J65431k73818L5358j22847L53302l33779J99396
$$ plain form
13881 1411014 1137377 1236599 1737234 1366616 1317259 1518051 1332267 1137486 1449541 1306616
13871 1306616 1341603 1297812 1232481 1301444 1357312 1158996 1042769 1240164 1344807 1051520
13861 1051520 1327349 1151408 1180444 1546631 1111498 1428213 1138186 1016631 986649 1141861
13851 1141861 1077209 617148 1060063 1028488 1093419 938101 1153510 884662 1016604 1242883
13841 1242883 1046105 1059364 1265761 927905 775353 1044801 990240 1142192 824638 846544
13831 846544 970372 977999 1059845 1004504 953383 1325352 1066624 883071 1208214 1037984
13821 1037984 656936 931278 763203 843960 1057914 707299 1032340 671031 769194 977462
13811 977462 1302880 1060224 805682 1064022 1028314 854948 1063525 977741 890564 931218
$$ packed form
13881A411014k73637R9222N00635l70618m9357K00792j85784j94781L12055j42925
13871A306616L4987m3791o5331O8963N5868j98316j16227J97395J04643k93287
13861A051520K75829j75941K9036L66187m35133L16715k90027j21555k9982J55212
13851A141861o4652m60061M42915l1575O4931j55318K15409k68848J31942K26279
13841A242883j96778J3259K06397l37856j52552K69448n4561J51952l17554K1906
13831H46544J23828P627Q1846n5341n1121L71969k58728j83553L25143j70230
13821A037984l81048K74342j68075Q0757K13954l50615L25041l61309R8163K08268
13811I77462L25418k42656k54542K58340l5708j73366K08577q5784q7177M0654
$$ plain form
13801 931218 812767 782478 698725 910381 812866 742969 794651 859360 990491 1013800 912487
13790 912487 930552 1032347 701197 881174 789546 829160 986131 1142314 1162138 816169
13780 816169 989220 982908 810334 533509 855009 1049938 691026 680272 731105 737938 729283
13769 729283 828370 914480 840768 539344 710378 887810 903620 923960 771634 752961 559647
13758 559647 551345 556806 935142 663759 785483 813377 725481 815285 587867 783152 613221
13747 613221 334129 529525 430697 822074 522116 658284 849296 642830 887524 533442
13737 533442 903290 789029 891048 465596 744550 519089 791367 842117 629618 486424
13727 486424 618651 584887 548589 349172 784552 541864 570618 716825 573884 318828
$$ packed form
13801I31218j18451l0289q3753K11656r7515o9897N1682O4709J31131K3309j01313
13790I12487J8065J01795l31150J79977r1628L9614J56971J56183J9824l45969
13780H16169J73051o312j72574k76825L21500J94929l58912j0754N0833O833q655
13769G29283R9087Q6110p3712l01424J71034J77432J5810K0340j52326j8673j93314
13758E59647q302N461L78336k71383J21724K7894q7896Q9804k27418J95285j69931
13747F13221k79092J95396r8828L91377k99958J36168J91012k06466K44694l54082
13737E33442L69848j14261J02019m25452K78954k25461K72278N0750k12499j43194
13727D86424J32227l3764l6298j99417M35380k42688K8754J46207j42941k55056
$$ plain form
13717 318828 436453 712100 600965 912356 747949 670512 561940 499235 474573 527066
13707 527066 931119 677872 686339 1013250 902742 445604 629130 453647 659577 517454
13697 517454 846406 644776 216546 726290 489186 300321 511853 235661 671368 612938
13687 612938 576154 483313 609629 692264 290662 219645 682207 320344 399988 606757
13677 606757 842421 751786 481613 633282 479175 710120 530010 174950 310195 420295
13667 420295 695694 727510 276995 249838 698935 675446 238240 684823 733199 577644
13657 577644 341710 869107 513405 402587 454914 369543 594220 821667 162025 442127
13647 442127 527128 464822 661131 607348 714045 570207 608804 710184 714622 403623 658811
$$ packed form
13717C18828J17625K75647j11135L11391j64407p7437j08572o2705k4662N2493
13707E27066M04053k53247Q467L26911j10508D45604J83526j75483K05930j42123
13697E17454L28952k01630B16546N09744k37104j88865K11532B35661M35707n8430
13687F12938l6784r2841J26316Q2635B90662p1017M62562C20344P9644K06769
13677F06757K35664r0635k70173J51669j54107K30945j80110A74950J35245J10100
13667D20295K75399L1816B76995k7157M49097k3489B38240M46583M8376j55555
13657E77644k35934N27397l55702j10818N2327q5371K24677K27447A62025K80102
13647D42127Q5001o2306J96309n3783J06697j43838L8597J01380M438l10999K55188
$$ plain form
13636 658811 371951 267811 291713 390252 429180 342207 463900 614122 333229 255040
13626 255040 266918 797097 293296 607583 548246 219303 406906 395881 491098 461105
13616 461105 250248 349658 364056 291276 357807 492580 500411 344807 242231 437345 503583
13605 503583 567801 370050 457310 -89100 236959 455950 336436 291934 433612 544090
13595 544090 568970 2533 439429 442830 292545 143519 234925 270338 254901 414722 238698
13584 238698 695789 436574 334668 539121 428944 398467 473807 198123 423251 634268
13574 634268 229609 354050 184581 210391 361344 436136 344564 261251 308230 128635
13563 461574 414472 302923 429820 441400 306266 350622 566213 29869 295730 366418
$$ packed form
13636F58811k86860j04140K3902R8539L8928q6973J21693J50222k80893p8189
13626B55040J1878N30179B93296L14287n9337B19303J87603j1025R5217k9993
13616D61105k10857R9410J4398p2780O6531J34773P831j55604j02576J95114O6238
13605E03583O4218j97751Q7260h9100B36959K18991j19514m4502J41678J10478
13595E44090K4880B533M36896L401j50285A43519R1406L5413j5437J59821j76024
13584B38698M57091k59215j01906K04453j10177l0477P5340A98123K25128K11017
13574F34268B29609J24441j69469K5810J50953P4792r1572q3313M6979A28635
13563D61574m7102j11549J26897J1580j35134M4356K15591B9869K65861P0688
$$ plain form
13553 366418 490181 262122 179775 821479 450102 453281 377169 424089 460026 305010 486342
13542 486342 245927 129304 274974 183721 276676 100578 315944 202807 358527 572787
13532 572787 204709 197589 315030 114784 460808 625956 436480 436818 254907 367637
13522 367637 713067 472940 167761 391966 -74012 101324 312751 421703 433174 423002
13512 423002 311871 279442 163037 223174 347312 444499 505255 94707 180469 337859 366626
13501 366626 226132 237016 437779 470999 80927 222226 349512 427839 505498 136785
13490 157627 275392 -29661 368685 563848 98248 191542 244230 344704 296067 132460
13479 251879 94545 188041 363460 552235 60331 341306 392551 329285 200665 324322
$$ packed form
13553C66418J23763k28059q2347O41704l71377L179p6112M6920L5937j55016J81332
13542D86342k40415j16623J45670r1253R2955A00578K15366j13137J55720K14260
13532E72787B04709p120J17441A14784L46024J65148j89476L38j81911J12730
13522C67637L45430k40127A67761K24205g4012A01324K11427J08952J1471j0172
13512D23002j11131l2429j16405O0137J24138R7187O0756I4707Q5762J57390K8767
13501C66626j40494J0884K00763L3220H0927J41299J27286P8327P7659A36785
13490A57627J17765b9661C68685J95163I8248R3294N2688J00474m8637A32460
13479B51879I4545R3496J75419J88775F0331K80975N1245o3266j28620J23657
$$ plain form
13469 324322 285866 318405 492590 174036 345423 177497 110691 313329 455226 194726
13458 -138299 355687 306684 237162 205315 436702 688333 324407 274328 654912 294789
13447 317577 260613 72283 555347 521048 261514 311954 184232 187843 253323 152472 222925
13436 222925 -55880 296429 279153 322444 446454 137127 382658 -65981 -28509 511928
13425 225531 331722 117174 168460 550714 281323 309627 168876 214295 202697 395224
13415 395224 416100 237611 223923 68871 226237 154118 485978 336453 259519 319188 176981
13404 176981 298923 152734 -4144 -139815 95408 21792 520557 232670 324057 -29767 422165
13392 288508 428279 368201 404666 478536 423492 315570 -15340 166088 136409 -177995 263508
$$ packed form
13469C24322l8456L2539J74185A74036J71387j67926o6806K02638J41897A94726
13458a38299C55687m9003o9522l1847K31387K51631C24407n0079L80584B94789
13447C17577n6964G2283M83064l4299k59534N0440j27722L611O5480j00851P0453
13436B22925e5880B96429j7276M3291J24010A37127K45531f5981b8509E11928
13425B25531J06191A17174N1286L82254k69391K8304j40751M5419j1598J92527
13415C95224K0876j78489j3688F8871J57366p2119L31860j49525p6934N9669j42207
13404A76981J21942j46189d144j35671I5408B1792M98765B32670R1387b9767D22165
13392B88508J39771o0078L6465P3870n5044j07922a5340A66088k9679a77995B63508
$$ plain form
13380 292005 86095 58388 378374 511382 -140519 120362 -178076 64178 -56234 196127
13369 189565 201400 178015 89320 313141 311677 127318 330212 37964 272341 129565 306876
13358 306876 240960 254395 -61891 84561 162248 145120 445335 390497 98237 166488 -26477
13346 165930 369394 432486 291218 478223 293551 108535 525577 288972 241658 51522
13335 389905 433434 419230 36405 22025 332576 82185 118971 191420 415092 166521 6582
13323 -167002 518358 338185 303222 222387 197474 199001 421110 286471 198755 367668 399336
13312 399336 288452 -51627 344788 117613 501424 506537 115938 82711 96770 312081
13302 312081 57718 -37236 288466 110824 206023 205491 361347 233326 247516 456011 170365
$$ packed form
13380B92005H6095k7707L19986J33008a40519A20362a78076F4178e6234A96127
13369A89565J1835k3385q8695K23821j464A27318K02894C7964K34377A29565J77311
13358C06876o5916J3435f1891H4561P7687j7128L00215n4838I8237O8251b6477
13346A65930K03464O3092j41268J87005j84672A08535M17042k36605m7314E1522
13335C89905M3529j4204C6405j4380L10551H2185L6786P2449K23672A66521F582
13323a67002E18358j80173l4963q0835k4913J527K22109j34639q7716J68913L1668
13312C99336j10884e1627C44788A17613L83811N113A15938l3227J4059K15311
13302C12081E7718c7236B88466A10824R5199n32J55856j28021J4190K08495A70365
$$ plain form
13290 152091 381106 286160 -175549 -57185 1057 326045 116580 132743 594006 489305
13280 489305 300547 52893 201682 287147 261630 89419 292992 -118101 -125550 -70928 152052
13268 173311 216013 137108 170053 117730 192427 -83957 380964 235819 -78439 138005 45256
13256 5264 100730 32244 -71130 -71975 129591 111730 185339 112017 605 219378 238500 377541
13244 377541 142405 -3215 96683 129906 -57576 -134224 -82376 -50521 234360 26906 8982
13232 -181114 123623 530123 332576 104108 75726 -3525 331287 294884 382101 234495
13222 234495 364578 127602 58662 393968 -83940 151125 -100269 -123473 140611 142116
13212 142116 242112 158389 173275 237371 -170956 305447 232640 15955 -58397 285661 378315
$$ packed form
13290A52091K29015r4946a75549e7185A057L24988A16580J6163M61263j04701
13280D89305j88758E2893J48789Q5465k5517H9419K03573a18101p449N4622A52052
13268A73311M2702p8905L2945n2323P4697h3957C80964j45145g8439A38005D5256
13256E264R5466C2244g1130q45A29591j7861P3609p3322F05K18773J9122J39041
13244C77541A42405c215I6683L3223e7576p6648N1848L1855B34360B6906H982
13232a81114A23623M06500j97547A04108k8382c525C31287l6403Q7217j47606
13222B34495J30083A27602E8662L35306h3940A51125a00269k3204A40611J505
13212A42116R9996q3723J4886O4096a70956C05447p2807A5955e8397B85661R2654
$$ plain form
13201 378315 463833 201755 670556 182938 378167 199538 246180 73350 181776 52634
13190 191869 102510 10417 298480 -87715 -44884 311949 -17245 87041 283720 471256 446716
13179 446716 -238395 94614 -117501 373770 197966 108590 96357 -17855 -6980 -88105 143019
13167 124695 9123 161113 -281328 147401 120071 43756 -130153 18521 200642 100670 -188789
13155 48992 251757 75819 275618 264856 134571 -47486 275662 311556 -128528 54718 56310
13144 56310 15460 242205 76827 9708 12805 -2837 -146644 -181502 255722 286265 66006 248258
13132 248258 26734 205879 215900 275375 44157 -171953 39160 143936 224661 190070 -150592
13120 -47854 160217 200074 -154146 131436 102620 22963 314111 -386196 763 279786 -348993
$$ packed form
13201C78315Q5518B01755M68801A82938J95229j78629M6642G3350J08426E2634
13190A91869q9359A0417K88063h7715M2831C11949a7245H7041J96679J87536k4540
13179D46716b38395I4614a17501C73770j75804q9376j2233a7855f980q1125A43019
13167A24695I123J51990b81328A47401k7330D3756a30153A8521J82121r9972a88789
13155D8992K02765G5819J99799j0762j30285d7486B75662L5894a28528E4718J592
13144E6310A5460K26745G6827I708L097b837j43807l4858B55722L0543F6006J82252
13132B48258B6734J79145J0021N9475D4157a71953C9160J04776Q0725l4591a50592
13120d7854A60217L9857a54146A31436k8816B2963K91148c86196G63K79023c48993
$$ plain form
13108 30019 245727 102536 -450811 25642 -144891 185771 861 257224 176522 -64839 336343
13096 -254787 28087 -265821 220411 139529 -43435 101633 291853 -102351 307611 61797
13085 79386 -72399 260184 71596 5193 -62884 208373 -10513 138218 87748 59054 -138914
13073 142562 317144 -150569 52065 219455 74084 317725 19759 -225727 23672 207995
13063 207995 -10339 157533 -12192 403408 -112532 -255690 50572 329509 137171 143127
13053 143127 97382 120531 344123 150076 -169780 -123244 377730 -330062 293834 -87776
13042 171581 42597 12879 40385 385828 13630 70753 551347 -137339 217637 280246 -87476
13030 79458 -46845 -379536 -5170 29706 43517 125910 -195494 206388 167577 50902 -189239
$$ packed form
13108C0019K15708A02536d50811B5642a44891A85771H61K56363q0702f4839C36343
13096b54787B8087b65821B20411q0882d3435A01633J90220a02351C07611F1797
13085G9386g2399B60184G1596E193f2884B08373a0513A38218n0470k8694a38914
13073A42562J74582a50569E2065J67390G4084K43641A9759b25727B3672J84323
13063B07995a0339A57533a2192D03408a12532j43158E0572K78937A37171N956
13053A43127m5745K3149K23592A50076a69780M6536C77730c30062B93834h7776
13042A71581D2597A2879K7506L45443A3630N7123M80594a37339B17637O2609h7476
13030G9458d6845l32691e170B9706J3811Q2393a95494B06388l8811E0902a89239
$$ plain form
13018 295394 -108659 -245347 45668 244103 114785 -30957 -131899 330265 152911 470763
13008 470763 -207991 -118330 234225 -24781 188170 129304 54105 227708 -29705 227046
12997 -194200 -60652 136865 193090 -26609 -45882 46677 508300 -73609 59876 -42191 262846
12985 180242 113626 170761 195644 -82981 -109728 180419 -66430 362291 309827 6840 27955
12974 27955 145385 92353 298100 163019 107947 -24676 -109058 -183867 274814 298261 20698
12962 70743 25756 -22776 210870 227087 142630 223264 28771 -116035 100277 -53366 99858
12950 -27939 134197 -196274 194040 67151 -85802 -209440 159771 350007 -31891 88967
12939 280263 292342 320867 196184 -230786 318714 231726 4718 185523 171956 -130009 317110
$$ packed form
13018B95394a08659j36688D5668J98435A14785c0957j00942C30265A52911L17852
13008D70763b07991Q9661B34225b4781A88170n8866E4105J73603b9705B27046
12997a94200f0652A36865N6225b6609j9273D6677M61623g3609E9876d2191B62846
12985A80242o6616N7135K4883h2981k6747A80419f6430C62291n2464F840K1115
12974B7955J17430n3032K05747j35081n5072b4676q4382p4809B74814K3447B0698
12962G0743B5756b2776B10870J6217q4457Q0634B8771a16035A00277e3366I9858
12950b7939A34197a96274A94040F7151h5802j23638A59771J90236c1891H8967
12939B80263J2079K8525j24683b30786C18714q6988D718J80805j3567a30009C17110
$$ plain form
12927 108543 -158166 278314 209112 -77043 32897 77141 -69379 5048 92439 -38567 -39694
12916 -39694 18401 -167671 -331377 15541 -103175 -186475 47958 71589 -283364 325093 180994
12905 180994 -257918 -12745 -221835 -281716 141655 -23586 303827 65660 -44449 178075
12894 -9763 -328976 -137646 247765 276761 -33018 258222 413924 122331 306036 117495
12883 116025 34224 -175023 55312 -220118 -28309 214087 13878 -9033 -167816 82830 249651
12872 249651 -23299 463576 -54744 -273014 210929 209853 -840 -74624 98432 158335 -119120
12860 -196013 37307 -102186 7133 -149089 91428 37486 407364 -269835 88185 78109 -220211
12848 -32319 55641 270471 55388 394259 54094 275761 129476 261901 -238025 63799
$$ packed form
12927A08543a58166B78314o9202g7043C2897M4244f9379E048Q7391c8567j127
12916c9694A8401a67671j63706A5541a03175q3300D7958K3631b83364C25093j44099
12905A80994b57918a2745k09090n9881A41655b3586C03827F5660d4449A78075
12894i763l19213a37646B47765K8996c3018B58222J55702A22331J83705A17495
12883A16025C4224a75023E5312b20118b8309B14087A3878i033j58783H2830J66821
12872B49651b3299D63576e4744k18270B10929j076h40p3784I8432N9903a19120
12860a96013C7307a02186G133a49089I1428C7486L69878b69835H8185j0076b20211
12848c2319E5641K14830E5388L38871E4094K21667A29476J32425b38025F3799
$$ plain form
12837 88506 27893 -276822 112321 -2860 353867 255157 -258023 56783 387100 -23696 174208
12825 85273 160322 34 115672 64223 374359 36065 178674 -104254 117570 -166806 74852
12813 -42493 371790 -15515 245928 157450 -78041 -131628 9548 -42193 44674 -157723 89235
12801 111554 154740 192355 189829 -129903 -195211 141735 181303 -27143 150556 100394 158420
12790 158420 -167113 -147535 -26054 -198066 -144117 284987 -76628 -123050 -212271 303113 -72663
12778 -367781 -346418 158404 138223 8812 -6635 68846 -1482 62685 25055 162610 222803 -93708
12765 244363 179557 -161094 139136 -244473 192560 -276906 136066 -234432 453931 268865
12755 268865 -116637 -96067 5429 5446 523547 335004 100521 13287 -47703 -138952 -74288
$$ packed form
12837H8506B7893b76822A12321b860C53867r8710b58023E6783L30317b3696A74208
12825H5273P5049C4J15638n1449L10136C6065J42609a04254A17570a66806G4852
12813d2493C71790a5515B45928q8478g8041n3587I548d2193D4674a57723H9235
12801A11554M3186L7615k526a29903o5308A41735L9568b7143A50556n0162N8026
12790A58420a67113J9578b6054j72012N3949B84987g6628m6422q9221C03113g2663
12778c67781K1363A58404k0181H812f635F8846a482F2685B5055J37555O0193i3708
12765B44363o4806a61094A39136b44473A92560b76906A36066b34432D53931j85066
12755B68865a16637K0570E429J7N18101j88543A00521A3287d7703r1249O4664
$$ plain form
12744 -74288 277749 125525 172714 -189917 -80767 -144341 195201 12626 89322 -146200 -79172
12733 -79172 214299 -32475 150613 -29370 90579 58574 -244491 313120 240568 205939 -64081
12721 -56066 -97962 -21448 200530 236815 -16723 -44933 242960 -315771 342126 -115527 221591
12709 -286776 203756 -9113 -159975 80157 -11120 -185281 134559 -183228 415892 258243
12699 258243 -177967 100625 174755 -191235 235536 258390 -42068 -45825 299219 149043
12688 515950 212773 56696 -12975 205286 181155 95706 -58658 -240292 199830 -170963
12677 -33069 5950 186178 232294 155064 20708 188972 114002 -38892 -76948 369473 179888
12665 160949 418532 -153473 5048 60462 576990 73671 85825 177271 -67317 285038 583343
$$ packed form
12744g4288B77749A25525M7189a89917h0767o3574A95201A2626P6696a46200O7028
12733g9172B14299c2475A50613b9370I0579l2005b44491C13120p2552l4629f4081
12721e6066m1896b1448B00530L6285a6723k8210B42960c15771C42126a15527B21591
12709b86776B03756i113j50862H0157a1120j74161A34559a83228D15892j57649
12699B58243a77967A00625P4130a91235B35536K2854d2068l757B99219A49043
12688E15950B12773E6696a2975B05286k4131q5449e8658j81634A99830a70963
12677c3069E950J80228M6116p7230B0708J68264p4970c8892l8056C69473A79888
12665A60949K57583a53473E048N5414N16528G3671J2154R1446f7317B85038K98305
$$ plain form
12654 583343 8081 89290 365139 -201865 401366 151095 91805 28577 52463 63015 -21876
12642 -114112 -191916 216712 21788 -179110 254734 233893 39870 -195523 250056 98298
12631 229965 23351 367274 198468 474894 52273 177713 409065 10013 101881 162165
12621 162165 186298 1044 131469 225331 5326 183287 -170395 6128 -160431 -183416 162035
12609 4651 290629 14085 -19758 179025 278764 13020 226097 -134955 171512 221121 319140
12598 319140 115596 163080 333009 181651 692830 -67330 192218 -63050 55257 54165 -6357
12586 110827 403335 94354 -78593 -297630 -60683 155586 -197336 -28775 -131749 -131777 -70164
12575 -70164 -130228 199473 -46821 329608 -38250 9478 258794 -99933 -323330 -29664 61201
$$ packed form
12654E83343H081Q1209K75849b01865D01366A51095n9290B8577K3886J0552b1876
12642a14112p7804B16712B1788a79110B54734k0841C9870a95523B50056I8298
12631B29965B3351L43923j68806K76426E2273J25440K31352A0013R1868O0284
12621A62165K4133A044J30425R3862E326J77961a70395F128a60431k2985A62035
12609D651K85978A4085a9758A79025R9739A3020K13077a34955A71512M9609R8019
12598C19140A15596M7484J69929j51358N11179f7330A92218f3050E5257j092f357
12586A10827K92508I4354g8593k19037f0683A55586a97336b8775j02974k8O1613
12575g0164o0064A99473d6821C29608c8250I478K49316i9933k23397b9664F1201
$$ plain form
12563 137196 -2884 -274757 147542 -245583 272917 195355 95583 -18700 93461 217977 89114
12551 -183670 -13354 56029 224989 215635 14765 13902 24287 200272 172802 -133818 252983
12539 -265786 -107231 18463 441550 62472 -383486 77158 -40097 234031 48701 598 -136818
12527 31957 -117201 173164 -52492 163918 -14321 -22702 -210655 199665 290239 128200 61757
12515 13057 126565 -61547 -54976 228328 -272260 -381744 98314 111954 81043 163562 112474
12504 112474 -11812 -182054 -87327 -53729 -29729 -42585 248725 612418 38181 114948 -32012
12492 -50253 -85647 107813 -249735 282155 158580 -361207 -236207 -27931 -93527 -48941
12482 -48941 -15386 -32180 222996 -343991 -62300 -56995 -166492 110871 -108564 -46473 134823
$$ packed form
12563A37196b884k71873A47542b45583B72917p7562I5583a8700I3461J24516H9114
12551a83670a3354E6029J68960r354A4765q63J0385J75985k7470a33818B52983
12539b65786a07231A8463M23087F2472c83486G7158d0097B34031D8701E98a36818
12527C1957a17201A73164e2492A63918a4321q381j87953A99665R0574A28200F1757
12515A3057J13508f1547O571B28328b72260j09484I8314J3640l0911Q2519n1088
12504A12474a1812j70242h7327L3598K4000j2856B48725L63693C8181P6767c2012
12492e0253l5394A07813b49735B82155j23575c61207J25000b7931o5596M4586
12482d8941a5386j6794B22996c43991f2300N305j09497A10871a08564d6473A34823
$$ plain form
12470 -102169 54370 -226727 22920 -64352 -144539 -96131 -239582 231762 -219379 66008 129181
12459 129181 -117906 60547 -121795 -277504 -98151 65086 -150334 116583 -64800 -62937 165736
12447 10270 -49312 6402 -50459 -75232 376973 311355 140338 95430 52853 -15764 -38533
12436 -38533 86694 256381 -194143 64839 -115522 288686 293790 313861 207419 129978 -117386
12424 -239116 -47840 134959 68710 -164793 92977 -291526 142667 55756 285122 -95841
12413 113177 -36461 -232944 -303477 221870 -222510 -41997 73194 440952 -11319 -192996
12403 -192996 94232 278113 220256 32722 -109655 268345 312360 82253 72980 -91555 68294
12391 177460 -8748 767 -174838 14850 -119085 23449 233315 277283 -121926 -144707 154089
$$ packed form
12470a02169E4370b26727B2920f4352q0187M8408j43451B31762b19379F6008O3173
12459A29181a17906F0547a21795j55709i8151F5086a50334A16583f4800J863A65736
12447A0270d9312F402e0459k4773C76973o5618A40338m4908m2577a5764k2769
12436c8533H6694J69687a94143F4839a15522B88686N104K0071j06442p7441a17386
12424b39116d7840A34959o6249a64793I2977b91526A42667E5756K29366i5841
12413A13177c6461j96483p0533B21870b22510d1997G3194L67758a1319j81677
12403a92996I4232J83881n7857C2722a09655B68345M4015H2253r273i1555F8294
12391A77460h748G67a74838A4850a19085B3449K09866M3968a21926k2781A54089
$$ plain form
12379 34157 248410 238964 120948 44591 -135250 -125247 197353 327094 366543 -45999 361336
12367 -280915 239426 -318191 -358710 72302 -89733 101164 -52462 138792 -264753 127226
12356 322483 144622 -38587 8924 -68984 -276897 134482 237553 -154775 3883 152787 324584
12345 324584 199765 161115 -145791 -208896 54324 -35269 48842 171104 -132040 321519
12334 -26757 358525 -170551 -382210 -156147 -253091 -183601 -18130 127498 302587 575825
12324 575825 144233 331364 -329285 -29110 -364540 162597 120970 67803 183941 430912
12314 430912 262025 67885 -62833 -48986 -271887 128342 -124812 -348605 -4471 24512 -70537
12302 280137 321211 313717 -112596 -42691 11337 -80983 -42217 -91463 301842 -5165 -12323 -26445
$$ packed form
12379C4157K14253r446j18016D4591a35250J0003A97353J29741L9449d5999C61336
12367b80915B39426c18191m0519G2302h9733A01164e2462A38792b64753A27226
12356C22483A44622c8587H924f8984k07913A34482J03071a54775C883J48904J71797
12345C24584j24819l8650a45791o3105E4324c5269D8842J22262a32040C21519
12334b6757C58525a70551k11659a56147r6944O9490a8130A27498J75089K73238
12324E75825A44233J87131c29285b9110l35430A62597m1627n3167J16138K46971
12314D30912j68887F7885f2833J3847k22901A28342a24812k23793d471B4512g0537
12302B80137M1074p494a12596d2691A1337h0983L8766m9246C01842e165p158j4122
$$ plain form
12290 -26445 -21934 176065 -29113 -89122 -135760 151381 -7515 91002 58003 -47308 -124525 -192454
12278 -192454 135990 -274503 65567 200968 103906 55358 -129095 140032 -275469 -144281
12268 -144281 -182399 406788 187903 -101878 86811 105794 188301 -51556 -144841 236852 -302271
12256 -124177 -47916 -75974 183027 -54447 238022 114331 -143354 63370 3919 148089 64973
12244 84845 231159 -33716 147552 84448 145548 73013 161241 142789 -228973 -11052 -91722
12233 -91722 29107 326509 138364 368390 -85869 295692 211331 558859 368639 392410
12223 392410 16202 23782 356048 211341 361280 56770 -65250 83284 -11909 279718 -26568
12211 371991 -36457 187527 1505 -168657 25952 202175 37313 201194 251938 228554 291527
$$ packed form
12290b6445M511A76065b9113o0009m6638A51381g515I1002l2999d7308p7217o7929
12278a92454A35990b74503F5567J35401r7062m8548a29095A40032b75469J31188
12268a44281l8118D06788A87903a01878H6811J8983Q2507e1556r3285B36852c02271
12256a24177d7916k8058A83027e4447B38022A14331a43354F3370C919J44170F4973
12244H4845J46314c3716A47552o3104O1100p2535Q8228j8452b28973a1052q0670
12233i1722B9107K97402A38364K30026h5869B95692q4361L47528j90220K3771
12223C92410A6202P580L32266j44707J49939E6770f5250H3284a1909B79718b6568
12211C71991c6457A87527A505a68657B5952J76223C7313J63881N0744k3384O2973
$$ plain form
12200 291527 -33367 152491 530852 223346 48803 28150 167236 67500 131630 144527 187176
12189 187176 179262 161058 124034 -179368 262905 244951 -27163 -303 173513 29235 158255
12178 158255 439854 -34330 371081 249449 157292 83157 573838 -130604 74043 48803
12168 48803 254848 30901 78960 192264 224440 -72977 457922 -106648 1372 -95731 210058
12156 140222 -51574 26332 197915 -167357 -70101 188341 -206133 20597 -17162 16168 251908
12145 251908 44795 15771 -54140 -23139 -214329 225039 -84036 119230 -18832 -218777 169615
12133 -128489 101143 111998 -340474 -59947 -230602 93806 -76287 -47510 42287 -41984 -46664
12122 -46664 10853 169014 -184364 91721 47026 2191 252553 -325082 126780 -133113 76008
$$ packed form
12200B91527c3367A52491L78361B23346D8803k0653J39086F7500O4130J2897M2649
12189A87176p914j8204l7024a79368B62905j7954b7163c03A73513B9235J29020
12178A58255K81599c4330C71081j21632r2157p4135M90681a30604G4043k5240
12168D8803K06045C0901M8059J13304L2176g2977D57922a06648A372i5731B10058
12156A40222e1574B6332J71583a67357g0101A88341b06133B0597a7162A6168K35740
12145B51908D4795A5771e4140b3139j91190B25039h4036A19230a8832j99945A69615
12133a28489A01143J0855c40474e9947j70655I3806g6287K8777D2287d1984m680
12122d6664A0853J58161a84364I1721m4695B191K50362c25082A26780a33113G6008
$$ plain form
12110 -86140 123013 -168937 -165985 211087 -202270 238054 32136 -124969 131919 67821
12100 67821 -74231 -359104 153980 48335 98726 64807 -58977 174042 -123812 -64981 71042
12088 259789 198127 5595 -93045 -22569 86588 95064 -177704 190740 153252 48273 114463
12077 114463 149494 53458 302991 636498 1342876 1433396 637283 -14512 121649 205005
12067 205005 189623 -166377 278904 -79676 93666 -132654 -58616 -90897 36841 44131 -307416
12055 346333 118217 367116 16787 -111721 105383 46952 21583 -147429 3196 146898
12045 146898 41436 -106332 326569 233237 -95175 252969 113945 -362532 224683 579842
12035 579842 -20221 -80855 177074 -157673 137581 -119390 -98406 -308218 -52516 331389
$$ packed form
12110h6140A23013a68937K952B11087b02270B38054C2136a24969A31919o4098
12100F7821g4231k84873A53980D8335N0391l3919e8977A74042a23812N8831G1042
12088B59789o1662E595i3045b2569H6588Q476a77704A90740l7488D8273O6190
12077A14463L5031E3458K49533L33507P06378R0520F37283a4512A21649Q3356
12067B05005j5382a66377B78904g9676I3666a32654e8616l2281C6841P290c07416
12055C46333A18217K48899A6787a11721A05383D6952B1583a47429C196J43702
12045A46898D1436a06332C26569r3332i5175B52969A13945c62532B24683L55159
12035E79842b0221o0634A77074a57673A37581a19390K0984k09812e2516C31389
$$ plain form
12024 38420 185293 -225426 277198 14928 -148531 44309 256724 -374251 -275968 81980
12013 339727 -14729 -111849 -44804 36643 -56846 181589 -215316 -245198 -194036 -377086 338890
12001 -96456 -12763 -222377 -216722 -304157 24435 137306 200217 -178004 54999 -117635 -42047
11989 2596 -194939 -322528 80512 76884 74352 4526 -92353 163744 82083 332159 135547
11977 -139384 132952 -364694 -29838 -151987 129076 66998 -374405 272933 59603 89271
11967 89271 -84117 -136701 -9759 143870 -112981 76493 92031 -247465 -158526 142740 186777
11956 186777 199718 -31123 87327 -118231 -87623 -74608 45752 -81985 34681 -310193 47839
11944 -174792 28412 85774 -195223 -52686 67799 -9541 42546 -38216 201805 -56756 -209075
$$ packed form
12024C8420J46873b25426B77198A4928a48531D4309K12415c74251R8283H1980
12013C39727a4729r7120d4804C6643e6846A81589b15316k9882N1162j83050C38890
12001i6456a2763k09614N655q7435B4435J12871O2911a78004E4999a17635d2047
11989B596a94939j27589H0512l628k532D526i2353A63744q1661K50076A35547
11977a39384A32952c64694b9838j22149A29076o2078c74405B72933E9603K9668
11967H9271h4117n2584i759A43870a12981G6493J5538b47465Q8939A42740M4037
11956A86777J2941c1123H7327a18231L0608J3015D5752h1985C4681c10193D7839
11944a74792B8412N7362a95223e2686F7799i541D2546c8216B01805e6756j52319
$$ plain form
11933 -209075 69161 181238 161533 -149337 105484 -139232 -40662 27451 -232341 169316
11922 -101254 -276046 -215842 -112616 -174549 10222 137867 -41572 64811 -259126 117851
11911 -77035 163530 -29510 104920 -212462 220315 110538 144351 389089 -66215 -179782
11901 -179782 -8603 -99958 -232042 66415 -60855 -194346 234249 255530 -142851 236091 -181384
11889 13929 70161 -69072 -51322 -4709 -109639 -112697 97424 43460 176820 -328315 -145616
11877 -294600 -198166 -149316 -204537 43576 236565 25604 -279860 -298136 -10495 41549 -98069
11865 -274810 328485 -494259 7052 -28098 180987 299097 -88226 -209761 -269009 -36078 -71399
11854 -71399 155769 72129 -21460 232895 83713 89540 -14947 -133257 -215785 -173395 151764
$$ packed form
11933b09075F9161J12077j9705a49337A05484a39232d0662B7451b32341A69316
11922a01254j74792O0204J03226o1933A0222J27645d1572F4811b59126A17851
11911g7035A63530b9510A04920b12462B20315j09777L3813K44738f6215j13567
11901a79782h603r1355j32084F6415f0855j33491B34249K1281a42851B36091a81384
11889A3929N6232f9072J7750d709j04930l058I7424D3460J33360c28315a45616
11877b94600R6434M8850n5221D3576J92989B5604b79860j8276a0495D1549i8069
11865b74810C28485d94259G052b8098A80987J18110h8226j21535n9248c6078l5321
11854g1399A55769G2129b1460B32895H3713N827a4947j18310q2528M2390A51764
$$ plain form
11842 209507 27259 55885 -167061 84546 61454 2082 -304702 15364 -52303 -143479 -157882
11831 -157882 -83681 -362954 55995 -26676 -152555 50633 49468 177205 -2480 191546 31594
11819 -176136 35743 -55523 -197485 283158 -63341 -150988 -19315 -217947 10743 50965 -252101
11807 -29198 28013 -103750 -387473 -377705 -56712 -22744 28013 -64296 -150355 200761 -180930
11795 436732 -108316 63192 -209767 34198 -71061 194598 44270 294983 39893 154108
11785 154108 -47217 8095 -249068 -156483 86113 147110 -124333 142227 163965 -10154 74538
11773 131732 -227014 -398175 -208879 -55280 -109122 187694 -55537 -150542 6273 49560 172210
11762 172210 53187 -89821 50873 198164 -109194 -181117 -270911 -209574 -11369 -306778 309069
$$ packed form
11842B09507B7259K8626a67061H4546k3092B082c04702A5364e2303r1176j4403
11831a57882P4201k79273E5995b6676j25879E0633j165J27737b480A91546C1594
11819a76136C5743e5523j41962B83158f3341q7647a9315j98632A0743M0222b52101
11807b9198B8013a03750k83723R768e6712b2744B8013f4296q6059B00761a80930
11795D36732a08316F3192b09767C4198g1061A94598D4270K50713C9893J14215
11785A54108d7217H095b49068R2585H6113O0997a24333A42227K1738a0154G4538
11773A31732b27014j71161J89296e5280n3842A87694e5537r5005F273M3287J22650
11762A72210E3187h9821E0873J47291a09194p1923q9794O1337a1369k95409C09069
$$ plain form
11750 -116816 134203 128561 -14162 -145166 -214479 -82645 -149211 157020 -53891 -146219 156831
11738 107161 19283 -313464 -93643 -188952 8291 -320634 31502 -92198 2472 -80084 127617
11726 -46207 62831 -145018 -261601 -118170 317074 117550 -35563 74504 100978 216249
11716 216249 -642652 -141991 235933 -236959 -2395 109620 88338 -183863 230233 -214338
11705 117430 -181664 -2042 -143406 51810 -134286 -327227 39047 312670 -77027 -170202 -311398
11694 -311398 47699 -48361 169544 203254 -110882 -89135 82101 -109322 371213 151727
11683 165067 18683 208488 -13500 28263 -114045 201649 -139328 114610 111784 -280638
11672 -4944 181488 273619 15831 255933 -352843 -85792 -68045 -78551 -85844 -136448 -121948
$$ packed form
11750a16816A34203n642a4162j31004o9313h2645o6566A57020e3891r2328A56831
11738A07161A9283c13464i3643r5309H291c20634C1502i2198B472h0084A27617
11726d6207F2831a45018j16583a18170C17074A17550c5563G4504K6474J15271
11716B16249f42652a41991B35933b36959b395A09620k1282a83863B30233b14338
11705A17430a81664b042j41364E1810a34286j92941C9047K73623g7027r3175j41196
11694c11398D7699d8361A69544L3710a10882K1747H2101a09322C71213A51727
11683A65067A8683J89805a3500B8263a14045B01649a39328A14610k826b80638
11672d944A81488R2131A5831K40102c52843h5792J7747j0506p293n0604J4500
$$ plain form
11661 -121948 129443 207104 141681 328907 32901 139323 -218 -220707 89229 81720 -104201
11649 -328600 233331 1848 269917 -222783 68659 -107658 55162 -175387 20000 -108038
11638 -342868 -78538 70805 -118585 -69566 24168 17810 11455 -16920 210098 911 53877 165402
11626 165402 -119864 340338 -183851 -41865 340641 31488 2412 -43550 176075 23332 -52562
11614 -181863 265260 -320967 253073 300974 148360 16968 -104554 117327 -141619 24476
11603 355276 -72395 -268396 4400 75813 -82200 -126200 21747 208355 115444 2101 -103850
11591 105407 153229 242577 62991 28393 13153 -295667 81626 -214347 -3831 -47393 262111
11579 48379 -67234 68800 242139 -11504 -180801 -74789 456427 71007 -17508 89754 154755
$$ packed form
11661a21948A29443P7661o5423J87226C2901J06422b18k20489H9229p509a04201
11649c28600B33331A848K68069b22783F8659a07658E5162a75387B0000a08038
11638c42868g8538G0805a18585M9019B4168o358o355a6920B10098I11N2966J11525
11626A65402a19864C40338a83851d1865C40641C1488B412d3550A76075B3332e2562
11614a81863B65260c20967B53073M7901A48360A6968a04554A17327a41619B4476
11603C55276g2395j96001D400P1413h2200m4000B1747J86608r2911B101a03850
11591A05407M7822Q9348F2991B8393A3153b95667H1626b14347c831m3562B62111
11579D8379f7234F8800J73339a1504j69297g4789D56427G1007a7508H9754O5001
$$ plain form
11568 154755 -50424 85377 363501 -118183 -55153 33582 53642 163553 -202496 289145
11557 -88357 197092 192704 112974 89735 33310 132415 -6634 199539 82858 -110072 147501
11545 22416 72842 -45332 -175477 151946 -294616 85496 32632 -219000 -165891 341886 411812
11534 411812 -1437 146228 150945 145903 58236 -3646 5593 88533 -177536 301859 -10548 -97936
11522 -97936 68222 -51382 -143670 -9082 -99393 152961 249777 349922 131488 -275886 -2651
11510 38585 88198 223027 -75767 238509 115587 90519 125961 609349 90723 -181250 292192
11498 666910 98396 5299 -167889 -18333 224518 128276 86527 67166 -24618 39220 62129
11487 62129 9952 187965 112041 71140 -337805 244436 -6015 120273 157797 37585 45039
$$ packed form
11568A54755e0424H5377K78124a18183e5153C3582K0060J09911b02496B89145
11557h8357A97092m388p9730k3239C3310R9105f634A99539H2858a10072A47501
11545B2416N0426d5332j30145A51946b94616H5496C2632b19000N3109C41886O9926
11534D11812a437A46228M717n042E8236c646E593Q2940a77536C01859a0548q7388
11522i7936F8222e1382r2288i082r0311A52961R6816J00145A31488b75886b651
11510C8585M9613J34829g5767B38509A15587k5068L5442M83388I0723a81250B92192
11498F66910I8396E299a67889a8333B24518r6242m1749j9361b4618C9220K2909
11487F2129I952J78013p5924m0901c37805B44436f015A20273L7524C7585P454
$$ plain form
11476 45039 149548 59775 -36671 228923 155595 140628 145388 -28287 199583 91198 277390
11465 277390 192626 -61682 246902 -110026 52867 151699 193604 -420261 109827 202324 113335
11454 113335 61513 30119 331716 27682 180303 -77201 -144813 -23545 -83503 27544 -309118
11442 387554 -230133 3310 -316731 242067 -220968 -69547 258495 -85361 126731 -66209
11431 -110609 -137878 -298404 188462 63277 -117915 -21958 -202353 203672 71561 -49798
11420 -269266 27050 -124487 13555 -93957 301959 -40526 140694 11918 -34653 57817 -16162
11408 11642 -142975 9095 -42455 -197560 -25159 30448 -5647 350553 4116 69448 41193 68431
11396 68431 220692 197853 -188550 -72075 188781 36740 53189 168879 146492 208220 109394
$$ packed form
11476D5039J04509E9775c6671B28923p3328j4967M760b8287A99583I1198J86192
11465B77390q4764f1682B46902a10026E2867R8832M1905d20261A09827R2497q8989
11454A13335n1822C0119L01597B7682J52621g7201o7612b3545n9958B7544c09118
11442C87554b30133C310c16731B42067b20968f9547B58495h5361A26731f6209
11431a10609k7269j60526A88462F3277a17915b1958j80395B03672G1561d9798
11420b69266B7050a24487A3555i3957C01959d0526A40694A1918c4653E7817a6162
11408A1642a42975I095d2455j55105b5159C0448e647C50553D116O5332k8255K7238
11396F8431J52261k2839a88550g2075A88781C6740J6449J15690k2387O1728r8826
$$ plain form
11385 109394 -141641 -142105 136419 -310086 95461 -74307 -281490 131613 12339 -267562 -295132
11374 -295132 -106120 124742 6091 7754 64611 266012 -125352 -18524 67834 -23309 26285
11362 188397 -18365 70398 -90040 -157201 87761 -306461 134443 -213928 143290 -132454
11351 259886 -144418 242639 66498 419004 -180856 -1268 193364 -179103 -229339 -136866
11341 -136866 -32543 111036 -177501 -62593 248075 81471 123807 57515 -33044 -65579 -500093
11330 -500093 -66171 -272531 -17439 145151 -275810 -170929 -92010 -229027 196269 -12809
11319 319411 216332 -187272 -114136 -109087 335874 -6083 -11343 167294 -70208 -231371 347979
11307 46219 -95209 33033 -15451 -796 -151040 -54147 7506 -8030 -23647 180691 -113605 -193524
$$ packed form
11385A09394a41641m64A36419c10086I5461g4307k07183A31613A2339b67562k7570
11374b95132a06120A24742F091J663N6857K01401a25352a8524F7834b3309B6285
11362A88397a8365G0398i0040o7161H7761c06461A34443b13928A43290a32454
11351B59886a44418B42639F6498L52506a80856a268A93364a79103n0236R2473
11341a36866c2543A11036a77501f2593B48075H1471M2336E7515c3044l2535m34514
11330e00093f6171k06360a7439A45151b75810J04881P8919j37017A96269a2809
11319C19411j03079a87272P3136N049C35874f083n260A67294g0208j61163C47979
11307D6219i5209C3033a5451g96j50244e4147G506h030j5617A80691a13605p9919
$$ plain form
11295 -193524 -397663 116253 31168 -108202 -159552 -5133 -248922 144125 -47813 129345
11284 -259429 -87215 54967 229090 10234 101955 99445 -154392 144809 -464955 -361239 -106378
11272 -278998 -60023 88058 -255986 -92773 -161674 -77968 -55381 40267 203573 -222196 -48367
11260 -205959 -102890 -143610 247014 52712 239312 -107655 120563 19068 -77702 -28855
11249 36944 -119327 62835 -35262 17240 -283565 90219 -410370 107812 76245 98693 245540
11238 245540 -159401 -37005 204366 -315921 173444 39566 -238445 390314 436160 -12422
11227 -67019 61082 152470 10891 -128261 78254 28161 -138898 -48596 59611 44098 25753
11216 25753 -215850 -272849 134291 5986 104756 -221815 -262427 -115744 -33521 6103 239020
$$ packed form
11295a93524k04139A16253C1168a08202n1350e133k43789A44125d7813A29345
11284b59429h7215E4967J74123A0234R1721k510a54392A44809d64955J03716a06378
11272b78998f0023H8058b55986i2773o8901g7968K2587D0267J63306b22196d8367
11260b05959a02890m0720B47014E2712J86600a07655A20563A9068g7702b8855
11249C6944a19327F2835c5262A7240b83565I0219d10370A07812l1567K2448J46847
11238B45540a59401c7005B04366c15921A73444C9566b38445C90314M5846a2422
11227f7019F1082R1388A0891a28261G8254B8161a38898d8596E9611j5513j8345
11216B5753b15850n6999A34291E986R8770b21815m0612a15744c3521F103K32917
$$ plain form
11205 239020 -239110 -327088 3084 -46486 -106609 92328 -102024 15310 -174960 286865 -150868
11193 -40875 178096 -309935 239097 94075 106534 -96871 249444 134785 79415 225645
11183 225645 -228527 -268388 258019 -178979 299588 372216 -179729 194586 -196344 -211114
11173 -211114 123487 25534 108174 -64338 -317473 98092 52303 -225777 -152378 -75496 154928
11161 49627 223417 -32718 -94988 -121960 319401 -274670 77300 398967 -360334 151017
11150 -71970 149802 -71154 -231699 46749 185089 -131440 -148761 -273604 -76933 -80508 -6912
11138 161762 -181109 -63473 30726 -44425 -22981 197763 -6659 38015 2050 -9614 177215
11126 -45707 -21433 139709 384940 -43625 304641 -411256 -108342 -205231 36699 61412 48571
$$ packed form
11205B39020b39110q7978C084d6486o0123I2328a02024A5310a74960B86865a50868
11193d0875A78096c09935B39097I4075J2459i6871B49444j14659n5370J46230
11183B25645b28527l9861B58019a78979B99588P2628a79729A94586a96344j4770
11173b11114A23487B5534Q2640f4338k53135I8092m5789b25777P3399g5496A54928
11161D9627J73790c2718o2270k6972C19401b74670G7300L21667c60334A51017
11150g1970A49802g1154j60545D6749J38340a31440j7321j24843g6933l575f912
11138A61762a81109f3473C0726d4425K1444A97763f659C8015B050i614A77215
11126d5707b1433A39709K45231d3625C04641d11256a08342r6889C6699K4713j2841
$$ plain form
11115 48571 -92958 72944 164831 11582 -29880 -116269 102294 167106 -111121 -61930 187254
11103 -59981 -110446 178623 448324 117647 126841 -106160 5830 -92300 -89204 24246 -100440
11091 164503 111071 -49368 -28090 293558 44105 -90312 228831 -21065 337770 242637 -80375
11079 -164150 201800 -138606 20051 282763 251063 57557 385498 201557 161663 90671
11069 90671 223465 174086 357149 -48801 419058 294210 53417 120053 573815 41823 340568
11058 340568 377002 256852 571337 360069 479626 658074 395712 759500 797436 514486
11048 514486 806924 399357 507616 549920 348471 554875 254450 763645 431989 504345
11038 504345 251728 237511 763899 412307 267065 395010 677991 549848 731120 827858
$$ packed form
11115D8571i2958G2944R1887A1582b9880q6389A02294O4812a11121M9191A87254
11103e9981n0465A78623K69701A17647R194a06160E830i2300L096B4246a00440
11091A64503n3432d9368K1278B93558D4105i0312B28831b1065C37770r5133h0375
11079a64150B01800a38606B0051K62712l1700E7557L27941j83941l9894p0992
11069I0671J32794m9379J83063d8801D19058j24848E3417O6636M53762D1823K98745
11058C40568L6434j20150L14485k11268J19557J78448k62362L63788L7936k82950
11048E14486K92438C99357J08259M2304k01449K06404B54450N09195l31656P2356
11038E04345B51728j4217N26388l51592j45242J27945K82981j28143J81272R6738
$$ plain form
11028 827858 348075 452952 522776 403308 610481 688443 426355 938067 240263 404485
11018 404485 273695 963050 593083 377193 293461 361850 477418 49401 496782 441334
11008 441334 499676 374827 504497 409697 549605 676318 530725 237796 381948 366541
10998 366541 619964 306636 706990 457979 305993 539665 376069 615693 581888 272531
10987 609319 412832 768125 611066 674020 688011 505940 845879 936716 989034 871873
10977 871873 1236521 1092039 1265737 1384130 1810271 2159797 2173086 2363321 2023988 1955842
10967 1955842 1603044 1523757 1492928 1510737 1317805 1150955 1144032 1298186 1520242 947812
10957 947812 1396167 982941 999787 1218666 936459 786342 478600 511515 571043 495387
$$ packed form
11028H27858C48075J04877O9824j19468K07173P7962k62088N11712B40263J64222
11018D04485j30790O89355l69967k15890q3732O8389J15568D9401M47381n5448
11008D41334N8342j24849J29670r4800J39908J26713j45593B37796J44152j5407
10998C66541K53423C06636M00354k49011j51986K33672j63596K39624l3805B72531
10987F09319j96487L55293j57059O2954J3991j82071L39939R0837N2318j17161
10977H71873L64648j44482J73698J18393M26141L49526J3289J90235l39333o8146
10967A955842l52798p9287l0829J7809j92932j66850o923J54154K22056n72430
10957I47812M48355m13226J6846K18879k82207j50117l07742L2915N9528p5656
$$ plain form
10947 495387 559167 367273 318789 270122 -25248 159219 182078 183239 27676 -50725 4597
10935 -74796 236596 147550 69091 288252 80808 170244 8347 -179771 11394 -45485 -129293
10924 -129293 259119 19694 320118 248263 195344 14063 67533 -6760 -236135 80515 -268832
10912 46210 -183232 -11229 17995 -61277 -29946 138351 48398 -7893 -167313 362192 -64174
10900 -248359 -32515 228403 -212360 -19714 314104 -356833 -39814 56003 -76887 41658 193092
10889 193092 92736 -60515 -192304 -29536 -166285 241429 260482 341151 178084 38270 -180730
10877 -228840 37433 195487 58198 -8856 -37828 10117 81922 -24227 55046 -46267 -77739
10866 -77739 -7017 -378601 -201442 80433 -24430 -51583 -194562 189979 -182730 208984 197960
$$ packed form
10947D95387O3780j91894m8484m8667b5248A59219K2859J161B7676e0725D597
10935g4796B36596q9046F9091K19161H0808Q9436H347a79771A1394d5485q3808
10924a29293B59119A9694L00424p1855n2919A4063N3470f760k29375H0515b68832
10912D6210a83232a1229A7995f1277b9946A38351D8398g893j59420C62192f4174
10900b48359c2515B28403b12360a9714C14104c56833c9814E6003g6887D1658J51434
10889A93092I2736f0515j31789b9536j36749B41429J9053Q0669j63067C8270a80730
10877b28840C7433J58054E8198h856k8972A0117P1805b4227E5046d6267l1472
10866g7739g017l71584J77159H0433b4430k7153j42979A89979a82730B08984j1024
$$ plain form
10855 197960 -257352 10525 147071 164615 31505 -233417 -39996 -237425 32036 88901 -52851
10843 -299946 31336 146005 -189271 107044 1379 -180678 92019 -276662 -122785 162718
10832 -319263 -92883 -79347 -160207 -197547 56596 -191589 -392438 -169512 187814 -123854
10821 22722 14260 51346 -194277 87377 -277827 -51240 -21529 -33537 150670 49910 -199105
10809 157859 -299666 -137303 -40735 -136062 240935 -105413 -254211 193623 96694 258746
10799 258746 -87260 -89401 -4587 -455661 131946 37562 -19441 -65074 -250163 -29054 61808
10787 63087 -341454 -98046 169302 -322545 -227384 240483 104980 -124769 -38811 -105296
10777 -105296 186279 156567 196569 130817 -84813 -33767 21705 9124 148834 -84794 35518
$$ packed form
10855A97960b57352A0525J36546J7544C1505b33417c9996j97429C2036N6865e2851
10843b99946C1336J14669a89271A07044A379a80678I2019b76662a22785A62718
10832c19263i2883J3536q0860l7340E6596a91589k00849a69512A87814a23854
10821B2722q462L7086a94277H7377b77827e1240b1529j2008A50670D9910a99105
10809A57859b99666a37303d0735r5327B40935a05413j48798A93623I6694J62052
10799B58746h7260k141d587m51074A31946C7562a9441m5633j85089b9054F1808
10787F3087c41454i8046A69302c22545R5161B40483A04980a24769c8811o6485
10777a05296A86279k9712M0002o5752h4813c3767B1705I124J39710h4794C5518
$$ plain form
10765 -110969 -258731 -189474 -292163 24625 -54935 -537502 -262666 -20493 181177 -105735
10754 -153365 -212355 -55299 -39920 -81108 167313 121453 170694 -5070 203408 227009 286309
10743 286309 -341923 -67182 96560 -77736 137005 62258 -130109 240217 83618 -121183
10732 -87747 106396 -185581 -67516 -359086 -248845 -58822 196717 309309 -125002 -55625
10721 -79976 813 141633 -273944 15839 -87171 1167 -154904 -230162 -164407 -77551 69871 -3198
10708 -420704 116481 -143357 124386 -509191 -63683 -37601 -127635 -239932 -112489 -96121
10698 -96121 -109390 162778 -242703 48179 37087 55785 133059 53742 -190591 -146194 -80860
10687 -80860 293802 239298 -213870 41925 50181 -238223 -82601 -492365 -249259 -166204 85364
$$ packed form
10765a10969j47762O9257j02689B4625e4935m82567b62666b0493A81177a05735
10754a53365n8990e5299J5379m1188A67313m5860M9241e070B03408K3601N9300
10743B86309c41923f7182I6560g7736A37005F2258a30109B40217H3618a21183
10732h7747A06396a85581f7516k91570J10241e8822A96717J12592a25002e5625
10721g9976H13J40820b73944A5839h7171A167a54904p5258O5755g7551F9871c198
10708d20704A16481a43357A24386e09191f3683K6082r0034j12297a12489J6368
10698i6121j3269A62778b42703D8179j1092J8698P7274E3742a90591M4397O5334
10687h0860B93802n4504b13870D1925Q256b38223h2601m09764K43106Q3055H5364
$$ plain form
10675 153765 -214671 -120122 340223 -252819 37590 -124486 -202379 -313242 -278375 -5327 52575
10663 -174466 -15235 -69518 63524 -111694 158556 287614 183132 -270294 313182 150375
10652 -111277 -4160 -321818 37199 -129548 150878 51476 232773 -126334 -72769 255871
10641 214376 -9146 -6957 74168 292388 -21314 21565 -187424 47026 -71776 194680 -49033
10629 61541 -102443 -266648 -336141 -139603 -118551 184074 167155 -59806 -272570 217896
10618 -408114 36136 -236549 93582 -253033 -205835 -91019 121623 337635 -152761 -5441 -505135
10607 -505135 16846 444635 -352959 26113 72656 -62048 -185390 143332 -284453 -243049
10597 -243049 -100948 123029 138053 203675 -253315 156707 -19645 67260 87296 65324 -84734
$$ packed form
10675A53765b14671R4549C40223b52819C7590a24486p7893j10863L4867e327E2575
10663a74466a5235n4283F3524a11694A58556J29058j04482b70294C13182A50375
10652a11277d160l17658C7199a29548A50878E1476J81297a26334N3565B55871
10641B14376i146K189G4168K18220b1314B1565a87424D7026g1776A94680d9033
10629F1541a02443j64205o9493a39603K1052A84074j6919e9806k12764B17896
10618d08114C6136b36549I3582b53033M7198i1019A21623K16012a52761e441m99694
10607e05135A6846M27789c52959B6113M6543f2048j23342A43332b84453M1404
10597b43049a00948A23029J5024O5622b53315A56707a9645F7260K0036k1972h4734
$$ plain form
10585 222109 -776 94612 -100507 -99532 -130823 -240957 -183445 5393 -224669 249977 -109549
10573 12486 161929 -368742 -160357 -50246 -150654 -218963 -444193 125144 115975 -23831 -100075
10562 -100075 -64475 -52261 -101355 -166089 -165627 -100609 -195626 395976 -340196 88249 -304766
10550 88324 19248 -263914 -269034 -74265 -67224 28581 287968 -166704 -257410 -117734 -210694
10539 -210694 181345 -35892 -44919 -194664 13505 -267561 142388 -134686 218075 -76348
10528 -125805 -96733 -8138 -193445 -54391 -143765 -215488 -17275 137705 86453 -100218 -455609
10517 -455609 253084 321950 149645 43359 -218477 -97235 197808 -113692 120334 65813
10507 65813 -88766 89229 -145609 -219827 130103 210459 -44530 247474 171288 -39159 24310
$$ packed form
10585B22109g76I4612a00507R75l1291j10134N7512E393b24669B49977a09549
10573A2486J49443c68742a60357e0246j00408o8309k25230A25144r169b3831p6244
10562a00075L5600J2214m9094o4734M62O5018r5017C95976c40196H8249c04766
10550H8324A9248b63914n120g4265P041B8581K59387a66704r0706a17734r2960
10539b10694A81345c5892r027j49745A3505b67561A42388a34686B18075g6348
10528a25805K9072h138j85307e4391q9374p1723a7275A37705n1252a00218l55391
10517d55609B53084O8866A49645D3359b18477i7235A97808a13692A20334n4521
10507F5813h8766H9229a45609p4218A30103Q0356d4530B47474p6186c9159B4310
$$ plain form
10495 7773 -90054 233381 -14631 -116690 -53001 86021 -103741 -170298 -172540 -6863 -6983 -262386
10483 -262386 198527 162241 222583 75855 219685 121141 -5078 101251 142611 132724 -184650
10471 -177126 218382 -28399 75161 -76518 143902 -361569 -249670 105608 102328 -49395 66268
10459 -117980 -43002 116952 197179 76439 -30112 18399 -155105 -54243 -291506 -112260 14667
10447 -246177 -24547 -253850 -34256 169218 -241610 66793 -76017 66841 111327 -177832 -329020
10436 -329020 -236002 -52908 -393388 64412 36779 115385 253115 44576 -157677 -191350 -85705
10424 -242568 -96940 73858 -7794 34341 -5937 172297 220555 -220481 253029 -254299 58750
10412 -176675 161169 -221804 130784 49321 93360 181641 33554 53179 144266 -156543 201053
$$ packed form
10495G773i0054B33381a4631j02059e3001H6021a03741o6557k242f863j20k55403
10483b62386A98527l6286O0342G5855J43830r8544e078A01251M1360r887a84650
10471a77126B18382b8399G5161g6518A43902c61569J11899A05608l280d9395F6268
10459a17980d3002A16952Q0227G6439c0112A8399a55105e4243k37263a12260A4667
10447b46177b4547k29303c4256A69218b41610F6793g6017F6841M4486a77832j51188
10436c29020R3018e2908l40480F4412k7633P8606J37730D4576a57677l3673h5705
10424b42568i6940G3858g794C4341e937A72297M8258b20481B53029b54299E8750
10412a76675A61169b21804A30784D9321M4039Q8281C3554J9625R1087a56543B01053
$$ plain form
10400 -144668 -269167 87487 63943 -172755 92844 -28465 -351419 -8310 204761 -144688 94830
10388 48316 -139140 25516 159791 172394 78634 260515 -195515 122887 6058 64659 36379
10377 36379 47434 155980 203759 88851 29091 155677 519886 -19853 252381 153842 95171
10366 95171 678396 270518 551674 159940 283872 -64891 294758 77695 35374 195513
10356 195513 282388 231465 293609 207061 46992 541353 -31123 348732 390337 30296 -14929
10344 205412 299746 143098 112236 214975 41858 -1022 69905 203861 440054 354248 207715
10333 207715 273967 -208740 173897 123825 54063 -50366 110831 -31013 66865 224780 184417
10322 184417 213553 235514 163110 369425 -100578 205258 325757 208674 219668 320458
$$ packed form
10400a44668j24499H7487k3544a72755I2844b8465l22954h310B04761a44688I4830
10388D8316a39140B5516J34275J2603G8634J81881a95515A22887F058N8601k8280
10377C6379J1055J08546M7779H8851B9091J26586L64209a9853B52381r8539n8671
10366I5171N83225B70518K81156A59940J23932f4891B94758G7695C5374J60139
10356A95513Q6875n0923O2144q6548D6992M94361c1123C48732M1605C0296a4929
10344B05412R4334A43098l0862J02739D1858a022F9905J33956K36193q5806j46533
10333B07715O6252b08740A73897n0072E4063e0366A10831c1013F6865J57915m0363
10322A84417K9136K1961p2404K06315a00578B05258J20499j17083J0994J00790
$$ plain form
10312 320458 147583 -121266 -341496 -121695 55741 -86440 -54763 212511 103436 -85643
10301 -162812 138536 -278226 -392910 422342 28973 -186434 -93759 -48515 -217517 14953
10290 -62814 -335062 63317 -31673 -251169 171422 55794 71093 -154555 7246 -43810 -337503
10279 -337503 -224502 -315139 -68717 296524 -163298 -81751 -139264 21586 -72636 -41491 -80222
10268 -80222 -237870 113936 72235 146082 -87735 -358991 -101559 -103921 52945 209653 289552
10257 289552 116417 277343 266079 73600 575224 385761 114212 434144 -576147 -279134
10246 18880 -23158 230279 155433 -176227 129714 236711 152519 -12250 582366 77723 -347501
10234 107621 -263725 148431 -36039 -59295 41574 73412 71022 -289617 -230456 -288410 -45087
$$ packed form
10312C20458A47583a21266k20230a21695E5741h6440L1677B12511A03436h5643
10301a62812A38536b78226j14684D22342B8973a86434R2675M5244j69002A4953
10290f2814k72248F3317c1673k19496A71422E5794J5299a54555G246d3810k93693
10279c37503J13001r0637f8717B96524a63298Q1547n7513B1586g2636L1145l8731
10268h0222j57648A13936m1701P3847h7735k71256a01559k362E2945J56708P9899
10257B89552A16417J60926j1264G3600N01624j89463A14212L19932e76147b79134
10246A8880b3158B30279p4846a76227A29714J06997q4192a2250E82366G7723c47501
10234A07621b63725A48431c6039k3256D1574L1838k390b89617N9161n7954d5087
$$ plain form
10222 -72613 -20296 -29126 33365 -292093 -143607 -247698 213569 -127728 164650 -146856
10211 -102686 -266894 -271219 14928 -72292 297628 -232272 -384126 -18746 -140330 -149207 -301426
10200 -301426 105930 -395384 -163890 -222340 -439255 -133672 -131274 21183 -121994 -354202
10190 -354202 -81444 32314 12696 -191715 -161205 -236093 -137879 151511 2458 -71878 -26921
10178 -14468 -18960 -83808 111592 -171099 -3010 -28567 -143823 -89050 -34562 -153169 -40398
10166 112274 115296 -221119 417419 124193 320074 -321353 178949 26467 -153358 -126344
10156 -126344 63353 110952 -26384 -962 -60937 223308 -1722 -198621 -71089 -177135 138050
10144 -192734 142370 -65452 -242068 -386906 1204 -6549 101905 -13287 -111318 -89342 10853
$$ packed form
10222g2613b0296q830C3365b92093a43607j04091B13569a27728A64650a46856
10211a02686j64208m325A4928g2292B97628b32272j51854a8746j21584q877j52219
10200c01426A05930c95384a63890n8450k16915a33672K398B1183a21994k32208
10190c54202h1444C2314A2696a91715L0510p4888R8214A51511B458g1878b6921
10178a4468m492o4848A11592a71099c010k5557j15256N4773c4562j18607d0398
10166A12274L022b21119D17419A24193J95881c21353A78949B6467a53358K7014
10156a26344F3353M7599b6384i62n9975B23308a722j96899g1089j06046A38050
10144a92734A42370f5452j76616j44838A204f549A01905a3287r8031K1976A0853
$$ plain form
10132 -35925 -313685 26015 193218 -143003 6274 -151206 223599 -122861 39101 -422946
10121 177711 -180186 -67693 -54419 126831 -170362 15254 -110244 -23620 52807 -98389 -844
10109 49105 -37130 264262 -37926 25000 -68247 221242 -151719 -135700 -97315 140942 31099
10097 -118974 -344770 11135 130207 -82267 15968 -126543 -238932 209513 -23658 -47062
10087 -47062 58981 6954 212282 68713 113669 -183477 -263885 9070 -401490 -69244 -5735 -166211
10075 -166211 66151 14674 -86637 -28399 -475615 -196532 113579 52075 10353 -238872 -16772
10063 88879 3985 -103694 387335 218681 23754 -109566 -49657 -231298 -164862 179533 -77800
10051 67442 -28349 -57689 -314786 -127376 83850 -338080 347075 -125067 -119604 -38005 148306
$$ packed form
10132c5925k77760B6015J67203a43003F274a51206B23599a22861C9101d22946
10121A77711a80186f7693J3274A26831a70362A5254a10244b3620E2807i8389h44
10109D9105c7130B64262c7926B5000f8247B21242a51719J6019L8385A40942C1099
10097a18974k25796A1135J19072h2267A5968a26543j12389B09513b3658k3404
10087d7062E8981F954K05328F8713M4956a83477q0408I070d01490f9244e735j60476
10075a66211F6151A4674h6637b8399m47216a96532A13579E2075A0353b38872a6772
10063H8879C985a03694C87335j68654B3754a09566d9657j81641O6436A79533g7800
10051F7442b8349k9340k57097a27376H3850c38080C47075a25067N463c8005A48306
$$ plain form
10039 -19026 238405 -98456 -91563 -48077 -164825 -22463 42229 -144429 -210622 -340803 99938
10027 54795 -119476 -131773 -321574 -300730 -156989 -312489 -15621 -196195 -54947 16170 -88104
10015 227532 -164878 -133546 -56473 143129 -243937 -175801 -284622 -172212 -81392 -154893
10005 -154893 -160196 -79062 -17389 247931 -69737 97845 168579 -192958 -118157 -211100 -14460
9993 -4635 -38420 106621 -276369 4259 -139283 -319202 -251042 92644 87568 11965 -116910
9981 -314842 16514 7325 -267734 368241 136530 -97886 -98532 -313735 -129112 -241214 111189
9969 -138274 -101889 52066 -371876 39570 -75659 39050 -168611 -157179 -295425 -182746 -235105
9958 -235105 -170305 273479 96293 -427261 -189951 -266435 -39258 -52382 83942 333549 205480
$$ packed form
10039a9026B38405i8456O893M3486j16748b2463D2229a44429o6193j30181I9938
10027E4795a19476j2297j89801K0844J43741j55500a5621j80574e4947A6170h8104
10015B27532a64878L1332e6473A43129b43937O8136j08821J12410h1392p3501
10005a54893n303g9062a7389B47931f9737I7845P0734a92958P4801r2943a4460
9993d635l3785A06621b76369D259a39283j79919O8160I2644n076A1965a16910
9981c14842A6514G325b67734C68241A36530i7886o46k15203a29112j12102A11189
9969a38274L6385E2066c71876C9570g5659C9050a68611J1432j38246J12679n2359
9958b35105O4800B73479I6293d27261a89951p6484c9258j3124H3942K49607j28069
$$ plain form
9947 205480 -198689 14976 25110 -119491 -151407 -86239 -272861 -133081 39650 -44939 36773
9935 -155081 28719 -336248 -376448 -89281 4273 176649 4569 146791 -223368 -17722 -114173
9924 -114173 -105771 165473 170218 -43586 76302 -292165 56467 -143828 -408155 -309877 -38161
9912 -55077 288368 -36305 -321738 -31599 -325708 117461 -173016 -318442 -212062 54153
9901 -34355 174021 244104 102110 -13936 80630 -254509 -116042 4595 -42417 -155475 -173933
9890 -173933 19236 88584 277154 33755 -241294 75836 -715 -280443 33102 -199030 -212039
9879 -212039 -157460 8808 46653 89491 -345375 93729 -34662 -84788 206098 13496 -108411
9867 173368 201437 24530 -71360 -211347 -10022 -140764 -320201 -27235 -108370 24560 18061
$$ packed form
9947B05480a98689A4976J0134a19491l1916O5168j86622a33081C9650d4939C6773
9935a55081B8719c36248m0200h9281D273J72376D569J42222b23368a7722r6451
9924a14173Q402A65473M745d3586G6302b92165E6467a43828k64327R8278c8161
9912e5077B88368c6305k85433c1599k94109A17461a73016j45426J06380E4153
9901c4355A74021P0083A02110a3936H0630b54509a16042D595d2417j13058j8458
9890a73933A9236O9348J88570C3755b41294G5836g15k79728C3102a99030j3009
9879b12039N4579H808L7845M2838c45375I3729c4662n0126B06098A3496a08411
9867A73368K8069B4530g1360j39987a0022j30742j79437b7235q1135B4560o499
$$ plain form
9856 18061 38547 -275608 33380 257536 -241969 -59114 -99953 -129501 164065 -48829 -266368
9845 -266368 42586 -206525 -46926 95052 -302057 48173 -104939 94701 71486 -191880 -120196
9834 -120196 143306 58971 -64445 28851 -148630 -19640 15150 161992 -18270 299868 -79446
9822 -165273 -245464 94947 -355906 -360033 -137034 -25564 -49451 48206 -33534 2450 37433 -183020
9809 -13122 48537 -139740 -374109 -334622 -215865 -370040 -44741 -1323 -43132 -54367 71612
9797 42557 -51331 101363 -217110 151127 -73020 -166381 84534 -268755 -265409 -238765 -126250
9786 -126250 133209 -264886 -181675 -248031 -227432 3375 423602 -43092 305429 165291 -178676
9774 -271756 -177879 -179402 -296578 96161 -294110 -313801 136681 236842 -65403 21168 29047
$$ packed form
9856A8061K0486b75608C3380K24156b41969e9114m0839k9548A64065d8829k17539
9845b66368D2586b06525d6926I5052c02057D8173a04939I4701k3215a91880P1684
9834a20196A43306E8971f4445B8851a48630a9640A5150J46842a8270B99868g9446
9822a65273q0191I4947c55906m127a37034b5564k3887D8206c3534B450L4983a83020
9809a3122D8537a39740k34369L9487J18757j54175d4741a323m1809j1235G1612
9797D2557e1331A01363b17110A51127g3020r3361H4534b68755L346K6644J12515
9786a26250A33209b64886Q3211o6356K0599C375M20227d3092C05429j40138a78676
9774b71756R3877j523j17176I6161b94110j9691A36681J00161f5403B1168P879
$$ plain form
9763 29047 -57180 90315 88500 -108341 -117304 -5843 -157501 211533 -103547 -371755 -114001
9751 98769 72165 -378857 32382 -227305 -548810 -69816 -345089 -29772 -8925 92934 -197313
9739 208574 -167345 -158094 -348042 73351 5552 -81559 -250896 -142622 -61088 139162 150236
9728 150236 -138444 71457 -295117 -67797 -104103 48318 -266031 -30066 17080 -332926 -116626
9716 -32171 13862 -409612 -166719 -139079 266665 -115963 -23599 236902 75029 152902 -33210
9704 -21176 26316 -154589 -36913 -8941 183298 -17939 -70108 -192512 -4210 -432684 -205087
9692 -141493 407587 -100040 59657 -375393 108211 -274444 -24158 123965 192251 -13771
9681 -264601 -116485 287543 -263361 -110282 -143473 -61402 -113854 -143574 22908 86683 178842
$$ packed form
9763B9047e7180I0315j815a08341q963e843j51658B11533a03547k68208a14001
9751I8769k6604c78857C2382b27305l21505f9816k75273b9772h925I2934a97313
9739B08574a67345R251j89948G3351E552h1559j69337J08274f1088A39162J1074
9728A50236a38444G1457b95117f7797l6306D8318b66031c0066A7080c32926a16626
9716c2171A3862d09612a66719K7640B66665a15963b3599B36902G5029P7873c3210
9704b1176B6316a54589c6913h941A83298a7939n2169j22404d210m28474b05087
9692a41493D07587a00040E9657c75393A08211b74444b4158A23965O8286a3771
9681b64601a16485B87543b63361a10282l3191f1402n2452k9720B2908O3775R2159
$$ plain form
9670 178842 -3778 3653 98764 200460 189569 -33011 -18840 150024 -130167 188887 -39199
9658 -138794 -107638 -84790 32417 -358366 16100 -303069 19067 -94129 161994 -163771 -406546
9647 -406546 -72023 -129441 7478 -195719 90483 -31917 133605 -99720 -214803 -215916 -332248
9636 -332248 -533498 -9992 -28545 -147415 129170 -191417 -169976 40762 153897 -4784 -24003
9625 -24003 -22036 299200 -303435 -224108 -396871 -40502 49826 -106822 -42872 -42803 6839 -285557
9612 -78490 70570 -58875 -91870 -418543 -350531 -83855 -304326 -82548 168798 91343 -226930
9600 -127483 -143478 -55521 -5571 -78213 -145048 130766 -234756 5464 -187202 -36037 97028
9588 -143756 -296745 -68324 -69429 -155950 -4549 -60323 -111493 171148 -53773 -68105 -99888 -204693
$$ packed form
9670A78842c778C653R5111J01696j0891c3011J4171A50024a30167A88887c9199
9658a38794L1156K2848C2417c58366A6100c03069A9067i4129A61994a63771k42775
9647d06546g2023n7418G478a95719I0483c1917A33605i9720j15083j113j16332
9636c32248k01250i992j8553j18870A29170a91417K1441D0762J13135d784j9219
9625b4003J967B99200c03435P9327j72763d0502D9826a06822d2872O9F839b85557
9612g8490G0570e8875l2995l26673O8012h3855k20471h2548A68798p7455b26930
9600a27483j5995e5521e571p2642o6835A30766b34756E464a87202c6037I7028
9588a43756j52989f8324j105q6521d549n5774n1170A71148e3773j4332l1783j04805
$$ plain form
9576 -204693 -397298 60900 -120819 -70602 60671 113154 248431 -58389 6962 158542 -375694
9564 -31644 40451 72856 359255 239606 391665 -43756 -55205 -70254 3502 -162873 -274600
9553 -274600 46398 51595 9766 -94453 -98349 -149603 -12919 -119894 -270141 -98482 -299945 -261048
9541 -261048 -175166 237493 -216576 -173209 210594 -40119 132189 -93044 -25358 57129 -116502
9529 -404614 111931 65400 -130778 82602 -163882 98562 -186799 -319923 -14395 -228129
9519 -228129 -840 7290 133680 32580 49112 -47792 157162 25600 286890 -255465 78539
9507 -141684 -316617 -186638 256175 -77981 248981 -65891 84493 -336885 47634 148227
9497 148227 94573 -55581 -196033 -511 -288284 -127155 -84666 -117671 18231 -5401 50410 29063
$$ packed form
9576b04693j92605F0900a20819N0217F0671N2483J35277e8389F962J51580c75694
9564c1644D0451L2405K86399j19649J52059d3756j1449j5049C502a62873j11727
9553b74600D6398N197I766i4453l896n1254a2919j06975j50247i8482k01463L8897
9541b61048Q5882B37493b16576M3367B10594d0119A32189i3044b5358E7129a16502
9529d04614A11931m6531a30778H2602a63882I8562a86799j33124a4395k13734
9519b28129h40G290J26390C2580J6532d7792A57162B5600K61290b55465G8539
9507a41684j74933J29979B56175g7981B48981f5891H4493c36885D7634J00593
9497A48227n3654e5581j40452e11k87773a27155M2489l3005A8231e401E0410k1347
$$ plain form
9485 29063 178757 -68594 -193927 -216097 118663 -104882 -169889 -48904 176188 -6127 28629
9473 275439 -251952 -176826 349657 93562 -95020 -54239 246230 -31870 128971 -19172 -321892
9462 -321892 -12248 297447 -68888 -74161 -144545 118468 -135793 -85480 -187396 143422 131676
9451 131676 146914 -89560 -92656 -119585 -95562 119850 155367 -48779 -60646 -87045 -265831
9440 -265831 -420195 -223817 -101904 -153542 -192823 198215 71766 -21351 -129215 -80499 -178749
9429 -178749 -249629 38353 -169788 -92970 176977 12129 -208365 -74650 27870 -237506 -7192
9417 19860 -221889 -181780 -118938 132384 7798 -349499 -195042 -74780 -42577 23867 11482
9405 -76214 108524 -58616 -287919 -336279 -319355 -7303 -195746 85310 65701 -141902 144159
$$ packed form
9485B9063J49694f8594j25333k2170A18663a04882o5007d8904A76188f127B8629
9473B75439b51952P5126C49657I3562i5020M0781B46230c1870A28971a9172l02720
9462c21892a2248B97447f8888n273p0384A18468a35793N0313j01916A43422j1746
9451A31676J5238h9560l096k6929K4023A19850L5517d8779j1867k6399j78786
9440b65831j54364J96378a01904n1638l9281A98215G1766b1351j07864M8716r8250
9429a78749p0880C8353a69788P6818A76977A2129b08365g4650B7870b37506g192
9417A9860b21889M0109O2842A32384G798c49499J54457g4780L2203B3867A1482
9405g6214A08524e8616k29303m8360J6924g303j88443H5310j9609a41902A44159
$$ plain form
9393 -54085 52270 335680 66121 -125649 316483 -51730 59870 -24709 193237 -140716 -7619
9381 -121618 -234220 -17736 15743 93063 355470 -151560 -120161 91192 130975 -151471 -193059
9370 -193059 -106810 -87043 -167731 -74856 -47371 69400 -172642 -147662 -36114 79282 95866
9359 95866 -13921 -155940 -124010 63707 39188 36238 -313188 -280494 -110578 10583 24942
9348 24942 149643 -231454 85544 -81586 -107408 -160467 -168844 -17639 -126666 -129681 -241184
9337 -241184 -52568 -290099 269819 -263221 -189948 -208457 -81029 -76140 -147767 -33431 -51689
9326 -51689 -79251 -249377 105768 -110252 26489 -332178 -28093 -292061 -172623 -94515 155132
9314 -52373 336487 -234766 -107361 182158 -198323 -5072 -19301 -6005 -201765 -146153 -181748
$$ packed form
9393e4085E2270K83410F6121a25649C16483e1730E9870b4709A93237a40716g619
9381a21618j12602a7736A5743P7320K62407a51560L1399I1192L9783a51471m1588
9370a93059Q6249J9767q0688g4856K7485F9400a72642K4980c6114G9282J6584
9359I5866a3921j42019L1930F3707k4519k950c13188L2694a10578A0583J4359
9348B4942J24701b31454H5544h1586k5822n3059q377a7639j09027l015j11503
9337b41184e2568k37531B69819b63221P3273j8509h1029M889p1627c3431j8258
9326e1689k7562j70126A05768a10252B6489c32178b8093k63968J19438P8108A55132
9314e2373C36487b34766a07361A82158a98323e072j4229f005j95760N5612l5595
$$ plain form
9303 -181748 3940 36945 -74603 241754 241439 12237 -95729 -178567 -167993 -31567 -176135 368453
9290 -125360 -294585 -5932 -170781 -69484 65964 251671 -100420 -6029 10564 26274 -288140
9278 -43002 44605 -178206 -173454 126545 -207952 5753 -180209 44929 -115443 -67554 302652
9266 91988 -106423 89883 122907 -186020 -206946 34043 -45123 -352309 54288 -78063 -49718
9255 -49718 -83319 -4451 -5197 -305927 -145534 -290432 -3938 -246526 56691 98037 -44578 37872
9242 150620 202994 97928 -47419 -360499 -526230 -33524 -49399 -78623 -35252 -189606 150528
9230 -56461 -53686 -77059 -357500 28198 -145356 -280752 135805 -82896 -66350 -35420 96398
9218 -325442 4132 -159524 -165260 73248 154053 129735 -129037 -143734 167007 -108260 -166031
$$ packed form
9303a81748C940L3005g4603B41754l15A2237i5729q2838J0574c1567j44568C68453
9290a25360j69225e932j64849f9484F5964J85707a00420f029A0564J5710b88140
9278d3002D4605a78206M752A26545b07952E753a80209D4929a15443M7889C02652
9266I1988a06423H9883L3024a86020k0926C4043d5123l07186E4288g8063K8345
9255d9718l3601d451p46l00730a45534j44898c938k42588E6691M1346d4578C7872
9242A50620N2374I7928d7419l13080j65731c3524j5875k9224c5252j54354A50528
9230e6461K775k3373k80441B8198a45356j35396A35805h2896J6546L0930I6398
9218c25442D132a59524n736G3248Q0805k4318a29037j4697A67007a08260n7771
$$ plain form
9207 -166031 62168 -51614 -129239 41591 -416255 333 -154647 -151312 116509 120276 152535 -495559
9194 -11474 -165617 -26748 -49041 -194830 338980 -223602 194385 -129778 -12627 -113270
9184 -113270 7738 251050 -40713 310024 -106530 -109616 -115429 571664 -217397 91290 -131712
9172 51463 -38695 -168846 -93900 14194 189688 -127005 -450817 -551592 40440 -212479 18454
9160 -516186 -40861 82861 22933 -401232 -32697 -69699 203211 372543 -242957 -45968 -47564
9149 -47564 -332931 239371 356782 -303787 -239361 -22856 -210420 81691 -263931 -129113
9138 -209014 -419906 -223546 76136 -204306 40600 30493 -96675 -49038 -9561 -122261 -319598
9127 -319598 27139 -328219 15610 -103396 170130 -81549 -61500 -198260 -110280 -54486 -34698
$$ packed form
9207a66031F2168e1614p7625D1591d16255C33a54647L335A16509L767L2259d95559
9194a1474j54143b6748k2293j45789C38980b23602A94385a29778a2627j00643
9184a13270G738K43312d0713C10024a06530l086n813E71664b17397I1290a31712
9172E1463c8695j30151P4946A4194J75494a27005l23812j00775D0440b12479A8454
9160e16186d0861H2861B2933d01232c2697l7002B03211J69332b42957d5968j596
9149d7564k85367B39371J17411c03787O4426b2856j87564H1691b63931a29113
9138b09014k10892J96360G6136b04306D0600j0107i6675M7637i561j12700j97337
9127c19598B7139c28219A5610a03396A70130h1549K0049j36760Q7980e4486J9788
$$ plain form
9116 -34698 -256596 207614 52998 53755 116124 238934 46031 257931 -48930 39958 -2654 135266
9103 -167955 -184264 -7074 202650 225245 -153952 -218315 24568 -22415 -67590 -73855 170407
9091 19821 314610 134322 80964 -462153 -249148 136777 -453124 49314 126608 -478603
9080 30965 52266 269190 -63665 287544 -15926 -23750 -95543 -8285 -283600 -314586 -6743 -346654
9068 -346654 -59828 90850 22062 -37357 -166327 -253049 -121305 -120004 -40195 -87318 128699
9056 -176553 211053 80684 84109 169130 -67290 235401 151068 86940 -257141 133941 -542910
9044 -90465 83714 69163 136455 -46252 -50756 -55154 -126937 113715 -1237 100463 -32331 284723
9031 -461344 38685 -38521 -361840 112345 -287710 126577 -170267 -93661 -300362 -116491
$$ packed form
9116c4698k21898B07614E2998P57O2369J22810D6031K11900d8930C9958b654A35266
9103a67955j6309g074B02650K2595a53952o4363B4568b2415m5175o265A70407
9091A9821K94789A34322n3358d62153K13005A36777d53124D9314P7294d78603
9080C0965K1301K16924f3665B87544a5926p824p1793h285k75315l0986f743l39911
9068c46654e9828I0850B2062c7357j28970q6722a21305J301d0195m7123A28699
9056a76553B11053H0684L425Q5021f7290B35401q4333o4128b57141A33941e42910
9044i0465H3714j4551O7292d6252m504m398p1783A13715a237A00463c2331B84723
9031d61344C8685c8521l23319A12345b87710A26577a70267P6606k06701a16491
$$ plain form
9020 -194870 20018 12567 -68380 367185 -138102 -64365 -88927 -346851 -558672 -134613 -201905
9009 -201905 -272103 -75476 -134214 -38385 -117580 112138 106385 69960 -60813 -40991 -128907 80352
8996 -57958 150251 -237587 -191298 -62473 -37407 -89457 -40274 -232866 71794 201313 -97846
8984 50367 -103032 138887 -149570 -35121 102375 -110538 61016 12353 8108 -219759 -264520
8973 -264520 24045 192143 -74738 -91064 -2398 -98072 -153636 44317 161906 -111234 -213092
8962 -213092 -134226 -209445 -114510 242853 -81728 -64619 -97155 -39934 -311792 -323399 36773
8950 -81702 -198259 -66220 129343 -230990 86242 -114970 32182 -36876 -7454 -31475 -116734
8939 -116734 27260 -233012 69766 6861 395984 149589 604201 99319 171746 -25906 194744
$$ packed form
9020a94870B0018p451f8380C67185a38102f4365k4562k57924k11821a34613o7292
9009b01905p0198g5476n8738c8385p9195A12138n753l6425f0813J9822q7916H0352
8996e7958A50251b37587M6289f2473K5066n2050d0274j92592G1794J29519i7846
8984E0367a03032A38887a49570c5121A02375a10538F1016A2353m245b19759m4761
8973b64520B4045J68098g4738j6326b398r5674n5564D4317J17589a11234j01858
8962b13092P8866p5219R4935B42853h1728J7109l2536c9934k71858j1607C6773
8950h1702j16557f6220A29343b30990H6242a14970C2182c6876g454k4021q5259
8939a16734B7260b33012F9766F861L89123A49589M54612I9319P2427b5906A94744
$$ plain form
8927 -276702 193542 308059 495404 943427 2592863 6312809 15893332 16356032 5210488
8917 1553409 563577 539461 498628 101348 -105034 -11437 -148265 439852 234602 51874
8906 567669 195 167586 -57750 1251 -150827 117727 -27206 -193804 39732 40532 10747 -40864
8893 -35009 5201 -68064 -196030 -74639 -131864 -122209 63212 158272 -24294 -71086 94439 -137361
8880 -604682 -253138 53202 -98768 175966 -355613 -232741 -574 162320 255467 -306030 -129627
$$ packed form
8927b76702A93542J14517J87345M48023J649436L719946R580523M62700E210488
8917A553409E63577k4116m0833A01348a05034a1437j36828D39852k05250E1874
8906E67669A95J67391e7750A251a50827A17727b7206j66598C9732Q00A0747d0864
8893c5009E201f8064j27966g4639n7225R655F3212R5060b4294m6792I4439a37361
8880f04682b53138E3202i8768A75966c55613J22872e74A62320R3147c06030a29627
$$ [...]
##END NTUPLES=NMR SPECTRUM
##END=
