
##TITLE=UV1233_M7_1357-1247_70_7230903_WchUKA3BT3
##JCAMPDX= 6.0         $$ Bruker NMR JCAMP-DX V2.0
##DATA TYPE= NMR SPECTRUM
##DATA CLASS= NTUPLES
##ORIGIN= BRUKER
##OWNER= Administrator
$$ 1.72 TOPSPIN		Version 2.1
$$ 2013-01-18 21:49:34.806 -0500  Administrator@X
$$ Compression mode = diff/dup
##.OBSERVE FREQUENCY= 400.02188249412
##.OBSERVE NUCLEUS= ^1H
##.ACQUISITION MODE= SIMULTANEOUS (DQD)
##.ACQUISITION SCHEME= undefined
##.AVERAGES= 64
##.DIGITISER RES= 22
##SPECTROMETER/DATA SYSTEM= spect
##.PULSE SEQUENCE= noesygpps1d.comp
##.SOLVENT NAME= COFFEE_meoh
##.SHIFT REFERENCE= INTERNAL, COFFEE_meoh, 1, 14.96156
##AUDIT TRAIL= $$ (NUMBER, WHEN, WHO, WHERE, PROCESS, VERSION, WHAT)
$$ ##TITLE= Audit trail, TOPSPIN		Version 2.1
$$ ##JCAMPDX= 5.01
$$ ##ORIGIN= Bruker BioSpin GmbH
$$ ##OWNER= Administrator
$$ $$ E:\/data/COFFEE/nmr/UV1233_M7_1357-1247_70_7230903_WchUKA3BT3/22/pdata/1/auditp.txt
$$ ##AUDIT TRAIL=  $$ (NUMBER, WHEN, WHO, WHERE, PROCESS, VERSION, WHAT)
(   1,<2013-01-18 21:49:28.993 -0500>,<Administrator>,<X>,<go>,<TOPSPIN 2.1>,
      <created by zg
	started at 2013-01-18 21:37:58.837 -0500,
	POWCHK enabled, PULCHK disabled,
       configuration hash MD5:
       86 BA 57 50 F2 9D 5C 9B 26 00 A9 28 5F 66 2E 89
       data hash MD5: 64K
       D9 7F 4F 57 39 9D C0 D6 CF 13 FD 9A D5 EF 5A 73>)
(   2,<2013-01-18 21:49:32.009 -0500>,<Administrator>,<X>,<proc1d>,<TOPSPIN 2.1>,
      <Start of raw data processing
       efp LB = 0.3 FT_mod = 6 PKNL = 1 PHC0 = 0 PHC1 = 0 SI = 128K 
       data hash MD5: 128K
       41 3C 29 4F EC BE 6E C9 81 FC 7B 9F AE 27 58 42>)
(   3,<2013-01-18 21:49:33.056 -0500>,<Administrator>,<X>,<proc1d>,<TOPSPIN 2.1>,
      <pk PHC0 = -85.31433 PHC1 = 0 
       data hash MD5: 128K
       DC 6D F3 F8 EA 80 35 F1 B0 58 7F 36 6C 73 33 99>)
(   4,<2013-01-18 21:49:33.743 -0500>,<Administrator>,<X>,<proc1d>,<TOPSPIN 2.1>,
      <abs ABSG = 1 
       data hash MD5: 128K
       D3 44 0B 9E 96 81 89 5F 2D 45 54 22 6C 69 FA 26>)
(   5,<2013-01-18 21:49:33.915 -0500>,<Administrator>,<X>,<proc1d>,<TOPSPIN 2.1>,
      <abs ABSG = 2 
       data hash MD5: 128K
       01 AE 35 46 AE D8 3A DA FD 77 DA 1F 7A 61 08 A6>)
(   6,<2013-01-18 21:49:34.087 -0500>,<Administrator>,<X>,<proc1d>,<TOPSPIN 2.1>,
      <abs ABSG = 3 
       data hash MD5: 128K
       30 4F 5A 99 EA 54 F8 8B 46 C2 66 0B 52 09 01 02>)
(   7,<2013-01-18 21:49:34.275 -0500>,<Administrator>,<X>,<proc1d>,<TOPSPIN 2.1>,
      <abs ABSG = 4 
       data hash MD5: 128K
       7A BC 33 21 BE 73 AE 84 7A C3 FA 48 4B 4A 0A FC>)
(   8,<2013-01-18 21:49:34.462 -0500>,<Administrator>,<X>,<proc1d>,<TOPSPIN 2.1>,
      <abs ABSG = 5 
       data hash MD5: 128K
       63 02 AE F8 E2 01 E0 3C BC 80 9B 62 A3 FE 74 09>)
$$ ##END=
$$ 
$$ $$ hash MD5
$$ $$ 1B 17 8D 97 00 BE 5D FD D9 FE 64 72 74 D9 EF DE
##$RELAX= 
##$RELAX= 
##$RELAX= 
##$RELAX= 
##$RELAX= 
##$RELAX= 
##$RELAX= 
##$RELAX= 
$$ Bruker specific parameters
$$ --------------------------
##$DU= <E:\>
##$EXPNO= 22
$$ [...]
##$TP07= 0
##$TPNAME0= <>
##$TPNAME1= <>
##$TPNAME2= <>
##$TPNAME3= <>
##$TPNAME4= <>
##$TPNAME5= <>
##$TPNAME6= <>
##$TPNAME7= <>
##$TPOAL= (0..7)
0.5 0.5 0.5 0.5 0.5 0.5 0.5 0.5
##$TPOFFS= (0..7)
0 0 0 0 0 0 0 0
##$TUNHIN= 0
##$TUNHOUT= 0
##$TUNXOUT= 0
##$USERA1= <user>
##$USERA2= <user>
##$USERA3= <user>
##$USERA4= <user>
##$USERA5= <user>
##$V9= 5
##$VALIST= <valist>
##$VCLIST= <CCCCCCCCCCCCCCC>
##$VD= 0
##$VDLIST= <DDDDDDDDDDDDDDD>
##$VPLIST= <PPPPPPPPPPPPPPP>
##$VTLIST= <TTTTTTTTTTTTTTT>
##$WBST= 1024
##$WBSW= 4
##$XGAIN= (0..3)
0 0 0 0
##$XL= 0
##$YL= 0
##$YMAX_a= 5988499
##$YMIN_a= -11511409
##$ZGOPTNS= <>
##$ZL1= 120
##$ZL2= 120
##$ZL3= 120
##$ZL4= 120
##$ABSF1= 14.96156
##$ABSF2= -5.596622
##$ABSG= 5
##$ABSL= 3
##$ALPHA= 0
##$AQORDER= 0
##$ASSFAC= 0
##$ASSFACI= 0
##$ASSFACX= 0
##$ASSWID= 0
##$AUNMP= <proc_prof1d_extract.lims>
##$AXLEFT= 0
##$AXNAME= <>
##$AXNUC= <1H>
##$AXRIGHT= 0
##$AXTYPE= 0
##$AXUNIT= <>
##$AZFE= 0.1
##$AZFW= 0.1
##$BCFW= 0
##$BC_mod= 0
##$BYTORDP= 0
##$COROFFS= 0
##$CY= 15
##$DATMOD= 1
##$DC= 0
##$DFILT= <>
##$DTYPP= 0
##$F1P= 0
##$F2P= 0
##$FCOR= 0.5
##$FTSIZE= 131072
##$FT_mod= 6
##$GAMMA= 0
##$GB= 0
##$INTBC= 1
##$INTSCL= 1
##$ISEN= 128
##$LB= 0.3
##$LEV0= 0
##$LPBIN= 0
##$MAXI= 10000
##$MC2= 0
##$MEAN= 0
##$ME_mod= 0
##$MI= 0
##$NCOEF= 0
##$NC_proc= -2
##$NLEV= 6
##$NOISF1= 0
##$NOISF2= 0
##$NSP= 0
##$NTH_PI= 0
##$NZP= 0
##$OFFSET= 14.96156
##$PC= 1
##$PHC0= -85.31433
##$PHC1= 0
##$PH_mod= 1
##$PKNL= yes
##$PPARMOD= 0
##$PPDIAG= 0
##$PPIPTYP= 0
##$PPMPNUM= 2147483647
##$PPRESOL= 1
##$PSCAL= 4
##$PSIGN= 0
##$PYNMP= <proc.py>
##$REVERSE= no
##$SF= 400.020009412236
##$SI= 131072
##$SIGF1= 0
##$SIGF2= 0
##$SINO= 400
##$SIOLD= 131072
##$SPECTYP= <>
##$SREGLST= <1H.CDCl3>
##$SSB= 0
##$STSI= 131072
##$STSR= 0
##$SW_p= 8223.68421052631
##$SYMM= 0
##$S_DEV= 0
##$TDeff= 65536
##$TDoff= 0
##$TI= <>
##$TILT= no
##$TM1= 0
##$TM2= 0
##$TOPLEV= 0
##$USERP1= <user>
##$USERP2= <user>
##$USERP3= <user>
##$USERP4= <user>
##$USERP5= <user>
##$WDW= 1
##$XDIM= 131072
##$YMAX_p= 419788022
##$YMIN_p= -17934
##$CURPLOT= <Network HP LaserJet P1505>
##$CURPRIN= <$Network HP LaserJet P1505>
##$DFORMAT= <normdp>
##$LAYOUT= <+/1D_H.xwp>
##$LFORMAT= <normlp>
##$PFORMAT= <normpl>
##$SURQMSG= 1
$$ End of Bruker specific parameters
$$ ---------------------------------
##NTUPLES= NMR SPECTRUM
##VAR_NAME=  FREQUENCY,     SPECTRUM/REAL,   SPECTRUM/IMAG
##SYMBOL=    X,             R,               I
##VAR_TYPE=  INDEPENDENT,   DEPENDENT,       DEPENDENT
##VAR_FORM=  AFFN,          ASDF,            ASDF
##VAR_DIM=   131072,        131072,          131072
##UNITS=     HZ,            ARBITRARY UNITS, ARBITRARY UNITS
##FACTOR=    0.0627417313425164, 1,          1
##FIRST=     8223.62146879497, 55,           -55452
##LAST=      0,             1690,            -55564
##MIN=       0,             -17934,          0
##MAX=       8223.62146879497, 419788022,    0
$$ Real data points
##PAGE= N=1
##DATA TABLE= (X++(R..R)), XYDATA
$$ [...]
65152 161331 163503 166831 170932 175476 180367 185493 190746 196325 202683 210100 218592 228223 239143 251173
65138 251173 263738 276369 288956 301264 312601 322440 331139 339537 347862 355480 361719 366450 369732
65125 369732 371322 370944 368834 365675 362012 357963 353419 348214 342006 334289 324817 314020 302761 291560
65111 291560 280188 268223 255947 244423 234503 225908 217509 208529 199343 191061 184492 179565 175634
65098 175634 172119 168812 165743 163002 160774 159311 158636 158316 157782 156966 156370 156402 156854 157228 157391 157603 157995
65081 157995 158331 158388 158328 158528 159101 159714 159963 159917 160167 161200 162781 164213 165208 166160 167416 168666 169373 169524
65063 169524 169558 169733 170009 170360 170785 171129 171322 171726 172722 174065 175180 176006 176882 177619 177563 176745 176025 175698 174878
65044 174878 172988 171023 170332 170680 170644 169647 168452 167592 166494 164499 161841 159077 156228 153064 149797 146902
65028 146902 144560 142711 141486 141119 141539 142422 143556 144901 146303 147355 147593 146800 145296 143923 143473 143991
65012 143991 144840 145586 146500 148007 149941 151702 152990 154109 155596 157797 160634 163611 166127 167959 169360
64997 169360 170581 171581 172362 173210 174239 175030 175220 175290 176217 178383 181332 184553 187950 191473 194854 197952
64981 197952 200935 203818 206173 207492 207509 206086 203244 199633 196418 194160 192149 189375 185910 182766 180609
64966 180609 179278 178480 178176 178112 177633 176341 174504 172549 170559 168558 166814 165459 164191 162823 161767
64951 161767 161427 161368 160725 159354 157943 156986 156257 155430 154592 153884 153204 152677 152973 154632 157186 159396 160339
64934 160339 160111 159565 159585 160439 161555 161996 161364 160115 158915 157903 156848 155774 154993 154645 154561 154586 154705 154840
64916 154840 154829 154636 154425 154446 155048 156636 159268 162392 165303 167829 170202 172401 174117 175445 177136 179955
64900 179955 184160 189644 196093 202861 209219 215074 221094 227748 234574 240713 245882 250464 254880 259182
64886 259182 262968 265437 265832 264220 261528 258426 254569 249497 243830 238793 234699 230787 226591 222585
64872 222585 219254 216370 213697 211703 210953 211193 211669 212048 212409 212548 212012 210766 209210 207401 204824 201198
64856 201198 197029 193046 189422 185928 182637 179997 178234 177042 175942 174739 173488 172246 171012 169837
64842 169837 168814 168001 167437 167212 167452 168208 169360 170602 171528 171863 171697 171463 171607 172265 173245 174215 174914 175415
64824 175415 176321 178481 182195 186724 190908 194325 197632 201734 206841 212463 218047 223461 228969 234881
64810 234881 241092 246924 251546 254633 256429 257141 256573 254474 250973 246456 241328 236133 231529 227752 224288
64795 224288 220558 216791 213761 211727 210149 208514 206941 205756 204881 203973 202946 202059 201597 201655 202138 202773
64779 202773 203206 203284 203302 203891 205600 208516 212183 215906 219288 222494 225967 229940 234373 239280 244835 251052
64763 251052 257583 263990 270145 276201 282215 287898 292833 296964 300776 304849 309215 313332 316686 319078
64749 319078 320217 319482 316477 311553 305270 297631 288461 278453 269073 261230 254672 248868 243852 239764
64735 239764 236151 232355 228389 225003 223023 222847 224274 226467 228373 229588 230622 232044 233719 235335
64721 235335 237287 240380 244800 249991 255435 260907 266034 270312 273719 276659 279103 280354 279940 278130
64707 278130 275224 270857 264576 256787 248639 241113 234625 229291 225034 221461 218091 214789 211763 209137
64693 209137 206817 204739 202964 201535 200479 199997 200344 201493 203189 205381 208305 212026 216226 220715 225870
64678 225870 232197 239477 246732 253159 258924 264834 271267 277592 282678 285872 287311 287331 285818 282434 277405
64663 277405 271703 266273 261339 256718 252599 249488 247375 245482 243155 240720 239027 238341 238152 238128 238686
64648 238686 240312 242694 245022 247039 249336 252592 256955 262334 268828 276491 284826 292961 300305 306735
64634 306735 312210 316627 320111 323046 325504 326948 326813 325224 322802 319893 316264 311517 305461 298132
64620 298132 289834 281281 273344 266504 260660 255514 250855 246494 242329 238649 235964 234240 232635 230406
64606 230406 227853 225978 225413 226090 227782 230396 233597 236658 238984 240656 242325 244667 247943 251910 256126
64591 256126 260414 264961 269857 274747 279300 283827 288983 294846 300721 305916 310301 313975 316826 318686
64577 318686 319685 320211 320640 321043 320876 319023 314643 308140 300920 294090 287809 281949 276625 271764 266864
64562 266864 261769 257156 253531 250206 246034 240984 236176 232438 229541 226875 224239 221810 219891 218815
64548 218815 218688 219113 219557 219977 220611 221290 221645 222016 223319 225722 228168 229607 230069 230071 229604 228381 226607
64531 226607 224730 222668 220027 217010 214457 212935 212304 212253 212738 213715 214897 216005 216990 217872 218588 219147
64515 219147 219698 220358 221163 222306 224106 226579 229275 231787 234305 237426 241490 246321 251610 257335 263659
64500 263659 270487 277189 282890 287033 289633 290940 290985 289626 287010 283724 280387 277244 274301 271626 269301
64485 269301 267163 264964 262898 261729 262111 263775 265532 266175 265398 263829 262231 260743 258897 256291 253119
64470 253119 250030 247587 245947 244998 244610 244716 245271 246251 247654 249449 251575 253936 256284 258034 258455 257299
64454 257299 255154 252945 251123 249608 248422 247900 248099 248450 248483 248689 250139 253148 256779 259847 262139 264366
64438 264366 267164 270566 274429 279018 284858 292084 300172 308420 316700 325752 336753 350602 367543
64425 367543 387450 410432 437095 468229 504361 545800 593118 647348 709547 780171 858899
64414 858899 944714 1035794 1129406 1222401 1312043 1396326 1473602 1542377 1601613 1650819 1689427
64403 1689427 1716159 1729333 1727780 1711430 1681202 1638576 1585072 1521752 1449171 1368020 1279842
64392 1279842 1187057 1092450 998836 908974 825224 749081 681094 621248 569232 524502 486437
64381 486437 454580 428474 407246 389594 374364 361023 349558 340048 332325 325804 319659 313322
64369 313322 306830 300469 294151 287445 280264 273181 266965 261972 258054 254746 251501 248058 244748 242203
64355 242203 240705 240072 240234 241461 243830 246867 250037 253286 256746 260191 263113 265166 266104 265615 263670
64340 263670 260921 258186 255516 252291 248378 244654 242074 240607 239501 238417 237769 237929 238528 238881 238969 239654
64324 239654 241843 245622 250266 254941 259230 263069 266421 269036 270497 270623 269902 269268 269175 269010 267740 265021
64308 265021 261293 256946 252021 246719 241523 236513 231230 225622 220549 216762 213884 211049 208227 206118
64294 206118 204949 204225 203684 203666 204294 205033 205477 206063 207582 210307 213979 218301 223000 227623 231715 235251
64278 235251 238643 242368 246725 251854 257699 263945 270081 275601 280164 283692 286294 287979 288469 287598 285932
64263 285932 284617 284348 284734 284945 284727 284430 284248 283929 283231 282128 280439 277638 273376 267970 262144 256453
64247 256453 251177 246554 242683 239234 235738 232320 229795 228704 228483 228002 226888 225915 226014 227247 228943
64232 228943 230549 232056 233745 235866 238567 241879 245638 249530 253291 256787 259925 262619 264876 266854
64218 266854 268821 271071 273853 277282 281311 285776 290434 295000 299318 303594 308235 313223 317802 321059
64204 321059 322838 323828 324727 325557 325832 325151 323479 321072 318349 315769 313595 311752 310015 308486 307909 309386
64188 309386 313483 319502 325833 331305 336056 340829 345486 348648 348877 345824 340025 332007 322065 310838
64174 310838 299549 289380 280643 272687 264627 256193 247945 240681 234715 229771 225513 221968 219322 217467
64160 217467 215970 214508 213195 212469 212720 214015 216065 218321 220201 221368 222011 222804 224406 226867 229626
64145 229626 232157 234419 236489 238041 238647 238529 238396 238384 237676 235619 232838 230680 229750 229583 229704 230346 231863
64128 231863 233987 236099 237968 239830 241958 244486 247483 250728 253533 255290 256323 257795 260609 264736
64114 264736 269717 275378 281754 288668 295839 303149 310376 316805 321672 325005 327582 330029 332388 334640
64100 334640 337084 339918 342926 345950 349355 353531 358081 361913 364100 364433 363268 361190 358734 356094
64086 356094 353047 349418 345557 342113 339308 336659 333456 329353 324526 319477 314694 310301 306015 301564
64072 301564 297083 292958 289403 286414 284010 282192 280653 278891 276737 274585 273039 272431 272681 273423 274272
64057 274272 275033 275666 276060 276023 275656 275399 275499 275810 276541 278758 283419 290026 296980 303284 309216 315300 321504
64040 321504 327784 334604 342314 350502 358518 366188 373494 379901 384674 387650 389240 389805 389501 388549 387187
64025 387187 385524 383864 382987 383538 385129 386479 386432 384551 380894 375760 369671 363157 356449 349654 343117
64010 343117 337173 331659 326243 321298 317768 315928 314800 313243 311219 309537 308587 307878 306822 305571 304843
63995 304843 305103 306175 307675 309618 312286 315538 318650 321111 323322 326129 329830 334087 338669 343713
63981 343713 349219 354916 360815 367351 374604 381876 388480 394673 401292 408651 416330 424029 432157 441473
63967 441473 452385 464665 477607 490511 503317 516840 532135 549491 568241 587629 607699
63956 607699 629263 653194 679946 709691 742850 780470 824066 874965 933812 1000914 1077100
63945 1077100 1164078 1263916 1378416 1509116 1657465 1824444 2009909 2212603 2430887 2663257
63935 2663257 2908008 3162658 3423941 3688268 3951909 4210487 4458304 4688477 4894206
63926 4894206 5070274 5213355 5320939 5390467 5420007 5409457 5360295 5273976 5151377 4994276
63916 4994276 4806774 4594572 4363181 4117443 3862345 3603204 3344797 3090933 2844919
63907 2844919 2609723 2387460 2179453 1987196 1812561 1656509 1518112 1395510 1287555
63898 1287555 1193964 1114182 1046744 989625 940633 897573 858774 823679 792433 764704 739238
63887 739238 714782 691090 668789 648433 629889 612558 596057 580635 566865 554906 544285
63876 544285 534615 526324 520284 516762 515161 514888 516113 519475 525330 533537 543835 556111 570248 585984
63862 585984 603159 622161 643860 668820 696606 726194 757035 789332 823174 857960 893006
63851 893006 928116 962980 996451 1027217 1054980 1080171 1102534 1120882 1134406 1143348 1148002 1147772
63839 1147772 1141819 1130194 1113758 1093318 1069291 1041939 1011357 977420 940253 900777 860453
63828 860453 820487 781501 743853 707904 673956 642112 612253 584036 557069 531294 507116
63817 507116 485004 465038 446975 430562 415624 402018 389727 378874 369413 360922 352847 344871
63805 344871 336984 329502 323176 318802 316223 313953 310411 305481 300370 295987 292074 288039 283967 280335
63791 280335 277160 273972 270523 267049 263816 260752 257677 254646 251882 249507 247528 246077 245420 245542 245833
63776 245833 245485 244339 243180 242999 243975 245324 246089 245909 244998 243682 242158 240614 239278 238212 237220 236150
63760 236150 235296 235236 236120 237267 237717 237174 236173 235321 234661 233927 233181 232868 233271 234097 234697 234633 234024 233362 233064
63741 233064 233256 234021 235599 238067 240892 243215 244727 245941 247418 249054 250443 251645 253158 255237 257647
63726 257647 260146 262832 265907 269379 273111 276983 280901 284777 288561 292138 295189 297361 298657 299503
63712 299503 300321 301179 301858 302044 301316 299275 296025 292514 290014 289110 289289 289639 289817 290158 290958 291969 292763
63695 292763 293428 294582 296678 299464 302264 304642 306648 308488 310139 311384 312100 312431 312673 313045 313559 314054
63679 314054 314318 314249 314001 313914 314139 314322 313906 312881 312022 312180 313481 315449 317697 320110 322465 324417 325968
63662 325968 327519 329167 330266 330003 328200 325388 322251 319198 316223 312959 309079 304907 301412 299334
63648 299334 298395 297643 296407 294686 292734 290711 288815 287434 286959 287446 288548 289826 291197 293013 295539
63633 295539 298457 301222 303955 307508 312422 318207 323977 329501 335276 341857 349529 358381 368283 378902
63619 378902 390153 402513 416567 432380 449650 468304 488537 510497 534328 560245 588031
63608 588031 616642 644918 672513 699470 724987 747402 765445 778819 787421 790914 789473 784288
63596 784288 776798 767818 757772 747244 736804 726518 716008 704753 692095 677334 660252 641382
63584 641382 621559 601473 581818 563411 546723 531533 517345 503965 491534 480342 470936 464054
63572 464054 460034 458497 458849 460836 464381 469181 474731 480494 485896 490621 495163 500512 506940 513677
63558 513677 520269 527643 537114 548914 562521 577937 595632 615478 636939 660367 687000 717371
63546 717371 750479 784679 818493 850184 877489 898540 912608 919504 918880 910827 896912 879904
63534 879904 862382 845800 830607 816728 803871 791607 779293 766040 751067 734202 715767
63523 715767 695879 674160 650350 624956 599053 573669 549494 526914 506076 487031 469933
63512 469933 454946 441892 430253 419600 409792 400803 392738 386003 380870 376735 372415 367490 362747
63499 362747 358927 355679 352317 348972 346209 343925 341525 339032 337138 336122 335464 334689 333987 333840 334465
63484 334465 335714 337141 338228 339025 340400 343059 346425 349286 351492 354093 357606 361168 363858 365905
63470 365905 367898 369525 370017 369351 368179 366802 364923 362227 358558 353782 348246 343194 339914 338393 337502
63455 337502 336546 335880 335935 336474 337227 338590 341169 344995 349622 354745 360356 366550 373502 381505 390835 401730
63439 401730 414568 429672 446777 465144 484578 505877 529766 555609 581721 606681 629729
63428 629729 649991 666304 678305 687275 695376 704134 713979 725045 737969 753785 773295 796687
63416 796687 823525 852798 882965 912215 938888 961689 979513 991374 996711 995740 989338 978746
63404 978746 965590 951825 938911 926760 913908 899067 882209 863906 844050 821780 796546
63393 796546 768801 739663 710310 681691 654465 629050 605825 585163 567035 550805 535849
63382 535849 522381 511232 502736 496201 490725 486208 483346 482808 484604 488141 492747 498223 504957 513403
63368 513403 523526 534957 547658 562052 578424 596510 615971 637051 660394 686213 713891
63357 713891 742522 771782 802105 833784 865831 895940 921847 942602 958226 968417 972312 969745
63345 969745 962151 951677 939645 926251 911563 896190 880844 865600 849819 832712 813801 792895
63333 792895 769853 744649 717787 690454 664009 639350 616934 597157 580260 565872 553237
63322 553237 542177 533494 528075 525760 525189 524485 521949 516492 507834 496272 482187 466066 449025
63309 449025 432759 418511 406333 395646 386182 378005 371002 364951 359909 355996 352952 350371 348195
63296 348195 346427 344519 341696 337880 333706 329620 325600 321818 318821 316765 315100 313415 312090 311671
63282 311671 311961 312227 312032 311435 310613 309769 309303 309591 310459 311156 311049 310226 309345 308935 308919 308843 308532 308376 308854
63263 308854 309949 311218 312344 313362 314394 315432 316416 317279 317986 318740 320008 321925 323800 324805 325157
63248 325157 325946 327623 329407 330628 331927 334369 337782 340849 342824 344375 346618 349933 354002 358592
63234 358592 363838 369891 376611 383704 391056 398861 407360 416546 426221 436266 446580 456797 466512
63221 466512 475895 485674 496145 506600 516114 524651 532882 541206 549556 558039 566970 576106 584479 591388
63207 591388 597137 602394 607123 610546 612032 611589 609495 605853 600679 594256 587132 579775 572334 564818
63193 564818 557421 550537 544513 539617 536285 535141 536512 540028 544977 551035 558487 567726 578728 591107
63179 591107 604531 618979 634553 651064 667890 684415 700616 716970 733681 750237 765907
63168 765907 780449 794128 807231 819792 831504 841648 849384 854548 857855 859829 859703 856026 848238
63155 848238 836966 822800 805590 785318 762928 739803 716823 694348 672669 652007 632326
63144 632326 613651 596409 581085 567718 556048 545969 537461 530294 524143 518856 514283 510089 506154
63131 506154 502930 500955 500196 500333 501463 503861 507130 510352 513230 516444 520631 525626 530984 536642 542583
63116 542583 548351 553467 558040 562457 566716 570651 574589 579096 584059 588732 592827 596948 601549 605968
63102 605968 609093 610769 611979 613625 615638 617438 618888 620431 622485 625078 628108 631646 635786 640308
63088 640308 644743 648797 652562 656214 659575 662122 663432 663544 662820 661534 659668 657053 653569 649196 644048
63073 644048 638523 633361 629302 626527 624496 622438 619971 617231 614580 612434 611318 611804 614160 618134
63059 618134 623232 629191 636121 644281 653895 665162 678287 693372 710259 728510 747584 767183
63047 767183 787521 809097 832007 855529 878688 901287 924036 947522 971362 994662 1016997
63036 1016997 1038443 1058853 1077816 1095531 1113093 1131359 1149806 1166980 1181885 1194482 1204934
63025 1204934 1213001 1218297 1220621 1219734 1215177 1206622 1194168 1178063 1158488 1136028 1112036 1087936 1064110
63012 1064110 1039989 1015378 991310 969421 950846 935974 924919 917747 914364 914552 918217 925389
63000 925389 936059 950175 967696 988322 1011245 1035544 1060921 1087698 1115909 1144801 1173525
62989 1173525 1202067 1231030 1260623 1290233 1319027 1346623 1373033 1398187 1421614 1442466 1459771
62978 1459771 1472800 1481209 1484739 1482832 1474765 1460164 1439196 1412339 1380283 1344084 1304984 1263878
62966 1263878 1221230 1177663 1134280 1092127 1051661 1013011 976466 942289 910295 880034 851287
62955 851287 824016 798048 773234 749746 727741 706846 686600 667256 649486 633194 617406
62944 617406 601594 586479 573099 561637 551574 542474 534051 525852 517564 509514 502329 496171 490704
62931 490704 485650 480956 476570 472552 469310 467171 465748 464261 462564 461277 460745 460426 459650 458574 457888
62916 457888 457815 457810 457270 456187 455002 453988 452994 451773 450387 449096 447907 446559 445062 443899 443437 443448 443621
62899 443621 444322 446274 449522 453266 456785 460024 463168 466204 469197 472501 476321 480337 484093 487489
62885 487489 490644 493597 496430 499325 502111 504061 504615 504124 503394 502608 501234 498955 496125 493118 489631
62870 489631 484967 478834 471757 464726 458538 453272 448344 443133 437608 432290 427704 424012 421086 418719
62856 418719 416737 415050 413654 412581 411936 411983 412971 414673 416322 417244 417340 416733 415285 412941 410334 408372
62840 408372 407183 406034 404369 402416 400613 399059 397819 397210 397308 397559 397317 396520 395449 394229 393030 392402
62824 392402 392769 393791 394878 396129 398054 400402 402162 402921 403418 404324 405227 405504 405633 406763 409172 412008
62808 412008 414549 416948 419448 421575 422603 422541 422211 422527 423938 426384 429445 432620 435712 438893 442240
62793 442240 445420 448239 451323 455718 461719 468522 475305 482315 490585 500808 512858 526304 541079
62780 541079 557535 576105 597004 620145 645249 672000 700093 729137 758656 788281 817874
62769 817874 847339 876402 904596 931276 955453 975863 991591 1002691 1009862 1013403 1012620 1006369
62757 1006369 994028 976003 953527 928030 900468 871074 839886 807482 774963 743194 712406
62746 712406 682768 654981 629888 607641 587681 569476 552856 537523 522768 508069 493852
62735 493852 481282 471233 463587 457516 452210 447321 442970 439548 437370 436274 435632 434952 434484 434950 436622
62720 436622 439039 441708 444748 448417 452390 456026 459348 463226 468486 475261 483362 492885 504119 517156
62706 517156 531845 547966 565304 583835 604053 626842 652705 681319 712066 744789 779771
62695 779771 817319 857768 901643 949214 999874 1052363 1105593 1158961 1211911 1263543 1312578
62684 1312578 1357250 1395380 1425122 1445806 1457625 1460499 1453848 1437583 1412683 1380444 1341719 1297289
62672 1297289 1248436 1196611 1142871 1088177 1033955 981730 932311 885817 842318 801955 764588
62661 764588 729941 698098 669322 643406 619801 598380 579439 562764 547379 532595 518760
62650 518760 506537 495873 486185 477163 468841 461116 453778 446930 440884 435722 431390 428090 425942 424314
62636 424314 422193 419464 417201 416263 416051 415108 412692 409297 405871 403043 400980 399508 398237 396906 395733
62621 395733 395146 395157 395276 395087 394604 394005 393393 392966 393053 393653 394224 394290 394123 394406 395255 395991 396067 395917 396690 399171
62601 399171 403114 407619 412087 416769 422341 429046 436458 444154 452356 461693 472507 484726 498292
62588 498292 513274 529408 545912 561965 577203 591641 605280 617877 628864 637331 642405 643926
62576 643926 642579 639166 633896 626556 617120 605819 592882 578678 564027 549869 536473 523410
62564 523410 510367 497657 485741 474708 464505 455380 447733 441664 436890 432957 429303 425371 421070
62551 421070 417001 413830 411422 408996 406174 403540 401966 401677 402163 402848 403571 404468 405560 406550 406994 406724
62535 406724 406061 405492 405162 404830 404373 404124 404590 405952 408015 410526 413439 416920 421234 426653 433391 441595
62519 441595 451351 462615 475211 489064 504449 521811 541249 562461 585253 609806 636194 664014
62507 664014 692879 723067 755130 788854 823075 856542 888484 918163 944449 966360 983816
62496 983816 997470 1007862 1015054 1019089 1020547 1020548 1020326 1020844 1022728 1026498 1032709 1041670 1053115 1066429
62482 1066429 1081301 1097804 1115603 1133344 1149150 1161526 1169511 1172294 1169256 1160449 1146419 1127307
62470 1127307 1102482 1071358 1034444 993323 949767 905060 860084 815669 772681 731856 693717
62459 693717 658714 627279 599582 575282 553832 535214 520101 508945 501022 494776 489139 484210
62447 484210 480619 478640 478175 479251 482041 486360 491428 496348 500812 505281 510346 515884 520970 524750
62433 524750 527179 528673 529212 528314 525895 522551 518679 513788 507177 499035 490406 482203 474664 467687 461154
62418 461154 454828 448375 441738 435283 429402 424153 419416 415255 411915 409531 407901 406552 405002 403102
62404 403102 401182 399788 399243 399458 400125 400920 401603 402208 403236 405368 408743 412628 416020 418563 420682 422951
62388 422951 425592 428656 432308 436706 441678 446825 451976 457387 463427 470190 477437 484862 492341 499982
62374 499982 507964 516310 524820 533335 542064 551511 562029 573583 586071 599724 615044 632485 652340
62361 652340 674837 700208 728780 761171 798106 839701 884994 932564 981465 1031183 1080779
62350 1080779 1128654 1173221 1213237 1247327 1273932 1292269 1302964 1307238 1305736 1298505 1285765 1268116
62338 1268116 1246176 1220580 1192264 1162230 1131036 1098928 1066438 1034389 1003332 973427 944939
62327 944939 918364 893920 871279 849952 829600 809867 790300 770689 751262 732380 714250
62316 714250 696941 680382 664237 648070 631828 615999 601251 588156 577215 568660 561996 556163
62304 556163 550431 544956 540223 536320 533006 530286 528534 528123 529088 530980 532935 534133 534449 534497 534925 535877
62288 535877 537269 539139 541347 543267 544329 544767 545395 546607 547938 548690 548782 548875 549763 551614 553826 555802
62272 555802 557928 561414 566994 574171 582112 590914 601437 614140 628780 645279 664297 686703 712918
62259 712918 742967 776899 814950 857442 904540 955841 1010198 1066236 1123017 1179841 1235388
62248 1235388 1287510 1334103 1373903 1406382 1431260 1448384 1457784 1459555 1453825 1440934 1421377 1395418
62236 1395418 1363127 1325066 1282706 1237795 1191417 1143942 1095821 1048138 1002326 959472 919900
62225 919900 883368 849702 819165 792109 768352 747218 728152 710902 695083 680147 666128
62214 666128 653859 643882 635439 627179 618707 610833 604363 599308 595358 592431 590366 588607 586713 584964
62200 584964 584046 584254 585411 587475 590782 595577 601640 608552 616115 624217 632443 640192 647346 654587 662774
62185 662774 672101 682091 692380 703090 714277 725356 735477 744361 752436 760142 767444 774147 780444
62172 780444 786973 794449 803423 814365 827874 844752 865763 891204 920670 953292 988199 1024676
62160 1024676 1061932 1098828 1133815 1165135 1191264 1211439 1225714 1234298 1236958 1233393 1224166 1210722
62148 1210722 1194228 1174680 1151453 1124540 1094954 1064119 1033198 1002933 973733 945834 919605
62137 919605 895746 874979 857420 842399 829008 816775 805787 796300 788295 781355 774923 768682
62125 768682 762719 757310 752597 748485 744764 741284 738123 735686 734603 735356 738013 742334 748050 755000
62111 755000 763186 772815 784113 796890 810465 824266 838186 851892 863954 872385 876380 877165 876864
62098 876864 876848 877360 878191 879047 879357 878251 875003 869343 861439 851845 841500 831494 822685 815574 810459
62083 810459 807516 806694 807676 810019 813400 817891 824106 832825 844204 857464 871656 886660 903131
62070 903131 921537 941610 962733 984419 1006342 1028353 1050744 1074128 1098698 1123744 1148145
62059 1148145 1171099 1192092 1210361 1224763 1234267 1238343 1236967 1230546 1219841 1205715 1188735 1169021
62047 1169021 1146464 1120997 1092761 1062178 1029893 996595 962888 929349 896549 864870 834398
62036 834398 805197 777637 752220 729042 707558 686987 666999 648133 631570 618292 608192
62025 608192 600089 592746 585791 579493 573911 568714 563781 559461 555982 552977 549903 546752 544090 542402
62011 542402 541532 540773 539514 537871 536716 536921 538569 541051 543823 546771 549843 552834 555781 559175 563279
61996 563279 567439 570467 571715 571439 570192 568233 565549 562098 557836 552687 546602 539578 531652 523049
61982 523049 514250 505693 497427 489304 481480 474395 468206 462591 457273 452386 448122 444329 440771 437628
61968 437628 435418 434503 434811 435941 437323 438456 439260 440136 441449 443082 444765 446649 449146 452226 455365
61953 455365 458324 461561 465569 470120 474492 478289 481735 485206 488805 492526 496688 502076 509558 519485
61939 519485 531444 544697 558841 573904 589807 606059 622125 637835 653189 668009 682155
61928 682155 695852 709321 722003 732652 740417 745535 748727 750191 749493 746315 740971 734254 727076
61915 727076 720309 714682 710609 708193 707500 708822 712616 719227 728673 740585 754277 768846 783341
61902 783341 797000 809454 820640 830363 837826 841738 841156 836347 828749 819934 810578 800416 789116
61889 789116 776995 764807 753036 741632 730443 719560 709105 698920 688831 679092 670191 662107
61877 662107 654121 645520 636292 626976 618163 610374 604093 599388 595551 591623 587428 583766 581468 580696
61863 580696 581369 583816 588485 595154 602987 611395 620471 630491 641482 653569 667412 683858 703268
61850 703268 725447 750081 776818 804896 833199 860996 888375 915595 942094 966489 987567
61839 987567 1005006 1018983 1029317 1035306 1036377 1032673 1024925 1014037 1001100 987754 976052 967570
61827 967570 962660 960804 961616 965184 971421 979544 988497 997586 1006261 1013395 1017315 1016798 1011774 1002847 990310
61812 990310 973876 953381 929506 903666 877092 850113 822471 794418 767289 742751 721508
61801 721508 702998 686312 671089 657428 645306 634429 624577 615858 608564 602905 598868 596224 594587
61788 594587 593484 592436 591132 589597 588088 586657 584971 582762 580320 578153 576215 573994 571503 569614
61774 569614 569007 569202 569191 568825 568956 570186 572036 573593 574566 575419 576656 578332 580250 582383 584968 588233
61758 588233 592098 596184 600073 603497 606378 608772 610760 612279 613124 613218 612722 611598 609240 605103 599712
61743 599712 594429 589926 585520 580474 575315 571162 568188 565662 563328 561730 561053 560566 559590 558353 557367
61728 557367 556615 555868 555417 555857 557303 559323 561505 563704 565749 567349 568409 569232 570345 572176 574812
61713 574812 577945 581052 583675 585495 586239 585787 584405 582629 580833 579085 577410 575814 574011 571566 568544
61698 568544 565614 563233 561053 558425 555102 551112 546343 540921 535728 531836 529303 526998 523805 519689
61684 519689 515520 512110 509551 507263 504604 501507 498481 495906 493509 490732 487457 484056 480897 478108
61670 478108 475676 473391 470865 468095 465900 465143 465511 465647 464758 463454 462731 462679 462723 462703 463047 464002 465267
61653 465267 466432 467440 468569 470169 472418 475038 477313 478727 479611 480885 483097 485975 488954 491840
61639 491840 494748 497660 500280 502245 503236 502975 501366 498668 495365 491820 488139 484370 480657 477129 473783
61624 473783 470578 467558 464753 462016 459138 456136 453288 450853 448771 446706 444345 441710 439147 436980
61610 436980 435132 433182 430820 428041 424806 420805 415879 410516 405517 401227 397435 393976 390887 387926
61596 387926 384605 380964 377746 375315 372945 369812 366310 363610 362075 360926 359492 357936 356510 354853
61582 354853 352572 350050 348142 347313 347521 348654 350605 352939 354941 356128 356501 356317 355793 355051 354182 353280
61566 353280 352483 351927 351651 351591 351737 352187 352951 353846 354686 355446 356130 356632 356916 357228 357914 359046 360386 361698
61548 361698 362956 364265 365705 367243 368704 369854 370602 371104 371598 372223 373090 374421 376368 378749 381158
61533 381158 383392 385600 387969 390436 392801 395008 397131 399091 400480 400770 399781 397987 396187 394713 393000
61518 393000 390201 386269 382185 378971 376757 375067 373760 373198 373510 374208 374749 375101 375446 375604 375194 374221
61502 374221 373159 372457 372321 372873 374117 375714 377231 378703 380473 382340 383425 383271 382607 382559 383425 384718
61486 384718 386080 387511 388884 389971 390975 392380 394147 395659 396633 397502 398580 399431 399475 398781 397771 396536
61470 396536 395017 393643 393156 393739 394780 395551 395806 395721 395620 395892 396830 398271 399528 399868 399104 397719 396511
61453 396511 396162 396917 398554 400603 402726 404908 407310 409924 412428 414500 416270 418248 420685 423201 425377
61438 425377 427585 430732 435070 439703 443541 446444 449130 452228 455779 459483 462999 466049 468585 470872
61424 470872 473140 475189 476621 477462 478222 479222 480172 480534 480160 479451 479013 479231 480044 480996 481556 481419 480492
61407 480492 478706 476052 472790 469448 466495 464082 462065 460162 458120 455931 453895 452308 451070 449771
61393 449771 448240 446766 445693 444984 444378 443806 443456 443475 443796 444243 444665 444947 445085 445352 446300 448438 451787
61376 451787 455743 459405 462128 463927 465445 467502 470496 474128 477761 481072 484253 487537 490779 493691
61362 493691 496296 498762 500869 502202 503040 504541 507602 511820 516038 519783 523727 528761 535028 541987
61348 541987 549075 556208 563860 572736 583131 594462 605556 615406 623527 629680 633692 635678 636184 635890
61334 635890 635269 634617 634127 633741 633071 631707 629604 627088 624586 622352 620306 618082 615394 612383 609437
61319 609437 606667 603925 601409 599788 599383 599550 599353 598679 598243 598618 599811 601810 604986 609690 615859 623340
61303 623340 632287 642889 654875 667614 680508 692932 703944 712561 718397 721671 722464 720432 715507
61290 715507 708562 700965 693542 686284 679002 671939 665659 660582 656698 653606 650757 647856 645142 643177
61276 643177 642323 642505 643483 645166 647586 650777 654794 659725 665545 672026 678837 685593 691815 697142 701769
61261 701769 706486 712087 718848 726731 735767 745918 756734 767543 777939 787709 796303 802741 806135
61248 806135 806077 802588 796072 787431 777821 768008 758200 748614 739802 732087 724997 717820 710703 704703 700615
61233 700615 698083 696131 694273 692776 691985 691854 692298 693590 696078 699629 703693 707912 712390 717300 722488
61218 722488 727570 732215 736220 739602 742699 745874 748925 751153 752365 753444 755446 758328 761133 763294
61204 763294 765125 767019 768874 770586 772589 775527 779737 785322 792440 801199 811601 823817 838131
61191 838131 854233 870965 887282 903228 919402 935561 950275 962038 970285 975272 977491 977400 975421
61178 975421 971854 966899 960808 953860 946102 937366 927669 917319 906475 894814 881915 867824 852974
61165 852974 837668 821974 806116 790603 775762 761459 747475 734008 721521 710252 700228
61154 700228 691729 685311 681204 678933 677774 677403 677945 679556 682180 685550 689196 692603 695555 698137 700107
61139 700107 700558 698650 694591 689419 683919 678256 672674 667873 664473 662651 662621 664918 669766 676542 684408
61124 684408 693236 703498 715444 728940 743983 760839 779526 799531 820203 841285 862913 885199
61112 885199 907823 930046 951216 971216 990239 1008166 1024537 1039178 1052329 1063854 1072873 1078701
61100 1078701 1081759 1082947 1082340 1079162 1072889 1063686 1051737 1036826 1018800 997986 974995 950526 925491
61087 925491 900850 877119 854324 832549 812184 793524 776529 761090 747141 734464 722876
61076 722876 712760 704900 699472 695692 692725 690478 689134 688444 688059 688160 689101 690659 692272 693953 696415
61061 696415 700235 705363 711436 718123 725134 732420 740484 750042 761151 773048 785128 797770 811926
61048 811926 828137 846271 866004 887111 909300 932258 956068 981269 1008161 1036167 1064275
61037 1064275 1092076 1119986 1148343 1176764 1204789 1232762 1261385 1290501 1319070 1346592 1373893
61026 1373893 1402106 1431492 1461852 1493655 1527921 1565091 1604805 1646957 1692233 1741285 1793855
61015 1793855 1849176 1906985 1967881 2032988 2103768 2182151 2270483 2371168 2486251 2617272 2765525
61004 2765525 2932707 3121576 3336296 3582836 3870080 4211076 4622797 5124234 5734919
60995 5734919 6475428 7368474 8438194 9708119 11200455 12937168 14939249 17219227
60987 17219227 19764125 22510831 25323933 27995200 30282321 31983066 33010885 33428172
60979 33428172 33418236 33215111 33026845 32975323 33059175 33146697 33011828 32413695 31190502 29321105
60969 29321105 26924809 24208319 21395687 18674736 16172741 13956223 12043934 10423994
60961 10423994 9069108 7946578 7023157 6267182 5649970 5146533 4735185 4396868 4115287
60952 4115287 3877506 3673747 3496325 3338860 3196323 3065246 2943442 2829529 2722526
60943 2722526 2621446 2525014 2431956 2341499 2253108 2165676 2077628 1988213 1898283 1809412 1722685
60932 1722685 1638777 1558690 1483506 1413493 1348226 1287640 1232265 1182205 1136562 1094328 1055439
60921 1055439 1020484 989583 961965 936613 913088 891728 873195 857777 845057 834214 824603
60910 824603 815928 808004 800684 793999 788114 783084 778878 775608 773309 771468 769159 765852 761786 757392
60896 757392 752765 747870 742814 737522 731531 724604 717286 710313 703673 696806 689669 682944 677010 671289
60882 671289 664967 658056 651381 645629 640676 635746 629994 623002 614960 606492 598131 589838 581065 571485
60868 571485 561653 552738 545370 538905 532129 524690 517542 511935 508293 506209 505078 504395 503788 503231 503091
60853 503091 503531 503977 503629 502499 501451 501111 501157 500882 500109 499377 499396 500559 502779 505588 508432 510899 512591
60836 512591 512966 511655 509020 506089 503736 502136 501097 500620 500870 501780 502992 504236 505683 507902 511302
60821 511302 515425 518931 520707 521075 521429 522552 523731 523773 522403 520194 517542 514398 510902 507611 504915
60806 504915 502603 500190 497370 494003 489923 484994 479307 473241 467311 461908 457079 452577 448178 443881
60792 443881 439739 435653 431461 427137 422778 418574 414845 411821 409216 406341 402949 399685 397333 395838
60778 395838 394527 393057 391660 390632 390177 390618 392140 394283 396316 398181 400426 403179 405934 408583 411830
60763 411830 416172 421155 426128 431118 436391 441745 446898 452058 457343 462074 465478 467808 469855 471579
60749 471579 472227 471785 471251 471224 471119 470168 468425 466313 463805 460587 456483 451254 444477 436258 427734 420239
60733 420239 414066 408481 402769 396816 390851 385123 379833 375078 370931 367769 366177 366150 366685 366631 365766 364514
60717 364514 362965 360914 358774 357493 357303 357335 356810 356017 355663 355881 356378 357050 357856 358499 358931 359880 362157
60700 362157 365553 369150 372595 376300 380289 383817 386501 389100 392563 396803 401066 405168 409657 414927
60686 414927 420827 427148 433864 440707 447067 452633 457796 463151 468849 474664 480407 485975 491135 495625
60672 495625 499351 502259 504088 504542 503636 501583 498383 493888 488292 482171 475822 468891 460995 452547 444643
60657 444643 438195 433445 430233 428311 427240 426402 425494 424848 424908 425426 425579 424995 424358 424697 426210 428018 429007
60640 429007 428696 427295 425231 422787 420093 417263 414469 411900 409673 407833 406481 405827 406002 406851 408054
60625 408054 409454 411086 412852 414424 415596 416552 417571 418591 419323 419737 420139 420740 421345 421611 421450 421102
60609 421102 420900 421047 421463 421761 421544 420888 420433 420756 421668 422334 422136 421201 420030 418886 417845 417303 417999 420294
60591 420294 423589 426740 429111 431062 433305 435959 438493 440547 442499 444980 447947 450553 452050 452568
60577 452568 452834 453324 454032 455011 456730 459654 463702 468406 473560 479458 486538 495070 505317 517648 532183
60562 532183 548406 565501 583146 601667 621154 640647 658588 674000 686760 696588 702380 703133
60550 703133 699299 692645 684729 676106 667100 658613 651641 646430 642741 640757 641170 644416 650431 659285
60536 659285 671615 688230 709499 735214 764742 797307 832391 869891 909487 949699 987839
60525 987839 1021005 1046945 1064206 1072249 1071787 1064454 1051619 1033818 1011765 987466 963602 941828
60513 941828 922100 903652 886136 869842 855420 843629 835063 829802 827503 827910 831084 837048 845501
60500 845501 856236 869880 888042 912480 943988 982120 1026150 1076229 1133319 1197971 1269507
60489 1269507 1346480 1427375 1510414 1593056 1672394 1746024 1812139 1868984 1914959 1949425 1972840
60478 1972840 1985779 1988043 1978798 1957130 1922298 1873902 1812331 1739049 1656336 1566888 1473672 1379819
60466 1379819 1288259 1201375 1120921 1047987 982921 925455 875044 831074 792852 759721 731172
60455 731172 706624 685156 665862 648434 632946 619052 606033 593845 583463 575698 570077 565358
60443 565358 560757 556228 551892 547788 544033 540604 537137 533509 530535 529360 529972 530811 530189 527820 524787
60428 524787 522361 521091 520762 520786 520579 519782 518349 516552 514852 513571 512482 510879 508262 504989 502044
60413 502044 500171 499385 499314 499750 500692 501956 503025 503419 503226 503110 503625 504603 505402 505721 505867 506205 506713 507256
60395 507256 507904 508727 509597 510523 511936 514206 517084 519967 522555 524894 527009 528936 530921 533050 534805
60380 534805 535618 535802 536303 537472 538741 539698 540748 542346 544170 545537 546266 546623 546746 546640 546589 547052 548110
60363 548110 549322 550161 550470 550609 551281 553024 555658 558360 560491 562245 564340 567283 571068 575327 579546
60348 579546 583377 587008 590985 595396 599570 602970 606037 609552 613320 616190 617435 617443 616840 615501 612869
60333 612869 608912 604315 599874 596019 592850 590334 588414 587064 586287 586053 586304 586952 587757 588207 587782 586413
60317 586413 584495 582414 580340 578557 577612 577833 578932 580478 582660 586244 591771 599090 607731 617523 628761
60302 628761 641947 657419 675141 694820 716150 738759 761721 783344 801820 816059 825630 829979
60290 829979 828245 820027 806029 787782 767034 745486 724541 704794 686001 668043 651769 638390
60278 638390 628105 619790 612121 604597 597441 591020 585580 581154 577402 573847 570504 567998 566690 565949
60264 565949 564764 563067 561984 562671 565102 568069 570188 570863 570518 570109 570400 571549 573291 575327 577430
60249 577430 579322 580706 581491 581849 581964 581789 581096 579698 577621 575099 572452 569898 567436 564939 562406
60234 562406 560214 559048 559407 561083 563257 565324 567476 570189 573279 575978 578010 580044 582785 586093
60220 586093 589453 592909 596898 601386 605856 610169 614776 619934 625319 630705 636504 643206 650559 657730
60206 657730 664164 670007 675744 681687 687733 693483 698549 702813 706276 708739 709841 709510 708108 705958
60192 705958 702957 698861 693841 688547 683651 679349 675150 670105 663624 656271 649493 644289 640314 636524
60178 636524 632453 628488 625114 622407 620249 618556 617115 615641 614225 613427 613584 614154 614166 613304 612258 611819
60162 611819 611860 611566 610573 609499 609156 609540 609916 609746 609123 608428 608045 608430 609967 612537 615626 619067 623188
60145 623188 627946 632483 636110 639321 643121 647619 652061 656206 660774 666302 672299 677919 682925 687526
60131 687526 691805 695867 700226 705372 711016 716267 720625 724417 728195 732087 735926 739779 744073 749157
60117 749157 754780 760098 764335 767481 770231 773162 776166 778825 781048 783013 784602 785264 784542 782556 779918
60102 779918 777317 775117 773144 770843 767838 764331 760803 757310 753345 748442 742755 736986 731926 728060
60088 728060 725353 723329 721606 720420 720343 721365 722556 722940 722481 721894 721650 721457 720650 718741 715576 711211
60072 711211 705704 698906 690518 680573 669810 659312 649766 641279 633846 627589 622425 617812 613110 608135
60058 608135 603259 599057 595878 593590 591700 589889 588385 587602 587425 587278 586980 587145 588387 590470 592596
60043 592596 594365 596078 598206 600897 603962 606970 609329 610541 610510 609489 607774 605560 602994 600139 596937
60028 596937 593341 589432 585237 580613 575520 570253 565081 559836 554290 548836 544263 540827 537909 534797
60014 534797 531376 527927 524630 521527 518620 515756 512617 509093 505491 502182 499216 496416 493716 491241
60000 491241 489232 487984 487647 487951 488356 488635 489075 489981 491263 492734 494549 497031 500266 504083 508217 512278
59984 512278 515798 518632 521104 523457 525406 526580 527142 527477 527474 526691 525206 523664 522351 520759 518352 515447
59968 515447 513002 511684 511307 511061 510225 508853 507816 508014 509514 511688 514112 516924 520220 523545 526267
59953 526267 528147 529221 529454 528883 527982 527449 527595 528212 529021 529935 530825 531299 531006 530150 529597 530268 532240 534469
59935 534469 535660 535505 534861 534594 534704 534956 535940 538638 542950 547486 551231 554743 559141 564484 570019 575713
59919 575713 582507 590871 600009 608885 617395 625985 634691 643181 651342 659066 665636 670140 672588 673988
59905 673988 675163 675997 676033 675246 673910 672120 669804 666956 663616 659870 656171 653320 651814 651294 650974 650466
59889 650466 649991 649957 650600 651940 653834 656075 658615 661626 665244 669365 673811 678513 683456 688616 694012
59874 694012 699555 704730 708821 711693 713983 716238 718181 719181 719102 718230 716740 714785 712866 711429 710134
59859 710134 708107 704947 700980 696608 692027 687651 684113 681538 679337 677036 674947 673734 673691 674728 676749
59844 676749 679687 683325 687429 692010 697355 703888 712029 721948 733284 745220 756799 767074 775133
59831 775133 780491 783602 785610 787378 789016 790349 791385 792015 791598 789172 783963 775674 764705 752286
59817 752286 739983 728718 718516 709361 701769 696061 691506 686840 681577 676254 671466 667234 663431
59804 663431 660245 657881 656084 654304 652257 650095 648026 645982 643777 641452 639221 637040 634514 631450
59790 631450 628261 625479 623049 620534 617888 615451 613151 610415 607146 604080 601685 599308 596062 592168
59776 592168 588757 586516 585205 584392 583957 583852 583975 584480 585771 588006 590907 594185 597845 601981 606515
59761 606515 611159 615489 619207 622584 626430 631175 636244 640867 645277 650258 655571 659862 662472 664389
59747 664389 666775 669333 670972 671548 671937 672648 673336 673699 673964 674181 673820 672462 670425 668290 666195 664015
59731 664015 661942 660428 659645 659300 658931 658159 656761 654791 652551 650200 647518 644381 641307 639080 637790
59716 637790 636698 635190 633432 631858 630519 629396 628971 629852 631929 634436 636836 639104 641210 642966 644603
59701 644603 646870 650224 654326 658693 663329 668263 672967 676838 680018 683069 686008 688275 689547 689954
59687 689954 689570 688426 687096 686474 686649 686648 685709 684263 683180 682492 681430 679396 676377 672585 668207 663428
59671 663428 658326 652880 647389 642609 638970 635875 632441 628835 626189 625120 625057 625338 626283 628630 632373
59656 632373 636804 641438 646273 651159 655562 659178 662400 665829 669491 672779 675078 676170 676053 674591
59642 674591 671547 666916 661028 654300 647069 639761 632988 627218 622355 617921 613669 609764 606352 603292
59628 603292 600444 597914 595740 593537 590792 587373 583499 579389 575227 571367 568139 565416 562699 559722
59614 559722 556697 553924 551412 548998 546600 544258 542123 540479 539601 539488 539928 540853 542413 544640 547296
59599 547296 550138 553104 556062 558654 560511 561489 561638 561236 560911 561321 562459 563578 564025 563884 563557 563127
59583 563127 562492 561744 560957 559878 558317 556646 555373 554367 553071 551384 549775 548481 547187 545597 543885
59568 543885 542460 541627 541548 542134 542891 543262 543173 542903 542459 541558 540251 538991 537988 537073 536308 536128 536647 537457
59550 537457 538430 540058 542572 545289 547476 549408 551993 555676 560376 566238 573778 583265 594502 607283
59536 607283 621740 638200 656781 676759 695933 711015 719369 720587 716271 708612 699573 690943 684114
59523 684114 679461 676377 674151 672562 671634 671195 670791 669760 667442 663636 658820 653524 647547 640257 631685
59508 631685 622756 614256 606027 597492 588645 580177 572797 566736 561858 558014 555217 553470 552523 551988 551723
59493 551723 551864 552308 552485 551952 551027 550418 550460 551154 552683 555218 558255 560879 562870 564962 567823 571368
59477 571368 575286 579633 584472 589432 594111 598638 603347 608110 612398 615833 618380 620137 621320 622322
59463 622322 623482 624809 626179 627753 630008 633358 637867 643222 648945 654787 661050 668288 676577 685265
59449 685265 693608 701356 708551 714999 720322 724338 727049 728298 727779 725352 721123 715223 707750 699002
59435 699002 689592 680290 671786 664566 658895 654835 652234 650633 649400 648286 647967 649755 654631 662677
59421 662677 673309 685714 699057 712919 727892 745290 765752 788328 811374 834134 856977
59410 856977 880161 902764 922697 937332 944309 942561 933091 918655 902545 887591 875928 868975
59398 868975 867218 870129 876370 883856 889710 890779 884846 871668 852954 831465 809966 790425 773599
59385 773599 759312 747279 737735 731185 727626 726255 726061 726619 728152 730821 734170 737475 740536 743836
59371 743836 747811 752189 756209 759348 761678 763696 766006 769020 772698 776584 780288 783912 787877 792449
59357 792449 797645 803535 810335 818162 826879 836213 845885 855698 865681 876214 887769 900508 914230
59344 914230 928621 943320 957786 971386 983781 995019 1005143 1013813 1020317 1023878 1024055 1021077 1015721
59331 1015721 1008603 999580 988174 974588 959938 945377 931328 917739 904683 892391 880891 869947
59319 869947 859312 848844 838527 828510 818945 809679 800381 791128 782484 774637 766783 757900 747948
59306 747948 737808 728189 719249 711227 704657 699607 695331 691173 687469 685112 684500 685432 687889 692426
59292 692426 699679 709788 722314 736611 752306 769533 788417 807924 825321 837194 841284 837473
59280 837473 827430 813664 798628 783986 770428 758392 748881 743189 741832 744261 749623 757247 766225
59267 766225 775249 783438 790957 798382 805713 812430 818167 822832 826207 827927 827698 825167 819878 811948
59253 811948 802583 793229 784228 774960 765380 756645 749892 745051 741307 738349 736628 736681 738685 742555 748015
59238 748015 754560 761658 769076 776795 784580 791812 797863 802564 806243 809310 811881 813825 815127 815964
59224 815964 816285 815535 813089 808926 803649 797921 792136 786554 781361 776486 771635 766563 761168 755312 748890
59209 748890 742106 735439 729270 723777 719109 715321 712118 709069 706064 703235 700528 697883 695789 694982
59195 694982 695460 696479 697703 699560 702104 704421 705843 707088 709352 712781 716687 720885 725797 731347
59181 731347 736687 741190 745041 748730 752555 756688 761243 766158 771430 777338 783895 790250 795443 799765
59167 799765 804591 810701 817534 824295 830807 836755 840964 842329 841034 838084 833857 827847 819659 809630
59153 809630 798431 786651 774773 763092 751516 739781 727912 716198 704782 693681 683186
59142 683186 673722 665177 656885 648541 640769 634357 629187 624357 619283 614240 609827 606343 603856 602455
59128 602455 602059 602197 602431 602993 604680 607984 612602 617916 623759 630511 638588 648007 658361 669102 679944
59113 679944 691189 703530 717341 732093 746547 759503 770431 779599 787730 795353 802289 807868
59101 807868 811786 814442 816156 816309 813814 808496 801520 794297 787385 780739 774643 769824 766641 764565
59087 764565 762654 760383 757849 755322 752788 749935 746409 741996 736709 730832 724838 719057 713433 707661
59073 707661 701608 695449 689501 684118 679702 676468 674106 671952 669655 667447 665662 664265 663025 661826
59059 661826 660600 659224 657799 656713 656052 655221 653588 651327 649188 647594 646457 645768 645767 646444 647356 648127
59043 648127 648754 649316 649697 649730 649276 648129 646263 644292 643219 643403 644051 644059 643208 642301 642274 643406 645349 647776
59025 647776 650971 655749 662705 671577 681508 691851 702383 712746 722058 729382 734440 737688 739799
59012 739799 741121 741519 740604 738208 734749 731138 728333 726887 726686 727063 727493 728414 731032 735923 742109 748065
58996 748065 753363 758695 764408 769888 774499 778270 781280 783062 783205 782057 780300 778165 775488 772242
58982 772242 768592 764725 761058 758329 756984 756725 757145 758627 762108 767991 775740 784486 793640 802954 812438
58967 812438 822341 832939 844278 856275 868978 882422 896248 909695 921983 932535 940897 946706
58955 946706 949733 949839 946970 941285 933085 922440 909141 893338 875936 857978 839861 821686 804188
58942 804188 788597 775441 764146 754060 745346 738466 733207 728791 724781 721392 718921 717214 715769
58929 715769 714138 712159 709984 707891 705922 703719 700926 697725 694748 692386 690515 689030 688288 688595 689432
58914 689432 689770 689299 688912 689697 691794 694561 697616 701291 706144 712457 720232 729342 739604 750931 763457
58899 763457 777289 792177 807690 823700 840347 857512 874717 891683 908704 926315 944882
58888 944882 964656 985829 1008276 1031344 1054102 1075673 1095265 1112168 1125888 1136070 1142257 1144029
58876 1144029 1141556 1135724 1127423 1116927 1104114 1089058 1072241 1054416 1036437 1018956 1002103 985700
58864 985700 969951 955521 942738 931122 920046 909455 899461 889578 878944 867213 854766 842096
58852 842096 829424 816893 804780 793433 783169 774109 765867 757600 748711 739369 730083 721001 712026
58839 712026 703390 695560 688571 681988 675547 669423 663780 658502 653508 648946 644906 641248 637899 635107
58825 635107 633252 632536 632906 634106 635811 637885 640516 643895 647803 651747 655469 659082 662735 666423 670052
58810 670052 673422 676146 677965 679112 680026 680694 680664 679794 678537 677300 675894 673936 671447 668718 665752
58795 665752 662218 657961 653286 648665 644332 640276 636545 633413 631188 629988 629827 630864 633291 636959
58781 636959 641424 646496 652387 659045 665692 671523 676596 681505 686263 690089 692340 693010 692156 689436 684668
58766 684668 678489 671932 665431 658611 651084 643195 635880 629890 625208 621277 617752 614896 613095 612172
58752 612172 611473 610592 609751 609447 609956 611205 612848 614477 616070 618306 622096 627638 634183 640934 647924
58737 647924 655749 664654 674170 683585 692499 700893 708896 716670 724436 732354 740241 747457 753385 758132
58723 758132 762612 767718 773479 779197 784319 788997 793881 799579 806280 813637 820975 827723 833623 838472
58709 838472 841843 843250 842457 839396 833968 826168 816222 804271 790139 773792 755879 737340 718605
58696 718605 699672 680877 662953 646280 630730 616439 604035 593693 584499 575298 565941 557289
58684 557289 550144 544522 539810 535352 530952 527051 524371 523239 523313 523946 524645 525202 525772 527034 529966 535207
58668 535207 542775 552430 563961 576902 590355 603515 616265 628975 641750 653936 664158 670765
58656 670765 672596 669700 663228 654592 644867 634898 625331 616163 606714 596647 586793 578499 572314 567719
58642 567719 564054 561173 559160 557863 556939 556123 555352 554752 554511 554685 555148 555789 556576 557281 557440 556863 555948
58625 555948 555124 554165 552524 550187 547681 545299 542978 541116 540843 543001 547186 552219 557395 562824 568731
58610 568731 574912 580957 586583 591516 595281 597420 597897 597210 596060 594999 594309 594039 594089 594290 594499 594688
58594 594688 594998 595733 597186 599387 602083 605121 608785 613584 619746 627236 636294 647447 660621 674522
58580 674522 687462 698817 709280 719650 729800 738889 746172 751402 754884 757444 760155 763756 768483
58567 768483 774657 783166 795039 810622 829486 850992 874629 899747 925351 950277 973488 994138
58555 994138 1011480 1024816 1033526 1037284 1036414 1032015 1025528 1018137 1010557 1003193 996085 988688 980083 969670
58541 969670 957599 944363 930159 914839 898288 880587 861846 842318 822776 804442 788242
58530 788242 774244 762007 751329 742363 735200 729675 725621 722977 721631 721428 722339 724269 726624 728445
58516 728445 729232 729334 729359 729470 729443 729042 728000 725970 722930 719417 715963 712484 708659 704719 701317 698641
58500 698641 696197 693569 690922 688644 686833 685363 684159 683228 682608 682435 682933 684225 686269 688964 692259
58485 692259 696214 701149 707625 716057 726397 738323 751561 765773 780342 794663 808498 821644
58473 821644 833316 842347 847986 850182 849152 845177 838823 830840 821729 811825 801884 793129 786504 782243
58459 782243 780272 780601 783157 787613 793644 801045 809473 818363 827267 835934 843913 850354 854449 855849
58445 855849 854588 850906 845318 838555 831227 823678 816278 809640 804427 801075 799646 799786 800828 802246
58431 802246 804058 806620 810125 814538 819845 826009 832825 840134 848036 856480 864886 872617 879561 885625
58417 885625 889988 891694 890890 888624 885441 881071 875517 869376 862783 855053 845892 836190 827086 818920
58403 818920 811636 805536 800996 797851 795690 794473 794420 795533 797527 800050 802822 805874 809570 813922 817988
58388 817988 820727 822443 824534 827677 831179 834355 837420 840591 843400 845625 847997 851176 854768 858126
58374 858126 861492 865589 870650 876587 883565 891713 900718 910311 920640 931656 942767 953659 964812
58361 964812 976560 988320 999385 1009758 1019562 1028474 1036499 1044421 1052529 1059693 1064776 1068252 1071409
58348 1071409 1074683 1077897 1081411 1085682 1090279 1094745 1099982 1107356 1116788 1127171 1138399 1151378 1166132
58335 1166132 1181574 1197395 1214542 1233271 1251963 1268631 1282719 1294900 1305889 1315988 1325147
58324 1325147 1332941 1338857 1342894 1345535 1347165 1348067 1348998 1351121 1355136 1360868 1367705 1375052 1382495 1390112
58310 1390112 1398636 1408748 1420256 1432368 1444659 1457359 1470902 1485648 1501758 1518812 1535872
58299 1535872 1552458 1569093 1586375 1604009 1621451 1639000 1657370 1676576 1696084 1715757 1735823
58288 1735823 1756217 1776776 1797799 1819712 1842545 1866449 1892161 1920113 1949672 1980140 2011882
58277 2011882 2045447 2080255 2115409 2151264 2188954 2228759 2270207 2313325 2358531 2405614 2454064
58266 2454064 2503977 2555545 2608222 2661717 2717116 2775500 2836044 2897030 2958135 3020023 3082375
58255 3082375 3144337 3206460 3270068 3334971 3399944 3465469 3533915 3606964 3684761 3767510 3855766
58244 3855766 3949115 4046708 4149364 4259106 4376513 4500620 4631533 4770887 4919441 5076579
58234 5076579 5242590 5419210 5607358 5806515 6016852 6239869 6476544 6727059 6992833
58225 6992833 7276620 7580216 7904365 8251274 8624812 9027934 9462509 9932112 10442372
58216 10442372 10998351 11604554 12267888 12997403 13800797 14684863 15660284 16742626 17948518
58207 17948518 19295848 20809643 22524223 24479349 26720913 29309894 32329016 35883092
58199 35883092 40104801 45169855 51304094 58769872 67846959 78828894 92028776 107770938
58191 107770938 126361688 148057700 173052427 201472171 233322180 268288027 305358693
58184 305358693 342424175 376175474 402581769 417897024 419788022 408063768 384691531
58177 384691531 353142822 317403163 281066763 246805709 216257790 190183599 168701287
58170 168701287 151477940 137847287 126891789 117562181 108876956 100147698 91106078
58163 91106078 81858076 72716100 64024947 56053866 48955793 42770946 37458016 32933631
58155 32933631 29099591 25854796 23103472 20763392 18767274 17057844 15585726 14311480
58147 14311480 13204176 12235904 11380120 10615236 9925909 9299710 8725309 8194406 7702288
58138 7702288 7245358 6820200 6425362 6061476 5728737 5425931 5151848 4905303 4683493
58129 4683493 4482384 4298872 4130453 3972925 3821013 3671796 3525409 3382167 3241401
58120 3241401 3103564 2970990 2845504 2727172 2616042 2513057 2418171 2329409 2244987 2165102
58110 2165102 2090683 2021629 1957117 1896531 1839264 1784552 1732125 1682204 1634491 1588156 1543072
58099 1543072 1499983 1459047 1419367 1380353 1342527 1306625 1272928 1241767 1213581 1188040 1164147
58088 1164147 1141611 1121144 1103024 1086352 1070097 1053943 1037786 1021354 1004624 987634 969617
58077 969617 949392 927039 904167 882097 860753 839700 819199 799687 781210 763959 748481
58066 748481 734753 721913 709532 698293 688773 680327 671944 663630 656233 650272 645473 641025 635873
58053 635873 629229 621224 612711 604184 595413 586333 577592 569821 562972 556758 551077 545569 539467 532505
58039 532505 525467 519191 513381 507017 499659 491826 484286 477458 471329 465509 459368 452382 444418 435682
58025 435682 426605 417784 409709 402407 395558 388936 382550 376451 370782 365925 362134 359094 356276 353632
58011 353632 351384 349233 346536 343309 340400 338459 337346 336660 336180 335568 334336 332473 330562 328974 327502
57996 327502 326101 325370 325797 326926 327797 327992 327968 328535 330182 332586 334634 335241 334334 332750 331153 329440
57980 329440 327282 324649 321578 317978 314005 310200 306931 304030 301267 298826 297007 295751 294749 293842
57966 293842 293136 292938 293643 295383 297633 299489 300449 300686 300575 300327 300080 299902 299584 298840 297778 296713 295501
57949 295501 293612 290924 287878 284750 281430 278170 275880 275291 276323 278590 281993 286451 291595 297245
57935 297245 303740 311343 319661 328141 336796 345921 355378 364688 373674 382450 390773 397824 402768 405360
57921 405360 405992 405308 403799 401635 398772 395112 390578 385273 379731 374711 370401 366101 361221 356370 352876
57906 352876 351297 351049 351466 352402 353594 354199 353417 351140 347690 343405 338694 333983 329265 324109 318400
57891 318400 312607 307162 302077 297413 293560 290673 288405 286562 285474 285289 285487 285635 286147 287627 289774
57876 289774 291577 292445 292604 292494 292245 291765 290983 289964 288889 287844 286613 284997 283398 282699 283391 285192
57860 285192 287645 290561 293724 296768 299770 303377 307875 312573 316621 320064 323527 327222 330787 333849
57846 333849 336198 337573 337743 336704 334548 331365 327550 323816 320501 317160 313236 308761 304019 298935
57832 298935 293344 287511 281849 276401 271105 266271 262197 258590 254992 251566 248917 247326 246745 247287 248996
57817 248996 251203 252869 253630 253979 254422 254990 255620 256320 256802 256514 255362 254044 253370 253386 253278 251995 249032
57800 249032 244808 240273 235995 231770 227318 222982 219302 216171 213028 209904 207708 207331 208911 212038
57786 212038 216250 221057 225874 230274 234284 238276 242543 247050 251552 255991 260693 266028 271847 277519
57772 277519 282559 286981 290930 294318 296975 298814 299638 299171 297495 295010 291729 287114 280987 274037 266991
57757 266991 259877 252765 246540 242032 238758 235610 232606 230935 231286 233054 235293 237488 239272 240327
57743 240327 240978 242166 244384 247247 250340 253785 257553 260898 263044 264059 264607 265199 266019 267030 267819
57728 267819 267744 266740 265724 265701 266611 267454 267408 266434 264877 262918 260517 257628 254297 250596 246527 242068
57712 242068 237375 232780 228411 223922 218979 213955 209735 206672 204066 200940 197124 193378 190536 188704
57698 188704 187241 185504 183591 182210 181745 181701 181352 180613 179869 179187 178331 177433 176936 176763 176238 175069 173808
57681 173808 173047 172835 173320 175376 179970 187281 197102 209892 226817 248736 275668 307343 343933
57668 343933 386072 434433 489387 550794 617628 687268 754805 813149 854514 872704 864954 832548
57656 832548 780380 715619 645696 576448 511573 453259 402725 360158 324830 295743 272013
57645 272013 252646 236528 223026 212205 204073 198000 193208 189433 186573 184055 181142 177801 174745
57632 174745 172593 171306 170375 169200 167425 165274 163481 162520 161962 160973 159347 157670 156491 155770 155171 154456
57616 154456 153495 152262 150980 149971 149169 148035 146159 143750 141384 139406 137755 136255 134913 133902 133368
57601 133368 133314 133663 134375 135367 136320 136832 136866 136843 137019 136924 135725 133159 129866 126837 124704 123458 122547 121274
57583 121274 119431 117581 116425 115854 114966 113164 110922 109274 108703 108709 108303 106826 104416 101829 99689 97879
57567 97879 95824 93376 91096 89487 88282 86766 84637 82211 79907 77884 76199 74989 74366 74282 74630
57552 74630 75324 76250 77206 77992 78514 78787 78912 79049 79360 79947 80907 82351 84276 86483 88715 90830 92735
57535 92735 94305 95606 97052 98910 100614 101030 99627 97101 94584 92585 91025 89886 89214 88596 87295
57520 87295 85074 82416 79836 77377 74989 72870 71083 69204 66838 64316 62456 61760 62144 63322 65006
57505 65006 66760 68119 69016 69801 70716 71576 72056 72050 71626 70860 69936 69263 69290 70184 71706 73346 74553 74940
57487 74940 74409 73119 71393 69676 68385 67561 66661 65004 62534 60007 58296 57625 57540 57479 57193 56720 56141
57470 56141 55458 54624 53608 52391 51009 49720 49111 49709 51284 52765 53132 52349 51157 50122 49246 48442
57454 48442 47866 47613 47471 47222 46857 46305 45300 43811 42363 41572 41525 41927 42626 43627 44703 45430 45648 45581
57436 45581 45464 45293 44970 44477 43885 43332 42975 42767 42437 41935 41697 42094 42723 42768 42078 41351 41032 40604 39288
57417 39288 37079 34704 32910 32158 32617 33889 34954 34997 34311 33912 34310 35163 36125 37354 38954 40475 41333
57400 41333 41396 40843 39762 38244 36600 35187 34159 33627 33795 34605 35497 35863 35601 34978 34234 33683 33865 35036
57382 35036 36640 37848 38542 39230 40133 40996 41796 42899 44341 45669 46744 47979 49425 50290 49963 49032
57366 49032 48640 49158 50095 51016 51908 52763 53461 54120 55030 56169 57168 57786 58156 58608 59542 61321 63860 66366
57348 66366 67944 68492 68664 69040 69720 70661 71836 72940 73458 73259 72757 72365 72156 72179 72673 73659 74689 75308
57330 75308 75565 75789 76109 76473 76934 77585 78306 78785 78773 78214 77288 76533 76683 78066 80136 81835 82469 82169
57312 82169 81581 81296 81599 82603 84378 86830 89487 91639 92930 93768 94949 96784 98774 100168 100740 100982
57296 100982 101690 103389 106049 109247 112656 116252 119990 123491 126420 129056 132019 135343 138300 140444
57282 140444 142358 144921 147990 150343 150918 149719 147444 144686 141714 138691 135596 131953 127135 121175
57268 121175 115049 109844 105838 102767 100846 100945 103579 108242 114154 121243 129930 140149 151115 161904
57254 161904 171806 180346 187644 194832 203399 213769 224867 235320 244695 253404 261868 270174 278196
57241 278196 285737 292757 299733 307503 316449 326079 335727 345413 355601 366379 377400 388596 400496
57228 400496 413712 428408 444367 461313 479083 497604 516745 536074 554847 572392 588454
57217 588454 603045 616173 628133 639997 653316 668981 686647 705453 725090 745895 768132
57206 768132 791597 815902 840764 865861 890753 915153 939053 962347 984562 1005273 1024665
57195 1024665 1043269 1061213 1078202 1094379 1110759 1128498 1147996 1169054 1191723 1216547 1243918
57184 1243918 1273398 1303766 1333635 1362004 1388353 1412369 1433890 1453312 1471797 1490533 1509700
57173 1509700 1528621 1547060 1565855 1585969 1607487 1629924 1653028 1676610 1700004 1722475 1744139
57162 1744139 1765868 1788256 1811132 1834109 1857132 1880443 1904370 1929146 1954635 1980266 2005554
57151 2005554 2030542 2055362 2079598 2102511 2123800 2143708 2162487 2180174 2196728 2212001 2225819
57140 2225819 2238511 2251003 2263724 2275742 2285688 2293297 2299306 2304145 2307779 2310826 2314733 2320561 2328365
57127 2328365 2338047 2350107 2365275 2384014 2406594 2433142 2463451 2497166 2534160 2574331 2617256
57116 2617256 2662649 2710913 2762507 2817002 2873617 2932575 2995284 3063727 3140818 3230987 3339152
57105 3339152 3469305 3625200 3811999 4035966 4303377 4622026 5004174 5466812 6029877
57096 6029877 6716594 7555172 8576848 9810559 11279719 13001685 14985357 17227552
57088 17227552 19713822 22422270 25322760 28373164 31522724 34720802 37917030 41053576
57080 41053576 44069990 46923306 49589635 52023921 54113750 55688114 56586454 56726198
57072 56726198 56115099 54818800 52927357 50540262 47760304 44688496 41423049 38061087
57064 38061087 34695964 31410100 28270395 25327985 22617970 20158494 17952907 15994514
57056 15994514 14269666 12758984 11440104 10291399 9292889 8424721 7667253 7003114 6417820
57047 6417820 5898617 5434545 5017884 4643914 4308709 4008085 3738530 3497519 3282336
57038 3282336 3089547 2915921 2759032 2616871 2487767 2370798 2265398 2170368 2083994 2005088
57028 2005088 1933181 1867906 1809148 1757773 1715227 1682356 1659432 1647281 1647378 1660717 1687591 1728742
57016 1728742 1785845 1860234 1950985 2053210 2156619 2245564 2302582 2314457 2276857 2194795 2079834
57005 2079834 1946190 1807039 1672082 1547131 1435110 1336885 1251691 1178051 1114913 1061710
56995 1061710 1017510 980867 950685 926565 908042 893958 882846 873597 865695 859181 854481 851984
56983 851984 851704 853459 856955 861147 863827 862592 856224 844774 828688 808702 786400 763827 742309
56970 742309 722240 703968 688012 674299 662195 651759 644187 640524 640478 642934 647230 653548 662465
56957 662465 674410 689153 705470 721527 735674 746492 752154 750569 740694 723401 700836 675296
56945 675296 648881 623585 601035 582224 567684 557649 551826 549368 549465 552051 557825 567746 582419
56932 582419 601692 624739 650633 678592 707278 734018 755211 767527 768576 757144 733937 702130
56920 702130 666144 629445 593927 561059 532261 507799 486561 467710 451673 438830 428249
56909 428249 418705 410160 403046 396692 389805 382341 375647 370642 366875 363573 360654 358385 356855 356256
56895 356256 357064 359470 363068 367526 373248 380987 391050 403198 417188 433090 451088 471050 492107
56882 492107 512451 529635 541378 546304 544222 536003 523298 508126 492439 477885 465799 457184
56870 457184 452601 452179 455834 463512 475329 491677 513279 541049 575682 617215 664888 717427
56858 717427 773399 830995 887089 936541 973054 991443 989625 968981 933454 888465 839847 792595
56846 792595 750006 713936 685674 666204 655814 654206 661413 678344 706132 745206 795306 856131
56834 856131 927475 1008591 1097560 1190876 1282868 1365198 1427705 1461088 1460100 1425158 1361736 1278437
56822 1278437 1184853 1089711 999675 919087 850447 794948 752676 722815 704239 696186 698469 711146
56810 711146 734098 766898 809004 859933 918851 983503 1049207 1109018 1155197 1181107 1182647 1159092
56798 1159092 1113307 1050966 978942 903804 831059 764732 706874 657676 616692 584127 560705
56787 560705 546451 540225 540697 547352 560200 578817 602124 629056 658860 690225 720090 743740
56775 743740 756482 755526 740558 713150 676114 633109 587825 542943 500030 460480 425919 397210
56763 397210 373563 353318 335455 319868 306509 295002 285108 276839 269973 263969 258530 253823 250000
56750 250000 246922 244460 242624 241185 239547 237244 234344 231314 228748 227136 226425 225728 223989 221214 218645
56735 218645 217475 217688 218290 218305 217313 215499 213546 212274 211999 212291 212505 212451 212496 213170 214644 216389 217438
56718 217438 217375 216980 217404 218723 219937 220468 220874 221792 222940 223706 224086 224404 224563 224294 223860 223780 224003 223945 223302
56699 223302 222360 221545 221087 221022 221183 221260 221181 221201 221365 221212 220414 219323 218286 216810 214240 211107 208874 208241
56681 208241 208439 208406 207921 207321 206843 206718 207352 208783 210290 211053 211040 210868 210962 211297 211871 212936 214569 216300
56663 216300 217317 217105 215878 214446 213568 213333 213211 212735 212005 211422 211086 210712 210181 209940 210710 212796 215808
56646 215808 219055 222132 225018 227755 230296 232762 235587 239114 243113 246991 250554 254253 258462 262635
56632 262635 265566 266557 266118 265318 264580 263442 261434 258737 255816 252823 249812 247250 245711 245051 244421 243218
56616 243218 241560 239759 237869 236032 234728 234260 234323 234447 234478 234247 233279 231454 229600 228700 228684 228724 228610 228950
56598 228950 229920 230682 230459 229580 228918 228758 228705 228456 228099 227752 227343 226768 226056 225401 225157 225614 226564 227258 227082
56579 227082 226230 225456 225320 225919 227214 229133 231281 232952 233735 233979 234478 235773 237829 240215 242463 244402
56563 244402 246365 248965 252501 256678 261064 265689 270900 276755 282959 289333 295775 301654 305888 308073
56549 308073 309177 310575 312695 315108 317573 320154 322458 323688 323745 323456 323333 322804 321262 319280 318019
56534 318019 317758 317742 317351 316654 315744 314199 311648 308499 305772 304198 303647 303367 302714 301623 300393 299162
56518 299162 297803 296230 294436 292133 288830 284562 280155 276346 272917 269130 264829 260646 257266 254956
56504 254956 253686 253203 252943 252374 251516 250793 250346 249859 249036 247805 246122 244148 242701 242890 244910 247656
56488 247656 249890 251454 252948 254580 255894 256565 256877 257284 257787 257922 257251 255760 253893 252325 251575 251711
56472 251711 252338 252963 253371 253626 253789 253837 253907 254345 255218 255957 255944 255364 255058 255429 255986 256149 255997 255901 255899 255875 256021
56451 256021 256580 257393 258137 258788 259393 259701 259533 259282 259428 259752 259738 259574 259993 261108 262228 262971 263752 264922
56433 264922 266132 266968 267653 268659 269990 271211 271906 271861 271205 270595 270872 272268 274232 276242 278323 280615
56417 280615 282898 284844 286342 287320 287708 287826 288289 289137 289616 289239 288536 288211 288040 287317 286023 284823 284103
56400 284103 283728 283645 283962 284357 284069 282721 280794 279145 278323 278338 278668 278454 277029 274479 271492 268711 266420
56383 266420 264740 263693 263024 262311 261295 259955 258339 256746 256037 257224 260498 264910 269259 273123 276886
56368 276886 280905 284885 288079 290053 291166 292159 293280 294124 294536 295279 297271 300300 303112 304875 306015
56353 306015 307371 308955 310007 310000 309224 308441 308293 309016 310379 311808 312763 313196 313625 314630 316270 318053 319513
56336 319513 320688 321922 323257 324300 324776 324957 325301 325852 326283 326527 327032 328304 330404 332988 335683 338286
56320 338286 340722 342966 345003 346803 348369 349820 351343 352988 354519 355575 356064 356369 357125 358748 361239
56305 361239 364395 368081 372157 376317 380294 384227 388577 393528 398662 403340 407242 410492 413413 416323
56291 416323 419417 422731 426294 430316 435030 440312 445710 450985 456329 461903 467520 473021 478668 484754
56277 484754 491029 496954 502420 507857 513717 520134 527045 534264 541547 548972 557201 566915 577996 589727
56263 589727 601872 615081 630074 646944 665631 686616 710623 737844 768012 801286 838656
56252 838656 881301 929810 984157 1044215 1110092 1182127 1260814 1346691 1439977 1540132 1645846
56241 1645846 1755592 1868073 1981960 2095356 2205781 2310657 2407507 2493719 2566569 2623796
56231 2623796 2663946 2686043 2689340 2673844 2640861 2592568 2531071 2458233 2376251 2287728 2194899
56220 2194899 2099184 2001778 1904362 1808880 1716730 1628469 1544245 1464241 1388678 1317623 1250961
56209 1250961 1188536 1130333 1076617 1027855 984292 945422 909966 876649 845156 816196 790592
56198 790592 768433 749195 732358 717611 704626 693090 682954 674235 666529 659140 651809 644915
56186 644915 638820 633454 628762 625034 622379 620276 618154 616114 614540 613301 611978 610765 610406 611149 612342
56171 612342 613301 614089 615156 616590 618105 619567 621205 623290 625770 628272 630520 632713 635438 639121 643704
56156 643704 648952 654869 661610 669182 677524 686803 697307 709109 721995 735674 749906 764702 780651
56143 780651 798822 819995 844207 871394 902136 937369 977658 1023464 1075969 1136864 1207223
56132 1207223 1287057 1375809 1472483 1575070 1680465 1785177 1885684 1978276 2059684 2128596
56122 2128596 2186233 2235066 2277200 2313838 2345251 2370436 2387277 2393807 2389523 2375474 2353577 2326063
56110 2326063 2294836 2260417 2221331 2174880 2118619 2051331 1973352 1886674 1794595 1700790 1608537
56099 1608537 1520599 1439235 1365864 1301031 1245025 1198249 1160671 1131319 1108764 1091878 1079730
56088 1079730 1071109 1064757 1060064 1057119 1056112 1056975 1059464 1063255 1067975 1073352 1079261 1085549 1092100 1099185
56074 1099185 1107369 1116802 1126956 1137407 1148462 1160663 1174056 1188370 1203539 1219480 1235691 1251611
56062 1251611 1267154 1282364 1296898 1310422 1323259 1335911 1348170 1359424 1369772 1380059 1390813
56051 1390813 1401839 1412996 1424649 1437127 1450313 1464100 1478871 1495317 1514051 1535439 1559401
56040 1559401 1585257 1612118 1639539 1667567 1696287 1725769 1756394 1788690 1822635 1857524 1892691
56029 1892691 1928136 1964416 2002244 2042123 2084013 2127382 2171898 2217908 2265796 2315058 2364726
56018 2364726 2414712 2466069 2519815 2576051 2634355 2694510 2756651 2821215 2888854 2959946 3034087
56007 3034087 3110617 3189751 3272683 3360524 3453709 3552500 3657308 3768273 3885207 4008277
55997 4008277 4138212 4275594 4420529 4573283 4734601 4905131 5085127 5274986 5475455
55988 5475455 5687063 5910126 6145719 6395985 6663170 6949110 7255968 7586580 7943542
55979 7943542 8328878 8745245 9196691 9687704 10222613 10806781 11447384 12152082 12928127
55970 12928127 13784289 14733039 15789880 16972019 18300107 19801398 21510400 23468646
55962 23468646 25728115 28357331 31445710 35107975 39493870 44798248 51258104 59135452
55954 59135452 68704215 80253520 94091393 110524143 129817557 152174928 177741494
55947 177741494 206577658 238510008 272828074 307926483 341112513 368814370 387282809
55940 387282809 393612842 386668537 367462753 338800171 304384902 267842611 232049430
55933 232049430 198894429 169365250 143776209 122011652 103726015 88480881 75823081
55926 75823081 65324785 56605455 49341758 43265586 38156222 33834331 30157522 27013027
55918 27013027 24308790 21968338 19929987 18145721 16577782 15195425 13973232 12889589
55910 12889589 11925077 11062343 10287203 9588580 8956940 8383445 7860652 7383013 6946190
55901 6946190 6546351 6180121 5844337 5535547 5250400 4986775 4743819 4520507 4314759
55892 4314759 4124370 3948193 3785905 3636905 3499918 3373603 3257331 3151482 3057027 2974574
55882 2974574 2903757 2843802 2794606 2756894 2731332 2717864 2715774 2723593 2738579 2756659 2773150 2783215
55870 2783215 2781706 2763375 2724080 2661982 2577860 2474924 2358485 2234923 2109993 1987847
55860 1987847 1871516 1763551 1665584 1577646 1498660 1427639 1364069 1307407 1256857 1211683 1171270
55849 1171270 1134770 1101103 1069524 1039902 1012270 986278 961164 936203 911160 886558 863490
55838 863490 842903 824822 808301 792282 776425 761079 746557 732688 719136 705973 693674
55827 693674 682566 672486 663041 653985 645169 636391 627591 619051 611028 603192 594778 585377 575311
55814 575311 565259 555920 548057 542333 538784 536802 535936 536429 538680 542538 547526 553417 560071 566870
55800 566870 572989 578296 583393 588469 592478 593763 591331 585297 576316 564981 551834 537690 523635
55787 523635 510576 498845 488399 479415 472447 467747 464481 460957 455828 449049 441649 434708 428738
55774 428738 423898 420474 418870 419274 421608 425833 431898 439159 446060 450741 451946 449197 442485 432333
55760 432333 420100 407434 395132 382926 370655 359128 349449 341869 335738 330210 324499 317804 309775
55747 309775 301104 293039 286149 279946 273819 267900 262825 259023 256468 254839 253661 252461 251007 249427
55733 249427 247973 246783 245854 245136 244587 244188 243912 243614 243072 242153 240788 238654 235243 230660 226088 222877
55717 222877 221122 219661 217614 215437 214225 214361 215308 216537 218264 221173 225508 230483 234748 237542 239295
55702 239295 240804 242017 242119 240731 238344 235374 231416 225982 219512 213105 207434 202438 197932 193984
55688 193984 190732 188257 186713 186203 186471 187074 187885 189147 190957 193041 195229 197803 201012 204353 206690
55673 206690 207235 206298 204923 203767 202526 200572 197984 195675 194472 194375 194839 195469 196174 196896 197568 198316 199404
55656 199404 200971 203015 205648 209123 213514 218437 223057 226354 227631 227033 225454 223610 221248 217553
55642 217553 212286 206158 200038 194226 188652 183431 178887 175204 172303 169920 167642 165038 162056 159229
55628 159229 157252 156299 155902 155458 154713 153766 152780 151719 150322 148324 145834 143429 141711 140744 140014 138944
55612 138944 137345 135445 133746 132870 133205 134401 135417 135382 134426 133446 133083 133178 133235 133018 132486 131477 129852
55595 129852 127926 126400 125751 125812 125949 125584 124642 123709 123646 124746 126289 127243 127473 127908 129346 131436 133110
55578 133110 133745 133548 133018 132529 132411 133002 134407 136448 138973 141995 145426 148858 151851 154396 156937 159857
55562 159857 162957 165487 166764 166737 165905 164595 162535 159304 155024 150312 145571 140712 135703 131053 127457
55547 127457 125119 123702 122852 122428 122222 121806 120919 119876 119341 119611 120273 120620 120334 119732 119403 119707 120549 121456
55529 121456 121867 121508 120557 119391 118154 116780 115454 114769 115142 116189 117046 117254 117013 116528 115603 114138 112741
55512 112741 112420 113713 116402 119988 124059 128140 131571 133822 134804 134713 133748 132187 130529 129214 128150
55497 128150 126835 124964 122726 120483 118460 116825 115735 115008 114081 112685 111408 111172 112126 113499 114556
55482 114556 115307 116061 116689 116692 115901 114747 113816 113265 112696 111593 109952 108450 107826 108062 108400 108228 107654 107091
55464 107091 106647 106219 105938 106039 106407 106610 106412 105971 105486 104973 104443 104123 104324 105113 106126 106751 106694 106453 106903
55445 106903 108212 109419 109455 108315 106796 105360 103880 102436 101563 101478 101706 101828 102090 102862 103924 104789 105436
55428 105436 106215 107188 108045 108583 108857 108916 108777 108647 108802 109273 109985 111188 113327 116371 119663 122602 125181
55411 125181 127598 129629 130732 130723 130092 129604 129689 130160 130333 129466 127294 124335 121566 119624 118275 116772 114751
55394 114751 112625 110958 109718 108471 107198 106424 106371 106502 106209 105581 105005 104290 102888 100910 99197 98242
55378 98242 97679 97186 97259 98461 100309 101638 101960 101814 101738 101530 100791 99663 98650 98010 97704 97730 98102 98584
55360 98584 98842 98885 99094 99760 100796 101925 102917 103523 103441 102569 101255 100157 99857 100572 102102 103907 105350
55343 105350 106065 106186 106127 106149 106160 105959 105556 105175 104987 104887 104556 103740 102516 101345 100865 101482 102984 104568
55325 104568 105411 105347 104961 104975 105611 106546 107297 107549 107290 106883 106868 107436 108114 108288 108031 108073 108851 109931 110597 110720
55305 110720 110717 110804 110615 109622 107792 105877 105057 106025 108189 109999 110385 109777 109423 109818 110278 110071 109436 109172
55287 109172 109534 109980 109947 109512 109190 109301 109734 110209 110539 110607 110325 109783 109327 109228 109275 108933 107936 106527 105113
55268 105113 103954 103224 103058 103294 103477 103355 103155 103140 103131 102832 102368 102139 102265 102577 103024 103741 104746 105948 107324
55249 107324 108689 109488 109376 108928 109180 110318 111364 111314 110115 108340 106476 104807 103541 102635 101778 100851
55233 100851 100119 99805 99822 100144 100987 102303 103522 104200 104550 104938 105285 105474 105925 107111 108682 109791 110200
55216 110200 110424 110810 111158 111344 111616 112014 112085 111570 111013 111195 112168 113175 113469 112942 111999 111083 110394 109996 110075
55197 110075 110950 112655 114555 115627 115234 113621 111663 110237 109769 110082 110537 110442 109537 108166 106986 106462
55181 106462 106556 106811 106768 106369 105910 105643 105566 105653 106011 106683 107490 108322 109333 110532 111412 111448 110947 110862 111671 112886
55161 112886 113848 114598 115590 116854 117902 118395 118506 118534 118500 118277 117883 117413 116753 115676 114301 113187 112749 112708
55143 112708 112458 111943 111856 112777 114406 115792 116155 115334 113704 111966 110830 110529 110633 110566 110307 110380 111209 112672
55125 112672 114238 115365 115880 116129 116635 117461 118090 118169 118092 118444 119100 119392 119073 118569 118257 118040 117720 117305 116759
55106 116759 115934 114986 114378 114242 114160 113932 114097 115219 116912 118136 118369 118060 117945 118305 118992 119814 120638 121255
55088 121255 121398 121027 120460 120050 119761 119303 118799 118949 120151 121669 122238 121523 120452 120023 120288 120710 120912 120717
55070 120717 119909 118542 117236 116666 116848 117324 117881 118662 119616 120326 120445 120030 119350 118601 117877 117262 116862 116857 117435
55051 117435 118516 119601 120046 119578 118490 117474 117205 117864 118902 119541 119619 119685 120095 120444 120279 119970 120342 121587
55033 121587 123097 124260 124905 125041 124751 124455 124690 125481 126330 126938 127438 127772 127420 126133 124460 123053 121841
55016 121841 120415 119015 118442 118968 119881 120342 120272 120141 120146 120053 119755 119611 120036 120994 122124 123246 124399 125427
54998 125427 125914 125766 125505 125633 125968 126012 125804 125872 126363 126854 127172 127840 129286 131013 132020 131873 130987 130053
54980 130053 129573 129817 130718 131688 131875 130821 128886 127044 126299 127044 128706 130131 130632 130624 131005 132072 133375
54963 133375 134495 135441 136216 136536 136330 136158 136776 138358 140344 141936 142680 142752 142809 143335 144008 143984 142965 141646
54945 141646 140811 140378 139754 138853 138157 137955 138115 138673 139945 141862 143712 144862 145418 145905 146640 147714 149250
54928 149250 151336 153926 157110 161303 166868 173692 181324 189305 197128 204233 210391 215835 220547 223614
54914 223614 223857 221017 215905 209510 202462 195265 188400 182033 176097 170749 166276 162467 158685 154808
54900 154808 151555 149594 148692 148061 147151 145884 144528 143666 143811 144722 145543 146032 147116 149673 153231 156607
54884 156607 159548 162936 167520 173207 179622 186568 193764 200802 207609 214342 220498 224691 225830 224193
54870 224193 221013 217198 212824 207633 201617 195088 188457 182006 175861 170133 165014 160524 156338 152235
54856 152235 148674 146448 145586 145075 143975 142407 141069 140140 139164 137818 136255 134747 133442 132512 132137 132166
54840 132166 132120 131648 130795 129767 128709 127815 127337 127240 127050 126307 125130 124134 123828 124233 125118 126406 128248 130677
54822 130677 133236 135038 135405 134553 133534 133295 133801 134243 134058 133501 133123 133010 132871 132680 132818 133510 134450 135167
54804 135167 135533 135731 135888 136015 136175 136490 136984 137527 137945 138079 137889 137593 137569 137973 138564 139082 139599 140255 140867
54785 140867 141199 141503 142319 143725 145276 146765 148553 150911 153498 155882 158194 160862 163924 167141 170625
54770 170625 174904 180344 186904 194432 202702 210988 218087 223154 226330 228264 229185 228780 226914 224014 220541
54755 220541 216357 210950 204264 197079 190512 185260 181272 177923 174419 170328 165994 162317 159896 158505
54741 158505 157608 157187 157642 158925 160264 161001 161324 161934 163244 165217 167720 170669 173875 177112 180413 184110
54725 184110 188552 193872 199945 206443 212935 218968 223955 227015 227326 224931 220888 216267 211172 205181
54711 205181 198549 192336 187239 182871 178415 173589 168734 164359 160955 158900 158013 157327 155772 153162 150283
54696 150283 148041 146767 146247 146023 145613 144788 143841 143399 143817 144877 146146 147396 148490 149098 148849 147757
54680 147757 146251 144773 143471 142297 141250 140466 140129 140274 140612 140613 139954 138863 137893 137343 137119 137130 137502 138242
54662 138242 139014 139490 139747 140061 140434 140605 140404 139811 138749 137188 135450 134043 133118 132463 132047 132169 132887
54645 132887 133731 134285 134727 135453 136503 137734 139252 141079 142591 142936 142151 141299 141274 141841 142104 141590 140595
54628 140595 139749 139563 140216 141434 142615 143295 143490 143457 143284 142889 142307 141715 141197 140701 140175 139528 138547 137157
54610 137157 135751 134987 135115 135714 136198 136357 136286 136076 135869 135985 136644 137590 138295 138632 139050 139986 141319 142587
54592 142587 143559 144384 145255 146149 146896 147351 147473 147350 147068 146479 145202 143110 140809 139296 139057 139744 140796
54575 140796 142000 143176 143753 143293 142349 142136 143135 144531 145370 145789 146588 147906 149046 149561 149821 150180 150233
54558 150233 149405 147936 146676 145997 145480 144732 143971 143540 143261 142740 142152 142290 143724 146103 148394 149740 150053
54541 150053 149914 150029 150752 152022 153582 155182 156669 158068 159494 160798 161367 160636 158929 157412 156923 157082
54525 157082 156894 155995 154890 154151 153861 153857 154018 154126 153873 153240 152620 152360 152421 152608 152822 152824 152129 150526 148538
54506 148538 146976 146061 145309 144275 143121 142393 142478 143328 144532 145583 146224 146558 146776 146842 146579 146013 145418 144996
54488 144996 144672 144276 143798 143416 143323 143564 144006 144502 145176 146389 148286 150386 151825 152105 151519 150871 150896 151906
54470 151906 153793 156194 158666 160822 162382 163229 163433 163171 162537 161540 160313 159209 158564 158464 158829 159553
54454 159553 160355 160697 160225 159293 158695 158769 159015 158764 158012 157363 157252 157427 157223 156258 154845 153760 153597 154324
54436 154324 155373 156060 155942 155045 153968 153567 154258 155651 157086 158356 159627 160810 161545 161858 162241 162814
54420 162814 162934 162101 160938 160656 161608 162898 163499 163297 162835 162461 162136 161909 162137 163085 164491 165724 166359
54403 166359 166527 166763 167535 168847 170165 170744 170235 169048 168029 167730 168076 168762 169738 171099 172684 174111
54387 174111 175182 175980 176602 177040 177329 177539 177541 177083 176202 175306 174736 174456 174305 174272 174303 174103 173402 172400 171686
54368 171686 171739 172552 173686 174590 174989 175084 175298 175836 176653 177854 179747 182351 185166 187690 189939 192173 194384
54351 194384 196406 198299 200165 201684 202283 201743 200298 198176 195507 192756 190738 189878 189638 188907 186885
54336 186885 183622 179875 176518 173891 171682 169516 167480 165873 164666 163704 163264 163718 164536 164406 162787
54321 162787 160799 159986 160572 161550 162218 162880 164009 165398 166409 166644 166122 165064 163792 162737 162296 162600
54305 162600 163342 163854 163546 162493 161408 160824 160460 159765 158858 158439 158785 159430 159951 160462 161053 161317 160937 160340
54287 160340 160210 160597 161015 161249 161490 161799 162046 162380 163105 164020 164456 164224 163990 164378 165171 165783 166079 166230 166107
54268 166107 165424 164382 163612 163432 163576 163708 163817 164056 164594 165702 167603 170011 172145 173490 174387 175628
54252 175628 177549 179640 180988 180984 179702 177737 175717 174001 172784 172179 171960 171479 170304 168879 168056 167976
54236 167976 167978 167735 167698 168014 167733 165995 163632 162633 163834 165958 167185 167092 166641 166789 167676 168955 170252 171155
54218 171155 171208 170260 168729 167254 166057 164860 163495 162359 161994 162300 162589 162503 162506 163216 164600 166132 167458
54201 167458 168470 168959 168757 168176 167813 167877 168174 168718 169737 170877 171146 170088 168544 167724 167830 168092 167894
54184 167894 167332 166773 166461 166550 167020 167471 167430 167025 166976 167734 168931 169821 169974 169351 168077 166500 165270 164880
54166 164880 165138 165403 165380 165390 165753 166277 166608 166841 167386 168218 168694 168346 167560 167151 167363 167638 167416 166811 166405
54147 166405 166613 167447 168615 169614 169909 169360 168437 167739 167321 166806 166151 165954 166786 168484 170336 171802 172836
54130 172836 173617 174251 174731 174946 174642 173609 172085 170873 170805 172038 173949 175782 177248 178465 179459 180007
54114 180007 180018 179871 180158 181084 182252 183089 183405 183473 183659 184120 184842 185789 186845 187702 188007 187706 187140 186784 186986
54095 186986 187953 189699 191815 193539 194387 194617 194801 195003 194793 194121 193713 194352 196087 198454 201216 204560
54079 204560 208703 213710 219609 226285 233151 239171 243353 245114 244310 241252 236714 231617 226549 221715
54065 221715 217282 213453 210144 207047 204248 202419 202016 202490 202739 202222 201281 200430 199819 199447 199449 199871 200532
54048 200532 201391 202813 205065 207688 209827 211216 212483 214376 217018 220071 223269 226536 229901 233654
54034 233654 238389 244378 250977 257160 262752 268686 275767 283537 290739 296621 301385 305479 308920 311432
54020 311432 312910 313544 313595 313212 312413 311184 309637 308074 306836 306048 305516 304811 303466 301157 297891 294008
54004 294008 290000 286252 282846 279440 275383 270301 264698 259745 256188 253658 251243 248499 245574 242586
53990 242586 239433 236208 233301 230908 228792 226689 224698 223140 222264 222163 222641 223051 222676 221549 220623 220754
53974 220754 221645 222129 221440 219927 218516 217722 217277 216611 215580 214598 214027 213609 212796 211618 210863 211270 212822
53957 212822 215007 217367 219541 221108 221889 222326 223161 224724 226810 229172 231769 234529 237206 239657 242083
53942 242083 244934 248693 253732 260136 267533 275207 282527 289309 295885 302898 310967 320364 330986 342648
53928 342648 355229 368385 381177 392236 400326 404742 405375 402647 397408 390681 383432 376558 370859
53915 370859 366846 364605 364007 364857 366706 368853 370942 373422 377005 381732 386977 392267 397585 402846 407631
53900 407631 411631 414864 417201 418127 417378 415498 413399 411519 409659 407402 404375 400286 395148 389442 383740
53885 383740 378151 372332 366050 359534 353220 347292 341534 335552 329178 322691 316583 311059 305953 301196
53871 301196 297106 293972 291456 288772 285479 281905 278670 275930 273205 269937 266129 262368 259177 256455
53857 256455 253685 250617 247495 244588 241834 239128 236710 234948 233808 232827 231609 230215 229005 228187 227544
53842 227544 226581 225006 223044 221190 219734 218728 218371 218937 220163 221159 221318 221079 221346 222347 223501 224261
53826 224261 224573 224530 224114 223423 222749 222197 221534 220598 219585 218772 218206 217871 217934 218550 219571 220723 221963 223462
53808 223462 225253 227131 228903 230659 232754 235558 239188 243483 248252 253526 259369 265409 270841 275175
53794 275175 278922 283262 288895 295281 301091 305417 308486 311185 313961 316324 317487 317313 316458 315693 315323
53779 315323 315193 314941 314133 312460 310039 307350 304681 301803 298408 294671 291032 287494 283618 279315 275270
53764 275270 272220 269977 267519 264079 259884 255739 252077 248662 245137 241656 238839 237168 236491 236090 235230
53749 235230 233727 232038 230778 230114 229694 229133 228374 227497 226387 224927 223428 222486 222253 222193 221764 221076 220558
53732 220558 220209 219639 218801 218157 217990 218016 217945 217961 218262 218522 218388 218259 218839 219930 220501 220220 220148 221370 223487
53713 223487 225164 225808 225985 226359 227050 228080 229668 231764 233847 235491 236775 237951 239138 240581 242711
53698 242711 245580 248610 251306 253919 256982 260460 263762 266439 268495 270159 271643 273043 274139 274461
53684 274461 273789 272506 271240 270335 269840 269730 269778 269510 268696 267718 267095 266836 266643 266462 266405 266358 266211 266277 266927
53665 266927 267867 268326 267865 266600 264826 263001 261883 261889 262369 262286 261644 261422 262023 262720 262890 262890 263240 263673 263634
53646 263634 263170 262774 262788 263340 264462 265866 267038 267877 268754 269622 269788 269041 268287 268399 269084 269639 270251 271532
53628 271532 273241 274547 275387 276498 278104 279560 280502 281455 283039 285270 287944 291022 294299 297279 299722
53613 299722 301908 304081 306159 308249 310898 314394 318171 321428 324143 327105 330992 335687 340450 344589
53599 344589 348044 351395 355169 359192 362834 365902 368888 372200 375509 378159 379931 381029 381475 380989 379559
53584 379559 377821 376557 375858 375008 373312 370880 368412 366281 364177 361708 358960 356272 353846 351908 350884
53569 350884 350903 351335 351385 351034 350853 350982 350932 350440 349869 349520 349151 348559 348131 348357 349053 349522 349430 349179 349385 350182
53549 350182 351122 351746 352192 353047 354453 355673 355895 355305 354850 355061 355644 356277 357178 358694 360843 363518 366674
53532 366674 370165 373868 378142 383564 389875 395875 400861 405606 411345 418273 425725 433388 441520 450186
53518 450186 459100 468244 477948 488316 499202 510828 523764 538055 552928 567758 582912 599273
53506 599273 617134 635919 654860 673706 692699 712016 731327 750014 767872 785399 803185
53495 803185 821110 838397 854452 869444 884067 898962 914357 930079 945781 961250 976484
53484 976484 991489 1006195 1020701 1035345 1050257 1065041 1079210 1092751 1105885 1118486 1130222
53473 1130222 1141212 1151923 1162328 1171667 1179198 1184703 1188108 1189192 1188054 1185388 1181814 1177158 1170817
53460 1170817 1162586 1152699 1141341 1128718 1115488 1102487 1089821 1076693 1062326 1046705 1030214 1012957
53448 1012957 994854 976204 957708 939907 922859 906392 890405 874881 859804 845213 831216
53437 831216 817901 805365 793911 783968 775628 768509 762318 757429 754461 753330 753187 753476 754602 757155
53423 757155 760828 764692 768496 773096 779341 787038 795465 804650 815546 828886 844291 860796 877970
53410 877970 896167 915758 936461 957582 978716 1000084 1022324 1046044 1071500 1098565 1127059
53399 1127059 1157189 1189512 1224346 1261334 1299798 1339357 1379969 1421460 1463456 1505841 1548920
53388 1548920 1592926 1637601 1682514 1727518 1772618 1817442 1861183 1903102 1942931 1980829 2017148
53377 2017148 2052264 2086340 2119038 2149472 2176653 2200058 2219716 2235790 2248221 2256868 2261780 2263032
53365 2263032 2260316 2253063 2241052 2224606 2204040 2179289 2150328 2117505 2081070 2040791 1996762 1950389
53353 1950389 1903785 1858049 1812757 1767241 1721714 1676909 1633303 1591092 1550445 1511293 1473222
53342 1473222 1435884 1399236 1363198 1327581 1292611 1258991 1226999 1196066 1165780 1136862 1110580
53331 1110580 1087453 1066951 1048041 1029646 1011159 993201 977419 964713 954012 943531 932820
53320 932820 922667 913408 904529 895848 887853 880734 874143 868210 863759 861084 859449 858162 857328 857116
53306 857116 857305 858181 860967 866439 873707 881268 888899 897663 908322 920537 933585 947197 961629
53293 961629 977239 993998 1011281 1028506 1046205 1065885 1088292 1112263 1135921 1158565 1180714
53282 1180714 1202653 1223862 1243730 1261891 1277804 1290891 1301366 1310219 1318054 1324456 1328718 1330677
53270 1330677 1330581 1328666 1325170 1320230 1313432 1303951 1291650 1277590 1262883 1247223 1229210 1208052 1184484
53257 1184484 1160003 1135717 1112024 1088843 1065764 1042224 1017915 993013 967863 942627 917445
53246 917445 892691 868678 845207 821878 798820 776654 755563 734953 714362 694197 675070
53235 675070 656761 638575 620525 603385 587524 572459 557828 544058 531662 520393 509666
53224 509666 499448 490193 482100 474927 468369 462220 456209 450021 443432 436276 428491 420475 413044 406547
53210 406547 400233 392990 384671 376229 368584 361843 355667 349915 344743 340324 336651 333412 330041 326150
53196 326150 321916 317812 313996 310265 306577 303208 300258 297323 293906 290011 286141 282800 280064 277577
53182 277577 274978 272363 270196 268615 267083 265032 262689 260819 259657 258577 256947 254877 252909 251312
53168 251312 249971 248729 247558 246504 245639 244969 244277 243197 241614 239868 238488 237786 237811 238471 239499 240424
53152 240424 240776 240414 239581 238652 237862 237270 236903 236844 237124 237549 237794 237690 237246 236385 234965 233251 232050 232013
53134 232013 232963 234200 235339 236420 237409 238119 238686 239576 240921 242278 243226 243869 244521 245244 245943 246625 247258
53117 247258 247595 247459 247172 247437 248732 250887 253185 254876 255670 255767 255410 254583 253277 251782 250327 248621
53101 248621 246260 243544 241280 239700 238176 236255 234413 233401 233236 233299 233109 232636 232074 231648 231445 231198
53085 231198 230550 229730 229523 230237 231141 231396 231079 230741 230377 229635 228779 228585 229226 230006 230315 230197 229821 229100 228131
53066 228131 227450 227375 227496 227193 226427 225689 225374 225509 225873 226067 225603 224296 222605 221345 220987 221244 221379 220881
53048 220881 219902 219044 218694 218680 218676 218749 219233 220164 221194 222095 222931 223601 223603 222571 220880 219443 218940 219353 220156
53029 220156 220821 221159 221226 220969 220160 218877 217809 217651 218220 218603 218284 217656 217269 217113 216992 217162 218045 219465
53011 219465 220648 220968 220456 219642 219141 219234 219591 219582 219122 218947 219679 220881 221533 221319 220817 220489 220129 219492 218840
52992 218840 218541 218596 218884 219494 220424 221290 221794 222272 223349 225127 227053 228572 229562 230186 230585 230777 230682 230276
52974 230276 229880 230089 231144 232425 232939 232361 231318 230641 230586 230894 231325 231951 233037 234708 236648 238212 238973
52957 238973 239087 238877 238223 236794 234845 233209 232273 231480 230212 228699 227535 226610 225205 223090 220931 219482
52941 219482 218848 218680 218731 218992 219530 220447 221786 223296 224432 224765 224368 223728 223375 223568 224147 224644 224671 224255
52923 224255 223721 223293 223087 223310 224042 224762 224570 223175 221296 219833 218967 218400 218027 217868 217592 216808 215820 215495
52905 215495 216202 217301 217862 217537 216606 215529 214689 214261 214067 213783 213468 213672 214734 216233 217475 218392 219584
52888 219584 221473 223764 225834 227393 228552 229399 229733 229221 227752 225575 223141 220861 219078 218172 218458
52873 218458 219855 221758 223450 224625 225463 226293 227375 228923 231064 233668 236413 239132 241919 244771 247313
52858 247313 249158 250443 251725 253321 254923 255896 255670 253811 250122 245094 240040 236288 234059 232387 230204
52843 230204 227247 223933 220809 218425 217364 217815 219116 220101 220040 219092 217888 216956 216528 216579 216830 216957 216883
52826 216883 216782 216810 217065 217771 219088 220601 221471 221340 220762 220372 220061 219526 219320 220570 223538 227115 229978
52809 229978 231784 232914 233586 233699 233288 232592 231654 230255 228292 226002 223712 221559 219516 217577 215849
52794 215849 214547 213845 213639 213458 212701 211048 208702 206318 204695 204307 205031 206378 208006 209872 211894 213810
52778 213810 215535 217281 219005 220056 219853 218733 217630 216990 216575 216274 216455 217231 217993 218048 217382 216459 215635
52761 215635 215067 214840 214702 214030 212599 211209 210945 211903 213215 214334 215667 217687 220013 221779 222619 222848
52745 222848 222883 222896 223054 223729 225237 227441 229707 231280 231784 231425 230780 230357 230297 230442 230589 230720 230958 231314
52727 231314 231551 231478 231339 231617 232319 232739 232214 230959 229822 229322 229274 229278 229207 229119 229016 228823 228416 227654 226575 225580
52707 225580 225103 225094 225068 224668 223848 222550 220724 218825 217771 218060 219174 220129 220355 219873 219068 218624 219324 221325
52689 221325 223737 225363 225849 225840 226156 227106 228486 229813 230593 230684 230392 230013 229409 228420 227457 227184 227574 227795
52671 227795 227201 226014 224892 224182 223851 223806 223929 223958 223662 223199 223136 224025 225869 227963 229400 229931 230267 231304
52653 231304 233164 235357 237762 240892 244933 249024 251930 253256 253553 253377 252633 250948 248345 245403 242892
52638 242892 241352 240858 241036 241290 241184 240716 240265 240268 240892 241966 243161 244200 244977 245647 246564 247924 249346
52621 249346 250000 249295 247303 244448 241073 237609 234824 233333 232876 232555 231892 231236 231015 231092 231100 231047 231209 231690
52603 231690 232416 233377 234512 235416 235568 234891 233877 233097 232739 232641 232620 232708 233124 234027 235329 236762 238095 239200
52585 239200 239963 240357 240622 241125 241924 242710 243321 244051 245179 246392 246963 246481 245233 243906 243127 243103 243463 243471
52567 243471 242645 241240 240010 239526 239863 240774 241864 242657 242872 242776 242985 243699 244300 244011 242891 241887 241784
52550 241784 242315 242531 241935 240925 240044 239204 238039 236741 235999 236085 236509 236755 236935 237400 238164 239058 240118 241344
52532 241344 242337 242722 242884 243673 245299 246979 247826 247740 247254 246907 247010 247750 249133 250887 252649 254272 255868
52515 255868 257583 259388 261030 262184 262728 262945 263424 264733 267132 270423 273909 276643 278019 278129 277363
52500 277363 275766 273107 269560 265854 262572 259641 256802 254296 252705 252217 252344 252426 252184 251795 251585 251749
52484 251749 252278 253075 254101 255369 256788 258068 258832 258848 258244 257589 257652 258863 260922 263086 264912 266612
52468 266612 268685 271377 274537 277758 280539 282510 283741 284739 286008 287616 289151 289962 289394 287200 283923
52453 283923 280625 277911 275388 272351 268830 265600 263253 261663 260347 258979 257491 256099 255312 255558 256562
52438 256562 257430 257577 257313 257272 257546 257730 257610 257301 256746 255579 253700 251652 250146 249364 248997 248866 249189 250140
52420 250140 251371 252202 252253 251755 251244 251111 251535 252576 254058 255448 256254 256724 257823 260270 263743 267299
52404 267299 270498 273867 278366 284602 292428 300901 308608 314418 318058 319794 319638 317298 312987 307780
52390 307780 302832 298606 295079 292255 290015 287870 285501 283365 282157 281800 281572 281234 281362 282408 284062
52375 284062 285781 287417 288987 290362 291604 293248 295705 298576 301001 302569 303559 304367 305029 305304 305031
52360 305031 304448 304119 304270 304172 302717 299915 297328 296521 297455 298881 299948 300707 301354 301866 302477 303716 305691
52343 305691 307817 309451 310398 310724 310657 310806 311896 313926 315996 317320 318103 319141 320881 323162 325680 328445
52327 328445 331898 336692 343027 350133 356752 362344 367522 373174 379501 386050 392273 397815 402624 407084
52313 407084 411750 416740 421752 426773 432269 438421 444796 451182 458142 466148 474691 482938 490864 499038
52299 499038 507567 516090 524583 533314 542051 550137 557436 564450 571342 577545 582549 586489 589714 592375
52285 592375 594672 596968 599304 601214 602358 603058 603966 605509 607740 610391 612881 614673 615825 616864 618080
52270 618080 619354 620764 622781 625585 628723 631698 634373 636480 637399 637039 636481 637122 639363 642645 646423
52255 646423 650537 654897 659521 664887 671634 679758 688453 696836 704561 711795 718889 726040 733013 739287
52241 739287 744629 749318 753559 757095 759829 762450 765743 769486 772780 775423 778140 781337 784413 786675
52227 786675 788321 790086 792331 794882 797381 799482 800995 802166 803522 805132 806365 806736 806667 807007 808063
52212 808063 809577 811444 813875 816859 819970 822811 825337 827646 829823 832174 835302 839638 844867 850013
52198 850013 854234 857600 861130 865922 872149 878961 885403 891243 896852 902414 907503 911375 913558 914227
52184 914227 914033 913443 912148 909381 904960 899683 894444 889309 883966 878754 874494 871282 868198 864462 860327
52169 860327 856432 852872 849371 845986 843006 840400 838013 836202 835593 836080 836616 836298 835271 834349 834130 834749
52153 834749 836129 837967 839643 840591 840883 841220 842331 844490 847439 850540 853072 854744 855961 857247 858400
52138 858400 858564 857277 855127 853131 851703 850535 849283 848065 847302 847412 848684 851202 854827 859385 864967
52123 864967 871947 880652 891033 902617 914664 926405 937233 946723 954549 960602 965277 969370 973419
52110 973419 977287 980732 984189 988484 993742 999113 1003839 1008172 1012960 1018770 1025760 1034029 1043348 1052624
52096 1052624 1060338 1065857 1069957 1073762 1077386 1079869 1080331 1078870 1076383 1073745 1071297 1068962 1066635 1064378
52082 1064378 1062300 1060369 1058432 1056401 1054374 1052511 1050789 1048893 1046418 1043238 1039656 1036119 1032846 1029875
52068 1029875 1027407 1025814 1025149 1024899 1024468 1023835 1023522 1023958 1025155 1027034 1029815 1033876 1039239 1045285 1051069
52053 1051069 1055939 1059899 1063291 1066149 1067980 1068240 1066889 1064374 1061193 1057648 1053869 1049880 1045687 1041505
52039 1041505 1037824 1035052 1033105 1031501 1029848 1028087 1026327 1024618 1022826 1020595 1017555 1013796 1009944 1006443
52025 1006443 1002923 998718 993867 989085 984742 980534 976367 972885 970695 969529 968687 967948 967480 967060 966053
52010 966053 964135 961534 958416 954450 949119 942190 933743 923945 912967 900983 888197 874927 861689
51997 861689 849069 837437 826753 816564 806174 795083 783373 771535 759773 747672 734710
51986 734710 720847 706407 691677 676919 662481 648405 634076 618783 602642 586582 571527
51975 571527 558058 546710 537889 531345 526370 522807 521305 522209 524754 527886 531474 536111 541863 547880
51961 547880 553240 557642 561021 562921 562670 560147 556067 551383 546477 541162 535421 529858 525233 521820
51947 521820 519559 518669 519678 522862 528074 535155 544025 554303 565406 577257 590307 604452 618411
51934 618411 630773 641381 651035 659993 667312 671773 673017 671672 668735 664967 660642 655670 649984 643856
51920 643856 637973 633435 631611 633524 639086 647255 657172 668805 682127 695982 708186 716452 718906
51907 718906 714296 702690 685961 666913 647729 629471 612623 597241 582672 568067 553425 539377
51895 539377 525841 511791 496721 481533 467456 454828 443518 433853 426304 420672 416435 413663
51883 413663 412847 414028 416799 421069 427065 434559 442871 451774 461705 472679 483536 492664 499238 503426
51869 503426 505698 506305 505279 502578 498237 492657 486736 481438 477080 473213 469384 465900 463566 462655 462466
51854 462466 462087 461320 460448 459307 457177 453701 449324 444502 438935 432042 423997 415821 408492 402291 396951
51839 396951 392155 387846 384333 382128 381546 382390 384021 385672 386738 387147 387592 389075 391872 395090 397474
51824 397474 398467 398317 397539 396645 396142 396264 396760 397296 397975 399132 400804 402710 404570 406073 406762 406438 405459
51807 405459 404198 402464 400032 397449 395537 394214 392675 390780 389384 389061 389374 389772 390448 391783 393523
51792 393523 395052 396051 396433 396048 394885 393222 391279 389082 386942 385507 384899 384376 383360 382297 381879 381915
51776 381915 381789 381776 383003 386136 390802 396393 402802 410185 418410 426904 434800 441256 445928 449068 451003
51761 451003 451666 450881 448835 445925 442377 438406 434449 430736 426877 422405 417519 412720 407942 402703 396997
51746 396997 391401 386455 382622 380650 380999 382842 384565 385535 386578 388535 391184 393994 397010 400367 403613
51731 403613 406249 408527 411071 414004 416946 419554 421573 422735 423170 423719 425317 428128 431548 434706 436650
51716 436650 436522 434231 430799 427574 425209 423722 423100 423222 423461 423087 422053 420860 419783 418829 418323 418785
51700 418785 420063 421175 421177 419825 417350 414194 411091 408888 407997 408320 409680 411873 414189 415530 415276 413604
51684 413604 410767 406637 401316 395662 390653 386580 383317 381014 379919 379719 379720 379649 379696 379783 379443 378791 379075
51667 379075 381618 386346 391831 396907 401902 408021 415757 424324 432562 439878 445975 450145 451531 450157
51653 450157 447172 443918 441173 439452 439442 441577 445366 449659 453493 456335 457669 456866 453548 447793 439953
51638 439953 430588 420579 410870 401971 394030 387404 382659 379795 377940 376225 374660 373754 373562 373592 373486
51623 373486 373230 372756 371933 371105 370989 371725 372455 372239 371128 369849 368713 367344 365436 363254 361267 359678
51607 359678 358443 357479 356653 355857 355280 355373 356343 357815 359155 360045 360663 361559 363571 367595 374024 382326 391396
51590 391396 400309 408580 415749 421108 424092 424804 423918 422053 419401 416071 412688 410422 410300 412612 417125
51575 417125 423719 432500 443261 455241 467624 480063 492529 504902 517034 529070 541333 553973
51563 553973 567001 580617 595245 611343 629524 650806 676228 705949 738855 773070 806597
51552 806597 837476 863889 884476 898475 905378 904717 896385 880938 859308 832451 801499 768029
51540 768029 733610 699080 664619 630619 598174 568612 542827 521124 503402 489189 477671
51529 477671 467982 459566 452214 445879 440601 436578 434083 433226 433797 435311 437181 438969 440599 442304 444193
51514 444193 445907 446875 446831 445872 444011 441008 436827 431985 427186 422765 418712 415005 411525 407833 403539
51499 403539 398922 394712 391125 387589 383674 379815 376726 374439 372372 370198 368176 366684 365793 365325 365012
51484 365012 364576 363862 362921 361809 360429 358745 357013 355524 354281 353262 352807 353274 354326 355071 354983 354344
51468 354344 353728 353399 353303 353263 353029 352439 351624 350805 349895 348694 347463 346764 346685 346753 346849 347594 349464 352061 354704
51449 354704 357281 360038 362975 366084 369877 374994 381398 388518 396080 404190 412572 420344 426716 431493
51435 431493 434840 437021 438552 440185 442385 444900 446926 447528 445993 442123 436348 429364 421633 413436
51421 413436 405350 398305 392983 389380 387029 385490 384600 384439 385074 386158 386945 387009 386843 387234 388065 388363 387682
51404 387682 386741 386316 386118 385443 384514 384352 385378 386945 388477 390416 393680 398466 404039 409538 414745 420151
51388 420151 426533 434476 444147 455437 468262 482662 498717 516720 537524 562339 591750 625092
51376 625092 661239 699949 741928 787298 834377 880208 922087 958304 987788 1009544 1022487
51365 1022487 1025548 1018008 1000114 973385 939998 901805 860143 816360 771971 728185 685801 645757
51353 645757 609256 577004 548713 523694 501659 482574 466082 451544 438510 426735 415941
51342 415941 405900 396651 388253 380523 373396 367304 362699 359301 356300 353278 350491 348295 346751 345728
51328 345728 344953 343928 342323 340450 338963 338070 337515 337262 337588 338496 339710 341406 344183 348053 352152 355870
51312 355870 359634 364044 368763 372873 375924 377997 379033 378781 377339 375172 372647 369970 367423 365155
51298 365155 362745 359509 355319 350773 346501 342634 338984 335463 332232 329689 328278 328090 328728 329729 331022
51283 331022 332681 334433 335894 337306 339565 343305 348206 353310 357771 361200 363603 365246 366481 367564
51269 367564 368614 369745 371027 372379 373639 374827 376192 377907 379842 381625 382902 383545 383661 383385 382610
51254 382610 381137 379197 377582 376942 377055 377059 376345 374946 373171 371217 369210 367262 365358 363368 361247 359095
51238 359095 357026 355145 353534 352015 350049 347272 344174 341913 341316 342303 344195 346180 347478 347612 346887
51223 346887 346251 346425 347340 348563 349961 351714 353993 356881 360318 363859 366786 368830 370582 372840 375701
51208 375701 378643 381277 383614 385700 387506 389189 391101 393369 395704 397652 398891 399326 399127 398620 397948
51193 397948 396901 395354 393703 392491 391687 390804 389690 388673 387840 386776 385311 384042 383652 384038 384531 384815
51177 384815 385185 386000 387227 388509 389434 389751 389498 388883 387931 386460 384516 382591 381133 380108 379419 379388 380299
51160 380299 381680 382717 383399 384567 386666 389105 391107 392626 394003 395220 395999 396268 395993 394821 392454
51145 392454 389285 386157 383499 381029 378271 375011 371366 367743 364680 362381 360492 358699 357389 357184
51131 357184 357863 358362 358050 357495 357771 359353 361886 364669 367159 369370 372039 376058 381429 387051 391811
51116 391811 395582 398896 401996 404657 406742 408426 409852 410946 411673 412263 413104 414460 416237 417973 419188
51101 419188 419817 420138 420215 419735 418592 417281 416352 415683 414674 413041 411017 408865 406594 404184 401775 399525
51085 399525 397504 395772 394375 393318 392733 392934 394006 395382 396207 396270 396292 397107 398749 400506 401784 402727
51069 402727 403941 405710 407678 409401 411085 413478 416996 421292 425851 430742 436617 444203 453979 465946
51055 465946 479387 493115 506331 519085 531596 543526 554380 564335 574053 583883 593773 603777
51043 603777 613869 623266 630640 635192 636938 635963 632168 625951 618373 610209 601441 592083 582979 575207
51029 575207 568984 563599 558100 551745 544252 536164 528820 523491 520597 519887 520945 523183 525758 528097
51015 528097 530375 533037 536066 539153 542311 545775 549370 552649 555700 559358 564461 571168 579013 587328
51001 587328 595588 603655 611752 619997 628072 635520 642182 647959 652363 654865 655662 655538 654890 653469 651261
50986 651261 648980 647210 645519 643050 639877 637224 636332 637499 640362 644665 650355 657062 663902 669943
50972 669943 674787 678622 681933 685323 689497 695179 702971 713353 726658 742805 761166 781071 802464
50959 802464 825708 850676 876446 902091 927343 952236 976529 999949 1022705 1045247 1067599
50948 1067599 1089360 1110293 1130571 1150512 1170504 1191124 1212967 1236301 1261118 1287328 1314469
50937 1314469 1341318 1366228 1387921 1405658 1418877 1427279 1431284 1431704 1428664 1421391 1409353 1393173
50925 1393173 1374019 1352462 1328251 1300915 1270166 1236011 1199044 1160583 1122094 1084358 1047471
50914 1047471 1011670 977840 947033 919578 894828 871755 849711 828621 808624 789831 772501
50903 772501 757052 743510 731086 718775 706435 694953 685212 677225 670345 663923 657619 651474 646057
50890 646057 642245 640482 640257 640493 640360 639686 638854 638519 639123 640434 641746 642754 644006 646243 649519 653311
50874 653311 657247 661341 665674 670302 675460 681469 688405 696085 704370 713216 722498 732165 742541 754136
50860 754136 767145 781471 797240 814882 834561 855903 878540 902721 929180 958537 990951
50849 990951 1026221 1064096 1104593 1148015 1194505 1243645 1294717 1347420 1402042 1458822 1517358
50838 1517358 1576602 1635070 1691058 1743199 1791191 1835620 1876792 1914148 1947243 1976790 2004139
50827 2004139 2029995 2054467 2078265 2102994 2130009 2159649 2191879 2226954 2264892 2304716 2344733
50816 2344733 2383139 2417857 2446184 2465539 2474602 2473119 2460567 2435740 2397909 2347894 2287662 2219303
50804 2219303 2144673 2065559 1983602 1900208 1816865 1735452 1657884 1585537 1519233 1459544 1406702
50793 1406702 1360335 1319797 1284851 1255789 1232869 1215873 1204117 1196547 1191893 1189140 1187961 1188338
50781 1188338 1189722 1190992 1191355 1190799 1189396 1186661 1182037 1175735 1168505 1160687 1151938 1141865 1130477 1117889
50767 1117889 1103992 1088633 1071929 1054240 1035919 1017241 998399 979441 960305 941095 922356
50756 922356 904975 889736 876940 866359 857479 849817 843122 837482 833324 831192 831336 833592 837825
50743 837825 844415 853999 866670 881811 898972 918605 941516 967732 996330 1026404 1057742 1090482
50731 1090482 1124518 1159561 1195408 1231689 1267431 1301352 1332771 1361986 1389616 1415743 1439957
50720 1439957 1462057 1482256 1500524 1516056 1527785 1535399 1539506 1540800 1539550 1536158 1531849 1528307 1526712
50707 1526712 1527566 1531399 1539089 1551217 1567472 1587014 1609133 1633140 1657729 1680935 1700990 1717010
50695 1717010 1728746 1735752 1736985 1731249 1718034 1698016 1672810 1644221 1613632 1581954 1550001 1518759
50683 1518759 1489264 1462201 1437646 1415227 1394592 1375816 1359388 1345875 1335667 1329059 1326424 1328161
50671 1328161 1334424 1344996 1359492 1377631 1399190 1423611 1449667 1475686 1500267 1522838 1543541
50660 1543541 1562641 1580137 1595932 1610158 1623220 1635553 1647361 1658521 1668716 1677778 1686020 1694183
50648 1694183 1702969 1712633 1723137 1734642 1747779 1763437 1782308 1804605 1830147 1858738 1890474 1925536
50636 1925536 1963539 2003215 2042906 2081377 2118027 2152392 2183743 2211304 2234713 2254204 2270473
50625 2270473 2284450 2296952 2308299 2318149 2325607 2329213 2326769 2315696 2294242 2262791 2224075 2182185
50613 2182185 2141249 2104565 2074258 2051346 2036054 2028060 2026355 2029063 2033782 2038256 2040622 2039093 2031812
50600 2031812 2017296 1994916 1964785 1927336 1883185 1833268 1778896 1721597 1663011 1604815 1548554
50589 1548554 1495421 1446135 1400934 1359625 1321736 1286775 1254365 1224248 1196325 1170714 1147611
50578 1147611 1127029 1108859 1093202 1080345 1070346 1063005 1058478 1057543 1060769 1067573 1076510 1086381 1096625
50565 1096625 1106826 1116540 1125865 1135624 1146619 1158978 1172487 1187238 1203654 1222108 1242881 1266320
50553 1266320 1292581 1321206 1351224 1381774 1412443 1442963 1472792 1501170 1527637 1552445 1576482
50542 1576482 1600764 1626042 1652854 1681734 1713120 1747181 1784120 1824713 1870178 1921293 1977878
50531 1977878 2039367 2105671 2177254 2254560 2337643 2426226 2519817 2617866 2720000 2825971 2935039
50520 2935039 3045433 3154652 3260234 3360009 3451745 3532995 3601411 3654980 3691932 3710765 3710489
50509 3710489 3690765 3651883 3594926 3522003 3436030 3340114 3237339 3131115 3025265 2923545
50499 2923545 2829230 2745289 2674506 2618985 2579615 2556287 2548560 2555829 2576883 2609537 2650637 2696242
50487 2696242 2741824 2782606 2813985 2831886 2833073 2815476 2778287 2721768 2647180 2557080 2455339
50476 2455339 2346312 2233720 2120391 2008812 1901403 1799982 1705303 1617460 1536646 1463323
50466 1463323 1397785 1339832 1288939 1244617 1206558 1174461 1147715 1125327 1106314 1090172 1076804
50455 1076804 1065921 1056740 1048458 1040812 1034017 1028344 1024067 1021693 1021809 1024631 1029976 1037704 1047866 1060286
50441 1060286 1074339 1089366 1105139 1121685 1138832 1156128 1173081 1189220 1204021 1217035 1228148
50430 1228148 1237686 1246278 1254677 1263460 1272689 1281943 1290837 1299405 1307890 1316420 1325240 1335075 1346880 1361273
50416 1361273 1378570 1399337 1424418 1454293 1488774 1527492 1570317 1617083 1667232 1720057 1775082
50405 1775082 1831882 1889640 1947143 2003150 2056623 2106725 2152772 2193972 2228909 2255388 2271131
50394 2271131 2274768 2266138 2245741 2214144 2171930 2120017 2059985 1994124 1925136 1855610 1787785 1723770
50382 1723770 1665706 1615426 1573849 1540861 1515836 1498386 1488717 1487320 1494111 1507679 1525457 1544675
50370 1544675 1563002 1578366 1588666 1592145 1587874 1575549 1554945 1526011 1489425 1446688 1399626 1350070
50358 1350070 1299866 1250550 1202804 1156561 1111941 1069796 1031177 996540 965747 938565 914787
50347 914787 894027 875834 860188 847682 839045 834491 833540 835432 839627 845789 853240 860503 865606
50334 865606 866927 863832 856696 846528 834570 821976 809692 798499 789022 781517 775790 771644 769376
50321 769376 769525 772079 776300 781474 787480 794352 801575 808257 813938 818915 823689 828391 832841 836957
50307 836957 840875 844750 848609 852487 856622 861407 867149 873880 881363 889150 896683 903451 909192 913890
50293 913890 917618 920583 923303 926403 930003 933538 936414 938474 939469 938399 934127 926648 917160 906773
50279 906773 895848 884821 874989 867782 863577 861731 861618 863097 866076 870145 874904 880340 886748 894284
50265 894284 902548 910534 917129 921910 925451 928788 932675 937337 942632 948251 953993 960073 966989 974842
50251 974842 983100 991320 999846 1009348 1019918 1031132 1042860 1055356 1068486 1081415 1093307 1103973
50239 1103973 1113697 1122821 1131705 1140698 1149826 1158709 1166907 1174108 1179815 1183227 1183722 1181202 1175728 1167153
50225 1167153 1155554 1141833 1127456 1113585 1100815 1089626 1080577 1073815 1068608 1063543 1057148 1048353
50213 1048353 1036616 1021792 1003912 983114 959949 935667 911873 889705 869395 850662 833338
50202 833338 817538 803413 790959 779934 769796 759859 749800 740005 731108 723170 715549 707739 700021
50189 700021 693059 687016 681454 676125 671489 668280 666663 665991 665355 664295 663106 662522 663064 664550 666259
50174 666259 667628 668713 669975 671715 673864 676213 678640 681103 683620 686313 689333 692597 695724 698392
50160 698392 700721 703194 706161 709477 712632 715203 717213 719168 721751 725327 729694 734337 738897 743232
50146 743232 747105 750123 752210 753837 755452 756870 757755 758674 761054 765854 772840 781549 792576 807267
50132 807267 826364 849575 876353 906425 939404 974480 1010780 1047636 1084261 1119613 1152986
50121 1152986 1184531 1214899 1244460 1273023 1300033 1324761 1346382 1364021 1376616 1382815 1381478 1372549
50109 1372549 1357076 1336075 1309762 1278353 1243197 1206517 1170121 1134895 1101402 1070242 1041655
50098 1041655 1015355 991084 968977 949080 930832 913356 896185 879502 863748 849167 835711
50087 835711 823324 812258 802960 795505 789263 783381 777615 772394 768053 764332 760771 757368 754613 752961
50073 752961 752377 752360 752415 752625 753763 756654 761363 767116 773011 778655 784145 789727 795557 801566 807408 812710
50057 812710 817439 821855 825975 829334 831413 832214 832225 831945 831511 830701 829169 826796 823938 821278 819371 818360
50041 818360 818076 818256 818670 819303 820541 823009 827035 832373 838486 845010 851821 858884 866230 874039 882544
50026 882544 891794 901512 911184 920355 928947 937248 945436 953207 960182 966690 973760 982115 991405 1000682
50012 1000682 1009444 1018012 1027106 1037385 1049324 1063129 1078566 1095004 1111685 1127928 1143136 1156853
50000 1156853 1169018 1180121 1190889 1201589 1211587 1219662 1224728 1226067 1222824 1213747 1197854 1175312
49988 1175312 1147217 1114595 1078075 1038692 998427 959448 922886 888554 855821 824689 796156
49977 796156 771651 751953 736525 723973 713145 703659 695495 688516 682467 677057 671932 666923 662488
49964 662488 659448 658040 657676 657897 659053 661618 665319 669591 674585 681005 689069 698305 708337 719138
49950 719138 730285 740580 748759 754368 757756 759500 760015 759434 757605 754267 749321 742871 735010 725707
49936 725707 714930 702816 689868 677048 665406 655293 646070 636904 627738 619145 611456 604536 598402
49923 598402 593455 589936 587538 585808 584658 584320 585026 586849 589695 593388 597857 603164 609126 615170 620992
49908 620992 627208 634819 644061 654352 665266 676821 688622 699545 708759 716523 723518 729858 735212
49895 735212 739424 742473 744140 744255 742967 740214 735225 727221 716546 704571 692552 681032 670214
49882 670214 660265 651082 642276 633577 625042 616807 608969 601662 594976 588793 583090 578357 575275 573909
49868 573909 573613 573826 574604 576306 579207 583480 589060 595308 601384 607345 614468 623942 635504 647811
49854 647811 659885 671545 682539 692042 699415 704929 709261 712522 714224 714083 712387 709466 705190 699194
49840 699194 691418 682245 672319 662449 653466 645794 639200 633261 628082 624219 621897 620684 620074 620044 620830
49825 620830 622547 625317 629369 634572 640122 645277 650301 656145 663210 670965 678796 686561 694033 700440
49811 700440 705116 708308 710761 712668 713518 712954 711220 708620 704973 699959 693787 687174 680654 674164 667406
49796 667406 660418 653608 647287 641347 635499 629672 624061 618849 614067 609749 606072 603258 601373 600317
49782 600317 599987 600422 601760 603965 606646 609295 611839 614824 618915 624270 630608 637756 645778 654471 663002
49767 663002 670270 675556 678818 680525 681352 681801 681891 681206 679313 676106 671736 666347 660032 652911 645147
49752 645147 636898 628355 619733 611173 602730 594551 586935 580155 574312 569465 565747 563211 561679 560901
49738 560901 560757 561171 561922 562725 563434 564028 564560 565347 567065 570244 574572 579000 582753 586183 590530 596929
49722 596929 605551 615543 625706 635332 644411 653024 660792 667245 672585 677472 681902 684784 685025 682688
49708 682688 678614 673159 665922 656762 646511 636512 627774 620724 615350 611278 608010 605417 603852 603488
49694 603488 603800 604129 604570 605812 608168 611280 614929 619508 625402 632336 639802 647758 656404 665484 674512
49679 674512 683703 694030 706154 719745 734096 748994 764548 780403 795505 808481 817980 822951
49667 822951 823222 819934 814994 809813 804635 799172 793631 788942 786027 784917 784457 782851 778664 771543 762083
49652 762083 751107 739143 726573 714003 702259 691986 683389 676379 670877 666875 664257 662708 661931
49639 661931 661869 662615 664125 666171 668498 670793 672469 672822 671614 669220 665994 661762 656327 650240 644577
49624 644577 639956 636262 633319 631271 630112 629383 628712 628244 628153 628088 627634 627112 627308 628456 629998 631431 632879
49607 632879 634624 636553 638344 639912 641294 642352 642994 643581 644716 646592 648845 651126 653502 656137 658839
49592 658839 661207 663148 664990 667038 669200 671126 672616 673807 675071 676841 679437 682821 686488 689721
49578 689721 692094 693710 694938 696085 697408 699292 702102 705824 710098 714747 720083 726465 733731 741384
49564 741384 749315 757933 767432 777233 786451 794677 801972 808255 813114 816224 817547 817104 814971 811663
49550 811663 808094 804869 801900 798978 796307 794155 792313 790458 788858 788100 788129 788131 787511 786566 786061 786523 788070
49533 788070 790530 793456 796330 799045 802151 806641 813636 824086 838234 855274 874029 894091 915830
49520 915830 939116 962580 984377 1003093 1017630 1027036 1031284 1031821 1030605 1028805 1026891 1025484 1025123
49507 1025123 1025349 1024943 1023146 1019859 1014590 1006153 993849 978353 961058 943049 925028 907708 891699
49494 891699 877191 864075 852283 841855 832911 825600 819807 814936 810434 806556 803993 802648 801506
49481 801506 800069 799223 800053 802326 804818 806781 808390 809957 811416 812618 813636 814695 816067 817921 820008
49466 820008 821777 823162 824926 827695 830900 833357 834729 835702 836766 837646 838041 838137 837995 837039 834644 830804
49450 830804 825876 820056 813654 807540 802705 799330 796649 793761 790348 786687 783326 780829 779566 779497 780246
49435 780246 781593 783918 787999 794188 801898 810185 818828 828511 839753 852096 864742 877621 891191
49422 891191 905358 919267 932277 944370 955268 963785 968658 969776 968186 965178 961840 959200 958092
49409 958092 958707 960661 963572 967332 971825 976889 982763 990195 999725 1010951 1022805 1034540 1046265
49396 1046265 1058525 1071646 1085568 1099984 1114293 1127535 1138823 1148009 1155680 1162294 1167556 1170855
49384 1170855 1172039 1171365 1168887 1164381 1157938 1150164 1141707 1132929 1124132 1115732 1108048 1101262 1095790 1092314
49370 1092314 1091251 1092492 1095876 1101416 1108669 1116359 1123263 1129290 1135093 1140697 1145185 1147786 1148693 1148541
49356 1148541 1147525 1145375 1141883 1137099 1131220 1124623 1117938 1111806 1106508 1102033 1098477 1096119 1094963 1094356
49342 1094356 1093302 1091299 1088705 1086227 1084064 1081760 1078790 1075031 1070569 1065390 1059597 1053801 1048953 1045648
49328 1045648 1043680 1042347 1041120 1040047 1039545 1039828 1040648 1041777 1043651 1047100 1052298 1058435 1064793 1071766 1080291
49313 1080291 1090536 1101852 1113959 1127421 1142669 1159190 1176030 1192613 1208513 1222736 1233812
49302 1233812 1240565 1242501 1239558 1231958 1220428 1206229 1190726 1174882 1159116 1143551 1128383 1114086
49290 1114086 1101184 1089845 1079777 1070614 1062235 1054688 1048001 1042216 1037421 1033575 1030503 1028247 1027105
49277 1027105 1026965 1026796 1025309 1022184 1018320 1014849 1012268 1010514 1009449 1009064 1009458 1010824 1013184 1016028 1018541
49262 1018541 1020435 1022280 1024720 1027639 1030482 1033235 1036644 1041465 1047808 1055178 1062816 1069936 1075965 1080638
49248 1080638 1083614 1083938 1080237 1071641 1058421 1041676 1022715 1002824 983236 964913 948365 933869
49236 933869 921649 911638 903300 896116 890203 886146 884255 884334 886125 889583 894602 900815 907869 915697
49222 915697 924361 933837 943998 954591 965013 974328 981705 986815 989742 990791 990496 989553 988445 987273
49208 987273 986179 985724 986544 988770 992118 996483 1002092 1009083 1017243 1026252 1035970 1046405 1057597 1069546
49194 1069546 1082047 1094531 1106263 1116726 1125705 1133083 1138867 1143399 1147206 1150524 1153273 1155549 1157871
49181 1157871 1160806 1164699 1169942 1177154 1186873 1199398 1215202 1235167 1259947 1289251 1322107 1357598
49169 1357598 1394877 1432587 1468773 1501378 1528410 1547801 1558048 1559520 1554736 1546810 1537648 1527748
49157 1527748 1517181 1506129 1494556 1482073 1468467 1454221 1440365 1427945 1417614 1409454 1403116 1398260
49145 1398260 1394975 1393621 1394263 1396523 1400016 1404643 1410241 1416282 1422338 1428712 1436213 1445238 1455383 1466048
49131 1466048 1477083 1488682 1500889 1513504 1526331 1539225 1551940 1564278 1576456 1589098 1602712
49120 1602712 1617288 1632628 1648982 1667235 1688413 1713115 1741487 1773672 1810232 1852157 1900580
49109 1900580 1956495 2020645 2093582 2175646 2266601 2364832 2466758 2567469 2662726 2750809 2832183
49098 2832183 2906804 2971342 3018869 3041618 3034991 3000181 2943628 2873493 2795624 2712053 2622810
49087 2622810 2528727 2432474 2337662 2247871 2166368 2095713 2036865 1988900 1949990 1918541 1893302
49076 1893302 1872912 1856001 1841677 1829435 1818622 1808437 1798556 1789340 1781178 1773936 1767292 1761330
49064 1761330 1756410 1752450 1748693 1744349 1739311 1734016 1728755 1723421 1718042 1713220 1709672 1707425 1705872 1704799
49050 1704799 1704986 1707477 1712480 1719323 1727296 1736148 1745806 1756206 1767613 1780635 1795382 1810707 1824622
49037 1824622 1835525 1842932 1847291 1849558 1851008 1852999 1856468 1861614 1868109 1875512 1883399 1891345 1899066 1906562
49023 1906562 1913871 1920653 1926288 1930441 1933377 1935623 1937538 1939336 1941256 1943432 1945764 1948287 1951572 1956334
49009 1956334 1962584 1969597 1976878 1984807 1994036 2004556 2015712 2026926 2038034 2048955 2059503 2069573
48997 2069573 2079231 2088534 2097451 2106056 2114601 2123306 2132198 2141164 2149988 2158327 2165858 2172466 2178144 2182779
48983 2182779 2186339 2189261 2192280 2195660 2198884 2201259 2202496 2202469 2200755 2196913 2191074 2183862 2175727 2166722
48969 2166722 2156917 2146643 2136197 2125602 2114846 2104194 2094113 2085066 2077470 2071697 2067939 2066062
48957 2066062 2065636 2066114 2067088 2068679 2071692 2077114 2085250 2095507 2107125 2119798 2133353 2147080 2159891
48944 2159891 2171196 2181310 2190963 2200781 2211352 2223360 2237263 2252923 2269921 2288250 2308504 2331298
48932 2331298 2356652 2383931 2412261 2441044 2470286 2500535 2532376 2565955 2601051 2637525 2675460
48921 2675460 2714833 2755430 2797286 2840874 2886431 2933198 2979735 3025108 3069580 3114156 3159698
48910 3159698 3206365 3253405 3299358 3342951 3384221 3424563 3465355 3506688 3547647 3587461 3625903
48899 3625903 3662787 3697822 3731093 3763139 3794274 3824161 3852302 3878524 3902625 3923879 3941466
48888 3941466 3955301 3966050 3974334 3980351 3984297 3986618 3987548 3986724 3983595 3977982 3969927 3959205 3945460
48875 3945460 3928741 3909408 3887358 3861773 3831985 3798315 3761821 3723432 3683687 3643061 3602041
48864 3602041 3560829 3519389 3477855 3436563 3395611 3354805 3314208 3274303 3235364 3197096 3159304
48853 3159304 3122621 3088080 3056094 3026225 2997838 2970586 2944417 2919586 2896681 2876208 2858201
48842 2858201 2842577 2829777 2820431 2814380 2810596 2808262 2807418 2808366 2811019 2815190 2821043 2828770 2838201 2849175
48828 2849175 2862007 2877092 2894201 2912590 2931753 2951720 2972738 2994844 3017616 3040149 3061612
48817 3061612 3082130 3102849 3124738 3147594 3170565 3193246 3215690 3237667 3258667 3278625 3297997
48806 3297997 3317125 3336132 3355494 3375974 3397698 3419861 3441703 3463439 3485858 3509213 3532758
48795 3532758 3555233 3575767 3594436 3611985 3628854 3644638 3658771 3671471 3683523 3695272 3706428
48784 3706428 3716746 3726127 3733907 3738769 3739674 3736436 3729337 3718945 3706491 3693460 3680261 3665908 3649491
48771 3649491 3631248 3611696 3590537 3567287 3542304 3516199 3488651 3458880 3427085 3394401 3361521
48760 3361521 3328315 3294802 3261440 3228171 3194102 3158707 3122799 3087834 3054566 3022651 2991322
48749 2991322 2960185 2929529 2899925 2871399 2843211 2814861 2787161 2761685 2739171 2719033 2700422
48738 2700422 2683062 2666895 2651739 2637673 2625157 2614180 2603769 2592885 2581605 2570992 2562011
48727 2562011 2554903 2549396 2545147 2542010 2540136 2539738 2540653 2542296 2544090 2545694 2546819 2547279 2547415 2547950 2549116
48712 2549116 2550300 2550939 2551392 2552552 2554862 2558109 2561852 2565672 2569306 2573052 2577812 2584212 2591786 2599514
48698 2599514 2606998 2614581 2622468 2630418 2638372 2646697 2655570 2664591 2673351 2681932 2690469 2698484 2705140 2710131
48684 2710131 2714047 2717876 2722378 2727961 2734804 2742820 2751467 2759825 2767046 2772751 2776967 2779788 2781245 2781436
48670 2781436 2780607 2779114 2777399 2775903 2774636 2772845 2769415 2763706 2755698 2745385 2732564 2717379 2700443
48657 2700443 2682018 2661555 2638552 2613411 2586851 2558948 2529660 2500073 2472117 2446859 2423874
48646 2423874 2402530 2383011 2365591 2349567 2333642 2317023 2299678 2281828 2263799 2246172 2229457
48635 2229457 2213590 2198156 2183032 2168350 2153809 2138534 2121855 2103871 2085110 2065935 2046596
48624 2046596 2027635 2009804 1993523 1978669 1965012 1952759 1942537 1934796 1929289 1925155 1921652 1918848
48612 1918848 1917544 1918370 1920946 1924026 1926533 1928322 1929867 1931410 1932658 1933291 1933445 1933607 1934299 1936013 1939132
48597 1939132 1943598 1948692 1953476 1957490 1960794 1963344 1964663 1964255 1962139 1958769 1954561 1949692 1944227 1938228
48583 1938228 1931762 1925024 1918482 1912657 1907659 1903082 1898497 1893907 1889624 1885941 1883213 1882107 1883220 1886293
48569 1886293 1890198 1894076 1898219 1903476 1909940 1916620 1922298 1926209 1927858 1926693 1922233 1914363 1903338 1889765
48555 1889765 1874629 1858927 1843137 1827324 1811889 1797739 1785382 1774192 1762931 1750725 1737254
48544 1737254 1722491 1706810 1691096 1676017 1661254 1646046 1630529 1615859 1602868 1591184 1579995
48533 1579995 1569155 1559093 1549999 1541736 1534538 1529334 1527111 1528053 1531450 1536481 1543057 1551872 1563594
48520 1563594 1578012 1593915 1609575 1623200 1633091 1637721 1635860 1626849 1611167 1590957 1569632 1550340
48508 1550340 1534602 1522581 1514351 1510370 1510754 1514749 1521290 1529749 1539916 1551623 1564755 1579471 1596034
48495 1596034 1614290 1633243 1650926 1664615 1671614 1670282 1660555 1643577 1621111 1595225 1568054 1541381
48483 1541381 1516418 1494029 1474867 1459119 1446409 1436284 1428649 1423423 1419944 1417172 1414541 1412342
48471 1412342 1411234 1411588 1413309 1415948 1418824 1421335 1423428 1425667 1428673 1432507 1436786 1441288 1446143 1451319
48457 1451319 1456221 1460120 1462894 1464975 1466454 1466579 1464427 1459883 1453657 1446438 1438315 1429098 1418905 1408271
48443 1408271 1397690 1387099 1375792 1363021 1348782 1333928 1319411 1305537 1292157 1279317 1267362
48432 1267362 1256494 1246741 1238387 1231931 1227344 1223715 1220008 1216066 1212592 1210170 1208504 1206639 1203849 1200208
48418 1200208 1196287 1192369 1188152 1183293 1177918 1172384 1166684 1160441 1153379 1145523 1137113 1128686 1121055 1114632
48404 1114632 1108774 1102379 1095207 1088076 1081665 1075766 1069975 1064465 1059579 1055170 1050845 1046563 1042493 1038540
48390 1038540 1034494 1030410 1026398 1022204 1017447 1012137 1006580 1000983 995602 991113 988201 986694 985528 983688
48376 983688 980947 977659 974262 971110 968480 966483 964997 963730 962380 960816 959274 958149 957462 956685 955391
48361 955391 953883 952802 952225 951657 950940 950696 951621 953649 956143 958732 961728 965789 971356 978433 986809
48346 986809 996407 1007481 1020439 1035446 1052020 1068824 1083844 1095097 1101574 1103679 1102811 1100542 1098182
48333 1098182 1096849 1097575 1101111 1107692 1117137 1129258 1144190 1162278 1183760 1208716 1237253 1269476
48321 1269476 1305207 1344132 1386389 1432680 1483549 1539114 1600014 1668203 1746178 1835935 1939746
48310 1939746 2061908 2208915 2388338 2609080 2883088 3225561 3653034 4182525 4833028
48301 4833028 5626009 6582596 7720771 9056407 10605759 12382412 14382697 16557828
48293 16557828 18779848 20823765 22396062 23218283 23130103 22150900 20463735 18339241 16049156
48284 16049156 13808500 11755188 9956322 8427242 7152672 6103275 5245688 4547750
48276 4547750 3980862 3520360 3145010 2836974 2582294 2370743 2194597 2047343 1923245
48267 1923245 1817639 1727135 1649289 1582026 1523439 1472151 1427474 1388798 1355035 1325147 1299039
48256 1299039 1277160 1259045 1243052 1227841 1213420 1200291 1188255 1176746 1165873 1156344 1148647 1142944
48244 1142944 1139584 1138945 1140798 1144423 1149465 1156197 1164736 1174322 1183358 1189935 1192458 1190301 1184120 1175316
48230 1175316 1165151 1154432 1143833 1134052 1125472 1117909 1110800 1103632 1096232 1088811 1081705 1074916 1067953
48217 1067953 1060217 1051541 1042223 1032552 1022343 1011011 998145 984076 969743 955785 941963 927748
48205 927748 913244 899023 885164 871201 857150 843845 831925 821133 811012 801639 793128 785053
48193 785053 777025 769350 762361 755559 748304 741016 734761 729744 725159 720475 715936 711650 707179 702430
48179 702430 698130 694891 692343 689631 686384 682797 679165 675741 672751 670214 667954 665974 664473 663267
48165 663267 661703 659572 657706 657072 657462 657620 656662 654892 653162 651826 650555 648984 647277 645980 645388
48150 645388 645180 644826 644288 644068 644564 645629 646929 648394 650090 651862 653452 654904 656524 658439 660456
48135 660456 662383 664219 665944 667363 668383 669297 670547 672219 674064 676026 678489 681701 685192 688159
48121 688159 690440 692629 695092 697299 698548 698984 699387 700066 700609 700809 701245 702590 704755 707117 709427 712033
48105 712033 715247 718811 722128 724882 727355 730134 733529 737255 740789 743993 747255 750952 754954 758754
48091 758754 761951 764462 766441 768224 770290 772973 776140 779310 782114 784477 786349 787587 788285 788989 790257
48076 790257 792078 794072 796249 799159 803131 807726 812274 816634 821125 825971 831330 837690 845516 854391
48062 854391 863101 870835 877733 883908 888581 890828 890911 890144 889470 888664 886956 883904 879560 874221 868252
48047 868252 861937 855373 848637 842001 835761 829910 824172 818328 812195 805469 798009 790279 782996 776299
48033 776299 769688 762887 756201 749750 742944 735202 726871 718909 711793 705188 698587 691799 684819 677690
48019 677690 670692 664319 658771 653645 648366 642880 637689 633195 629247 625463 621834 618729 616366 614561
48005 614561 613150 612366 612526 613445 614455 615007 615091 615051 615169 615379 615249 614301 612550 610647 609260 608326 607185
47988 607185 605441 603438 601827 600933 600587 600356 599811 598798 597544 596377 595304 594061 592600 591239 590202
47973 590202 589201 587656 585234 582155 579065 576580 574738 572868 570238 566861 563464 560693 558590 556794
47959 556794 554879 552426 549232 545644 542394 539885 537908 536169 534710 533600 532610 531585 530851 530884 531687
47944 531687 532810 533861 534741 535526 536418 537699 539488 541632 543946 546479 549334 552448 555672 558918 562083
47929 562083 565119 568323 572176 576591 580714 583851 586278 588630 590878 592528 593602 594631 595712 596350
47915 596350 596391 596440 596988 597693 597868 597238 595838 593624 590677 587556 584878 582599 580098 576967 573412 569892
47899 569892 566671 563873 561766 560790 561273 563086 565619 568157 570363 572360 574341 576274 578037 579633 581153
47884 581153 582656 584303 586432 589208 592200 594618 596108 597134 598534 600833 604040 607818 611582 614584
47870 614584 616280 616757 616610 616290 615704 614546 612850 611032 609413 607935 606338 604464 602310 599885 597082
47855 597082 593633 589217 583763 577694 571756 566482 561918 557891 554386 551474 548931 546162 542734 538936
47841 538936 535621 533303 531481 529166 526202 523754 523091 524045 525158 525456 525572 526818 529533 532746 535367
47826 535367 537253 539143 541847 545601 550016 554582 559266 564542 570716 577426 584144 591146 599690 611101
47812 611101 625876 643613 663444 684421 705856 727672 750242 773542 796547 817843 836839
47801 836839 853956 869506 882790 892668 898713 901343 900954 897532 891246 882829 873027 862020 849834
47788 849834 837083 824872 814063 805002 797790 792328 788083 784314 780723 777592 775186 773300 771459
47775 771459 769295 766701 763960 761691 760323 759587 758961 758540 758837 759640 759829 758696 756743 754636 752006 747975
47759 747975 742470 736186 729492 722148 714109 705890 697965 690291 682607 674860 667254 660124 653776 648249
47745 648249 643339 639033 635670 633322 631307 628862 626112 623829 622314 621122 619887 618828 618436 619148 621312
47730 621312 624826 628768 632071 634726 637732 641707 646224 650721 655279 659998 664277 667446 669711 671850
47716 671850 674136 676105 677237 677437 676883 675794 674297 672305 669632 666367 662894 659326 655230 650200 644456
47701 644456 638521 632602 626635 620745 615194 610016 605079 600420 596162 592189 588254 584421 581177 579098
47687 579098 578573 579589 581608 583905 586355 589610 594114 599278 604197 608969 614582 621488 628985 636176
47673 636176 642884 649331 655466 661124 666497 671944 677388 682264 686096 688951 691379 693965 696827 699441
47659 699441 701109 701656 701475 700802 699286 696567 693062 689763 687299 685545 684220 683471 683575 684273 684814 684742
47643 684742 684409 684565 685634 687609 690530 694691 700295 707195 715171 724280 734734 746565 759683 774191
47629 774191 790436 808798 829595 853050 879017 906775 935403 964387 993502 1022055 1048712
47618 1048712 1072314 1092582 1109678 1123341 1132823 1137518 1137155 1131335 1119372 1100974 1076910 1048737
47606 1048737 1017809 984703 949626 913178 876566 841074 807468 775986 746805 720352 697039
47595 697039 676801 658987 642775 627710 613879 601655 591274 582578 575119 568417 562197 556448
47583 556448 551366 547163 543759 540650 537248 533496 530056 527778 526914 526902 526866 526247 525110 524042 523799 524804
47567 524804 526809 529121 531256 533273 535357 537239 538300 538275 537544 536603 535440 533631 530988 527900 525034
47552 525034 522808 521094 519332 516956 513838 510365 507017 503923 500932 498043 495531 493579 491973 490284
47538 490284 488290 486058 483678 481079 478240 475564 473854 473724 474931 476459 477422 477820 478242 478882 479197 478612
47522 478612 477327 476176 475765 475924 476014 475580 474639 473427 472016 470324 468469 466972 466377 466658 467157 467238 466899
47505 466899 466670 466966 467707 468562 469418 470388 471413 472052 471921 471225 470544 470054 469250 467685 465694 464038 463007
47488 463007 462259 461473 460716 460078 459362 458336 457016 455582 454229 453220 452829 453107 453928 455324 457443 460044
47472 460044 462426 464116 465322 466470 467639 468886 470775 474045 478767 484221 489611 494571 499005 502854
47458 502854 506117 508885 511228 513153 514693 515922 516989 518257 520214 523015 526305 529822 534034 539735
47444 539735 547070 555447 564478 574606 586597 600716 616483 632974 649218 664685 679599 694569
47432 694569 709684 724224 737375 748919 758944 767235 773420 777600 780309 781827 781959 780646 778355
47419 778355 775532 771952 767093 761094 754880 749240 744181 739435 735117 731431 727988 724064 719532 714914
47405 714914 710391 705376 699407 692895 686472 679973 672698 664485 655948 647670 639707 631926 624432 617530
47391 617530 611514 606468 602040 597570 592838 588524 585494 583646 582028 580054 578093 576867 576842 578266 581081
47376 581081 584565 587704 590318 593250 597089 601288 605024 608329 611727 615240 618492 621490 624436 626878
47362 626878 627918 627401 626181 624905 623092 619778 614685 608358 601441 594177 586542 578531 570217 561715
47348 561715 553157 544740 536661 528972 521575 514544 508422 503804 500474 497307 493370 488879 484671 481018
47334 481018 477440 473632 469936 466783 464172 461904 459966 458365 456896 455348 453772 452375 451282 450603
47320 450603 450471 450833 451359 451794 452304 453266 454863 457090 459980 463460 466942 469399 470079 469127 467426 465870
47304 465870 464794 463999 463136 461953 460253 457886 455044 452396 450632 449779 449191 448292 447106 445937 444863
47289 444863 443824 442993 442718 443117 444095 445709 448158 451303 454502 457109 458956 460251 461328 462735 465256
47274 465256 469349 474550 479876 484955 490476 497374 505802 515107 524607 534111 543819 554074 565271 577719
47260 577719 591339 605430 618690 629467 636210 637982 634709 627011 615956 603020 589867 577659
47248 577659 566545 556166 546614 538467 531914 526398 521375 516876 512979 509299 505598 502540 501032 500944
47234 500944 501227 501355 501929 503576 505951 508291 510461 512889 515755 518877 522282 526326 531152 536495 542204
47219 542204 548590 555973 564101 572309 580185 587835 595462 602969 610089 616740 622994 628754 633705 637681
47205 637681 640863 643431 645177 645703 644965 643308 640951 637747 633656 629194 625086 621480 617742 613148 607681
47190 607681 602015 596812 592206 588031 584388 581713 580222 579520 579012 578602 578739 579791 581654 584067 587052
47175 587052 590869 595698 601505 608178 615613 623752 632617 642274 652655 663425 674027 683863 692589
47162 692589 700430 708091 716032 723761 730228 735022 738772 742133 744821 746084 745743 744156 741348 736981
47148 736981 731263 725198 719464 713547 706501 698336 690184 683057 676797 670370 663061 655258 648153 642722
47134 642722 639053 636573 634772 633452 632453 631527 630645 630105 630099 630399 630722 631238 632426 634475 637087 639857 642631
47117 642631 645418 648099 650257 651347 651131 650021 648762 647606 645968 643131 639145 634716 630326 625854
47103 625854 621096 616234 611607 607212 602672 597580 591843 585791 580020 574944 570386 565725 560481 554685
47089 554685 548694 542879 537499 532674 528368 524530 521258 518607 516265 513835 511544 510221 510262 510990 511418
47074 511418 511386 511452 511883 512318 512470 512580 512951 513391 513439 512946 512186 511465 510809 510069 509288 508840 509084 509817 510276 509871
47054 509871 508782 507621 506659 505745 504905 504571 505082 506288 507816 509478 511278 513255 515461 517887 520302
47039 520302 522431 524390 526657 529353 531883 533619 534734 536009 537931 540345 542954 545755 548822 551955
47025 551955 554816 557359 559932 562862 565972 568722 570962 573335 576611 580648 584419 587207 589363 591648
47011 591648 594190 596511 598316 599759 600975 601796 602049 601858 601569 601501 601691 601771 601186 599726 597683 595335 592607
46994 592607 589605 587095 585795 585356 584740 583641 582847 583013 583774 584421 584841 585330 585991 586813 588069 590100 592884
46977 592884 596167 599818 603702 607507 611167 615245 620380 626463 632798 638984 645137 651301 657164 662489
46963 662489 667396 672072 676483 680472 683865 686456 688166 689281 690261 691238 691975 692314 692348 692161 691789 691483
46947 691483 691564 691923 692106 692123 692696 694370 696718 698868 700543 702187 704178 706339 708242 709726 711053 712688
46931 712688 714909 717559 720227 722683 724949 727019 728824 730618 732936 735958 739266 742499 745825 749366
46917 749366 752640 755162 757284 759711 762361 764414 765434 765668 765205 763634 760862 757506 754012 749964 744772
46902 744772 738732 732913 728218 724906 722747 721255 719986 718983 718790 719753 721569 723776 726418 729839 734157
46887 734157 739435 746097 754516 764225 774107 783502 792660 802046 811624 821002 829851 837958 845114 851239
46873 851239 856485 861083 865176 868819 872003 874645 876694 878256 879500 880470 881165 881732 882481 883758 885926
46858 885926 889206 893311 897540 901654 906370 912513 919830 927309 934551 942027 949894 957384 963763 969238
46844 969238 974413 979388 983897 987936 991611 994630 996472 997020 996597 995545 994099 992528 991030 989500 987690
46829 987690 985501 982990 980331 977961 976445 975830 975440 974724 974129 974709 977048 980957 985986 991755 997904
46814 997904 1004260 1011061 1018608 1026724 1034892 1042884 1050867 1058981 1067138 1075153 1082752 1089619 1095720 1101280
46800 1101280 1106039 1108950 1109364 1108167 1106833 1105575 1103499 1100571 1098153 1097126 1096537 1094875 1091922 1088632
46786 1088632 1085824 1083791 1082660 1082262 1081912 1081147 1080622 1081593 1084537 1088730 1093093 1096918 1099945 1102334 1104627
46771 1104627 1107275 1110185 1113085 1116213 1120144 1124939 1129990 1134760 1139177 1143294 1147122 1151058 1155947 1162324
46757 1162324 1169831 1177726 1185765 1194310 1203725 1213963 1224772 1236025 1247714 1259762 1271960 1284121
46745 1284121 1296195 1308236 1320352 1332683 1345194 1357304 1367991 1376696 1384014 1391023 1397904 1403784
46733 1403784 1408058 1411166 1413687 1415379 1415742 1415071 1414151 1413228 1412087 1411022 1410882 1412027 1413926 1415953 1417976
46718 1417976 1420021 1422066 1424472 1428020 1433025 1438780 1444266 1449115 1453551 1457635 1460964 1462916 1462943 1460758
46704 1460758 1456489 1450615 1443591 1435632 1426801 1417050 1406119 1393688 1379747 1364520 1348062 1330367
46692 1330367 1311986 1293940 1276719 1259786 1242424 1224590 1206583 1188401 1170138 1152683 1137249
46681 1137249 1124119 1112394 1100956 1089211 1077004 1064518 1052472 1041840 1032889 1024777 1016435 1007691
46669 1007691 999201 991472 984298 977266 970489 964535 959629 955247 950768 946406 943078 941280 940493 939915
46655 939915 939416 939341 939667 939886 939734 939555 939796 940448 941137 941513 941417 940817 939707 937996 935522 932291 928733 925507
46637 925507 922994 921046 919244 917300 915249 913373 911986 911283 911507 913213 917039 923025 930417 938446 947064
46622 947064 956614 967053 977998 989326 1001125 1013015 1024109 1033778 1041992 1048780 1053903 1057275 1059199
46609 1059199 1059882 1059112 1056836 1053652 1050308 1046895 1042899 1037881 1031772 1024755 1017231 1009783 1002797 996140
46595 996140 989493 982962 977117 972422 968842 965944 963260 960607 958194 956350 955084 954055 952958 951611
46581 951611 949620 946518 942573 938973 936682 935436 934384 933322 932613 932078 930937 928946 926836 925286 924098
46566 924098 922745 921203 919830 918772 917936 917287 916863 916707 917058 918319 920506 922949 924871 926170 927380
46551 927380 929030 931304 934073 936964 939561 941872 944465 947799 951580 955192 958662 962754 968060 974454
46537 974454 981529 989163 997410 1006118 1014973 1023817 1032744 1041971 1051763 1062399 1074063 1086733 1100295
46524 1100295 1114707 1130047 1146391 1163732 1181985 1201084 1221040 1241898 1263567 1285752 1308108
46513 1308108 1330432 1352573 1374173 1394623 1413347 1430113 1445092 1458608 1470820 1481537 1490403
46502 1490403 1497322 1502659 1506894 1510107 1511966 1512277 1511413 1510084 1508700 1507015 1504469 1500897 1496889 1493285
46488 1493285 1490223 1486862 1482253 1476392 1470190 1464404 1458881 1452841 1445609 1436885 1426620 1415003 1402459
46475 1402459 1389322 1375384 1359945 1342424 1322868 1301909 1280389 1259100 1238633 1219228 1200721
46464 1200721 1182780 1165245 1148202 1131806 1116266 1102053 1089903 1080334 1073206 1067952 1064287 1062546
46452 1062546 1063278 1066657 1072304 1079509 1087553 1096013 1104903 1114463 1124757 1135547 1146532 1157423 1167690
46439 1167690 1176590 1183690 1189200 1193533 1196823 1199115 1200751 1202002 1202406 1200977 1197217 1191564 1184840 1177673
46425 1177673 1170520 1163683 1157006 1149924 1142173 1134250 1126941 1120648 1115415 1111248 1108070 1105608 1103815 1103196
46411 1103196 1104270 1106780 1109929 1113391 1117675 1123432 1130900 1140175 1151519 1164941 1179771 1195104 1210656
46398 1210656 1226834 1243969 1261765 1279558 1296770 1312857 1327098 1338852 1348148 1355744 1362382 1368083
46386 1368083 1372243 1374304 1374230 1372482 1369700 1366269 1361935 1355980 1348156 1339323 1330735 1322603 1313923 1303988
46372 1303988 1293618 1284427 1277133 1271061 1265207 1259357 1254205 1250762 1249722 1251145 1254608 1259816 1266971 1276403
46358 1276403 1288054 1301689 1317471 1335868 1356965 1380349 1405757 1433411 1463501 1495731 1529666
46347 1529666 1565181 1602213 1640290 1678573 1716316 1753014 1788180 1821199 1851313 1877692 1899598
46336 1899598 1916668 1928932 1936475 1939262 1937368 1931084 1920538 1905469 1885724 1861881 1835020 1806000
46324 1806000 1775291 1743426 1711146 1679035 1647416 1616699 1587433 1559845 1533811 1509590 1488184
46313 1488184 1470448 1456046 1443859 1433402 1425311 1420366 1418599 1419664 1423516 1430147 1438938 1448940 1459887
46300 1459887 1472368 1486796 1502733 1519550 1537391 1556947 1578348 1600767 1623188 1645287 1667383
46289 1667383 1689739 1712048 1733515 1753392 1771462 1788010 1803179 1816405 1826706 1833567 1837370 1838842
46277 1838842 1838244 1835177 1829052 1819632 1807287 1792916 1777541 1761802 1745765 1729251 1712333 1695504
$$ [...]
##END NTUPLES=NMR SPECTRUM
##END=
