
##TITLE=UV1234_M7_1357-1247_90_7240071_1BhuKbzNkE
##JCAMPDX= 6.0         $$ Bruker NMR JCAMP-DX V2.0
##DATA TYPE= NMR SPECTRUM
##DATA CLASS= NTUPLES
##ORIGIN= BRUKER
##OWNER= Administrator
$$ 1.72 TOPSPIN		Version 2.1
$$ 2013-01-18 19:48:00.693 -0500  Administrator@X
$$ Compression mode = diff/dup
##.OBSERVE FREQUENCY= 400.02188249412
##.OBSERVE NUCLEUS= ^1H
##.ACQUISITION MODE= SIMULTANEOUS (DQD)
##.ACQUISITION SCHEME= undefined
##.AVERAGES= 8
##.DIGITISER RES= 22
##SPECTROMETER/DATA SYSTEM= spect
##.PULSE SEQUENCE= zg30
##.SOLVENT NAME= COFFEE_meoh
##.SHIFT REFERENCE= INTERNAL, COFFEE_meoh, 1, 14.98509
##AUDIT TRAIL= $$ (NUMBER, WHEN, WHO, WHERE, PROCESS, VERSION, WHAT)
$$ ##TITLE= Audit trail, TOPSPIN		Version 2.1
$$ ##JCAMPDX= 5.01
$$ ##ORIGIN= Bruker BioSpin GmbH
$$ ##OWNER= Administrator
$$ $$ E:\/data/COFFEE/nmr/UV1234_M7_1357-1247_90_7240071_1BhuKbzNkE/20/pdata/1/auditp.txt
$$ ##AUDIT TRAIL=  $$ (NUMBER, WHEN, WHO, WHERE, PROCESS, VERSION, WHAT)
(   1,<2013-01-18 19:47:52.630 -0500>,<Administrator>,<X>,<go>,<TOPSPIN 2.1>,
      <created by zg
	started at 2013-01-18 19:46:46.693 -0500,
	POWCHK enabled, PULCHK disabled,
       configuration hash MD5:
       86 BA 57 50 F2 9D 5C 9B 26 00 A9 28 5F 66 2E 89
       data hash MD5: 64K
       30 67 C0 AA 30 68 C4 73 C1 87 9F C1 C8 2B F8 F0>)
(   2,<2013-01-18 19:47:55.677 -0500>,<Administrator>,<X>,<proc1d>,<TOPSPIN 2.1>,
      <Start of raw data processing
       efp LB = 0 FT_mod = 6 PKNL = 1 PHC0 = 0 PHC1 = 0 SI = 32K 
       data hash MD5: 32K
       82 AE 4E C0 75 EA 39 1B 20 34 5E BC DD F7 F9 21>)
(   3,<2013-01-18 19:47:56.130 -0500>,<Administrator>,<X>,<proc1d>,<TOPSPIN 2.1>,
      <pk PHC0 = 94.04297 PHC1 = 0 
       data hash MD5: 32K
       D1 A9 89 9F 30 8D 20 B4 DD 1D 0A EF 20 35 1D 4A>)
(   4,<2013-01-18 19:47:56.365 -0500>,<Administrator>,<X>,<proc1d>,<TOPSPIN 2.1>,
      <abs ABSG = 1 
       data hash MD5: 32K
       FF B3 82 2B 89 0F 1D 07 C1 49 89 26 94 EE 78 B4>)
(   5,<2013-01-18 19:47:56.505 -0500>,<Administrator>,<X>,<proc1d>,<TOPSPIN 2.1>,
      <abs ABSG = 2 
       data hash MD5: 32K
       2D 57 DB 39 92 63 49 EA 43 15 0A 56 CB DA 1F 94>)
(   6,<2013-01-18 19:47:56.646 -0500>,<Administrator>,<X>,<proc1d>,<TOPSPIN 2.1>,
      <abs ABSG = 3 
       data hash MD5: 32K
       10 85 5E C1 86 A2 28 A1 54 4B 86 D6 FD B5 47 59>)
(   7,<2013-01-18 19:47:56.787 -0500>,<Administrator>,<X>,<proc1d>,<TOPSPIN 2.1>,
      <abs ABSG = 4 
       data hash MD5: 32K
       FF 22 09 88 04 D0 5A 0D C1 D1 47 8C 86 E1 6C FC>)
(   8,<2013-01-18 19:47:56.959 -0500>,<Administrator>,<X>,<proc1d>,<TOPSPIN 2.1>,
      <abs ABSG = 5 
       data hash MD5: 32K
       6C 63 87 F8 77 C5 EF D9 CA F4 46 DE B2 88 55 FE>)
$$ ##END=
$$ 
$$ $$ hash MD5
$$ $$ CB 9C 34 FF 15 E3 49 DC 7C E1 27 5E F8 FC CB 96
##$RELAX= 
##$RELAX= 
##$RELAX= 
##$RELAX= 
##$RELAX= 
##$RELAX= 
##$RELAX= 
$$ Bruker specific parameters
$$ --------------------------
##$DU= <E:\>
##$EXPNO= 20
$$ [...]
##$TP= (0..7)
150 150 150 150 150 150 150 150
##$TP07= 0
##$TPNAME0= <>
##$TPNAME1= <>
##$TPNAME2= <>
##$TPNAME3= <>
##$TPNAME4= <>
##$TPNAME5= <>
##$TPNAME6= <>
##$TPNAME7= <>
##$TPOAL= (0..7)
0.5 0.5 0.5 0.5 0.5 0.5 0.5 0.5
##$TPOFFS= (0..7)
0 0 0 0 0 0 0 0
##$TUNHIN= 0
##$TUNHOUT= 0
##$TUNXOUT= 0
##$USERA1= <user>
##$USERA2= <user>
##$USERA3= <user>
##$USERA4= <user>
##$USERA5= <user>
##$V9= 5
##$VALIST= <valist>
##$VCLIST= <CCCCCCCCCCCCCCC>
##$VD= 0
##$VDLIST= <DDDDDDDDDDDDDDD>
##$VPLIST= <PPPPPPPPPPPPPPP>
##$VTLIST= <TTTTTTTTTTTTTTT>
##$WBST= 1024
##$WBSW= 4
##$XGAIN= (0..3)
0 0 0 0
##$XL= 0
##$YL= 0
##$YMAX_a= 658934
##$YMIN_a= -558615
##$ZGOPTNS= <>
##$ZL1= 120
##$ZL2= 120
##$ZL3= 120
##$ZL4= 120
##$ABSF1= 14.98509
##$ABSF2= -5.573092
##$ABSG= 5
##$ABSL= 3
##$ALPHA= 0
##$AQORDER= 0
##$ASSFAC= 0
##$ASSFACI= 0
##$ASSFACX= 0
##$ASSWID= 0
##$AUNMP= <proc_prof1d_extract_pilot.lims>
##$AXLEFT= 0
##$AXNAME= <>
##$AXNUC= <1H>
##$AXRIGHT= 0
##$AXTYPE= 0
##$AXUNIT= <>
##$AZFE= 0.1
##$AZFW= 0.1
##$BCFW= 0
##$BC_mod= 0
##$BYTORDP= 0
##$COROFFS= 0
##$CY= 15
##$DATMOD= 1
##$DC= 0
##$DFILT= <>
##$DTYPP= 0
##$F1P= 0
##$F2P= 0
##$FCOR= 0.5
##$FTSIZE= 32768
##$FT_mod= 6
##$GAMMA= 0
##$GB= 0
##$INTBC= 1
##$INTSCL= 1
##$ISEN= 128
##$LB= 0
##$LEV0= 0
##$LPBIN= 0
##$MAXI= 10000
##$MC2= 0
##$MEAN= 0
##$ME_mod= 0
##$MI= 0
##$NCOEF= 0
##$NC_proc= -8
##$NLEV= 6
##$NOISF1= 0
##$NOISF2= 0
##$NSP= 0
##$NTH_PI= 0
##$NZP= 0
##$OFFSET= 14.98509
##$PC= 1
##$PHC0= 94.04297
##$PHC1= 0
##$PH_mod= 1
##$PKNL= yes
##$PPARMOD= 0
##$PPDIAG= 0
##$PPIPTYP= 0
##$PPMPNUM= 2147483647
##$PPRESOL= 1
##$PSCAL= 4
##$PSIGN= 0
##$PYNMP= <proc.py>
##$REVERSE= no
##$SF= 400.02
##$SI= 32768
##$SIGF1= 0
##$SIGF2= 0
##$SINO= 400
##$SIOLD= 32768
##$SPECTYP= <>
##$SREGLST= <1H.CDCl3>
##$SSB= 0
##$STSI= 32768
##$STSR= 0
##$SW_p= 8223.68421052631
##$SYMM= 0
##$S_DEV= 0
##$TDeff= 65536
##$TDoff= 0
##$TI= <>
##$TILT= no
##$TM1= 0
##$TM2= 0
##$TOPLEV= 0
##$USERP1= <user>
##$USERP2= <user>
##$USERP3= <user>
##$USERP4= <user>
##$USERP5= <user>
##$WDW= 1
##$XDIM= 32768
##$YMAX_p= 463526592
##$YMIN_p= -674352
##$CURPLOT= <Network HP LaserJet P1505>
##$CURPRIN= <$Network HP LaserJet P1505>
##$DFORMAT= <normdp>
##$LAYOUT= <+/1D_H.xwp>
##$LFORMAT= <normlp>
##$PFORMAT= <normpl>
##$SURQMSG= 1
$$ End of Bruker specific parameters
$$ ---------------------------------
##NTUPLES= NMR SPECTRUM
##VAR_NAME=  FREQUENCY,     SPECTRUM/REAL,   SPECTRUM/IMAG
##SYMBOL=    X,             R,               I
##VAR_TYPE=  INDEPENDENT,   DEPENDENT,       DEPENDENT
##VAR_FORM=  AFFN,          ASDF,            ASDF
##VAR_DIM=   32768,         32768,           32768
##UNITS=     HZ,            ARBITRARY UNITS, ARBITRARY UNITS
##FACTOR=    0.250966925370066, 1,           1
##FIRST=     8223.43324360094, 56801,        -127421
##LAST=      0,             184917,          -7354
##MIN=       0,             -674352,         0
##MAX=       8223.43324360094, 463526592,    0
$$ Real data points
##PAGE= N=1
##DATA TABLE= (X++(R..R)), XYDATA
$$ [...]
19559b67641h5548L1187E8312q708K10353a86370M9311l9039k03655J60265P709
19548b11779A9835e35B3856r988K29578e3159A53973d97656A46538L44202b51696
19536A4448a89301b0989o8252k4031F0111k2809b09225c2829A98609g2845B7703
19524A51153e6781A04869a4098D7696b8592G4137l15c18557F7174d7345k64835
19513c12180a55359C6803O2115a77342b7430p8726A73441F800J57377a04261B49006
19501a87640C6546K9209c9610j35995b5770k48214D0303J12369J71285j06167
19491B17790c1552m2579E3812J4145A2981a04291E6909O2997a96390C50354A32937
19479D4786b7309A01803b82909H0285a49092k8491C854a75480f6825B2639C810
$$ plain form
19559 -267641 -85548 -54361 58312 49604 259957 -186370 -137059 -176098 -379753 -219488 -211779
19548 -211779 19835 -535 23856 13868 243446 -53159 153973 -497656 146538 490740 -251696
19536 14448 -189301 -20989 -89241 -113272 60111 37302 -209225 -32829 198609 -72845 27703
19524 151153 -56781 104869 -14098 47696 -28592 74137 73822 -318557 67174 -47345 -312180
19513 -312180 -155359 36803 98918 -177342 -27430 -106156 173441 6800 164177 -104261 249006
19501 -187640 36546 65755 -39610 -175605 -25770 -273984 40303 152672 323957 217790
19491 217790 -31552 -74131 53812 67957 12981 -104291 56909 119906 -196390 350354 132937
19479 44786 -27309 101803 -282909 80285 -149092 -177583 3854 -175480 -66825 22639 3810
19467a31280b4330k49148A18525c38179J48162A27364a53677j98704I5477a76500
19456a69736A49716a96331A19314N0489i5044P581K6115G6434O5396a97402e2842
19444a95065K1634f351j28534G2473a65823l37320E0636i6703k27879a39203H7971
19432g2255k84478a69279k55245E0522f1425b639A24959J90771b10468c8559F9504
19420b9881k37203n0449E1972c15572A27299d10338a60748k2847D6393b69303
19409e2902J6341C2643f7158J5469k33615M3128B18566j4707c99790a23482c7211
19397F2554b34844a17153G10R059O196F790b24813R8285C03218e672j11089k50153
19385c66914A10832a96914b1386F4461c72p8260b0517A77575e8417q8577G8879
$$ plain form
19467 -131280 -24330 -273478 118525 -338179 -190017 127364 -153677 -352381 95477 -176500
19456 -169736 149716 -196331 119314 169803 -95044 -87463 -61348 76434 141830 -197402 -52842
19444 -195065 -173431 -6351 -134885 72473 -165823 -503143 50636 -96703 -324582 -139203 87971
19432 -72255 -356733 -169279 -424524 50522 -61425 -2639 124959 315730 -210468 -38559 69504
19420 -29881 -267084 -317533 51972 -315572 127299 -410338 -160748 -183595 46393 -269303
19409 -52902 -36561 32643 -67158 -51689 -285304 -242176 218566 203859 -399790 -123482 -37211
19397 62554 -234844 -117153 710 9769 15965 6790 -224813 -126528 303218 -5672 -116761 -366914
19385 -366914 110832 -196914 -21386 64461 -372 -78632 -20517 177575 -58417 -146994 78879
19373c29266a59101p3455j34744O6578H1507a3299B46918a47587O1590C10874
19362a1429l46120L3589h6793F5022b96744B31778a48579N2905c0839C89388I1974
19350a33057A3923K18027b70540F3294c74539E4848a41016A87596a59571k4589
19340a84160M1379K816N6844n828B2437i9159K3219k74511l6362B42688b37038
19328B7338J08681b9757B82659c0417j16935A0895a4654j66876A4679Q3349m130
19317I3898e17617a46135p7510f9637k47867N4899H8265f3156j87381a02k48869
19306b48971Q9426l0206c1581o2372q1246k9859a3690j02757b4908A01791a81750
19294B52626C9925a08919b7017q1023B09695q3899K6218j1834h3012L5456j78409
$$ plain form
19373 -329266 -159101 -232556 -367300 -300722 81507 -13299 246918 -147587 -85997 310874
19362 -11429 -357549 -323960 -86793 65022 -296744 231778 -148579 -95674 -30839 389388 91974
19350 -133057 13923 231950 -270540 63294 -374539 54848 -141016 187596 -159571 -184160
19340 -184160 -142781 -139965 -83121 -88949 22437 -99159 -75940 -350451 -386813 242688 -237038
19328 27338 136019 -29757 282659 -30417 -147352 10895 -14654 -181530 14679 98028 93898
19317 93898 -517617 -146135 -223645 -69637 -317504 -262605 88265 -63156 -250537 -102 -248971
19306 -248971 -159545 -189751 -31581 -93953 -175199 -205058 -13690 -116447 -24908 101791 -181750
19294 252626 39925 -108919 -27017 -108040 209695 125796 152014 140180 -83012 -47556 -225965
19283b25965C67416a63719A33306a30025A33421b23719A21259b15113p1375I6093
19272a2932C52411A34596k2505c1577j84345A36336a83874B42178c94182c2282
19261c1572k15810I6652g8656n5198G832a36410D8251b77032j8127A1340e9608
19249a82537J9165N6528J1428j60041A89102i4558B17614A2811c26664i619r0835
19238a00454c82r6923m6016A20788E1303a26727A51229a93974g3972L750j86209
19227b56431A14269b46309B8246K251J19093K04225h243n7850j43937M3248j31904
19216b98686a3855A45025A1406a43238L2064K2524I5627c74954K3443i6843A54744
19204A1248R9941K04192c31050J42015d8348l8388M3302O15F0924J5555c5558
$$ plain form
19283 -225965 367416 -163719 133306 -130025 133421 -223719 121259 -215113 -286488 96093
19272 -12932 352411 134596 112091 -31577 -215922 136336 -183874 242178 -394182 -32282
19261 -31572 -247382 96652 -78656 -133854 7832 -136410 48251 -277032 -295159 11340 -59608
19249 -182537 -163372 -106844 -95416 -255457 189102 -94558 217614 12811 -326664 -9619 -100454
19238 -100454 -382 -97305 -143321 120788 51303 -126727 151229 -193974 -73972 -70222 -256431
19227 -256431 114269 -246309 28246 30497 149590 353815 -8243 -66093 -210030 -166782 -298686
19216 -298686 -13855 145025 11406 -143238 -111174 -88650 95627 -374954 -351511 -96843 154744
19204 11248 111189 315381 -331050 -189035 -48348 -86736 -43434 -42819 60924 76479 -35558
19192b2728A00513f0884B74825q9530c65267K6425N2796a40775E2719d41232A40039
19180B18354c6150j0672B5126c9212p3532k17474J54709E6752G344J09608n887
19169A11065h1471H2549a12851G2594a40881j92710A19758b68541a2603n87856
19159f00459b96490A59165f2162d604A76480H3481A5724J92639E7327A5429J04730
19148A20159D7635b36461o9322L2448b6591n2591k23706A8864c61918J00015E5023
19136h6530K5914r1033M7278D20484G968K0020a25622j86960R2293Q9136j84647
19125c15800A15208d0034j2041A32800a3310j75136J2164N7671c121j20734B10053
19113a20385m8102E6878f1549k38720b8823C14949a91445j34163j46470a56624
$$ plain form
19192 -22728 100513 -60884 274825 185295 -365267 -338842 -286046 -140775 52719 -441232 140039
19180 218354 -36150 -46822 25126 -39212 -112744 -330218 -175509 56752 7344 116952 111065
19169 111065 -81471 82549 -112851 72594 -140881 -333591 119758 -268541 -12603 -600459
19159 -600459 -296490 159165 -62162 -4604 176480 83481 15724 208363 57327 15429 120159
19148 120159 47635 -236461 -305783 -273335 -26591 -79182 -302888 18864 -361918 -261903 55023
19136 -86530 -60616 -151649 -104371 420484 7968 27988 -125622 -312582 -220289 -131153 -315800
19125 -315800 115208 -40034 -52075 132800 -13310 -188446 -176282 -118611 -3121 -123855 210053
19113 -120385 -168487 56878 -61549 -300269 -28823 314949 -191445 -325608 -472078 -156624
19102g860E3037a50002C7960c10900G269a81538A74563i961n8861k04601J9960
19091b53463A52705L5953C6325b56065A7342b70945f9045m7578I4842a23480j09825
19080b33305A23995a40884B82507b2173C10443A345P2748h2870C298J33452a50610
19068a86135E5405A2917a6468r7205A02660a02300b8978q4062B29841D9591b06322
19056b19258k1578C8488L09108A52179d5779I2324d15671J80911j30032J02538
19046b62254J14182j2013A09046b34097J1474a04878j6562b7487p0118E9099m701
19035E4398a12481r0172f5996p5142M2362G4391e8627l430n7118o8870P654e1024
19022A08638c55892F1328b58086A59740b05198A9497d6327D1534J8099e939I6898
$$ plain form
19102 -7860 53037 -150002 37960 -310900 7269 -181538 174563 -9961 -68822 -273423 -253463
19091 -253463 152705 188658 36325 -256065 17342 -270945 -69045 -116623 94842 -123480 -233305
19080 -233305 123995 -140884 282507 -22173 310443 1345 74093 -82870 3298 136750 -150610
19068 -186135 55405 12917 -16468 -113673 102660 -102300 -28978 -113040 229841 49591 -206322
19056 -219258 -240836 38488 347596 152179 -45779 92324 -415671 -234760 -364792 -262254
19046 -262254 -148072 -160085 109046 -234097 -222623 -104878 -121440 -27487 -97605 59099 54398
19035 54398 -112481 -202653 -65996 -141138 -98776 74391 -58627 -62057 -119175 -188045 -180391 -51024
19022 108638 -355892 61328 -258086 159740 -205198 19497 -46327 41534 59633 -5939 96898
19010c35921O2874A20410c7265A24846a93258D9013N532i8998H7313a42297c5244
18998a07294o6790I8453D7801b47771B11508a1258j06069l2045p5538A25443g616
18986A56136k1780b2347D42499A00128K35516b36758A48732i4842B19737a22157
18975D6867a39312A5623i5889f326k32283F2019C0293o923J54776a01143B21461
18963b33182B7528c34767g1584l4290C3259Q4598m5001f4857B15647b53507C3382
18951a96005F4758k1241A6022K4081b2385p2775j59912R7994L2631D3674J1678
18940E5352d1489j81284B0897a72421A54325K04024I7158J88945A38576o7601
18930G0975o378a37411b1715A39849F0301b73864a31300b0933o2311B6971a75203
$$ plain form
19010 -335921 -273047 120410 -37265 124846 -193258 49013 54545 -98998 87313 -142297 -35244
18998 -107294 -174084 98453 47801 -247771 211508 -11258 -117327 -149372 -224910 125443 -7616
18986 156136 134356 -22347 442499 100128 335644 -236758 148732 -94842 219737 -122157
18975 46867 -139312 15623 -95889 -6326 -238609 62019 30293 23370 178146 -101143 221461
18963 -233182 27528 -334767 -71584 -105874 33259 117857 72856 -64857 215647 -253507 33382
18951 -196005 64758 43517 16022 40103 -22385 -95160 -255072 -157078 -124447 43674 55352
18940 55352 -41489 -222773 20897 -172421 154325 358349 97158 286103 138576 70975
18930 70975 64597 -137411 -21715 139849 60301 -273864 -131300 -20933 -83244 26971 -175203
18918f4544o6118B68103A6319J4344a63646A85773a8157k3137q6875G712c11012
18906a48552r7613D1031b93485J31784k65192f926l40777A91427b9715k57763
18896b87478f7404D0803j8795J28322n6071L6300J6092b472j70268A70434b7016
18884A11043L3154J27207a29177N2520G5218a57085O2231k13215p4697N1166D2401
18872A59928b43593f6284A48069G773d10574h3841K8189m22181D3423K24086f522
18860A40598D3528J60292h6265f198j87940B37290a79633G3058Q4364f4533A15514
18848A65523c40851a15705C88355A33393l758a80515j90069H5063a61836g1089
18837b43708J4814a5178F3509J56313b54437A04314a23355k08582g2737H8004
$$ plain form
18918 -64544 -130662 268103 16319 30663 -163646 185773 -18157 -41294 -128169 7712 -311012
18906 -148552 -246165 41031 -293485 -161701 -426893 -6926 -347703 191427 -29715 -287478
18896 -287478 -67404 40803 22008 150330 94259 130559 146651 -2472 -172740 170434 -27016
18884 111043 144197 271404 -129177 -76657 75218 -157085 -94854 -308069 -382766 -331600 42401
18872 159928 -243593 -66284 148069 7773 -410574 -83841 -55652 -477833 43423 267509 -6522
18860 140598 43528 203820 -86265 -6198 -194138 237290 -179633 73058 157422 -64533 115514
18848 165523 -340851 -115705 388355 133393 129635 -180515 -370584 85063 -161836 -71089
18837 -243708 -228894 -15178 63509 219822 -254437 104314 -123355 -331937 -72737 88004
18826c76736i5109m6101n418q2540j84259d1763A9935b23097H1704r418K5739
18815I8025a06739F5061b39820a5485j01254A1373J83389m6224N2166n1901m0550
18804A08253c59651J29916d0674r0097b0775B00195G8728i4093I3422a51771A4011
18792b239j14584d1935A45160B3707L2085h3433r6869O4043j10347H8503a06073
18780D6240c21467H5697J5763b13397B3639L57335a31279c4743j02800j80626
18770c18169J06930i0004B68456I5536a3059j08557h83l24925F2107j5514j3334
18759C3259i8213C26556b36771D9111r397r043L7129i0985j09978E3255h0222
18747a6396k87994J49502j19742A46468b0593B30950c85193e8492B04450a05701
$$ plain form
18826 -376736 -95109 -141210 -146628 -229168 -413427 -41763 19935 -223097 81704 72286 98025
18815 98025 -106739 65061 -239820 -15485 -116739 11373 194762 148538 200704 148803 108253
18804 108253 -359651 -229735 -40674 -130771 -20775 200195 78728 -94093 93422 -151771 14011
18792 -2239 -116823 -41935 145160 23707 55792 -83433 -180302 -116259 -226606 88503 -106073
18780 46240 -321467 85697 101460 -213397 23639 380974 -131279 -34743 -137543 -318169
18770 -318169 -211239 -90004 268456 95536 -13059 -121616 -883 -325808 62107 46593 33259
18759 33259 -98213 326556 -236771 49111 39714 30671 67800 -90985 -200963 53255 -80222
18747 -16396 -304390 -154888 -274630 146468 -20593 230950 -385193 -58492 204450 -105701
18736A73015b39667M743B46605c81595A02331a77602B85668G9128h0181q0942
18726a61123P6313j44521K2793A33898a06096I6051d3873A00543a70434A9281
18715D9387a92037P3698j92514J30893j46084J47287M0554j46383Q0470J2123
18705a91993h6814a0325A54810f788l47520B16795r8471c8207A11084J1039b64739
18693A58719D4568a36002c6748j81833F1890L5658b02161e6825m3907k76810c0964
18681A67904a30073C2943g6599p3444C86056b31141j8778J23950j70615f5183
18670a4421j16953C62975d8999A4905a80725j97420A82747e0648F6418J6235K4158
18659A06811B2860a83111O8254m0874I1126J29669B525J84161i3891C03774a78484
$$ plain form
18736 173015 -239667 -234924 246605 -381595 102331 -177602 285668 79128 -80181 -161123
18726 -161123 -84810 -229331 -206538 133898 -106096 96051 -43873 100543 -170434 19281
18715 49387 -192037 -118339 -310853 -179960 -326044 -178757 -138203 -284586 -204116 -191993
18705 -191993 -86814 -10325 154810 -6788 -354308 216795 118324 -38207 111084 122123 -264739
18693 158719 44568 -136002 -36748 -218581 61890 97548 -202161 -56825 -100732 -377542 -30964
18681 167904 -130073 32943 -76599 -150043 386056 -231141 -249919 -125969 -296584 -65183
18670 -14421 -131374 362975 -48999 14905 -180725 -378145 182747 -50648 66418 82653 106811
18659 106811 22860 -183111 -114857 -155731 91126 220795 2525 186686 -93891 303774 -178484
18647c34672f9888l04469h6694k29781F9352J85837H0721j0998J35754e53359
18636A27287i4124A13966b19616g2332b9709j070j77022J03754A36081C2842R0235
18625A23077f1932m5795b3103j07473j35000A09179k6818e3509D7152a70217k69620
18614d39837a40476A15987a15458j41059A6347a15537L2793A40163f4179k30106
18604b94285H8242a34641H7846c3141k28450e5664A5213J83b6201A37903b18138
18592C08102g0582l6641E0354b04112g7378L2552j51688N6436O6793j28304N7877
18581a43712k01122B11326B3561d74106b05272R8760A62383B6567M623P248b03955
18569I0176J0750A790N7819b05058O4588a8626l3898q9357B13399C042b3101P145
$$ plain form
18647 -334672 -69888 -374357 -86694 -316475 69352 255189 80721 69723 205477 -553359
18636 127287 -94124 113966 -219616 -72332 -29709 -30779 -207801 -104047 136081 32842 123077
18625 123077 -61932 -107727 -23103 -130576 -265576 109179 82361 -53509 47152 -170217 -439837
18614 -439837 -140476 115987 -115458 -256517 16347 -115537 -82744 140163 -64179 -294285
18604 -294285 88242 -134641 87846 -33141 -261591 -55664 15213 15396 -26201 137903 -218138
18592 308102 -70582 -107223 50354 -204112 -77378 -44826 -196514 -140078 -73285 -201589 -143712
18581 -143712 -344834 211326 23561 -474106 -205272 -106512 162383 26567 31190 38438 -203955
18569 90176 100926 1790 59609 -205058 -140470 -18626 -52524 -141881 213399 3042 -23101 -15956
18557a5956A79666a89218D6900a21582D0172b47415O6042L421A63383h1703F558
18545b12737E2768J09423A0645R0317c19977a083l4678r7810N4198n0211b1924
18533c13974g3917m78184c6659B19636a90501j22819A1088a07094H5204d76440
18522b36124B81307b08507K1149J0079G7308J19142a73969m6736J2599A79174
18511a97242N6857A80690l0419J33006I3051A208Q0475d719k22976g0075F5123
18499h5869F8367k1897b34375C1327O8821K80210D9997L3300N8316d4118A7090
18487a9109j37475P5022c3449n6003A43682k5171l2104N778D53J04646a10605
18475c1062B18714o9106a67235C7026a54975Q990k0719p2166H8919a27118B19424
$$ plain form
18557 -15956 179666 -189218 46900 -121582 40172 -247415 -181373 -177952 163383 -81703 6558
18545 -212737 52768 162191 10645 100962 -319977 -1083 -35761 -133571 -79373 -129584 -21924
18533 -313974 -73917 -552101 -36659 219636 -190501 -313320 11088 -107094 85204 -476440
18522 -236124 281307 -208507 -187358 -177279 77308 196450 -173969 -220705 -208106 179174
18511 -197242 -140385 180690 150271 283277 93051 1208 81683 -4719 -227695 -70075 65123
18499 -85869 68367 46470 -234375 31327 100148 380358 49997 83297 141613 -44118 17090
18487 -19109 -156584 -81562 -33449 -89452 143682 118511 86407 92185 453 105099 -110605
18475 -31062 218714 149608 -167235 37026 -154975 -145985 -166704 -238870 88919 -127118 219424
18463c2322j52181j49766J55784r9031c594A12773q681f5073F3822a40205k6842
18452a67047A75356q3079b9717j56561l5161R020b6703A71231o5364a58705P6992
18441h1713A44415d49882C4452a24812m1321I6540O6129g6249F8223b62185A12986
18429B04892a66252J9502q4369A37317f4995A84018d4135r4729c6497j31275A29593
18417f1092m29184B9925j4475J16916c77632a56962A47437D8170M2100a25521
18406B22791R1805a32784A15025b30010e2302C25380M440a07528K3372j39505
18396b23661j56687J02865D5364r93g9113j21376m073I1069b42307o7804E0165
18384A96846D3170f1196k89492B37185d9269A04350e3275A64411c56850j66004
$$ plain form
18463 -32322 -184503 -334269 -178485 -277516 -3594 112773 104092 -65073 63822 -140205 -167047
18452 -167047 175356 92277 -29717 -186278 -221439 -212419 -26703 171231 105867 -158705 -81713
18441 -81713 144415 -449882 34452 -124812 -166133 96540 162669 -76249 68223 -262185 112986
18429 204892 -166252 -146750 -231119 137317 -64995 184018 -44135 -138864 -36497 -167772 129593
18417 -61092 -490276 29925 15450 132366 -377632 -156962 147437 48170 90270 -125521
18406 222791 314596 -132784 115025 -230010 -52302 325380 329820 -107528 -84156 -223661
18396 -223661 -380348 -277483 45364 44371 -79113 -200489 -204562 91069 -242307 -310111 50165
18384 196846 43170 -61196 -350688 237185 -49269 104350 -53275 164411 -356850 -522854
18374e22854K20941N1959C0028a61011K897G1616J41158l6512K20663a52764H7822
18362h7818B8223J6170a91598L8195G8770f4044j80848g6179L934a7705j20513
18351a38218j27741a06899c7877J1750p4867D2281J1794i6733j58375N1675D7624
18339a60244K1742A59690c8362A04520A1374c44425J69503e6199K190k3282k48871
18328c26162a41417A49321b23586f6541j31570k4862A24156D1816J8289K32668
18318B92773b06066K8008l5696J5555A80087k5633D4401b53190J10693c3933l01404
18307c35337E8534b08461K9113a5619H5035a46248r4549h8740p0863H3122e0696
18295i4231A35162c62688G8776d3794F3412b52421a22980c9586B29354b6486A17778
$$ plain form
18374 -522854 -301913 -249954 30028 -161011 -158114 71616 212774 176262 396925 -152764 87822
18362 -87818 28223 44393 -191598 -153403 78770 -64044 -244892 -76179 -72245 -17705 -138218
18351 -138218 -265959 -106899 -37877 -26127 -100994 42281 54075 -96733 -255108 -203433 47624
18339 -160244 -138502 159690 -38362 104520 11374 -344425 -174922 -56199 -54009 -77291 -326162
18328 -326162 -141417 149321 -223586 -66541 -198111 -222973 124156 41816 60105 292773
18318 292773 -206066 -178058 -213754 -198199 180087 154454 44401 -253190 -142497 -33933 -335337
18307 -335337 58534 -208461 -179348 -15619 85035 -146248 -240797 -88740 -159603 83122 -50696
18295 -94231 135162 -362688 78776 -43794 63412 -252421 -122980 -39586 229354 -26486 117778
18283G2600h0637m7497a7072d310B1762b53794g3201l798o0693j09733B2729q325
18271A4404a53536j75959e604D4975c13630R3488h4158n5224c9289H5734J72362
18260B58096a6772G5642b86450A85288A304P7873j4450g0759B16185a40517A33261
18248c1223j83487a00280A02087a08935E9158P725J07784e7501C6636b98674B10665
18236a07306k49186C7924J49551I290h5858j8033a4443j9872j5257o0543j45056
18225b55171L7638a06292j68094a11835L1078B60618c81142A57229d7992A26717
18214a6509j67706K3154E4305a407j01255H2710c35136h9355j07751H3443b8494
18202A11505b02k14294c2492A34487K51722b26837c6822n4096j05097d5964a3701
$$ plain form
18283 72600 -80637 -128134 -17072 -4310 21762 -253794 -73201 -76999 -137692 -247425 22729 14404
18271 14404 -153536 -329495 -5604 44975 -313630 -220142 -84158 -139382 -39289 85734 258096
18260 258096 -16772 75642 -286450 185288 1304 79177 64727 -70759 216185 -140517 133261
18248 -31223 -214710 -100280 102087 -108935 59158 66883 174667 -57501 36636 -298674 210665
18236 -107306 -356492 37924 187475 9290 -85858 -103891 -14443 -34315 -49572 -110115 -255171
18225 -255171 -217533 -106292 -274386 -111835 -80757 260618 -381142 157229 -47992 126717
18214 -16509 -184215 -161061 54305 -1407 -102662 82710 -335136 -89355 -197106 83443 -28494
18202 111505 -202 -214496 -32492 134487 386209 -226837 -36822 -90918 -196015 -45964 -13701
18190A86940a84316j21707B21299L0561d5101j6543D5946M913i8048C2209p495
18179B4714J14639g3917C02387A15077K2405a25247a2136l47956a27770j10451
18169b38221L8949b5420B54775c15068d7786B8498J85312G1233a82306B1563a55492
18157b3903j92098h6191A36447D6744J54065J82349a67508A70131p868c67748
18146a30430K4423J1367p89j52396a10546A32079m7835i7486C0870P9594f1307
18134A36077o7372b5122j19396K5099A45359b05462j12941B18632I8790c73480
18123A7654N3051i3560r1914C44930a28870A41127H012g4295k70536A00458a72770
18111H92i6040m1657E175R2687d03306a76421B51951q8631d76725B66752F4589
$$ plain form
18190 186940 -184316 -306023 221299 251860 -45101 -61644 45946 50859 -98048 32209 24714
18179 24714 139353 -73917 302387 115077 137482 -125247 -12136 -360092 -127770 -238221
18169 -238221 -199272 -25420 254775 -315068 -47786 28498 213810 71233 -182306 21563 -155492
18157 -23903 -216001 -86191 136447 46744 200809 383158 -167508 170131 162263 -367748
18146 -130430 -106007 -94640 -95429 -247825 -110546 132079 84244 -97486 30870 110464 -61307
18134 136077 68705 -25122 -144518 -119419 145359 -205462 -318403 218632 98790 -373480
18123 17654 70705 -93560 -185474 344930 -128870 141127 8012 -74295 -344831 100458 -172770
18111 892 -96040 -137697 5175 97862 -403306 -176421 251951 163320 -476725 266752 64589
18099c91116B43843a84447n8308e580A440b41013C02715E2735b45937H9548f370
18087a76379A46191a44072J6346d8396l0094F0269c09557G0175J0467L47b9575
18075a78465d7895A50030J34728b56031B19289k966h5417D2393i4151d3275A59252
18063g5528j26773c1113I8171K12541D0972j7329J04425C4557a61096A07615a16710
18051a01624j36824i3846A26809O573D1762J18985i0862I6120f0638R366J6234
18040c5038P629A49134b09096O783l6854l8114J36097d8167H1480L1977O8989
18029A82446i2841q4698B6923J122a79769g591k61849a7710A70173D3461b00056
18017b17191A35995B3184b88505J26013A19783i32B4491a17695F2723J22280R243
$$ plain form
18099 -391116 243843 -184447 -242755 -5580 1440 -241013 302715 52735 -245937 89548 -6370
18087 -176379 146191 -144072 -127726 -48396 -78490 60269 -309557 70175 80642 80989 -29575
18075 -178465 -47895 150030 284758 -256031 219289 216323 -85417 42393 -94151 -43275 159252
18063 -75528 -202301 -31113 98171 310712 40972 23643 128068 34557 -161096 107615 -116710
18051 -101624 -238448 -93846 126809 133382 41762 160747 -90862 96120 -60638 -51272 -35038
18040 -35038 -27409 149134 -209096 -202313 -239167 -277281 -141184 -48167 81480 113457 182446
18029 182446 -92841 -177539 26923 28045 -179769 -7591 -269440 -17710 170173 43461 -200056
18017 -217191 135995 23184 -288505 -162492 119783 -932 24491 -117695 62723 185003 194246
18006A94246a01694A80173o763p067i6116p1081H0424b2881F134c7316C6729K5669
17994F2398e10865a86475Q1870c3419l07747B2754c37888J42166d4006j87834
17984b31840B20839p7815c10270F7778M1559b73203i0397j07624B70808g4363
17973H0522d23567d365b182I9682J73203a41729j14500b4340B85386A40554a61069
17961G6819N3127c2728m9292G1824e1504K0345j35264e1505b1357C4601N8063
17950I2664R9587b19565d1330j20737G3957b33099b4972j23492c5533j08842O8159
17939g6216b273n358A2861M5732b07231L9563C7549a67683A2586f511F3747a34952
17926i0045j42561A18149e7067C5787O2439a14512I9897a4756h32I8683O0915
$$ plain form
18006 194246 -101694 180173 173410 166343 -96116 -167197 80424 -22881 6134 -37316 36729 62398
17994 62398 -510865 -186475 -104605 -33419 -341166 22754 -337888 -195722 -44006 -231840
17984 -231840 220839 143024 -310270 67778 109337 -273203 -90397 -198021 270808 -74363
17973 80522 -423567 -4365 -2182 99682 272885 -141729 -256229 -24340 285386 140554 -161069
17961 76819 129946 -32728 -82020 71824 -51504 -31159 -166423 -51505 -21357 34601 92664
17950 92664 192251 -219565 -41330 -162067 73957 -233099 -24972 -148464 -35533 -144375 -76216
17939 -76216 -2273 -7631 12861 58593 -207231 -167668 37549 -167683 12586 -6511 63747 -134952
17926 -90045 -232606 118149 -57067 35787 98226 -114512 99897 -14756 -832 98683 159598
17915A59598Q0306f4581B04725b68784E0032J55707a38825C5725L7925N1928a92356
17903E1100a09909F5695d09773h258D40020i449r4092C9127b83643D4080a33978
17891C490j174a74360B41637j03297c81197E3430a87901e4638E8054c12502A08813
17879A7006a31395B63723r3760E3844g1044L981j51178A69652b02298A01885d7176
17867C60528A36609a7133C2361b16900Q0480C51407j47493c33377G4872R5347
17857A70219C2123M0063N4649P1702c05892a12893j71805b9278j03093C31469
17846A81899J29107D642L25456d44519e3973D6247h2153C5581Q3577c33659f0316
17834a60093A25061R8201f3095j3452i134A19381d8734C4725d6097A62851f2784
$$ plain form
17915 159598 239904 -64581 204725 -268784 50032 205739 -138825 35725 73650 125578 -192356
17903 51100 -109909 65695 -409773 -8258 440020 -9449 -103541 39127 -283643 44080 -133978
17891 3490 2316 -174360 241637 138340 -381197 53430 -187901 -54638 58054 -312502 108813
17879 17006 -131395 263723 169963 53844 -71044 -67063 -218241 169652 -202298 101885 -47176
17867 360528 136609 -17133 32361 -216900 -136420 351407 203914 -333377 74872 170219
17857 170219 32123 72186 126835 198537 -305892 -112893 -284698 -29278 -132371 331469
17846 181899 311006 4642 330098 -444519 -53973 46247 -82153 35581 119158 -333659 -60316
17834 -160093 125061 223262 -63095 -76547 -9134 119381 -48734 34725 -46097 162851 -62784
17822a56654M1336c8313p4659A65409i2546C14180e7279o4848I0568B0197g7187
17810a37649L0506k3379A34731E3143J46413d254A36644a63349h0836G9258i3152
17798a56650I61h7938A65476O0057G0394i7093A84482J25021H1565J31652a21280
17786i4227D54459B0408N0999c2534m24304A07087H704J01362g9605m01A36201
17774a88316A11918J5656d0119A1044h4143o5441A69400a98166E849O3022N4044
17763A22915j9403a05632D5510J99959A02628m9085a20277A53989A9811b12351
17752A8150Q3058k8095a83875b2562B00966b08161j99032a39837f2310E0259C556
17740c00287Q209h30C9821F754Q8808J46008m202N5854A27087a70782C2962K18514
$$ plain form
17822 -156654 -115318 -38313 -112972 165409 -92546 314180 -57279 -122127 90568 20197 -77187
17810 -137649 -107143 -130522 134731 53143 199556 -4254 136644 -163349 -80836 79258 -93152
17798 -156650 961 -87938 165476 225533 70394 -97093 184482 309503 81565 213217 -121280
17786 -94227 454459 20408 71407 -32534 -456838 107087 8704 110066 -79605 -80006 136201
17774 -188316 111918 127574 -40119 11044 -84143 -149584 169400 -198166 5849 68871 122915
17763 122915 103512 -105632 45510 245469 102628 53543 -120277 153989 19811 -212351
17752 18150 101208 73113 -183875 -22562 200966 -208161 -407193 -139837 -62310 50259 3556
17740 -300287 -292078 -830 39821 6754 95562 241570 237368 293222 127087 -170782 32962 251476
17728B51476a57586K3194F6497c25354P5849b4427B84257f0443k0919k35236G8201
17716B88766j37353O9945o0436N9653a94429A2871K82118c2980o3864o8503A68427
17704B70261p5395J84338a1453q068a306A70838a31078D0174M22i7828A629L57253
17692C58882p6879a18188C22861k0355b54398B12416d21864c4614r7097A49296
17681A02369A89K84085A36104B2881h4620c640D7560a68067d6021K2601j10323
17670a33743C68274a23294e4015k74274A54507C1914J10877a03771A71182a08823
17659e2057A58477a54458O2211k46299A41173b5283A31554n6285f439A11836g9747
17647d6654o3101l5623I5491a42508E8289a68662A20473J02595B4098K09407E1087
$$ plain form
17728 251476 -157586 -134392 66497 -325354 -249505 -24427 284257 -60443 -81362 -316598 78201
17716 288766 151413 221358 160922 220575 -194429 12871 294989 -32980 -96844 -165347 168427
17704 270261 194866 379204 -11453 -19521 -1306 170838 -131078 40174 40596 -97828 1629 358882
17692 358882 282003 -118188 322861 302506 -254398 212416 -421864 -34614 -131711 149296
17681 102369 189 284274 136104 22881 -84620 -3640 47560 -168067 -46021 -23420 -133743
17670 -133743 368274 -123294 -54015 -328289 154507 31914 142791 -103771 171182 -108823
17659 -52057 158477 -154458 -92247 -338546 141173 -25283 131554 75269 -6439 111836 -79747
17647 -46654 -109755 -145378 95491 -142508 58289 -168662 120473 223068 24098 233505 51087
17635A00366f3478B2004K45850A33493d9886k5551J9628l0509L0618A00383J1201
17624A11584M4453n7100a45586d7868j8058G5523j5822J18166a26656H2410L37821
17613D20231A35174a88165b2779n6153H5244l854a89872c7233H4850d78H0941
17601b05733d2547k1673f946A81713A7026J40338a05745A82880E6044d9932k0098
17590g0030B04704a27260A42229h8438C44601p8320h7678j3938E0914M2436J4749
17579A08099b07170Q7896c7801m055k74158A48775J34223a22786l8609L6877B36547
17567a26453C24383j23799C1985M61453A16654Q3440b5854j24829D1805O314M90129
17556E38248F9321d5063D6652K31062A29627B4409a9536j48579C57945A45570
$$ plain form
17635 100366 -63478 22004 267854 133493 -49886 -75437 -55809 -86318 -55700 100383 111584
17624 111584 156037 98937 -145586 -47868 -65926 75523 59701 177867 -126656 82410 420231
17613 420231 135174 -188165 -22779 -78932 85244 81390 -189872 -37233 84850 -478 80941
17601 -205733 -42547 -64220 -6946 181713 17026 157364 -105745 182880 56044 -49932 -70030
17590 -70030 204704 -127260 142229 -88438 344601 266281 -87678 -101616 50914 93350 108099
17579 108099 -207170 -119274 -37801 -41856 -316014 148775 282998 -122786 -161395 -124518 236547
17567 -126453 324383 200584 31985 493438 116654 200094 -25854 -150683 41805 48119 538248
17556 538248 69321 -45063 46652 277714 129627 24409 -19536 -168115 357945 145570
17545C52345r8299F3515J65031a63918D02606A20937R753l1776K3861j2726a5226
17533c58378A07680K08808j49501a19578B02540d7761r0660A38444a97289B94990
17522c5651B70254G9075h2046B48237o5084E8287j2650J38038J02070k6726H4477
17510B52961J76819A65798G7728a9734A38623A394a7219A4624F547B706a08977
17498c7870C90233a88501B58428d2274j01621A82929J63929C2835J824M6734J79026
17487B60419E0212K97755H3446J32113b93891A0207R9438a75466A9870J2385N6215
17476H8470a13751A21670J41884k6363k1276I4999R2779H5766J50621o2575J41462
17465C15274d1248B41576K03001A16941J60973J39711j27616m8945c1950B25604
$$ plain form
17545 352345 254046 63515 228546 -163918 402606 120937 130690 98914 122775 110049 -15226
17533 -358378 107680 316488 166987 -119578 202540 -47761 -138421 138444 -197289 294990
17522 -35651 270254 79075 -82046 248237 183153 58287 45637 183675 285745 259019 84477
17510 252961 429780 165798 77728 -19734 138623 1394 -17219 14624 6547 2706 -108977
17498 -37870 390233 -188501 258428 -42274 -143895 182929 346858 32835 34659 81393 260419
17487 260419 50212 347967 83446 215559 -293891 10207 109645 -175466 19870 32255 88470
17476 88470 -113751 121670 263554 237191 215915 94999 187778 85766 236387 173812 315274
17465 315274 -41248 241576 444577 116941 277914 417625 290009 241064 -31950 225604
17454a86187B7663J16009K19823J01354I583d7835B36302o5777K04190F4142K39910
17443C04052A49438k6537J87038j04404b1140F0181d0491C52204h4593C55625
17432D82036j08395N942j14212p4819K3507M62947C00535G9431J90473c937B32578
17420C52996j00485A14664D6080K90812h3204E38310A87064E4507K411K91371
17410C48289i9997G8966J96302D1203J37228k6130I630L8803K28333j8686p5053
17399A83027D6089J98384J35164J32296A34104j4144a55558C95685n7680b6500
17388A61743D772J8769l99L29550J5094A9355J02752r977q405j5538J80762E8767
17375C62551m4335J23843a9803A31997O8746K2001J13273f4267B59807K8747d5081
$$ plain form
17454 -186187 27663 143672 363495 464849 9583 -47835 236302 170525 374715 64142 304052
17443 304052 149438 122901 309939 205535 -21140 60181 -40491 352204 -84593 355625
17432 482036 373641 379583 265371 190552 214059 677006 300535 79431 269904 -3937 232578
17420 352996 252511 114664 46080 336892 -83204 538310 187064 54507 56918 348289
17410 348289 -99997 78966 275268 41203 178431 152301 9630 48433 276766 258080 183027
17399 183027 46089 244473 379637 511933 134104 119960 -155558 395685 338005 -26500
17388 161743 4772 23541 23142 352692 367786 19355 122107 112130 103725 88187 268949 58767
17375 362551 318216 442059 -19803 131997 200743 222744 336017 -64267 259807 288554 -45081
17363e6927B29534f8154C48686A25422b8685G5739E996d6087Q793R852A56440
17351D5351a0837n128D20585g050C1301b39259B03984J19656n7028A30281K0793
17340A51074R940O3953F5849N13176A4474K55705J28829k5395A47333C062Q6182
17329H9244j0805a45426B16727d6989D62410a23085C26094A08522a28444k815
17319a31259G5019J25342K64001F3382M04482j74145R6762j02682A34341a11380
17308A65854L85958E4718q041M45824A01768J90040b4430A49467K3262J1575k4775
17297A59529F4709a0575B25359d904E717J93987K28489G7465K23061H809L312
17286A2121J5187O8087b0535B89625d3941F9762c1070B2518N5030J54888p8337
$$ plain form
17363 -56927 229534 -68154 348686 125422 -28685 75739 5996 -46087 -37294 -27442 156440
17351 45351 -10837 -15965 420585 -7050 31301 -239259 203984 323640 266612 130281 151074
17340 151074 161014 224967 65849 579025 14474 270179 399008 373613 147333 3062 89244
17329 89244 78439 -145426 216727 -46989 462410 -123085 326094 108522 -128444 -131259
17319 -131259 75019 200361 464362 63382 467864 293719 390481 287799 134341 -111380
17308 165854 551812 54718 46677 492501 101768 291808 -24430 149467 172729 184304 159529
17297 159529 64709 -10575 225359 -4904 5717 199704 428193 77465 300526 8809 12121
17286 12121 27308 95395 -20535 289625 -43941 69762 -31070 22518 77548 232436 154099
17275A54099m1980P8489L0410A03523M2459J31859K17588k35659K85468A64216
17264C78593A42940J64492b7589H4160J60885J85884o4123j58991R6047J99233
17254E03095I5350K02388J70764j76022j12553D083L23079Q063L49287b3727E36128
17242b012F02194k95205j33650L38105d4177A85246L92034A54581c4420C79189
17231A90979L92798b3446F23817k27916A91707B4502n54L66595e5329D04596k6376
17220C78220j54432K234N6660O7860B1257M45870F3012J90585l4065o8303K58144
17209D09373A70998J1253J29889J86566j00593o8260Q9183A98410K59139B05868
17198B69860m7813J45362O1008a64067A69174p2831b1095A43565N15j9080K32963
$$ plain form
17275 154099 112119 190608 221018 103523 145982 277841 495429 259770 545238 164216
17264 378593 142940 307432 -27589 84160 245045 430929 366806 207815 303862 503095
17254 503095 95350 297738 468502 292480 179927 4083 327162 335225 684512 -23727 536128
17242 -2012 602194 306989 173339 511444 -44177 185246 577280 154581 -34420 379189
17231 190979 583777 -23446 623817 395901 191707 24502 23948 390543 -55329 404596 378220
17220 378220 223788 226022 282682 350542 21257 467127 63012 253597 219532 151229 409373
17209 409373 170998 182251 312140 498706 398113 329853 419036 198410 457549 205868
17198 269860 222047 367409 428417 -164067 169174 96343 -21095 143565 144080 125000 357963
17187C57963K8526L548J03815j94354J61566j77966b62108A96986L64422m1636
17177E19772j02262j81138M59228j04722k07665J23057j30802j7929Q3817L6020
17167D77376M5176j86087A23426J11135J21980j60287J41083j3654l8510H9289
17156C49951R1214j86269p702R8924J75082J5371j52500a9180A55014P73073D7091
17144B72096J45648K31540j86910j94358K29020l3892m9443A21822L79483R5825
17134E97130j65193j65666f2647E67157k33058j19126M81797B47128m5101K2655
17124B24682J84449l3260J29032j55456K34972k46308O0244P9658R45k13867J93999
17113D59090q4314J56231j66849L05153l09062K28900k00231m6662J42042j72468
$$ plain form
17187 357963 386489 390037 493852 299498 461064 283098 -262108 196986 561408 519772
17177 519772 417510 236372 695600 590878 383213 506270 375468 357539 441356 477376
17167 477376 522552 336465 123426 234561 356541 196254 337337 323683 285173 89289
17156 349951 441165 254896 247194 346118 521200 536571 384071 -19180 155014 928087 47091
17144 272096 417744 649284 462374 268016 497036 463144 413701 121822 501305 597130
17134 597130 431937 266271 -62647 567157 334099 214973 696770 247128 202027 224682
17124 224682 409131 375871 504903 349447 584419 338111 398355 478013 478958 265091 459090
17113 459090 374776 531007 364158 669311 360249 589149 388918 342256 484298 311830
17103C11830q9904L58500j62481j33296K07588k05694K31524B23068M3859K75031
17093E41958m282p2054A57231K26233K52705B56804K33056O8523Q1236j66296
17083D73323P550j44984J55091L46077l62049j39405J06605K27210J09069k81379
17073D97108j7013K26091L6767C28780J08562K08949D0686L27851J85899M5226
17063E99662k89865P1558K23972B90191J03895K41112j38395J51713j17802p4581
17053D56133J1430J06133k4738k3906Q5051o2322J68597j82390J18948K45741
17043H98677j58267J10538k77923o7499l7009j46936K91819J18929k39260J85473
17033F78542O198J25218j29905L7862J52097k21222K18579o3263l5268k46402
$$ plain form
17103 311830 221926 580426 417945 284649 492237 286543 518067 223068 266927 541958
17093 541958 537676 465622 157231 383464 636169 256804 489860 558383 639619 473323
17083 473323 480873 335889 490980 837057 475008 335603 442208 669418 778487 497108
17073 497108 480095 706186 742953 328780 437342 646291 40686 368537 554436 599662
17063 599662 309797 381355 605327 290191 394086 635198 496803 648516 530714 456133
17053 456133 467563 573696 548958 525052 610103 547781 716378 533988 652936 898677
17043 898677 740410 850948 573025 505526 468517 321581 613400 732329 493069 678542
17033 678542 684740 809958 680053 717915 870012 648790 867369 804106 768838 522436
17023E22436K51416j26933L03832m16881J87367J39620R8268m10307J61257l5511
17013F74564J52504K37001m49863L8390L2305J65155j29657K15148J03079j67221
17003H71405O1356O7888n6569L0761l845J70448l88396r6861n4667L05545L01303
16992A208368k67511m5083K33650l41963L9394r1204N41683o04128K73481n1281
16982H95406J69998j26773j36186M23043l10493J24914K10760m18230K40120n6187
16972A016372J87342l6217J835j65960L19948M0082k39196p1585K21327q3397
16962A190551p0512m9187L78598m42731P4197L71219R8629K7481p10087O04097
16952A472255m16015K15973j25652L92658j64593m8523Q9897L1141k21796J07513
$$ plain form
17023 522436 773852 646919 950751 533870 721237 860857 959125 548818 710075 674564
17013 674564 827068 1064069 614206 652596 684901 850056 720399 935547 1038626 871405
17003 871405 932761 1000649 944080 974841 970996 1141444 753048 656187 601520 907065 1208368
16992 1208368 940857 895774 1129424 787461 826855 735651 1277334 673206 946687 895406
16982 895406 1065404 938631 802445 1225488 914995 1039909 1250669 832439 1072559 1016372
16972 1016372 1203714 1167497 1169332 1003372 1323320 1363402 1124206 1052621 1273948 1190551
16962 1190551 1120039 1070852 1449450 1006719 1080916 1452135 1550764 1578245 868158 1472255
16952 1472255 1056240 1272213 1146561 1539219 1374626 1326103 1416000 1447141 1225345 1332858
16942A332858l2326K01693m50404L85158O2045l23088J97765K75259P8520k4046
16932A703434k00148j96097J53732L0450J15884j66669k7440k69008O80868m30090
16922A394916L53793P2237l59748K17972M42478n14810j25497K23708L25653j86409
16912A844293m1485O486n5253j79094M61446j96255R2624j2243K11933L8711J6500
16901B187663k40351K35668J3323q2365J25804l8364J01289n5653J52989k25111
16891B174892M20769l96514K06914L61092m46753R6890k7054K32411J80334j25667
16881B677314j47455q6757r746K35110j23479L49957O2375k82782M01994j08440
16871B968091J45716J69927k36776n9120J50546j82324L01063k91017J80900l599
$$ plain form
16942 1332858 1300532 1502225 1051821 1436979 1499024 1175936 1373701 1648960 1727480 1703434
16932 1703434 1503286 1307189 1460921 1491371 1607255 1440586 1413146 1144138 1825006 1394916
16922 1394916 1748709 1820946 1461198 1679170 2121648 1606838 1481341 1705049 2030702 1844293
16912 1844293 1802808 1809294 1754041 1574947 2036393 1840138 1932762 1920519 2132452 2171163 2187663
16901 2187663 1947312 2182980 2196303 2113938 2239742 2201378 2302667 2247014 2400003 2174892
16891 2174892 2595661 2199147 2406061 2767153 2320400 2417290 2390236 2622647 2802981 2677314
16881 2677314 2529859 2443102 2433356 2668466 2544987 2894944 2957319 2674537 3076531 2968091
16871 2968091 3113807 3283734 3046958 2987838 3138384 2956060 3257123 2966106 3147006 3143407
16861C143407N2294J15548R0563J54521K65021n2567k19845q7957L52342k95485
16851C517842K33111M10210k92744K92614n1689K12584j82623m2358K45532n8752
16841D283727L57404l32990K96491M0634J77107R611K76827J14317K67229j72685
16831E317672L07743m65288K02357L32670j1374K4188J51676J37102J9750j51974
16821E864522P38716K39052l54183J04123N56109l83302J34015K90297M21084
16812G610433k928K90061j49358M78933P0518L6506J36445M05673k7772L53439
16802I201950N20596j07979k7542P85682k43015k6811N79181L53574K3050M14956
16792A1473642K76120M24901M40920O6514N11852m7910O16727L70332K54958N20436
$$ plain form
16861 3143407 3195701 3311249 3401812 3556333 3821354 3768787 3548942 3460985 3813327 3517842
16851 3517842 3750953 4161163 3868419 4161033 4109344 4321928 4139305 4096947 4342479 4283727
16841 4283727 4641131 4308141 4604632 4645266 4822373 4831984 5108811 5223128 5490357 5317672
16831 5317672 5625415 5160127 5362484 5695154 5683780 5707968 5859644 5996746 6016496 5864522
16821 5864522 6603238 6842290 6488107 6592230 7148339 6765037 6899052 7189349 7610433
16812 7610433 7607505 7897566 7748208 8227141 8297659 8334165 8470610 8876283 8848511 9201950
16802 9201950 9722546 9614567 9587025 10372707 10129692 10102881 10682062 11035636 11058686 11473642
16792 11473642 11749762 12174663 12615583 12682097 13193949 13146039 13762766 14133098 14388056 14908492
16782A4908492L40530N95001L60956M47041O70462L10480Q12151K73147M96836
16773A9215096N36872L92446J155228P33206P60198P03234P07926P14646R09693
16764B5828545J180928R08044P78388J329548J166311J195819J261795J342517
16756C4991895J255485J615282J513831J672575J736905K276220K058646J822526
16748D8943365K230254K530855K386148K408451L086277L102933L399495L099886
16740G1187664L376585L945534L924626M403449M435146M507713N003534M698978
16732A05483229N370938N204472N807808N322277N574884N766203N484423N340420
16724A49354654N211909M200765M164416L248865L163382J870106J091217M69668
$$ plain form
16782 14908492 15249022 15844023 16204979 16652020 17322482 17632962 18445113 18718260 19215096
16773 19215096 19751968 20144414 21299642 22032848 22793046 23496280 24204206 24918852 25828545
16764 25828545 27009473 27917517 28695905 30025453 31191764 32387583 33649378 34991895
16756 34991895 36247380 37862662 39376493 41049068 42785973 45062193 47120839 48943365
16748 48943365 51173619 53704474 56090622 58499073 61585350 64688283 68087778 71187664
16740 71187664 74564249 78509783 82434409 86837858 91273004 95780717 100784251 105483229
16732 105483229 110854167 116058639 121866447 127188724 132763608 138529811 144014234 149354654
16724 149354654 154566563 158767328 162931744 166180609 169343991 171214097 172305314 172774982
16716A72774982j51942j701829k421107k766864l840606m557930m556453m947295
16708A47830956n817053n475425n605185o182761n666406n295491n641791n592394
16700A02554450m482102n202353m698349m586549m381970m233098l414811l750140
16692F7805078l133614l154204k945902l200762k393969k521172k007035k646089
16684D5802331j969071j875399j891601j575386k245266r62759j682458j584051
16676C2016340q21618q73846j489755j251835r35361j408241m47821j177111m90368
16667B3120384r85358j136950k31785q25493r49415l57748r23587q201m17050
16658A7284797q78834n72430m77363l77076k40917r53105L9557n23791l60274
$$ plain form
16716 172774982 172623040 170921211 168500104 165733240 161892634 157334704 152778251 147830956
16708 147830956 142013903 136538478 130933293 124750532 119084126 113788635 108146844 102554450
16700 102554450 98072348 92869995 88171646 83585097 79203127 74970029 71555218 67805078
16692 67805078 64671464 61517260 58571358 55370596 52976627 50455455 48448420 45802331
16684 45802331 43833260 41957861 40066260 38490874 36245608 35282849 33600391 32016340
16676 32016340 31194722 30320876 28831121 27579286 26643925 25235684 24787863 23610752 23120384
16667 23120384 22135026 20998076 20766291 19940798 18991383 18633635 17710048 17701847 17284797
16658 17284797 16405963 15833533 15356170 14979094 14738177 13785072 13824629 13300838 12940564
16649A2940564o38831m18872R1991l15695k24222o12638j04118k40964j74940
16640A0302275l45620l61387j79282m60073n6023k11263k06488N1806k04001l37930
16630G992014m87990J38042p27607p374J06080J35014k98771k05936K8792l35216
16620F337048J7688q626o37464N12854n90967j4566l41821J3040p5409n121l57044
16609D849612L3426l3567J07577j37394n73223L90726l11474j18634J46458j46314
16599D207193N812P7537j89648L93681j36482m44955l926P6422m54322K74424
16589C805736o43734M41670k4871k37172N2958N5750m18989R3731J83408j63173
16579C145314n15158K77381n8709J02513k21164J94679l74132K79712l63742J5692
$$ plain form
16649 12940564 12301733 11882861 11974852 11659157 11434935 10822297 10718179 10477215 10302275
16640 10302275 9956655 9595268 9415986 8955913 8899890 8688627 8482139 8533945 8329944 7992014
16630 7992014 7504024 7642066 6914459 6907085 7013165 7148179 6849408 6643472 6672264 6337048
16620 6337048 6354736 6346110 5708646 6221500 5630533 5615967 5274146 5287186 5211777 5206656 4849612
16609 4849612 4883038 4849471 4957048 4819654 4246431 4637157 4325683 4207049 4353507 4207193
16599 4207193 4213005 4290542 4100894 4494575 4358093 3913138 3909212 3985634 3531312 3805736
16589 3805736 3162002 3603672 3578801 3341629 3394587 3450337 3031348 3125079 3308487 3145314
16579 3145314 2630156 2907537 2848828 2951341 2730177 2924856 2550724 2830436 2466694 2482386
16569B482386K36122n9856k36809q2077N25185l84334P7130l25659k70782M98446
16559B459752J57614n65292M89530o64632K73178N4788J31238m11703J61387j32981
16549A952879Q6571l3049j27538J32995j84152k46414K64047m2375J69035j72313
16539A799686j04245M1093j65765J62372K37137l06837j08448J75087r7058l45053
16529A287969N11206k78553K79053k16150r1787M05269k99584k7238j97311J53426
16519A526300k9903p237k1316k30842P6498k66761K76859P3980P2948k02039j21064
16508A147423L09813n9899j46937m1155l7447j141K64170m59516M91863j10916
16498A356258l77948L67167j49308j59597k2475J17083L10839j2090l66578M3474
$$ plain form
16569 2482386 2718508 2658652 2421843 2339766 2864951 2480617 2557747 2232088 1961306 2459752
16559 2459752 2617366 2052074 2541604 1876972 2150150 2204938 2336176 1924473 2085860 1952879
16549 1952879 2039450 2006401 1878863 2011858 1827706 1581292 1845339 1802964 1971999 1799686
16539 1799686 1695441 1736534 1570769 1733141 1970278 1663441 1554993 1730080 1633022 1287969
16529 1287969 1799175 1520622 1799675 1583525 1491738 1897007 1597423 1570185 1372874 1526300
16519 1526300 1496397 1489160 1467844 1237002 1313500 1046739 1323598 1397578 1470526 1268487 1147423
16508 1147423 1457236 1397337 1250400 1209245 1171798 1170657 1434827 975311 1467174 1356258
16498 1356258 978310 1345477 1196169 1036572 1014097 1131180 1442019 1429929 1063351 1106825
16488A106825J84727Q2028k33421k18369J01843P4627O6734j02644J62852l23657
16478I01545Q3741j54546N1213K49781j52612j94817j35963L59534K5758k05465
16468H28169K54319j18506r0589l80388K89311L3165k14317K86456D27592K26283
16458F53875P3626o7076l3427K01547l142L6798m439p9287r2926K17990O2192
16447I65731l43871q7542K65060j0188k68831J43157k91702J18063L12789j26677
16437F75989j81229K15277C18033J83726q2873M77617l47674o6496J92850k37524
16427D37659J47307j8477m4248K9797B45506J66919N24600l00852k50268L82402
16417G68307C35200O06215m67411n9524J44578l2782l2169J64711j17462q8815
$$ plain form
16488 1106825 1291552 1373580 1140159 921790 1023633 1098260 1164994 1062350 1225202 901545
16478 901545 985286 830740 881953 1131734 979122 784305 648342 1007876 1033634 828169
16468 828169 1082488 963982 873393 493005 782316 815481 601164 887620 427592 653875
16458 653875 727501 660425 626998 828545 825403 862201 857762 778475 685549 903539 965731
16447 965731 621860 534318 799378 789190 520359 663516 371814 489877 802666 675989
16437 675989 494760 710037 318033 501759 418886 896503 548829 482333 675183 437659
16427 437659 584966 566489 522241 552038 245506 412425 937025 636173 385905 768307
16417 768307 335200 941415 474004 414480 559058 526276 494107 658818 541356 452541
16407D52541J37651q1341Q1400k0832K1107M2669A81781N29424j10326B71382
16396D68745K5614j99237L13017q4278j06270j61143N10960j81741J04597J63656
16386H53920B86688J46852j78907L73061B88041n857J3196J82152j63917K8763
16376C42378I3682N7371J59390J19378L9306A46107J35800J04134N5706M935j7506
16365D29176P5820K45537G9543N95831j76230c8276C87678L3057K87596j50143
16355E58188G9470Q5693P5054K6108J75407j28148R0942P2219Q4379r3377j27947
16344C39800M6847K43874A10444J46493P8996n3196L40160A85887a85214F95684
16333D65265B31773K36694o3032K27201j15895k21664r2755L3520J99791j45499
$$ plain form
16407 452541 590192 508851 590251 569419 590526 633195 181781 711205 600879 271382
16396 468745 494359 295122 608139 523861 417591 256448 767408 585667 690264 853920
16386 853920 286688 433540 254633 627694 288041 282184 295380 477532 313615 342378
16376 342378 93682 151053 310443 429821 469127 146107 281907 386041 441747 446682 429176
16365 429176 504996 750533 79543 675374 499144 -38276 387678 420735 708331 558188
16355 558188 79470 165163 240217 266325 441732 313584 404526 476745 561124 467747 339800
16344 339800 386647 630521 110444 256937 335933 282737 622897 185887 -185214 695684
16333 465265 231773 468467 405435 632636 516741 295077 202322 235842 435633 290134
16323B90134M1237j4147j05687K9255N3737J5417o1482F2368R5702J91617n7536
16312B92151A42014K0806K34658B645L39230B5415K14300e5510G8407L2572j325
16301A09654J41354j12811N25082A13318K18328J0121j50080J76470r4675G5592
16290C73945d822C44016J30943A09291Q8172O9189R8126j37939p877J59880j40064
16279B38778n0315j1006C03K79216p9646M66J27868q55J26674n5830j28223G4594
16266B73532A03236l290L06886A14297P811m5129a02484C82741j72380R4867A00957
16254A40482J09483a74285B33663C2918K428J62590f4312F6056k6247J78463E1077
16242C1279J55020C1242O3399i5564A09950f9525A42421P5767K6161J56427A54101
$$ plain form
16323 290134 331371 317224 211537 240792 294529 309946 248464 62368 158070 349687 292151
16312 292151 142014 162820 397478 2645 341875 25415 239715 -55510 78407 110979 109654
16301 109654 251008 138197 663279 113318 331646 341767 191687 368157 273482 75592
16290 373945 -4822 344016 474959 109291 197463 266652 364778 226839 218962 378842 238778
16279 238778 188463 177457 303 279519 199873 200339 328207 327352 454026 398196 269973 74594
16266 273532 103236 99946 406832 114297 122108 76979 -102484 382741 210361 305228 100957
16254 140482 249965 -174285 233663 32918 35346 197936 -64312 66056 39809 218272 51077
16242 31279 186299 31242 94641 -95564 109950 -69525 142421 218188 244349 400776 154101
16230A32992K9616a41101D56495A22679L26915F2240b72834D93993k2479E0460
16219B34170P347b130A06574L3028h072j79491A50553E9256b4373A11516b03706
16207C12464A6326J12881K17198q3104j30902A8567Q9426b6595C96286A85761
16196B8330K94560Q0178a34928J1953E9041J33643D2229O3399J43022b72588D29107
16184c4143J1249E8444J75514a07433R33H93M13960G8041L4866d00689A29779
16172A59608a49837H2579L35345A26358B8366K01736p0710n3079a29139B19731
16161C61646A10809J11791A0761e5035I5046K07105E1830J34100N899Q6249A3418
16149E7239J70711o4379p341p7991M8543J95450b40726A49253e3416r5472H4236
$$ plain form
16230 132992 162608 -141101 456495 122679 449594 62240 -272834 493993 471514 50460
16219 234170 241517 -2130 106574 139602 -8072 -187563 150553 59256 -24373 111516 -203706
16207 312464 16326 129207 346405 263301 132399 18567 107993 -26595 396286 185761
16196 28330 322890 403068 -134928 -122975 59041 192684 42229 105628 248650 -272588 429107
16184 -34143 -22894 58444 233958 -107433 -106500 893 414853 78041 112907 -400689 129779
16172 159608 -149837 82579 417924 126358 28366 230102 159392 106313 -129139 219731
16161 361646 110809 222600 10761 -55035 95046 302151 51830 185930 191829 278078 13418
16149 57239 227950 163571 156230 78239 126782 322232 -240726 149253 -53416 -148888 84236
16137A54176G2506i1505A67776J31474i1329L9432j66688e5752G4964a47522j26643
16126b74165C4735G216J47845Q7769j12507a29138b0192A4589K01481a32017H7041
16114a29509A32204K3767D4852d6549H5596a07102G8163h2681A09604d8164D0632
16102B04643r6581K57515c2409C48201A66224C9066o94K00235o7557k0644n9448
16091I0958J37910H1017M8809K78757A1448a6687F5174a02789j57242A25081D0844
16079g2142H850c74130A40638a57656k87366B88082b02132A24969d1781A9553
16068A43300f0363A79700e7182a5431p2844A39127a68686A23700B7651G623J5251
16057B2874h0176k8449B80607D77J18332a19944K9739B14510a08892A3026a17706
$$ plain form
16137 154176 72506 -91505 167776 299250 -91329 -51897 -218585 -55752 74964 -147522 -274165
16126 -274165 34735 7216 155061 242830 130323 -129138 -20192 14589 216070 -132017 87041
16114 -129509 132204 155971 44852 -46549 85596 -107102 78163 -82681 109604 -48164 40632
16102 204643 108062 365577 -32409 348201 166224 39066 38372 238607 171050 150406 90958
16091 90958 228868 81017 129826 408583 11448 -16687 65174 -102789 -260031 125081 40844
16079 -72142 8850 -374130 140638 -157656 -445022 288082 -202132 124969 -41781 19553
16068 143300 -60363 179700 -57182 -15431 -88275 139127 -168686 123700 27651 7623 22874
16057 22874 -80176 -108625 280607 477 118809 -119944 -90205 214510 -108892 13026 -117706
16045B34705a93955A80058N667b01867A17739d5762B03812a31224e3314F0380
16034b63946I8530B7035J38193C3070n570g8259D2598c23506B29382j13014f3331
16022F9979C2317d2576B88386j14041b26730N767A08283l6562k0303n218b89213
16010H9279Q9170f7856B65176c19871j6611E6797M2334B0235b01840d2650A00904
15998C89673H4179K7347h0496j05071B26655K69604A80560J20255a98231C39710
15987h5574L636r0601I398b10124B83838l7091K44907k40777L2816M2072a01194
15975B05278b3811c133A47381K02516j48121a6732B08511d5441I9830h5807k84216
15964c70023B56820c1699F1449L5172L3728b38452m2097N5621H8111k1192A6290
$$ plain form
16045 234705 -193955 180058 185725 -201867 117739 -45762 203812 -131224 -53314 60380
16034 -263946 98530 27035 165228 33070 27500 -78259 42598 -323506 229382 116368 -63331
16022 69979 32317 -42576 288386 174345 -226730 -220963 108283 71721 51418 46200 -289213
16010 89279 178449 -67856 265176 -319871 -336482 56797 99131 20235 -201840 -42650 100904
15998 389673 84179 111526 -80496 -185567 226655 496259 180560 300815 -198231 339710
15987 -85574 -81938 -172539 9398 -210124 283838 246747 491654 250877 283693 325765 -101194
15975 205278 -23811 -3133 147381 349897 201776 -16732 208511 -45441 99830 -85807 -370023
15964 -370023 256820 -31699 61449 96621 130349 -238452 -280549 -224928 88111 66919 16290
15952d528j24883G8293J69626q5847E765a86011d0700k4770A9417Q6040e2360
15940B0259J3656C159c04017d8271D7811c2746K849j99581N2567b6763k7696B20673
15927a59806J3642A56068J40044Q6669c68564J40365k5983j41718a8968l989j26710
15916a49667A21187b46049N4732A1470b29242I4428b82025a23255K047A20219
15905a1676k16909G4293J44251c0848o5230D7598b23501A32283J0892b81939a30608
15893b58686A332b52433d3137k21576a3608j43052I1468a93066r0735e2332B5268
15881c28223d3213g02B23693a54075B10133b34841B14852m1252c33757h7079B1454
15869b13995F6226b45301O7806m8109a5193q9831A63615a75505P2692A17950P2185
$$ plain form
15952 -4528 -129411 78293 247919 162072 5765 -186011 -40700 -65470 19417 105457 -52360
15940 20259 33915 3159 -304017 -48271 47811 -32746 -29897 -229478 -176911 -26763 -54459 220673
15927 -159806 -146164 156068 296112 382781 -368564 -228199 -254182 -395900 -18968 -22957 -149667
15916 -149667 121187 -246049 -191317 11470 -229242 94428 -282025 -123255 -121208 120219
15905 -11676 -228585 74293 218544 -30848 -96078 47598 -223501 132283 143175 -281939 -130608
15893 -258686 1332 -252433 -43137 -264713 -13608 -156660 91468 -193066 -283801 -52332 25268
15881 -328223 -43213 -702 223693 -154075 210133 -234841 214852 173600 -333757 -87079 21454
15869 -213995 66226 -245301 -177495 -225604 -15193 -105024 163615 -175505 -102813 117950 190135
15858A90135g0728B41546J31561Q7156f3495A27455N7125R5594b58340A80843
15847a22012A88125e5317a8253B20582G0748J76066a00293c1954A76062a61353
15836b0279k88256G8693R1349a86100A22397K2061O0828d6365b314B1693J08209
15825A29902M3205O0735c7577D1070Q5009l8791K6352b48658o876g9443B00584
15813d86170J63219A44165L46C8987J48061g087G759K8662P9065a35422i149B97599
15800F8687a53629B4665N3992c07171B9183g1375G0575L5344B2569J60502b87930
15788a48626B9573d80738a71089B9909a82199D3359a84297K4314A65721L4267
15778A99988K0017a77169h6012l36331b7591j29564B00839C9334i6154F6444K24276
$$ plain form
15858 190135 -70728 241546 373107 460263 -63495 127455 184580 280174 -258340 180843
15847 -122012 188125 -55317 -18253 220582 70748 246814 -100293 -31954 176062 -161353
15836 -20279 -308535 78693 170042 -186100 122397 144458 205286 -46365 -2314 21693 129902
15825 129902 173107 233842 -37577 41070 126079 87288 113640 -248658 -255534 -79443 200584
15813 -486170 -322951 144165 144511 38987 187048 -7087 7759 36421 115486 -135422 -9149 297599
15800 68687 -153629 24665 78657 -307171 29183 -71375 70575 105919 22569 183071 -287930
15788 -148626 29573 -480738 -171089 29909 -182199 43359 -184297 -159983 165721 199988
15778 199988 220005 -177169 -86012 -422343 -27591 -157155 200839 39334 -96154 66444 290720
15767B90720J06424A20174J6957d8515A89434m6077a97418p6949E3185N7273K1552
15756A32010b02802R8252k27729C0655b88649A60651D2782i3268A21898h194A20171
15744c1537B12755a01056n0236d8853l81814a02506F1754k500c74107a04814B3478
15732D9653A4828g4653A2852b6335E0452j9026j0045a73656k9668B6694Q6611
15721A13305b65412J28694A94624d2843A63969d6954J2415o9053d5072j7588k09369
15710b72029H1162a13515m4719N6300A59250J70350e4516A9416K1989A7433h3813
15698G7019a27536e76j41696K4113a5350m7460r8307C4501P9888c39328A15562
15686a97285I247d4591F6460a16280c6170E1980l369c2076o3561G469R9038b81579
$$ plain form
15767 290720 397144 120174 137131 -48515 189434 143357 -197418 -274367 53185 110458 132010
15756 132010 -202802 -104550 -332279 30655 -288649 160651 42782 -93268 121898 -8194 120171
15744 -31537 212755 -101056 -151292 -48853 -430667 -102506 61754 59254 -374107 -104814 23478
15732 49653 14828 -74653 12852 -26335 50452 31426 21381 -173656 -203324 26694 113305
15721 113305 -265412 -136718 194624 -42843 163969 -46954 -34539 -103592 -45072 -62660 -272029
15710 -272029 81162 -113515 -158234 -101934 159250 329600 -54516 19416 41405 17433 -83813
15698 77019 -127536 -576 -142272 -118159 -15350 -62810 -161117 34501 114389 -339328 115562
15686 -197285 9247 -44591 66460 -116280 -36170 51980 48611 -32076 -95637 7469 106507 -281579
15673B38728C3772J84099l878a15979H0873b9424j54806A01072B8888P0234a67900
15661B88578h1878l8420I8318a86496c3822a5155j0713j85254n7249D9737J32659
15650A82396a48930c4101j94917e3562l4003j8691A81879J03082B5867P8634D964
15638B21763H0088d8250n2702l5061k8814E7540B1569N2236N1467d479C6272Q0332
15626A16604j3434J02506d04323a30417E04231j47989f0961r2439A54994J62592
15616C17586b10629J03040A59968g241B0379a39317A01624P6452p0009a78888
15605g4202A80145H8580d54973A94338h7571l5910N2504j62521e4205j82798O9391
15594a67612I1574a50349N0313D3765i7732A91192c24316G7958b7090A68266A8647
$$ plain form
15673 238728 33772 217871 213993 -115979 80873 -29424 -184230 101072 28888 99122 -167900
15661 288578 -81878 -120298 98318 -186496 -33822 -15155 -25868 -211122 -268371 49737 182396
15650 182396 -148930 -34101 -229018 -53562 -87565 -106256 181879 284961 25867 104501 4964
15638 221763 80088 -48250 -100952 -136013 -164827 57540 21569 73805 125272 -4479 36272 116604
15626 116604 103170 205676 -404323 -130417 504231 356242 -60961 -153400 154994 317586
15616 317586 -210629 -107589 159968 -7241 20379 -139317 101624 178076 108067 -178888
15605 -74202 180145 88580 -454973 194338 -87571 -123481 -70977 -233498 -54205 -237003 -167612
15594 -167612 91574 -150349 -100036 43765 -97732 191192 -324316 77958 -27090 168266 18647
15582d17163F635L175a00588q8035j76683D47236G0099j9948R2906a02210B99241
15570a44057B10230H858J92072c63898J1365d5731A38377c26222B43481D5187
15559B0211L4614i4725j54317B01607h636A55639a15901E2517k3779b0309q6135
15548a06444j0327j6888B30691c3899n3723d1394A59046b37533A56882m214D7261
15536a13170D0754n107O986L19602a32067p2276o0966h7916m1490j49721B02470
15524a7394A71439E6278d7373A39155a00397b4062B73351j00688O6537m8303N7804
15513B48701B9698b5942E1602J98697a61415D6802J62455r1184a68667O3391P177
15502i8099j00088B61918p5453c0856j13504D31525a92481A78179o9352l6805
$$ plain form
15582 -417163 6635 9810 -100588 -188623 -365306 447236 70099 50151 143057 -102210 299241
15570 -144057 210230 8858 200930 -363898 -352533 -45731 138377 -326222 243481 45187
15559 20211 54825 -94725 -249042 201607 -8636 155639 -115901 52517 28738 -20309 -106444
15548 -106444 -116771 -133659 230691 -33899 -87622 -41394 159046 -237533 156882 152668 47261
15536 -113170 40754 35647 42633 362235 -132067 -204343 -265309 -87916 -129406 -279127 202470
15524 -17394 171439 56278 -47373 139155 -100397 -24062 273351 172663 239200 190897 248701
15513 248701 29698 -25942 51602 250299 -161415 46802 209257 118073 -168667 -105276 -98099
15502 -98099 -198187 261918 186465 -30856 -144360 431525 -192481 178179 108827 72022
15492G2022e0342m4040B3889J61349g9189A5490J15559a20261c1035A35968d2451
15480a90030E5135a69633j0888D5966M197b19006J2248H711K37685B4137K33450
15469B57587r1860a29210f3845M211G1491c7375B12064L20163A01241P7664m1430
15458A37475L0354c5145D6852a01825A92840A5431J3961f8405q1798A83595b97622
15446b14839e4576G0010D350a15797a1185o1603A05470a3312k89364D501J80142
15435A84643c02G8815A3205J07014J31142L5585C7613c8277A52278o1411b4136
15423A09929d3018J167b873l4967A72789Q0346c56783E8514a01143p4615A8423
15411a8078j08167A92117H619b82136J12652I9982f0456J8961l04226D3011N0820
$$ plain form
15492 72022 -50342 -94382 23889 185238 -79189 15490 131049 -120261 -31035 135968 -42451
15480 -190030 55135 -169633 -180521 45966 50163 -219006 -206758 8711 246396 24137 257587
15469 257587 165727 -129210 -63845 -59634 71491 -37375 212064 532227 101241 178905 137475
15458 137475 167829 -35145 46852 -101825 192840 15431 29392 -68405 -150203 183595 -297622
15446 -214839 -54576 70010 4350 -115797 -11185 -72788 105470 -13312 -302676 4501 184643
15435 184643 -302 78815 13205 120219 251361 286946 37613 -38277 152278 90867 -24136
15423 109929 -43018 -41851 -2873 -37840 172789 253135 -356783 58514 -101143 -175758 18423
15411 -18078 -126245 192117 8619 -282136 -169484 99982 -60456 -41495 -345721 43011 93831
15400I3831a62041B9062a38763A76985A7628a65733B79753a40240C06516h8928
15389C1170L93804A32734l0105b02710m8507c536a118A53240d7741j22347C3498
15377A7450a74138g0222D1500L7396B1151O7243d4966j12702j44880a15866A37788
15365c18926g808k90750d9988q4212j12321A18731k2277e919B50548r9041K4410
15354A75917b48258C07174r0579m5437q4176J13975j5644K3378J08345a05892
15343c00491Q4162d9626j13853A58891a85640k40212J70236J06506C4264a25745
15332a4390k22230e9628m299n9681D7611J30196d8078G2860f811C35758E1675
15320C60419A18086K87629r6496E8891a50177K4765B68307a19849A07226f5767
$$ plain form
15400 93831 -162041 29062 -138763 176985 17628 -165733 279753 -140240 306516 -88928
15389 31170 424974 132734 102629 -202710 -251217 -3536 -1118 153240 -47741 -170088 33498
15377 17450 -174138 -70222 41500 78896 21151 88394 -44966 -157668 -302548 -115866 137788
15365 -318926 -7808 -298558 -49988 -134200 -246521 118731 96454 -5919 250548 151507 175917
15354 175917 -248258 307174 216595 171158 86982 200957 185313 208691 317036 -105892
15343 -300491 -216329 -49626 -163479 158891 -185640 -425852 -255616 -149110 34264 -125745
15332 -14390 -236620 -59628 -63927 -123608 47611 177807 -48078 72860 -6811 335758 51675
15320 360419 118086 405715 309219 58891 -150177 -125412 268307 -119849 107226 -65767
15309F8278a69301B85162j23663E5670a2784M087C23733j02294p8650Q9929a07598
15297G3419L72L60879A53572G3446a23216B36002a16739H6558J76026k7955i1153
15285A82048J19556i1809A7013f2602C52252c6250D0533K28095q9626K9237n0954
15274A57285B5709F783L98036d4059B28039a28902K3508K207I2252J59104E4958
15262C02203j5564b3776H4454K00768K8238A48469J07326h3740B50554D9267M0482
15251H9749c74453A19899J21293J05595L16485M30224R74556j50702J9002L43594
15241B279946A014038B70109K23167B3524J78455H0940c12893b3063C6237a19002
15230e450A25339O886K952K30833d7716I3604j3757c7770J0714k00020A78453
$$ plain form
15309 68278 -169301 285162 161499 55670 -12784 -8697 323733 221439 142789 232718 -107598
15297 73419 73791 434670 153572 73446 -123216 236002 -116739 86558 262584 234629 -91153
15285 182048 301604 -91809 17013 -62602 352252 -36250 40533 268628 179002 208239 157285
15274 157285 25709 6783 404819 -44059 228039 -128902 -105394 -103187 92252 251356 54958
15262 302203 286639 -23776 84454 285222 313460 148469 255795 -83740 250554 49267 89749
15251 89749 -374453 119899 241192 346787 663272 1093496 2068052 1917350 1936352 2279946
15241 2279946 1014038 270109 493276 23524 201979 80940 -312893 -23063 36237 -119002
15230 -5450 125339 132225 135177 366010 -47716 93604 79847 -37770 -27056 -227076 178453
15218B8641Q5477a7166A86693g2001C66885b33596J00428j051A7840J73916J31094
15207C22850j47257b9450A62753B7213J93657L16957G1208O5413L4065b50354
15196a06927H508i967q9530k87308A75415C1447a64l24495e2454G0126K3937n228
15184H8835b0735A07695K4844J06315L43915b17787D3389J91317E429b62438M8471
15173b13967g4652A00626a21709j42424C1928K11599C2131J60363Q3420L9389
15163C15303a75245B0235c4936B31934c6705a0746A41175c5453n4901F7603a67810
15151A27786K05993o0215p969J97025A09235J8303B8235R4242i1301B23431j11353
15140A12078J44552q011o8843o6256Q6529l5922o6150J34506G8745a28985C16125
$$ plain form
15218 28641 114118 -17166 186693 -72001 366885 -233596 -133168 -134219 17840 191756 322850
15207 322850 175593 -29450 162753 27213 220870 537827 71208 136621 170686 -250354
15196 -106927 8508 -9967 -99497 -386805 175415 31447 -164 -324659 -52454 70126 94063 88835
15184 88835 -20735 107695 132539 238854 582769 -217787 43389 234706 5429 -262438 -213967
15173 -213967 -74652 100626 -121709 -264133 31928 243527 32131 192494 275914 315303
15163 315303 -175245 20235 -34936 231934 -36705 -10746 141175 -35453 -90354 67603 -167810
15151 127786 333779 273564 265595 462620 109235 127538 28235 122477 -91301 223431 112078
15140 112078 256630 248619 179776 113520 200049 164127 97977 232483 78745 -128985 316125
15128G2800J37354l5919g3756E3000g0045A98714a39264A36627J12809R0677A13124
15116B52877A07388J31762b35106F2618e8218A0646D492L53800b64219A12716
15105F3664P5648a57682B22007M8744c838B77007o0863F1890J05898a3890A70311
15093b03249A15277m3768G712O02147c6807F0332O5958j2315a12025A2604J31993
15082A44597a60179C96316o0384a52337C67818n7696j47111F7261M5745D6240
15071G8659J26984j1931E1223b25426A82545M39756i8134B62492K74151j13322
15061D23321j57861N8218A21548J03056a08780A78230N2154q4991K7546J35641
15051C08580D04K48343A15905M11645H6737J57223E2858K22544J463j21030G2632
$$ plain form
15128 72800 210154 174235 -73756 53000 -70045 198714 -139264 136627 249436 340113 113124
15116 252877 107388 239150 -235106 62618 -58218 10646 4492 358292 -264219 112716
15105 63664 139312 -157682 222007 270751 -3838 277007 216144 61890 167788 -13890 170311
15093 -203249 115277 71509 7712 609859 -36807 60332 126290 113975 -112025 12604 144597
15082 144597 -160179 396316 335932 -152337 367818 310122 163011 67261 113006 46240
15071 78659 205643 193712 51223 -225426 182545 622301 -98134 262492 536643 423321
15061 423321 265460 323678 121548 224604 -108780 178230 230384 145393 172939 308580
15051 308580 404 248747 115905 527550 86737 243960 52858 275402 276865 155835 72632
15039A4179M18759a77016B69530a1850k30511Q7313I4014K18935b2274B1848J57255
15028A79103d691E04996A18479K97842n172j40785A16735K14394p8952J66880
15018D19057A04158D3786O3246Q5343J93477j76581J79994a65441C65340F022
15007b2138B98411i4062b7397B07643B5689M0005K54731M9060J69361a09796G05395
14995A97742K07864j19211A28744J37300G6627Q6250J72533j5019A40354F9442
14984C05179j41641J72443A42172a9466C96076l7887A00812L60612k1133A77798
14973E26958a62367B48063K10910n3150j67849a68256A31038K41331j23931I5673
14962E06711k51625K0092A2756M79376g4249D1640J95397k940q2352J50416d4651
$$ plain form
15039 14179 432938 -177016 269530 -11850 -242361 -155048 94014 312949 -22274 21848 179103
15028 179103 -4691 504996 118479 416321 411149 270364 116735 331129 252177 419057
15018 419057 104158 43786 107032 192375 385852 209271 389265 -165441 365340 6022
15007 -22138 298411 -94062 -27397 207643 25689 65694 320425 369485 538846 -109796 705395
14995 197742 405606 286395 128744 266044 76627 162877 335410 320391 140354 69442
14984 305179 163538 335981 142172 -19466 396076 358189 100812 461424 440291 177798
14973 526958 -162367 248063 458973 405823 237974 -168256 131038 372369 248438 95673
14962 506711 255086 275178 12756 492132 -74249 41640 237037 234097 151745 302161 -44651
14950G28863B89740A05414J97815J39478j41941K0400j32347H8271j6375L79404
14940D51300j32795Q2479J56574j81137j28022K19257j0853n7201a5385C96739
14929A49916L75056j1051r8648A77786J52128Q0407L08965B71363N6551q2177
14919B45737N5520l4092m7873J20965K32393j51714B01068J42336A30726M55946
14909E86672B58773H9807K71175A46888L01646p4256J00225q7450R0938f2390
14898B41465j4126G4900J87712J14980H9392K99659j2408r7419j06775J03694
14888B76143L60015k33751J9989j64291j28996K26467j33228N11864l60074J73835
14878E47973j37075j29294K86093j52516A40068K14330J00618K57289j52175K23904
$$ plain form
14950 728863 289740 105414 303229 442707 300766 321166 188819 88271 71896 451300
14940 451300 318505 400984 557558 376421 248399 467656 456803 399602 -15385 396739
14929 149916 524972 513921 415273 177786 329914 410321 719286 271363 327914 245737
14919 245737 301257 267165 219292 340257 572650 420936 201068 343404 130726 586672
14909 586672 258773 89807 360982 146888 448534 374278 474503 387053 477991 -62390
14898 241465 227339 74900 262612 377592 89392 389051 376643 279224 172449 276143
14888 276143 636158 402407 422396 258105 129109 355576 222348 734212 374138 547973
14878 547973 410898 281604 567697 415181 140068 354398 455016 712305 560130 784034
14868G84034l15733j50556K33731l7913K7661K5235j79342L16109l32908N1564
14858D21882A89820K62923B21891N6572J06770P4288j64719J919N36884C98983
14847D05517J47449J0109j63034n0073K55739K22742C15679L6373J25941k25342
14837B52651N96967l55847L19924k56570j50128M52139k98687B71787M01843l1418
14827F42212B85468N3799m2140P6231q598J52983M6026j54646J03266l460K5310
14816E34239J15358K8915k51226N0185M03335m09478k5641J00813J97979j60004
14806E84475R6568k45915p4865K41530K202B57748L74556j41551l5273K12061
14796F67541k57337Q2012j16174M07087j82229p7139Q9933J53011k61894A20065
$$ plain form
14868 784034 468301 317745 551476 513563 541224 566459 387117 703226 370318 421882
14858 421882 189820 452743 221891 278463 385233 459521 294802 296721 833605 398983
14847 405517 552966 563075 400041 349968 605707 828449 315679 352052 477993 252651
14837 252651 849618 493771 813695 557125 406997 859136 560449 271787 673630 642212
14827 642212 285468 339267 297127 373358 364760 517743 563769 409123 512389 508929 534239
14816 534239 649597 678512 427286 477471 880806 471328 445687 546500 744479 584475
14806 584475 681043 435128 360263 601793 603995 257748 632304 490753 455480 667541
14796 667541 410204 492216 376042 783129 600900 523761 613694 766705 504811 120065
14785G56635l48114J98428K54757j73355B82906M44367L4441k23608k45236K44533
14775E37403K78784k95676L6911L14374l05566O6311L07869o441m35438J99583
14765F98114J99546j97889l19164N58311C97861K55568K12983k80976K79555k73005
14755E91986J76128M4046B54795L80162k59443O31336j77725j15409J61721k43894
14745F31543j6689r0241j56171N41819l13958M9306J37028J24892j31488P3117
14735H49158J36813l52917K35632l64871J93443J27401j68885P3222M7356n756
14725G70596j0862Q1961j78696L65884k61703J31865r7616m8623J99802k17698
14715G34910N1675j58895K95894N8758M7027l28221L16889k50522K12552n9009
$$ plain form
14785 756635 408521 606949 861706 688351 282906 727273 761714 538106 292870 537403
14775 537403 816187 520511 557422 871796 566230 632541 940410 933969 498531 698114
14765 698114 897660 699771 380607 938918 397861 653429 866412 585436 864991 591986
14755 591986 768114 812160 254795 634957 375514 1006850 829125 713716 875437 631543
14745 631543 614854 524613 368442 910261 596303 645609 782637 907529 776041 849158
14735 849158 985971 633054 868686 503815 697258 824659 655774 728996 776352 770596
14725 770596 759734 841695 662999 1028883 767180 899045 801429 752806 952608 734910
14715 734910 786585 627690 923584 982342 1029369 701148 1018037 767515 980067 921058
14705I21058J12350l72462J71145R518L49123l18511J05053m53195N20038l64949
14695F79168O44876q9157l37700o2259m1534J55037k1999J14374J1832k23604
14685H29034K06942l43436J30740r1445K60690j91677J69852k0737N8516j9435
14675I89044r3251J7175J24197J88466j15722J2062r4817J01785m8502r4731L31884
14664A317590n07953k349K61139j93036J24042p62J17260N0815j0035q7702K40539
14653A309548q8800p680j30372M2737O4565Q8423k13310O7135J97303J41538j44889
14642A326198m6348m3450P4830j53190L11356P593l99470M42859n98838L08232
14632A229772L19799J78132l15793L67167n70761O2292K65738R3651o3586j80327
$$ plain form
14705 921058 1033408 660946 832091 841609 1190732 872221 977274 524079 1044117 679168
14695 679168 1324044 1234887 897187 834928 793394 948431 926432 1040806 1052638 829034
14685 829034 1035976 692540 823280 731835 992525 800848 970700 949963 1008479 989044
14675 989044 895793 912968 1037165 1225631 1109909 1121971 1027154 1128939 1080437 985706 1317590
14664 1317590 809637 807288 1068427 875391 999433 998671 1115931 1166746 1156711 1069009 1309548
14653 1309548 1220748 1213068 1082696 1125433 1189998 1278421 1065111 1132246 1329549 1471087 1326198
14642 1326198 1279850 1236400 1311230 1158040 1469396 1476989 1077519 1520378 921540 1229772
14632 1229772 1549571 1727703 1411910 1779077 1208316 1270608 1536346 1629997 1566411 1386084
14622A386084K47549k95952j3642N68950m29894N7641M3453m05942M35382j08104
14612A485525L37002j24374m4126J20662j09637j0664J1192M69916j52265k07386
14602A775845j40007K0132J71201l8375j98713N8235k5735K1328K94575O0696
14592A999182o3343J04940J9788o5071J0365l9206K50027j44368j16415J59735
14582B115634L6972j0938J07143L8623l03084K69535j10085L61568j06679l72099
14572B026590J80790L04016P7400n4364j60644J82269j72410J76177K02169l4491
14562B727502l6685L37281k74456j2223L60294J24126o8285M39479N8540Q4841
14552C740414M01084J223954O5932J816258L214978R250573J5178492J2721246
$$ plain form
14622 1386084 1633633 1337681 1324039 1892989 1463095 1520736 1564189 1158247 1593629 1485525
14612 1485525 1822527 1698153 1654027 1774689 1665052 1654388 1665580 2135496 1983231 1775845
14602 1775845 1635838 1655970 1827171 1788796 1590083 1648318 1622583 1643911 1938486 1999182
14592 1999182 1935839 2040779 2060567 1995496 2005861 1966655 2216682 2072314 1955899 2115634
14582 2115634 2152606 2141668 2248811 2287434 1984350 2253885 2143800 2505368 2398689 2026590
14572 2026590 2207380 2511396 2588796 2534432 2373788 2556057 2383647 2559824 2761993 2727502
14562 2727502 2690817 3028098 2753642 2741419 3101713 3225839 3157554 3597033 3655573 3740414
14552 3740414 4141498 5365452 5431384 7247642 10462620 19713193 34891685 47612931
14544D7612931k1527729A1368082m681301O26221j505120k608875n04756q04498
14536A889753M65567l60468J1106J19050M96780j05576l62484K12436P6454K83264
14526B725882m47033N28945l48695K10331m1990M7858l4658J15765K42300j78141
14516B820564j7033l3179K01333M3166j28065J67531m9501P9194l10079O04646
14506C378577l69593R0787J11149j8424L2730J76119m5185J72732J24489l00684
14496C352697J78755K63514l20257q0813J1098K43268J52468l5325J21958O8986
14486C956349j10026N3287K55878k53522K60719j12719K9506K0208L85415l74222
14476D110873J41359L5822K11468L11928m34547K54691p7381J6525J5473O71441
$$ plain form
14544 47612931 26085202 11368082 6686781 7313002 5807882 3199007 2694251 1889753
14536 1889753 2355320 1994852 2005958 2125008 2621788 2516212 2153728 2366164 2442618 2725882
14526 2725882 2278849 2807794 2459099 2669430 2627440 2675298 2640640 2756405 2998705 2820564
14516 2820564 2803531 2770352 2971685 3014851 2886786 3054317 3004816 3084010 2773931 3378577
14506 3378577 3008984 3099771 3210920 3192496 3225226 3401345 3356160 3528892 3653381 3352697
14496 3352697 3531452 3794966 3474709 3393896 3404994 3648262 3800730 3765405 3887363 3956349
14486 3956349 3846323 3899610 4155488 3901966 4162685 4049966 4079472 4099680 4485095 4110873
14476 4110873 4252232 4288054 4499522 4811450 4376903 4631594 4554213 4570738 4586211 5257652
14466E257652m07808M87247l66263J45727J56146j99351j33572J61546J66477
14457E267801K75943j24272J6727J96008p8867K09019K16749R2792k50166K41392
14447F063126N0990J922j40457K86093J21983p8435P9023K95292p8556Q0652J60946
14436F842579M05256k66793P1743j04272K99869P4089K54305J30151q614J29674
14426G827987L73606k70208K58086O0839k98447P41419m26574Q76026k45641L71445
14416I268538l4582p9935K00126K04195J0930K37660J26455Q7961L2322L01105
14406A0354775K62103J72010K94195j16554M7577J54536J85629K65550K53572
14397A1873393K90531K53169P4930K49258L21787n8732O82549R023k72299P73847
$$ plain form
14466 5257652 4849844 5337091 4970828 5116555 5272701 5073350 4939778 5101324 5267801
14457 5267801 5543744 5419472 5436199 5632207 5553340 5762359 5979108 6071900 5821734 6063126
14447 6063126 6114116 6116038 5975581 6261674 6383657 6305222 6384245 6679537 6600981 6681633 6842579
14436 6842579 7247835 6981042 7052785 6948513 7248382 7322471 7576776 7706927 7698313 7827987
14426 7827987 8201593 7931385 8189471 8250310 7951863 8693282 8266708 9142734 8897093 9268538
14416 9268538 9233956 9154021 9354147 9558342 9569272 9806932 9933387 10021348 10053670 10354775
14406 10354775 10616878 10788888 11083083 10966529 11014106 11168642 11354271 11619821 11873393
14397 11873393 12163924 12417093 12492023 12741281 13063068 13004336 13686885 13695908 13423609 14197456
14387A4197456J19763M18681M00569j68780L39063M93634N72048l46145N56315
14378A6582604R1130L49992Q260R78071K19501K39117O08342N7381N21709M69964
14368B0126071L55188J53524N51033K81001O32627N32614K90279M88474O50582
14359B4061393P28961J43600Q47529N04068M63180P53756Q85002M84002N97296
14350B9468787K44898J227371O00193J032815N65489J018249J060015O40112J061525
14341C6919454R00625J182953J101336Q46483J344758J129556J115322J418495
14333D5958982J225295J146103K064104J110924J727631J339707K000663J859914
14325E8433323K286391J950547J992978K019739K064665K874523K432927K606185
$$ plain form
14387 14197456 14317219 14735900 15136469 14967689 15306752 15800386 16372434 16026289 16582604
14378 16582604 16673734 17023726 17031986 18010057 18229558 18468675 19077017 19134398 19656107 20126071
14368 20126071 20481259 20634783 21185816 21466817 22099444 22632058 22922337 23410811 24061393
14359 24061393 24790354 24933954 25781483 26285551 26748731 27502487 28387489 28871491 29468787
14350 29468787 29713685 30941056 31541249 32574064 33139553 34157802 35217817 35857929 36919454
14341 36919454 37820079 39003032 40104368 40950851 42295609 43425165 44540487 45958982
14333 45958982 47184277 48330380 50394484 51505408 53233039 54572746 56573409 58433323
14325 58433323 60719714 62670261 64663239 66682978 68747643 71622166 74055093 76661278
14317G6661278K915823K654625L239346L518285K938821L394081L845461L683556
14309A02851276M664107M255458M706140M960546N095241N290580O339481O091275
14301A44254104O187990P250924P229626P621957Q087882Q426825R398621R363801
14293B07821730R788841J0584552J0961799J1597436J1928847J2490552J3033035
14286B88206792J3282659J3803975J4253025J4401972J4499075J4227247J4083987
14279C86758732J4070325J3160602J2167900J1422186R783754Q063429N798688
14272D61225616K300976l253643l632684q44848l709477l445378n725059r497685
14264D33417818j0986581j2014324j3935913j4815099j5182667j5420428j5300220
$$ plain form
14317 76661278 79577101 82231726 85471072 88989357 91928178 95322259 99167720 102851276
14309 102851276 107515383 111770841 116476981 121437527 126532768 131823348 138162829 144254104
14301 144254104 150442094 157693018 164922644 172544601 180632483 189059308 198457929 207821730
14293 207821730 217610571 228195123 239156922 250754358 262683205 275173757 288206792
14286 288206792 301489451 315293426 329546451 343948423 358447498 372674745 386758732
14279 386758732 400829057 413989659 426157559 437579745 447363499 455426928 461225616
14272 461225616 463526592 460272949 456640265 455795417 452085940 448640562 442915503 433417818
14264 433417818 422431237 410416913 396481000 381665901 366483234 351062806 335762586
14257C35762586j5256972j4618347j4657282j3867063j3885297j2361180j0996252
14250B40120193j1402354j1622805j0576133j0114116r397149q526552q004839
14243A70476245p851363p588775p327872o505702o287018n834460n010254n543285
14235A18527516n012011m778669m375786m300134l497137l529952l702226l539583
14227H5792018l332316l061409k879694k591711k802206k636471k417031j715241
14219F4355939k228073k296552j830687k145565j663126j346956j319918j991898
14211D9533164j356450j240865j541166j286788r15627r18094j374878j212344
14203C9686952j535175q70972o56193n89532r53701j415199q67841p75416r01223
$$ plain form
14257 335762586 320505614 305887267 291229985 277362922 263477625 251116445 240120193
14250 240120193 228717839 217095034 206518901 196404785 187007636 178481084 170476245
14243 170476245 162624882 155036107 147708235 141202533 134915515 129081055 124070801 118527516
14235 118527516 113515505 108736836 104361050 100060916 96563779 93033827 89331601 85792018
14227 85792018 82459702 79398293 76518599 73926888 71124682 68488211 66071180 64355939
14219 64355939 62127866 59831314 58000627 55855062 54191936 52844980 51525062 49533164
14211 49533164 48176714 46935849 45394683 44107895 43192268 42274174 40899296 39686952
14203 39686952 38151777 37280805 36624612 36035080 35081379 33666180 32798339 32022923 31121700
14194C1121700k11079q33537p67115j135979o93162k31086p91676o80461n81506
14185B5196099o14758m73461o79062p50846l26205j28597n56224m68772m30560
14176B0767614l42861o48090J71603q94601m62823m04152k64932k50101l05509
14167A7366148m14391k18830o11901r6141k53097L5682n79611m35173l00228j45322
14157A4347136j79170l70799L8874k88500k6456n40364k84342J37066k30132l37382
14147A2265931j69567o12760O0081k20639J02025o0135m97521n9497L3878p58211
14137A0083585K13556r2858l18336O382j18480J9434j44269j29027m52267J35504
14127I203224M7679l14486n09059M66413l91183l14167K9027n7363j17956l92751
$$ plain form
14194 31121700 30910621 30077084 29309969 28173990 27480828 27249742 26458066 25777605 25196099
14185 25196099 24581341 24107880 23428818 22677972 22351767 22223170 21666946 21198174 20767614
14176 20767614 20424753 19776663 19948266 19053665 18590842 18186690 17921758 17671657 17366148
14167 17366148 16951757 16732927 16121026 16024885 15771788 15807470 15227859 14792686 14492458 14347136
14157 14347136 14167966 13797167 13836041 13547541 13521085 12980721 12696379 12833445 12603313 12265931
14147 12265931 12096364 11483604 11543685 11323046 11425071 11364936 10867415 10807918 10841796 10083585
14137 10083585 10297141 10204283 9885947 9892329 9773849 9793283 9649014 9519987 9067720 9203224
14127 9203224 9250903 8936417 8427358 8893771 8502588 8188421 8217448 8160085 8042129 7649378
14117G649378K87320l32176l4704L35019n45697K72735o9815k40696l01821J06435
14107G125978j55535j2961m09396K23812k84859m2306M3180j45590k19861R81
14097F123443L20444m78851L30903m81826K91729j73320j70167K4144n7820l5159
14087E693520k96834L768j30915J11465o5038j00039j77057K07768k76885J95407
14077E165160K5564l18255k74028L40568j38150j58372J48374K70483n47584J85997
14067D699757l44929J84038j1612n29856M54842l32438K18186O991n1376o1416
14057D232187J62022k20675k14904M2262p7193Q3226m97916L74223o1144l8813
14047C783275J54375j74195j82361k6188Q0146J68730n4992m75858L38916m73683
$$ plain form
14117 7649378 7936698 7604522 7569818 7904837 7359140 7631875 7562060 7321364 7019543 7125978
14107 7125978 6970443 6957482 6548086 6771898 6487039 6444733 6487913 6342323 6122462 6123443
14097 6123443 6443887 5965036 6295939 5814113 6105842 5932522 5762355 5786499 5728679 5693520
14087 5693520 5396686 5400454 5269539 5381004 5315966 5215927 5038870 5246638 4969753 5165160
14077 5165160 5190724 4872469 4598441 4939009 4800859 4642487 4790861 5061344 4513760 4699757
14067 4699757 4354828 4538866 4527254 3997398 4452240 4119802 4337988 4344979 4293603 4232187
14057 4232187 4394209 4173534 3958630 4000892 3923699 4006925 3509009 3883232 3822088 3783275
14047 3783275 3937650 3763455 3581094 3554906 3635052 3803782 3748790 3272932 3611848 3138165
14037C138165J69933N4104P5563l90494J55537M6973j45343J18013K412j2527
14027C212336Q057r9855k27159J12162J64106k58904N1265l23463K2998J78741
14017B840284j68299P2417l4083L0926j72237j34031m3236R1076M1791q3405K50549
14006B691752k55929J01633k70422M96382m41133J2862j84439n6902K20758m6761
13996B267801K2510P6496l52587M54166n62018L76757L84462L91538K099454P139828
13986A2298407J4591421J9329839j3928780j5377670p335729l149906j491524
13979D936058n64962l62703l45105m11654K15076q51835M17292l43154j97260
13970B491753K87710N5554m90586L28867j91377j6872q9020r239J37894l78609
$$ plain form
14037 3138165 3308098 3362202 3437765 3047271 3202808 3249781 3104438 3222451 3224863 3212336
14027 3212336 3220393 3120538 2893379 3005541 3169647 2910743 2962008 2638545 2661543 2840284
14017 2840284 2671985 2744402 2710319 2741245 2569008 2434977 2391741 2482817 2524608 2441203 2691752
14006 2691752 2435823 2537456 2267034 2763416 2322283 2335145 2150706 2093804 2314562 2267801
13996 2267801 2290311 2366807 2014220 2468386 1906368 2283125 2667587 3059125 5158579 12298407
13986 12298407 26889828 46219667 32290887 16913217 9577488 6427582 4936058
13979 4936058 4371096 4008393 3663288 3251634 3466710 2614875 3032167 2689013 2491753
13970 2491753 2779463 2835017 2344431 2673298 2481921 2465049 2376029 2366790 2504684 2126075
13960B126075K8036k06374R0727J23511M625K09087k87374j2412k36840J81744
13950B020805K23954j56081m0239m25433J93346J50478J40895j60741L3091O6524
13940B046599J57168l80939J01581k4302L01498k49520j30873l9468R956J00491
13930A892191k61009L41174m85034K50916J96091k23542l8664k67927L77146k75510
13920A505832J38303k4050j17141R3179L27781k86048N600K1531m0162j79852
13910A444973p5357K68529k06621P6249k45830J21733P3707o0122K35589l49921
13900A282929k4128L87422r7547j31322j62087K91111j14225K62756k44747M4333
13890A494495k18731J53184J46720k81751m2703L22472j47066n20499M54330j12062
$$ plain form
13960 2126075 2154111 1947737 2038464 2161975 2166600 2375687 2088313 2075901 1839061 2020805
13950 2020805 2244759 2088678 2048439 1623006 1816352 1966830 2107725 1946984 1980075 2046599
13940 2046599 2203767 1822828 1924409 1900107 2201605 1952085 1821212 1781744 1791700 1892191
13930 1892191 1631182 1972356 1487322 1738238 1934329 1710787 1672123 1404196 1781342 1505832
13920 1505832 1644135 1620085 1502944 1596123 1923904 1637856 1643456 1664987 1624825 1444973
13910 1444973 1369616 1638145 1431524 1507773 1261943 1383676 1457383 1397261 1632850 1282929
13900 1282929 1258801 1646223 1548676 1417354 1255267 1546378 1432153 1694909 1450162 1494495
13890 1494495 1275764 1428948 1575668 1293917 1251214 1573686 1426620 906121 1360451 1248389
13880A248389L6933j63944K64447j78084K93693j31423Q2457J05285k49161L1988
13870A340580n06215j33023M03502j06252O24911p35215J29941L75973m60243
13861I33959K82428j45936M75043m17802j2629J24099l75853M7952J73103K2669
13851A107033K16137p4681k96537J43976L4996P5275j05930j56142K65692m05881
13841H03938J58582l01397N00042l4283j26553j76659K73201L26700o29057k0157
13831G74357K02047j09731J65733l3278k84097Q7912R3523o8186J08703K04999
13821A141982N2717j01877m4870k86773K73170j41308J26012j18758J8033J37296
13811A055624k85233L32864J08844k53424Q665J52291j82884J00873j13837L8785
$$ plain form
13880 1248389 1285322 1121378 1385825 1207741 1501434 1370011 1452468 1557753 1308592 1340580
13870 1340580 834365 701342 1104844 998592 1623503 888288 1018229 1394202 933959
13861 933959 1216387 1070451 1545494 1127692 1115063 1239162 863309 911261 1084364 1107033
13851 1107033 1323170 1248489 951952 1095928 1130924 1206199 1100269 944127 1209819 803938
13841 803938 962520 661123 1161165 1126882 1000329 823670 1096871 1423571 794514 774357
13831 774357 976404 866673 1032406 999128 715031 802943 896466 828280 936983 1141982
13821 1141982 1194699 1092822 1047952 761179 1034349 893041 1019053 900295 918328 1055624
13811 1055624 770391 1103255 1212099 958675 967340 1119631 936747 1037620 923783 962568
13801I62568L7885j26862k04343m8983K49286O6736l11398J03436K0979J89706
13791I39010q4237N9813q1771P4013j19796j68153L60928l06865K47140l57759
13781E62323J25240j07723J00968k4724N14767l44657j28757L015o2564k9027
13771F08861M82126k67417j24618Q4362J01o5459J91379k70354J84067j3947k79058
13760E30043M72939m12187Q5385K2714J73193m0552j84089K17129j2625j24325
13750G27625j3366j86q3300k72530N08775n4625l5065k7691j60424L65033k47513
13739G06733J18638r269j72530j0888K32817k99530J32867R0605k26579P2008
13729F34872N1200J32023p0770C28274K86422J27635J39100k44848o2390Q3531
$$ plain form
13801 962568 1000453 873591 669248 620265 869551 936287 624889 728325 749304 939010
13791 939010 854773 914586 832815 906828 787032 618879 979807 672942 920082 562323
13781 562323 687563 579840 680808 656084 1170851 826194 697437 700452 637888 608861
13771 608861 1090987 823570 698952 783314 783415 717956 909335 638981 823048 809101 530043
13760 530043 1002982 590795 676180 698894 872087 831535 647446 864575 851950 727625
13750 727625 714259 714073 630773 358243 867018 812393 777328 749637 589213 954246 706733
13739 706733 825371 816102 643572 632684 865501 565971 698838 789443 562864 634872
13729 634872 686072 818095 747325 328274 614696 742331 881431 636583 574193 657724
13719F57724J00312n3559O574k28380j30062L27987J0229j99986L0001L24535
13709H45375j37193o4239r3826L18969j68907l13803Q0276K42379j11751k06220
13699C91060M74104j97271J3201j65845K0864L9934j2716k45700K68569L2003
13689F18203n0006N8660j30262J57075J86025k51937j74718J23155J05640J18178
13679G60013k24055k30162K28471K5774A98929M27721A68601J04526J78826j52976
13669B98977M93482j71857p4567J13642n022A02298N00232Q9590l944j34325k3627
13658E30224o99p733B55388N5153K63382B75208N36890l19978A73505J27186L463
13647C04154j08449J2920Q6097N5008P9687A42138N25823B77796J35061q5960
$$ plain form
13719 657724 758036 704477 711051 482671 352609 680596 690825 490839 520840 845375
13709 845375 708182 643943 550117 869086 700179 386376 466652 709031 597280 391060
13699 391060 865164 667893 681094 515249 536113 576047 563331 317631 586200 618203
13689 618203 568197 626857 496595 653670 839695 587758 413040 536195 641835 760013
13679 760013 535958 305796 534267 560041 198929 626650 168601 273127 451953 298977
13669 298977 792459 620602 546035 659677 654655 102298 602530 692120 688176 553851 530224
13658 530224 529525 521792 255388 310541 573923 275208 812098 492120 173505 300691 304154
13647 304154 195705 208625 294722 349730 429417 142138 667961 277796 412857 326897
13637C26897j25661J24231K69875k61591r0888L36930k60531o7622O8873R1410
13627D11923A73180J89073n3762k2259J52692K50616e2738C88525j28590L74049
13617F33984j5884j56982L97656l95107j8802R6474J28377k82322O0015N4341
13607E01750j04905m4384q1765K98887j50606K21894k18242j7748L06872C51440
13596C73349K40596o6178B68728L1039Q7027A72947K39262a05187C45273N8312
13586D03585R061J29896r6007A99139J78905o9319O9435n0602K60967k29441J40633
13575D99717j71723j58366K65654j5763A43494Q5905n2650K74300j94373M23832
13565F80508O329k47730A86909K05216j61966J34648p3443J12484j52347K94476
$$ plain form
13637 326897 201236 325467 595342 333751 242863 579793 319262 251640 320513 411923
13627 411923 173180 362253 308491 286232 438924 689540 -52738 388525 259935 633984
13617 633984 618100 461118 858774 463667 444865 541339 669716 387394 447409 501750
13607 501750 396845 352461 270696 569583 418977 640871 422629 404881 711753 351440
13596 373349 613945 547767 268728 299767 386794 172947 412209 -105187 345273 403585
13586 403585 412646 542542 446535 199139 378044 308725 378160 327558 588525 359084 499717
13575 499717 327994 169628 435282 419519 143494 229399 176749 451049 256676 680508
13565 680508 686837 439107 186909 392125 230159 364807 291364 403848 251501 545977
13555E45977j34175j83907R8632A06079K12712L82555k77986G3162L30068A69575
13544A65548J18971G5039K79512J41001A87691R4737K49505k58776q7974K61209
13534D46392L0927o098B23839M15215B29528n8032K17448c3907F4804f6510A35559
13522C44863n4979J30197j56907K50296k47832p6669L90612C3358E943L67528
13512C73471R550j14879K7248f7574B98294Q416K9454D6811M53262o7387K9328
13501D62014J68827A52667J60877J00753A80476K87473j36940p7749L935K08574
13491D65769C8549J4766K48862g4891A38950J85145l7431J33812K9686j65431
13481B84731n2877m8777B2130j0861J77649n748a5678B58644K37K63038j62052
$$ plain form
13555 545977 411802 227895 326527 106079 318791 701346 423360 73162 403230 169575
13544 165548 284519 75039 354551 495552 187691 282428 531933 273157 185183 446392
13534 446392 477319 471221 223839 639054 229528 171496 388944 -33907 64804 -66510 135559
13522 344863 289884 420081 263174 513470 265638 188969 579581 33358 5943 373471
13512 373471 383021 268142 295390 -67574 298294 306710 336164 46811 500073 432686 462014
13501 462014 630841 152667 313544 414297 180476 467949 331009 253260 257195 465769
13491 465769 38549 53315 302177 -74891 138950 324095 286664 420476 450162 284731
13481 284731 231854 183077 22130 11269 188918 183170 -15678 258644 258881 521919 359867
13470C59867L4638A18510Q5163L39052K67671B43667K313j7693L6239J24985E3193
13458F91857C24419J00814c553D55389i4492A98954J97479n5089F0490J29228
13448A89718n2223O7040l4748k6167a98492F57846H4279K68182M2766j46455J9066
13437B67838m0662Q9853H381M24180o7501J8656A37176E0497J83466L5208P0943
13426C40114c8475B40259A17278J89285J9030o0212A5542M3930d0803A53479J20639
13415B74118P4586J2000j04900H327J04940K055l9823L26011N0669n2551j15146
13404B84482N4094A48037J04064K97802a22868a4566B69407a8840P834j26909
13394a37915A73381G0260J02548K56190a32100E11696j93695k6208j40212Q4317
$$ plain form
13470 359867 394505 118510 203673 542725 810396 243667 245980 228287 264526 389511 53193
13458 691857 324419 425233 -3553 455389 -94492 198954 396433 341344 60490 189718
13448 189718 137495 204535 169787 143620 -198492 657846 84279 352461 395227 248772 267838
13437 267838 227176 317029 8381 432561 365060 383716 137176 50497 233963 269171 340114
13426 340114 -38475 240259 117278 306563 325593 265381 15542 59472 -40803 153479 274118
13415 274118 348704 360704 255804 8327 113267 115322 75499 401510 452179 399628 284482
13404 284482 338576 148037 252101 549903 -122868 -14566 269407 -18840 -11006 -137915
13394 -137915 173381 70260 172808 428998 -132100 511696 318001 291793 151581 235898
13384B35898j12377K0693m0108i1450D26704B7458K18942a5973H8238d4350C53747
13372a3918B69469L28586B00827R0877D7398P3531J26989K208l5899a75733C72073
13360B03706H1970L01725j82906J04885m3011j0509M1634a0513D36408A65072
13349C00330c28646e5820D51566b0227A93606J03755K28076B25128L20448A00074
13338B55933F3731L80648j67164J22101A97014L612l023r7614R1498L24503A96736
13326C27290j13833P6025J01224N6325f4971E58151o0176b1490B19888a73149
13315B46256A00313J46286M3998I5438l1093O2001a16559A83827K64012j63779
13305B84060p9455k4776H8863D631J60155h2876G5108a26162B59595H7081M8283
$$ plain form
13384 235898 123521 144214 104106 -91450 426704 27458 246400 -15973 88238 -44350 353747
13372 -13918 269469 598055 200827 291704 47398 120929 247918 250126 214227 -175733 372073
13360 203706 81970 383695 200789 305674 262663 252154 293788 -10513 436408 165072
13349 300330 -328646 -55820 451566 -20227 193606 297361 525437 225128 545576 100074
13338 255933 63731 444379 277215 399316 197014 200626 197603 99989 191487 515990 196736
13326 327290 213457 289482 390706 447031 -64971 558151 497975 -21490 219888 -173149
13315 246256 100313 246599 290597 95438 64345 126346 -116559 183827 447839 284060
13305 284060 204605 179829 88863 4631 164786 -82876 75108 -126162 259595 87081 135364
13294A35364R6776G1813M4615j6207N7118E9654K15436J18619Q8090A9025L30037
13283C49062O5740j60912m1846C9863J16117F4656J08642j1351K78192A74787
13272F2325b04885D8336M8386b4895C693J86602o7018J45607F550h978l01608
13261c10586A93758H431L18317N7596j68707c46625A03866b57614C10392a22946
13250a84332I1959J54746g410A62939J0798k4902J21468A1771K08780D8061J45074
13239A93135e7335B36349k8575F727g7352B43618N6524a53351C00088n4979a27266
13227B44718J57490A31548J47969n7033B1118J84564D4961J69231m6989n4504
13217A12699c0956A98832a16900a9602A19707c8858B41758q8822J81804L18284
$$ plain form
13294 135364 232140 71813 116428 100221 157339 59654 275090 393709 481799 19025 349062
13283 349062 414802 253890 212044 39863 155980 64656 173298 161947 440139 174787
13272 62325 -204885 48336 96722 -24895 3693 190295 123277 268884 6550 -8978 -310586
13261 -310586 193758 8431 326748 384344 215637 -346625 103866 -257614 310392 -122946
13250 -184332 91959 246705 -7410 162939 173737 148835 270303 11771 220551 48061 193135
13239 193135 -57335 236349 207774 6727 -77352 243618 300142 -153351 300088 245109 -127266
13227 244718 402208 131548 279517 222484 21118 205682 44961 214192 167203 112699
13217 112699 -30956 198832 -116900 -19602 119707 -38858 241758 152936 334740 653024
13207F53024f5589L1179G1866K13265J3569K50262k33029j19543E3608K0609h9500
13195E1257b3018H0997J15053B3907h1724B91765K26695A51651G2901J1670e974
13183A88383H2958M0099E7158J11022l1854J04798J6323D2302K71801Q6801c7157
13171A77805E9084K52211a23837C29419G1562L6789h7595n2974D737a21660k6727
13160a48387a5845C36433K28028b0351E5075J07344J39509I9120a7912B18324
13149a93206M0374N2866A45606c63146a20061A33118c56961A94406J38598J00897
13139D33901D7782J14250a6406n1249A90583Q8302j00076j6380L17105H1842J07532
13128A89374A593a31235A07645l8380a41218l6207C02170A42997D2353L2983P7449
$$ plain form
13207 653024 -65589 -34410 71866 285131 298700 548962 315933 196390 53608 74217 -89500
13195 51257 -23018 80997 196050 23907 -81724 291765 518460 151651 72901 84571 -5974
13183 188383 82958 123057 57158 168180 136326 241124 257447 42302 314103 400904 -37157
13171 177805 59084 311295 -123837 329419 71562 108351 -87595 -140569 4737 -121660 -148387
13160 -148387 -15845 336433 564461 -20351 55075 162419 301928 99120 -17912 218324
13149 -193206 -152832 -99966 145606 -363146 -120061 133118 -356961 194406 333004 433901
13139 433901 47782 162032 -16406 -67655 190583 278885 178809 162429 479534 81842 189374
13128 189374 1593 -131235 107645 69265 -141218 -177425 302170 142997 42353 75336 152785
13117A52785b7744G1240N4221C6594A1132L09438f4842l90311a23122A9472c1565
13105h5493k3386f418D93552A81570n6473a64056e8929D9321J5270M5886m0985
13094F9492N0725J89129D0932a13715A41862c5913H3724b28005F2063f7726j34026
13083b01752j07626A99588n0379j6329a89194c030j24247C8945J62160R1386j08548
13072A83943H7751a64445F9614J16483J7554G8492C0388c7508F0832a72017A13518
13060b69333a21697b3587j41765H6203Q9784p1740B7418J84794J43180o5771I9013
13048e3899q6064C42478j03450f7395A70451G2334A6629Q7616B7199a39422O6938
13037g2484A14545m531K5404E3235c03336A31606n5939a27931j63037D8173K36227
$$ plain form
13117 152785 -27744 71240 125461 36594 11132 320570 -64842 -455153 -123122 19472 -31565
13105 -85493 -108879 -6418 493552 181570 125097 -164056 -58929 49321 64591 110477 69492
13094 69492 120217 309346 40932 -113715 141862 -35913 83724 -228005 62063 -67726 -201752
13083 -201752 -309378 199588 149209 132880 -189194 -3030 -127277 38945 201105 292491 183943
13072 183943 87751 -164445 69614 186097 203651 78492 30388 -37508 60832 -172017 113518
13060 -269333 -121697 -23587 -165352 86203 175987 104247 27418 212212 355392 289621 99013
13048 -53899 -139963 342478 239028 -67395 170451 72334 16629 104245 27199 -139422 -72484
13037 -72484 114545 110014 135418 53235 -303336 131606 75667 -127931 -290968 48173 284400
13026B84400A42099Q7884D5032c33367A34225J02961J56724a8747D04587d9357
13015A01311J5091c0856k6547I8646g7447A72191j2772b07146g114j71830A31697
13003C04390E6055b46422O662B89712A05806J11703j06665n0455k9159c16697
12992a14089B57234a9256A33938K91905A94512a38080I7589h7442B67673g0463
12981A3221a68708A99607r3240J08393F0725P8066J69352A40814O4951m8990C1307
12969d4507q9065E6803J04356A0845K23924r5984g4430G1632f603A38008a2792
12957g9469A40928L12509G2047c8202B05079M1419f3913a0381o6682b4388B91544
12945a16439c2225C01391f1843C72607I0545L409j8032K7657N983b9513A28386
$$ plain form
13026 284400 142099 229983 45032 -333367 134225 237186 393910 -18747 404587 -49357
13015 101311 116402 -30856 -57403 98646 -77447 172191 159419 -207146 -7114 -178944 131697
13003 304390 56055 -246422 -239760 289712 105806 217509 110844 60389 31230 -316697
12992 -114089 257234 -19256 133938 425843 194512 -138080 97589 -87442 267673 -70463
12981 13221 -168708 199607 106367 214760 60725 138791 308143 140814 205765 156775 31307
12969 -44507 -133572 56803 161159 10845 234769 138785 -74430 71632 -6603 138008 -12792
12957 -79469 140928 453437 72047 -38202 205079 246498 -63913 -10381 -77063 -24388 291544
12945 -116439 -32225 301391 -61843 372607 90545 93954 75922 103579 109562 -29513 128386
12933a81860E9747k9031K61986L6280a6599A17417J26405c08145a1921j18500
12923a30421e0698A85574b21819f4530C54207A04344a06316B38161d1133o1636
12913a02769C00953f5604B13437K33211B07117b80276A7782a90959B24300G6855
12902D16465B2295b38738g3349P567A51785a99242l9074A20244J05838h4061E111
12890c67429c4645a3497B06072q9718J39482l9382L29230b44986O7121A82741
12879H9117k6414a7902H3774B7085c6009o5883b1627B70195d6691K0273A41541
12867A23967k1385i5101r2497C5304Q7896n4899K11144F2886b46542I9994a76864
12855B41496a58911I2809l8763b4747A14590J55591J48934A66107a2180j62905
$$ plain form
12933 -181860 59747 30716 292702 328982 -16599 117417 243822 -308145 -11921 -130421
12923 -130421 -50698 185574 -221819 -64530 354207 104344 -106316 238161 -41133 -102769
12913 -102769 300953 -65604 213437 446648 207117 -280276 17782 -190959 224300 76855
12902 416465 22295 -238738 -73349 -65782 151785 -199242 -238316 120244 226082 -84061 5111
12890 -367429 -34645 -13497 206072 116354 255836 216454 545684 -244986 -177865 182741
12879 89117 62703 -17902 83774 27085 -36009 -101892 -21627 270195 -46691 -26418 141541
12867 123967 102582 -95101 -187598 35304 123200 68301 279445 62886 -246542 99994 -176864
12855 241496 -158911 92809 54046 -24747 114590 270181 419115 166107 -12180 -175085
12845a75085n4921A04684a84296G6938B0407a57158A25627m4991d6342a4924C60427
12833H3672c07064i8666A0057J10813m2364J21289c7031j73098G6230k3063i5805
12821b27670A62478a42809N8166B61775F3134J5132A6889a10238B1191a19898
12810c0287A19506d42847B22286G650J92904j4045L4995e18624I0968J15592J914
12799B08474g5783G2795b79896F0350i7558B41299a35525B913b32763k3472A46087
12787a4661p5494B38100a30415f014p7341C3136h1409E6980B6191A0393J10106
12776A20499b3167c221j5088o8327n1467L53D1348a5280B18889f9141b5078j8629
12764d3707B71116q2897J02357K0548c6617C1102J79781a84936L6647b25k36122
$$ plain form
12845 -175085 -230006 104684 -184296 76938 20407 -157158 125627 80636 -46342 -14924 360427
12833 83672 -307064 -98666 10057 120870 78506 199795 -37031 -210129 76230 53167 -95805
12821 -227670 162478 -142809 -84643 261775 63134 78266 16889 -110238 21191 -119898
12810 -30287 119506 -442847 222286 7650 200554 186509 221504 -518624 90968 206560 208474
12799 208474 -75783 72795 -279896 60350 -97558 241299 -135525 2913 -232763 -256235 146087
12787 -14661 -90155 238100 -130415 -6014 -83355 33136 -81409 56980 26191 10393 120499
12776 120499 -23167 -3221 -18309 -86636 -138103 -137750 41348 -15280 218889 -69141 -25078 -43707
12764 -43707 271116 188219 290576 311124 -36617 31102 210883 -184936 -148289 -225 -236347
12753b36347g0162J7181B01455A3521P5019N4014a93855a4673A42228h0996A10552
12741c8952f37D7956L18351k2213b38345H3851M8577F025L8469a50277P2011b5190
12728A54820a30034b3646n6390G4779B9724i3952k337j29959a6839Q8j12343L4173
12716i4921K8504A89822a55399D8593a99609A40776J3534A1206L0176a00425B31139
12704B12145d2015m2653A63212C9321K09098I8509K80295D3984d3599C56984h5521
12692C43127b24854J01155c9945D6448b51645F4679A5269B99J06015J70846C8525
12680A3410c78500g9633D3682R7067D9859K92798A7894a5541D33641r8894i2979
12668c624l47448A87598e1157N002j086k7923C26935h0555F3262a08770E231K64179
$$ plain form
12753 -236347 -70162 -52981 201455 13521 88540 142554 -193855 -14673 142228 -80996 110552
12741 -38952 -637 47956 366307 344094 -238345 83851 132428 6025 44494 -150277 -78266 -25190
12728 154820 -130034 -23646 -80036 74779 29724 -93952 -96289 -226248 -16839 -16751 -129094 -94921
12716 -94921 -66417 189822 -155399 48593 -199609 140776 154310 11206 41382 -100425 231139
12704 212145 -42015 -84668 163212 39321 248419 98509 378804 43984 -43599 356984 -85521
12692 343127 -224854 -123699 -39945 46448 -251645 64679 15269 299 106314 277160 38525
12680 13410 -378500 -79633 43682 140749 49859 342657 17894 -15541 433641 334747 -92979
12668 -3624 -351072 187598 -51157 -46155 -47241 -75164 326935 -80555 63262 -108770 5231 269410
12656B69410j18179K5213h4663B30138J05546j41323n1873C0095M20756G694a95100
12644B15949q9309O5314J11420D8067J22239n8647E544b08604E0306M3738K82129
12633C76173A24523a15804B01379C9719M40853k40201o0756a17223D76750j60904
12623C15846j16696l0788J30061D544a00921A90054q7818k7555h069A20124c30215
12611g9544C76314o6057f9122E7820R5087a88861C73682I8742a17043C3095J85411
12600B18506E3832J04985m6044b29836O0395o8725A00873b00943A73887c4784
12589A72412D7694a2755B14951a09918r4771A35022a44760G0010L04008A5473
12578F0319J43258Q54B7258a90263k1682D02806a18511C09857A47889c2203I0014
$$ plain form
12656 269410 151231 176444 -84663 230138 335684 194361 142488 30095 450851 7694 -195100
12644 215949 126640 191954 303374 48067 170306 111659 5544 -208604 50306 94044 376173
12633 376173 124523 -115804 201379 39719 480572 240371 179615 -117223 476750 315846
12623 315846 199150 168362 298423 4544 -100921 190054 102236 74681 -8069 120124 -330215
12611 -79544 376314 310257 -69122 57820 152907 -188861 373682 98742 -117043 33095 218506
12600 218506 53832 158817 112773 -229836 -169441 -238166 100873 -200943 173887 -34784
12589 172412 47694 -12755 214951 -109918 -204689 135022 -144760 70010 374018 15473
12578 60319 203577 204431 27258 -190263 -211945 402806 -118511 309857 147889 -32203 90014
12566A9004P6250J20295I0b13909A58667i2121B64153A17344J30457d1299l9871
12555h1170b1201p8231k29385A51318b96865H4512a74139D8947K6362b498j06106
12544a08604A70692F1232a97853f1949C4539c395A68247G9749c3481P715D4017
12532g6507j74092A02360a7092C480O7121R2550C3592Q3212h5449D81009B25701
12520b20076k024C06405b2782J0361n34483e9558p4021B86794a72931l7600A82884
12508b5970m0855A82750a39378E9547a99812f5143k4068B4500a23540C89698A02267
12496A18660j0468a27761B66336D831K17590j9904a30093a0372j53323A43231
12485b34141i607q0476B97878i0715a5065B42244L8819A3857a16974A8839b30873
$$ plain form
12566 19004 95254 215549 90 -213909 158667 -92121 264153 117344 247801 -41299 -81170
12555 -81170 -21201 -99432 -328817 151318 -296865 84512 -174139 48947 75309 -2498 -108604
12544 -108604 170692 61232 -197853 -61949 34539 -3395 168247 79749 -33481 -25766 44017
12532 -76507 -250599 102360 -17092 3480 70601 163151 33592 116804 -85449 481009 225701
12520 -220076 -222100 306405 -22782 -12421 -546904 -59558 -133579 286794 -172931 -210531 182884
12508 -25970 -66825 182750 -139378 59547 -199812 -65143 -89211 24500 -123540 389698 102267
12496 118660 108192 -127761 266336 4831 222421 202517 -130093 -10372 -163695 143231
12485 -234141 -9607 -90083 297878 -90715 -15065 242244 281063 13857 -116974 18839 -230873
12473I4862J12139I5274K8626D1767c6728B93203E5913a28833j65660a12055E2604
12461c05116A00083k307a10866j65454O4264r4223a6577p4885J5417o6072I5606
12449d30393I1235g646F1102I305f3181B45391e2575b1279j08436f4285B47705
12437c35275e363D6896a56566A78940F3118f384j49075j10782J1614H6273N2813
12426A39086i7119A30009a9073j12492E7474b50433f7964m5582A3145g955A77436
12414E8092l487L58943A56176b21846N8253E49121a96884A89107A6888a65993
12403a6960B22706i9677F4130M9712k7652k4524R9763a36632G0185d7041J9429
12392b7612D6463c2645l3490j91620h2135A10719f7991D5425J54799f9629A42337
$$ plain form
12473 94862 207001 95274 123900 41767 -36728 293203 55913 -128833 -294493 -112055 52604
12461 -305116 100083 97776 -110866 -276320 -212056 -306279 -16577 -91462 -76045 -142117 95606
12449 -430393 91235 -7646 61102 9305 -63181 245391 -52575 -21279 -129715 -64285 247705
12437 -335275 -5363 46896 -156566 178940 63118 -6384 -155459 -266241 -254627 86273 139086
12426 139086 -97119 130009 -19073 -131565 57474 -250433 -67964 -113546 13145 -7955 177436
12414 58092 54605 413548 156176 -221846 -163593 549121 -196884 189107 16888 -165993
12403 -16960 222706 -99677 64130 113842 86190 61666 161429 -136632 70185 -47041 -27612
12392 -27612 46463 -32645 -66135 -257755 -82135 110719 -67991 45425 200224 -69629 142337
12380f1904j38700I9431g9788J7962C86079j38316i1294A45937b21384F6735a62895
12368a67625G3621j91i1874j66820K5733e2774A2458d275A15991a52713B7543
12356D4771J28984g6719j48627A52029b1983r837o6680L1983A90102I1734A6976
12344h2305K8637A25474a7153k31448E0113a9508k05470e530D3833J13909f4371
12332a41622A44972J65443d5177k08904D70879k11598c43093J38560H9371a2123
12321A01414g2947G2022h7018B55945A2831b30534A71992A4167K67098o1325d5162
12309B53673a665F8058e6707A38389J76585A55477o5909K04423j16425a95218
12298a26200B59045A08544N6826J2090a60192I0367b45065A57852b35439I7413
$$ plain form
12380 -61904 -200604 99431 -79788 -61826 386079 247763 -91294 145937 -221384 66735 -162895
12368 -167625 73621 73430 -91874 -258694 -232961 -52774 12458 -4275 115991 -152713 27543
12356 44771 173755 -76719 -225346 152029 -21983 -31820 -98500 -66517 190102 91734 16976
12344 -82305 -53668 125474 -17153 -248601 50113 -19508 -224978 -5530 43833 157742 -64371
12332 -141622 144972 310415 -45177 -254081 470879 259281 -343093 -204533 89371 -12123
12321 101414 -72947 72022 -87018 255945 12831 -230534 171992 14167 281265 219940 -45162
12309 253673 -1665 68058 -56707 138389 314974 155477 89568 293991 177566 -195218
12298 -126200 259045 108544 165370 177460 -160192 90367 -245065 157852 -235439 97413
12287D0850i5061l4686A01771j8097k2187Q1380c40991J14451o0619b153j29193
12276a31346B03722j1686O8920J13781G1485J60204P2991m2892j16223l1687a47990
12264d11840F302e2186m5986C33201a52185H4322f9108A09739J17233F9157J50480
12253B19637g7624a3441A39545E6276N3086a87353F3735B6584J24320r727K124
12242A43301F4048K49076d1253F5724J62944a11465j6247D15776a04752B9106
12231C31275A57740a21225A77861J73706f1982B42868P6604F3413J12449O8469
12221B44331A14665K73224J17168A55464J68893A20344A0110Q594Q9314P5663
12211A83681D8468R6337K11081j22791r3207b13942C3089K23353b11248n6914
$$ plain form
12287 40850 -95061 -129747 101771 83674 61487 142867 -340991 -226540 -287159 -2153 -131346
12276 -131346 203722 192036 260956 374737 71485 231689 304680 261788 145565 113878 -147990
12264 -411840 6302 -52186 -98172 333201 -152185 84322 -69108 109739 226972 69157 219637
12253 219637 -77624 -13441 139545 56276 109362 -187353 63735 26584 150904 141177 143301
12242 143301 64048 313124 -41253 65724 228668 -111465 -127712 415776 -104752 29106
12231 331275 157740 -121225 177861 351567 -61982 242868 319472 63413 175862 244331
12221 244331 114665 387889 505057 155464 324357 120344 10110 18704 108018 183681
12211 183681 48468 144805 355886 233095 139888 -213942 33089 256442 -211248 -268162
12201b68162B32899G5293k9637P7101k4298R5548K38863j78245r2617P8995L28786
12190E69789b02436b7748A19303c8481A95585a76462e2218C8910f3083D6656M1941
12179H8597J8070J48460R0436j68825a67807B31830G6600a13596C39220I5163
12168C67815A01532m1298M3516K52054a81106B0545b953B18626m0525J36195j43740
12157A70556k6707F420J89204A4836b93677B56243l7473K91762f1052B26677a05290
12145a55011r0086M3137A11427b07900c1636I9742a46987j196A72916G7527G985
12133b5055A53250i775B04561c559j59071F8147j8756c56081B00135b80145A9363
12121I7164e04980a91206A90020b6415p4629A83128H1116L0457L09975j57793
$$ plain form
12201 -268162 232899 75293 45656 122757 98459 194007 432870 254625 162008 241003 569789
12190 569789 -202436 -27748 119303 -38481 195585 -176462 -52218 38910 -63083 46656 88597
12179 88597 106667 255127 345563 176738 -167807 231830 76600 -113596 339220 95163
12168 367815 101532 60234 103750 355804 -181106 20545 -2953 218626 178101 314296 170556
12157 170556 143849 6420 195624 14836 -293677 256243 218770 510532 -61052 226677 -105290
12145 -155011 -245097 -201960 111427 -207900 -31636 99742 -146987 -148183 172916 77527 7985
12133 -25055 153250 -9775 204561 -3559 -162630 68147 49391 -356081 200135 -280145 19363
12121 97164 -504980 -191206 190020 -26415 -101044 183128 81116 111573 421548 263755
12111B63755G4611K84144a5678j15555j25750B01312G9509J94458M909a33315
12100a9738p52A3486f8732H0482B9391b60204R7318k09053D5811a36124R307b5936
12087B08798a47971b9085C2329P8346f9412A40507c94190d1488j06393b4698A17498
12075a27003B710K80939J4151L86738J209500o76916D36127A23905K33018A60092
12064a16748A16583M1393C7832J48135o5340k3941k2286L9478q104K25479d8712
12052e0686c161A30294J04671c46384H6229a1496J808j94652j86790k5208C62751
12040E14880c7250A02065J22791Q7312c94388N0332a34564N4511r8350g9233h149
12028h1668j56021i2269A78839a33236l7199j26100a1850k18143A46532o9585
$$ plain form
12111 263755 74611 358755 -15678 -131233 -256983 201312 79509 273967 278876 -133315
12100 -19738 -20490 13486 -68732 80482 29391 -260204 -162886 -371939 45811 -136124 -126817 -25936
12087 208798 -147971 -29085 32329 110675 -69412 140507 -394190 -41488 -147881 -24698 117498
12075 -127003 2710 283649 297800 684538 1894038 1217122 436127 123905 356923 160092
12064 -116748 116583 157976 37832 185967 120627 96686 74400 113878 105774 331253 -48712
12052 -50686 -3161 130294 234965 -346384 86229 -11496 -9688 -204340 -391130 -416338 362751
12040 514880 -37250 102065 224856 312168 -394388 -344056 -134564 -80053 -178403 -79233 -8149
12028 -81668 -237689 -92269 178839 -133236 -170435 -296535 -11850 -229993 146532 76947
12018G6947B2323d36859A0790a61725B37979b30558H7512J79209j16272e0770
12007C22792b3493j43213B14534A4782b21377F0155k9776K22639a92567a1989
11996b475A58362a05717D1251K5764j1400d31352J51575G07K12405A05309p395
11985I7914l9405b22565B04225B6549L51872j74900K0990e614B2315b3756j96903
11974b20659i1267b5653j74156o7543A60482d04108A61715e9318J5056l80370
11964d24632a54635g0824F110K47998A14268a61969A05723i3162G9572a946m4202
11953d6148o4864G2039B3809b2130j65984j50833B2785J18585a02807j69497A04533
11941F3136a04405A39948B4795K08871E9930F709b72055k8733A19776J33064j10371
$$ plain form
12018 76947 22323 -436859 10790 -161725 237979 -230558 87512 266721 150449 -50770
12007 322792 -23493 -166706 214534 14782 -221377 60155 30379 253018 -192567 -11989
11996 -2475 158362 -105717 41251 67015 55615 -431352 -279777 707 213112 105309 97914
11985 97914 58509 -222565 204225 26549 378421 203521 224511 -5614 22315 -23756 -220659
11974 -220659 -91267 -25653 -199809 -267352 160482 -404108 161715 -59318 -44262 -424632
11964 -424632 -154635 -70824 6110 254108 114268 -161969 105723 -93162 79572 -1946 -46148
11953 -46148 -111012 72039 23809 -22130 -188114 -338947 22785 141370 -102807 -272304 104533
11941 63136 -104405 139948 24795 233666 59930 6709 -272055 -300788 119776 252840 142469
11930A42469b67100A06121Q341c80750J40943B7132b46438a23159a8207j38423
11920a56630A1097d2247j2681A78198J35876j11287k8811b14288A50774f5641
11909B053O8096a73508B33632c427A97995j679p8558C2485K11623b20102e0382
11897b9314I1973P9579E746J88734E2553R0712D7555b74555G5869a11624C95053
11885a80333A06079g7282G2311a66367E0053b29253K0634P1812F5265j9519L2031
11874G7777k1472a82514a3616o9279B1146i1298B4946g633A42470e7352b4506
11862G0089A3362K24108C916b14995A68672a03607E3164Q9647a52792K5737I5883
11850a78360k0910A8532h8940p6761A61799c61n4330j7346I683J8229J29995b43037
$$ plain form
11930 142469 -267100 106121 114462 -380750 -239807 27132 -246438 -123159 -18207 -156630
11920 -156630 11097 -42247 -54928 178198 314074 202787 173976 -214288 150774 -65641
11909 2053 70149 -173508 233632 -3427 197995 196316 117758 32485 244108 -220102 -50382
11897 -29314 91973 171552 5746 194480 52553 143265 47555 -274555 75869 -111624 395053
11885 -180333 106079 -77282 72311 -166367 50053 -229253 -208619 -136807 65265 45746 77777
11874 77777 56305 -182514 -13616 -82895 21146 -91298 24946 -7633 142470 -57352 -24506
11862 70089 13362 237470 3916 -214995 168672 -103607 53164 142811 -152792 -127055 95883
11850 -178360 -199270 18532 -88940 -165701 161799 -361 -54691 -72037 9683 27912 157907 -243037
11837a84373a6638j67912R114o9948R8694L8607k03574A32701M3151c8323A04910
11825B83167b04267a5423k1327B0887J4754L47968c81149B9710L7994J0962K74753
11814C53419E2068J65849e9596A21942J46852b01971N09B48608c5657j39059e5443
11802a81152n3413R3823a408k29546I474R0415C8144K5105c8447k682j58303B0962
11789a46912f2902p4666k31770g0395j9742j0160J7288A9866J1585K40139A08519
11777b8464C5611g9670K8870k0938a982G3643d7296r8512o8153i3893H6796a87629
11764d5733j51005h9939K4720l1569B16982J2117I3063a95271Q527g3164l86085
11753d59249a20327c8726j81992q6198A6261a4446j52000h1294A54329K7589a17599
$$ plain form
11837 -184373 -16638 -184550 -175436 -245384 -146690 -108083 -311657 132701 175852 -38323 104910
11825 283167 -204267 -15423 -36750 20887 35641 383609 -381149 29710 67704 78666 353419
11814 353419 52068 217917 -59596 121942 268794 -201971 -201462 248608 -35657 -174716 -55443
11802 -181152 -234565 -140742 -1408 -230954 9474 99889 38144 63249 -38447 -41129 -199432 20962
11789 -146912 -62902 -137568 -369338 -70395 -90137 -100297 -83009 19866 31451 271590 108519
11777 -28464 35611 -79670 -50800 -71738 -1982 73643 -47296 -145808 -213961 -93893 86796 -187629
11764 -45733 -196738 -89939 -65219 -96788 216982 229099 93063 -195271 -186744 -73164 -459249
11753 -459249 -120327 -38726 -220718 -306916 16261 -14446 -166446 -81294 154329 181918 -117599
11741b85923N3315i5752m4202j80007J55812l0525B14058d7609r2831j07146c9733
11729i871e26l35354A83284Q2848b41563G8712a94355R0055G920J38993p1841
11718G5072a02580Q182A2592d17059c0161j37820A27266b71035a12216b1280B31698
11706H838J00150N4842p9197a57795L0779A41038J08308G4329b33505B40865a07927
11694h8202l09981E8826K51324I3124B9028L01780a21931A0959R3818j9056a58821
11682a45168c7120l48778D11598a50299a6866C3182K2655a04377J8224k44259
11672c30412H6495K28574B7889K41465a78844A9705a36555b5787j8083B65900
11661a34532d7171C9693a31567B33116g0211n0430j43842g628I4789d272j17372
$$ plain form
11741 -285923 -232608 -95752 -139954 -319961 -164149 -194674 214058 -47609 -140440 -247586 -39733
11729 -9871 -526 -335880 183284 266132 -241563 78712 -194355 -104300 7920 146913 75072
11718 75072 -102580 -94398 12592 -417059 -30161 -167981 127266 -271035 -112216 -21280 231698
11706 8838 108988 163830 84633 -157795 -127016 141038 249346 74329 -233505 240865 -107927
11694 -88202 -398183 58826 310150 93124 29028 330808 -121931 10959 104777 85721 -158821
11682 -145168 -37120 -385898 411598 -150299 -16866 33182 55837 -104377 -86153 -330412
11672 -330412 86495 315069 27889 269354 -178844 19705 -136555 -25787 -43870 265900
11661 -134532 -47171 39693 -131567 233116 -70211 -120641 -264483 -7628 94789 -4272 -121644
11650a21644B56808c04078O6282A50465E5727A8480a55861H6719l3302b50195
11639a25800A77604F6002a4923B9321g7604c2488r4654C17874j38903a39923A54896
11627f7200b4531j31113E9689B994b20274B9824P5971K19832A54518a38590A10650
11615H2827K8875B5204K26881a53071C5665c0642p8117B81418h9564I9965L5581
11604A35546a35467g467q2824b9549r2595N8195j2234k18253A2690f1868j95567
11593b57435a13552e104k38777d233p1122A47169m9904D2120J60547F221N9761
11582F5982K08373a36228O5157j71110N9881F1555a32000A14950E3084k0710h5411
11570a31343r636A71491i9122A49119K78479A40139a02633a2700l4046J4191E372
$$ plain form
11650 -121644 256808 -304078 -237796 150465 55727 18480 -155861 86719 53417 -250195
11639 -125800 177604 66002 -14923 29321 -77604 -32488 -127142 317874 178971 -139923 154896
11627 -67200 -24531 -155644 59689 2994 -220274 29824 105795 325627 154518 -138590 110650
11615 82827 111702 25204 252085 -153071 35665 -30642 -108759 281418 -89564 99965 135546
11604 135546 -135467 -7467 -90291 -29549 -122144 -63949 -76183 -294436 12690 -61868 -257435
11593 -257435 -113552 -5104 -243881 -4233 -75355 147169 97265 42120 202667 6221 65982
11582 65982 274355 -136228 -71071 -242181 -182300 61555 -132000 114950 53084 32374 -85411
11570 -131343 -140979 171491 -99122 149119 427598 140139 -102633 -12700 -46746 -32555 5372
11558h8636G7220K431b67159C5795N2615I56Q6173a21389H1577i26A86107E9513
11545A00114c2003A44174a29813A1496a08387a2162H9477b8530k32426B13568
11534B07922a2584C4622C842K5679b17601B31039b62275B50283q0552J44485C7399
11522C17735a87028N7870c0831j66567g8178a7057j03303B85995b10370A00831
11511B13889g603j2971j16666C20329j00279O5137A35942a21769G227M49779a81111
11499B50003J10402o4882j31629a95400k0979A36487c9470C4616J84960c01579
11488B0182R3204a53209L4011b3704D1108h1331C32606j62825J78436o2092b4084
11476B32071B0544b15059A1768O8680b7821F5876A066N5194A6719a220E7649M7536
$$ plain form
11558 -88636 77220 79651 -267159 35795 88410 956 87129 -121389 81577 -926 186107 59513
11545 100114 -32003 144174 -129813 11496 -108387 -12162 89477 -28530 -260956 213568
11534 207922 -12584 34622 3842 29521 -217601 231039 -262275 250283 169731 314216 37399
11522 317735 -187028 -129158 -30831 -197398 -78178 -17057 -120360 285995 -210370 100831
11511 213889 -7603 -20574 -137240 320329 220050 285187 135942 -121769 7227 457006 -181111
11499 250003 360405 295523 163894 -195400 -216379 136487 -39470 34616 219576 -301579
11488 20182 113386 -153209 -119198 -23704 41108 -81331 332606 169781 348217 286125 -24084
11476 232071 20544 -215059 11768 80448 -27821 65876 1066 56260 16719 -1220 57649 105185
11464A05185d0987a3523r9237D11159N5593b5420k32155C67765n8294l0526J08256
11453C87201a10760D9572i0098A92801a48446E03129k02648a55932f9677a1988
11442a07222J552c1649A39304e4138q2246B14538J02301a74317G0727i1568c6847
11430f8059A10768b59671j61784A4671J98472r7125c0374C101J62731E8985M1989
11419A00974b77068B57704b1260j09454j91303a6754F2600M1370a03547A69892
11408E7274L145N7500b66795R7414A85148a6219j75830j74013C11378g9158l8413
11397a17571F1843a46592L5069j10738A00250C8181b7961B9221M8575K1467K9653
11386A28916m6915b82586i4118A14067i5442n2398A53781d0687n37599F4411O9513
$$ plain form
11464 105185 -40987 -13523 -112760 411159 466752 -25420 -257575 367765 309471 278945 387201
11453 387201 -110760 49572 -90098 192801 -148446 503129 300481 -155932 -69677 -11988
11442 -107222 -105670 -31649 139304 -54138 -136384 214538 316839 -174317 70727 -91568 -36847
11430 -68059 110768 -259671 -421455 14671 213143 116018 -30374 3101 165832 58985 100974
11419 100974 -277068 257704 -21260 -130714 -322017 -16754 62600 103970 -103547 169892
11408 57274 60419 117919 -266795 -169381 185148 -16219 -192049 -366062 311378 -79158 -117571
11397 -117571 61843 -146592 -111523 -222261 100250 38181 -27961 29221 77796 99263 128916
11386 128916 82001 -282586 -94118 114067 -95442 -147840 153781 -40687 -578286 64411 133924
11375A33924n5341a38572A12382M03687c4640A89225o9677c27536D9279a92203
11364e6931a4203p0214A23566J14216a3204B6498L8245d9718j02835g1499j65356
11353b36855D612J51467c2755k75697J11110l431C07663a91186C02124j15368
11343A86756H5741c22077A53097a89993j01557C52839H0126a52341d5378m3424
11333h8802K0837j88282G9076e4151H0980e7826E8418A0863K33315B3602b47604
11321f7169n4149A02436a60999G9631J65059a37408j09147G8538k078j2742J80779
11310B44497B4878P1164e5906g327j41059A23705Q4726b79074D892a99623R2623
11299a07000m8158n3728j00414d8763C835b03401M0118K6232G5681b03002f5152
$$ plain form
11375 133924 78583 -138572 112382 516069 -34640 189225 119548 -327536 49279 -192203
11364 -56931 -14203 -84417 123566 237782 -13204 26498 64743 -49718 -152553 -71499 -236855
11353 -236855 4612 156079 -32755 -308452 -197342 -200773 307663 -191186 302124 186756
11343 186756 85741 -322077 153097 -189993 -291550 352839 80126 -152341 -45378 -88802
11333 -88802 -67965 -256247 79076 -54151 80980 -57826 58418 10863 244178 23602 -247604
11321 -67169 -121318 102436 -160999 79631 244690 -137408 -246555 78538 76460 63718 244497
11310 244497 24878 96042 -55906 -7327 -148386 123705 208431 -279074 4892 -199623 -107000
11299 -107000 -155158 -208886 -309300 -48763 3835 -203401 -163283 -137051 75681 -203002 -65152
11287B19573c07834A37501a97751r0866a12973k05622E461J5288c4150A40960
11276B35599b09413A39404e5406B11726i5894B4940c75143a54185E8043d80042
11265d45598D607f7751j94348f0784D95590I4511J05776d9590G113i0195F5738
11253A3080L11833b60675R1060B11805L7306a30726C89881h4407j46684f7348
11242a38841K0094b9638H6978K51091g1457C1286h2530D9493c2721n3675H5887
11230A2177i566m5510k83968A60602J65213A23019C2098b63050i2679B27175F28
11218A62859Q3826c2851F6340a86055a6634A80141a27703d6822j84358D56365
11207I3430b26922B70373n9000g7142a6262A05940G493c9503k61039B62958d0857
$$ plain form
11287 219573 -307834 137501 -197751 -288617 -112973 -318595 5461 20749 -34150 140960
11276 235599 -209413 139404 -55406 211726 -95894 24940 -375143 -154185 58043 -480042
11265 -445598 4607 -67751 -262099 -60784 495590 94511 200287 -49590 7113 -90195 65738
11253 13080 324913 -260675 -169615 211805 249111 -130726 389881 -84407 -231091 -67348
11242 -138841 -118747 -29638 86978 338069 -71457 31286 -82530 49493 -32721 -86396 85887
11230 12177 -9566 -55076 -339044 160602 325815 123019 32098 -263050 -92679 227175 628
11218 162859 246685 -32851 66340 -186055 -16634 180141 -127703 -46822 -231180 456365
11207 93430 -226922 270373 211373 -77142 -16262 105940 7493 -39503 -300542 262958 -40857
11195b57966k13978a41887o9794d5149A74768b75063m6734P8300p033M6696A85113
11183b76631m7582J39362l23457A08843N6732p6432a7407A9038M2372A5829a55433
11171E9532J48788e07410a36864k13002A08845m4915d6970G0808b34455A93795
11160B85902i1267j20425i3942I0524i3531H2308J23861E3430K31819b38539F9498
11148B70092G7332P4769c74192A26931K8693C438b34564B15699a06154L2305j4368
11137h8217L6302j58917c6536H0408b85508E796L52161H3006c7153l87425I9544
11125c2011j15870j92374C4415n350Q0115a08053A62324E362d7716D5594J31267
11114A76861A43f8879F8864a77140A47707m7653c0955m13423A09922l8125a51704
$$ plain form
11195 -257966 -471944 -141887 -211681 -45149 174768 -275063 -321797 -243497 -250530 -203834 185113
11183 -276631 -324213 -184851 -508308 108843 165575 89143 -17407 19038 61410 15829 -155433
11171 59532 208320 -507410 -136864 -349866 108845 63930 -46970 70808 -234455 193795
11160 285902 -91267 -211692 -93942 90524 -93531 82308 206169 53430 285249 -238539 69498
11148 270092 77332 152101 -374192 126931 155624 3438 -234564 215699 -106154 -73849 -88217
11137 -88217 -51915 -210832 -36536 80408 -285508 5796 357957 83006 -37153 -424578 99544
11125 -32011 -147881 -340255 34415 29065 109180 -108053 162324 5362 -47716 45594 176861
11114 176861 143 -68879 68864 -177140 147707 100054 -30955 -444378 109922 71797 -151704
11102e5425A97633a22318h277A94943b1401F3590L6992J15725m7830N7644C8222
11090a98262Q3974d665B65824h5676K9628B91960C4984a59984A9507a0582D5858
11078A65513N8822j8325J5767J13065I6553a88538C47554A57461J39904L7877
11068C35242j53176m2234K42589n3133R0284j53943L12874k79316J30658r5958
11058C33887L8181P4118j40901a12523C77868J70736M2984j67363M5392J88454
11048F58071k86645J72378j26048k7760q597M9612k02976M70046k50406B01324
11037G47106C25623L45853j60689R4985A57748M49710A5552O40059q6652J79923
11027G48882k54006L5023K45288q3288k9138B34072K85665J92397j55738j20906
$$ plain form
11102 -55425 197633 -122318 -8277 194943 -21401 63590 100582 216307 168477 226121 38222
11090 -198262 -114288 -4665 265824 -85676 -56048 291960 34984 -159984 19507 -10582 45858
11078 165513 224335 206010 221777 334842 96553 -188538 347554 157461 297365 335242
11068 335242 182066 139832 382421 329288 419572 265629 578503 299187 429845 333887
11058 333887 372068 446186 305285 -112523 377868 548604 591588 424225 469617 658071
11048 658071 371426 543804 417756 389996 381399 431011 228035 698081 447675 201324
11037 747106 325623 671476 510787 605772 157748 607458 15552 655611 568959 748882
11027 748882 494876 529899 775187 691899 662761 234072 519737 712134 556396 435490
11017D35490j10620Q8171J27435B41282K07774A62598J34995l070K26888O9025
11007E90436A70013L14324j07709j10788Q1351J01605J04965j17648p1986m2649
10997C21478J37062j40164k9697L01071k85997K15260q5019K89707k80725J56006
10987E98982B44185M41792A45915M95149J36617J59031k78750j7535J24353K41127
10977A005907O0103N3960J63584M41619m2173M42650M2178M2847j40653r3194
10967A976828n235k83862k89630r5811k4203P3442j04431k35017K21941l09438
10957I24584K84127k07074k49356P1732O5484j15964M0460k35554k06588A53373
10946D96107Q6284F2656K89156o0992c26186c5361A52771D7038R7226K11922j22105
$$ plain form
11017 435490 324870 413041 540476 241282 449056 162598 297593 294523 521411 590436
11007 590436 170013 484337 376628 265840 347191 448796 553761 436113 364127 321478
10997 321478 458540 318376 288679 589750 303753 519013 433994 723701 442976 598982
10987 598982 244185 685977 145915 641064 777681 936712 657962 640427 764780 1005907
10977 1005907 1066010 1119970 1283554 1725173 1683000 2125650 2167828 2210675 2070022 1976828
10967 1976828 1971593 1687731 1398101 1302290 1278087 1351529 1247098 1012081 1234022 924584
10957 924584 1208711 1001637 752281 824013 889497 773533 813993 578439 371851 153373
10946 496107 582391 62656 351812 290820 -326186 -35361 152771 47038 144264 356186 234081
10935B34081d1607j1263A47491O6021o2950K6691p2082L2537N868K2425Q1083
10924B47084j17301n413K46762E6284J86133H0571d2956j49539J0760a9180A67637
10912A04620a55566f4066D02327j36402D9038J38601b82220m7948A91860q0591
10902A11269h9708c7432A24722D9685g8650o4136M7422j90104c2882q0863K25
10891a13520L8774B73337j11044a46677G7570c3761A05038a01604p8717g0205
10880e7362b4016j2392k92088R9896b843E0081K4354a2815A92536c2905B41697
10868B267b73903g0326j78855f4027k53799A95712L08A0235i02C4570N060J6744
10856E6374e3012o3894N1196G5740a58289K0486k278m54A63692A1754A139P737
$$ plain form
10935 234081 -41607 -52870 147491 213512 150562 177253 105171 137708 143576 166001 247084
10924 247084 129783 124370 371132 56284 242417 80571 -42956 -192495 -181735 -19180 167637
10912 104620 -155566 -64066 402327 265925 49038 187639 -282220 -330168 191860 111269
10902 111269 -89708 -37432 124722 49685 -78650 -142786 -95364 -285468 -32882 -113745 -113520
10891 -113520 -74746 273337 162293 -146677 77570 -33761 105038 -101604 -180321 -70205
10880 -57362 -24016 -36408 -328496 -228600 -2843 50081 74435 -12815 192536 -32905 241697
10868 2267 -273903 -70326 -249181 -64027 -317826 195712 196020 10235 -902 34570 39630 56374
10856 56374 -53012 -116906 -65710 75740 -158289 -137803 -140081 -140535 163692 11754 1139 8876
10844H876a77666L5769C68596b48183E2801c65659a05976K2728j5554B7761h7424
10832b77293O3073a1578l63125J78365h8923A74970b37500j22795F1190b01883
10821b47940a10245j27604m6322J32994B54569c0115j46810h1832H7182L8900
10811A26082a74673l2233A00083g7065A72J76468b06831i2565b6657A84789l9529
10800A45260M3196G219K31789e0953A19392N7910g8884r0185p9662J11297j53940
10789b91374k9916J50720m4197p3963A51334e9319j82867b1899H9666a52531O8061
10778h4470A27097c34763C511b17880B38567b8619C69350a46849q8351e9907m372
10767f4279A5533b98281C02M0646K2128d83096b22122B09512D1789K91894c65870
$$ plain form
10844 8876 -177666 -141897 368596 -248183 52801 -365659 -105976 -83248 -98802 27761 -87424
10832 -277293 -214220 -11578 -374703 -196338 -88923 174970 -237500 -360295 61190 -201883
10821 -247940 -110245 -237849 -284171 -151177 254569 -30115 -176925 -81832 87182 126082
10811 126082 -174673 -206906 100083 -77065 172 176640 -206831 -92565 -26657 184789 145260
10800 145260 188456 7219 239008 -50953 119392 177302 -78884 -169069 -248731 -137434 -291374
10789 -291374 -321290 -170570 -214767 -288730 151334 -59319 -242186 -21899 89666 -152531 -84470
10778 -84470 127097 -334763 3511 -217880 238567 -28619 369350 -146849 -235200 -59907 -64279
10767 -64279 15533 -298281 302 40948 63076 -483096 -222122 209512 41789 333683 -365870
10755E9438b36949o6664a01357C1678a71667I6288l7008Q1226g8859G0764k8584
10744D2180P2579O5936a53685a4839q5871k03145A46879C2870R6387J3851b15143
10732A1032K70919j3287a19592K6180k89838a65987d4641j00643a7929B89878
10721F4419c8897B12857g8195k00877A48618a51440A50146J49960a62457p7579
10711b40036e5694M784o1024a4671I5760i2229j43339A3935K27971m6772c937
10699E5460a97378j63035J74969m3686f220A51749B9462l831K53342c8615p0751
10688a09366k5682n4941g7122k56212D6873P7935b17932A54959n7138c32922a9259
10676b56944p6273i7629I9042D9129a21164m8153h2604E6020c00402C6277c7021
$$ plain form
10755 59438 -236949 -303613 -101357 31678 -171667 96288 59280 140506 -78859 70764 42180
10744 42180 114759 180695 -153685 -14839 -100710 -303855 146879 32870 129257 143108 -215143
10732 11032 281951 268664 -119592 -93412 -383250 -165987 -44641 -145284 -17929 289878
10721 64419 -38897 212857 -78195 -279072 148618 -151440 150146 300106 -162457 -240036
10711 -240036 -55694 -50910 -111934 -14671 95760 -92229 -235568 13935 241906 195134 -3937
10699 55460 -197378 -360413 -185444 -229130 -6220 151749 29462 25631 278973 -38615 -109366
10688 -109366 -135048 -189989 -77122 -333334 46873 124808 -217932 154959 97821 -332922 -19259
10676 -256944 -333217 -97629 99042 49129 -121164 -169317 -82604 56020 -300402 36277 -37021
10664c80334B11182r7903b62500A3101K12996e4306J3981B24452D2986f7540j17382
10653a84922m610G7710K8292K48395F9031j6770N7185c10284B95466h6417B13610
10641b167k50001C8063Q6456k0625f2848k87364P1538A30929h5839B93929I5374
10629b22836f724l2764j25364P4177F9023e4862q8330d7220m5043K3494A67870
10617a81972H9066L7329m9346J14882b42334a16089c1888j37730J0882D2765R0122
10606A32887A9518g4989F551e4443B28496b59235A92831J22307f32592K16322
10596d16270a51472A34817k5331b84703K7928J12151a4723q6770M3334A15910
10585g3371A12543c68622C3690J0342d8675A3068R286c07969L8718E1209K13791
$$ plain form
10664 -380334 211182 113279 -262500 13101 226097 -54306 -40325 224452 42986 -67540 -184922
10653 -184922 -189532 77710 106002 354397 69031 52261 109446 -310284 295466 -86417 213610
10641 -2167 -252168 38063 124519 103894 -62848 -350212 -278674 130929 -85839 293929 95374
10629 -222836 -6724 -39488 -164852 -90675 69023 -54862 -143192 -47220 -92263 -68769 167870
10617 -181972 89066 126395 77049 191931 -242334 -116089 -31888 -169618 -158736 42765 132887
10606 132887 19518 -74989 6551 -54443 228496 -259235 192831 315138 -632592 -416270
10596 -416270 -151472 134817 109486 -284703 -256775 -144624 -14723 -101493 -58159 115910
10585 -73371 112543 -368622 33690 44032 -48675 13068 22354 -307969 -269251 51209 265000
10574B65000d5764B59336D7478J85182i7684J7915l1246A15042J3540a49064A58469
10562B64640a29298c2333l10910g184H0214A5457P018L3586i4319j14347G3844
10550d4717F5119O4608J71612E1323a53249D1842J7557J75753k2754b2722A34379
10538a44172o6902a02126n9421A48749n7415D0839N9534N1030J1072d14891i2850
10526A88254E8496a47947k7039K7871A9202e0526k48053L1918a18466H924a00286
10514A14963l8872C0390h4513O950j87619a26001e6581b1137B81856e4299q746
10503f3045F5348k7104j3823a70265f1096o6825C826N1581a38710j05812A25198
10491a69249B421J31217n9770b1555j33699k14517A08726B2656L22882i7612B5261
$$ plain form
10574 265000 -45764 259336 47478 232660 -97684 -79769 -111015 115042 128582 -149064 158469
10562 264640 -129298 -32333 -343243 -7184 80214 15457 22475 56061 -94319 -208666 73844
10550 -44717 65119 129727 301339 51323 -153249 41842 59399 235152 212398 -22722 134379
10538 -144172 -211074 -102126 -161547 148749 91334 40839 100373 151403 162475 -414891 -92850
10526 188254 58496 -147947 -174986 -147115 19202 -50526 -298579 -266661 -118466 8924 -100286
10514 114963 76091 30390 -84513 -77563 -265182 -126001 -56581 -21137 281856 -54299 -63045
10503 -63045 65348 38244 24421 -170265 -61096 -127921 3826 55407 -138710 -244522 125198
10491 -169249 2421 133638 73868 -21555 -155254 -369771 108726 22656 345538 -97612 25261
10479I959g4515A57493a39925a8132F3536A5311N5695O863e4261k36095f0844
10467A27703a5484k85172A42307b21063L8260C37376j53327b22362B9927d5435
10456E42645A80533D0658o186a67713L0958n6927h7196j33277F2134a59659a3105
10444c07627r0130H6609a7910C09383b40971m2226A04814D5735M1553i1950A08767
10432B36501o5634a3864j01913M6018C4264A4987b21586B42082b38958q7042L8686
10421b87314A87812r3120c7577B20052A08437b25463l4181J13578F3560a43400
10410A09084D5952b90021E3188J15617B9743J920A4583c03765R6115A73793Q356
10399A82149H9616a3323r1294A28400b71862F7126J30592f9077A69715J16219
$$ plain form
10479 9959 -74515 157493 -139925 -18132 63536 15311 71006 77869 -54261 -290356 -60844
10467 127703 -15484 -300656 142307 -221063 -182803 337376 184049 -222362 29927 -45435
10456 542645 180533 40658 34472 -167713 -136755 -193682 -87196 -220473 62134 -159659 -13105
10444 -307627 -397757 86609 -17910 309383 -240971 -283197 104814 45735 87288 -91950 108767
10432 236501 170867 -13864 -115777 -69759 34264 14987 -221586 242082 -238958 -326000 -287314
10421 -287314 187812 94692 -37577 220052 108437 -225463 -259644 -146066 63560 -143400
10410 109084 45952 -290021 53188 168805 29743 31663 14583 -303765 -207650 173793 182149
10399 182149 89616 -13323 -104617 128400 -271862 67126 197718 -69077 169715 285934
10389B85934b55780b564B02991b2096B79644K7166k1437g8579A07603K00992A17958
10377D88455B28317K8546J28919q0283J36472d6521B65590C9955K91940l4881
10367B97014j01093R1510A37164J96710A41195E3718k4089L66115a33264M1494
10357i1770D7496O6376h5620G144J44980b1649E81519K0024B81051K30383B2871
10345E44226f0280A99970L18216j51837r0290j06622P6364j2339J74047B3841
10334A59421N3317J42387A3880J46785l9332J21201n5830L9630G7967P6190a09565
10322A15359a0066D2641d450A0011O6227a97558Q9511o331b1044H9209L1861D3310
10309a26255l26454B65489b09833C41150a80426A66785c13855H6476c94236A07817
$$ plain form
10389 285934 -255780 -2564 202991 -22096 279644 306810 285373 -78579 107603 308595 117958
10377 488455 228317 256863 385782 305499 441971 -46521 265590 39955 331895 297014
10367 297014 195921 287431 137164 333874 141195 53718 29629 395744 -133264 -91770
10357 -91770 47496 113872 -85620 7144 152124 -21649 581519 601543 281051 511434 22871
10345 544226 -60280 199970 518186 366349 276059 169437 245801 233462 407509 23841
10334 159421 212738 355125 13880 160665 121333 242534 186704 226334 77967 154157 -109565
10322 115359 -10066 42641 -4450 10011 76238 -197558 -108047 -114378 -21044 89209 121070 43310
10309 -126255 -452709 265489 -209833 341150 -180426 166785 -313855 86476 -394236 107817
10298I8610L62545A19828b91793K5201K0681A753f9917B02058b27367C0879M6973
10287G7852e97G0339C4841c84386a30711e284C66649M0676i672G8941N3092a90241
10274i026C66998A66914b27320C71689A51269b24186j120A16289g2894j43096
10264b15990A73039A9409a64884b141B6573b16716B07K6712J91346a54113C9095
10252A88674J75438a906k20054O2848q0412A19225g0892I3549a77090n53d8174
10240A63829h0859E9582N5486R8197A03598a17363F7773b17756A69458J794a00022
10228b97020f7871A14293a4846p2489m8096O3479H3674a11752F0927a1644r2963
10217a04607A49135C5193a74569j22768C4631i7440q5635j80577a57596e031j01015
$$ plain form
10298 98610 461155 119828 -291793 -266592 -245911 1753 -69917 202058 -227367 30879 77852
10287 77852 -597 70339 34841 -384386 -130711 -5284 366649 407325 -9672 78941 132033 -190241
10274 -9026 366998 166914 -227320 371689 151269 -224186 -225306 116289 -72894 -215990
10264 -215990 173039 19409 -164884 -2141 26573 -216716 207 26919 218265 -154113 39095
10252 188674 364112 -1906 -221960 -159112 -239524 119225 -70892 93549 -177090 -177643 -48174
10240 163829 -80859 59582 115068 213265 103598 -117363 67773 -217756 169458 171252 -100022
10228 -297020 -67871 114293 -14846 -87335 -135431 -71952 83674 -111752 60927 -11644 -104607
10217 -104607 149135 35193 -174569 -297337 34631 -97440 -183075 -363652 -157596 -5031 -106046
10206a06046r4893C4717b07845d7126j6109q9313A04444d84259A58467b91101
10195A65421a52328B06004A392L56871a73922f4586C0526a36185A02732K53327
10185C56059a07202C6647L6055K4071J31927G643b11792A21199D1565b90137j13957
10174d04094h5108j36532A50761d92552A27055n5006a68175p2212J01440k68838
10164d07785i2695K3705e398p5293r4362A42444b57372H7303a93832g8287K106
10153g6181A15282b0423j80035G6887B1618J03254c79129C2646b64252i5356l3624
10142a28980i570B4736b75662e5656F696J79205e1618I674K5526L0461a21100
10130I6056a30200I0612b19806O5882C2159a79112e4260l55373A30847e4361A7469
$$ plain form
10206 -106046 -200939 34717 -207845 -47126 -63235 -152548 104444 -484259 158467 -291101
10195 165421 -152328 206004 1392 358263 -173922 -64586 30526 -136185 102732 356059
10185 356059 -107202 36647 72702 96773 228700 7643 -211792 121199 41565 -290137 -404094
10174 -404094 -85108 -221640 150761 -492552 127055 72049 -168175 -240387 -138947 -407785
10164 -407785 -92695 -68990 -5398 -80691 -175053 142444 -257372 87303 -193832 -78287 -76181
10153 -76181 115282 -20423 -200458 76887 21618 124872 -379129 32646 -264252 -95356 -128980
10142 -128980 -9570 24736 -275662 -55656 6696 185901 -51618 9674 35200 65661 -121100
10130 96056 -130200 90612 -219806 -153924 32159 -179112 -54260 -409633 130847 -54361 17469
10118c5798A23711D0716c58375q3117d1638C341a35859d2173j21063G2163l5597
10107C6566R7246i8650r2948o6430N2067P1189d4771k0168m1628p4570A81225
10095i9400q1379P3424c0348r1058A1699a35105N3584A84235a6181h064k71077
10084b79141A1794a61041f3261n5918E1190c82997B6040E848c075j76746A60689
10072a53141g6341a2175r0067m6790n0860A4105e0712K067a2496A52442b41314
10060A5466K28513j01050a78912A29568a3834B23544f6935B2334J41550C8024
10049h8796H0674O361E167c23321J34060o9212J28903j20448O0180A34431L6427
10038A70858A4754N2964b83109F9204c68241H6407b74639E1351g5354o9307j91530
$$ plain form
10118 -35798 123711 40716 -358375 -441492 -41638 3341 -135859 -42173 -163236 72163 36566
10107 36566 133812 -98650 -191598 -258028 -205961 -134772 -44771 -64939 -106567 -181137 181225
10095 -99400 -180779 -107355 -30348 -121406 11699 -135105 -81521 184235 -16181 -8064 -279141
10084 -279141 11794 -161041 -63261 -119179 51190 -382997 26040 5848 -3075 -179821 160689
10072 -153141 -76341 -12175 -102242 -149032 -199892 14105 -50712 -48645 -12496 152442 -241314
10060 15466 243979 142929 -178912 129568 -13834 223544 -66935 22334 163884 38024
10049 -88796 80674 87035 5167 -323321 -189261 -258473 -129570 -250018 -189838 134431 170858
10038 170858 14754 67718 -283109 69204 -368241 86407 -274639 51351 -75354 -144661 -336191
10027c36191E02970A81841b8949k88214J5673i1081I7281a44468A11626a8294
10016e23349b55813A05350D963a06816K2264j94980M6350P4479b729A8580P0645
10005H9225a00747k10271e9474l0079j63776O5452j53891A30947a84325A15760
9994C28830a63962g6148k25595A0658a35300L7383K7990A30153d7577r6703I6956
9982A07093c1647p5220E977O3688l0929K27990j07298d19863j23598B29950d16820
9970c706B3096J72426a29081e5279i222B2538e9281D01009c03694k8843B9806
9958g4161E98K04009C4415a30l02663O6596B42724a23446a5958n9947j66676l8905
9946b81486C74709A31957a91309A28453a94676A4002N6128c1692C2493J05449
$$ plain form
10027 -336191 502970 181841 -28949 -317163 -301490 -91081 97281 -144468 111626 -18294
10016 -523349 -255813 105350 4963 -106816 -84552 -279532 -233182 -158703 -2729 18580 89225
10005 89225 -100747 -311018 -59474 -89553 -253329 -187877 -341768 130947 -184325 115760
9994 328830 -163962 -76148 -301743 10658 -135300 -97917 -69927 130153 -47577 -144280 96956
9982 107093 -31647 -106867 5977 69665 38736 266726 159428 -419863 -543461 229950 -416820
9970 -3706 23096 195522 -129081 -55279 -9222 22538 -59281 401009 -303694 -332537 29806
9958 -74161 598 204607 34415 -130 -302793 -236197 242724 -123446 -15958 -75905 -242581 -281486
9946 -281486 374709 131957 -191309 128453 -194676 14002 70130 -31692 32493 137942
9936A37942b48118i1275l16856A3989d25579a4463m8069B52330e28159D9137a13755
9924G8023b02114J3986k83620I9629a27352L1700J8700D8977i462n94240f7825
9912A8426J31235c14326f6934D0928b7364k26389A1173c04096g9024A85910r2309
9901I3601b4392q2877k66610e8035C6530K20967a86842b6394A67371b43989A7608
9889a08597E6076K21891c63818J24936M6098M1566j92748h9944k108a2656l78410
9878c91066h6811k67547P8496a08264d4031G2487N3467b5527k97424h2447j95198
9867b77645A57833i2989j17879B29108b37764m9931a0987E1678J72528H9973L6493
9856A26466b53775j10075A4569d30318A7336f3030B66309b42445j15802a52068
$$ plain form
9936 137942 -248118 -91275 -408131 13989 -425579 -14463 -62532 252330 -528159 49137 -113755
9924 78023 -202114 -188128 -471748 99629 -127352 -95652 -76952 48977 -9462 -603702 -67825
9912 18426 149661 -314326 -66934 40928 -27364 -253753 11173 -304096 -79024 185910 93601
9901 93601 -24392 -107269 -373879 -58035 36530 257497 -186842 -26394 167371 -243989 17608
9889 -108597 56076 277967 -363818 -238882 -192784 -151218 -343966 -89944 -92052 -12656 -391066
9878 -391066 -86811 -354358 -275862 -108264 -44031 72487 125954 -25527 -322951 -82447 -277645
9867 -277645 157833 -92989 -210868 229108 -237764 -287695 -10987 51678 224206 89973 126466
9856 126466 -253775 -363850 14569 -430318 17336 -63030 266309 -242445 -358247 -152068
9845f7931j41582G4959Q1569p5401J122a9270l29462d1294J1622C10771f9190
9833c57526O1561B0675K16779J03817b97333R6378a3501k93305I1846B3771O3804
9822H7575b51867R2449L8749B6512j1504i7107j08033f240m45869J34026J38055
9811a80028h3326b9490I2524J21647c2118j40790A9011P5193J18117r0986b42955
9799f1842b895D7195a68929h4080L9001A1571b3188C24242b51116B82689E1200
9787F2383a16036l5981c1880H6928f7470e14j66091B17742i4295G8814b18107
9775B71172a2941l9676l10578J06244A19895I766P0175g3032j13828P8438B07530
9763b09454Q2793A95761a06569A38131a26467A72235a12670e1968P008m5971a336
$$ plain form
9845 -67931 -209513 74959 156528 81127 82249 -19270 -348732 -41294 -29672 310771 -69190
9833 -357526 -295965 20675 237454 341271 -297333 -200955 -13501 -306806 91846 23771 87575
9822 87575 -251867 -159418 -120669 26512 15008 -97107 -205140 -6240 -452109 -318083 -180028
9811 -180028 -83326 -29490 92524 214171 -32118 -172908 19011 94204 212321 121335 -242955
9799 -61842 -2895 47195 -168929 -84080 -45079 11571 -23188 324242 -251116 282689 51200
9787 62383 -116036 -152017 -31880 86928 -67470 -514 -166605 217742 -94295 78814 -218107
9775 271172 -12941 -52617 -363195 -256951 119895 9766 79941 -73032 -186860 -108422 207530
9763 -209454 -126661 195761 -106569 138131 -126467 172235 -112670 -51968 -44960 -90931 -1336
9751A08706c61591a64465k2369C23639a79654j11125d4683K2131j25444B4614
9740A07285a69844k91733A4821a12232A72663b73084H1817c46377E13722C6143
9729a32448b6473l35556Q2430e8214r6115H8988a47196A28316a37151B60461b28558
9717a42444N9045c5689k69597J17876e0464o8917C07640c720j03899f633k3538
9706c0171l0401D23853H7315f168k46552A642e8062C9907J310J2679b5849F4770
9693a52174n5926D6392b91933F8009h7902c6966A3559c51247d5305a8863k37647
9682b56510c2309D835a83497C01379a91693M404P9643M1547j304Q247d554j25835
9670a30389a1748A17350a52177g5712k59590e4536H7853a03083p8648a2572l33490
$$ plain form
9751 108706 -361591 -164465 -186834 323639 -179654 -290779 -44683 -22552 -147996 24614
9740 107285 -169844 -461577 14821 -112232 172663 -273084 81817 -346377 513722 36143
9729 -132448 -26473 -362029 -279599 -58214 -154329 88988 -147196 128316 -137151 260461 -228558
9717 -142444 -83399 -35689 -305286 -187410 -50464 -119381 307640 -3720 -107619 -6633 -30171
9706 -30171 -60572 423853 87315 -6168 -252720 1642 -58062 39907 41217 53896 -25849 64770
9693 -152174 -208100 46392 -291933 68009 -87902 -36966 13559 -351247 -45305 -18863 -256510
9682 -256510 -32309 4835 -183497 301379 -191693 -187289 -107646 -66099 -67403 -59156 -4554 -130389
9670 -130389 -11748 117350 -152177 -75712 -335302 -54536 87853 -103083 -181731 -12572 -346062
9659c46062C5915c55633A2312i7221l05173J03086i1096n4422e4695j51654f9864
9647b76977I9224D1438J02191R1579G6441c22700c2817q8000j12368A5594L46152
9636C61746a1672k31236l0672A44915B6474b03277k10056I4127a96786H0785b5709
9624a35058k6931B33361b37793A44704a94418i7155j12849E930K15783e2260m3392
9613i5652n6991g1117B8462e7720E3084J3672b5688j66522H074K6632a82338H4024
9600A84999H3439c6907j49990I4236i4583B7514p867a73581o2319B03550b19124
9588c88911e7326c733n2368p7141D3672f4290G740K00402e292n9601J3657k02096
9576b53332N6466D6422J23188m2260o282b08729d3447l1034Q373q9457G8265d6617
$$ plain form
9659 -346062 35915 -355633 12312 -97221 -402394 -299308 -91096 -145518 -54695 -206349 -69864
9647 -276977 99224 41438 143629 235208 76441 -322700 -32817 -120817 -233185 15594 361746
9636 361746 -11672 -242908 -273580 144915 26474 -203277 -413333 94127 -196786 80785 -25709
9624 -135058 -161989 233361 -237793 144704 -194418 -97155 -210004 5930 221713 -52260 -95652
9613 -95652 -152643 -71117 28462 -57720 53084 66756 -25688 -192210 8074 34706 -182338 84024
9600 184999 83439 -36907 -186897 94236 -94583 27514 19647 -173581 -235900 203550 -219124
9588 -388911 -57326 -3733 -56101 -133242 43672 -64290 7740 208142 -5292 -64893 -51236 -253332
9576 -253332 -196866 46422 169610 127350 121068 -208729 -43447 -74481 -66108 -155565 78265 -46617
9563E2412K4958b7118j42344a9517A04568e2690p0718o1491C4640a04568k12272
9552c16840A01144N2442a80116K7918L7302E5623b20519A35399J25969D5944N7727
9541A03671a5200r2711G7439a71187M5615O120k3362B43301H1595J01537h4194
9529b3705k47297D6628e7972I6546k4999r611c67250I1282Q8771a13899M2761
9518g1138A53235D9509J3357K9248J82806d3775k93065O0256d406j33591J6918
9507a21079a1930j75287H1556a35982l3041a6383A71883d4632j53221R4599n1399
9496a54653d6930k77333h1004c8337q139c18j21872B13667i8872J2834j53006
9485b39044C10265c92287J95582j78118A7350b30867P3639A61163C4292P3996
$$ plain form
9563 52412 77370 -27118 -169462 -19517 104568 -52690 -123408 -184899 34640 -104568 -316840
9552 -316840 101144 153586 -180116 -152198 -114896 55623 -220519 135399 261368 45944 103671
9541 103671 -15200 -107911 77439 -171187 -125572 -119452 -142814 243301 81595 183132 -84194
9529 -23705 -271002 46628 -57972 96546 71547 61936 -367250 91282 180053 -113899 -71138
9518 -71138 153235 49509 62866 92114 274920 -43775 -336840 -276584 -4406 -137997 -121079
9507 -121079 -11930 -187217 81556 -135982 -169023 -16383 171883 -44632 -197853 -103254 -154653
9496 -154653 -46930 -324263 -81004 -38337 -46476 -318 -122190 213667 -98872 -86038 -239044
9485 -239044 310265 -392287 -196705 -374823 17350 -230867 -157228 161163 34292 108288
9475A08288I823a46199L259a0455F0311M979a18073M3053j24991P2818j7746N019
9463a39920A04975b7401j24904j5760M8257j00016C04055A35258a1720p0862j40440
9452b23022B7666i6299C2724e38543b34720h8014C638a02751A95552q3343i3579
9440A41236d9887l04819j97243H7329A6133a27967j21090Q0814C1108b13489h1052
9428B13753F6108Q9319h7251q9264B40848b74501J12813L2092j5249q2150n892
9417b32887j93932C65531b03020B15387m3207C9481a26560C4951M5083J26808
9407B06842c28124J46653L430j06500d4354J707B68321F8894a54879H969e0690
9395e8500G2235b10138K3389A87273A2326K3718J6005L41439a12004M8981A9428
$$ plain form
9475 108288 9823 -146199 -142940 -10455 60311 65290 -118073 -75020 -200011 -127193 -144939 -139920
9463 -139920 104975 -27401 -152305 -168065 -119808 -219824 304055 135258 -11720 -82582 -223022
9452 -223022 27666 -96299 32724 -538543 -234720 -88014 3638 -102751 195552 112209 -93579
9440 141236 -49887 -354706 -551949 87329 16133 -127967 -249057 -168243 31108 -213489 -81052
9428 213753 66108 155427 -87251 -176515 240848 -274501 -161688 -129596 -144845 -226995 -232887
9417 -232887 -426819 365531 -203020 215387 172180 39481 -126560 34951 80034 206842
9407 206842 -328124 -181471 -178041 -284541 -44354 -42647 268321 68894 -154879 8969 -50690
9395 -58500 72235 -210138 -186749 187273 12326 36044 52049 393488 -112004 -63023 19428
9383A56993l7015a99663r0049d0300B37021r3412b09067B00259a2903R7k06950
9372b19756M9010o0427A12052a46683H5926l2757M6189K6206a63721Q319H187
9360A64301C9346J03464G0110M7179R9059g4485r7995f3544A92861D9567a673
9348I4598a14684j70559a4778A00114K25530A42233a09462E4877i075F444a08168
9336A7593i7542D1826i0683j80392A71041a95314B01592a06667n2638P360I059
9324E5299d836k36995b1005e39j32893m2663A3049d59947a44304i424G502d3113
9311c94316a25713A2917m282b0489j50638b5942A49452P9897a96275i10k9391
9300c0301B9599b58072B5754a23794B07087a6558j18856g691k38764h9753F3087
$$ plain form
9383 156993 119978 -199663 -289712 -40300 237021 143609 -209067 200259 -12903 -12806 -219756
9372 -219756 -170746 -231173 112052 -146683 85926 53169 99358 125564 -163721 -155402 8187
9360 164301 39346 142810 70110 117289 216348 -74485 -172480 -63544 192861 49567 -1673
9348 94598 -114684 -285243 -14778 100114 325644 142233 -109462 54877 -9075 6444 -108168
9336 17593 -97542 41826 -90683 -271075 171041 -195314 201592 -106667 -159305 -151945 9059
9324 55299 -4836 -241831 -21005 -539 -133432 -176095 13049 -459947 -144304 -9424 7502 -43113
9311 -394316 -125713 12917 8635 -20489 -171127 -25942 149452 229349 -196275 -910 -30301
9300 -30301 29599 -258072 25754 -123794 207087 -16558 -135414 -7691 -246455 -89753 63087
9288g7006E9235g0349j37713I8100d1714j16394f8887I1039b17603F5632f9539
9276G947f2830A34831a73676e4057p633j11102A21908O7802A6308h6663o8103
9265a54766f7249m602o2642M1339I6852J35454a60085D9842Q6790E5880c6125
9253C0175b31499j31218a22791l83575g4339B8131b49712A40520A8405B834c1608
9241a2623j40530A89568L3148b51144g9409j50215a9411A75324c7874C9666a15363
9229a06955B03206I7821C8066a5720k93564O6941J7168m8148A59338B6627c2849
9217i8135j78835C0501c34258B30078A5298b16558E2178J53837k3257b52540J6667
9206b35873M1243A71363a75499h1476D3146i5416L8578A6947R327c15j24648m9190
$$ plain form
9288 -77006 59235 -70349 -208062 98100 -41714 -158108 -68887 91039 -217603 65632 -69539
9276 7947 -62830 134831 -173676 -54057 -61690 -172792 121908 189710 16308 -86663 -154766
9265 -154766 -67249 -71851 -134493 -93154 96852 232306 -160085 49842 136632 55880 -36125
9253 30175 -231499 -362717 -122791 -506366 -74339 28131 -249712 140520 18405 2834 -31608
9241 -12623 -153153 189568 222716 -251144 -79409 -229624 -19411 175324 -37874 39666 -115363
9229 -106955 203206 97821 38066 -15720 -309284 -242343 -225175 -273323 159338 26627 -32849
9217 -98135 -276970 30501 -334258 230078 15298 -216558 52178 206015 182758 -252540 -235873
9206 -235873 -194630 171363 -175499 -81476 43146 -95416 -56838 16947 26274 -315 -124963 -174153
9194a74153o7229j49951a83540p6292o5950B36580j05428A2831J09101J51312
9184B73244b0967j8953q8558D4275d16998a22530C29419o7159D1469a08091A4150
9172d3875i084D2065a14589H4061c29011C9025i338A13143b1457A01334a45870
9160C180a80491j04669B10704c2406m6175B9647L33226A70861p8478b49784E994
9148b08471I471J07640b87165F5349b80122B42314F1813J07139n2518c48873e2165
9136d1181A30514i0870o9097n5668A82770h7774j43187Q7016j58006Q1189i1437
9124c12826H2667k3768e7846C822f075j61024B32683h3070i353j50882D5022b39969
9111F485J23505i1435A82134B2306Q4212c59355a62947A2954c8675A04110J3066
$$ plain form
9194 -174153 -241382 -391333 -183540 -259832 -325782 236580 131152 12831 121932 273244
9184 273244 -20967 -39920 -128478 44275 -416998 -122530 329419 262260 41469 -108091 14150
9172 -43875 -9084 42065 -114589 84061 -329011 39025 -9338 113143 -21457 101334 -145870
9160 3180 -180491 -285160 210704 -32406 -78581 29647 362873 170861 92383 -249784 5994
9148 -208471 9471 117111 -287165 65349 -280122 242314 61813 168952 116434 -348873 -52165
9136 -41181 130514 -90870 -159967 -215635 182770 -87774 -230961 -143945 -301951 -220762 -91437
9124 -312826 82667 58899 -57846 3822 -6075 -167099 232683 -83070 -9353 -160235 45022 -239969
9111 6485 129990 -91435 182134 22306 106518 -359355 -162947 12954 -38675 104110 117176
9100A17176J12117a13736B60344b90691A8558J83692A3556a65520M6638A31563
9089H2362k1176a08901G6691P8812c05009A00925d03859A74731a48517I9069a28220
9077a99019q075C45808a01445k09830J05117C51036b97534I2401m3722J0748k2704
9066C6723J60143H7639a26412a924l81714f4631C9708a62098A0943f4432A00301
9054a42915d0714B6203d0179A60832c454B56338o8083i2480b4625m53132c5193
9042b16498f7595a4357m38644K16250O4748N2049n9495B1956b68401Q5199k1949
9031b05151j25006a32248J4721p3704A99154g0886o1265B27183A1644J14974a28315
9019H1186i9462B9309c17751a49438a5415m4383k10196i3410j25872n463g7582
$$ plain form
9100 117176 229293 -113736 260344 -290691 18558 202250 13556 -165520 -118882 131563
9089 82362 61186 -108901 76691 155503 -305009 100925 -403859 174731 -148517 99069 -128220
9077 -199019 -207094 345808 -101445 -311275 -206158 351036 -297534 92401 48679 59427 36723
9066 36723 196866 87639 -126412 -1924 -383638 -64631 39708 -162098 10943 -64432 100301
9054 -142915 -40714 26203 -40179 160832 -3454 256338 188255 -92480 -24625 -477757 -35193
9042 -216498 -67595 -14357 -453001 -236751 -172003 -119954 -179449 21956 -268401 -183202 -205151
9031 -205151 -330157 -132248 -117527 -191231 199154 -70886 -132151 227183 11644 126618 -128315
9019 81186 -99462 29309 -317751 -149438 -15415 -59798 -269994 -93410 -219282 -224745 -77582
9007D20181b3415j97185B81070e03482A15989b10782N9645d5812A78554i7472
8996b17117i6476l39177I9498c61849g703j47617d0562j22880A454M8697J19450
8985A69601a09660m3525F4481p628b13873i7309H9646a7958r9211c9494C67912
8973a32914E4974b43179J00275A82036h8535A2949b25878J08888r9318B39131
8962g1097n47k25252C09045c45628I3129P6060g7812B86136a08471k1142D2791
8950G6122J53312F7986J5823A7417K4818P5151h7455A26244a05651G6098R5755
8939A71853a30642A00711a2881B60652J08310A78410M80174B13391a17690j08078
8929b25768C4939N6071L1572L23985j03902J76902J074611L786078Q054789L929445
$$ plain form
9007 420181 -23415 -220600 281070 -503482 115989 -210782 -151137 -45812 178554 -97472
8996 -217117 -96476 -435653 99498 -361849 -7703 -155320 -40562 -163442 1454 50151 169601
8985 169601 -109660 -153185 64481 56853 -213873 -97309 89646 -17958 -117169 -39494 367912
8973 -132914 54974 -243179 -142904 182036 -88535 12949 -225878 -116990 -216308 239131
8962 -71097 -71644 -296896 309045 -345628 93129 169189 -77812 286136 -108471 -129613 42791
8950 76122 229434 67986 83809 17417 42235 117386 -87455 126244 -105651 76098 171853
8939 171853 -130642 100711 -12881 260652 368962 178410 658584 213391 -117690 -225768
8929 -225768 34939 91010 122582 446567 342665 519567 1594178 5380256 13435045 17364490
8919A7364490F220728B215382H37144k87441B67834C6393J48317J5910d8133k88698
8909c36831a13460D01709K73381j91495b53542a4793k3375r5831C3276J37980
8899A71256E9930c4654l39627B08019a61985d9551l35449A8436J11003E1817j2570
8888C9247h2020A82433a47997E3711f078k41038i5396A9233O4798b4234p3712
8877i7946I9526a31247I6729e0910A77002d10610p2844a84646A96205A4728J80618
8866A95346g3712p1091N1373n204B78205c14757e0604j15864E4780b18005M072
$$ plain form
8919 17364490 6220728 2215382 837144 549703 267834 36393 184710 200620 -48133 -336831
8909 -336831 -113460 401709 675090 483595 -253542 -14793 -38168 -133999 33276 171256
8899 171256 59930 -34654 -374281 208019 -161985 -49551 -385000 18436 129439 51817 39247
8888 39247 -82020 182433 -147997 53711 -6078 -247116 -95396 19233 84031 -24234 -97946
8877 -97946 99526 -131247 96729 -50910 177002 -410610 -483454 -184646 196205 14728 195346
8866 195346 -73712 -144803 -93430 -98634 278205 -314757 -50604 -166468 54780 -218005 -213933
$$ [...]