
##TITLE=UV1234_M7_1357-1247_90_7240071_1BhuKbzNkE
##JCAMPDX= 6.0         $$ Bruker NMR JCAMP-DX V2.0
##DATA TYPE= NMR SPECTRUM
##DATA CLASS= NTUPLES
##ORIGIN= BRUKER
##OWNER= Administrator
$$ 1.72 TOPSPIN		Version 2.1
$$ 2013-01-25 02:44:56.842 -0500  Administrator@X
$$ Compression mode = diff/dup
##.OBSERVE FREQUENCY= 400.02188249412
##.OBSERVE NUCLEUS= ^1H
##.ACQUISITION MODE= SIMULTANEOUS (DQD)
##.ACQUISITION SCHEME= undefined
##.AVERAGES= 64
##.DIGITISER RES= 22
##SPECTROMETER/DATA SYSTEM= spect
##.PULSE SEQUENCE= noesygpps1d.comp
##.SOLVENT NAME= COFFEE_meoh
##.SHIFT REFERENCE= INTERNAL, COFFEE_meoh, 1, 14.96145
##AUDIT TRAIL= $$ (NUMBER, WHEN, WHO, WHERE, PROCESS, VERSION, WHAT)
$$ ##TITLE= Audit trail, TOPSPIN		Version 2.1
$$ ##JCAMPDX= 5.01
$$ ##ORIGIN= Bruker BioSpin GmbH
$$ ##OWNER= Administrator
$$ $$ E:\/data/COFFEE/nmr/UV1234_M7_1357-1247_90_7240071_1BhuKbzNkE/32/pdata/1/auditp.txt
$$ ##AUDIT TRAIL=  $$ (NUMBER, WHEN, WHO, WHERE, PROCESS, VERSION, WHAT)
(   1,<2013-01-25 02:44:51.030 -0500>,<Administrator>,<X>,<go>,<TOPSPIN 2.1>,
      <created by zg
	started at 2013-01-25 02:33:20.811 -0500,
	POWCHK enabled, PULCHK disabled,
       configuration hash MD5:
       86 BA 57 50 F2 9D 5C 9B 26 00 A9 28 5F 66 2E 89
       data hash MD5: 64K
       4B 1F 1D 38 E3 5E 08 CA 69 69 7A 06 CB 1F 32 2B>)
(   2,<2013-01-25 02:44:54.092 -0500>,<Administrator>,<X>,<proc1d>,<TOPSPIN 2.1>,
      <Start of raw data processing
       efp LB = 0.3 FT_mod = 6 PKNL = 1 PHC0 = 0 PHC1 = 0 SI = 128K 
       data hash MD5: 128K
       24 9B E6 E2 20 C4 5E 23 DF 91 57 AD D6 FA FC 4D>)
(   3,<2013-01-25 02:44:55.155 -0500>,<Administrator>,<X>,<proc1d>,<TOPSPIN 2.1>,
      <pk PHC0 = -82.41943 PHC1 = 0 
       data hash MD5: 128K
       21 56 71 5B 6A 80 06 07 D8 05 91 5E CC 19 04 5C>)
(   4,<2013-01-25 02:44:55.826 -0500>,<Administrator>,<X>,<proc1d>,<TOPSPIN 2.1>,
      <abs ABSG = 1 
       data hash MD5: 128K
       EB 23 65 B0 7F CF 31 51 1D C0 12 FF CB 31 08 8E>)
(   5,<2013-01-25 02:44:55.998 -0500>,<Administrator>,<X>,<proc1d>,<TOPSPIN 2.1>,
      <abs ABSG = 2 
       data hash MD5: 128K
       DA 1F 84 F1 73 6D 87 33 78 7B 1B B5 4F 1B 39 87>)
(   6,<2013-01-25 02:44:56.155 -0500>,<Administrator>,<X>,<proc1d>,<TOPSPIN 2.1>,
      <abs ABSG = 3 
       data hash MD5: 128K
       CD 84 2E 3B 96 7C 74 BF 4B 9B 45 27 0A 63 C8 6C>)
(   7,<2013-01-25 02:44:56.342 -0500>,<Administrator>,<X>,<proc1d>,<TOPSPIN 2.1>,
      <abs ABSG = 4 
       data hash MD5: 128K
       91 BB D3 14 60 33 32 0B A3 BF 61 DE B5 D2 16 DB>)
(   8,<2013-01-25 02:44:56.514 -0500>,<Administrator>,<X>,<proc1d>,<TOPSPIN 2.1>,
      <abs ABSG = 5 
       data hash MD5: 128K
       4F 7F E5 84 DB A5 A9 DD CE 56 94 01 C2 07 D7 48>)
$$ ##END=
$$ 
$$ $$ hash MD5
$$ $$ A7 A3 26 65 58 4D 62 72 F5 81 ED 72 15 AA 80 B6
##$RELAX= 
##$RELAX= 
##$RELAX= 
##$RELAX= 
##$RELAX= 
##$RELAX= 
##$RELAX= 
##$RELAX= 
$$ Bruker specific parameters
$$ --------------------------
##$DU= <E:\>
##$EXPNO= 32
$$ [...]
##$TP07= 0
##$TPNAME0= <>
##$TPNAME1= <>
##$TPNAME2= <>
##$TPNAME3= <>
##$TPNAME4= <>
##$TPNAME5= <>
##$TPNAME6= <>
##$TPNAME7= <>
##$TPOAL= (0..7)
0.5 0.5 0.5 0.5 0.5 0.5 0.5 0.5
##$TPOFFS= (0..7)
0 0 0 0 0 0 0 0
##$TUNHIN= 0
##$TUNHOUT= 0
##$TUNXOUT= 0
##$USERA1= <user>
##$USERA2= <user>
##$USERA3= <user>
##$USERA4= <user>
##$USERA5= <user>
##$V9= 5
##$VALIST= <valist>
##$VCLIST= <CCCCCCCCCCCCCCC>
##$VD= 0
##$VDLIST= <DDDDDDDDDDDDDDD>
##$VPLIST= <PPPPPPPPPPPPPPP>
##$VTLIST= <TTTTTTTTTTTTTTT>
##$WBST= 1024
##$WBSW= 4
##$XGAIN= (0..3)
0 0 0 0
##$XL= 0
##$YL= 0
##$YMAX_a= 5815733
##$YMIN_a= -11320260
##$ZGOPTNS= <>
##$ZL1= 120
##$ZL2= 120
##$ZL3= 120
##$ZL4= 120
##$ABSF1= 14.96145
##$ABSF2= -5.596732
##$ABSG= 5
##$ABSL= 3
##$ALPHA= 0
##$AQORDER= 0
##$ASSFAC= 0
##$ASSFACI= 0
##$ASSFACX= 0
##$ASSWID= 0
##$AUNMP= <proc_prof1d_extract.lims>
##$AXLEFT= 0
##$AXNAME= <>
##$AXNUC= <1H>
##$AXRIGHT= 0
##$AXTYPE= 0
##$AXUNIT= <>
##$AZFE= 0.1
##$AZFW= 0.1
##$BCFW= 0
##$BC_mod= 0
##$BYTORDP= 0
##$COROFFS= 0
##$CY= 15
##$DATMOD= 1
##$DC= 0
##$DFILT= <>
##$DTYPP= 0
##$F1P= 0
##$F2P= 0
##$FCOR= 0.5
##$FTSIZE= 131072
##$FT_mod= 6
##$GAMMA= 0
##$GB= 0
##$INTBC= 1
##$INTSCL= 1
##$ISEN= 128
##$LB= 0.3
##$LEV0= 0
##$LPBIN= 0
##$MAXI= 10000
##$MC2= 0
##$MEAN= 0
##$ME_mod= 0
##$MI= 0
##$NCOEF= 0
##$NC_proc= -2
##$NLEV= 6
##$NOISF1= 0
##$NOISF2= 0
##$NSP= 0
##$NTH_PI= 0
##$NZP= 0
##$OFFSET= 14.96145
##$PC= 1
##$PHC0= -82.41943
##$PHC1= 0
##$PH_mod= 1
##$PKNL= yes
##$PPARMOD= 0
##$PPDIAG= 0
##$PPIPTYP= 0
##$PPMPNUM= 2147483647
##$PPRESOL= 1
##$PSCAL= 4
##$PSIGN= 0
##$PYNMP= <proc.py>
##$REVERSE= no
##$SF= 400.020009455861
##$SI= 131072
##$SIGF1= 0
##$SIGF2= 0
##$SINO= 400
##$SIOLD= 131072
##$SPECTYP= <>
##$SREGLST= <1H.CDCl3>
##$SSB= 0
##$STSI= 131072
##$STSR= 0
##$SW_p= 8223.68421052631
##$SYMM= 0
##$S_DEV= 0
##$TDeff= 65536
##$TDoff= 0
##$TI= <>
##$TILT= no
##$TM1= 0
##$TM2= 0
##$TOPLEV= 0
##$USERP1= <user>
##$USERP2= <user>
##$USERP3= <user>
##$USERP4= <user>
##$USERP5= <user>
##$WDW= 1
##$XDIM= 131072
##$YMAX_p= 462234015
##$YMIN_p= -12514
##$CURPLOT= <Network HP LaserJet P1505>
##$CURPRIN= <$Network HP LaserJet P1505>
##$DFORMAT= <normdp>
##$LAYOUT= <+/1D_H.xwp>
##$LFORMAT= <normlp>
##$PFORMAT= <normpl>
##$SURQMSG= 1
$$ End of Bruker specific parameters
$$ ---------------------------------
##NTUPLES= NMR SPECTRUM
##VAR_NAME=  FREQUENCY,     SPECTRUM/REAL,   SPECTRUM/IMAG
##SYMBOL=    X,             R,               I
##VAR_TYPE=  INDEPENDENT,   DEPENDENT,       DEPENDENT
##VAR_FORM=  AFFN,          ASDF,            ASDF
##VAR_DIM=   131072,        131072,          131072
##UNITS=     HZ,            ARBITRARY UNITS, ARBITRARY UNITS
##FACTOR=    0.0627417313425164, 1,          1
##FIRST=     8223.62146879497, 2926,         -51419
##LAST=      0,             4987,            -51080
##MIN=       0,             -12514,          0
##MAX=       8223.62146879497, 462234015,    0
$$ Real data points
##PAGE= N=1
##DATA TABLE= (X++(R..R)), XYDATA
$$ [...]
63924D831266R6775N9838K2159j5803n3724r1526j28640j63160j92531k15299
63914D149355k31761k42730k48417k48830k44716k37364k27657k15730k01512
63905B050638j85270j67658j49425j31179j13443r6888q2201o9596n8704m9294
63895I46980m1793l6596l3221l0774k8970k7904k7084k5740k4097k3151k2919
63884F24731k2162k0269j8222j6892j5552j3183j0357q425p421o203m389k776
63872D78880j745n53J397L620N408O860Q522J0463J2341J4041J5860J8089K0681
63859E93864K3339K5818K8144L0428L2425L3594L3815L3748L4068L4509L4154
63848I37906L2554L0109K7359K4369K0860J6667J1907O834J528m253j0607j6790
$$ y = [4831266, 4928041, 4987879, 5010038, 4994235, 4940511, 4848985, 4720345, 4557185, 4364654, 4149355, 3917594, 3674864, 3426447, 3177617, 2932901, 2695537, 2467880, 2252150, 2050638, 1865368, 1697710, 1548285, 1417106, 1303663, 1206775, 1124574, 1054978, 996274, 946980, 905187, 868591, 835370, 804596, 775626, 747722, 720638, 694898, 670801, 647650, 624731, 602569, 582300, 564078, 547186, 531634, 518451, 508094, 499669, 492248, 486045, 481656, 478880, 477135, 476582, 477979, 481599, 487007, 493867, 502389, 512852, 525193, 539234, 555094, 573183, 593864, 617203, 643021, 671165, 701593, 734018, 767612, 801427, 835175, 869243, 903752, 937906, 970460, 1000569, 1027928, 1052297, 1073157, 1089824, 1101731, 1108565, 1110093, 1105840, 1095233, 1078443]
63836A078443k1574k4606k6919k9600l2518l4957l6887l8589l9514l8752l6690
63825G17837l4974l4419l3969l2261k9454k6836k5133k3848k2079j9529j6773
63814D18562j4688j3540j2707j1503j0094r123q595p900o913o262o220o148n487
63801B99382m620m215m277m418m615n022n351n126m472m044m113m241l958l368
63787B37542k881k624k321j767j166q90r74j108j163j422j997k410k149j381o23
63772B12666N1Q26J318Q20n19j549j518r14n54n02m11l32n67j003j185r34m55
63755B05238k7J14j76p02r36o01QN33J052J758K413K625K431K272K400K617K558
63738B23577K028J222O80Q14J375J703J631J675K154K634K650K457K620L151L576
$$ y = [1078443, 1056869, 1032263, 1005344, 975744, 943226, 908269, 871382, 832793, 793279, 754527, 717837, 682863, 648444, 614475, 582214, 552760, 525924, 500791, 476943, 454864, 435335, 418562, 403874, 390334, 377627, 366124, 356030, 346907, 338312, 330412, 323499, 317237, 311017, 304869, 299382, 294762, 290547, 286270, 281852, 277237, 272215, 266864, 261738, 257266, 253222, 249109, 244868, 240910, 237542, 234661, 232037, 229716, 227949, 226783, 225893, 224919, 223811, 222648, 221226, 219229, 216819, 214670, 213289, 212666, 212717, 213543, 214861, 215681, 215162, 213613, 212095, 211181, 210627, 210125, 209714, 209382, 208815, 207812, 206627, 205693, 205238, 205211, 205325, 205149, 204447, 203511, 202910, 202918, 203451, 204503, 206261, 208674, 211299, 213730, 216002, 218402, 221019, 223577, 225605, 226827, 227507, 228321, 229696, 231399, 233030, 234705, 236859, 239493, 242143, 244600, 247220, 250371, 253947]
63723B53947L640L490L353L362L469L320K628J834J804K426K332P57j043j331
63709B83988l41K6j163k800l531l352k982k620k043j350q16l71K48J077J956K770
63693B68696L370L514L248K996L031L060K662J842R35J69l44m40j08L13M31K41
63677B93616L9k0%J8jo4K7O35J749K659K626J900J531K062K782K566J134q01k345
63658C10113l067l016k599k440k912l688m045l737l263l111l136k883k262j525
63644B68429q20j59L35N17M95M55L73K55N30J563K901L645L656L736M416N275
63628B95602N758O128O938Q111R108R714J0149J0611J1230J2251J3731J5243J6412
63615D30986J7603J9487K2005K4403K6319K8206L0415L2444L3510L3465L2646
$$ y = [253947, 257587, 261077, 264430, 267792, 271261, 274581, 277209, 279043, 280847, 283273, 285605, 286362, 285319, 283988, 283647, 283673, 282510, 279710, 276179, 272827, 269845, 267225, 265182, 263832, 263016, 262645, 262893, 263970, 265926, 268696, 272066, 275580, 278828, 281824, 284855, 287915, 290577, 292419, 293354, 293523, 293179, 292739, 292631, 292944, 293375, 293616, 293655, 293635, 293635, 293653, 293652, 293588, 293615, 294250, 295999, 298658, 301284, 303184, 304715, 306777, 309559, 312125, 313259, 312458, 310113, 307046, 304030, 301431, 298991, 296079, 292391, 288346, 284609, 281346, 278235, 275099, 272216, 269954, 268429, 267609, 267450, 267785, 268302, 268797, 269252, 269625, 269880, 270410, 271973, 274874, 278519, 282175, 285911, 290327, 295602, 301360, 307488, 314426, 322537, 331645, 341359, 351508, 362119, 373349, 385600, 399331, 414574, 430986, 448589, 468076, 490081, 514484, 540803, 569009, 599424, 631868, 665378, 698843, 731489]
63604G31489L0890K7345K1496J4139O939R98l756p700j0519j1666j1557j1462
63592G76636j2088j2963j3594j4481j6404j9103k1392k2433k2372k1821k1172
63581E78813k0400j9193j7353j5230j3519j2367j1092r133o789m593k442m8K224
63568D48878L829N026O462P904Q362P567O452N958O156O751P677Q856J0003J1040
63554E50921J2289J4016J6255J9175K2962K7250L1282L4902L8574M2018M3478
63543H53122M0968L3999K3776J2203J025q457j5432j9429k0266j8557j6100j4809
63531H52043j4938j5072j4269j3408j3939j6072j8971k2043k5075k7522k8632
63520F42102k8245k6871k5080k3380k2294k1886k1318j9644j6935j4144j2016
$$ y = [731489, 762379, 789724, 811220, 825359, 832298, 833296, 829540, 821840, 811321, 799655, 788098, 776636, 764548, 751585, 737991, 723510, 707106, 688003, 666611, 644178, 621806, 599985, 578813, 558413, 539220, 521867, 506637, 493118, 480751, 469659, 460526, 453737, 449144, 446702, 446654, 448878, 452707, 457733, 464195, 472099, 480461, 488028, 494480, 500438, 506594, 513345, 521022, 529878, 539881, 550921, 563210, 577226, 593481, 612656, 635618, 662868, 694150, 729052, 767626, 809644, 853122, 894090, 928089, 951865, 964068, 965093, 956636, 941204, 921775, 901509, 882952, 866852, 852043, 837105, 822033, 807764, 794356, 780417, 764345, 745374, 723331, 698256, 670734, 642102, 613857, 586986, 561906, 538526, 516232, 494346, 473028, 453384, 436449, 422305, 410289]
63509D10289j0646r894r430q577o881m904l729l687m144m558m903n012m384l026
63495C26514j739j146j020r64j174j927k769k862k012q09J55P62J139J356J518
63480C15022J835K468L360M242M850N091N032M691L894K583J139J65k13n45j441
63465C52173k847m090m545m245l793l750l985l743k576r69J53M93N60Q44J286
63450C20966J717K244K978L710M317N077O261P610Q716R662J0787J1995J2941
63437D08981J3983J6269K0452K5650L0046L2250L1802K8761K3556J7350J1885
63426F60985Q473P152P131P902R721J2966J7458K2511K7435L1801L5328L7771
63414H86634L8823L7948L4400K7777J8746Q969K00o583j1272j4212j5929j7005
$$ y = [410289, 399643, 389749, 380319, 371742, 364861, 359957, 356228, 352541, 348397, 343839, 338936, 333924, 329540, 326514, 324775, 323629, 322609, 321645, 320471, 318544, 315775, 312913, 310901, 310092, 310247, 311009, 312148, 313504, 315022, 316857, 319325, 322685, 326927, 331777, 336868, 341900, 346591, 350485, 353068, 354207, 354372, 354159, 353614, 352173, 349326, 345236, 340691, 336446, 332653, 328903, 324918, 321175, 318599, 317630, 317783, 318276, 318836, 319680, 320966, 322683, 324927, 327905, 331615, 335932, 341009, 347270, 354880, 363596, 373258, 384045, 396040, 408981, 422964, 439233, 459685, 485335, 515381, 547631, 579433, 608194, 631750, 649100, 660985, 669458, 676610, 683741, 691643, 701364, 714330, 731788, 754299, 781734, 813535, 848863, 886634, 925457, 963405, 997805, 1025582, 1044328, 1053297, 1053497, 1046914, 1035642, 1021430, 1005501, 988496]
63402I88496j7795j8280j8378j8415j9080k0798k3347k6110k8558l0443l1679
63391G35613l2171l1737l0184k7613k4601k1855j9565j7305j4710j2037r787p994
63379D86054o251m375k620j123M36K375M486O272P540Q539R602J0938J2668J4733
63365E49274J6753J8273J9308K0536K2766K6194L0148L3601L5970L7435L8426
63354H48684L8796L7716L4462K9126K2432J5094P583L04o373j2159j6650j9220
63342I79795j9564j8312j6778j6040j6527j8332k1321k4854k7907k9829l0654
63331G39677l0620k9836k8566k7245k5780k3376j9589j5177j1336q292n301j909
63319E12650J249K817J519l081r827j6037j9230j9096j7351j5660j4264j2735
$$ y = [988496, 970701, 952421, 934043, 915628, 896548, 875750, 852403, 826293, 797735, 767292, 735613, 703442, 671705, 641521, 613908, 589307, 567452, 547887, 530582, 515872, 503835, 494048, 486054, 479803, 475428, 472808, 471685, 472121, 474496, 478982, 485254, 492794, 501333, 510935, 521873, 534541, 549274, 566027, 584300, 603608, 624144, 646910, 673104, 703252, 736853, 772823, 810258, 848684, 887480, 925196, 959658, 988784, 1011216, 1026310, 1033893, 1034197, 1027824, 1015665, 999015, 979795, 960231, 941919, 925141, 909101, 892574, 874242, 852921, 828067, 800160, 770331, 739677, 709057, 679221, 650655, 623410, 597630, 574254, 554665, 539488, 528152, 519860, 514559, 512650, 513899, 516716, 518235, 515154, 505327, 489290, 470060, 450964, 433613, 417953, 403689, 390954]
63307C90954j1093r589q083o446n169m819n049m900m107l380l278l466l378l066
63293C15131k875k692k130j380j259k177l484m121l786l129k911l189l363k780
63279B75855j296N75J973K337J865J157M75l67j244j455o32M50N90k97j106r69
63263B77911j86N23R79J309J316P65O4n0N20J069J029N74L12O55J528K399K564
63246B93281J850R67P82J234J470J100P15R17J464J837K057K430K860L121L479
63231C19564M311N209N246M296L362L346M056M738N063N174N105M753M247L894
63217C82364L773L746L848M365N373O446O928O442N207L914L266L381L649L235
63203D45937J874J07j218j679j545j436j700k125k223j663m60J095K498L232L259
$$ y = [390954, 379861, 370272, 362189, 355743, 350574, 345755, 340706, 335806, 331699, 328319, 325041, 321575, 318197, 315131, 312256, 309564, 307434, 306054, 304795, 302618, 299134, 295013, 291227, 288098, 285187, 281998, 278635, 275855, 274559, 275134, 277107, 279444, 281309, 282466, 282941, 282574, 281330, 279875, 279243, 279693, 280283, 279986, 278880, 277911, 277725, 278248, 279227, 280536, 281852, 282617, 282681, 282631, 283151, 284220, 285249, 285823, 286135, 286790, 288318, 290717, 293281, 295131, 296098, 296880, 298114, 299584, 300684, 301399, 302316, 303780, 305617, 307674, 310104, 312964, 316085, 319564, 323875, 329084, 334330, 338626, 341988, 345334, 349390, 354128, 359191, 364365, 369470, 374223, 378470, 382364, 386137, 389883, 393731, 398096, 403469, 409915, 416843, 423285, 428492, 432406, 435672, 439053, 442702, 445937, 447811, 447918, 446700, 445021, 443476, 442040, 440340, 438215, 435992, 434329, 433869, 434964, 437462, 440694, 443953]
63188D43953L273M112N800P583Q927J0069J1391J2690J3447J3574J3490J3678
63176E61987J4350J5319J5902J5356J3866J2713J2854J3680J3825J2985J2020
63165G14857J1385J0421Q538O195M087K079l90l331o257r002j1798j4652j7209
63152F94923j9142k0311k0626k0225j9630j9225j8602j7025j4601j2360j0960
63141E02216r893q458o924o108n968n479m053k432j681j749j575n14R32J896K186
63126D52396K293K724L569M558N287N537N493N503N511N146M534M480N396O467
63112E18894O553N647M730M336M101L769L715M170M663M688M366M070L861L702
63098E81265L768M139M595N002N479N935N964N640N736O567P219O723N470M598
$$ y = [443953, 447226, 451338, 457138, 464721, 473648, 483717, 495108, 507798, 521245, 534819, 548309, 561987, 576337, 591656, 607558, 622914, 636780, 649493, 662347, 676027, 689852, 702837, 714857, 726242, 736663, 745201, 751396, 755483, 757562, 757172, 753841, 747584, 738582, 726784, 712132, 694923, 675781, 655470, 634844, 614619, 594989, 575764, 557162, 540137, 525536, 513176, 502216, 492323, 483865, 476941, 470833, 464865, 459386, 455333, 452901, 451220, 449471, 447896, 447382, 448314, 450210, 452396, 454689, 457413, 460982, 465540, 470827, 476364, 481857, 487360, 492871, 498017, 502551, 507031, 512427, 518894, 525447, 531094, 535824, 540160, 544261, 548030, 551745, 555915, 560578, 565266, 569632, 573702, 577563, 581265, 585033, 589172, 593767, 598769, 604248, 610183, 616147, 621787, 627523, 634090, 641309, 648032, 653502, 658100]
63084F58100M334L845K621J009n90k159l589m614n416o533p936q904r074q886
63070F12208q696q164p015n763n123n072n013m484l354j684Q7J263J726K338L936
63055E67190O122P678Q083Q068Q604R924J1567J2973J3804J4065J4126J4449J5143
63042G11796J5838J6051J5519J4294J2721J1438J1059J1651J2520J2730J1827
63031H57444J0158Q543P614P377P218O402M606K098n91l146n586p980j0071j1490
63017H72596j2315j3133j4251j5099j4801j3287j1392r778q293o462m187j639
63005G47959J098L902O441Q588J0759J3388J6218J8627K0498K2326K4362K6200
62993I20366K7371K7937K8234K8271K7708K6384K4681K3336K2858K3066K3227
$$ y = [658100, 662434, 666279, 668900, 669909, 669319, 667160, 663571, 658957, 653541, 647008, 639072, 630168, 621094, 612208, 603512, 595348, 588333, 582570, 577447, 572375, 567362, 562878, 559524, 557840, 557927, 559190, 560916, 563254, 567190, 573312, 580990, 589073, 597141, 605745, 615669, 627236, 640209, 654013, 668078, 682204, 696653, 711796, 727634, 743685, 759204, 773498, 786219, 797657, 808716, 820367, 832887, 845617, 857444, 867602, 876145, 883759, 891136, 898354, 904756, 909362, 911460, 910869, 907723, 902137, 894157, 884086, 872596, 860281, 847148, 832897, 817798, 802997, 789710, 778318, 768540, 760247, 753785, 749598, 747959, 749057, 752959, 759400, 767988, 778747, 792135, 808353, 826980, 847478, 869804, 894166, 920366, 947737, 975674, 1003908, 1032179, 1059887, 1086271, 1110952, 1134288, 1157146, 1180212, 1203439]
62982A203439K2742K1575J9887J7466J3839Q896L034l307r892j6387k2210k6921
62970A232161l0492l3158l5121l6591l7741l8450l8317l7107l5042l2535k9852
62959H47755k7199k4839k2950k1556k0702k0433k0445k0128j9263j8283j7520
62948F14437j6616j5190j3725j3045j3116j3035j2240j1023r832q732p772p196
62936D72915p009o838o572o545o791o579n288l296j506l61K01J10o65j572j775
62921D18429j139l62j4O7K78O01O84K92m27j047j194r92j053j730k534k650j963
62904D05246j063k94N73J669K580K930K906K950L234L729M450N350O237P017P734
62889D55248Q222Q041P118N981N128M459L712K994K460J746L74j437k926l746
$$ y = [1203439, 1226181, 1247756, 1267643, 1285109, 1298948, 1307844, 1310878, 1307571, 1297679, 1281292, 1259082, 1232161, 1201669, 1168511, 1133390, 1096799, 1059058, 1020608, 982291, 945184, 910142, 877607, 847755, 820556, 795717, 772767, 751211, 730509, 710076, 689631, 669503, 650240, 631957, 614437, 597821, 582631, 568906, 555861, 542745, 529710, 517470, 506447, 496615, 487883, 480111, 472915, 465906, 459068, 452496, 445951, 439160, 432581, 427293, 423997, 422491, 422130, 422331, 422441, 421776, 420204, 418429, 417290, 416928, 416914, 416981, 417259, 417860, 418544, 418836, 418409, 417362, 416168, 415176, 414123, 412393, 409859, 407209, 405246, 404183, 403889, 404462, 406131, 408711, 411641, 414547, 417497, 420731, 424460, 428910, 434260, 440497, 447514, 455248, 463470, 471511, 478629, 484610, 489738, 494197, 497909, 500903, 503363, 505109, 505483, 504046, 501120, 497374]
62875D97374m275m948n731o367o762p003p214p493p836q049p902p345o504n545
62861D04400m698m237m155m057l621l021k577k187j615j169j477k416k906k165
62847C64099p74q5o94j852k400j954j101n77n19n86o38r12j486j925j759j104
62831C45733m89j92j25k36n71r18q55l24K04L22J35l1q6r5L1M31J009J437J491
62812C46871J214P96L70K6p2L04J100J752J628Q65M31J047K246K911K603J864
62796C65956J272Q07K29l86p57p14j86Q32K125L316M258N119N986O699P251Q017
62780D09824R265J0724J1929J2784J3487J4030J4265J4344J4696J5409J5973J5898
62768E72628J5341J4796J4253J3052J0743P730M698J731j504m779p336r007j0555
$$ y = [497374, 493099, 488151, 482420, 476053, 469291, 462288, 455074, 447581, 439745, 431696, 423794, 416449, 409945, 404400, 399702, 395465, 391310, 387253, 383632, 380611, 378034, 375847, 374232, 373063, 371586, 369170, 366264, 364099, 363325, 363240, 362546, 360694, 358294, 356340, 355239, 354662, 354143, 353557, 352919, 352007, 350521, 348596, 346837, 345733, 345244, 345052, 344927, 344691, 344120, 343202, 342347, 342023, 342227, 342549, 342684, 342653, 342567, 342472, 342503, 342934, 343943, 345380, 346871, 348085, 348881, 349251, 349277, 349205, 349509, 350609, 352361, 353989, 354854, 355285, 356332, 358578, 361489, 364092, 365956, 367228, 368035, 368264, 367878, 367121, 366407, 366221, 367053, 369178, 372494, 376752, 381871, 387857, 394556, 401807, 409824, 419089, 429813, 441742, 454526, 468013, 482043, 496308, 510652, 525348, 540757, 556730, 572628, 587969, 602765, 617018, 630070, 640813, 648543, 653241, 654972, 653468, 648689, 641353, 632346, 621791]
62755F21791j2415j3890j4277j4148j4564j5433j5756j5268j4679j4230j3311
62744D63820j1737j0295r514q924q095p418p110o482n083l797l678m276m262l331
62730C69818k372j934j618j009k53M06R09J104R22Q53J464K446K868K550K342
62715C78496K895L925M965O078P377Q532R234R763J0632J2006J3745J5640J7409
62702E00697J8838K0189K2007K4319K6520K8357L0464L3426L6858L9937M2492
62691H24104M4981M7550M9655N0553M9846M7616M4280M0084L4589K7067J7638
62680A277963P602j835j0642j9266k7382l4118l9272m3372m6582m8414m8679m7935
62668I18068m6686m4831m2279l9503l6991l4583l1830k8797k5976k3618k1480
$$ y = [621791, 609376, 595486, 581209, 567061, 552497, 537064, 521308, 506040, 491361, 477131, 463820, 452083, 441788, 432274, 423350, 415255, 407837, 400727, 394245, 389162, 385365, 381687, 377411, 373149, 369818, 367446, 365512, 363894, 362885, 362632, 363038, 363947, 365051, 365973, 366826, 368290, 370736, 373604, 376154, 378496, 381391, 385316, 390281, 396359, 403736, 412268, 421502, 431265, 441897, 453903, 467648, 483288, 500697, 519535, 539724, 561731, 586050, 612570, 640927, 671391, 704817, 741675, 781612, 824104, 869085, 916635, 966290, 1016843, 1066689, 1114305, 1158585, 1198669, 1233258, 1260325, 1277963, 1285565, 1283730, 1273088, 1253822, 1226440, 1192322, 1153050, 1109678, 1063096, 1014682, 966003, 918068, 871382, 826551, 784272, 744769, 707778, 673195, 641365, 612568, 586592, 562974, 541494]
62657E41494j9239j6834j4532j2793j1956j1826j1695j0949r622q239p287o884
62645C99638o705o087m608k796j835k177k786k334r16J06j06r76j541j655j756
62630C63466j987k134k169k324k654k924k885k483j775r14j98M9k36p87j183j059
62614C37803l52N78J156J058M28m18j283j968k143j606n73N14J338J702J539J220
62598C38993J525K771M112M376L592L056L739N258O667P664Q501R185R395R034
62584D17868Q335P488O545N575M580L325J638j60j509k366l257m555n984o991
62570D30532p309p074o682o603p039p558p389o342n171m710m826m630l635k300
62556C49264j303p89m93l61n95j136j478j165k87O31J184J412J565J754J853J758
$$ y = [541494, 522255, 505421, 490889, 478096, 466140, 454314, 442619, 431670, 422048, 413809, 406522, 399638, 392933, 386846, 382238, 379442, 377607, 375430, 372644, 370310, 369394, 369500, 369394, 368418, 366877, 365222, 363466, 361479, 359345, 357176, 354852, 352198, 349274, 346389, 343906, 342131, 341217, 341019, 341068, 340832, 340045, 338862, 337803, 337451, 338029, 339185, 340243, 340671, 340253, 338970, 337002, 334859, 333253, 332680, 333194, 334532, 336234, 337773, 338993, 340518, 343289, 347401, 351777, 355369, 358425, 362164, 367422, 374089, 381753, 390254, 399439, 408834, 417868, 426203, 433691, 440236, 445811, 450391, 453716, 455354, 455194, 453685, 451319, 448062, 443507, 437523, 430532, 423223, 416149, 409467, 402864, 395825, 388267, 380878, 374536, 369365, 364655, 359829, 355199, 351564, 349264, 347961, 347172, 346679, 346318, 345723, 344587, 343109, 341944, 341657, 342288, 343472, 344884, 346449, 348203, 350056, 351814]
62540C51814J555J390J230R15M63J64K32M73M77J19l09m57j99M73J574K990M345
62523C67249N238N633N889O472P601R121J0647J1940J3184J4801J6932J9250K1294
62510E15251K2854K4059K5328K7213K9853L2421L3552L2652L0444K7913K5110
62499H26650K1516J7148J2644Q441M598J414n93j471j923k343k245r89J403M417
62485H88667P583J0553J3040J5021J6681J7837J7674J5425J1232O155J506j936
62473A019438m536p857j3430k1018k8497l3824l6802l8529l9722m0251l9930l8857
62461F76185l6981l4101l0434k6663k3224k0012j6872j3975j1498r378p565o234
62449D39248n452m822l810k325q01L45J168K028L078M077M741N094N348N560N631
$$ y = [351814, 353369, 354759, 355989, 356904, 357367, 357531, 357763, 358236, 358713, 358832, 358523, 358066, 357867, 358340, 359914, 362904, 367249, 372487, 378120, 384009, 390481, 398082, 407203, 417850, 429790, 442974, 457775, 474707, 493957, 515251, 538105, 562164, 587492, 614705, 644558, 676979, 710531, 743183, 773627, 801540, 826650, 848166, 865314, 877958, 886399, 890997, 892411, 891818, 890347, 888424, 886081, 883836, 882847, 884250, 888667, 896250, 906803, 919843, 934864, 951545, 969382, 987056, 1002481, 1013713, 1019868, 1021374, 1019438, 1014902, 1007045, 993615, 972597, 944100, 910276, 873474, 834945, 795223, 754972, 715042, 676185, 639204, 605103, 574669, 548006, 524782, 504770, 487898, 473923, 462425, 453047, 445482, 439248, 433796, 428974, 425164, 422839, 422038, 422383, 423551, 425579, 428657, 432734, 437475, 442569, 447917, 453477, 459108]
62434D59108N561N352M750L453J576m48k431m396o000o610o234n771n891o199
62420D35820n993n370n004n107n210m821l840k560j605j607k497l398l574l136
62406C82098k481j628o87l58j053j937j819p75J31N59J162K176K908K918K658
62391C83872K524K250J662J260J469K026K591L360M508N605O211O544P054P643
62377D38579P904P795P613P533P520P545P589P705Q204R461J1328J3225J5003
62364E57004J7175K0000K2947K5547K8275L2014L6963M2519M7941N2707N6531
62353I39623N9384O1194O1278N8562N2768M4856L5878K6014J5410N225l125r525
62341A347542j5027k0365k5367k9764l3650l7030l9572m1006m1289m0341l8166
$$ y = [459108, 464669, 470021, 474771, 478224, 479800, 479352, 476921, 472525, 466525, 459915, 453681, 447910, 442019, 435820, 429827, 424457, 419453, 414346, 409136, 404315, 400475, 397915, 396310, 394703, 392206, 388808, 385234, 382098, 379617, 377989, 377302, 376944, 375891, 373954, 372135, 371360, 371491, 372050, 373212, 375388, 378296, 381214, 383872, 386396, 388646, 390308, 391568, 393037, 395063, 397654, 401014, 405522, 411127, 417338, 423882, 430936, 438579, 446483, 454278, 461891, 469424, 476944, 484489, 492078, 499783, 507987, 517448, 528776, 542001, 557004, 574179, 594179, 617126, 642673, 670948, 702962, 739925, 782444, 830385, 883092, 939623, 999007, 1060201, 1121479, 1180041, 1232809, 1277665, 1313543, 1339557, 1354967, 1360192, 1357067, 1347542, 1332515, 1312150, 1286783, 1257019, 1223369, 1186339, 1146767, 1105761, 1064472, 1024131, 985965]
62330I85965l5249l2362k9863k7563k5219k2808k0430j8434j7432j7650j8409
62319G20546j8817j8823j8871j8772j7879j6321j5076j4491j3742j2216j0517
62308E45021r503r003q235o991n670m503l407k445j782j272n39M64J381J904K036
62293D97456J970J944K141K556K968L152L024K564J889J418J592K201K402J704
62279E28981O44J59N61J464K382L042L321L393L768M778O141P305Q133Q895R828
62264E92795J1163J3433J7082K1800K6680L1138L5312L9568M4109M9032N4260
62253I36372N9110O2414O3290O1670N7899N2170M4445L4774K3606J1993J402p135
62241A402010j3892k0090k6572l3155l9243m4498m8591n0936n1224m9940m7867
$$ y = [985965, 950716, 918354, 888491, 860928, 835709, 812901, 792471, 774037, 756605, 738955, 720546, 701729, 682906, 664035, 645263, 627384, 611063, 595987, 581496, 567754, 555538, 545021, 535518, 526515, 518280, 511289, 505619, 501116, 497709, 495264, 493482, 492210, 491671, 492135, 493516, 495420, 497456, 499426, 501370, 503511, 506067, 509035, 512187, 515211, 517775, 519664, 521082, 522674, 524875, 527277, 528981, 529625, 529784, 530345, 531809, 534191, 537233, 540554, 543947, 547715, 552493, 558634, 565939, 574072, 582967, 592795, 603958, 617391, 634473, 656273, 682953, 714091, 749403, 788971, 833080, 882112, 936372, 995482, 1057896, 1121186, 1182856, 1240755, 1292925, 1337370, 1372144, 1395750, 1407743, 1409145, 1402010, 1388118, 1368028, 1341456, 1308301, 1269058, 1224560, 1175969, 1125033, 1073809, 1023869, 976002]
62230I76002m5255m1905l7805l3268k8641k4251k0450j7258j4166j0785p536n141
62218F89541l568k160p90j59o67j666k272k443k773l470m065m114l778l654m189
62203F49773n298o460p145p153o582n622m529l591k829j802j56J725L062L707
62189F07100M270N162O076O704P351Q346R372R924J0106J0359J0662J0588R955
62176G15975Q871P362N649M617N267P618J0773J4114J7739K1610K5234K8604L2665
62163I06098L8003M3545M7333M8350M6864M3219L7232K9051J9793J0847K876m157
62151A269054j0373j5768k0421k4424k7742l0443l2893l5265l6979l7121l5570
62140I62055l3185l0774k8327k5520k2430j9312j6134j2911j0226q700q105p621
$$ y = [976002, 930747, 888842, 851037, 817769, 789128, 764877, 744427, 727169, 713003, 702218, 694682, 689541, 685973, 683813, 683023, 682864, 682197, 680531, 678259, 675816, 673043, 669573, 665508, 661394, 657616, 653962, 649773, 644475, 638015, 630870, 623717, 617135, 611513, 606984, 603393, 600564, 598762, 598606, 600331, 603393, 607100, 611370, 616532, 622608, 629312, 636663, 645009, 654381, 664305, 674411, 684770, 695432, 706020, 715975, 724846, 732208, 737857, 742474, 747741, 755359, 766132, 780246, 797985, 819595, 844829, 873433, 906098, 944101, 987646, 1034979, 1083329, 1130193, 1173412, 1210644, 1239695, 1259488, 1270335, 1273211, 1269054, 1258681, 1242913, 1222492, 1198068, 1170326, 1139883, 1106990, 1071725, 1034746, 997625, 962055, 928870, 898096, 869769, 844249, 821819, 802507, 786373, 773462, 763236, 754536, 746431, 738810]
62128G38810o947o499o491o616o729p075p474p073n465l507k348j991j375L48
62114F69568L118O253Q942J0686J1776J3159J5335J7464J7973J5937J1693O427
62102H08331J636j385k160j208O86K969M853M992K550j643n836r066j1340j2411
62088G80968j1594q976n773k975l94K497N507Q009R879J1515J3257J5109J6925
62075H33954J8616K0265K2043K3816K4987K5218K5154K5815K7259K8552K9146
62064A104825K9542L0322L1254L1665L1076K9082K5333K0081J4198Q192J723n359
62052A351934j2095j7182k0414k2753k5227k8241l1708l5227l8176m0016m0618
62041A040277m0182l9056l7697l6474l5256l3553l1236k8765k6518k4342k2110
$$ y = [738810, 731863, 725364, 718873, 712257, 705528, 698453, 690979, 683906, 678441, 674934, 672586, 670595, 669220, 669568, 672686, 678939, 687881, 698567, 710343, 723502, 738837, 756301, 774274, 790211, 801904, 808331, 809967, 808582, 806422, 805214, 805900, 808869, 813722, 818714, 821264, 819621, 813785, 804719, 793379, 780968, 769374, 760398, 754625, 751650, 751256, 753753, 759260, 767269, 777148, 788663, 801920, 817029, 833954, 852570, 872835, 894878, 918694, 943681, 968899, 994053, 1019868, 1047127, 1075679, 1104825, 1134367, 1164689, 1195943, 1227608, 1258684, 1287766, 1313099, 1333180, 1347378, 1355570, 1357293, 1351934, 1339839, 1322657, 1302243, 1279490, 1254263, 1226022, 1194314, 1159087, 1120911, 1080895, 1040277, 1000095, 961039, 923342, 886868, 851612, 818059, 786823, 758058, 731540, 707198, 685088]
62030F85088k0152j8720j7418j5659j3402j1113r210p934p383p348p400p395p546
62017E34408p761p523o740o096o059o154n824n451n673o110n704m126k087k50
62003D58850J372K911M172M863M967M823M969N717O662O897O066M840L965L326
61989E24400K413J218mj421l250m987n813n748n648o080o793p222o952n801m103
61974D64209k771k505k922l113k859k639k622k485k160j947j760j115j9Q47J055
61959D37194Q93P09M78K64M20R85J378J153O88P75J740L206M491N149N358N865
61943D70746P362R815J2537J4841J6414J7233J7539J7762J8165J8613J8909J9053
61931F58989J8921J8122J6662J5202J4077J2570J0002P025M763K968L24l485p266
$$ y = [685088, 664936, 646216, 628798, 613139, 599737, 588624, 579414, 571480, 564097, 556749, 549349, 541954, 534408, 526647, 519124, 512384, 506288, 500229, 494075, 488251, 482800, 477127, 471017, 465313, 461187, 459100, 458850, 460222, 463133, 467305, 472168, 477135, 481958, 486927, 492644, 499306, 506203, 512269, 517109, 521074, 524400, 526813, 528031, 528027, 526606, 523356, 518369, 512556, 506808, 501160, 495080, 488287, 481065, 474113, 468312, 464209, 461438, 458933, 456011, 452898, 450039, 447400, 444778, 442293, 440133, 438186, 436426, 435311, 435292, 436139, 437194, 438087, 438796, 439274, 439538, 439958, 440943, 442321, 443474, 444162, 444937, 446677, 449883, 454374, 459523, 464881, 470746, 478108, 487923, 500460, 515301, 531715, 548948, 566487, 584249, 602414, 621027, 639936, 658989, 677910, 696032, 712694, 727896, 741973, 754543, 764545, 771570, 776333, 779301, 779625, 776140, 768874]
61918G68874r950j1595j2436j2231j0984r325p544n111j670K266O114R817J3127
61905G19352J5177J5575J5131J4738J4024J1961Q429M349N52k818n978r093j2088
61892G89311j4534j5884j6174j6041j5892j5494j4650j3682j2828j1773j0368
61881F31991r273r164r767j0253j0346j0365j0459j0413j0031r254q089o818n956
61868E11803n493m575k523J25K212L409M338N504O801Q162R828J1856J3902J5832
61854E81181J8126K1265K4926K8073K9937L0850L1900L3680L5461L6027L5107
61843I06533L3529L1811K9371K5493K0472J5118R619L649k532p883j1612j3893
61831A039675j5392j6319j6125j4006r818m525M22M326P546J0513J2853J3823
$$ y = [768874, 758924, 747329, 734893, 722662, 711678, 702353, 694809, 689698, 688028, 690294, 696408, 706225, 719352, 734529, 750104, 765235, 779973, 793997, 805958, 814387, 818736, 819288, 816470, 810492, 801399, 789311, 774777, 758893, 742719, 726678, 710786, 695292, 680642, 666960, 654132, 642359, 631991, 622718, 613554, 603787, 593534, 583188, 572823, 562364, 551951, 541920, 532666, 524577, 517759, 511803, 506310, 501735, 499212, 499337, 501549, 504958, 509296, 514800, 521601, 529763, 539591, 551447, 565349, 581181, 599307, 620572, 645498, 673571, 703508, 734358, 766258, 799938, 835399, 871426, 906533, 940062, 971873, 1001244, 1026737, 1047209, 1062327, 1071946, 1075595, 1073063, 1065180, 1053568, 1039675, 1024283, 1007964, 991839, 977833, 968015, 963490, 963912, 968238, 975784, 986297, 999150, 1012973]
61819A012973J3118J0800O834J312n067j1373j7149k2281k6450k9325l1203l2744
61807H69445l3967l4163l2935l0763k8327k5777k3014k0301j8130j6592j5211
61796E90265j3538j1637r908q490p109n625m417l936l947l727l037k361k035j689
61782E08809r90l62l71p43o39J30Q05O72j19p97p51M2J055J639J585J362J619
61765E12946K434L289L702L777L999M638N445N948O037O052O194O071N127L390
61751E79049J419l78j904k982l479l811m581n491n507m430l477l699m483m473
61737E31773l384k086j276r13p56p25p21o92p76r20o43L44J524K234K570L006
61721E28559L413L324K969L086L659L760K909J745J093R30O96J44m56p99r54j373
$$ y = [1012973, 1026091, 1036891, 1043725, 1045037, 1039970, 1028597, 1011448, 989167, 962717, 933392, 902189, 869445, 835478, 801315, 768380, 737617, 709290, 683513, 660499, 640198, 622068, 605476, 590265, 576727, 565090, 555182, 546692, 539583, 533958, 529541, 525605, 521658, 517931, 514894, 512533, 510498, 508809, 507819, 507457, 507086, 506343, 505704, 505834, 506639, 507311, 507192, 506395, 505644, 505686, 506741, 508380, 509965, 511327, 512946, 515380, 518669, 522371, 526148, 530147, 534785, 540230, 546178, 552215, 558267, 564461, 570532, 575659, 579049, 580468, 580090, 578186, 575204, 571725, 567914, 563333, 557842, 552335, 547905, 544428, 540729, 536246, 531773, 528389, 526303, 525027, 524114, 523358, 522633, 521912, 521220, 520444, 519524, 518881, 519225, 520749, 522983, 525553, 528559, 531972, 535296, 538265, 541351, 545010, 548770, 551679, 553424, 554517, 555447, 556143, 556287, 555831, 555032, 554078, 552705]
61705E52705k329l318l373k376j552k034l289l875l476l128l452l794l454k675
61691E10580k005j486j096j159j710k036j644j084j168j741k015j775j529j547
61677D88585j558j414j406j740k194k461k440k134j596j171j281j843k232k110
61663D63005j923k180k528k187j183m73o50j124j060n89m66p91q91m07K31O42
61647D47426J088J860K658L072L245L569L975M061L735L262K803K238J439L59
61633D84790r55k208k932k992k832k925l214l392l413l307k861k027j382j599
61619D48751k452k911k232o32R98J741J177k55j514k015k281l154m559n614n832
61604D19216n648n624n754n700n363m997m927n158n241m652l507k616k583l116
$$ y = [552705, 550376, 547058, 543685, 541309, 539757, 537723, 534434, 530559, 527083, 523955, 520503, 516709, 513255, 510580, 508575, 507089, 505993, 504834, 503124, 501088, 499444, 498360, 497192, 495451, 493436, 491661, 490132, 488585, 487027, 485613, 484207, 482467, 480273, 477812, 475372, 473238, 471642, 470471, 469190, 467347, 465115, 463005, 461082, 458902, 456374, 454187, 453004, 452531, 451881, 450757, 449697, 449108, 448642, 447851, 446960, 446553, 446784, 447426, 448514, 450374, 453032, 456104, 459349, 462918, 466893, 470954, 474689, 477951, 480754, 482992, 484431, 484790, 483835, 481627, 478695, 475703, 472871, 469946, 466732, 463340, 459927, 456620, 453759, 451732, 450350, 448751, 446299, 443388, 441156, 440524, 441522, 443263, 444440, 444185, 442671, 440656, 438375, 435221, 430662, 425048, 419216, 413568, 407944, 402190, 396490, 391127, 386130, 381203, 376045, 370804, 366152, 362645, 360029, 357446, 354330]
61590C54330l491l347k692j640o45n10j499k758l282l082k700k123j093j48j25
61575C25195p68r73n38m55j220j908j538m44L20L24r8n45q14q26o50m56k19K88
61557C14675J088J807K009J498M43n11n27N14J659J994J759J675J562P31n13r72
61541C28891k91O38J144J469J685J256K42k98K03R88J343J729K649L361K929J777
61525C49715J050Q88M63n77j748k650l274l476k994k067j343j090j025r08p80
61510C30184o48l54J85Q76J535J864J642J122R24J261J595J420R46O21M19J46
61494C43738L2L91R43J067N99p0n78q16p32l45J36N95J162J855K268K054J471
61477C53770J067R92J050J143J261J170N89l33j059j136n40L47R88J079Q08M89
$$ y = [354330, 350839, 347492, 344800, 343160, 342515, 342005, 340506, 337748, 334466, 331384, 328684, 326561, 325468, 325320, 325195, 324427, 323454, 322916, 322461, 321241, 319333, 317795, 317351, 317671, 317995, 317897, 317352, 316538, 315712, 315062, 314606, 314387, 314675, 315763, 317570, 319579, 321077, 321520, 321009, 320482, 320996, 322655, 324649, 326408, 328083, 329645, 330376, 329863, 328891, 328600, 329238, 330382, 331851, 333536, 334792, 335034, 334736, 334939, 335927, 337270, 338999, 341648, 345009, 347938, 349715, 350765, 351653, 352116, 351539, 349791, 347141, 343867, 340391, 337397, 335330, 333987, 332897, 331872, 330964, 330184, 329536, 329182, 329367, 330243, 331778, 333642, 335284, 336406, 337330, 338591, 340186, 341606, 342552, 343173, 343592, 343738, 343770, 344161, 345104, 346171, 346770, 346700, 346122, 345306, 344574, 344229, 344365, 344960, 346122, 347977, 350245, 352299, 353770, 354837, 355829, 356879, 358022, 359283, 360453, 361042, 360709, 359650, 358514, 357974, 358321, 359309, 360388, 361196, 361685]
61461C61685L1p87j558j500o52K9J6p6L40Q62R55R18J159J232O28k9K44J194J674
61442C66365J437J361J875K340K252K078K387L000L444L675L880L985L790L351
61428D05220K896K578K418K351K170J743J289J263J909L007M066M592M305L335
61414D43142K071P72m73j295j127j08N57j65j833l053l131k584k134j958j949
61399D26732k077k245k234j936j451r19n32n94j133j636j573j067o19l26R2N41
61383D09023M90j76q07o77K49J447K395K914L094L079K873K452K092K203K669
61368D33320K788K222J597J627K061K146J863J864K336K675K415J850J551J835
61354D62150K718L951N000N477N716O426P779R265J0431J1243J1685J1503J0483
$$ y = [361685, 361716, 360929, 359371, 357871, 357219, 357248, 357264, 357188, 357528, 358390, 359345, 360263, 361422, 362654, 363282, 363253, 363497, 364691, 366365, 367802, 369163, 371038, 373378, 375630, 377708, 380095, 383095, 386539, 390214, 394094, 398079, 401869, 405220, 408116, 410694, 413112, 415463, 417633, 419376, 420665, 421928, 423837, 426844, 430910, 435502, 439807, 443142, 445213, 445985, 445512, 444217, 443090, 442982, 443539, 443374, 441541, 438488, 435357, 432773, 430639, 428681, 426732, 424655, 422410, 420176, 418240, 416789, 415870, 415338, 414744, 413611, 411975, 410402, 409335, 408716, 408390, 408482, 409023, 409513, 409337, 408530, 407853, 408102, 409549, 411944, 414858, 417952, 421031, 423904, 426356, 428448, 430651, 433320, 436108, 438330, 439927, 441554, 443615, 445761, 447624, 449488, 451824, 454499, 456914, 458764, 460315, 462150, 464868, 468819, 473819, 479296, 485012, 491438, 499217, 508482, 518913, 530156, 541841, 553344, 563827]
61341E63827Q701O442M198K655K117K051J610O10m93j454k439l400l957l990l821
61326E72657l660l378k923k431j816q52K32P74N70K03L36J033J984K913L609L912
61310E73163L911L874L989M430N514P260Q927R721R920J0542J1738J2403J1578
61297F76970R500O850L828N24k484m664o227p728r201j0263j0835j1183j1355
61284F23732j1045j0012q393o653n342m707m436l966l146k268j403j91J445K905
61270E66520L591L666L765M248N056N968O628O652O152N945O761Q464J0431J2493
61256F56340J4809J6943J7800J6813J4703J2610J0750Q401N111J414j822m322
61244G69550o271p569p825p201o625o808p417p651p266o562n646m429l222k722
$$ y = [563827, 572528, 578970, 583168, 585823, 587940, 589991, 591601, 592211, 591718, 590264, 587825, 584425, 580468, 576478, 572657, 568997, 565619, 562696, 560265, 558449, 557597, 557829, 558603, 559173, 559376, 559712, 560745, 562729, 565642, 569251, 573163, 577074, 580948, 584937, 589367, 594881, 602141, 611068, 620789, 630709, 641251, 652989, 665392, 676970, 686470, 693320, 697148, 697672, 695188, 690524, 684297, 676569, 667368, 657105, 646270, 635087, 623732, 612687, 602675, 594282, 587629, 582287, 577580, 573144, 569178, 566032, 563764, 562361, 562170, 563615, 566520, 570111, 573777, 577542, 581790, 586846, 592814, 599442, 606094, 612246, 618191, 624952, 633416, 643847, 656340, 671149, 688092, 705892, 722705, 737408, 750018, 760768, 769169, 774280, 775694, 773872, 769550, 763279, 755710, 747885, 740684, 734059, 727251, 719834, 712183, 704917, 698355, 692709, 688280, 685058, 682336]
61230F82336l180m071m677m623l811k329n86Q93J999L084M320N345N740N532N043
61215F91015M502L964L416K843K343K108K178K275K127J828J544J127M67J6M09
61200G22162J524K601L271L974N197O920Q885J0911J2720J4056J5097J6209J7117
61187H40644J6960J5377J2968J0343P394L938N55j869l092l651m154m843n630
61174H84940o340p011q093r944j2098j3473j3580j3068j2823j2987j3259j3653
61162G48611j4335j4966j4835j3722j2236j1129j0473r632q045n979m295l403
61150F25561k717j505P7J343K231L356M816N765N375L766J670l35k042l496m880
61135F38985o095o476n419l378j551m25O46K191L791M889N709O797Q243R878J1775
$$ y = [682336, 679156, 675085, 670408, 665785, 661974, 659645, 659059, 659952, 661951, 665035, 669355, 674700, 680440, 685972, 691015, 695517, 699481, 702897, 705740, 708083, 710191, 712369, 714644, 716771, 718599, 720143, 721270, 721737, 721753, 722162, 723686, 726287, 729558, 733532, 738729, 745649, 754534, 765445, 778165, 792221, 807318, 823527, 840644, 857604, 872981, 885949, 896292, 903686, 907624, 908179, 906310, 903218, 899567, 895413, 890570, 884940, 878600, 871589, 863496, 853552, 841454, 827981, 814401, 801333, 788510, 775523, 762264, 748611, 734276, 719310, 704475, 690753, 678517, 667388, 656915, 647283, 639238, 633259, 628964, 625561, 622844, 621339, 621416, 622759, 624990, 628346, 633162, 638927, 644302, 648068, 649738, 649403, 647361, 643865, 638985, 632890, 626414, 620995, 617617, 616066, 615641, 616287, 618478, 622269, 627158, 632867, 639664, 647907, 657785, 669560]
61120F69560J3943J5977J7478J8484J9160J9515J9757K0342K1208K1609K1113
61109H78146K0250J9511J8468J6569J4312J2643J1553J0120P853N209K805P22
61097A018161j352l825p020j0910j4953j8509k1315k3288k4212k3958k2870k1563
61085H24386k0466j9722j9258j8737j7735j6236j4601j2894j0771q353o475n573
61073F53565m905l566j801n83k71l81m30k63K53J181K217L040L824M891O021O717
61057F69509P013P468Q316R191R705R995J0566J1853J3772J5704J6997J7661J8254
61044H26004J9089K0031K1103K2567K4211K5313K5701K6128K7068K7961K8155
61033A093331K7945K7940K8181K8549K9332L0676L2125L3481L5369L8156M1186
$$ y = [669560, 683503, 699480, 716958, 735442, 754602, 774117, 793874, 814216, 835424, 857033, 878146, 898396, 917907, 936375, 952944, 967256, 979899, 991452, 1001572, 1009425, 1014634, 1017439, 1018161, 1016809, 1012984, 1005964, 995054, 980101, 961592, 940277, 916989, 892777, 868819, 845949, 824386, 803920, 784198, 764940, 746203, 728468, 712232, 697631, 684737, 673966, 665613, 659138, 653565, 648660, 645094, 643293, 642710, 642439, 642058, 641628, 641365, 641618, 642799, 645016, 648056, 651880, 656771, 662792, 669509, 676522, 683990, 692306, 701497, 711202, 721197, 731763, 743616, 757388, 773092, 790089, 807750, 826004, 845093, 865124, 886227, 908794, 933005, 958318, 984019, 1010147, 1037215, 1065176, 1093331, 1121276, 1149216, 1177397, 1205946, 1235278, 1265954, 1298079, 1331560, 1366929, 1405085, 1446271]
61022A446271M3984M7309N1879N6825O0631O2888O3999O4135O3979O5684P1189
61011B098773Q0161R1169J04179J19905J37203J53619J68609J84283K03229K27919
61001C569049K62159L10297L74460M54980N53939O75541Q23089J000162J216760
60992I240436J490331J837296K263756K757793L270002L683604L817045L503231
60984C1863494K715143J631253N63456k04719n38637m58139p9180M19703Q01998
60975C6714372Q21680L41348n66563j643366k589050l210941l471160l436346
60967B2959974l205199k866995k489415k116539j771780j465878j203612r84736
60959F855820q04111o55575n35486m41358l68994l13146k69858k36351k09482
$$ y = [1446271, 1490255, 1537564, 1589443, 1646268, 1706899, 1769787, 1833786, 1897921, 1961900, 2027584, 2098773, 2178934, 2270103, 2374282, 2494187, 2631390, 2785009, 2953618, 3137901, 3341130, 3569049, 3831208, 4141505, 4515965, 4970945, 5524884, 6200425, 7023514, 8023676, 9240436, 10730767, 12568063, 14831819, 17589612, 20859614, 24543218, 28360263, 31863494, 34578637, 36209890, 36773346, 36568627, 36029990, 35571851, 35492671, 35912374, 36714372, 37536052, 37877400, 37310837, 35667471, 33078421, 29867480, 26396320, 22959974, 19754775, 16887780, 14398365, 12281826, 10510046, 9044168, 7840556, 6855820, 6051709, 5396134, 4860648, 4419290, 4050296, 3737150, 3467292, 3230941, 3021459]
60950C021459j86372j66080j48893j34087j19940j05799r2652q1405p1987o4480
60940A849764n9798n8399n9121o0035o0072n9194n7466n4689n0860m6390m1777
60929A241963l7302l3013k8729k4141j9217j4429j0320o820l395K10L715O888
60917A075410R928J3009J5783J7765J9046K0237K1656K2938K3406K2664K0769
60906A282611J7949J4287R669M128j832p505j2704j7803k2875k7110k9616l0536
60894A178663l0859l1211l1351l0866k9820k8578k7361k6195k4935k3301k1211
60883H72975j9100j7579j6676j5773j4466j3071j2145j1837j1876j1931j1782
60872G16739j1370j0870j0501j0271j0056r925j0056j0341j0468j0362j0185r871
$$ y = [3021459, 2835087, 2669007, 2520114, 2386027, 2266087, 2160288, 2067636, 1986231, 1914244, 1849764, 1789966, 1731567, 1672446, 1612411, 1552339, 1493145, 1435679, 1380990, 1330130, 1283740, 1241963, 1204661, 1171648, 1142919, 1118778, 1099561, 1085132, 1074812, 1067992, 1064597, 1064807, 1068522, 1075410, 1085338, 1098347, 1114130, 1131895, 1150941, 1171178, 1192834, 1215772, 1239178, 1261842, 1282611, 1300560, 1314847, 1324516, 1328644, 1326812, 1319307, 1306603, 1288800, 1265925, 1238815, 1209199, 1178663, 1147804, 1116593, 1085242, 1054376, 1024556, 995978, 968617, 942422, 917487, 894186, 872975, 853875, 836296, 819620, 803847, 789381, 776310, 764165, 752328, 740452, 728521, 716739, 705369, 694499, 683998, 673727, 663671, 653746, 643690, 633349, 622881, 612519, 602334, 592463]
60860E92463r183q308p780p661p363o543n645n188n060m886m673m581m469m112
60846E07011l616l144k509j544o00k51o09j352k292l508m988o429p396p513o663
60831D54597n210l811k815k051j289n57K35J460L145M609N250N361N621O035O018
60816D76598N372M504L716K900J984J178O39L33K77M44M53j37j136j805j831j718
60800D91771j965k354k376k039j745j665j673j809k367l386m404m931m985n005
60786D51067n266n585n663n540n587n986o443o494o076n507m988m323l313k261
60772C78035j702j675j642j302j124j554k007j322O21K531L344L548M251N457
60758C85459O140N834N195M975N266N931O887P679P524O301M899M176M057M047
$$ y = [592463, 583280, 574972, 567192, 559531, 552168, 545625, 539980, 534792, 529732, 524846, 520173, 515592, 511123, 507011, 503395, 500251, 497742, 496198, 495598, 495347, 494738, 493386, 491094, 487586, 482598, 476169, 468773, 461260, 454597, 449387, 445576, 442761, 440710, 439421, 438864, 439099, 440559, 443704, 448313, 453563, 458924, 464545, 470580, 476598, 481970, 486474, 490190, 493090, 495074, 496252, 496891, 497224, 497501, 497945, 498398, 498261, 497125, 495320, 493489, 491771, 489806, 487452, 485076, 483037, 481292, 479627, 477954, 476145, 473778, 470392, 465988, 461057, 456072, 451067, 445801, 440216, 434553, 429013, 423426, 417440, 410997, 404503, 398427, 392920, 387932, 383609, 380296, 378035, 376333, 374658, 373016, 371714, 370590, 369036, 367029, 365707, 366328, 368859, 372203, 375751, 380002, 385459, 391599, 397433, 402628, 407603, 412869, 418800, 425687, 433366, 440890, 447191, 452090, 456266, 460323, 464370]
60744D64370M008L914L342J880k61k573m841o940q492r264r626r982j0017r189
60730D06329p686o297n481n143n132n276n107m259l057k101j471j005j048j949
60716C51317k942k692j196l6k92j226j566j182p40m88k70j97l98m65l9M17K64
60699C38269r5L21J532K457K451K034J847J753J507J507K218L300L983M099M111
60684C71294M337M676N041N533O173O848P558Q394R245R888J0250J0337R959Q946
60670D78479P565O292N154L791K153N75r72k993n476p443q028p581p079o856o487
60655D51094n746m893m128l328k499j938j802j866j758j222k44P18Q25l64k281
60640D20568l892m813n312n455m949l885k891k387k224k190k172j743m64J149
$$ y = [464370, 468378, 472292, 475634, 477514, 477253, 474680, 469839, 462899, 454407, 445143, 435517, 425535, 415518, 406329, 398643, 392346, 386865, 381722, 376590, 371314, 366207, 361948, 358891, 356790, 355319, 354314, 353266, 351317, 348375, 345683, 344487, 344451, 344159, 342933, 341367, 340185, 339445, 338957, 338687, 338490, 338092, 337627, 337588, 338005, 338269, 338174, 338495, 340027, 342484, 344935, 346969, 348816, 350569, 352076, 353583, 355801, 359101, 363084, 367183, 371294, 375631, 380307, 385348, 390881, 397054, 403902, 411460, 419854, 429099, 438987, 449237, 459574, 469533, 478479, 486044, 492336, 497490, 501281, 503434, 504009, 503037, 500044, 494568, 487125, 479097, 471516, 464437, 457581, 451094, 445348, 440455, 436327, 432999, 430500, 428562, 426760, 424894, 423136, 421914, 421670, 422388, 423213, 422849, 420568, 416676, 411863, 406551, 401096, 396147, 392262, 389371, 386984, 384760, 382570, 380398, 378655, 378191, 379340]
60626C79340J793J051N2r4L23N07O91J592K863L324K651J710J081L03r36j869
60610C94382j551k23R34J145O72K63M11J107J880K047J261n3r40q28r0M36L82
60593D01235J59K97Q47J570K444L580M667N017M267K857J580Q38M49O4l51m16
60577D29104K24J355K269K572K664L074L666M037M470N699P722R762J1477J3364
60563E01459J5651J7730J9238K0790K2879K4721K5029K3403K0123J5181Q611J542
60551G16357m352q445j1374j3579j4579j3884j1805q993n863k769oK655N884R829
60537F39076J3790J7335K1146K6194L2395L8721M4320M8804N1426N0806M5970
60526A029983L7429K6795J5477M091o820j6121k2613k6146k7632k7859k6806k4405
$$ y = [379340, 381133, 382184, 382236, 382142, 382465, 382972, 383663, 385255, 388118, 391442, 394093, 395803, 396884, 397187, 396251, 394382, 392831, 392608, 393542, 394687, 395359, 395622, 396033, 397140, 399020, 401067, 402328, 402275, 401335, 400507, 400417, 400853, 401235, 401394, 401691, 402538, 404108, 406552, 410132, 414799, 419816, 424083, 426940, 428520, 429358, 429807, 429871, 429520, 429104, 429328, 430683, 432952, 435524, 438188, 441262, 444928, 448965, 453435, 459134, 466856, 476618, 488095, 501459, 517110, 534840, 554078, 574868, 597747, 622468, 647497, 670900, 691023, 706204, 714815, 716357, 712005, 703560, 692186, 678607, 664028, 650144, 638339, 629346, 623483, 620714, 620708, 623363, 629247, 639076, 652866, 670201, 691347, 717541, 749936, 788657, 832977, 881781, 933207, 984013, 1029983, 1067412, 1094207, 1109684, 1113775, 1106955, 1090834, 1068221, 1042075, 1014443, 986584, 959778, 935373]
60514I35373k1478j9238j7988j6836j4823j1918q834o150l837j450J321M332P171
60501H25645R769J2676J6677K2141K8840L6247M4013N2317O1703P2245Q2741R1265
60489A356279R6753R9609J00418R8698R3596Q5422P5536O4802N2938L9422K4274
60478B187747P690j0335k9556m9040o7604q4336r8465j09031j15147j16509j13471
60467A401943j06820r7686q7462p7416o8255o0122n2907m6449m0559l5077l0054
60456F99136k5725k2258j9439j6832j4282j2141j0752r786q513o799n394n021
60444E42194n479n939n842n218m370l607l143k968k874k788k810k783k221j021
60430D91131J57O29M74J67k52r90j834k306k449k753l368l944m198m104l566k536
$$ y = [935373, 913895, 894657, 876669, 859833, 845010, 833092, 824258, 818108, 814271, 812821, 814142, 818474, 825645, 835414, 848090, 864767, 886908, 915748, 951995, 996008, 1048325, 1110028, 1182273, 1265014, 1356279, 1453032, 1552641, 1653059, 1751757, 1845353, 1930775, 2006311, 2071113, 2124051, 2163473, 2187747, 2195437, 2185102, 2155546, 2106506, 2038902, 1954566, 1856101, 1747070, 1631923, 1515414, 1401943, 1295123, 1197437, 1109975, 1032559, 964304, 904182, 851275, 804826, 764267, 729190, 699136, 673411, 651153, 631714, 614882, 600600, 588459, 577707, 567921, 559408, 552609, 547215, 542194, 536715, 530776, 524934, 519716, 515346, 511739, 508596, 505628, 502754, 499966, 497156, 494373, 492152, 491131, 491288, 491917, 492391, 492558, 492306, 491316, 489482, 487176, 484727, 481974, 478606, 474662, 470464, 466360, 462794, 460258]
60414D60258j419p56m39J10R30J322Q84P3m64o18n50k27L63Q86R59O30K87J84
60396D62413K14P6l46p51o33M0O75Q63J017J678K492K541J673P50M61O07P06O81
60378D75157O94Q42J268K037K710K546J467L19j19M8K77L41L07J81J6N4M18Q60
60360D89423J080J111J109J089R88Q15N71L02K52O45J253J619J690J817K014J907
60344E07685J492J321J621J878J614J056O06K44j42l14j63o5k69l72m4K41j11
60327E16278o94n37N11J561J886J656J400J276J119P93L08j56l42j74N9J06J74
60310E25224P00J736K920L995N070O341P875R736J2053J4922J8414K2576K7145
60297F58707L1138L3088L1855K7298K0230J1870L265n013j2743j9610k4905k7840
$$ y = [460258, 458839, 458083, 457644, 457754, 458684, 460006, 460890, 460963, 460499, 459881, 459331, 459104, 459467, 460353, 461312, 461942, 462229, 462413, 462627, 462703, 462357, 461606, 460973, 461013, 461688, 462551, 463568, 465246, 467738, 470279, 471952, 472702, 473163, 473770, 474476, 475157, 475851, 476693, 477961, 479998, 482708, 485254, 486721, 487040, 486921, 486969, 487246, 487587, 487894, 488075, 488091, 488145, 488563, 489423, 490503, 491614, 492723, 493812, 494800, 495615, 496186, 496488, 496740, 497385, 498638, 500257, 501947, 503764, 505778, 507685, 509177, 510498, 512119, 513997, 515611, 516667, 517273, 517517, 517375, 517061, 516898, 516833, 516564, 516192, 516148, 516389, 516278, 515584, 515047, 515558, 517119, 519005, 520661, 522061, 523337, 524456, 525249, 525557, 525401, 525059, 524885, 524944, 525050, 525224, 525924, 527660, 530580, 534575, 539645, 545986, 553861, 563597, 575650, 590572, 608986, 631562, 658707, 689845, 722933, 754788, 782086, 802316, 814186, 817451, 812438, 799695, 780085, 755180, 727340]
60285G27340k8224k6667k4082k0992j7485j3774j0503q360p387o994o656o286
60273E49930n895n303m527m038m158m389l942k824j826j380j042l07O38J215J192
60258E13344Q22N41O83J240J766J774J352J046J111J218R98M69j30n77o58l33
60242E24666l5l39j216k006k241k027j547q25j42pm04o36k16N97J383K084K574
60225E19663K548K211K348L083L411K682J881K368L893M957M873M304L897L558
60211E65677L297L627M666N657N936N808N963O431O649O274N444M363L133J989
60197F34914J332J259J217M31j248l048m039m130m121m706n700o293n931m791
60183E95146l630l161l453l857l719l107k582k366k173j867j664j570j211n53
$$ y = [727340, 699116, 672449, 648367, 627375, 609890, 596116, 585613, 577253, 569866, 562872, 556216, 549930, 544035, 538732, 534205, 530167, 526009, 521620, 517678, 514854, 513028, 511648, 510606, 510299, 510937, 512152, 513344, 514166, 514707, 515390, 516630, 518396, 520170, 521522, 522568, 523679, 524897, 525895, 526364, 526234, 525657, 524999, 524666, 524631, 524292, 523076, 521070, 518829, 516802, 515255, 514430, 514288, 514281, 513877, 513241, 513025, 513622, 515005, 517089, 519663, 522211, 524422, 526770, 529853, 533264, 535946, 537827, 540195, 544088, 549045, 553918, 558222, 562119, 565677, 568974, 572601, 577267, 582924, 588860, 594668, 600631, 607062, 613711, 619985, 625429, 629792, 632925, 634914, 636246, 637505, 638722, 639153, 637905, 634857, 630818, 626688, 622567, 617861, 612161, 605868, 599937, 595146, 591516, 588355, 584902, 581045, 577326, 574219, 571637, 569271, 567098, 565231, 563567, 561997, 560786, 560233]
60169E60233j71m19q55r54r35j225j581j422q77p07j219j730j400j82J122J621
60153E49299J139L63J62Q27K010L270M194M244L247K188K548M497O404O750N783
60138E96925M740M166L857L850M405N286N932O161O077N619M922M736N515O424
60124F68615O243N134M409M654N090M943M382L807L108K095R37j25r55j225n86
60109G10526O51J653K103K493L063L204K318P02q64j993k785l446m174n028n698
60094G02725n735n208m669m315l753k834k112k005k065j643q45k60N3N85J506
60079F69425K283K254J275l41k189m012n674p075q108q753r130r288r107q567
60065F02993q005p721p415o487n013l891l761m132m014l177k363k254k580k449
$$ y = [560233, 560062, 559643, 558788, 557834, 556899, 555674, 554093, 552671, 551794, 551087, 549868, 548138, 546738, 546556, 547678, 549299, 550438, 550801, 550963, 551790, 553800, 557070, 561264, 565508, 568755, 570943, 573491, 577988, 584392, 591142, 596925, 601665, 605831, 609688, 613538, 617943, 623229, 629161, 635322, 641399, 647018, 651940, 656676, 662191, 668615, 674858, 679992, 684401, 689055, 694145, 699088, 703470, 707277, 710385, 712480, 713417, 713292, 712337, 711112, 710526, 711177, 712830, 714933, 717426, 720489, 723693, 726011, 726713, 725849, 723856, 721071, 717625, 713451, 708423, 702725, 696990, 691782, 687113, 682798, 679045, 676211, 674099, 672094, 670029, 668386, 667541, 667281, 667334, 667919, 669425, 671708, 673962, 675237, 674896, 672707, 668695, 663021, 655946, 647838, 639085, 629955, 620667, 611560, 602993, 594988, 587267, 579852, 573365, 568352, 564461, 560700, 556568, 552554, 549377, 547014, 544760, 542180, 539731]
60051E39731j444j80L90R2l08j30M29Q12R97J350J847K091K031K030K142J940
60035E53820J285O20K52j38r54k079l212m341n418o027n864n304m954m866m684
60020E08136m423m465m788m792m098l061k256j764j316r00q21j242j948k570k863
60005D66829k733k332k142k543l153k971j652k54j17j119j787j212l6P34J099
59990D46611J613K203K315J960J774K084K582K993L351L552L241K370J406P59
59976D78814M15K38K59L91K57m06j359k086k256j878j222o83n07m90j22P84J821
59959D71970K392K305J852J496J556J992K392K287J618Q71O61J130J774J943J518
59944D97757J014R27J142J256J214J242J230Q48L47N17J520K464K605K356K498
$$ y = [539731, 538287, 538107, 538497, 538589, 538281, 538151, 538580, 539392, 540389, 541739, 543586, 545677, 547708, 549738, 551880, 553820, 555105, 555725, 555977, 555839, 554885, 552806, 549594, 545253, 539835, 533808, 527944, 522640, 517686, 512820, 508136, 503713, 499248, 494460, 489668, 485570, 482509, 480253, 478489, 477173, 476273, 475452, 474210, 472262, 469692, 466829, 464096, 461764, 459622, 457079, 453926, 450955, 449303, 449049, 448932, 447813, 446026, 444814, 444778, 445512, 446611, 448224, 450427, 452742, 454702, 456476, 458560, 461142, 464135, 467486, 471038, 474279, 476649, 478055, 478814, 479229, 479467, 479726, 480117, 480374, 479968, 478609, 476523, 474267, 472389, 471167, 470484, 469977, 469487, 469365, 470149, 471970, 474362, 476667, 478519, 480015, 481571, 483563, 485955, 488242, 489860, 490731, 491392, 492522, 494296, 496239, 497757, 498771, 499698, 500840, 502096, 503310, 504552, 505782, 506630, 506977, 507494, 509014, 511478, 514083, 516439, 518937]
59929E18937K947L087K949L128L780M477M982N428N703N495M989M890N517O440
59915E82749P105P394P422P203O631N544L864J962N91jn59j842l447m349m404
59900F15863m388m671m753m209l285k338j437o91l03m9O05J747K940L950M885
59885F03866N550N549N121N030N448N748N623N493N577N517N326N600O264O103
59871F81815M366J960K28p53j762k975l924m551n249o031o473o464o297o018n365
59856F32507m415l730l716m148m492m437m069l623l088k062j73K366M843O747
59842F08510Q134R361J0859J3060J5934J8519J9399J7892J4441R928N276J688
59830G53001L28J275L387N398O544O080L270j579o875j1168j4177j6026j6462
$$ y = [518937, 521884, 524971, 527920, 531048, 534828, 539305, 544287, 549715, 555418, 560913, 565902, 570792, 576309, 582749, 589854, 597248, 604670, 611873, 618504, 624048, 627912, 629874, 630465, 630464, 629905, 628063, 624616, 620267, 615863, 611475, 606804, 602051, 597842, 594557, 592219, 590782, 590091, 589788, 589739, 590344, 592091, 595031, 598981, 603866, 609416, 614965, 620086, 625116, 630564, 636312, 641935, 647428, 653005, 658522, 663848, 669448, 675712, 681815, 686181, 688141, 688369, 687616, 685854, 682879, 678955, 674404, 669155, 663124, 656651, 650187, 643890, 637872, 632507, 628092, 624362, 620646, 616498, 612006, 607569, 603500, 599877, 596789, 594727, 594554, 596920, 601763, 608510, 616644, 626005, 636864, 649924, 665858, 684377, 703776, 721668, 736109, 746037, 751313, 753001, 753329, 754604, 757991, 763389, 769933, 776013, 779283, 777704, 770829, 759661, 745484, 729458, 712996]
59817G12996j5508j3976j2445j0457p704n234m365m876n419n408n362n620n867
59804F10755n926n953n820n154m115l386l195l109k784k292j686r87n81r10j626
59789E63231j851j409j060j276j524j175n03k31m65n99j56N91R16M17m53p48n2
59772E53653J029J547J287P95N12L46Nn67j172j461j126k40O42J017R34P19M84
59755E58404L19O36J698K889L238K658J984J696J344N45j33P5R25J397R73J72
59739E78820l03m47p01j146j321r42n02p37j625k248j846p16J72K56k13o65q09
59722E65027p08o02p10j042j337j255p45j92j45p71j531j585o94L92P62M40K85
59705E55589R15K139L476M605N271N261M762M291L987L473K665K250K918M405
$$ y = [712996, 697488, 683512, 671067, 660610, 652906, 647672, 643307, 638431, 633012, 627604, 622242, 616622, 610755, 604829, 598876, 593056, 587902, 583787, 580401, 577206, 574097, 571313, 569021, 567335, 566348, 565767, 564857, 563231, 561380, 559971, 558911, 557635, 556111, 554936, 554433, 554202, 553737, 553138, 552982, 553573, 554489, 554906, 554453, 553705, 553653, 554682, 556229, 557516, 558311, 558823, 559169, 559174, 558607, 557435, 555974, 554848, 554608, 555250, 556267, 557201, 557920, 558404, 558723, 559359, 561057, 563946, 567184, 569842, 571826, 573522, 574866, 575411, 575278, 575353, 576278, 577675, 578648, 578820, 578517, 578070, 577369, 576223, 574902, 573960, 573458, 572721, 571096, 568848, 567002, 566286, 566458, 566714, 566501, 565836, 565027, 564319, 563717, 563007, 561965, 560628, 559373, 558628, 558436, 558291, 557520, 555989, 554404, 553710, 554102, 554864, 555304, 555589, 556504, 558643, 562119, 566724, 571995, 577256, 582018, 586309, 590296, 593769, 596434, 598684, 601602, 606007]
59691F06007N668N786M562K602R88M14M37M8q72j404j050n54p28j335j786k222
59675F16561k984l723l986m141m721n213m725l580l009l244l152j997m90L89P02
59660E72687J174K106L195M009M253L947L654M119N343O362O264N185M002L235
59646F29535K525J121j262l962n795o104n417m896n165n861o283o164n674n012
59632E71586m193l245k373j832j610j379j033j059k031l635m753m652l680k628
59618E33483j872j450j459j902k476k923l281l505l288k598j937j583j104j27
59604E03978R61J651K087K474K345J307J14j34L60L57n22j291j128m50n2l7r7
59587E11923j79m11q04j320j918k254j816o85K09j4j160k142k129j298m58o5J53
$$ y = [606007, 611675, 617461, 622023, 624625, 625613, 626027, 626464, 626512, 625640, 624236, 623186, 622632, 621904, 620569, 618783, 616561, 613577, 609854, 605868, 601727, 597006, 591793, 587068, 583488, 580479, 577235, 574083, 572086, 571596, 571985, 572687, 573861, 575967, 579162, 583171, 587424, 591371, 595025, 599144, 604487, 610849, 617113, 622298, 626300, 629535, 632060, 633181, 631919, 627957, 622162, 616058, 610641, 605745, 600580, 594719, 588436, 582272, 576598, 571586, 567393, 564148, 561775, 559943, 558333, 556954, 555921, 554862, 552831, 549196, 544443, 539791, 536111, 533483, 531611, 530161, 528702, 526800, 524324, 521401, 518120, 514615, 511327, 508729, 506792, 505209, 504105, 503978, 504939, 506590, 508677, 511151, 513496, 514803, 514917, 514783, 515143, 515500, 514978, 513687, 512559, 512109, 512057, 512020, 511923, 511744, 511333, 510529, 509209, 507291, 505037, 503221, 502536, 502745, 502731, 501571, 499429, 497300, 496002, 495544, 495479, 495632]
59570D95632N34P28J09j146k019j883j167n12O6P30J190J174R80R32P73K35k49
59553D96107j74K27N04R04J779K625K664K178K216L145M413N600O806Q106R501
59538E46601J1367J4109J7523K1034K4030K5066K1705J2952J671p288j1618j2780
59526F64372j2731j1466q522m987k549j550j194r87r86j173j537k323l535m657
59512F06175n421o283p535q510q385p339o295n782n585n274m638l811l269l378
59498E24670l780l660k748j577o59p4N6m53j092q16N20J681J665J038R86J662
59482E17419K300K471K439K493K734L285M157N052N734O344O968P163O428M920
59468E79907L280J940R50K37l13p98j103r57l95K38Q84J928L461M950O032P071
$$ y = [495632, 496166, 496894, 497003, 495857, 493838, 491955, 490788, 490276, 490342, 491072, 492262, 493436, 494416, 495348, 496121, 496356, 496107, 495933, 496160, 496664, 497568, 499347, 501972, 504636, 506814, 509030, 512175, 516588, 522188, 528994, 537100, 546601, 557968, 572077, 589600, 610634, 634664, 659730, 681435, 694387, 696058, 688770, 677152, 664372, 651641, 640175, 631653, 626666, 624117, 622567, 621373, 620386, 619400, 618227, 616690, 614367, 610832, 606175, 600754, 594471, 586936, 578426, 570041, 562702, 556407, 550625, 545040, 539766, 535128, 531317, 528048, 524670, 520890, 517230, 514482, 512905, 512246, 512172, 512228, 511775, 510683, 509867, 510387, 512068, 513733, 514771, 515757, 517419, 519719, 522190, 524629, 527122, 529856, 533141, 537298, 542350, 548084, 554428, 561396, 568559, 574987, 579907, 583187, 585127, 586077, 586314, 586001, 585203, 584100, 583143, 582748, 582986, 583870, 585798, 589259, 594209, 600241, 607312]
59452F07312Q464R861J0662J0853J0738J0181Q819O887N096L629J810j036m695
59439F88581q233j0796j2067j2117j1061r160p107n797n468n422m846l716k499
59426E90292j311L7J470K793M259O310Q806J1204J3393J5661J7933J9782K1175
59413G11804K2512K4102K6195K8905L0924K8908K0097N877q654j9017k4035k4431
59401H23187k1027j5043q191j132O520J3408J5421R532k185j4134k2188k5756
59389G58412k5980k4019k1082j8189j5372j2082q484n473l507k294j490p73M53
59376F20120K380M037M308L575L269L889M618M923N313O258P380Q153Q642R187
59362F96052R986J1109J2352J3034J2577J1339J0163R156P808O340N860O814Q152
$$ y = [607312, 615776, 625637, 636299, 647152, 657890, 668071, 676890, 683777, 688873, 692502, 694312, 693276, 688581, 680348, 669552, 657485, 645368, 634307, 625147, 618040, 612243, 606775, 601353, 596507, 592791, 590292, 588981, 589018, 590488, 593281, 597540, 603850, 612656, 623860, 637253, 652914, 670847, 690629, 711804, 734316, 758418, 784613, 813518, 844442, 873350, 893447, 899324, 890670, 871653, 847618, 823187, 802160, 787117, 778926, 777794, 784314, 797722, 813143, 822675, 820490, 806356, 784168, 758412, 732432, 708413, 687331, 669142, 653770, 641688, 633204, 627731, 624224, 621930, 620440, 619667, 620120, 622500, 626537, 630845, 634420, 637689, 641578, 646196, 651119, 656432, 662690, 670070, 678223, 686865, 696052, 706038, 717147, 729499, 742533, 755110, 766449, 776612, 785768, 793576, 799916, 805776, 812590, 820742]
59349H20742Q609Q149P639P644Q137R022J0261J1531J2175J1613R790P262M777
59336I37351K606M13k124m770p120r201j1189j2708j3134j2586j2014j2054j2266
59323H31204j1805j0485q967q009p723p547o937o022n454n439n330m428k929j659
59309G38470j114j219j815k768l592l633k846j982j734j957j959j381n80j84l17
59294G11389k71R69L777P587J1609J5709K0130K4353K6452K4102J6466N217o452
59281H61037j5976k2465k5969k6445k4056j9908j5486j1358p206l111J29K128
59269F91314L500M884O141O969P545Q082Q263P654O229M086J249j871m436o098
59255G43511p407q773r738r801r363r118r010q545p663o656n565m309l052j896
$$ y = [820742, 829351, 837500, 845139, 852783, 860920, 869942, 880203, 891734, 903909, 915522, 925312, 932574, 937351, 939957, 940370, 938246, 933476, 926356, 917155, 905966, 893258, 880124, 867538, 855524, 843470, 831204, 819399, 808914, 799947, 791938, 784215, 776668, 769731, 763709, 758255, 752816, 747486, 743058, 740129, 738470, 737356, 736137, 734322, 731554, 727962, 724329, 721483, 719501, 717767, 715810, 713851, 712470, 711890, 711706, 711389, 711118, 712087, 715864, 723451, 735060, 750769, 770899, 795252, 821704, 845806, 862272, 867489, 861037, 845061, 822596, 796627, 770182, 746126, 726218, 710732, 699374, 692168, 689057, 689186, 691314, 694814, 699698, 705839, 712808, 720353, 728435, 736698, 744352, 750581, 754667, 755916, 754045, 749609, 743511, 736104, 727331, 717593, 707792, 698429, 689311, 680301, 671756, 664093, 657437, 651872, 647563, 644511, 642615]
59241F42615n51J119K715L892M866N753O097N712N304N467N720N390M838M697
59227G03634M527L365J328n37j791k796l553l521k702j828j335r54m71j9M55J197
59211F94999J982K195J712J069O79N22N39O70N10k88j276j634j414j475k136k692
59195F93962k493j772j067n66l49p06j635k452k351j238J65J040J207J242J741
59180F84728K473K540J626O02M73J083J518J461J490K105L191M422N643O713P477
59165G27545P991Q495R069R491R357Q347O557M639L173J865l7k428m255n071n717
59150G79021o905q107q576q632q932r300r325r429j0194j1166j1453j1054j0472
59137F55476r572q079o707o346o524o125n299n143n601n389m127k901k311j420
$$ y = [642615, 642064, 643183, 645898, 649790, 654656, 660409, 666506, 672218, 677522, 682989, 688709, 694099, 698937, 703634, 708161, 711526, 712854, 712317, 710526, 707730, 704177, 700656, 697954, 696126, 694791, 693837, 693366, 693347, 693802, 694999, 696981, 699176, 700888, 701957, 702636, 703158, 703697, 704367, 704877, 704589, 703313, 701679, 700265, 698790, 696654, 693962, 691469, 689697, 688630, 688064, 687715, 687009, 685374, 682922, 680571, 679333, 679498, 680538, 681745, 682987, 684728, 687201, 689741, 691367, 691969, 692442, 693525, 695043, 696504, 697994, 700099, 703290, 707712, 713355, 720068, 727545, 735536, 744031, 753100, 762591, 771948, 780295, 786852, 791491, 794664, 796529, 796492, 794064, 789809, 784738, 779021, 772116, 764009, 755433, 746801, 737869, 728569, 719244, 709815, 699621, 688455, 677002, 665948, 655476, 645904, 637825, 631118, 624772, 618248, 612123, 606824, 601681, 596080, 590691, 586564, 583663, 581352, 579932]
59123E79932O60L337N375O324O602O875P685R069J0322J0765J0785J1274J2190
59110F81195J2596J2147J1444J0825R886Q466P025N761M303K578R88m00j975l579
59096G61260m485m590m679n131n442n316n171n102m418k868j375q61j123j528
59082G09171k111l307n072o854q067q296p487o251n479n407n481n251m804m278
59068F31026l579k713j807q37N9J72r41k406k876k448k478l323l690k671j128
59053F00360l01j42J12O11J001J189J221R05K31l24l90k14j61k14l14o90j364
59036F01516j843j665r38q0N25N89J82LP67K248L625M779O281Q072R217R333R206
59019F51817R506R754R200P852O083L933J491o41j905k446k711k780k474j805
$$ y = [579932, 580592, 583929, 589304, 595628, 602230, 609105, 616790, 625859, 636181, 646946, 657731, 669005, 681195, 693791, 705938, 717382, 728207, 738093, 746559, 753584, 759345, 763648, 766226, 767214, 766814, 764839, 761260, 756775, 752185, 747506, 742375, 736933, 731617, 726446, 721344, 716926, 714058, 712683, 711822, 710699, 709171, 707060, 703753, 698681, 691827, 683760, 675464, 667977, 661726, 656247, 650840, 645359, 640108, 635304, 631026, 627447, 624734, 622927, 622090, 622149, 622321, 621380, 618974, 616098, 613650, 611172, 607849, 604159, 601488, 600360, 600059, 599917, 600029, 600640, 601641, 602830, 604051, 604956, 605187, 604863, 604473, 604259, 604098, 603884, 603570, 602880, 601516, 599673, 598008, 597070, 596990, 597515, 598104, 598286, 598289, 599056, 601304, 604929, 609708, 615989, 624061, 633278, 642611, 651817, 661323, 671077, 680277, 688129, 694212, 698145, 699636, 698995, 697090, 694644, 691933, 689153, 686679, 684874]
59005F84874j001k58L75J103K272L818N035N434N467N715N773M896L377K186J421
58990G30487M13p89j375j321j573k458l257l668m289n282n791n226l991k474n23
58975F88883J654L347M576O222Q391R904J0138J0044J0660J1706J2422J2737J2859
58962H03543J2701J2397J2383J2366J1231Q653N685L144N62k588n808q572j1212
58949H54485j3893j5802j6369j6306j6467j6494j5602j3872j1900r927q151p128
58937F92574p030p215p117o815o237m889l030j927k067k265j463l25j7m27o88
58922F41062o27n38l25R3K49j68o27n96k54K09J099K292K866K504K250K963M085
58905F56537M844N615P034Q793J0379J2013J3804J4991J5111J4994J5423J5786
$$ y = [684874, 683873, 683615, 683990, 685093, 687365, 691183, 696218, 701652, 707119, 712834, 718607, 723503, 726880, 729066, 730487, 730900, 730111, 728736, 727415, 725842, 723384, 720127, 716459, 712170, 706888, 701097, 695871, 691880, 689406, 688883, 690537, 693884, 698460, 704682, 713073, 722977, 733115, 743159, 753819, 765525, 777947, 790684, 803543, 816244, 828641, 841024, 853390, 864621, 873274, 878959, 882103, 882665, 880077, 874269, 865697, 854485, 840592, 824790, 808421, 792115, 775648, 759154, 743552, 729680, 717780, 707853, 699702, 692574, 685544, 678329, 671212, 664397, 658160, 653271, 650241, 648314, 646247, 643982, 642519, 642194, 642177, 641750, 641062, 640435, 639897, 639572, 639665, 639914, 639746, 639119, 638523, 638269, 638478, 639577, 641869, 644735, 647239, 649489, 652452, 656537, 661381, 666996, 674030, 682823, 693202, 705215, 719019, 734010, 749121, 764115, 779538, 795324]
58893G95324J5276J4522J4744J6025J7631J9301K1083K2562K3222K3034K1879
58882A004603J9297J5543J1830Q676N240J157k465m975p585j1313j4934j6679
58870A008395j6755j6495j6079j4968j3588j2723j1965j0636r446r520j0411j0868
58858H54941j0978j1689j2835j3372j3174j2893j2525j1740j1097j1204j1230
58847G22204r988q062p026o989o766o167o150o846p265p054o851o851o534n887
58833F23768n479n280m759m034l653l383k562j475j016j100p47L56J613K623L400
58818E98272L730L534L507M182M846M568L757L417L457L139K664K697K869K316
58804F46955J265M97j79j346k441k549k231k706l715m078l976m625n928o433n658
$$ y = [795324, 810600, 825122, 839866, 855891, 873522, 892823, 913906, 936468, 959690, 982724, 1004603, 1023900, 1039443, 1051273, 1059949, 1065189, 1066346, 1063881, 1058906, 1051321, 1040008, 1025074, 1008395, 991640, 975145, 959066, 944098, 930510, 917787, 905822, 895186, 885740, 876220, 865809, 854941, 843963, 832274, 819439, 806067, 792893, 780000, 767475, 755735, 744638, 733434, 722204, 712216, 704154, 697128, 690139, 683373, 677206, 671056, 664210, 656945, 649891, 643040, 636189, 629655, 623768, 618289, 613009, 608250, 604216, 600563, 597180, 594618, 593143, 592127, 591027, 590280, 590636, 592249, 594872, 598272, 602002, 605536, 609043, 613225, 618071, 622639, 626396, 629813, 633270, 636409, 639073, 641770, 644639, 646955, 648220, 648717, 648538, 647192, 644751, 642202, 639971, 637265, 633550, 629472, 625496, 620871, 614943, 608510, 602852]
58789F02852m521l511k248q81j35R0O37J637K630L796N427O679O627O120O597
58774F31796P493O993M959K807P61k157n438p144p006o892p658p989p059n974
58760E97492n644n362m489l639l265k784j972j574j704j360k12O95P79Q66J576
58745E69403K343K725L213M063M772N280O206P419P926P666P814Q757R454R295
58731F56336Q949Q712P844O224M969M604M221L243K456K527L053L794N208P028
58717G29168P972P759P802Q930R941R443P741N844M002K186P64m06k399n746r485
58702G83516j2432j4419j5716j6366j6736j7586j8862j9508j8936j7679j6259
58691E99017j4561j2684j1065r505p416n297m386m603m508l749l588m502n108
$$ y = [602852, 598331, 594820, 592572, 591691, 591556, 591646, 592283, 593920, 596550, 600346, 605773, 612452, 619079, 625199, 631796, 639289, 646282, 651241, 654048, 654809, 652652, 647214, 640070, 633064, 626172, 618514, 610525, 603466, 597492, 591848, 586486, 581997, 578358, 575093, 572309, 570337, 568763, 567059, 565699, 565487, 566182, 566961, 567827, 569403, 571746, 574471, 577684, 581747, 586519, 591799, 598005, 605424, 613350, 621016, 628830, 637587, 647041, 656336, 665285, 673997, 681841, 688065, 693034, 697638, 701859, 705102, 707558, 710085, 713138, 716932, 722140, 729168, 737140, 744899, 752701, 761631, 771572, 781015, 788756, 794600, 798602, 800788, 801552, 801146, 798747, 793001, 783516, 771084, 756665, 740949, 724583, 707847, 690261, 671399, 651891, 632955, 615276, 599017, 584456, 571772, 560707, 551202, 543786, 538489, 534103, 529500, 524992, 521243, 517655, 513153, 508045]
58678E08045m342k919j742n72P81J624J800K403M061N850O894P663Q769R889J0740
58663E58944J1854J3368J4284J3703J1711Q489M002r15m659o767q249r465r408
58650E96892p790n999n061m402l539l222l771m043l297k504k517k417j055R87
58636E48262K266K253J231m19j930k309j661j276j742k243k199k057j843p54J112
58621E36691K309K307K422L569M807N132N026N172N302N270N548N712M378J674
58607E95319k55m42o84k463m381m407k933j700j238j098j326j972k305j956j706
58592E66453j963j735l25J436K881M713P258R177R508R434J0340J1551J1655J0784
58578F51167R991R420Q586P416N894L841J972J770L356N063O084P653J0474J3200
$$ y = [508045, 503703, 500784, 499042, 498470, 499251, 500875, 502675, 505078, 509139, 514989, 521883, 529546, 538315, 548204, 558944, 570798, 584166, 598450, 612153, 623864, 632353, 636355, 635440, 630781, 624014, 615765, 606300, 596892, 589102, 583103, 578042, 573640, 570101, 566879, 563108, 559065, 555768, 553264, 550747, 548330, 547275, 548262, 550528, 552781, 554012, 553593, 551663, 549354, 547693, 546417, 544675, 542432, 540233, 538176, 536333, 535579, 536691, 539000, 541307, 543729, 547298, 552105, 557237, 562263, 567435, 572737, 578007, 583555, 589267, 593645, 595319, 595064, 594622, 593938, 591475, 587094, 582687, 579754, 578054, 576816, 575718, 574392, 572420, 570115, 568159, 566453, 564490, 562755, 562430, 563866, 566747, 571460, 578718, 587895, 597403, 606837, 617177, 628728, 640383, 651167, 661158, 670578, 679164, 686580, 692474, 696315, 698287, 700057, 703413, 708476, 714560, 722213, 732687, 745887]
58564G45887J4855J6703J9906K3189K4676K4374K3181K1114J8192J5332J2666
58553I60075Q699K894k616n691o773p141o624n066m115n170p064q006q426r779
58539H95197j1966j4015j5938j7912j8940j8316j7092j6297j5174j2955j0692
58528G25900r425q197n935l611k418j517K65K078K700K852L631M208L354J821
58514G15706R79N80p1m05j11n55k403l805l311k515l229m129l204j540j439k455
58498F88093k624k167k657l704l677k704j988j187N27K013J771R40J673L541M579
58483F82429M834N828P470Q622R773J2077J4552J5224J4296J3249J1784Q670M683
58470H13491J609q72m183p620r185q971q635q235o654m470l228k430k96K898N187
$$ y = [745887, 760742, 777445, 797351, 820540, 845216, 869590, 892771, 913885, 932077, 947409, 960075, 968774, 971668, 969052, 963361, 956588, 949447, 942823, 937757, 933642, 928472, 921408, 913402, 904976, 895197, 883231, 869216, 853278, 835366, 816426, 798110, 781018, 764721, 749547, 736592, 725900, 716475, 708278, 702343, 698732, 696314, 694797, 695062, 697140, 699840, 702692, 706323, 710531, 713885, 715706, 716685, 717265, 717194, 716789, 716678, 716123, 713720, 709915, 706604, 704089, 700860, 696731, 693527, 691987, 690548, 688093, 685469, 683302, 680645, 676941, 673264, 670560, 668572, 667385, 667912, 669925, 671696, 672636, 674309, 677850, 682429, 687263, 693091, 700561, 709183, 718956, 731033, 745585, 760809, 775105, 788354, 800138, 808808, 813491, 815100, 814228, 810045, 802425, 793240, 784269, 775634, 767399, 760745, 756275, 753047, 750617, 750321, 753219, 758406]
58455G58406O137P056Q430R671J0664J1238J0093O711L044Q24j177m507p554q006
58441H11030o946o849p238o075m012l146k900j218J219K145K065L190M994N149
58427G91408M172M764P012Q584R176J0444J1815J0849P700N081L817K331M18n35
58413H77036q46k158l977m528m554o202q603q916p313o467o452m853j826k80p27
58398H09334o43Q15J859K164L417N420N929M755L864L305J435q61p61J457K610
58383H44099J993J942K885K711J388J322K615K855K068K972N740P513P678Q585
58369H96366J0417J0581Q958Q568J0019J0552R500R489J1038J1321R606Q713R645
58356A024773R901Q545P862Q516Q109N988M548M407L344J347J418L950N581N152
$$ y = [758406, 764543, 771599, 780029, 789700, 800364, 811602, 821695, 828406, 831450, 832274, 831097, 826590, 819036, 811030, 804084, 797235, 789997, 783922, 779910, 776764, 773864, 772646, 773865, 776010, 778075, 781265, 786259, 791408, 795580, 800344, 807356, 815940, 825116, 835560, 847375, 858224, 865924, 871005, 874822, 877153, 877571, 877036, 876190, 874032, 870055, 865527, 860973, 854771, 846168, 837252, 829939, 823472, 817020, 812167, 810341, 810061, 809334, 808691, 809506, 811365, 813529, 816946, 822366, 828295, 833050, 836914, 840219, 841654, 840793, 840032, 841489, 844099, 846092, 848034, 850919, 853630, 855018, 856340, 858955, 861810, 863878, 866850, 872590, 880103, 887781, 896366, 906783, 917364, 926322, 934890, 944909, 955461, 964961, 974450, 985488, 996809, 1006415, 1015128, 1024773, 1034674, 1043219, 1051081, 1059597, 1067706, 1073694, 1078242, 1082649, 1085993, 1087340, 1088758, 1092708, 1098289, 1103441]
58342A103441N521P876R705J0087J1539J4727J6745J6568J6927J8827J9567J8124
58330A269654J7115J7435J6294J2699R529Q115O060K512K78O30J200R65K029M710
58316A369225O266O188P211R610J0382R461J0459J3644J4828J3069J2593J5065
58304A498001J6938J6687J7478K0122K0750J8310J7128J8996K0055J8544J8177
58293A701186K0535K1703K0046J9706K2598K4491K3015K2006K3838K5018K3627
58282A947769K3534K6817K9462K9043K9197L2121L4201L3516L3989L7623M0425
58271B297697M0522M2269M7686N1987N2365N2924N6205N8342N7546N8432O2992
58260B878967O6217O5789O6666P0923P2961P0238O8597P1143P2411O9697O9168
$$ y = [1103441, 1108962, 1116838, 1126543, 1136630, 1148169, 1162896, 1179641, 1196209, 1213136, 1231963, 1251530, 1269654, 1286769, 1304204, 1320498, 1333197, 1342726, 1350841, 1356901, 1359413, 1359691, 1360321, 1361521, 1362486, 1364515, 1369225, 1375491, 1381679, 1388890, 1398500, 1408882, 1418343, 1428802, 1442446, 1457274, 1470343, 1482936, 1498001, 1514939, 1531626, 1549104, 1569226, 1589976, 1608286, 1625414, 1644410, 1664465, 1683009, 1701186, 1721721, 1743424, 1763470, 1783176, 1805774, 1830265, 1853280, 1875286, 1899124, 1924142, 1947769, 1971303, 1998120, 2027582, 2056625, 2085822, 2117943, 2152144, 2185660, 2219649, 2257272, 2297697, 2338219, 2380488, 2428174, 2480161, 2532526, 2585450, 2641655, 2699997, 2757543, 2815975, 2878967, 2945184, 3010973, 3077639, 3148562, 3221523, 3291761, 3360358, 3431501, 3503912, 3573609, 3642777]
58249C642777P4230P8961P9997Q3417R2499J00547J03582J08158J18428J27875
58239D610471J32419J38952J51793J63677J69740J77147J90975K04278K12414
58230F151866K23014K40927K58106K69708K84748L08798L32406L49490L70328
58221H789391M02563M36947M66491N01360N49129N99663O46254P01595P74905
58212A3868298Q54668R33233J025929J145028J279097J420796J589448J801570
58204B3918067K047339K323823K661784L090282L608785M228638N005677N993869
58196E2878264P208591Q681049J0503955J2774188J5545862J8899149K2981290
58189A49472348K7884245L3516177L9577153M5344780M9137789M8218109M0063835
$$ y = [3642777, 3717007, 3795968, 3875965, 3959382, 4051881, 4152428, 4256010, 4364168, 4482596, 4610471, 4742890, 4881842, 5033635, 5197312, 5367052, 5544199, 5735174, 5939452, 6151866, 6374880, 6615807, 6873913, 7143621, 7428369, 7737167, 8069573, 8419063, 8789391, 9191954, 9628901, 10095392, 10596752, 11145881, 11745544, 12391798, 13093393, 13868298, 14722966, 15656199, 16682128, 17827156, 19106253, 20527049, 22116497, 23918067, 25965406, 28289229, 30951013, 34041295, 37650080, 41878718, 46884395, 52878264, 60086855, 68767904, 79271859, 92046047, 107591909, 126491058, 149472348, 177356593, 210872770, 250449923, 295794703, 344932492, 393150601, 433214436]
58182D33214436K4480008M539571j4884472k9806315l8712912m2170520m1555987
58175B95103809l8235132l3362710k7828091k2207426j6894046j2333480r056660
58168A35186264p429265p372216q327783r514035j0293916j0410992r951608r129328
58160F2757121q120571p049577o020208n099487m298624l607240l029148k565280
58152B2966986k190007j873329j608402j395352j218129j060459r27085q26743
58144A1867480p49164o79306o19416n76918n43878n07889m71222m40993m11781
58135F866913l75524l37905l08106k82152k52220k22761k02005j86853j71183
58126D528204j59927j59911j64983j64744j60436j58459j56013j47086j35560
$$ y = [433214436, 457694444, 462234015, 447349543, 417543228, 378830316, 336659796, 295103809, 256868677, 223505967, 195677876, 173470450, 156576404, 144242924, 135186264, 127756999, 120384783, 112057000, 102542965, 92249049, 81838057, 71886449, 62757121, 54636550, 47586973, 41566765, 36467278, 32168654, 28561414, 25532266, 22966986, 20776979, 18903650, 17295248, 15899896, 14681767, 13621308, 12694223, 11867480, 11118316, 10439010, 9819594, 9242676, 8698798, 8190909, 7719687, 7278694, 6866913, 6491389, 6153484, 5845378, 5563226, 5311006, 5088245, 4886240, 4699387, 4528204, 4368277, 4208366, 4043383, 3878639, 3718203, 3559744, 3403731, 3256645, 3121085]
58117C121085j28649j23669j14267j03445r7707r4179q6176p6094p0541o7875
58107B158483o2415n6153n4679n5889n3954n0291m9846n0677m7810m3388m2616
58096A590765m3368m0143l4602l2297l2291k9839k6114k5630k7039k5710k2668
58085A251064k2001k2393k0104j7377j8967k2924k3679k1766k1907k3859k3739
58074A012348k2216k2937k4644k3130j9314j7574j7725j6238j3636j3199j4025
58063H07710j2729j0345j0317j1439j0010p194o979q591q216o618p641j0534j1178
58050F85919r736r867j1357j0674q012o794o972n586l276l431n545o060n243o540
58036E86826r531j0213q129o804p105o508m955n288p509q486p692p704q891r032
$$ y = [3121085, 2992436, 2868767, 2754500, 2651055, 2553348, 2459169, 2372993, 2296899, 2226358, 2158483, 2096068, 2039915, 1985236, 1929347, 1875393, 1825102, 1775256, 1724579, 1676769, 1633381, 1590765, 1547397, 1507254, 1472652, 1440355, 1408064, 1378225, 1352111, 1326481, 1299442, 1273732, 1251064, 1229063, 1206670, 1186566, 1169189, 1150222, 1127298, 1103619, 1081853, 1059946, 1036087, 1012348, 990132, 967195, 942551, 919421, 900107, 882533, 864808, 848570, 834934, 821735, 807710, 794981, 784636, 774319, 762880, 752870, 745676, 738697, 730106, 721890, 715272, 707631, 697097, 685919, 676183, 666316, 654959, 644285, 636273, 629479, 622507, 616921, 613645, 610214, 604669, 598609, 593366, 586826, 577295, 567082, 558953, 552149, 545044, 538536, 533581, 528293, 520784, 512298, 504606, 496902, 488011, 478979]
58022D78979q259q855j0187r266o486n307o113n805l759k813l769m198l246k773
58008C98143l139k568j227j269k413k007J14J270O57J28J95l30p26R76L605L756
57992C95165J352l01j66n04j944k354j333j251k814l849l359k874l062k894k629
57977C67183l789n666n739l997k958l221k921j816j722k523k083n29l21j512j336
57962C27050P14J800P51j50M22P62j85r39p08q77j876k093j152r12j939k286j045
57945C17337O8q7l86m5J46K01J514L989N572N646O003P494Q779R256J0177J1792
57929C87456J2379J1210R751Q924P851O172M908M182K759N44j060j834l031m634
57915D45577n194m833n333o834p506o984o886p459p103n851n719o826o788n048
$$ y = [478979, 470720, 461865, 451678, 442412, 435926, 430619, 424506, 418701, 414942, 412129, 408360, 404162, 400916, 398143, 395004, 392436, 391209, 389940, 387527, 385520, 385634, 386904, 387561, 387689, 387884, 387554, 386828, 387804, 391409, 395165, 396517, 396216, 396050, 395546, 393602, 391248, 389915, 388664, 385850, 382001, 378642, 375768, 372706, 369812, 367183, 363394, 357728, 351989, 347992, 345034, 341813, 338892, 337076, 335354, 332831, 330748, 330219, 329898, 328386, 327050, 327764, 329564, 330315, 330165, 330587, 331349, 331164, 330225, 329517, 328640, 326764, 324671, 323519, 322607, 320668, 318382, 317337, 317405, 317318, 316932, 316887, 317033, 317234, 318748, 322737, 328309, 333955, 339958, 347452, 356231, 365487, 375664, 387456, 399835, 411045, 420796, 429720, 437571, 443743, 448651, 452833, 455592, 456136, 455076, 453242, 450211, 445577, 440383, 435550, 430217, 423383, 415877, 408893, 402007, 394548, 387445, 381594, 375875, 369049, 362261, 357213]
57901C57213m166n511p088p112o467o159n498m367m172m986m672k429l20K27N39
57886B95032J753K688K384K080K874L769L746L445L450L188K681K951L572K555
57872C36168j91k062j758j153j754k301j639r98j510k070j693j511k423l126k533
57857C09446j848k311l008k768k144j721o05J547L152L165K857L344L502K263
57843C14871Q26N73O99j5q91r04q16j728l036l690m070m802n195m569l807l899
57827B79547m258l912l076k204r85N14J227Q81P70J553K041J363M88L41L31Q3
57811B74704N33J885K545J716J036J885L023K658J078m56j676k523k305j283j208
57796B81612k548l239j932l71m26r80j61J280J463O88N48R65P25n6l51k98o87
$$ y = [357213, 353047, 347536, 340448, 333336, 326869, 320710, 315212, 310845, 306673, 301687, 297015, 294586, 294266, 294493, 295032, 296785, 299473, 301857, 303937, 306811, 310580, 314326, 317771, 321221, 324409, 327090, 330041, 333613, 336168, 335977, 333915, 332157, 331004, 329250, 326949, 325310, 324312, 322802, 320732, 319039, 317528, 315105, 311979, 309446, 307598, 305287, 302279, 299511, 297367, 295646, 295041, 296588, 299740, 302905, 305762, 309106, 312608, 314871, 315697, 316270, 316969, 316954, 316063, 315159, 314343, 312615, 309579, 305889, 301819, 297017, 291822, 287253, 283446, 279547, 275289, 271377, 268301, 266097, 265112, 265626, 266853, 267734, 268504, 270057, 272098, 273461, 273949, 274290, 274621, 274704, 275237, 277122, 279667, 281383, 282419, 284304, 287327, 289985, 291063, 290607, 288931, 286408, 284103, 282820, 281612, 279064, 275825, 273893, 273522, 273096, 272116, 271955, 273235, 274698, 275386, 275934, 276899, 277624, 277568, 277217, 276919, 276232]
57779B76232j161r00l39l61n92j65O94J406K328L713M560M129L439L577L721K631
57763C02912R66J43j5o40j718k388k596k781k792k507k609l315l497k399j006
57748B75758l31K43J422K355K221J899K309K567J696N88L14J6j377k955l580m195
57732B78950n838o968n614k991j917k581k816j926j216j130p70j62k95r55r75
57717B42796n97j102k166k148j038o75j686k609k497k168k262k158j526j216j755
57702B17193k435k547k345k230k081j756j382r81n71n54j102j451q69N8J95m38
57686A96704r19r17p04j83Q41J755J956K104L248N089O553P732R694J2650J5854
57671B61457J9214K3577K9491L6865M5778N6372O7816P8011Q3834Q1168O6202
$$ y = [276232, 275071, 274171, 273832, 273471, 272879, 272714, 273408, 274814, 277142, 280855, 285415, 289544, 292983, 296560, 300281, 302912, 303878, 304021, 304006, 303366, 301648, 299260, 296664, 293883, 291091, 288584, 285975, 282660, 279163, 276764, 275758, 275427, 275670, 277092, 279447, 281668, 283567, 285876, 288443, 290139, 290727, 291041, 291057, 289680, 286725, 283145, 278950, 273112, 266144, 260530, 257539, 255622, 253041, 250225, 248299, 247083, 245953, 245183, 245021, 244726, 243771, 242796, 242199, 241097, 238931, 236783, 235745, 235070, 233384, 230775, 228278, 226110, 223848, 221690, 220164, 218948, 217193, 214758, 212211, 209866, 207636, 205555, 203799, 202417, 201436, 200865, 200311, 199209, 197758, 196889, 196947, 197142, 196704, 195785, 194868, 194164, 193981, 194822, 196577, 198533, 200637, 203885, 208974, 215527, 223259, 232953, 245603, 261457, 280671, 304248, 333739, 370604, 416382, 472754, 540570, 618581, 702415, 783583, 849785]
57660H49785L8802M451k8600n4142o9770p5657p3726o7343n9567n1414m2739l4157
57648C35923k6730k0562j5273j1270q904p177n015l179k951l693l714k985k755
57635B21715k975k425j206o93r38m57J072K078J533K58o58j075j039n11j77r49
57619B13553k339k818k077j349j318j280p58l83o85j317j871k234j998q00O11
57604A92937R82L64K0M55R16R20Q30P84L72l51p85q64j032j261j229j298j935
57587A89825k462j907r01r85k094k542j587l31J34j30q23j873k731k704k126j961
57571A64802k229k267k288k961l743l502k658k577k987k316o98j38j214k108j698
57556A31418j194j683k294k061j552j354p64O12J604J256M17K77N91O87R45J854
$$ y = [849785, 888587, 893038, 864438, 810296, 740526, 664869, 591143, 523800, 464233, 412819, 370080, 335923, 309193, 288631, 273358, 262088, 253184, 246007, 240992, 237813, 234862, 231169, 227455, 224470, 221715, 218740, 216315, 215109, 214416, 213478, 213021, 214093, 216171, 217704, 217962, 217304, 216229, 215190, 214679, 214502, 213553, 211214, 208396, 206319, 204970, 203652, 202372, 201614, 201231, 200546, 199229, 197358, 195124, 193126, 192326, 192937, 193919, 194283, 194303, 194758, 195674, 196594, 197424, 198208, 198580, 198229, 197444, 196580, 195548, 194287, 193058, 191760, 189825, 187363, 185456, 184555, 183570, 181476, 178934, 177347, 177016, 177150, 177020, 176197, 174324, 171593, 168889, 166763, 164802, 162573, 160306, 158018, 155057, 151314, 147812, 145154, 142577, 139590, 137274, 136576, 136438, 135224, 133116, 131418, 130224, 128541, 126247, 124186, 122634, 121280, 120516, 121128, 122732, 123988, 124405, 124682, 125273, 125960, 126905, 128759]
57540A28759K756K855K640K959L484L262K287J426J213J410J400O44p41j670j249
57525A51435k52l52j679k540j923q08l73l98k40p8k28k92J23P78J512K556L543
57508A50784L433K148J140J485K454K737K110J088lq38r69o06o31j233j576j352
57492A60171j454k313k886k210r19k27l56q66j530k069j897j042m23m73m52Q0
57476A41134K36p35k035k454k041j605j279p74l43m40q76j119j075q57l78K42
57460A25601M60M5n28r12j245j336n68Q25J495P55m04q73q56q86o02L88J352J442
57442A24153J101J246J721J706J164P18N10K46L1K01N68O23L13l5k72l60j24M19
57424A33929Q50Q95P44N78L26J45L52O64L98k60k58N51R51K71m46j59M76K59o14
$$ y = [128759, 131515, 134370, 137010, 139969, 143453, 146715, 149002, 150428, 151641, 153051, 154451, 155095, 154354, 152684, 151435, 151183, 150831, 149152, 146612, 144689, 143881, 143508, 143110, 142870, 142792, 142564, 142272, 142395, 143173, 144685, 147241, 150784, 154217, 156365, 157505, 158990, 161444, 164181, 166291, 167379, 167376, 166538, 165569, 164963, 164332, 163099, 161523, 160171, 158717, 156404, 153518, 151308, 150389, 150162, 149806, 148940, 147410, 145341, 143444, 142402, 141979, 141506, 141054, 141134, 141370, 140635, 138600, 136146, 134105, 132500, 131221, 130447, 130104, 129664, 128788, 127669, 126594, 125737, 125359, 125601, 126061, 126106, 125578, 124666, 123421, 122085, 121517, 122342, 123837, 124592, 124188, 123315, 122459, 121573, 120971, 121359, 122711, 124153, 125254, 126500, 128221, 129927, 131091, 131809, 132319, 132565, 132596, 132797, 133365, 133988, 134301, 134266, 133994, 133634, 133510, 133929, 134779, 135674, 136418, 136996, 137322, 137467, 137819, 138483, 138881, 138621, 138363, 138914, 139865, 140136, 139690, 139531, 140007, 140266, 139652]
57405A39652j048p65l41jM43Q10O71Q5m64o50m02J80N74J73p27r87j72P87J028
57386A38846R17J081J286J140J049J509K078K071J720J776K324K761K594J726
57372A62878L87p66j046n77j60p0J83O68P29K67R6N11P39M53N19J385K107J952
57354A70255J639J913K103J376L65K20Q85J630K320K973K901J686L26R4Q43J552
57338A93081J899K126K034J326M37n1l54q61j206q59j01N32J071J582J610R66
57322B03232L07P9j49n58m21N30J351J492J801K755L134J997N44L49R56J091R87
57305B19477J510K041J429L47N03J945L150L431L379L277K863K467K640L020L064
57290B54543L316M317N001M024K202J486K085K641K830L500M402M185K869K103
$$ y = [139652, 138604, 137839, 137498, 137497, 137940, 138750, 139421, 139506, 139042, 138392, 137990, 138170, 138744, 138917, 138190, 137203, 137031, 137818, 138846, 139763, 140844, 142130, 143270, 144319, 145828, 147906, 149977, 151697, 153473, 155797, 158558, 161152, 162878, 163265, 162499, 161453, 160876, 160716, 160646, 160829, 161497, 162226, 162493, 162589, 163100, 163839, 164292, 164811, 166196, 168303, 170255, 171894, 173807, 175910, 177286, 177651, 177871, 178756, 180386, 182706, 185679, 188580, 190266, 190592, 190686, 191529, 193081, 194980, 197106, 199140, 200466, 200903, 200852, 200498, 199637, 198431, 197572, 197471, 198003, 199074, 200656, 202266, 203232, 203539, 203618, 203469, 202911, 202490, 203020, 204371, 205863, 207664, 210419, 213553, 215550, 216094, 216443, 217399, 218490, 219477, 220987, 223028, 224457, 224804, 225307, 227252, 230402, 233833, 237212, 240489, 243352, 245819, 248459, 251479, 254543, 257859, 262176, 267177, 271201, 273403, 274889, 276974, 279615, 282445, 285945, 290347, 294532, 297401, 299504]
57276B99504K662L596M076M319M408M017L524L668L967L281J993J740K767L596
57262C47118L606L814M583M672L467K245K221K886L250L327L443L350K940K800
57248C93722L267L865M209M558N000N146N005N136N633N930N833N714N567N062
57234D63647M601N008O018O459O115N949O304O438O246O701Q042R081R057Q792
57220E58458R168R748R739R277R002R255J0148J1539J2634J2638J2068J2212J3175
57207F99061J3800J3741J4045J5232J6473J7235J8100J9254J9752J9266J9037
57196H84996K0071K1593K2337K2194K1586K0464J8945J7909J7886J8165J7961
57185A104107J7619J7834J8562J9521K0904K2736K4310K5050K5269K5487K5780
$$ y = [299504, 302166, 305762, 309838, 314157, 318565, 322582, 326106, 329774, 333741, 337022, 339015, 340755, 343522, 347118, 350724, 354538, 359121, 363793, 367260, 369505, 371726, 374612, 377862, 381189, 384632, 387982, 390922, 393722, 396989, 400854, 405063, 409621, 414621, 419767, 424772, 429908, 435541, 441471, 447304, 453018, 458585, 463647, 468248, 473256, 479274, 485733, 491848, 497797, 504101, 510539, 516785, 523486, 531528, 540609, 549666, 558458, 567626, 577374, 587113, 596390, 605392, 614647, 624795, 636334, 648968, 661606, 673674, 685886, 699061, 712861, 726602, 740647, 755879, 772352, 789587, 807687, 826941, 846693, 865959, 884996, 905067, 926660, 948997, 971191, 992777, 1013241, 1032186, 1050095, 1067981, 1086146, 1104107, 1121726, 1139560, 1158122, 1177643, 1198547, 1221283, 1245593, 1270643, 1295912, 1321399, 1347179]
57174A347179K6307K7434K8766K9097K8006K6528K5618K5040K4427K4262K4961
57163A637625K5998K6816K7601K8379K8404K7397K6398K6434K7170K7763K8146
57152A938131K8582K8784K8446K7928K7655K7545K7572K7940K8133K7026K4754
57141B242496K3198K3569K4706K4954K4578K4960K6374K7990K9363L0490L0986
57130B533664L0575K9950K9959L0315L0216K9737K9520K9550K9470K9706L1109
57119B863771L3682L6696L9899M3688M8270N3531N9628O6893P5291Q4534R4522
57108C500405J05193J16466J28904J44084J63716J88853K20462K60185L10102
57099E138370L72483M50461N48290O70234Q19596R98967J210019J451897J720251
$$ y = [1347179, 1373486, 1400920, 1429686, 1458783, 1486789, 1513317, 1538935, 1563975, 1588402, 1612664, 1637625, 1663623, 1690439, 1718040, 1746419, 1774823, 1802220, 1828618, 1855052, 1882222, 1909985, 1938131, 1966713, 1995497, 2023943, 2051871, 2079526, 2107071, 2134643, 2162583, 2190716, 2217742, 2242496, 2265694, 2289263, 2313969, 2338923, 2363501, 2388461, 2414835, 2442825, 2472188, 2502678, 2533664, 2564239, 2594189, 2624148, 2654463, 2684679, 2714416, 2743936, 2773486, 2802956, 2832662, 2863771, 2897453, 2934149, 2974048, 3017736, 3066006, 3119537, 3179165, 3246058, 3321349, 3405883, 3500405, 3605598, 3722064, 3850968, 3995052, 4158768, 4347621, 4568083, 4828268, 5138370, 5510853, 5961314, 6509604, 7179838, 7999434, 8998401, 10208420, 11660317, 13380568]
57090A3380568K008205K307223K606395K892418L151650L371301L538084L637868
57082C6893712L658541L590641L420724L124708K674543K059392J304698M71439
57074E7198398l65562j144491j830930k413812k891316l260242l515351l654314
57066C8122380l680911l604820l440894l208802k931264k630721k326482k033402
57058A4265084j761405j515807j298787j110966r51616q18202p07017o14530n37661
57049D949093m73165m17702l68792l25171k86256k51651k21091j94312j70953
57040B240000j50770j33687j19271j06600r5072q5013p6909p0386o4493n8687
57030A279112n2937m7177m1268l5414k9921k4553j8524j1127k071Q775K1774L7660
$$ y = [13380568, 15388773, 17695996, 20302391, 23194809, 26346459, 29717760, 33255844, 36893712, 40552253, 44142894, 47563618, 50688326, 53362869, 55422261, 56726959, 57198398, 56832836, 55688345, 53857415, 51443603, 48552287, 45292045, 41776694, 38122380, 34441469, 30836649, 27395755, 24186953, 21255689, 18624968, 16298486, 14265084, 12503679, 10987872, 9689085, 8578119, 7626503, 6808301, 6101284, 5486754, 4949093, 4475928, 4058226, 3689434, 3364263, 3078007, 2826356, 2605265, 2410953, 2240000, 2089230, 1955543, 1836272, 1729672, 1634600, 1549587, 1472678, 1402292, 1337799, 1279112, 1226175, 1178998, 1137730, 1102316, 1072395, 1047842, 1029318, 1018191, 1016120, 1024895, 1046669, 1084329]
57018A084329N7443Q2189J12733J48277J83051K03633J92805J41180N7257l5509
57008B227388j13228j63915j87982j91460j81022j62774j41568j20260j00380
56999H64799q3132o9012n7337m7302l8891l2014k5790j9829j5123j2382j0436
56988D53551p715m444j842J00K456N411P957R105Q250M837r10p349j2706j6586
56974D40115j9237k0203j9098j6927j5002j3106j0294o930m255k340k38K114L934
56961C18533N362P490J0609J4069J7719K1753K4915K4556J9154R662j700j2820
56949D59302k1736k6950k8367k7152k4455k0924j7289j4201j1442q305m781j450
56937B52250J683N152Q950J2660J6529K1283K6710L1439L3990L3122K7499J6600
$$ y = [1084329, 1141772, 1223961, 1336694, 1484971, 1668022, 1871655, 2064460, 2205640, 2262897, 2227388, 2114160, 1950245, 1762263, 1570803, 1389781, 1227007, 1085439, 965179, 864799, 781667, 712655, 655318, 608016, 569125, 537111, 511321, 491492, 476369, 463987, 453551, 445836, 441392, 439550, 439650, 442106, 447517, 455474, 464579, 472829, 477666, 476756, 469407, 456701, 440115, 420878, 400675, 381577, 364650, 349648, 336542, 326248, 319318, 315063, 312723, 312485, 314599, 318533, 323895, 331385, 341994, 356063, 373782, 395535, 420450, 445006, 464160, 473822, 472122, 459302, 437566, 410616, 382249, 355097, 330642, 309718, 292429, 278228, 266786, 258481, 253700, 252250, 253933, 259085, 268035, 280695, 297224, 318507, 345217, 376656, 410646, 443768, 471267, 487867]
56925D87867K186j2208k3532l0431l2884l1971k9829k8189k6770k4097j9940j5774
56913B14428j2819j0886r290p793o460n415m841m588m013k929k152k231k315j495
56899A37201m26k02k55Q19K860M371M921N481O549P786R482J2464J6504K0438
56885B27993K3808K6564K7280K3858J6439P758K00n800j0269j2687j3063j2326
56873B99755j0926q546n528k912o82K388O671J1186J5478K0313K6046L2156L8765
56860D24164M6676N5087O0989O1434N4998M1024K0052m123k5249l9098m5874m7647
56848F02433m5568m0552l4318k7908k0687j2225l670M032J1610J9915K8548L7394
56836E19004M7797O0589P4395Q7166R7421J02080R5283P2691L6841l653l9949
$$ y = [487867, 490053, 477845, 454313, 423882, 390998, 359027, 329198, 301009, 274239, 250142, 230202, 214428, 201609, 190723, 181433, 173640, 167180, 161765, 156924, 152336, 148323, 145394, 143242, 141011, 138696, 137201, 136775, 136573, 136318, 137137, 139997, 144368, 149289, 154770, 161319, 169105, 178587, 191051, 207555, 227993, 251801, 278365, 305645, 329503, 345942, 353700, 353900, 348100, 337831, 325144, 312081, 299755, 288829, 280283, 274755, 271843, 271161, 273549, 280220, 291406, 306884, 327197, 353243, 385399, 424164, 470840, 525927, 586916, 648350, 703348, 744372, 764424, 760301, 735052, 695954, 650080, 602433, 556865, 516313, 481995, 454087, 433400, 421175, 417505, 421537, 433147, 453062, 481610, 519004, 566801, 627390, 701785, 788951, 886372, 988452, 1083735, 1156426, 1193267, 1189614, 1149665]
56825A149665o6900q2856q8576q6646q0110p0890o0024m8761l8238k8538j9156
56814D78970j0089j484P179J6509K6343L6448M7325N9064O9572P4899P1201N6352
56802I32289L1133J16k9555n2003o5491p1357p1284o6620n9130n0682m2243l4121
56790D21052k6659j9915j3319o680p91L911Q505J4289K1042K7629L3391L7507
56778D99962L7702L1444J8580J844j5092k9281l8893m3433m3758m1300l7279l2804
56766C07692k8889k5671k2350j8586j5210j2831j0810q509o556n737n551n081
56754A41911m494m413m482l938k986k396k206k012j973k343k537j948j135j040
56740A04008j472j546j157q03n04n4J17m13j014q56k96k50n89m73J19N15O30Q09
$$ y = [1149665, 1082765, 999909, 911333, 824687, 744577, 673687, 613663, 564902, 526664, 498126, 478970, 468881, 467397, 474576, 491085, 517428, 553876, 601201, 660265, 729837, 804736, 875937, 932289, 963422, 963538, 933983, 881980, 816489, 745132, 673848, 607228, 548098, 497416, 455173, 421052, 394393, 374478, 361159, 354479, 353688, 357599, 366104, 380393, 401435, 429064, 462455, 499962, 537664, 569108, 587688, 589532, 574440, 545159, 506266, 462833, 419075, 377775, 340496, 307692, 278803, 253132, 230782, 212196, 196986, 184155, 173345, 164836, 158280, 152543, 146992, 141911, 137417, 133004, 128522, 124584, 121598, 119202, 116996, 114984, 113011, 110668, 108131, 106183, 105048, 104008, 102536, 100990, 99833, 99030, 98526, 98472, 98589, 98176, 97162, 96306, 96010, 95760, 95171, 94698, 94817, 95332, 95962, 96771]
56722I6771P36j27j174j165j0J075J259Q70M92K95L15N18O28M85L98N49N71L16
56704A02802L92J101J571J028J16j45j34q55j981k131r35N59J454J744J644J271
56688A07501J014J225J553J434J036R50J207J422J528J571J188K12o71p11j35
56673A20324M10Q33J220J166N38J36O03J294J297Q80Q29J140J497K113K904K795
56657A39979J270k42j90Q08J123O82N59P05J88p71r89l99j33o61j391j964k395
56640A36179k324j578j056j452j752p23P52Q24l93j254j381j711k066j264L06
56625A21107P57l17j240r94l61Q7Q31J693J561N07J43J010J653J096L39M41Q96
56608A29209R46Q34Q34M62l50p34l67j17m75o92k62J81J67K17O28P72M48N27J412
$$ y = [96771, 97507, 97380, 96206, 95041, 95031, 96106, 97365, 98235, 98727, 99022, 99337, 99855, 100483, 100968, 101366, 101915, 102486, 102802, 103194, 104295, 105866, 106894, 107010, 106865, 106731, 105876, 103895, 101764, 100829, 101388, 102842, 104586, 106230, 107501, 108515, 109740, 111293, 112727, 113763, 114713, 115920, 117342, 118870, 120441, 121629, 121841, 121170, 120459, 120324, 120734, 121567, 122787, 123953, 124491, 124627, 125230, 126524, 127821, 128701, 129530, 130670, 132167, 134280, 137184, 139979, 141249, 141007, 140817, 141625, 142748, 143430, 143989, 144694, 144882, 144111, 143122, 142723, 142590, 141929, 140538, 138574, 136179, 133855, 132277, 131221, 129769, 128017, 127294, 128046, 128870, 128477, 127223, 125842, 124131, 122065, 120801, 121107, 121864, 121547, 120307, 119313, 118952, 119039, 119870, 121563, 123124, 123631, 123774, 124784, 126437, 127533, 127872, 128313, 129209, 130155, 130989, 131823, 132285, 131935, 131201, 130834, 130717, 130242, 129550, 129288, 129469, 129636, 129853, 130481, 131253, 131701, 132228, 133640]
56589A33640K154J941J288R57Q85R07J343K047K058J000k34q03q98p80j03J093
56573A46495J922J937J755J747J321K56m32P5J125J668J677J761K142K821L944
56558A70214N391O590P176P146O282M437K483J710K013K041J379J066J523J676
56544B21127R67N48J296K124J640L88l6O10J022K52j232k319k418j834j308j104
56528B19723q09l43n67j928l129k514n14Q22O69R8j23n33j464k203k367k527k916
56511A99375k951k526k311k311j686n14q0p78j343r13l26n37j208j661j856j679
56495A76695p52M06M95n53j230p74k61n58r11n08J23L21M14O16K64q05j555j346
56477A70081q91p26k71P03J269J036J068J963K568J877P56M80Q36R01N51Q3n17
$$ y = [133640, 135794, 137735, 139023, 139980, 140865, 141772, 143115, 145162, 147220, 148220, 147986, 147183, 146285, 145505, 145402, 146495, 148417, 150354, 152109, 153856, 155177, 155433, 155001, 155076, 156201, 157869, 159546, 161307, 163449, 166270, 170214, 175605, 182195, 189371, 196517, 202799, 207236, 209719, 211429, 213442, 215483, 216862, 217928, 219451, 221127, 222094, 222642, 223938, 226062, 227702, 228090, 228054, 228664, 229686, 229938, 228706, 226387, 223969, 222135, 220827, 219723, 218914, 218571, 218004, 216076, 212947, 210433, 209919, 210741, 211410, 211508, 211385, 210852, 209388, 207185, 204818, 202291, 199375, 196424, 193898, 191587, 189276, 187590, 187076, 186996, 186218, 184875, 183962, 183636, 183099, 181891, 180230, 178374, 176695, 175943, 176349, 176844, 176291, 175061, 174287, 174026, 173468, 172557, 172049, 172172, 172493, 172907, 173523, 173787, 172982, 171427, 170081, 169190, 168464, 168193, 168896, 170165, 171201, 172269, 174232, 176800, 178677, 179433, 179913, 180749, 181650, 182201, 182284, 181767]
56460A81767r55n42M98R35M86L02Q25R50J44m67k15r9p14r40l2Q53P06L30N38
56441A84370O34K23N07K033L128K533J631J970K472J468j78n30K02M22j2o8K40
56424B01045K61M05J332K241K090J628K121K933K545J242N98Q63R46N27K54K53
56408B21284J05n7N0%m75n99O0M40k17p29J26J265R67l16r62r71j480k315k344
56389B13832j693j372j234l91P89J164Q18P18Q70O42L95R10J699J662R32L85M8
56372B20174l62j74J039J951J163m15r16l81j83l29K36J287J561J031P99R90P84
56355B28255J80j34k49n86o47J07Q25N52K7L13O89P1n64L80K164K696J767Q29
56337B36675L50j24o7J155K275J712M70O92J982K229J500J852L453M218L438K665
$$ y = [181767, 180812, 180270, 180768, 181703, 182189, 182491, 183316, 184266, 184410, 183943, 183728, 183629, 182915, 181975, 181943, 182796, 183502, 183832, 184370, 185004, 185227, 185734, 187767, 190895, 193428, 195059, 197029, 199501, 200969, 200791, 200261, 200463, 200885, 200873, 200805, 201045, 201306, 201711, 203043, 205284, 207374, 209002, 211123, 214056, 216601, 217843, 218441, 219304, 220250, 220777, 221031, 221284, 221389, 221332, 221382, 221382, 220907, 220308, 220368, 220808, 220591, 219862, 219988, 221253, 222220, 221904, 220942, 219971, 218491, 216176, 213832, 212139, 210767, 209533, 209142, 209931, 211095, 211913, 212631, 213501, 214143, 214538, 215448, 217147, 218809, 219741, 220126, 220174, 219812, 219638, 220677, 222628, 223791, 223376, 222460, 222079, 221896, 221567, 221803, 223090, 224651, 225682, 226481, 227471, 228255, 228435, 228301, 228052, 227466, 226819, 226926, 227751, 228303, 228330, 228643, 229332, 229403, 228839, 229219, 231383, 234079, 235846, 236675, 237025, 236901, 236834, 237989, 240264, 241976, 242446, 243138, 245120, 247349, 248849, 250701, 254154, 258372, 261810, 264475]
56321B64475K656K395J603J442K125K416J888J456J386J076Q59J581K411J743
56307B89512K59L06K046L178K810K637L635M478M201L779M083M482M398M219L997
56292C38020L174K070J691J847J500J075J979L772M444L829M002N706P107O892
56278C87108O091N899O012O029O371O998P173P097P752Q786Q692P547P183Q244
56264D86982R444J0281J1938J4695J6979J7938J8831K0884K3755K6886L0471L4456
56252G23540L8395M2774M8601N5423O1770O7733P4888Q3430R1700R8801J05278
56241A492333J10916J14367J15291J14489J11573J05031R4904Q2847O9260N3020
56231B464031L4350J5218l471k2273m0418n5639o7311p6941q5033r0438r3266
$$ y = [264475, 267131, 269526, 271129, 272571, 274696, 277112, 279000, 280456, 281842, 282918, 283777, 285358, 287769, 289512, 289771, 290077, 292123, 295301, 298111, 300748, 304383, 308861, 313062, 316841, 320924, 325406, 329804, 334023, 338020, 341194, 343264, 344955, 346802, 348302, 349377, 351356, 355128, 359572, 363401, 367403, 373109, 380216, 387108, 393199, 399098, 405110, 411139, 417510, 424508, 431681, 438778, 446530, 455316, 464008, 471555, 478738, 486982, 496426, 506707, 518645, 533340, 550319, 568257, 587088, 607972, 631727, 658613, 689084, 723540, 761935, 804709, 853310, 908733, 970503, 1038236, 1113124, 1196554, 1288254, 1387055, 1492333, 1603249, 1717616, 1832907, 1947396, 2058969, 2164000, 2258904, 2341751, 2411011, 2464031, 2498381, 2513599, 2510128, 2487855, 2447437, 2391798, 2324487, 2247546, 2162513, 2072075, 1978809]
56220A978809r5252r6535r5260r1233q6811q3209p9013p3409o7766o2905n7901
56209A089515n2681m8827m6541m3815l9727l5762l2820k9875k6585k4124k2347
56198F86411j9387j5255j2522j2123j1777r973q220p729p219n768m684m724m470
56185E62560l172k281k486k204p33J55n64j324j053j004j799j796k95O55k75j352
56169E43032q85J45L76L65P74Q97O68J391L097L939L507L670M943N473M891N426
56153E81709P593Q719P643O985Q538J0251J0183R800J0830J2356J3413J5183J8213
56140G21416K0832K2483K5304L0313L5814M1469M9893O1853P4038Q4043R3181
56129A260639J01683J05662J02176R3270Q1974O8695N4681M4378M0096L8200L4414
$$ y = [1978809, 1883557, 1787022, 1691762, 1600529, 1513718, 1430509, 1351496, 1278087, 1210321, 1147416, 1089515, 1036834, 988007, 941466, 897651, 857924, 822162, 789342, 759467, 732882, 708758, 686411, 667024, 651769, 639247, 627124, 615347, 605374, 597154, 589425, 582206, 576438, 571754, 567030, 562560, 559388, 557107, 554621, 552417, 551684, 551839, 551275, 549951, 548898, 547894, 546095, 544299, 544004, 544659, 544384, 543032, 542147, 542292, 542668, 543033, 543807, 544704, 545372, 546763, 549860, 553799, 557306, 560976, 565919, 571392, 576283, 581709, 589302, 598021, 605664, 612649, 621187, 631438, 641621, 651421, 662251, 674607, 688020, 703203, 721416, 742248, 764731, 790035, 820348, 856162, 897631, 947524, 1009377, 1083415, 1167458, 1260639, 1362322, 1467984, 1570160, 1663430, 1745404, 1814099, 1868780, 1913158, 1953254, 1991454, 2025868]
56118B025868K9023K3341J5502M281o769j3591j6938j9514k1406k2599k6425l5823
56106A934950m8861o1853p3856q4393r0408q9925q5600q0468p3359o2596n0802
56095A132829m1553l4382k7323k1234j7311j3591q292l580j823j257N56K351K341
56082I67731K285M071N828N707N807Q083J0115R518Q528R646J0824R777Q838J0502
56068A077260J2356J1733J1117J3483J6460J6745J6096J7211J8007J5946J3802
56057A240216J4904J6758J5624J3267J2978J3198J1513J0578J3311J6589J6547
56046A395483J5724J7910K0582J9867J8483K0845K4668K5393K4697K6473K8645
56035A638770K7402K5571K8085L2958L5206L5906L8860M2221M2208M1131M3044
$$ y = [2025868, 2054891, 2078232, 2093734, 2098015, 2091246, 2077655, 2060717, 2041203, 2019797, 1997198, 1970773, 1934950, 1886089, 1824236, 1750380, 1665987, 1575579, 1485654, 1400054, 1319586, 1246227, 1183631, 1132829, 1091276, 1056894, 1029571, 1008337, 991026, 977435, 969143, 965563, 963740, 962483, 963039, 965390, 967731, 970016, 974087, 979915, 985622, 991429, 999512, 1009627, 1019145, 1027673, 1037319, 1048143, 1057920, 1066758, 1077260, 1089616, 1101349, 1112466, 1125949, 1142409, 1159154, 1175250, 1192461, 1210468, 1226414, 1240216, 1255120, 1271878, 1287502, 1300769, 1313747, 1326945, 1338458, 1349036, 1362347, 1378936, 1395483, 1411207, 1429117, 1449699, 1469566, 1488049, 1508894, 1533562, 1558955, 1583652, 1610125, 1638770, 1666172, 1691743, 1719828, 1752786, 1787992, 1823898, 1862758, 1904979, 1947187, 1988318, 2031362]
56024B031362M5553M4803M4030M7902N3084N4116N3870N7918O3354O4000O2168
56013B622160O4138O8242O8823O7773P0622P5299P6471P6860Q2414R0470R4752
56002C458024R7682J05383J15257J21200J26118J36008J47041J52419J56366J66847
55992D782345J80177J88276J95079K09363K27380K39884K50352K68225K90191
55983F831272L07198L23789L50454L83065M10874M38552M78038N25177N68125
55974A0616544O12381O72500P45503Q18917Q98358R99259J118723J245482J390027
55965A9117694J572857J791746K035966K323884K688826L139200L676098M338813
55957D0685084N185026O239683P519481R094621J1064827J3493340J6438690K0024279
$$ y = [2031362, 2076915, 2121718, 2165748, 2213650, 2266734, 2320850, 2374720, 2432638, 2495992, 2559992, 2622160, 2686298, 2754540, 2823363, 2891136, 2961758, 3037057, 3113528, 3190388, 3272802, 3363272, 3458024, 3555706, 3661089, 3776346, 3897546, 4023664, 4159672, 4306713, 4459132, 4615498, 4782345, 4962522, 5150798, 5345877, 5555240, 5782620, 6022504, 6272856, 6541081, 6831272, 7138470, 7462259, 7812713, 8195778, 8606652, 9045204, 9523242, 10048419, 10616544, 11228925, 11901425, 12646928, 13465845, 14364203, 15363462, 16482185, 17727667, 19117694, 20690551, 22482297, 24518263, 26842147, 29530973, 32670173, 36346271, 40685084, 45870110, 52109793, 59629274, 68723895, 79788722, 93282062, 109720752, 129745031]
55949A29745031K4370320K9451416L5056228M0680592M5080485M5931563M0592894
55942C90908529K8013225J0153868q714166k4403827l4770580l9851199m0790935
55935B80544915l8908843l5370731l1105354k6725619k2561334j8801299j5562592
55928I1509143j2861376j0630199q800642p329209o154798n196585m403317l759173
55920C2373844l239178k801803k426418k117064j865871j647872j453237j291015
55912A5531386j158943j039942r29710q38772p65758o95705o26081n68731n24648
55903H383096m81199m35828l99114l72490l45025l14213k89086k70795k50065
55894E225281k25874k07557j96362j83065j65845j52897j45363j34658j18895
$$ y = [129745031, 154115351, 183566767, 218622995, 259303587, 304384072, 350315635, 390908529, 418921754, 429075622, 420361456, 395957629, 361187049, 321335850, 280544915, 241636072, 206265341, 175159987, 148434368, 125873034, 107071735, 91509143, 78647767, 68017568, 59216926, 51887717, 45732919, 40536334, 36133017, 32373844, 29134666, 26332863, 23906445, 21789381, 19923510, 18275638, 16822401, 15531386, 14372443, 13332501, 12402791, 11564019, 10798261, 10102556, 9476475, 8907744, 8383096, 7901897, 7466069, 7066955, 6694465, 6349440, 6035227, 5746141, 5475346, 5225281, 4999407, 4791850, 4595488, 4412423, 4246578, 4093681, 3948318, 3813660, 3694765]
55885C694765j05682r6528q4021o6672n1357l8988k2377n73J8815L3343M7745
55874C328470O0255O0959M6581K4093k600l6564p5945j10974j36280j54917j67674
55863B835404j69938j61919j50940j40587j27750j12562j00610r2819q3612p1598
55853A623069o2183n7124n1603m4118l9409l8909l7857l4579l3285l5003l4951
55842A154048l1673k9788l0865l0385k6585k3675k3460k2225j8811j7392j9207
55831H79982j9671j6758j4412j4694j4243j1506r860j0564j0124p591p059r866
55819G33634j1758j0757j0562j2986j4337j2673j1399j2214j1513p569m429m683
55807F08754m841j998J072J558J540L241M707M259M123N797O608M438J362p45
$$ y = [3694765, 3589083, 3492555, 3408534, 3341862, 3290505, 3251517, 3229140, 3228567, 3247382, 3280725, 3328470, 3388725, 3449684, 3496265, 3520358, 3517758, 3481194, 3405249, 3294275, 3157995, 3003078, 2835404, 2665466, 2503547, 2352607, 2212020, 2084270, 1971708, 1871098, 1778279, 1694667, 1623069, 1560886, 1503762, 1452159, 1408041, 1368632, 1329723, 1291866, 1257287, 1224002, 1188999, 1154048, 1122375, 1092587, 1061722, 1031337, 1004752, 981077, 957617, 935392, 916581, 899189, 879982, 860311, 843553, 829141, 814447, 800204, 788698, 778838, 768274, 758150, 750559, 743500, 733634, 721876, 711119, 700557, 687571, 673234, 660561, 649162, 636948, 625435, 617866, 613437, 608754, 603913, 601915, 602987, 604545, 606085, 609326, 614033, 618292, 622415, 628212, 634820, 639258, 640620, 639875]
55793F39875l556q164j2147j3737j4533j5405j4334j0937q259p486n814k274n73
55780E22656l052o729q479r324j0468r880o299k200N72L940R254J4054J6169J6717
55766E26931J6020J1126J061r668j6441j9723k1734k1920j9406j6220j4343j2583
55754D03100r688p357p112p330o399n662o374o947o143n725p025q099p149n631
55740C06459n095m254k107o14j195j813o67L08j039l068l231k217k003k272j986
55725B75206k128l755n492n769n443n627n328l720k296k232k058m95J021J257
55711B33141J863M362O967P369O283N485M581K570L79r30k352m689o349o039n455
55696B47186o506q024p949o786o167n878m997m123l981l551j990n83n59q76l53
$$ y = [639875, 636319, 628155, 616008, 602271, 587738, 572333, 557999, 547062, 538803, 531317, 525503, 523229, 522656, 519604, 512875, 504396, 495072, 484604, 474724, 468425, 466225, 466797, 470737, 479991, 494045, 510214, 526931, 542951, 554077, 555138, 545470, 529029, 509306, 487572, 465652, 446246, 430026, 415683, 403100, 393412, 386055, 378943, 371613, 365214, 359552, 353178, 346231, 340088, 334363, 327338, 319239, 312090, 306459, 301364, 297110, 295003, 294389, 293194, 291381, 290714, 291022, 289983, 286915, 283684, 281467, 279464, 277192, 275206, 273078, 269323, 263831, 258062, 252619, 246992, 241664, 237944, 235648, 233416, 231358, 230863, 231884, 233141, 235004, 239366, 246333, 253702, 259985, 265470, 270051, 272621, 273000, 272070, 269718, 265029, 258680, 252641, 247186, 240680, 232656, 224707, 217921, 211754, 205876, 200879, 196756, 192775, 189224, 187234, 186651, 186092, 185216, 184863]
55681A84863J33k37j98J207K477K299J974K680K819Q25j660k361k008k430l075
55666A87308k489j453j541k029j270K53R84J130J763K465K376K322L395M666M639
55651B02519L691K933K087O89j83L45R43L1j747l011l946n093n638n043m580n061
55635A78936n076l657k519l190m111l329j933j882k435j854q37j015j662j120
55621A44316p4k79j293j523j299j834k425j752q22j370k502k033k82O52N33P18
55605A28731J005l0j983k930k504k020j844j272n57n48p98l64J39l53r81k89Q91
55588A14293O26p50j204m46J5j52J77J031J203N77K15J59n05j503j559o25R8K55
55570A11905N29R45R27P02Q75J057O56L76J075J912J619P74O84R00J11j232j613
$$ y = [184863, 184996, 184759, 184561, 185768, 188245, 190544, 192518, 195198, 198017, 198842, 197182, 194821, 192813, 190383, 187308, 184819, 183366, 181825, 179796, 178526, 178779, 179763, 180893, 182656, 185121, 187497, 189819, 193214, 197880, 202519, 206210, 209143, 211230, 211919, 211736, 212081, 213024, 213055, 211308, 208297, 204351, 199258, 193620, 188577, 183997, 178936, 173860, 170203, 167684, 164494, 160383, 157054, 155121, 153239, 150804, 148950, 148113, 147098, 145436, 144316, 144242, 143963, 142670, 141147, 139848, 138014, 135589, 133837, 133015, 131645, 129143, 127110, 126828, 127480, 128013, 128731, 129736, 129706, 127723, 124793, 122289, 120269, 118425, 117153, 116596, 116048, 115250, 114886, 115025, 114672, 113691, 113402, 114293, 114919, 114169, 112965, 112519, 112534, 112382, 112559, 113590, 114793, 115370, 115585, 115744, 115239, 113736, 112177, 111552, 111650, 111905, 112434, 113379, 114306, 115008, 115883, 116940, 117596, 117972, 119047, 120959, 122578, 123352, 124036, 124936, 125047, 123815, 122202]
55553A22202j123j095j637j765j481j457j298l40N02qj063j029k53k03o08j50
55537A09194O68K42j022j203k21J36o20j166j055j215j711j534p37l87m28Q6P44
55520I9771K58r22j073k02op81j026l36qm17m08K34K37o52r59p1P46N90K22L63
55500I5560N64M29K73J01n54j454j884k159l175m467m471k870r40M36J312J441
55484G8142N11m58p7J052J063p1m72N14J409J241Q04P49N73Q3k7L10K60k19j36
55465H5251O46R75L23n34j004j242j095j51R90J223P84Q34J343J233N59M27P41
55448I1303K60r61j404o56M4J14L18P76N36m09p75k44L9l51m42P4K52j57j80L88
55428H8525M86j33l98K3J66j68J8P36O52l66n78Q48K469K970K904L059K990K297
$$ y = [122202, 121079, 119984, 118347, 116582, 115101, 113644, 112346, 112006, 112508, 112500, 111437, 110408, 110155, 109952, 109344, 109194, 109862, 110104, 109082, 107879, 107658, 107794, 107174, 106008, 104953, 103738, 102027, 100493, 99756, 99369, 98941, 99027, 99771, 100029, 99107, 98034, 97832, 97826, 97045, 96019, 95683, 95675, 95258, 94850, 95084, 95321, 94669, 93710, 93639, 94385, 94975, 95197, 95560, 96124, 96553, 96826, 96927, 96373, 94919, 93035, 90876, 87701, 83234, 78763, 75893, 74953, 75389, 76701, 78142, 78653, 78195, 78118, 79170, 80233, 80162, 79690, 80204, 81613, 82854, 83658, 84407, 84980, 85063, 85036, 85346, 85606, 85387, 85251, 85897, 86872, 87195, 86661, 85657, 84415, 83320, 83169, 84159, 85382, 86166, 87000, 88343, 89576, 90135, 90562, 91303, 91563, 90602, 89198, 88542, 88586, 88700, 89018, 89794, 90330, 89921, 89146, 88902, 88941, 88590, 88148, 88222, 88474, 88317, 88137, 88525, 89011, 88878, 88480, 88503, 88669, 88501, 88519, 89255, 89907, 89541, 88963, 89811, 92280, 95250, 98154, 101213, 104203, 106500]
55410A06500J633J401R96J40n35q53j371j814j165J39K20j302k462j974j002q61
55394I7690j077r34r86j635j948j267n39p25j293j370j045n83K83J333J605J027
55378H8536Q01J286J165l25j955k377j933j495j009k56K89M15O62J068P85k26
55362H5431p18k50n1q44j475r01Q2M05M99J075J517R44j14n10j08M52Q27J011
55344H7272R04N54P2q09k137k757j490P34J697J060O20J113J162J17n96j30J32
55327H7518r21k085j859o91K77J001J642J526N51k9M39P99K47j65M09Q61J24p82
55309H8862n79J7k36p70l65N29N69k27p68o64k72K42O43L70l52l09P86J493Q68
55290H9837n3j57Jk72l44J65J40r56j509l12J083P06o38r17j80R7j30J67P38M83
$$ y = [106500, 108133, 109534, 110530, 110670, 110135, 109282, 107911, 106097, 104932, 105071, 105291, 103989, 101527, 99553, 98551, 97690, 96613, 95679, 94693, 93058, 91110, 89843, 89304, 88579, 87286, 85916, 84871, 84288, 84571, 85904, 87509, 88536, 89337, 90623, 91788, 91463, 89508, 87131, 85198, 83703, 82694, 82438, 82727, 83142, 83804, 84872, 85657, 85431, 84713, 84463, 84412, 83568, 82093, 81192, 81274, 81679, 82178, 83253, 84770, 85714, 85600, 85090, 84982, 85434, 86261, 87272, 88176, 88730, 88802, 87993, 85856, 83099, 81609, 82343, 84040, 85100, 85720, 86833, 87995, 88112, 87516, 87386, 87518, 86597, 84512, 82653, 81962, 82239, 83240, 84882, 86408, 86959, 86930, 87369, 88168, 88415, 88250, 88659, 89520, 89644, 88862, 88283, 88300, 88064, 87294, 86929, 87458, 88027, 87800, 87032, 86368, 86096, 86338, 86981, 87351, 86999, 86690, 87476, 88969, 89837, 89784, 89627, 89628, 89356, 89012, 89177, 89317, 88361, 86852, 86540, 87623, 88329, 87691, 86774, 86594, 86691, 86561, 86728, 87466, 87949]
55270H7949l44o15m75q29j286p72L58Q58P94J152J722J451N79L17O41M43k89m20
55252I1234J94M31j62p86q87p11l79K42P39N39rj00J80J80KK32O88O79J89l34
55232I2161r13j592j627m74R51J357Q96O00N58J79l16k35J72J03l10l73k27m54
55214I0456p51n23k08n23q71k24Q32P61m25j113n17N17J139J406J463J211R09
55197I3539Q96P77J1q36p51J6J92n61j201q72J27R70J074L60n68q31m27l03o73
55178I0939l92J030K088J375k36j073j160j405j436m61O20K97q34q19N73J716
55162I0822J925K027K271J886R55N50P29L65p22j373j100p16o02j93M59L90n46
55145I7127j243j054n23j03L72O93L16l65k48O79J224Q60L01N5j37k88j05k4p42
$$ y = [87949, 87605, 86990, 86515, 85686, 84400, 83628, 83986, 84844, 85638, 86790, 88512, 89963, 90542, 90859, 91500, 91943, 91654, 91234, 91428, 91859, 91697, 90911, 90024, 89313, 88934, 89176, 89915, 90454, 90445, 90345, 90525, 90705, 90707, 90939, 91627, 92306, 92495, 92161, 91248, 89656, 88029, 87555, 88506, 89863, 90759, 91359, 91917, 92096, 91780, 91545, 91717, 91820, 91510, 91137, 90910, 90456, 89705, 89182, 88974, 88451, 87580, 87356, 88188, 88949, 88524, 87411, 86894, 87411, 88550, 89956, 91419, 92630, 93539, 94435, 95212, 95223, 94387, 93636, 93652, 93844, 93283, 92082, 91210, 91337, 92307, 93381, 93741, 93173, 92342, 91915, 91612, 90939, 90547, 91577, 93665, 95040, 94804, 93731, 92571, 91166, 89730, 89269, 89889, 90186, 89352, 88533, 89106, 90822, 92747, 94774, 97045, 98931, 99886, 100436, 101165, 101530, 100808, 99435, 98335, 97619, 97017, 96824, 97283, 97673, 97127, 95884, 94830, 94307, 94204, 94576, 95269, 95585, 95220, 94972, 95651, 96875, 97735, 98036, 98091, 97954, 97666, 97561, 97537, 96795]
55126I6795j666j445j75O85O70P14J039O37o21j376r46l29k78j07P03J319R46
55109I6565J10l15k78j2N18J014P94j45r35j062p48k2J220K137J541r7q90k35
55091I9160L90j31r49r12j88O06J467K240K163J115J73L9N5n18j282j588j489
55074A00351j121k07J113J996K025J672J154J08j198j643r50k42l05n72n06n18
55058A01157p43l64Q20J594J099J67j72l16r86j690j575q64k34L75J216J787J572
55041A02843J017P10L67m01j027q05j24J37q0k70l88o93r51p30j25M28P11O00
55023A01219p8j047j516j173o55n57o65n66k96L1M62P14L59j39L19J678K406J665
55005A02161O60Q40J853K312J676M03r61j873j725o52K24K32O1M45Q37M14m65
$$ y = [96795, 95129, 93684, 93509, 94194, 94864, 95578, 96617, 97254, 96633, 95257, 94311, 93982, 93704, 93597, 94300, 95619, 96565, 96675, 96360, 96082, 96070, 96588, 97602, 98396, 98251, 97316, 96254, 95506, 95484, 96704, 98841, 100382, 100285, 99395, 99160, 99550, 99419, 98470, 97558, 97370, 97976, 99443, 101683, 103846, 104961, 105134, 105173, 105228, 104710, 103428, 101840, 100351, 99230, 99023, 100136, 102132, 104157, 105829, 106983, 107091, 105893, 104250, 103300, 103058, 102753, 102181, 101675, 101157, 100414, 100050, 100870, 102464, 103563, 103730, 103558, 103242, 102256, 100566, 98991, 98127, 97893, 98268, 99484, 101271, 102843, 103860, 104570, 104937, 104536, 103509, 102704, 102580, 102717, 102637, 102367, 101979, 101286, 100335, 99605, 99480, 99908, 100619, 101219, 101141, 100094, 98578, 97405, 96750, 96193, 95528, 94962, 94666, 94697, 95159, 95873, 96232, 96093, 96412, 98090, 100496, 102161, 102821, 103661, 105514, 107826, 109502, 109905, 108944, 107071, 105346, 104694, 104918, 105150, 105211, 105656, 106493, 106907, 106442]
54988A06442q72p64o54n47k47j66o90j181p43L93J270J577J666J558R73J42l13
54971A07844k10J71O11Q94O54l6l62J79R21J003O96Q43J373J448Q24Q2l81o22
54953A15932m80L89J605K067J248q8q00p34p50j488k416k439j350k08M8j99l6
54936A10301M82O50O20J293K657L433K855J699J046J070J475K227L294M469N844
54921A43415P599R078R168Q020P046O692N550K558j224m067n633o495o761o385
54907A68561n967n977n842m932l770l120k659j703o22l20p74j248j474j572j306
54892A27275m77L28M48J38J1J4o0K78J485K975L962M704N758O632O519N886N870
54875A71746O421O423N449M006K169m91l549n664o273o262o624p313p657p179
$$ y = [106442, 105570, 104806, 104152, 103605, 103358, 103192, 102502, 101321, 100578, 100971, 102241, 103818, 105484, 107042, 108015, 108157, 107844, 107634, 107805, 108416, 109310, 109964, 109928, 109566, 109745, 110666, 111669, 112365, 113208, 114581, 116029, 116853, 116935, 116554, 115932, 115452, 115841, 117446, 119513, 120761, 120673, 119873, 119139, 118389, 116901, 114485, 112046, 110696, 110488, 110536, 110337, 110301, 110783, 111433, 112053, 113346, 116003, 119436, 122291, 123990, 125036, 126106, 127581, 129808, 133102, 137571, 143415, 151014, 160092, 169260, 177280, 184326, 191018, 196568, 199126, 197902, 193835, 188202, 181707, 174946, 168561, 162594, 156617, 150775, 145843, 142073, 138953, 136294, 134591, 133969, 133649, 132875, 131627, 130153, 128581, 127275, 126798, 127126, 127574, 127712, 127723, 127737, 127677, 127955, 129440, 132415, 136377, 141081, 146839, 153471, 159990, 165876, 171746, 178167, 184590, 190039, 194045, 196214, 195723, 192174, 186510, 180237, 173975, 167351, 160038, 152381, 145202]
54861A45202n848m222l312l602m232l899k456q98N4M17K01p04j773j998j130P
54845A11807N83N39J49m57j087j344j087o22l00j73j31j31k64p01j388j726j088
54828A02579K12R57N04m18p77n31j81K18P99J123O47l37j030j150r71n98mN15
54810A01557O38N87P80J132J284J207J080Q91P13Q53J229J177N43K03P09J216
54794A15799P28k59n07R7O26O68N45L33j73o73o95m77n26m95L46J750K688K803
54776A22578K565K266J942K086L123M296M407L681L615M854O524P753Q541Q817
54762A87048P970N918L551J579k21k211m154n725o970p811p836o938n713m843
54748A53644m510m526m496l911k627j255m23J38J033J909J798P37j09n9L38N04
$$ y = [145202, 139354, 135132, 131820, 128218, 123986, 120087, 117631, 116733, 116787, 117204, 117405, 116701, 114928, 112930, 111800, 111807, 112390, 112929, 113078, 112621, 111534, 110190, 109103, 108481, 108181, 108008, 107877, 107746, 107482, 106781, 105393, 103667, 102579, 102791, 103748, 104252, 103834, 103057, 102526, 102345, 102563, 103362, 104485, 105132, 104795, 103765, 102615, 101644, 101046, 101042, 101557, 102195, 102782, 103562, 104694, 105978, 107185, 108265, 109156, 109869, 110722, 111951, 113128, 113671, 113874, 114583, 115799, 116527, 116268, 115761, 115858, 116484, 117152, 117697, 118030, 117857, 117184, 116489, 116012, 115486, 114991, 115337, 117087, 119775, 122578, 125143, 127409, 129351, 131437, 134560, 138856, 143263, 146944, 150559, 155413, 161937, 169690, 178231, 187048, 195018, 200936, 204487, 206066, 205845, 203634, 199480, 193755, 186785, 178974, 171138, 164200, 158487, 153644, 149134, 144608, 140112, 136201, 133574, 132319, 131896, 132034, 133067, 134976, 136774, 137511, 137402, 137343, 137681, 138185]
54732A38185O99J272J928K285K522K949L537M157M842N533O031O379O729O741
54718A93789N708L455N94k180m475n945o411o289o238o281n971n355m942m702
54704A44757m062l046k420k429k366j748j094r61j052q72o07p12j105j324j178
54689A19781p91l14P3J21j64m02k01M28J112J365Q52k10j075j215r31q73j152
54672A16404j417j532j543j222l80N21P79L98o8l57n10l62J29L31k31p88k56Q71
54654A10767J043R4l70N05J516J379O28M54P50N83n3k40L03P99N75j16o04n92
54636A17421k68R7M35P71R12N24l04r24r05o70p92r98o08K21O33M67N44J324K152
54617A20032K207J531P13J02l01n82q28j005q42k43K90K37p8J19Q16J185Q62L91
$$ y = [138185, 138884, 140156, 142084, 144369, 146891, 149840, 153377, 157534, 162376, 167909, 173940, 180319, 187048, 193789, 199497, 202952, 203546, 201366, 196891, 190946, 184535, 178246, 172008, 165727, 159756, 154401, 149459, 144757, 140695, 137649, 135229, 132800, 130434, 128686, 127592, 126631, 125579, 124707, 124100, 123388, 122283, 120959, 119781, 118990, 118676, 118749, 118870, 118706, 118304, 118103, 118531, 119643, 121008, 121860, 121650, 120575, 119360, 118429, 117556, 116404, 114987, 113455, 111912, 110690, 110310, 110831, 111610, 112008, 111940, 111583, 111073, 110711, 110840, 111171, 110940, 110152, 109896, 110767, 111810, 111904, 111534, 112039, 113555, 114934, 115562, 116016, 116766, 117349, 117296, 117056, 117359, 118158, 118733, 118617, 118013, 117421, 117153, 117250, 117685, 118456, 119368, 119892, 119588, 118664, 117759, 117089, 116297, 115299, 114691, 114912, 115545, 116012, 116556, 117880, 120032, 122239, 123770, 124483, 124585, 124284, 123702, 122874, 121869, 121027, 120784, 121074, 121311, 121233, 121352, 122168, 123353, 124215, 124606]
54599A24606K33J85oj65j54n0K21P85J170O06p66j809j835j295p66r1R00J661
54581A23430J578Q26K8n05p87p86m88j7M24O09K68m79q64l01O55R63N78L29M49
54562A25910L18j51k33J92J57p92j688j599j004q59j065q63j25O30J136J470J577
54545A23011J379J116J061J040P48K51o9M2N86J334J866J942J783J630J152n4
54529A38818j507k212k000j631j501j275q91q06r63o40J69M21m24j480j736j329
54513A21013q36l00L25O12L71J72M30P20N94L01N4n36j479j799q41O19J456J718
54495A22594K025K185J555L03p03r92o56J71J152J500Q22j43m07k4K24R6LJ78
54477A29883N39J061J559J469N91k54q8R59J911K148J739R27P0k33K34P68N03
$$ y = [124606, 124839, 125024, 125018, 124853, 124699, 124649, 124870, 125655, 126825, 127431, 126665, 124856, 123021, 121726, 120960, 120869, 121769, 123430, 125008, 125834, 125862, 125357, 124570, 123784, 123296, 123279, 123703, 124312, 124580, 124101, 123237, 122936, 123591, 124554, 125132, 125461, 125910, 126228, 126077, 125844, 126036, 126193, 125401, 123713, 122114, 121110, 120251, 119186, 118323, 118198, 118828, 119964, 121434, 123011, 124390, 125506, 126567, 127607, 128355, 128606, 128537, 128579, 129165, 130499, 132365, 134307, 136090, 137720, 138872, 138818, 137311, 135099, 133099, 131468, 129967, 128692, 127801, 126995, 126032, 125392, 125561, 125982, 125558, 124078, 122342, 121013, 120177, 119877, 120202, 120814, 121185, 121357, 121787, 122507, 123101, 123402, 123456, 122920, 121441, 119642, 118801, 119420, 120876, 122594, 124619, 126804, 128359, 128662, 127959, 126967, 126311, 126482, 127634, 129134, 129956, 129813, 129406, 129382, 129606, 129702, 129705, 129883, 130422, 131483, 133042, 134511, 135102, 134848, 134760, 135719, 137630, 139778, 141517, 142444, 142514, 142281, 142515, 143283, 143786]
54460A43786m62j285j428j023m67j62k73l16M20J599J788M35j044j116k73q4p40
54443A39355j112q03n77p31o08n2Q2n96j189q69j63m9m08l20M20R03M05n09n91
54424A32588N27J790J976J109J89k79p13j369j732j396p79m45k94k8J76R5M2L26
54406A31783O19N48M36P34J227J526J889K630L160K615J240J67j01j25m06p09
54390A47233o58l41r1p4j51M1O64J165O78o92j560r32M20J063Q32O28P24M64l76
54371A49037j056r58l23L06P17Q45O24K34M7J50L08L75M56O11Q19J086J319J284
54353A55881J020J009J545K210K479K451K471K393J873J048K90m21j234j922k219
54338A68874k400k756k921k462j815j710k025k065j778j683j767j509r30o65q64
$$ y = [143786, 143324, 142039, 140611, 139588, 139121, 138959, 138686, 138370, 138790, 140389, 142177, 142612, 141568, 140452, 140179, 140095, 139355, 138243, 137440, 136863, 136132, 135524, 135472, 135554, 134958, 133769, 132900, 132737, 132688, 132280, 131960, 132380, 133283, 133688, 133179, 132588, 133115, 134905, 136881, 137990, 138179, 137900, 137187, 135818, 134086, 132690, 131911, 131466, 131172, 131144, 131320, 131415, 131457, 131783, 132402, 132950, 133386, 134120, 135347, 136873, 138762, 141392, 144552, 147167, 148407, 148574, 148473, 148348, 147942, 147233, 146575, 146234, 146143, 146069, 145918, 145959, 146623, 147788, 148466, 147774, 146214, 145282, 145702, 146765, 147597, 148225, 148949, 149413, 149037, 147981, 147023, 146700, 147006, 147723, 148568, 149192, 149426, 149473, 149623, 149931, 150306, 150762, 151373, 152192, 153278, 154597, 155881, 156901, 157910, 159455, 161665, 164144, 166595, 169066, 171459, 173332, 174380, 174670, 174249, 173015, 171093, 168874, 166474, 163718, 160797, 158335, 156520, 154810, 152785, 150720, 148942, 147259, 145492, 143983, 143053, 142388, 141524]
54323A41524r41n47RM23P16Q00M61j18m51m49m61o17p39q23r53q88m28l3k10m49
54303A35826J79J393J760O61q12j347r03l32j51k59l39j38L56P57O95L41K13M07
54285A38307N77O03O62O56K46m30p62m81O3N39R20J080P95K55l5n5k65p36r24
54266A41015n73j28k3p2P7M51Q95J308J459J077L35r7K51J155J959K053J203k01
54248A52144j277j512j316j366j577j411r60q69j213j340r18l30J37O44J072Q79
54232A40787J9o79n93j94k35n96n06K71J077J125L93l31k39N95J226Q88j13q23
54214A42072p53k37J49R5l47p58o02J28P21O53K78K35M95O99R29J349J481Q23
54196A47410l6m5O28P34j65j046r74l08J12J13J3l2p3j32l01o41r36r04o98p09
$$ y = [141524, 140583, 140036, 140045, 140468, 141184, 141984, 142445, 142327, 141876, 141427, 140966, 140349, 139610, 138787, 137834, 136946, 136518, 136485, 136275, 135826, 136005, 137398, 139158, 139819, 139007, 137660, 136757, 136425, 136274, 136015, 135676, 135538, 135894, 136651, 137346, 137687, 137900, 138307, 138884, 139487, 140149, 140805, 141051, 140621, 139859, 139378, 139441, 139980, 140900, 141980, 142775, 143030, 142995, 142940, 142675, 141939, 141015, 140442, 140314, 140291, 140219, 140296, 140747, 141642, 142950, 144409, 145486, 145821, 145724, 145975, 147130, 149089, 151142, 152345, 152144, 150867, 149355, 148039, 146673, 145096, 143685, 142725, 141856, 140643, 139303, 138385, 138055, 138192, 138836, 139908, 140787, 140806, 140127, 139534, 139340, 139105, 138509, 138003, 138274, 139351, 140476, 140869, 140538, 140299, 140894, 142120, 143008, 142895, 142072, 141319, 141082, 141231, 141326, 140979, 140221, 139619, 139747, 140468, 141121, 141399, 141634, 142129, 142828, 143757, 145106, 146587, 147410, 147374, 147329, 147957, 148691, 148526, 147480, 146506, 146198, 146310, 146423, 146436, 146404, 146331, 146199, 145898, 145257, 144321, 143417, 142719, 142010]
54176A42010r19j045j161j457j510p38M76J044P03L34N35Q42P15L95L41M97N65
54159A41627M48J18l86o49k01P06J238J083P14N13L49J69J61J47l14j034j235
54142A43454p19j55O1L30Q51J090O94R1k97o30j002r87m09J65K62J71L06N17N12
54123A44305M03M01M72O70J179J732J693J058O05O91P28K66k62m52o82j287j744
54106A49776j499r21o58n28J25J289K284K624K336J640Q00J47j75k29K6O90J403
54089A59130J406N05n75j055r17n44j38K27M65O66R96J252J071O63O43J103J575
54072A66473J997K803L862M399M293M426N282O217O524O253N464L741J124j480
54058B21378l462n125o532o859n737m170l170k465j485o63n88p57l71L73Q76J340
$$ y = [142010, 141091, 140046, 138885, 137428, 135918, 135180, 135656, 136700, 137403, 137737, 138272, 139114, 139829, 140224, 140565, 141062, 141627, 142075, 142193, 141807, 141158, 140957, 141663, 142901, 143984, 144698, 145211, 145560, 145729, 145890, 146037, 145723, 144689, 143454, 142735, 142580, 142641, 142971, 143822, 144912, 145606, 145697, 145400, 144770, 143768, 142781, 142372, 142537, 142799, 142970, 143276, 143793, 144305, 144708, 145109, 145581, 146251, 147430, 149162, 150855, 151913, 152518, 153209, 153937, 154203, 153941, 153489, 152807, 151520, 149776, 148277, 147356, 146698, 146170, 146295, 147584, 149868, 152492, 154828, 156468, 157268, 157415, 157240, 157011, 157037, 157727, 159130, 160536, 161041, 160466, 159411, 158494, 157950, 157812, 158039, 158504, 159170, 160166, 161418, 162489, 163152, 163795, 164898, 166473, 168470, 171273, 175135, 179534, 183827, 188253, 193535, 199752, 206276, 212529, 217993, 221734, 222858, 221378, 217916, 212791, 206259, 199400, 193663, 189493, 186323, 183858, 182373, 181710, 181122, 180365, 179994, 180367, 181243, 182583]
54042A82583K103K589K187J601J885K636K640K046K247L593M761M752M227M324
54028B24174N109N805N873N385M733M337M373M579M487L848K826J821J278J330
54014B79958J526J224M50j31k98o42j523k353k495k243k291k693l003l016k805
53999B59665k383j866j547j393r88l94l43j093j891k187k533l541m665m995m543
53984B25303l928l373k901k845l161k960j780o55p52j560j699j135j069j914k764
53969A92807k885k524k048j387n33K06O43P47L83l71q27l54P13J513J744J673
53953A89500J439J117J072J457J745J577J513K092K730K654K315K633L333L443
53939B18620L056L094L501L325K531K214K801L497L792M051M386M255L690L578
$$ y = [182583, 184686, 187275, 189462, 191063, 192948, 195584, 198224, 200270, 202517, 206110, 210871, 215623, 219850, 224174, 229283, 235088, 240961, 246346, 251079, 255416, 259789, 264368, 268855, 272703, 275529, 277350, 278628, 279958, 281484, 282708, 283158, 283027, 282729, 282087, 280564, 278211, 275716, 273473, 271182, 268489, 265486, 262470, 259665, 257282, 255416, 253869, 252476, 251488, 251094, 250751, 249658, 247767, 245580, 243047, 239506, 234841, 229846, 225303, 221375, 218002, 215101, 212256, 209095, 206135, 204355, 203700, 202948, 201388, 199689, 198554, 197485, 195571, 192807, 189922, 187398, 185350, 183963, 183430, 183636, 184279, 185026, 185409, 185038, 184211, 183857, 184570, 186083, 187827, 189500, 190939, 192056, 193128, 194585, 196330, 197907, 199420, 201512, 204242, 206896, 209211, 211844, 215177, 218620, 221676, 224770, 228271, 231596, 234127, 236341, 239142, 242639, 246431, 250482, 254868, 259123, 262813, 266391]
53925B66391M191M612M251L814M169N202O437P926R852J1956J3874J5381J5835
53912C73891J4210J0365N716K044q3j224j928k171j703o02N80J158R65M46j06
53897D01558r59k167k960k731k212k570l628m141l752l471l996m787n111n029
53883C54044m964n145n810p060q183q086o731n361m867m868m733m591m677m625
53869B74343m057l391l305l799m326m475m155l477k808k616k957l346l305k757
53855B25569j885j048p93j376k231k449j892j326j377j836k048j542l61P96R85
53840B07186J33o01k64N05M64l52q83q29p90q41m36J41j24j140j513p01J36O9
53822B00160k34P9O22O86N05N29M69ll64m1N37O38L26J10J00K47P83J619J981
$$ y = [266391, 270582, 275194, 279445, 283259, 287428, 292630, 299067, 306993, 316845, 328801, 342675, 358056, 373891, 388101, 398466, 404182, 406226, 406143, 404919, 402991, 400820, 399117, 398515, 399095, 400253, 401218, 401664, 401558, 400599, 398432, 395472, 392741, 390529, 387959, 384331, 380190, 376438, 372967, 368971, 364184, 359073, 354044, 349080, 343935, 338125, 331065, 322882, 314796, 308065, 302704, 297837, 292969, 288236, 283645, 278968, 274343, 270286, 266895, 263590, 259791, 255465, 250990, 246835, 243358, 240550, 237934, 234977, 231631, 228326, 225569, 223684, 222636, 221843, 220467, 218236, 215787, 213895, 212569, 211192, 209356, 207308, 205766, 205405, 206201, 207186, 207319, 206718, 206454, 206959, 207423, 207071, 206188, 205359, 204569, 203728, 203292, 203433, 203309, 202169, 200656, 199955, 200091, 200160, 199926, 200005, 200627, 201313, 201818, 202347, 202816, 202813, 202449, 202408, 202945, 203583, 203909, 204019, 204119, 204366, 205149, 206768, 208749]
53803B08749J452P90J000K073L370M574N541N874N545N403O148P188P355O408
53789B71470N093M014L212K555J872R63j3m81k31J44N2l28n75p67j117j486j839
53772B82538k590l826m792m819m243l679l127k501k374l143m084m230l695l180
53758B32255k720k059j735k380l286l054j651m65k49m10m89r79k089k923k701
53743B05065j929j558j582j281m83J59N8o42j242j079q4J123J774J669J166N09
53727B01643l78j293j528o92N15R20K50n11l31O54J372J120K48m86q23r49q90
53710A98841m14M42J226J577J584J487J350J119Q25N70M84P17J305K117L058M162
53694B20450N182N392M355K708J562J192R87N98L05J26m01j278j732j300m88R0
$$ y = [208749, 210201, 210991, 211991, 214064, 217434, 222008, 227549, 233423, 238968, 244371, 250519, 257707, 265062, 271470, 276563, 280577, 283789, 286344, 288216, 289179, 289166, 288685, 288454, 288598, 288650, 288322, 287747, 286980, 285863, 284377, 282538, 279948, 276122, 271330, 266511, 262268, 258589, 255462, 252961, 250587, 247444, 243360, 239130, 235435, 232255, 229535, 227476, 225741, 223361, 220075, 217021, 215370, 214905, 214656, 214246, 213757, 212778, 210689, 207766, 205065, 203136, 201578, 199996, 198715, 198232, 198391, 198449, 197807, 196565, 195486, 195402, 196525, 198299, 199968, 201134, 201643, 201265, 199972, 198444, 197752, 198267, 199187, 199437, 198926, 198595, 199249, 200621, 201741, 201989, 201503, 200680, 199731, 198841, 198427, 198869, 200095, 201672, 203256, 204743, 206093, 207212, 208037, 208607, 209091, 209808, 211113, 213230, 216288, 220450, 225632, 231024, 235379, 238087, 239649, 240841, 241828, 242426, 242731, 242857, 242456, 241178, 239446, 238146, 237658, 237748]
53678B37748M47O59L45o20j526j723j526j534j570j057p5P05R11O43L8p31j236
53661B29898j130o29k28j28k73n72p97o00r5P8l91r74j073p17j08P99J705J729
53643B26494O34m04k20O75Q87J81m25k87K81R88J934K825K915K039R27J91k35
53626B39400m84k97M45J297J753J798J775J953K380K798K760K143J471J356J712
53611B62260K045K249K598L094L459L785M376M975M863L963L069K780K829K772
53597C09117K724K877K880K298J454J184J769K556K724K205J633J494J467Q01
53583C37183p00k282k984k626j870j447j571k019k527l027l553l937l679k428
53569C02533o45O50R21N96K62o7n41q21m93J70N45O14R18J548J883J472O83K39
$$ y = [237748, 238195, 238854, 239199, 238579, 237053, 235330, 233804, 232270, 230700, 229643, 229568, 230273, 231184, 231827, 231865, 231134, 229898, 228768, 228139, 227911, 227783, 227510, 226938, 226141, 225541, 225446, 225524, 225133, 224159, 223086, 222369, 222261, 223060, 224765, 226494, 227128, 226724, 226504, 227179, 228066, 228247, 227822, 227535, 227816, 228804, 230738, 233563, 236478, 238517, 239444, 239635, 239400, 238916, 238619, 239064, 240361, 242114, 243912, 245687, 247640, 250020, 252818, 255578, 257721, 259192, 260548, 262260, 264305, 266554, 269152, 272246, 275705, 279490, 283866, 288841, 293704, 297667, 300736, 303516, 306345, 309117, 311841, 314718, 317598, 319896, 321350, 322534, 324303, 326859, 329583, 331788, 333421, 334915, 336382, 337183, 336483, 334201, 331217, 328591, 326721, 325274, 323703, 321684, 319157, 316130, 312577, 308640, 304961, 302533, 301888, 302538, 303459, 304055, 304317, 304250, 303709, 302888, 302395, 302565, 303110, 303724, 304642, 306190, 308073, 309545, 310228, 310467]
53551C10467M42J036J562J696J411J019R39J276J644J508P58J9J70J335K538K713
53535C30533K032J698K382L487M178M507N005N680O075O063O019O212O546O892
53521C97309P413Q393R804J1051J1367J0743J0243J0888J2375J3525J3933J4364
53509E31408J5363J6487J7262J7947J8788J9341J9212J8747J8412J8118J7819
53498G28904J7961J8664J9151J8804J8039J7443J6770J5692J4749J4512J4581
53487I15270J4447J4597J5509J6342J6024J5076J4830J5248J5150J4267J3414
53476A080174J2793J1849J0870J0863J1493J0926Q333N096K759J213l41j915l256
53463A160857m755o816r015j0814j2415j4131j5523j5995j5781j5605j5722j5993
$$ y = [310467, 310909, 311945, 313507, 315203, 316614, 317633, 318572, 319848, 321492, 323000, 323758, 323777, 323947, 325282, 327820, 330533, 332565, 334263, 336645, 340132, 344310, 348817, 353822, 359502, 365577, 371640, 377659, 383871, 390417, 397309, 404722, 413115, 422919, 433970, 445337, 456080, 466323, 477211, 489586, 503111, 517044, 531408, 546771, 563258, 580520, 598467, 617255, 636596, 655808, 674555, 692967, 711085, 728904, 746865, 765529, 784680, 803484, 821523, 838966, 855736, 871428, 886177, 900689, 915270, 929717, 944314, 959823, 976165, 992189, 1007265, 1022095, 1037343, 1052493, 1066760, 1080174, 1092967, 1104816, 1115686, 1126549, 1138042, 1148968, 1157301, 1162397, 1165156, 1166369, 1166028, 1164113, 1160857, 1156102, 1149286, 1140271, 1129457, 1117042, 1102911, 1087388, 1071393, 1055612, 1040007, 1024285, 1008292]
53451A008292j6478j7379j8592j9765k0585k0690j9811j8278j6977j6370j6010
53440H07357j5399j4775j4575j4534j3913j2367j0142p621n202l416k704k923
53428F89786l242k606n66K196M310N045N105N711P095Q503R485J0420J1716J3299
53414G66257J5063J7008J8732J9572J9596J9740K0583K1650K2374K3079K4440
53403I88094K6454K8480L0005L0983L1779L3080L5389L8323M0789M2182M2923
53392A368481M3609M4243M4660M5114M5841M6552M6882M6969M7035M6788M5784
53381A871958M4074M2044L9828L7382L4814L2228K9442K6360K3392K0953J8738
53370B221213J5958J2242P880L251j540o482j1520j6709k2167k7759l2959l7240
$$ y = [1008292, 991814, 974435, 955843, 936078, 915493, 894803, 874992, 856714, 839737, 823367, 807357, 791958, 777183, 762608, 748074, 734161, 721794, 711652, 704031, 698829, 695413, 692709, 689786, 686544, 683938, 683372, 685568, 689878, 694923, 700028, 705739, 712834, 721337, 730822, 741242, 752958, 766257, 781320, 798328, 817060, 836632, 856228, 875968, 896551, 918201, 940575, 963654, 988094, 1014548, 1043028, 1073033, 1104016, 1135795, 1168875, 1204264, 1242587, 1283376, 1325558, 1368481, 1412090, 1456333, 1500993, 1546107, 1591948, 1638500, 1685382, 1732351, 1779386, 1826174, 1871958, 1916032, 1958076, 1997904, 2035286, 2070100, 2102328, 2131770, 2158130, 2181522, 2202475, 2221213, 2237171, 2249413, 2257293, 2260544, 2259004, 2252522, 2241002, 2224293, 2202126, 2174367, 2141408, 2104168]
53358B104168m0552m3378m6146m8617n0075n0198m9524m8745m7965m6972m5974
53347A586022m5360m4918m3974m2384m0683l9269l8110l7347l7321l7677l7294
53336A141685l5608l3358l1488k9907k7974k5654k3496k1713j9983j8035j5880
53325H58589j3586j1316r530q683q645q740q424p673o737n724m580l316k172j429
53311G58034j042o00K22J395K832M690O970R069J0217J0325R980R712R818J0684
53297H42306J2634J5318J7878J9766K0971K1501K1367K1125K1652K3109K4739
53286A062366K5840K6332K6238K5351K3762K2026K0474J8919J7244J5614J3856
53275A298022J1400Q228N159K727N06j961m330o177p885j0011j2282j4010j5201
$$ y = [2104168, 2063616, 2020238, 1974092, 1925475, 1875400, 1825202, 1775678, 1726933, 1678968, 1631996, 1586022, 1540662, 1495744, 1451770, 1409386, 1368703, 1329434, 1291324, 1253977, 1216656, 1178979, 1141685, 1106077, 1072719, 1041231, 1011324, 983350, 957696, 934200, 912487, 892504, 874469, 858589, 845003, 833687, 824157, 815474, 806829, 798089, 789665, 781992, 775255, 769531, 764951, 761635, 759463, 758034, 756992, 756392, 756614, 758009, 760841, 765531, 772501, 781570, 791787, 802112, 812092, 821804, 831622, 842306, 854940, 870258, 888136, 907902, 928873, 950374, 971741, 992866, 1014518, 1037627, 1062366, 1088206, 1114538, 1140776, 1166127, 1189889, 1211915, 1232389, 1251308, 1268552, 1284166, 1298022, 1309422, 1317650, 1322809, 1325536, 1326042, 1324081, 1319751, 1313574, 1305689, 1295678, 1283396, 1269386, 1254185]
53262A254185j6537j8399k0516k2413k3761k4488k4878k5382k6029k6417k6510
53251I98855k6965k8184k9500k9814k8796k7011k5242k4024k3521k3364k2907
53240G09527k2006k1192k0835k0549j9898j9149j8808j8778j8508j7732j6523
53229D95549j5017j3510j2478j1975j1303r845p970o613o153o189o198n993n677
53216C76628n503n617n842n935o205p187q516q782p154m563k720k388l132m211
53202B98873n006m972m052k935k337k182k053k053k585l461l974l732k939k014
53188B54578j389j448k114k687k578k011j623j645j914k245k389k030j355j124
53174B28026j588j921j355l63J39J51K06J66m78j370j600j179j027j448j744j487
$$ y = [1254185, 1237648, 1219249, 1198733, 1176320, 1152559, 1128071, 1103193, 1077811, 1051782, 1025365, 998855, 971890, 943706, 914206, 884392, 855596, 828585, 803343, 779319, 755798, 732434, 709527, 687521, 666329, 645494, 624945, 605047, 585898, 567090, 548312, 529804, 512072, 495549, 480532, 467022, 454544, 442569, 431266, 421421, 413451, 406838, 400685, 394496, 388298, 382305, 376628, 371125, 365508, 359666, 353731, 347526, 340339, 331823, 323041, 315887, 311324, 308604, 306216, 303084, 298873, 293867, 288895, 284843, 281908, 279571, 277389, 275336, 273283, 270698, 267237, 263263, 259531, 256592, 254578, 253189, 251741, 249627, 246940, 244362, 242351, 240728, 239083, 237169, 234924, 232535, 230505, 229150, 228026, 226438, 224517, 223162, 222799, 222938, 223089, 223295, 223461, 222983, 221613, 220013, 218834, 217807, 216359, 214615, 213128]
53158B13128j131j021p84j48M43M75J7o60j468k164k211j421l19M52O96N32J48
53141B04564p8J62M96Q1j165k085j566Q2J480J712J025K35r3Q5M85P90R51J187
53123B08348J607J970J959J628J343J212Q56q5j269j798j186O5J042J384J345
53108B18421J117N74l05j212j871k239k289j987j576j435j527j411r62n70m74
53093B02254m42k77j37q2Q3L07K43m8m5K79K47l67q73q27p68j082j102k85N96
53074A97674N23j53l63n6Qk32j02M22N45o8r53j735k370k503j687l67L35L5n23
53055A88430o50m08n4L95P70P56M58L46M82M50J34j33k70n74j007j089o87k36
53037A87113q5k18o23j219j486r52r6P6n51j105j071p95n80k73k9l85j154j248
$$ y = [213128, 211997, 210976, 210192, 210044, 210487, 210962, 210979, 210319, 208851, 206687, 204476, 203055, 202736, 203188, 203884, 204416, 204564, 204486, 204648, 205144, 205225, 204060, 201975, 200409, 200491, 201971, 203683, 204708, 204943, 204850, 204935, 205420, 206210, 207161, 208348, 209955, 211925, 213884, 215512, 216855, 218067, 218923, 218838, 217569, 215771, 214585, 214650, 215692, 217076, 218421, 219538, 220112, 219807, 218595, 216724, 214485, 212196, 210209, 208633, 207198, 205671, 204260, 203298, 202728, 202254, 201812, 201535, 201398, 201316, 201399, 201706, 201949, 201901, 201856, 202135, 202382, 202015, 201142, 200315, 199547, 198465, 197363, 197078, 197674, 198197, 198044, 197681, 197625, 197633, 197401, 197299, 197721, 198266, 198198, 197245, 195510, 193140, 190637, 188950, 188583, 188918, 188953, 188430, 187780, 187372, 187318, 187713, 188483, 189239, 189697, 190043, 190525, 190975, 191109, 190976, 190706, 190132, 189125, 188036, 187349, 187113, 187028, 186810, 186187, 184968, 183482, 182530, 182434, 182510, 181959, 180854, 179783, 178988, 178408, 178135, 178106, 177721, 176567, 175319]
53019A75319j68J191J781J725J736J886J716J056J98m69o34k45J93O2m02k37P86
53002A85494J574J132j33j074j262j035o19k6M56L99j91q47j163r83l19N02Q27
52985A82732K96n78q60k08Q02J342J076L64o8L00J384K533K943K178N39r34j125
52968A92716M5J366J579O82l71r59j113q07J22J222J545P71m26j418k273l048
52952A89633l200k342j086m70p65j323j429r40k65M7j98n56l84L49R78R18K43
52935A79210n64j115j206q43k58K76O99R54P31o1p89p22j29J7m98p82k20O74J089
52916A76463R17M37k38r26j123o51o7Q0J5K67P62R77P04K01k46m50j70O44J525
52897A79121J700Q65l71r45l39P79J239P23J07J27L26o9p51p47J8O81Q09P35M76
$$ y = [175319, 175151, 176342, 178123, 179848, 181584, 183470, 185186, 186242, 186440, 185971, 185337, 185092, 185285, 185347, 184945, 184708, 185494, 187068, 188200, 188067, 186993, 185731, 184696, 184077, 184051, 184507, 184906, 184715, 183868, 182705, 181722, 181403, 181905, 182732, 183028, 182450, 181590, 181382, 182184, 183526, 184602, 184966, 184898, 185198, 186582, 189115, 192058, 194236, 194775, 193841, 192716, 192761, 194127, 195706, 196388, 196017, 195058, 193945, 193138, 193260, 194482, 196027, 196798, 196372, 194954, 192681, 189633, 186433, 184091, 183005, 182535, 181770, 180447, 179018, 178078, 177813, 177860, 177662, 177106, 176722, 177071, 178049, 178967, 179210, 178646, 177531, 176325, 175482, 175224, 175500, 176199, 177153, 177884, 177823, 177034, 176312, 176183, 176200, 175702, 174920, 174700, 175374, 176463, 177380, 177817, 177579, 176653, 175530, 174879, 174812, 174892, 174907, 175174, 175936, 176913, 177617, 177818, 177572, 177122, 176952, 177596, 179121, 180821, 181686, 181315, 180370, 180031, 180810, 182049, 182772, 182879, 183006, 183332, 183263, 182512, 181765, 181783, 182464, 183273, 184008, 184484]
52878A84484m03j608j971j029K75J019J354J614J456P31K81R02K144L004L232
52863A95485L114K655J859J324J563K039J833R47J79j13l21p60j288j696j911
52848B04909j874j706j795k293k753k700k361k261k402k362k049j796j787j815
52834A74955j577r50q4O15Q49Q46J051J336J144N93N87J402K027J543M45j65k9
52817A84588L72Q05J259J466J391J705K823L894L786K754J935J385lk501m727
52802B00932n341m613l744l288k868k032q73Q3L46j29q60j307j375j322j308j304
52786A70997j275j202r72n18N4O46J211J481J029n0r28r36l55J81N65J045J459
52769A72432J413R93O23L69rm29n18k64o3j14k00q3K17N62P10M14k25o49m64J05
$$ y = [184484, 184081, 182473, 180502, 179473, 179748, 180767, 182121, 183735, 185191, 185922, 186203, 187105, 189249, 192253, 195485, 198599, 201254, 203113, 204437, 206000, 208039, 209872, 210819, 210998, 210885, 210564, 209804, 208516, 206820, 204909, 203035, 201329, 199534, 197241, 194488, 191788, 189427, 187166, 184764, 182402, 180353, 178557, 176770, 174955, 173378, 172428, 172344, 172959, 173808, 174654, 175705, 177041, 178185, 178778, 179365, 180767, 182794, 184337, 184782, 184617, 184588, 184960, 185765, 187024, 188490, 189881, 191586, 194409, 198303, 202089, 204843, 206778, 208163, 208160, 205659, 200932, 195591, 190978, 187234, 183946, 181078, 179046, 178173, 178256, 178602, 178473, 177613, 176306, 174931, 173609, 172301, 170997, 169722, 168520, 167548, 167030, 167084, 167730, 168941, 170422, 171451, 171401, 170473, 169537, 169182, 169363, 169928, 170973, 172432, 173845, 174838, 175461, 175830, 175821, 175392, 174874, 174610, 174547, 174433, 174233, 174150, 174367, 174929, 175639, 176053, 175828, 175179, 174715, 174820]
52749A74820O30J021J206Q34q7o35R4J727K943K981K166J155M24K65O31Q81M20
52732A91476n05j144j185p38K75J824L034K838J469L23J36J70m56j579k464k763
52716A90711k496j736q49n03q95j322j035k14L73L95J90J31J72O2k44n04m64j28
52698A81644K30L99M19L88K17j89o74r86j048q87m42K77J006J440J516J282P77
52681A85369K25L9K46L19p1n03m54j02J08K23N00O68K93l38n78m36m53n69q4J168
52661A85570K360K647J964P95k32m63L61J613K324K345K336K568K528J931J307
52646B09954J087Q49L0j067j610j316p80p69j456k226k209j155J71Q02O25L27
52630B01257L69O23R64J554K288K564J928O02q60k073k770k762k189j566j317
$$ y = [174820, 175450, 176471, 177677, 178511, 178424, 177789, 177883, 179610, 182553, 185534, 187700, 188855, 189279, 189544, 190175, 191056, 191476, 190971, 189827, 188642, 187904, 188179, 190003, 193037, 195875, 197344, 197667, 197803, 197973, 197517, 195938, 193474, 190711, 188215, 186479, 185630, 185127, 184232, 182910, 181875, 181661, 182034, 182429, 182619, 182750, 182922, 182984, 182740, 182236, 181772, 181644, 181874, 182273, 182692, 183080, 183297, 183108, 182434, 181448, 180400, 179513, 179071, 179348, 180354, 181794, 183310, 184592, 185369, 185594, 185633, 185879, 186198, 186127, 185624, 185170, 185068, 185176, 185399, 185899, 186567, 186860, 186522, 185944, 185508, 185055, 184486, 184402, 185570, 187930, 190577, 192541, 193336, 193104, 192641, 193002, 194615, 196939, 199284, 201620, 204188, 206716, 208647, 209954, 211041, 211890, 211920, 210853, 209243, 207927, 207147, 206378, 204922, 202696, 200487, 199332, 199503, 200305, 200930, 201257, 201626, 202249, 203213, 204767, 207055, 209619, 211547, 212149, 211289, 209216, 206446, 203684, 201495, 199929, 198612]
52615A98612j487j923k396k527k086j420j080r48l54P52J463J150M02K05O20R03
52599A89886O65K56Q1J29K36L76N17N39M71N60Q76J042P08K63N77J774K725K326
52581B04007J010K61O98J528J975K223K366J648k63j999j865j83J031O75l62q53
52565B11897q04q73j202j445j451j354j356j706k494l224l042j653K67J751K377
52550A95688K278J740J002K59l05m62q7M95O12O3m95l93J40M61N38P36R10N77
52532B03757j29n03k86J52N47Q77Q43J99m66j97Q66J536J190M30r1m46p18m75
52514B07086N01J715K594K959K683J737P82P88J724K493K412J784P87q77k700
52499B26468l180j875m07l37j068j097l92p8l75m25O4L79J03l33m82l70PP30J402
$$ y = [198612, 197125, 195202, 192806, 190279, 188193, 186773, 185693, 184745, 184391, 185143, 186606, 187756, 188158, 188363, 188983, 189886, 190551, 190807, 190888, 191017, 191253, 191629, 192146, 192685, 193156, 193716, 194592, 195634, 196342, 196605, 197182, 198956, 201681, 204007, 205017, 205278, 205976, 207504, 209479, 211702, 214068, 215716, 215453, 213454, 211589, 211406, 212437, 213112, 212750, 211897, 211093, 210220, 209018, 207573, 206122, 204768, 203412, 201706, 199212, 195988, 192946, 191293, 191560, 193311, 195688, 197966, 199706, 200708, 200967, 200662, 200200, 200113, 200608, 201220, 201283, 200788, 200395, 200535, 200996, 201534, 202270, 203180, 203757, 203628, 203125, 202839, 202991, 203538, 204415, 205258, 205457, 204991, 204794, 205660, 207196, 208386, 208816, 208725, 208279, 207561, 207086, 207587, 209302, 211896, 214855, 217538, 219275, 220057, 220845, 222569, 225062, 227474, 229258, 230045, 229168, 226468, 223288, 221413, 221006, 220669, 219601, 218504, 218112, 218034, 217659, 217234, 217298, 217677, 217780, 217447, 216965, 216595, 216602, 217332, 218734]
52480B18734J333N39j06N5P70J482K057K582K834K398J294K58J39J012J997K197
52464B39575J673J140Q86O49M66Q00J510J564L71j232k053k049k087k559l049
52449B35605l138k866k411j899j488j229q86k65M04O87M51r8n99o71j75M10L11
52432B22143n20j187j038m94l27n76p87q45q86p73l25J65K72J02J10M08P60J036
52414B17238J163R67N33M70J162K097K514K538K944L985N138N959O572P193P723
52399B68196P825P026M910J625j873m536o111o910p032o395n281m179l102j758
52385B42405l93K67M6l32j84K78L47k30r70j173n60M86J294J572J591J688J841
52368B47973J913K060K483L009L181K715J667L47p19j032o69k97l66n74m60k21
$$ y = [218734, 220067, 220606, 220500, 220555, 221325, 222807, 224864, 227446, 230280, 232678, 233972, 234230, 234369, 235381, 237378, 239575, 241248, 242388, 243274, 243923, 244389, 245189, 246699, 248263, 248634, 247402, 245349, 243300, 241213, 238654, 235605, 232467, 229601, 227190, 225291, 223803, 222574, 221688, 221423, 221827, 222514, 222965, 222867, 222268, 221597, 221422, 221832, 222143, 221623, 220436, 219398, 218904, 218577, 218001, 217214, 216369, 215483, 214710, 214385, 214550, 214822, 214924, 215034, 215442, 216202, 217238, 218401, 219368, 219901, 220371, 221533, 223630, 226144, 228682, 231626, 235611, 240749, 246708, 253280, 260473, 268196, 276021, 283047, 287957, 289582, 287709, 283173, 277062, 270152, 263120, 256725, 251444, 247265, 244163, 242405, 242012, 242279, 242325, 241993, 241809, 242087, 242434, 242204, 241234, 240061, 239501, 239987, 241281, 242853, 244444, 246132, 247973, 249886, 251946, 254429, 257438, 260619, 263334, 265001, 265348, 264629, 263597, 262928, 262631, 262265, 261691, 261231, 261010]
52352B61010l92r14j102m95N82J423J602J332J196J401J338L30j139j644n74R90
52336B64944J671J420J137J309J822K642L696M361M067L320L247M116N127N726
52322C08605O194O773P063O647N740M802L926L001K179J863K309L401M651N497
52308C72651N655N282M714M229M100M483N124N497N526N736O344O772O517N951
52294D48581N630N252M159K507J138M29J27J75P65J579J796J099K2p67r71m61
52278D71060O56J717J997J731J918K885L741L589K724K147K318K862L301L573
52264E06219L827L902L283J690k11j099k84J518L035L776M190M742N530O483P368
52249E53969P675P127O251N843N841N342L833J879N25M08J445K919L800L533K570
$$ y = [261010, 260618, 259704, 258602, 258107, 258689, 260112, 261714, 263046, 264242, 265643, 266981, 267311, 266172, 264528, 263954, 264944, 266615, 268035, 269172, 270481, 272303, 274945, 278641, 283002, 287069, 290389, 293636, 297752, 302879, 308605, 314799, 321572, 328635, 335282, 341022, 345824, 349750, 352751, 354930, 356793, 359102, 362503, 367154, 372651, 378306, 383588, 388302, 392531, 396631, 401114, 406238, 411735, 417261, 422997, 429341, 436113, 442630, 448581, 454211, 459463, 463622, 466129, 467267, 467696, 467823, 467998, 468763, 470342, 472138, 473237, 473259, 472492, 471521, 471060, 471716, 473433, 475430, 477161, 479079, 481964, 485705, 489294, 492018, 494165, 496483, 499345, 502646, 506219, 510046, 513948, 517231, 518921, 518710, 517611, 517327, 518845, 521880, 525656, 529846, 534588, 540118, 546601, 553969, 561644, 568771, 575022, 580865, 586706, 592048, 595881, 597760, 598285, 598693, 600138, 603057, 606857, 610390, 612960]
52234F12960J851J811K279L018L791M145L859L530L939M860N248M679L854L495
52220F63319L524L546L528L615L705L545K969K020J194J376K939M939N932N651
52206G11802N198N390N708N224L929K720K433L204M441N211N006M292M043M670
52192G73271N749O705P198O922N643L685J863P50K71l5p24k214m191n466n219
52177G94208m246m074m887n382m777l833l468l480l248k832k636k650k642k539
52163G43514k108r11Q19J910J558M42j27J87O57N96Oo71q99m27L38O80O27J105
52145G47296K511L796L730K615J746J487R01o05k216k783k255j600j591k103k504
52130G48425k353j664o67N49K104M027O077P845R082R884J0576J1286J1623J1015
$$ y = [612960, 614811, 616622, 618901, 621919, 625710, 629855, 633714, 637244, 641183, 646043, 651291, 655970, 659824, 663319, 666843, 670389, 673917, 677532, 681237, 684782, 687751, 689771, 690965, 692341, 695280, 700219, 706151, 711802, 717000, 722390, 728098, 733322, 737251, 739971, 742404, 745608, 750049, 755260, 760266, 764558, 768601, 773271, 779020, 785725, 792923, 799845, 805488, 809173, 811036, 811786, 812057, 812022, 811298, 809084, 804893, 799427, 794208, 789962, 785888, 781001, 775619, 770842, 767009, 763541, 760061, 756813, 753981, 751345, 748695, 746053, 743514, 741406, 740495, 741314, 743224, 744782, 745224, 745097, 745284, 745941, 746537, 746543, 745872, 744973, 744546, 744884, 745564, 746191, 747296, 749807, 753603, 757333, 759948, 761694, 763181, 764082, 763477, 761261, 758478, 756223, 754623, 753032, 750929, 748425, 746072, 744408, 743741, 744290, 746394, 750421, 756498, 764343, 773425, 783309, 793885, 805171, 816794, 827809]
52116H27809R498P928P087O762O097M728L095J749Q38L61L35N66O61M73L08O22
52100H78917J695L470N437O795P084O524N449L735J318j188l059m405n643o382
52086H99747n892m531l513l222k905k167j489j007k19O50M36r81j913j149J76
52071H72021L12n13p73j49K48q8l68L6P77J439K180L120L891M206M222M123L778
52054H98462L094K263J469O95j70j257k648m062m842m730m445m902n926o420n816
52039H60765m677l702k821j698o15k45p20j401j632j407j177j237j530j926k348
52024H33629k569k184j093K36J117J203N17o98j784j818m99J271K302K413K141
52009H34184J555K57j552l188m735o952r675j1608j2181j2419j3179j3708j2962
$$ y = [827809, 837307, 845235, 852322, 859084, 865181, 869909, 873004, 874753, 875591, 875952, 876287, 876853, 877514, 877987, 878295, 878917, 880612, 884082, 889519, 896314, 903398, 909922, 915371, 919106, 920424, 919236, 916177, 911772, 906129, 899747, 893855, 889324, 885811, 882589, 879684, 877517, 876028, 875021, 874802, 875452, 875888, 874907, 872994, 871845, 872021, 872333, 871820, 871047, 870898, 871146, 871058, 870690, 870726, 871503, 872942, 875122, 878242, 882133, 886339, 890561, 894684, 898462, 901556, 903819, 905288, 905983, 905813, 904556, 901908, 897846, 893004, 888274, 883829, 878927, 873001, 866581, 860765, 856088, 852386, 849565, 847867, 847252, 847007, 846287, 844886, 843254, 841847, 840670, 839433, 837903, 835977, 833629, 831060, 828876, 827783, 828019, 829136, 830339, 830856, 830158, 828374, 826556, 826057, 827328, 829630, 832043, 834184, 835739, 835996, 834444, 831256, 826521, 819569, 809894, 798286, 786105, 773686, 760507, 746799, 733837]
51996G33837j1402j0228r659r220r143j0034j1419j2040j1664j1390j1949j2747
51984F02942j2894j2351j1691j1376j1614j2379j3262j3605j3071j1856j0347
$$ y = [733837, 722435, 712207, 702548, 693328, 684185, 674151, 662732, 650692, 639028, 627638, 615689, 602942, 590048, 577697, 566006, 554630, 543016, 530637, 517375, 503770, 490699, 478843, 468496]
$$ [...]