
##TITLE=UV1235_M8_1260-1248_5_7240988_xvrprCfSoq
##JCAMPDX= 6.0         $$ Bruker NMR JCAMP-DX V2.0
##DATA TYPE= NMR SPECTRUM
##DATA CLASS= NTUPLES
##ORIGIN= BRUKER
##OWNER= Administrator
$$ 1.72 TOPSPIN		Version 2.1
$$ 2013-01-18 22:48:21.389 -0500  Administrator@X
$$ Compression mode = diff/dup
##.OBSERVE FREQUENCY= 400.02188249412
##.OBSERVE NUCLEUS= ^1H
##.ACQUISITION MODE= SIMULTANEOUS (DQD)
##.ACQUISITION SCHEME= undefined
##.AVERAGES= 8
##.DIGITISER RES= 22
##SPECTROMETER/DATA SYSTEM= spect
##.PULSE SEQUENCE= zg30
##.SOLVENT NAME= COFFEE_meoh
##.SHIFT REFERENCE= INTERNAL, COFFEE_meoh, 1, 14.98509
##AUDIT TRAIL= $$ (NUMBER, WHEN, WHO, WHERE, PROCESS, VERSION, WHAT)
$$ ##TITLE= Audit trail, TOPSPIN		Version 2.1
$$ ##JCAMPDX= 5.01
$$ ##ORIGIN= Bruker BioSpin GmbH
$$ ##OWNER= Administrator
$$ $$ E:\/data/COFFEE/nmr/UV1235_M8_1260-1248_5_7240988_xvrprCfSoq/20/pdata/1/auditp.txt
$$ ##AUDIT TRAIL=  $$ (NUMBER, WHEN, WHO, WHERE, PROCESS, VERSION, WHAT)
(   1,<2013-01-18 22:48:13.280 -0500>,<Administrator>,<X>,<go>,<TOPSPIN 2.1>,
      <created by zg
	started at 2013-01-18 22:47:07.374 -0500,
	POWCHK enabled, PULCHK disabled,
       configuration hash MD5:
       86 BA 57 50 F2 9D 5C 9B 26 00 A9 28 5F 66 2E 89
       data hash MD5: 64K
       9D 75 3B E1 87 89 7A 63 0D 5F 57 84 D1 47 44 D8>)
(   2,<2013-01-18 22:48:16.342 -0500>,<Administrator>,<X>,<proc1d>,<TOPSPIN 2.1>,
      <Start of raw data processing
       efp LB = 0 FT_mod = 6 PKNL = 1 PHC0 = 0 PHC1 = 0 SI = 32K 
       data hash MD5: 32K
       31 BD 80 ED 0D 6F BD 35 9C FB 5A 5B 66 4F C6 83>)
(   3,<2013-01-18 22:48:16.811 -0500>,<Administrator>,<X>,<proc1d>,<TOPSPIN 2.1>,
      <pk PHC0 = 96.1853 PHC1 = 0 
       data hash MD5: 32K
       95 16 2D E3 FA 38 81 A7 78 62 81 93 AF 7B 8D 8F>)
(   4,<2013-01-18 22:48:17.030 -0500>,<Administrator>,<X>,<proc1d>,<TOPSPIN 2.1>,
      <abs ABSG = 1 
       data hash MD5: 32K
       0A D7 A4 C9 67 A0 EA 1A 55 AC 92 B6 F2 D3 08 32>)
(   5,<2013-01-18 22:48:17.186 -0500>,<Administrator>,<X>,<proc1d>,<TOPSPIN 2.1>,
      <abs ABSG = 2 
       data hash MD5: 32K
       D8 F5 E2 24 65 E6 44 F4 93 0A 3A 53 D9 4F 9C FF>)
(   6,<2013-01-18 22:48:17.327 -0500>,<Administrator>,<X>,<proc1d>,<TOPSPIN 2.1>,
      <abs ABSG = 3 
       data hash MD5: 32K
       A8 02 A6 29 48 12 F4 44 E5 BC F7 A8 6D B7 02 A3>)
(   7,<2013-01-18 22:48:17.467 -0500>,<Administrator>,<X>,<proc1d>,<TOPSPIN 2.1>,
      <abs ABSG = 4 
       data hash MD5: 32K
       D7 D8 BE 67 34 6B 88 E0 C5 2C 2A C0 95 C6 B5 62>)
(   8,<2013-01-18 22:48:17.624 -0500>,<Administrator>,<X>,<proc1d>,<TOPSPIN 2.1>,
      <abs ABSG = 5 
       data hash MD5: 32K
       CA 62 43 0A DC 9B EC 46 5E 68 31 11 39 84 80 82>)
$$ ##END=
$$ 
$$ $$ hash MD5
$$ $$ 8B EA 35 80 ED CF 38 D4 57 61 BF 2F 7B AC 64 B3
##$RELAX= 
##$RELAX= 
##$RELAX= 
##$RELAX= 
##$RELAX= 
##$RELAX= 
##$RELAX= 
$$ Bruker specific parameters
$$ --------------------------
##$DU= <E:\>
##$EXPNO= 20
$$ [...]
150 150 150 150 150 150 150 150
##$TP07= 0
##$TPNAME0= <>
##$TPNAME1= <>
##$TPNAME2= <>
##$TPNAME3= <>
##$TPNAME4= <>
##$TPNAME5= <>
##$TPNAME6= <>
##$TPNAME7= <>
##$TPOAL= (0..7)
0.5 0.5 0.5 0.5 0.5 0.5 0.5 0.5
##$TPOFFS= (0..7)
0 0 0 0 0 0 0 0
##$TUNHIN= 0
##$TUNHOUT= 0
##$TUNXOUT= 0
##$USERA1= <user>
##$USERA2= <user>
##$USERA3= <user>
##$USERA4= <user>
##$USERA5= <user>
##$V9= 5
##$VALIST= <valist>
##$VCLIST= <CCCCCCCCCCCCCCC>
##$VD= 0
##$VDLIST= <DDDDDDDDDDDDDDD>
##$VPLIST= <PPPPPPPPPPPPPPP>
##$VTLIST= <TTTTTTTTTTTTTTT>
##$WBST= 1024
##$WBSW= 4
##$XGAIN= (0..3)
0 0 0 0
##$XL= 0
##$YL= 0
##$YMAX_a= 657046
##$YMIN_a= -557288
##$ZGOPTNS= <>
##$ZL1= 120
##$ZL2= 120
##$ZL3= 120
##$ZL4= 120
##$ABSF1= 14.98509
##$ABSF2= -5.573092
##$ABSG= 5
##$ABSL= 3
##$ALPHA= 0
##$AQORDER= 0
##$ASSFAC= 0
##$ASSFACI= 0
##$ASSFACX= 0
##$ASSWID= 0
##$AUNMP= <proc_prof1d_extract_pilot.lims>
##$AXLEFT= 0
##$AXNAME= <>
##$AXNUC= <1H>
##$AXRIGHT= 0
##$AXTYPE= 0
##$AXUNIT= <>
##$AZFE= 0.1
##$AZFW= 0.1
##$BCFW= 0
##$BC_mod= 0
##$BYTORDP= 0
##$COROFFS= 0
##$CY= 15
##$DATMOD= 1
##$DC= 0
##$DFILT= <>
##$DTYPP= 0
##$F1P= 0
##$F2P= 0
##$FCOR= 0.5
##$FTSIZE= 32768
##$FT_mod= 6
##$GAMMA= 0
##$GB= 0
##$INTBC= 1
##$INTSCL= 1
##$ISEN= 128
##$LB= 0
##$LEV0= 0
##$LPBIN= 0
##$MAXI= 10000
##$MC2= 0
##$MEAN= 0
##$ME_mod= 0
##$MI= 0
##$NCOEF= 0
##$NC_proc= -8
##$NLEV= 6
##$NOISF1= 0
##$NOISF2= 0
##$NSP= 0
##$NTH_PI= 0
##$NZP= 0
##$OFFSET= 14.98509
##$PC= 1
##$PHC0= 96.1853
##$PHC1= 0
##$PH_mod= 1
##$PKNL= yes
##$PPARMOD= 0
##$PPDIAG= 0
##$PPIPTYP= 0
##$PPMPNUM= 2147483647
##$PPRESOL= 1
##$PSCAL= 4
##$PSIGN= 0
##$PYNMP= <proc.py>
##$REVERSE= no
##$SF= 400.02
##$SI= 32768
##$SIGF1= 0
##$SIGF2= 0
##$SINO= 400
##$SIOLD= 32768
##$SPECTYP= <>
##$SREGLST= <1H.CDCl3>
##$SSB= 0
##$STSI= 32768
##$STSR= 0
##$SW_p= 8223.68421052631
##$SYMM= 0
##$S_DEV= 0
##$TDeff= 65536
##$TDoff= 0
##$TI= <>
##$TILT= no
##$TM1= 0
##$TM2= 0
##$TOPLEV= 0
##$USERP1= <user>
##$USERP2= <user>
##$USERP3= <user>
##$USERP4= <user>
##$USERP5= <user>
##$WDW= 1
##$XDIM= 32768
##$YMAX_p= 462656278
##$YMIN_p= -718127
##$CURPLOT= <Network HP LaserJet P1505>
##$CURPRIN= <$Network HP LaserJet P1505>
##$DFORMAT= <normdp>
##$LAYOUT= <+/1D_H.xwp>
##$LFORMAT= <normlp>
##$PFORMAT= <normpl>
##$SURQMSG= 1
$$ End of Bruker specific parameters
$$ ---------------------------------
##NTUPLES= NMR SPECTRUM
##VAR_NAME=  FREQUENCY,     SPECTRUM/REAL,   SPECTRUM/IMAG
##SYMBOL=    X,             R,               I
##VAR_TYPE=  INDEPENDENT,   DEPENDENT,       DEPENDENT
##VAR_FORM=  AFFN,          ASDF,            ASDF
##VAR_DIM=   32768,         32768,           32768
##UNITS=     HZ,            ARBITRARY UNITS, ARBITRARY UNITS
##FACTOR=    0.250966925370066, 1,           1
##FIRST=     8223.43324360094, -170800,      -107125
##LAST=      0,             -22562,          -179771
##MIN=       0,             -718127,         0
##MAX=       8223.43324360094, 462656278,    0
$$ Real data points
##PAGE= N=1
##DATA TABLE= (X++(R..R)), XYDATA
$$ [...]
19543b82635J24463A24324b89139a12889j48969A87914J90470a23919J6700F9881
19532B2046b80408a28044j1374Q771A34229a68348j44175A81172a88969A47573
19521a02147E8567d0963K0434B51308a2962l35309F2001E740f5675A81151a58701
19509c07421a03911E9236I936a69270j54433f3839B02084h3808j25143a9909A82627
19497i86A93306Q3065g2589k25991a05370c0045n8670l1743k84369a14295d9924
19485b19935c6743F4887J89448b34800P3872N4080p9045E2985L2508O7461A5537
19473b8293m4118A5259J33341a17339m0197O490o087N3948A12413b7813B4370
19461f6103e023F4728g0054A7469K09781a86222c8184j52690k407b1392k30858
$$ plain form
19543 -282635 -158172 124324 -289139 -112889 -261858 187914 378384 -123919 -107219 69881
19532 22046 -280408 -128044 -139418 -130647 134229 -168348 -312523 181172 -188969 147573
19521 -102147 58567 -40963 -20529 251308 -12962 -348271 62001 5740 -65675 181151 -158701
19509 -307421 -103911 59236 9936 -169270 -323703 -63839 202084 -83808 -208951 -19909 182627
19497 -986 193306 276371 -72589 -298580 -105370 -30045 -88715 -120458 -404827 -114295 -49924
19485 -219935 -36743 64887 254335 -234800 -160928 -106848 -185893 52985 85493 152954 15537
19473 -28293 -72411 15259 148600 -117339 -157536 -151046 -157133 -103185 112413 -27813 24370
19461 -66103 -5023 64728 -70054 17469 227250 -186222 -38184 -190874 -193281 -21392 -252250
19450b52250L4000l04822d7207A54788c15238a34155A35808C7320b38372j00039
19440c38411a47733K9378j93235a41117k81494J09021P2035G8922N6880a54974
19429a26683B48114i2034M0030q461k66A2117a89885a5829P180j61817j61052
19418c31518E1055K1865a39374C4092b8639C13534c5252B90340a18318A94508
19407d5024j468j16879j46252m877J46408k0780g7665A63753o1318e6996l07778
19396c64774J07608a4960l7346j62888j22333o8879J65210a0547l3799j99132
19386b43478k609A07190a46556E5291K00124a02267A79604n0757n1305a1784k39586
19375b51370A78604J60373C705c31104a9979A83275c0667C3719N9371b46989J08415
$$ plain form
19450 -252250 -218250 -523072 -47207 154788 -315238 -134155 135808 37320 -238372 -338411
19440 -338411 -147733 -118355 -311590 -141117 -422611 -313590 -241555 78922 135802 -154974
19429 -126683 248114 -92034 -52004 -60465 -60731 12117 -189885 -15829 -8649 -170466 -331518
19418 -331518 51055 72920 -139374 34092 -28639 313534 -35252 290340 -118318 194508
19407 -45024 -46492 -163371 -309623 -314500 -168092 -188872 -77665 163753 102435 -56996 -364774
19396 -364774 -257166 -14960 -52306 -215194 -337527 -406406 -241196 -10547 -44346 -243478
19386 -243478 -246087 107190 -146556 55291 255415 -102267 179604 128847 77542 -11784 -251370
19375 -251370 178604 338977 3705 -331104 -19979 183275 -30667 33719 93090 -246989 -138574
19364a38574r985j51731P6342E5697c2913j82572A9508b93977e1418E377b05331
19352B27555a42718B9527a97245b5056m2611j9369k93707A14256a69727q4031
19342b53758B90966b08028N8598B07328I2258C4866b50700A05155a49220k5755
19332a74975b0732D59461j44886h2488m9739j15550f8084A36034Q7947h6325A32423
19320a94136b2818j63308F9043a99414A44436a21018A46556a49756C3578n679
19310B7899N842J7390j3004c2637k27513O0459o9162O3453I8748n926a5512k3111
19298c8623A03449b66737B25795a45595E989J3917i5207N154o4160A94612F557
19286b95926P034b1348j89089j58743G0900c69586F662J36181a19049n6728h4961
$$ plain form
19364 -138574 -148559 -300290 -223948 55697 -32913 -215485 19508 -293977 -51418 5377 -205331
19352 227555 -142718 29527 -197245 -25056 -67667 -87036 -380743 114256 -169727 -253758
19342 -253758 290966 -208028 -149430 207328 92258 34866 -250700 105155 -149220 -174975
19332 -174975 -20732 459461 314575 -82488 -132227 -247777 -68084 136034 223981 -86325 132423
19320 -194136 -22818 -186126 69043 -199414 144436 -121018 146556 -149756 33578 27899
19310 27899 33741 51131 38127 -32637 -260150 -199691 -268853 -205400 98748 92822 -15512 -38623
19298 -38623 103449 -266737 225795 -145595 5989 19906 -95207 -90053 -154213 194612 6557
19286 -295926 -288892 -21348 -210437 -369180 70900 -369586 6662 142843 -119049 -175777 -84961
19274a78206c4673j02741A58003c81916L5957A79451A0608b23793o4755a037k39372
19263b40409R1104l2436f0292j46728c6576I827J77770b58074a25726l8764r6548
19252b61038H2836j41c59807Q0634D8884a19166r8218O506N6628g0707k11535
19241b82242a3331o5141j97253B8782h2710j02141f9089A09852J0293b98631C0807
19229c06962J47771A58510d8493A54676c1663B802a16954l06997A74742l2964
19219A41778c08172R2682k9459A57188F7227a22612p2811A30391M2794c2891G0935
19207A58676a74899b1534B8282b57206f1784j0456j88237K3683D4845c08106A2221
19195b09355j58125J27639B07537g9737k52242a55905A17949C8935f6962E8101
$$ plain form
19274 -178206 -34673 -137414 158003 -381916 -345959 179451 10608 -223793 -288548 -1037 -240409
19263 -240409 -149305 -181741 -60292 -207020 -36576 9827 187597 -258074 -125726 -164490 -261038
19252 -261038 82836 82695 -359807 -279173 48884 -119166 -217384 -210878 -154250 -70707 -282242
19241 -282242 -13331 -78472 -275725 28782 -82710 -184851 -69089 109852 120145 -298631 30807
19229 -306962 -159191 158510 -48493 154676 -31663 2802 -116954 -423951 174742 141778
19219 141778 -308172 -215490 -244949 157188 67227 -122612 -195423 130391 173185 -32891 70935
19207 158676 -174899 -21534 28282 -257206 -61784 -72240 -260477 -236794 44845 -308106 12221
19195 -209355 -367480 -239841 207537 -79737 -331979 -155905 117949 38935 -66962 58101
19184d8630M748k26982F4885c00066A06432b43503D524b30638J4072A41438a29175
19172d3765j12537d7033B37771a59581o326M2768A10497L1045c06583e7495m3633
19161a01128A93040e1485j31220q854B923c03234H9845c01590A23079b12503B3063
19149f6702D7791c9849j39333K1270M9472l2816C6838J34874A9458e0578g194
19137a02038D6836M95n846N9397b465D8185C358b47857a17570q2890Q4669L3920
19125h1871a1905B33102b95995L8574B73620j16103A599K26292a6730k9277l399
19114d9406j728j17806P8080j0508A4750b00535J3769Q4833b0813A89446c61674
19102A44184c7876j25457A62168a5273A73005k429H0734K12991M1593j42535b50687
$$ plain form
19184 -48630 -43882 -270864 64885 -300066 106432 -243503 4524 -230638 -216566 141438 -129175
19172 -43765 -156302 -47033 237771 -159581 -165907 -123139 110497 141542 -306583 -57495 -101128
19161 -101128 193040 -51485 -182705 -191559 2923 -303234 89845 -301590 123079 -212503 23063
19149 -66702 47791 -39849 -179182 -157912 -108440 -141256 36838 171712 19458 -50578 -7194
19137 -102038 46836 47331 41485 100882 -2465 48185 3358 -247857 -117570 -200460 -115791 -81871
19125 -81871 -11905 233102 -295995 -257421 273620 157517 1599 227891 -16730 -46007 -49406
19114 -49406 -51134 -168940 -90860 -101368 14750 -200535 -186766 -101933 -20813 189446 -361674
19102 144184 -37876 -163333 162168 -15273 173005 170576 80734 293725 335318 192783 -250687
19090G420J29768A1330b7523B51771j13391g0024j47696A35549b02213j66311
19080c68524a01637L984C0233a56683B01845q8137c7951j19600A22716b44305
19069b4367j98792H6071d308C0817a99176B45001b23173g2024p0775n3019E510
19057b12360K5828D46225b1864I3612f2337K0898j39384M871p1730B92264b06699
19045B7766P067c1709A63120d278A4975J48040c37638J06927M9091b2918j84103
19034b07021N4408B38072g2942j74268M3778C1751m59a79549B15189b7265l0135
19023e7400F9584O439J51724b36772A16874M4528a36606A61832D240c6907k16995
19012b53902A17845k2528m1663C810J78614e17549A90316i1315l55303b13956
$$ plain form
19090 7420 137188 11330 -27523 251771 138380 -70024 -217720 135549 -202213 -368524
19080 -368524 -101637 -97653 30233 -156683 201845 113708 -37951 -157551 122716 -244305
19069 -24367 -223159 86071 -4308 30817 -199176 245001 -223173 -72024 -142799 -195818 5510
19057 -212360 -186532 446225 -21864 93612 -62337 -41439 -180823 -175952 -247682 292264 -206699
19045 27766 34833 -31709 163120 -4278 14975 163015 -337638 -230711 -181620 -22918 -207021
19034 -207021 -152613 238072 -72942 -247210 -203432 31751 31292 -179549 215189 -27265 -57400
19023 -57400 69584 76023 227747 -236772 116874 161402 -136606 161832 4240 -36907 -253902
19012 -253902 117845 95317 53654 3810 182424 -517549 190316 -91315 -446618 -213956
19001b04912A05981N6392g282k72398j19359f4165A61396b56490n301B4625e968
18989a99575M2868K4095D6721I067Q2410c48259I2983f0332j66705F821a25772
18977h2992p6568f6435J2549k49604B13038m8676a85288g855j86242D6388j6079
18966C0309g2803m3023c0814j87257E7854a20147B46564d3889A19188m5054c20286
18954a81391K6953j35765b9634C5940K5581K08517e9516p0943j64031a46473e2578
18942C3836b69639A10738d0417a3782l5175p4310c4408m1766A69276N3146D7790
18930a94657A41248o5519a95491e4299B20606a05742F1093b09607J8358L182q964
18919a97031A64083i8656A42309j8844a12703j6841b0260l53911H6712h0478k30159
$$ plain form
19001 -204912 105981 162373 -7282 -279680 -399039 -64165 161396 -256490 -261791 24625 -5968
18989 -199575 -156707 -132612 46721 9067 91477 -348259 92983 -60332 -227037 6821 -125772
18977 -82992 -159560 -66435 -53886 -303490 213038 164362 -185288 -7855 -194097 46388 30309
18966 30309 -72803 -115826 -30814 -218071 57854 -120147 246564 -43889 119188 74134 -320286
18954 -181391 -154438 -290203 -29634 35940 61521 270038 -59516 -130459 -294490 -146473 -52578
18942 33836 -269639 110738 -40417 -13782 -48957 -123267 -34408 -76174 169276 222422 47790
18930 -194657 141248 75729 -195491 -54299 220606 -105742 61093 -209607 -191249 -188067 -197031
18919 -197031 164083 -98656 142309 123465 -112703 -129544 -20260 -374171 86712 -80478 -310637
18908c10637g924j86956e5425j22255A85436N263a60802D64471f1491n5654C12671
18896A57398e5180j52929f3471G739d4388j03421l0821B92930j9952a79743A35862
18884h1795A9872J05699j1848D2294a01294m5439H8572D2203M7812b59256j9836
18873b79092A07142a23435N9241C5466a97606j1943n4415I0174d1835r5825c8522
18861A43313b11583A48586i3210D08840a19998j0462p4411n6596A01330N4778
18851A56108b73691B25286C8116J64649F3604B6275d5976G0476a11293E4025e7729
18839i5398D33637A27002H602c5853j05459A35542a88096D5235J01620m6894b3066
18827h428q9290q6001n8926k32560e6107B6251N6339a50168A93299a1151B00Q8881
$$ plain form
18908 -310637 -7924 -194880 -55425 -177680 185436 190699 -160802 464471 -61491 -117145 312671
18896 157398 -55180 -208109 -63471 7739 -44388 -147809 -178630 292930 272978 -179743 135862
18884 -81795 19872 125571 113723 42294 -101294 -146733 88572 42203 90015 -259256 -279092
18873 -279092 107142 -123435 -64194 35466 -197606 -209549 -263964 90174 -41835 -137660 -38522
18861 143313 -211583 148586 -93210 408840 -119998 -130460 -204871 -261467 101330 156108
18851 156108 -273691 225286 38116 202765 63604 26275 -45976 70476 -111293 54025 -57729
18839 -95398 433637 127002 8602 -35853 -141312 135542 -188096 45235 146855 99961 -23066
18827 -8428 -97718 -183719 -242645 -475205 -56107 26251 82590 -150168 193299 -11151 200 89081
18815H9081A3058e0413m0196C23295I8041L751g3098B1914c7370A07657D6114
18803b48196B24263F6775a82225A97415a84993d9835q9539j34361A09964r222
18793A00742b53982f3966B1573a82326B02323a0901A15574b34244A46106a22463
18782H9001a61994B93950a03264A4890R215a25036k09045B6220J33209b43018
18771B00657f6420p8081A44734a75520f5920D5742b51341h1702k54889N0320H8397
18759a94274k12665A73509p4259l2169J68721a85988a4766A01288E0165J87051
18749B37216j15952a6657B41969B1596i7125j58947g9941j14551h0648A04248
18738d07175a02082b8313j98889j48861i0671B30733a69180P6421l34224c0261
$$ plain form
18815 89081 13058 -50413 -90609 323295 98041 101792 -73098 21914 -37370 107657 46114
18803 -248196 224263 66775 -182225 197415 -184993 -49835 -139374 -273735 109964 100742
18793 100742 -253982 -63966 21573 -182326 202323 -10901 115574 -234244 146106 -122463
18782 89001 -161994 293950 -103264 14890 24105 -125036 -334081 26220 159429 -243018
18771 200657 -66420 -144501 144734 -175520 -65920 45742 -251341 -81702 -336591 -286271 88397
18759 -194274 -406939 173509 99250 67081 235802 -185988 -14766 101288 50165 237216
18749 237216 121264 -16657 241969 21596 -97125 -256072 -79941 -194492 -80648 104248
18738 -407175 -102082 -28313 -227202 -376063 -90671 230733 -169180 -92759 -426983 -30261
18727a51245k89257i2425l456n7520C09844a12925E1984a45322p217A33321a07476
18715A545g9965j79944A22446O0022m1977a245r4580B22310J28804d22115B58359
18703G6235e8929A8464R3039h3221B33645c00215A44239a99813c5579k30913m5320
18692c11812R5515A09035e8182A55470c1107D5233i0279a1774o3379k3910j93760
18681b92823a31877c2350l545J6523B82773a7376m801k07661r3682D2915Q3a96407
18668c51358c7533p5493k71276b2022A16111a67437a1646A21820i5687a1951o1957
18657g3908A92431I5375a49170p5289a1945A51504b07876l9091L0938j7342c4958
18645G5842e5923j27753O4175p6128b7049B0858e9990j51843k07706d2601A71756
$$ plain form
18727 -151245 -440502 -92425 -95881 -153401 309844 -112925 51984 -145322 -152539 133321 -107476
18715 1545 -79965 -259909 122446 182468 140491 -1245 -95825 222310 351114 -422115 258359
18703 76235 -58929 18464 111503 -83221 233645 -300215 144239 -199813 -35579 -266492 -311812
18692 -311812 -216297 109035 -58182 155470 -31107 45233 -90279 -11774 -75153 -99063 -292823
18681 -292823 -131877 -32350 -35895 -19372 282773 -17376 -22177 -229838 -323520 42915 42998 -196407
18668 -351358 -37533 -113026 -384302 -22022 116111 -167437 -11646 121820 -95687 -11951 -73908
18657 -73908 192431 95375 -149170 -224459 -11945 151504 -207876 -246967 -216029 -233371 -34958
18645 75842 -55923 -183676 -119501 -195629 -27049 20858 -59990 -211833 -419539 -42601 171756
18633c38431a49289i374L86j30386C41623C0914a24858j89303a48754g2748j15016
18622a87764B06017c44551N6015a25219B50578G5746a23276O0837J5297A5189
18611a9291j10501B17813D2563c28621a4257D2008A9254L8200M9564a74812A19
18599G7064R3989i8993j49359N0389F8722b9484j19701A46212J04354j13194a02608
18587a37686K4675c3723j80439H5913b28571f3890J1876j16216n5105A30926b76868
18575a86708O0333J9906j8709j57133d8940j02669B23255O7071a19711C9147K8952
18564F8099a41706O19j8049l5803I3091c58988A47697n0977a71357g1097i642
18552A43735b27308B18003h4168B86717r4239B5579i1259A81618b18000J8997
$$ plain form
18633 -338431 -149289 -9374 -8988 -139374 341623 30914 -124858 -314161 -148754 -72748 -187764
18622 -187764 206017 -344551 -288536 -125219 250578 75746 -123276 -62439 -47142 15189
18611 -19291 -129792 217813 42563 -328621 -14257 42008 19254 57454 107018 -174812 119
18599 77064 171053 -98993 -248352 -197963 68722 -29484 -149185 146212 250566 137372 -102608
18587 -137686 -113011 -33723 -214162 85913 -228571 -63890 -52014 -168230 -223335 130926 -276868
18575 -186708 -126375 -106469 -125178 -282311 -48940 -151609 223255 290326 -119711 39147 68099
18564 68099 -141706 -141087 -159136 -194939 93091 -358988 147697 96720 -171357 -71097 -9642
18552 143735 -227308 218003 -84168 286717 192478 25579 -91259 181618 -218000 -199003
18542a99003C1048f7998n95205A80595b9701C1788J425J32352b4962b580k90392
18531b92972D9697M4929g3029E0518e2446A87306j7895c0324k69688l6228J61741
18520a74499e67q7126A57372o6477j4571f90o8738b5878j93761F8095i3083r8735
18508a91818N8313A28695a09859k31576A32084e1100B78030h2210j2032q4609
18498a78851j30220a38390C25241B6305e6434j8053p2551c2391A11443l792P3703
18487A81354B1783b03305B57918H7580B2888e1624A48431J4147b32036a15550
18476c8080k6297B80201K7102a032F6736a3391j70430D1004e6630A00087c14721
18464A12955C7539a23839H5657c4352r0794b4990j05431j14772a3629j76808A33510
$$ plain form
18542 -199003 31048 -67998 -663203 180595 -29701 31788 33213 165565 -24962 -2580 -292972
18531 -292972 49697 94626 -73029 50518 -52446 187306 169411 -30324 -300012 -336240 -174499
18520 -174499 -567 -87693 157372 90895 76324 -690 -69428 -25878 -219639 68095 -93083 -191818
18508 -191818 -133505 128695 -109859 -341435 132084 -51100 278030 -82210 -94242 -178851
18498 -178851 -309071 -138390 325241 26305 -56434 -74487 -147038 -32391 111443 107651 181354
18487 181354 21783 -203305 257918 87580 22888 -51624 148431 162578 -232036 -115550
18476 -38080 -64377 280201 307303 -1032 66736 -13391 -183821 41004 -56630 100087 -314721
18464 112955 37539 -123839 85657 -34352 -125146 -24990 -130421 -245193 -13629 -190437 133510
18452b56350F2900a67622a2176r4034K4273G0443c708A59600i0842D2284a56278
18440A02047b51338A41819c40804h0236B3016J36671n8646n01a15095e579m705
18429a0284H0122b12325B34106A7709a73187A80962o1880a83781Q5837J7788O933
18418g3223c3928A48002b39528c6231c402B25261P5258A15168a39752B11362a69838
18406e3176A50490a74562j37662A61718b57738A19762N8276k9670g2094j57584
18396b29678A9335c7978A53797d3622k78862c2695A44711C4393f6862A21190g7915
18384F2343N8120b05131j21715B53355E6961L0770a85941f3519p5346d322r6035
18373a00357b9141H207a36843j78389c5917k32713G9371J55756h9255A63994g634
$$ plain form
18452 -256350 62900 -167622 -12176 -106210 -81937 70443 -3708 159600 -90842 42284 -156278
18440 102047 -251338 141819 -340804 -80236 23016 159687 101041 100540 -115095 -5579 -10284
18429 -10284 80122 -212325 234106 17709 -173187 180962 119082 -183781 -97944 -80156 -73223
18418 -73223 -33928 148002 -239528 -36231 -3402 225261 300519 115168 -139752 211362 -169838
18406 -53176 150490 -174562 -312224 161718 -257738 119762 178038 148368 -72094 -229678
18396 -229678 19335 -37978 153797 -43622 -322484 -32695 144711 34393 -66862 121190 -77915
18384 62343 120463 -205131 -326846 253355 56961 87731 -185941 -63519 -138865 -4322 -100357
18373 -100357 -29141 8207 -136843 -315232 -35917 -268630 79371 235127 -89255 163994 -7634
18361C9738B419J44422f0342Q905l4528A38546G209b21116c5347m7186B70880
18349B6155b75205I5317O5139l1737b15759I282a35033j1231A63568b7056j65924
18338a92980d9729K107D3937O9246B529N0659b39689h549C73819A34206n0631
18327H3575e2476A06231d5935M331j12586B79580c63522H4970l2820b19725o1078
18316b80803e9056B9033a32050I7168b05069C53474a73301c3976m69023a88241
18305a17988c7271r381D0944J70351b63099a22860p3062j99258a45380e2622A32618
18293d2075E1676a9895K217r5882B47193D4801H189d41036c021H0619a07525B46103
18280A2722b40760n2777A15915e2482E8315i6826B01898d8430l05619c8412E9955
$$ plain form
18361 39738 2419 146841 -60342 -51437 -85965 138546 7209 -221116 -35347 -82533 270880
18349 26155 -275205 95317 160456 128719 -215759 9282 -135033 -146264 163568 -27056 -192980
18338 -192980 -49729 -47622 43937 113183 2529 53188 -239689 -8549 373819 134206 83575
18327 83575 -52476 106231 -45935 -41604 -154190 279580 -363522 84970 52150 -219725 -280803
18316 -280803 -59056 29033 -132050 97168 -205069 353474 -173301 -33976 -502999 -188241
18305 -117988 -37271 -46652 40944 211295 -263099 -122860 -195922 -395180 -145380 -52622 132618
18293 -42075 51676 -19895 -17678 -113560 247193 44801 8189 -441036 -3021 80619 -107525 246103
18280 12722 -240760 -293537 115915 -52482 58315 -96826 201898 -48430 -354049 -38412 59955
18268h8639A30269L4535C7043K29617b22781B85761B8292h9359b8767E9405a52416
18256A198a4515o328A35810m9482B4964c09330A6622a28609j9228N1452m25458
18245e21843B01559a68716A75033G2376N5497F0572L19341a93535j23860a29981
18234F9341b0132j13009A5270a35579l70119A32803l8710i2918k82252H1580C390
18222f6167E4130J51369a54426o8782k0037B97359g4710F98b10503J00566A61288
18210F3637N4385e946A2932K65001a64976H5796N8298a05944h379j16966B16923
18198a19959L2477K2441m4301A4811a1982j89917K3134I4025j5777d17734d2233
18186A16343a33882j50589A45379b29641B94770j34587R123d8817j53147c7282
$$ plain form
18268 -88639 130269 164804 37043 266660 -222781 285761 28292 -89359 -28767 59405 -152416
18256 1198 -14515 -20843 135810 86328 24964 -309330 16622 -128609 -147837 -96385 -521843
18245 -521843 201559 -168716 175033 72376 127873 60572 379913 -193535 -317395 -129981
18234 69341 -20132 -133141 15270 -135579 -505698 132803 94093 -92918 -375170 81580 3390
18222 -66167 54130 205499 -154426 -223208 -243245 297359 -74710 698 -210503 -109937 161288
18210 63637 118022 -5946 12932 277933 -164976 85796 144094 -105944 -8379 -125345 216923
18198 -119959 -87482 -65041 -109342 14811 -11982 -201899 -178765 94025 78248 -417734 -42233
18186 116343 -133882 -284471 145379 -229641 294770 160183 169306 -48817 -201964 -37282
18175A95909a7819k66653d6212B78414h6482j7700A42271a20155D3750e11672
18164b81445E4488o220O4741a37868j52431J34956f7171l54076A60064J17996
18154B78060a17730P828k60135F0387a01760b4447B12535d10968A62519k4831
18144A37688c59815O4724J44525F1529c8826f459k05152A2232c2357j58620a119
18132B09715A9672L6548b39285L4598n9465b5167C71331d2370l46029J10936a11890
18120b85823R4622Q0049B8944R0905q825a38705A91963J2711q8446b7090I5989
18108B03193b4972C71014C6359e2451l7221k8061e4314A68981E937g7445k33092
18097c10537C20P7981L0541L57395b6343A43775a21865F7216O137J32573R631
$$ plain form
18175 195909 -17819 -284472 -46212 278414 -86482 -104182 142271 -120155 43750 -511672
18164 -281445 54488 48268 113009 -137868 -290299 -155343 -67171 -421247 160064 278060
18154 278060 -117730 -109902 -370037 60387 -101760 -24447 212535 -410968 162519 137688
18144 137688 -359815 -295091 -150566 61529 -38826 -6459 -211611 12232 -32357 -190977 -1119
18132 209715 19672 56220 -239285 -204687 -264152 -25167 371331 -42370 -388399 -277463 -111890
18120 -285823 -191201 -111152 28944 119849 111024 -138705 191963 204674 116228 -27090 95989
18108 203193 -24972 371014 36359 -52451 -89672 -117733 -54314 168981 5937 -77445 -310537
18097 -310537 320 78301 108842 466237 -26343 143775 -121865 67216 73353 205926 215557
18086B15557b58359I4901H652Q1860A1334J46073a49689d5503e347F4988R5854
18075A60842b01402i6323A20668r378J09768b57322d9929I2162k2443J67467q8750
18064A48436O9763A8894c1191a4923j04467j13930D196K53475b30999C4463g5271
18052B28420b01114a7760M260B4338J46058E679M3974a49872g0040k18451a10507
18040G1837P0444A0883e6954j97555B35424r8522a11283a4034n03962a8921j36459
18029a55380f7579H4670l0516a22683l2200J6956K5609p4480B05452E5999B1666
18017A60533b982j47697q1809A19832J3527a00464k5426L8432A95306a9263F3332
18005a73366M9302J8678K4996c0923j38975M7197L4194j18887d8829A17397a06347
$$ plain form
18086 215557 -258359 94901 8652 90512 11334 157407 -149689 -45503 -5347 64988 160842
18075 160842 -201402 -96323 120668 111290 221058 -257322 -49929 92162 69719 237186 148436
18064 148436 218199 18894 -31191 -14923 -119390 -233320 4196 257671 -230999 34463 -75271
18052 228420 -201114 -17760 -13500 24338 170396 5679 49653 -149872 -70040 -288491 -110507
18040 71837 142281 10883 -56954 -254509 235424 136902 -111283 -14034 -517996 -18921 -155380
18029 -155380 -67579 84670 54154 -122683 -154883 -137927 -112318 -186798 205452 55999 21666
18017 160533 -2982 -150679 -232488 119832 133359 -100464 -125890 -87458 195306 -19263 63332
18005 -173366 -124064 -105386 -80390 -30923 -169898 -122701 -88507 -207394 -48829 117397 -106347
17993d9606j39825O9515j531Q548A25866A5808Q6362c835j16583M1609E2876K75243
17981C28119j52421e3774C8978a52797j8908a2070B40929o2122F867a51492p3706
17970b25198A72693k8287o9475K32015K47247e52809f4944N055C04365G88a21379
17958i9651d6057A49188B6401b521A22027D7417a30453k39452a64876n1317A40653
17946a55514k21811d516k37830a8224l62083O6268A28065G506a83985A22518R8363
17935B20881b33137j05009B18904b03941a0643A65881a37133C77153D7074P1706
17925A18780h2731a3890B35372a06020c0813k43540L0851f0022C0841c8646G4073
17913A04631O3220O6014c3050j26937A42836D321J05855a20975k74023a2665j60857
$$ plain form
17993 -49606 -189431 -119916 -121447 -112899 125866 15808 102170 -3835 -120418 -78809 52876 328119
17981 328119 175698 -53774 38978 -152797 -171705 -12070 240929 178807 6867 -151492 -225198
17970 -225198 172693 144406 74931 306946 554193 -552809 -64944 -59889 304365 788 -121379
17958 -99651 -46057 149188 26401 -2521 122027 47417 -130453 -369905 -164876 -216193 140653
17946 -155514 -377325 -4516 -242346 -18224 -380307 -314039 128065 7506 -183985 122518 220881
17935 220881 -233137 -338146 218904 -203941 -10643 165881 -137133 377153 47074 118780
17925 118780 -82731 -13890 235372 -106020 -30813 -274353 -243502 -60022 30841 -38646 74073
17913 104631 167851 233865 -33050 -159987 142836 4321 110176 -120975 -394998 -12665 -173522
17902a73522B34218a2667k73179e8273J2571i183I0920b15057j09346J45153M5394
17891a33856E1309i4634r5300A41009a5824q5821E9705k8577c19280B00217j5787
17880A84430B7390L8295a99969F5451j8844b0746A61731N0493c7161m1169a574
17868A78879n9718b71188q2040a2096G3865d5590l06239A02984f6770A04418B3890
17856f4064h710q0549b5504D3514a24878c5586G9740M7539b08861C3514r461a9177
17843A28411Q8260R505G0874A312Q7922g7871A75550J08184o2198n5928J05980
17832B71588a45918k46532I9999L2889M0451o2814l1949c0491A7100h2939D8248
17820a09155A11933O355a82355f3576E9288B1968L1348b34400B35159a16216D6071
$$ plain form
17902 -173522 234218 -12667 -285846 -58273 -45702 -9183 90920 -215057 -324403 -179250 -133856
17891 -133856 51309 -94634 -189934 141009 -15824 -101645 59705 31128 -319280 200217 184430
17880 184430 27390 65685 -199969 65451 46607 -20746 161731 212224 -37161 -78330 -1574
17868 178879 119161 -271188 -353228 -12096 73865 -45590 -351829 102984 -66770 104418 23890
17856 -64064 -8710 -89259 -25504 43514 -124878 -35586 79740 127279 -208861 33514 24053 -19177
17843 128411 216671 226176 70874 1312 89234 -77871 175550 283734 221536 165608 271588
17832 271588 -145918 -392450 99999 132888 173339 110525 78576 -30491 17100 -82939 48248
17820 -109155 111933 118288 -182355 -63576 59288 21968 53316 -234400 235159 -116216 46071
17808D2935J87732i1789G3284b71623A30193J10677b35938e1226l8948c421k56512
17797b59933g0020k906j9716B29103A03746P0030c08074I5541a33866H7464e0037
17785B00108J99534b09259b8403j45090E90899i5391E6701a98055a9957E7738
17774a84701C4843P7616m1548a10191A12931a78068c6930k94180a31882A06500
17763a17773A39462M6213a39663A16507i7102B77698q6423F2417h1006J805A24522
17751d68598a84779H1788k263C0308c0799p6658J0137B41329H4276K6900J13818
17740B24994a2224n2127l20537J41571A48929c60111B64735b03296i7917H1085
17729I4972B3037f9959B89143a26589B95476a85805h4273n9994c2412B6261O9262
$$ plain form
17808 42935 230667 -91789 73284 -271623 130193 240870 -235938 -51226 -90174 -3421 -259933
17797 -259933 -70020 -72926 -92642 229103 103746 173776 -308074 95541 -133866 87464 -50037
17785 200108 399642 -209259 -28403 -173493 590899 -95391 56701 -198055 -19957 57738
17774 -184701 34843 112459 70911 -110191 112931 -178068 -36930 -331110 -131882 106500
17763 -117773 139462 185675 -139663 116507 -97102 277698 191275 62417 -81006 -79201 124522
17751 -468598 -184779 81788 79525 30308 -30799 -107457 -97320 241329 84276 111176 224994
17740 224994 -12224 -64351 -384888 -243317 148929 -360111 264735 -203296 -97917 81085
17729 94972 23037 -69959 289143 -126589 295476 -185805 -84273 -144267 -32412 26261 95523
17718I5523d4930F1540a50866n4033H5159a56433q972H0485L31813b47867G116
17706g1418j05230j57194c4073m8704j68312g7781C14534g6263J2410B69037F7588
17694D0224N6615R723L2777D6298I558e4528A57126a37679F848L43854b04461
17682a21470l980j6698A30216C8510J38794A2069P5089K63580A19254B9248a27903
17670c73799A4138f6419k1286k57965i0313b4352j31744n4730C14455G4724l5792
17659C8932J70194F5379b28838A45432b4991m53983K06743a05945A40874A2572
17648a56101C93648a14382p8187C27210a63767c8628B67006l6921D4055b7720
17637a00685k3627k343B21970I3958D3146e9277G0303b05437e9427C71177A40656
$$ plain form
17718 95523 -44930 61540 -150866 -204899 85159 -156433 -165405 80485 412298 -247867 7116
17706 -71418 -176648 -333842 -34073 -82777 -251089 -77781 314534 -76263 -63853 269037 67588
17694 40224 96839 106562 139339 46298 9558 -54528 157126 -137679 6848 350702 -204461
17682 -121470 -125450 -142148 130216 38510 177304 12069 87158 350738 119254 29248 -127903
17670 -373799 14138 -66419 -87705 -345670 -90313 -24352 -156096 -210826 314455 74724 38932
17659 38932 209126 65379 -228838 145432 -24991 -478974 -272231 -105945 140874 12572
17648 -156101 393648 -114382 -192569 327210 -163767 -38628 267006 230085 44055 -27720
17637 -100685 -124312 -126655 221970 93958 43146 -59277 70303 -205437 -59427 371177 140656
17625a51188p0696B75441a18518A01107b00574D6296N7745J10239a6451A41347
17614H3034j8552d31492A97849p2720f9056b737r4150B16991b39665B07808a55468
17602D9453a76262K3535n371p8515G7655l7195J32214b33672G6862b06753A48270
17590c46123A14122O3957C3900G856a81699c8721D078b92254A84131a22247M8830
17579g3417C39546r8133A12677b61220C48001b31346G878N5075i106K179B66739
17567A75094i0600B76489F8257c0512C43832G0433c09235C22979a54747M2556
17557a12191A16022J41694J16967J19916A0162a37334Q584N6237L3083B76868
17546A83797c04793B03557j780K4643j06971l6730A7842L37145A9062c0676I4354
$$ plain form
17625 -151188 -221884 275441 -118518 101107 -200574 46296 104041 214280 -16451 141347
17614 83034 64482 -431492 197849 125129 -69056 -2737 -96887 216991 -239665 207808 -155468
17602 49453 -176262 -152727 -158098 -236613 77655 40460 172674 -233672 76862 -206753 148270
17590 -346123 114122 178079 33900 7856 -181699 -38721 4078 -292254 184131 -122247 -73417
17579 -73417 339546 241413 112677 -261220 348001 -231346 7878 62953 -9106 -6927 266739
17567 175094 -90600 276489 68257 -30512 343832 70433 -309235 322979 -154747 -112191
17557 -112191 116022 257716 374683 494599 10162 -137334 -128750 -72513 -39430 276868
17546 183797 -304793 203557 201777 226420 119449 82719 17842 354987 19062 -30676 94354
17534B8436f3619D0097a29433D98173b2835j08638q2801A38798O9881N6599q3727
17523A81551E2978J29551c3694n9156C80905p0122a16120j13979F2897L8836J89191
17512B90924a81053G30J62644o6263B6402e1517C28295c7106B00474I0806a6475
17500C81446B3435K69122a01706N443A30221e1265C0212K52980j29131J67590
17490C21651n8803K04964c7237o0700p3814E0747Q2730J98190E8823R2956o7431
17479H4348L42786F4958J50089E106J23417L7168K75630j53139a03138H3544P8035
17468A61579E4331J15294J798J5818f2862E8513a5584J931D43975C6384a12836
17456I9635J46797K78901b00090E71941A02654M29771j22982c6422A39265L40091
$$ plain form
17534 28436 -63619 40097 -129433 498173 -22835 -131473 -214274 138798 208679 265278 181551
17523 181551 52978 182529 -33694 -92850 380905 310783 -116120 -230099 62897 101733 290924
17512 290924 -181053 730 163374 97111 26402 -51517 328295 -37106 200474 90806 -16475
17500 381446 23435 292557 -101706 -96263 130221 -51265 30212 283192 154061 321651
17490 321651 262848 467812 -37237 -97937 -171751 50747 133477 331667 58823 151779 84348
17479 84348 427134 64958 215047 5106 128523 165691 441321 288182 -103138 83544 161579
17468 161579 54331 169625 171423 187241 -62862 58513 -15584 -13653 443975 36384 -112836
17456 99635 246432 525333 -200090 571941 102654 532425 409443 -36422 139265 479356
17446D79356O0305B58110J27256C1092Q6365J27964j19743Q0446K20150A84819
17435E3060K94974b3051A05165K26548p5164G4480K20524q1802A04522M6932l2740
17424A18714k4359K58097A29929b6648C75986j57435b69897A26759L8589J94007
17414C59355M5794J6679J81295A23041K51979A51935J16782m6146g282A21175
17403B81518a61047B71030j8889G0696d9255B67299A30946J32049L30563B60367
17392D2732K38393g4656B65362G9990Q6093J8109K6670q4232j2800C2945i1236
17380E14064b25035A19837J159J09538J22549B9801J5649O8947K45868j36751
17370B23514a43177B45732n1224J188J06703F9991K03330G9814K67579K83030
$$ plain form
17446 479356 539661 258110 385366 31092 117457 245421 125678 206124 426274 184819
17435 53060 348034 -23051 105165 331713 256549 74480 295004 213202 104522 151454 118714
17424 118714 94355 352452 129929 -26648 375986 218551 -269897 126759 165348 359355
17414 359355 405149 421828 603123 123041 375020 151935 268717 222571 -7282 121175
17403 281518 -161047 271030 252141 70696 -49255 267299 130946 262995 593558 260367
17392 42732 281125 -74656 265362 79990 166083 184192 210862 126630 113830 32945 -91236
17380 514064 -225035 119837 120996 230534 353083 29801 45450 114397 360265 223514
17370 223514 -143177 245732 194508 195696 302399 69991 273321 79814 347393 630423
17360F30423b56853C23802j60201L62209a5590A35097J266K91712G8212J82132
17350B60344j21239O6194G3663J71702P6053o9790k4137J63253a489j12646A03215
17338B42435J8580r8656M1247Q7558J45694k12413B8087M34361q6149c3143C14178
17326A17660J27731k7340J45574a317D21052Q1143C1665J16733g0441A26857R0928
17315B17785L198a79494K1543B17967F6486M08136A85288c3047G6422e691D8530
17303A21980K14906K9043j42806K97423B28042i828j76813B20523E8810K24687
17293B83497q2131J46439D5267R5437Q3155c7807A42809J91838r8901b08229A70230
17281B94298G3254a59056A40738d9873F7672P6702M43358B86203Q7906C4799J40445
$$ plain form
17360 630423 -256853 323802 163601 525810 -15590 135097 136363 428075 78212 260344
17350 260344 139105 205299 73663 245365 321418 251628 227491 390744 -1489 -114135 103215
17338 242435 261015 162359 203606 291164 436858 224445 28087 462448 376299 -33143 314178
17326 117660 245391 218051 363625 -1317 421052 502195 31665 148398 -70441 126857 217785
17315 217785 220983 -179494 -157951 217967 66486 474622 185288 -33047 76422 -5691 48530
17303 121980 336886 365929 223123 520546 228042 -9828 -186641 220523 58810 283497
17293 283497 201366 347805 45267 140704 223859 -37807 142809 334647 235746 -208229 170230
17281 294298 73254 -159056 140738 -49873 67672 144374 587732 286203 374109 34799 175244
17270A75244G2212J51459k9550H2807J24209L01708B50594m9460K46470A73203
17259C69874B4019M82109j83801I7209M02992a47522A04769b1629B65321j24468
17249A40853o790k426N6449J79463H6360J32415c1603F9575M9863R4308m3853
17238A69893b8406r2944B46016k4983r9964J78129q1672K18814j15841A22323
17227B77325J06773H1812N6645P2292i871D36805q3729m5859J68613A63933M46450
17216F10383B60579e45A35259Q5675E0414B2862L0097J95463J18361M7977G3050
17204D51169A58640Q7939J02716N6785j03990o4513j7827O1614j128H3151L1343
17193A14494Q1741K71695k28312J87798A69439k900K7384J60371Q9973A16989
$$ plain form
17270 175244 72212 223671 194121 82807 207016 508724 250594 201134 447604 173203
17259 369874 24019 506128 322327 97209 500201 -147522 104769 -21629 265321 140853
17249 140853 134063 131637 188086 367549 86360 218775 -31603 69575 119438 213746 169893
17238 169893 -28406 -121350 246016 221033 121069 299198 217526 436340 320499 122323
17227 277325 384098 81812 138457 210749 -9871 436805 353076 307217 475830 163933 610383
17216 610383 260579 -545 135259 220934 50414 22862 52959 248422 366783 414760 73050
17204 451169 158640 246579 349295 406080 302090 237577 219750 281364 280236 83151 114494
17193 114494 196235 467930 239618 427416 169439 166539 193923 354294 444267 116989
17182A69901K91248K5413A21037L33272A43872J82280j47273R3723J53069b3213
17171E03610A21673L28891k20761J19371Q2496J98878k22767A21129J80766K9712
17161C31607a83602B72237r5581K22249J1487L72860f5160C37560A43056R7979
17151B41035J89853B05127J89062J69279A082O51798B04779K11390R7519M2487
17141E56175B04505L98154k05148N132K6176d1460F0871L55607A49991K92825
17131D42816J9825A64754K00031n7351K6426k1063A30817L5235J20403N4328j46063
17120A94720J77914l3952m6208Q9935O0159J94443j66519j34054P0853p491K50598
17109F50398k24459K19855j39890J09213k39869J68567j52774J39567k10052K40061
$$ plain form
17182 169901 461149 486562 121037 454309 143872 326152 178879 272602 425671 -23213
17171 503610 121673 450564 229803 349174 431670 630548 407781 121129 301895 331607
17161 331607 -183602 272237 176656 398905 410392 783252 -65160 337560 143056 241035
17151 241035 430888 205127 394189 563468 1082 652880 204779 416169 513688 556175
17141 556175 204505 602659 397511 402643 428819 -41460 60871 416478 149991 442816
17131 442816 462641 164754 364785 307434 333860 312797 130817 166052 286455 340783 194720
17120 194720 372634 338682 292474 382409 442568 637011 470492 336438 407291 399800 650398
17109 650398 425939 645794 505904 615117 375248 543815 391041 530608 320556 560617
17099E60617l0720J17547F6361M96533j84815J44690k07569o1216M08783k35183
17089D27584m9589j88227M89033K80766m06556J27979J70085D07666J25669j71502
17079C61833J30343K0750k31801K882N65517m7843j81167C03723K70124j29121
17069D44726K29523A07605K93821J42286B23658J88670J74149m9790J45435k48629
17059D33493K4356j67727M51167j22718J86591k04276A08152J066813C49947J30056
17049D80003j53040N55406j94394l5892N08676n57351j12576A65781N81884C64025
17038A008543l12025k97285K70285J42099j02242j42309j57359N64987k55757
17029G18937k06678K96415l18267K22612L13772j55341q1329j22413l7676N8045
$$ plain form
17099 560617 529897 647444 66361 562894 378079 522769 315200 253984 662767 427584
17089 427584 377995 189768 678801 959567 553011 680990 851075 407666 533335 361833
17079 361833 492176 512926 281125 284007 849524 801681 620514 303723 573847 444726
17069 444726 674249 107605 401426 543712 223658 412328 586477 536687 682122 433493
17059 433493 457849 290122 741289 618571 805162 600886 108152 1174965 349947 480003
17049 480003 326963 882369 687975 652083 1160759 603408 490832 165781 747665 364025
17038 1008543 696518 399233 669518 811617 709375 567066 409707 974694 718937
17029 718937 512259 808674 490407 713019 1026791 871450 790121 667708 630032 688077
17019F88077k9166N5438r9045p9215L63656l91262K19059N7600Q1346l18228R4534
17008F42794J59445k44176L00650L2311J02182D22308J63268N64298k35426k56325
16998F58123K71284D06639L62173J70904j39106Q5669J92789k13343P5587J18101
16988A059413j75238O890K3442k80544L36707r4639J3582j77555o5172J4133L33442
16977I94461K2991j52138K71573k32480j34628L32261k93574N881N7299m4456
16967H27190M7026N4056R1495J09104K15368j78015k06107J99976R5075J36368
16957A391536m3827j74157k03163K69417j70077j01417M1503L55485l47196L09359
16947A327463l48962K83363k01925N2475J74439J59997k49026J33311P2508R1457
$$ plain form
17019 688077 658911 714349 615304 536089 899745 508483 727542 785142 866488 548260 642794
17008 642794 802239 558063 858713 891024 993206 422308 585576 1149874 914448 658123
16998 658123 929407 406639 768812 939716 800610 886279 1079068 865725 941312 1059413
16988 1059413 884175 891065 914507 633963 970670 876031 889613 712058 646886 661019 994461
16977 994461 1017452 865314 1136887 904407 769779 1102040 808466 814347 871646 827190
16967 827190 874216 928272 1019767 1128871 1344239 1166224 960117 1160093 1255168 1391536
16957 1391536 1347709 1173552 970389 1239806 1069729 968312 1009815 1365300 1018104 1327463
16947 1327463 978501 1261864 1059939 1112414 1286853 1446850 1197824 1331135 1403643 1495100
16937A495100j75762r8790J60454l9243O2877j55554K7064l26568L47526K51625
16927A548729J36106l26004J40738k52437N89247m81854N9920N9947M8485K11252
16917A734129m51003K20266K42130J30492N1873k28140j60125J96094K09643J58732
16907B104091J1208l34227K2706P2042J21636l03656K68052j965J51424l87440
16897A723871L99228K5864k62923q1183J16378O0635K93060j88922K01730k50479
16887B037259K91360l64380M99960k45885P4853P1545J34710k07457L14516k38543
16877B367938R3436K38946j03823k88096M80741l86957K23307L33080j6542k54287
16867B687743O7961J35778J31382k75003L79289j84233O9619P1891k08023K30049
$$ plain form
16937 1495100 1319338 1220548 1381002 1341759 1404636 1249082 1276146 949578 1297104 1548729
16927 1548729 1684835 1358831 1499569 1247132 1836379 1354525 1414445 1474392 1522877 1734129
16917 1734129 1283126 1503392 1745522 1876014 1927887 1699747 1539622 1735716 1945359 2104091
16907 2104091 2115299 1781072 1803778 1875820 1997456 1693800 1961852 1959887 2111311 1723871
16897 1723871 2123099 2148963 1886040 1804857 1921235 1981870 2274930 2086008 2287738 2037259
16887 2037259 2328619 1964239 2464199 2218314 2293167 2364712 2499422 2291965 2606481 2367938
16877 2367938 2461374 2700320 2596497 2308401 2789142 2402185 2625492 2958572 2942030 2687743
16867 2687743 2755704 2891482 3022864 2747861 3127150 2942917 3012536 3084427 2876404 3106453
16857C106453Q8004k1700L3777J96832l5486J02675n5727J91333Q2474J49428
16847C838063R3824r2330j77691J44271K88979m13501M36349l30280K27623O4922
16837D080229M81742k04417j28124L77046P8841l7871Q7708K25522j90100L47692
16827E118268J28495p8646r3211N1381M00644j10491J96055J97792o6610L31887
16817F075564l3616q7034J33175J69001J67704N09009k21367j26620M20476M4149
16807G050441J09313L49630L85675k35973M04504J03316o5590N90686o7916L95021
16797I019107L4700n6023N98669j05659N43923M67263K7550J87076N23984j592
16787A1238998J8336O28813O27380J97207M5162O83412O9206N68270L76120P8333
$$ plain form
16857 3106453 3194457 3172757 3206534 3403366 3367880 3470555 3414828 3606161 3688635 3838063
16847 3838063 3931887 3839557 3661866 3806137 4095116 3681615 4117964 3787684 4015307 4080229
16837 4080229 4561971 4357554 4229430 4606476 4685317 4647446 4735154 4960676 4770576 5118268
16827 5118268 5246763 5168117 5074906 5126287 5526931 5416440 5612495 5810287 5743677 6075564
16817 6075564 6041948 5954914 6088089 6257090 6424794 6933803 6712436 6585816 7006292 7050441
16807 7050441 7159754 7509384 7895059 7659086 8063590 8166906 8101316 8692002 8624086 9019107
16797 9019107 9053807 8997784 9596453 9490794 10034717 10501980 10529530 10716606 11240590 11238998
16787 11238998 11257334 11886147 12513527 12710734 12755896 13439308 13508514 14076784 14452904 14531237
16777A4531237J004460K17345N30876O07402M30541O37037M00228O95129L82200
16768A9436455Q42915N33533Q44098Q81637M83125J156699J237020M79129P05086
16759B6599697J044023J356946Q02776J494883J425676J316782J733590J167535
16751C6941908J695004J811338J390158K191769J951904K278511K515302K384512
16743E3160406K390859K879143L192194L443438L152550L760814M069767L865829
16735G9915000M421447M674041N031011N034038N388084N478377N918708O435299
16727A22296005O176357O596629O448874O415871O426482O172725N609362N005538
16719A71147843M556803L846691K835172J713481Q19522m58229j221444k422268
$$ plain form
16777 14531237 15535697 15753042 16283918 16891320 17321861 17958898 18359126 19054255 19436455
16768 19436455 20279370 20812903 21657001 22538638 23021763 24178462 25415482 25894611 26599697
16759 26599697 27643720 29000666 29803442 31298325 32724001 34040783 35774373 36941908
16751 36941908 38636912 40448250 41838408 44030177 45982081 48260592 50775894 53160406
16743 53160406 55551265 58430408 61622602 65066040 68218590 71979404 76049171 79915000
16735 79915000 84336447 89010488 94041499 99075537 104463621 109941998 115860706 122296005
16727 122296005 128472362 135068991 141517865 147933736 154360218 160532943 166142305 171147843
16719 171147843 175704646 179551337 182386509 184099990 184919512 184461283 183239839 180817571
16711A80817571l453341m371828m890793n608342o052837o590253o284294o799274
16703A36766609o384322p009153o431391o340674n783073n941522n257950n306787
16695H8311737m985307m733451m018860m054919l895206l718531k994984l152282
16687E6758197k906858k421525l126745j820670k468572k074172k066155k003084
16679C7870416j496867j587303j525403j674908q93496j653091q08901j181634
16671B7048813j184588j094064r83986o67775j179562m65115r58257o62339p60793
16662A9092334o13550o87417o09138o38968o09855n56857j92115j051656k76928
16653A3855850l82196m7811m18327o65299k69434k77983j81298n65795j72864
$$ plain form
16711 180817571 177364230 172992402 168101609 162493267 156440430 149850177 143565883 136766609
16703 136766609 130382287 123373134 116941743 110601069 104817996 98876474 93618524 88311737
16695 88311737 83326430 78592979 74574119 70519200 66623994 62905463 59910479 56758197
16687 56758197 53851339 51429814 48303069 46482399 44013827 41939655 39873500 37870416
16679 37870416 36373549 34786246 33260843 31585935 30692439 29039348 28230447 27048813
16671 27048813 25864225 24770161 23786175 23118400 21938838 21473723 20515466 19853127 19092334
16662 19092334 18478784 17791367 17182229 16543261 15933406 15376549 15184434 14132778 13855850
16653 13855850 13473654 13425843 13007516 12342217 12072783 11794800 11613502 11047707 10874843
16644A0874843l36299J3872o21887m70892k50896j1937J62527n96467l42545j91559
16634H228760k64938k73630L50577m09793k91305j83409J75915n41317j05357
16625F685503r238k12562k12327j8156q9847k98932k1827N4942k62845p7056j86781
16614E350874M2564m09192J88670j26240m77325Q4135j73887J67769l58851J74884
16604D463401o14291j9404J2687N4331j30740M9654L42967o35812P798K32316
16594C762907k20683o8559j12266O5924N3206n19385J36918J23272j96707p0909
16584B953718K22582j41527l53924o1240J33358j93374O9098J17801m0941k46553
16574B458998L02370k53476R6742P2860l36654j11608J91103l32895P7904k8657
$$ plain form
16644 10874843 10538544 10552416 9930529 9459637 9208741 9196804 9359331 8762864 8420319 8228760
16634 8228760 7963822 7690192 8040769 7630976 7339671 7156262 7332177 6790860 6685503
16625 6685503 6676265 6463703 6251376 6233220 6143373 5844441 5822614 5877556 5614711 5537655 5350874
16614 5350874 5393438 4984246 5172916 5046676 4569351 4653486 4479599 4647368 4288517 4463401
16604 4463401 3849110 3829706 3842393 3896724 3765984 3815638 4158605 3522793 3530591 3762907
16594 3762907 3542224 3473665 3361399 3427323 3480529 2961144 3098062 3221334 3024627 2953718
16584 2953718 3176300 3034773 2680849 2619609 2752967 2559593 2628691 2746492 2705551 2458998
16574 2458998 2761368 2507892 2604634 2677494 2340840 2229232 2420335 2087440 2165344 2136687
16564B136687L04521j66779l18360J63827l22368k0141M46614m12602M1811l31521
16554A521689J25341N00170l09979J06177k35595R2703j00221k87508K23312J42205
16544A778294k36402k6458M11082m32000K27102P5486n71151N01847O9530o27109
16534A170221K64813J20697k70647k8813K34807l05961L53358q3191l30264m0822
16524A084198K67554j45778q4750J55606K16134k11081n6615k42358L28638j90027
16514A121521N7662k80001K02389R5508p9093p9766j49038O5671L14155j86229
16504A082779J94472j58822l20945M31931j69147m7234j2309o6217k39285N2565
16494G47788J96935k11207O9046k08608L37741m9357N2523r1766p7085J24878
$$ plain form
16564 2136687 2441208 2274429 1956069 2119896 1797528 1777387 2224001 1811399 1853210 1521689
16554 1521689 1647030 2147200 1837221 1943398 1707803 1800506 1700285 1412777 1636089 1778294
16544 1778294 1541892 1515434 1926516 1494516 1721618 1797104 1225953 1727800 1797330 1170221
16534 1170221 1435034 1555731 1285084 1256271 1491078 1185117 1538475 1455284 1125020 1084198
16524 1084198 1351752 1205974 1121224 1276830 1492964 1281883 1225268 982910 1311548 1121521
16514 1121521 1179183 899182 1101571 1197079 1117986 1038220 889182 954853 1269008 1082779
16504 1082779 1277251 1118429 797484 1229415 1060268 1013034 1000725 934508 695223 747788
16494 747788 944723 733516 802562 593954 931695 882338 934861 843095 766010 890888
16484H90888K19193N9728l26077r7879K35250r5186N5674R2576l71948J99889
16474H62108M8465k43885P0363P1228n4366A01322N53796N2305j21104P3147O178
16463F65644J52092k01779j32898K22465K55127m01297N8891J38280K16615C49300
16452E27898R1716J58887j779j39175M6064j63994L339j23564L49583j47402J34114
16441G35687j10164m1147k76104j7844R4822M29520p2279K12813D56941K83757
16431G40698l52067O8970B11751L23293K00199n7929A59764K12108L84695j47978
16421F08589j55844M4322H1635J71469M597J44867N2750I0125N20704J7870j71939
16410D56760j60330K37797A61880M45442B57218L6453K558M69397B16060n5686
$$ plain form
16484 890888 1110081 1169809 843732 745853 981103 885917 941591 1034167 662219 862108
16474 862108 910573 666688 737051 808279 753913 101322 655118 707423 586319 659466 665644
16463 665644 817736 615957 483059 705524 960651 559354 618245 756525 973140 349300
16452 527898 619614 778501 776722 637547 683611 519617 522956 399392 748975 601573 735687
16441 735687 625523 584376 308272 290428 385250 814770 742491 955304 456941 740698
16431 740698 388631 457601 211751 535044 735243 677314 159764 371872 756567 608589
16421 608589 452745 497067 81635 253104 257701 402568 455318 90125 610829 628699 456760
16410 456760 296430 534227 161880 607322 257218 293671 296229 765626 216060 160374
16400A60374L7899L05454j75300L1542A37343K83997J44797A92939J93674J74763
16390E61376D5580M87999B49910K26144j64353j01677L22337j62826j4551j13671
16380B41313J30042J27513J15317B97759K88986j31268n2621k6624L01975B98162
16369A41144C6967J17529k0173J53239D0355L46510B3151L37440g4676A93073
16358D77363k1380B4839K58979A23173L78787B17848k3415K0487C1694K06303
16348B37997N38822c7515E06919j08980D3524J87273o2895L554K82808l2619r9307
16337C22338n2568k2757K3094r3693Q492k2486L28138J0608j08853g7374j00848
16326a78222C7017J84152M08G0752j1460J12096n4346K43109D9497a92227P0504
$$ plain form
16400 160374 198273 503727 328427 359969 137343 421340 566137 192939 386613 561376
16390 561376 45580 533579 249910 476054 311701 210024 532361 369535 354984 241313
16380 241313 371355 498868 614185 297759 586745 455477 402856 376232 678207 298162
16369 141144 36967 154496 134323 287562 40355 386865 23151 360591 -74676 193073
16358 477363 455983 24839 283818 123173 501960 217848 194433 214920 31694 237997
16348 237997 776819 -37515 506919 397939 43524 230797 167902 171456 454264 421645 322338
16337 322338 269770 247013 270107 176414 184906 162420 490558 501166 392313 -77374 -178222
16326 -178222 37017 221169 221577 70752 59292 171388 117042 360151 49497 -192227 -121723
16315a21723A99111C8101J11585J84241K0496j18563d6407A89965P1891n6879
16305B04977A7098g1753B41498L3991k4326j2989N68n9794Q4594O0676n5228D0650
16292b7257C64644j01402a17207A69928g893D41299j06355B9593r401K7872K7569
16281G5633d4939A23884N0080J07816a12634A99940c06325B16130N9763C6139
16270B70267G703c5123C2412j1507a11248D68118G5208P437b16754h9639E6748
16258B72704a10024I8575J515i5797q3597I200K86253g7993B18481J46337C1341
16246F7004O6560a58208A79125p876a50623A54395C0775R9259k1349D7840m429
16235D3411a77473H2358J64383b55169A43767b85790A43404b54637D0425d3575
$$ plain form
16315 -121723 199111 38101 149686 333927 354423 235860 -46407 189965 261856 204977
16305 204977 17098 -71753 241498 275489 251163 238174 238742 178948 263542 324218 268990 40650
16292 -27257 364644 263242 -117207 169928 -7893 441299 334944 29593 20192 48064 75633
16281 75633 -44939 123884 173964 281780 -112634 199940 -306325 216130 275893 36139
16270 270267 7703 -35123 32412 20905 -111248 468118 75208 82645 -216754 -89639 56748
16258 272704 -110024 98575 100090 -95797 -179394 9200 295453 -77993 218481 364818 31341
16246 67004 133564 -158208 179125 171249 -150623 154395 30775 130034 108685 47840 43411
16235 43411 -177473 82358 246741 -255169 143767 -285790 143404 -254637 40425 -43575
16224a23011B13445a24642a8641B07275K31960C5777K71379q0456A00275n330
16214I4945N5914o5579a39175j69156P2746A55066J0685o310g0472C49231B6514
16202c7496n5357J2631A61043m430J00102G0293b49288K2450b2864A12358A496
16190E1376f5888B69266r0711l0061K99062G2343h71j36825c3001A07028a14793
16178A05412b20721J2071L6289h5286A11974J68664j22687a76651e4380B54566
16167b03381E1966K78468f5502o4898j46707F5126P59a31686E9672a55850n877
16156a61727A93069e5141E4975L52154d5593A45728a80757D0021O9825B9966K43992
16145B73958B3816J36552c90225B34161C2349K1828b3983B82828p1552L0548O2378
$$ plain form
16224 -123011 213445 -124642 -18641 207275 439235 35777 307156 226700 100275 94945
16214 94945 150859 85280 -139175 -308331 -235585 155066 165751 159441 -70472 349231 26514
16202 -37496 -92853 -80222 161043 156613 256715 70293 -249288 -226838 -22864 112358 1496
16190 51376 -65888 269266 178555 148494 447556 72343 -871 -137696 -33001 107028 -114793
16178 105412 -220721 -208650 -172361 -85286 111974 280638 157951 -176651 -54380 254566
16167 -203381 51966 330434 -65502 -130400 -277107 65126 65885 -131686 59672 -155850 -161727
16156 -161727 193069 -55141 54975 407129 -45593 145728 -180757 40021 109846 29966 273958
16145 273958 23816 160368 -390225 234161 32349 54177 -23983 282828 211276 241824 304202
16134C04202a55266j92943B62143a00038i127A10099a83447O3255k87285a69629
16123a4923k4005B21622E8840J14924M2573J77823a63378c1878j20928A09230
16112a27674N6887J7729K2613G3880a46692L3907j56350f3161k60733O4678C466
16100h7918I7742C4L29211A49306C9237J28696a98482N1332M1308C25750d43083
16088A13841H745K98278A1500b25k91625c5731r5753A57116K33798c44I2022c968
16075A29479a03693k59703B06483M7369a91809a0616A70143C7109B998f1271F1509
16063b97931J28372A87193a37677A28673d8980j89495K2890o3929E7475a76153
16052a39817A57554c01362B46780b63726J23985I180a08731A63829E9254J61950
$$ plain form
16134 304202 -155266 -348209 262143 -100038 -9127 110099 -183447 -120192 -407477 -169629
16123 -14923 -38928 221622 58840 173764 216337 394160 -163378 -31878 -152806 109230
16112 -127674 -70787 -53058 -30445 73880 -146692 -112785 -269135 -63161 -323894 -259216 3466
16100 -87918 97742 34 329245 149306 39237 167933 -198482 -147150 -105842 325750 -443083
16088 113841 8745 307023 11500 -225 -291850 -35731 -131484 157116 390914 -344 92022 -3968
16075 129479 -103693 -363396 206483 253852 -191809 -10616 170143 37109 2998 -61271 61509
16063 -297931 -169559 187193 -137677 128673 -48980 -238475 -215585 -279514 57475 -176153
16052 -139817 157554 -301362 246780 -263726 -139741 9180 -108731 163829 59254 221204
16042B21204I6477a24246A71424J07485e0619A56139R6063a60918A90362g4261
16031b93535a33985j24678A67525G9616a94972P6074N5549b3756k19494R6141
16021a47109F8128h260E5029a24788D71352d02408J70176d5993I6589D6293L57559
16010D03852f4536A6689i8012M0908B30361e2292a0611k3654C69869A1132J06482
15999A17614d00305B72259e3625B785a69102A26178n9605h2395A61161E2453d6241
15987E4476A9579g5542j60768B80392E1827L60821j78402J61568I1610J37504
15977B29114D5014r130d2604A59709e6765I036M74615a18302K0622C4144K7179
15966F1323h5591J4045A47808i5188E1168h6238A01966Q6747h7196m2662N7922
$$ plain form
16042 221204 96477 -124246 171424 278909 -50619 156139 252202 -160918 190362 -74261
16031 -293535 -133985 -258663 167525 79616 -194972 -118898 -63349 -23756 -243250 -147109
16021 -147109 68128 -8260 55029 -124788 471352 -402408 -232232 -45993 96589 46293 403852
16010 403852 -64536 16689 -98012 -57104 230361 -52292 -10611 -34265 369869 11132 117614
15999 117614 -400305 272259 -53625 2785 -169102 126178 66573 -82395 161161 52453 -46241
15987 54476 19579 -75542 -236310 280392 51827 412648 234246 395814 91610 229114
15977 229114 45014 35884 -42604 159709 -56765 9036 483651 -118302 -97680 34144 61323
15966 61323 -85591 -71546 147808 -95188 51168 -86238 101966 188713 -87196 -129858 -71936
15955g1936j13802n4226A0345J52683a93616g0583B69976E9717a3915l32237I0177
15943A4145a76880E9481n383J7262k7055a11452j0981E201K18263b33714A42465
15931c09500A31982b28666j64742G5174k3823a31878n4930B09878b04962A02425
15920b4547C10652C5993a59109j56120A55885h5555d0638C941d1899k68783J16932
15909a93750g096k40980j89222i0594G5409c5067l06776c5687n9779B6293j114
15898B5179f0746k03975I5481J559g8154F370a5155m4880q5634j84977Q4969B7763
15885A21579P3921a9969C3073i4540H6180a7017k00351A3639a45816B88213a14272
15873B1166c9020k7672l26703B4725e7059k42320b3298p5454A51870F4721a84014
$$ plain form
15955 -71936 -185738 -239964 10345 163028 -193616 -70583 269976 59717 -13915 -346152 90177
15943 14145 -176880 59481 54098 71360 44305 -111452 -122433 5201 223464 -233714 142465
15931 -309500 131982 -228666 -393408 75174 51351 -131878 -186808 209878 -204962 102425
15920 -24547 310652 35993 -159109 -315229 155885 -85555 -40638 3941 -41899 -310682 -193750
15909 -193750 -7096 -248076 -437298 -90594 75409 -35067 -341843 -35687 -95466 26293 25179
15898 25179 -60746 -264721 95481 97040 -78154 6370 -15155 -60035 -145669 -330646 -245677 27763
15885 121579 195500 -19969 33073 -94540 86180 -17017 -217368 13639 -145816 288213 -114272
15873 21166 -39020 -66692 -393395 24725 -57059 -299379 -23298 -98752 151870 64721 -184014
15861a55974A48064d889l00490J38820e961C5369J92865G686b77424C48149c86663
15849b3983C91419b6704j725j81269L6110b4777H5281A2586b5025C27847G7861
15837A19821f6389j67941A81232a26120E404a16j72626B43733b68114Q4400l1102
15826b14816F7219a815l5940k93851a19800A49512d1137l2777E3487b78753P0143
15815b08610N3867q0878A40991P2676C097K807P1228B717K02681N2855c17177
15803a54396f4715B17972j08937M434a1110d614j94339j24614E1336K0359J59567
15792B31262d8334r3413A98532a26308g446r7449B41444C5240m153a0012j97692
15781b07704A73805i6629o441d3053j78980B07859i1764j08000b2874G9535a32780
$$ plain form
15861 -155974 148064 -4889 -305379 -166559 -5961 35369 228234 7686 -277424 348149 -386663
15849 -23983 391419 -26704 -28429 -209698 -173588 -24777 85281 12586 -25025 327847 77861
15837 119821 -66389 -234330 181232 -126120 5404 -116 -172742 243733 -268114 -183714 -214816
15826 -214816 67219 -1815 -37755 -331606 -119800 149512 -41137 -73914 53487 -278753 -208610
15815 -208610 -154743 -235621 140991 213667 3097 5904 77132 2717 205398 258253 -317177
15803 -154396 -64715 217972 109035 113469 -11110 -4614 -198953 -323567 51336 71695 231262
15792 231262 -48334 -141747 198532 -126308 -7446 -104895 241444 35240 31087 -10012 -207704
15781 -207704 173805 -96629 -103070 -43053 -222033 207859 -91764 -199764 -22874 79535 -132780
15769c11450a20908A07486i0102A9455K65220a13901C28925I9285K17892j30307
15759A86870B4311b9095B10536J11274A49052p4149J2895L3996H782J18350E4524
15747B39160b98482j730i1778A83123D081P1744b86677a04151k15851a39481j11731
15736b51212A59384b77851Q6305j8243L2000A18624b37835C4953c7447E9039i9578
15724b29147j71509f6831q1008M8848A50768d3035j12330r0899l8614E9879b47640
15712b43938i0512A3961a24527G3316J17302D1152b97383J23204g22I0236N7363
15701A47599B4819f005j17171j54243J11521B11693i9430H8410N3078l3559J35685
15690B43614j07820a228I2276J94164j12673P9941h6320C7608c42611C06013B4453
$$ plain form
15769 -311450 -120908 107486 -90102 19455 284675 -113901 328925 99285 317177 186870
15759 186870 24311 -29095 210536 321810 149052 74903 87798 121794 8782 127132 54524
15747 239160 -298482 -300212 -91778 183123 4081 75825 -286677 -104151 -320002 -139481 -251212
15736 -251212 159384 -277851 -191546 -209789 -177789 118624 -237835 34953 -37447 59039 -99578
15724 -229147 -400656 -66831 -147839 -98991 150768 -43035 -155365 -246264 -284878 59879 -247640
15712 -243938 -90512 13961 -124527 73316 190618 41152 -297383 -174179 -722 90236 147599
15701 147599 24819 -6005 -123176 -277419 -165898 211693 -99430 88410 141488 107929 243614
15690 243614 135794 -1228 92276 286440 173767 253708 -86320 37608 -342611 306013 24453
15678b27743q6016J16766C12757E4538J21038O7422J238a15842e7876A31303a9187
15666d2414r2399B87046g9959K1361A19445a90130G2577a78672B3727K43388p4934
15655A92181E5720A1269a9716n3754l94741A13638D5316a8479K699k04539O1465
15644a58854k247B10862C6143J42628P7400b18151K8594f8679C45732j48369r7208
15633A00155e4904B41636a46913M7033A08667j7265C7733R1845c8853F0672n133
15622E5539c0686k73238g5606F1138K20527b28864L2324A72799c83218h3707E6734
15610b8568j16290A5595b35798J11686G8078e1811q388I6636C0469b79659J01903
15599a77756f9268j95459a4525C5190J17583d7550B76197a32730F7373J20237
$$ plain form
15678 -227743 -313759 -196993 312757 54538 175576 242998 244236 -115842 -57876 131303 -19187
15666 -42414 -134813 287046 -79959 -58598 119445 -190130 72577 -178672 23727 267115 192181
15655 192181 55720 11269 -19716 -73470 -468211 113638 45316 -18479 -15780 -220319 -158854
15644 -158854 -161101 210862 36143 178771 256171 -218151 -189557 -68679 345732 197363 100155
15633 100155 -54904 241636 -146913 -99880 108667 91402 37733 129578 -38853 60672 55539
15622 55539 -30686 -303924 -75606 61138 281665 -228864 -196540 172799 -383218 -83707 56734
15610 -28568 -144858 15595 -235798 -124112 78078 -51811 -60199 96636 30469 -279659 -177756
15599 -177756 -69268 -264727 -14525 35190 152773 -47550 276197 -132730 67373 187610
15589A87610a31215C44606d2806p1742B08040I2910c27318J63321o3533M5739
15579a81791p8579d1955F3566a6821A18384a72717B4972O3032B4206J21122a46653
15567f7978k0452A08062A0481h6370c3745A44140n0311r216a5884k04068G9893
15555B89882g5002A60797B2524a03628B04073E6405Q9424b7953p5835A47792a79431
15543A42571a41659C44725b58970g2963A01240d5145k57926i2693C0503M4915
15533G5418e6010j99313Q8452G8402R2129b47473J10769B09893E8486O9603e7993
15521A08774J3892a35474M2270A9825a8325C59957H4177f6437p6881B90621F5695
15509B8870Q8564c44387B2201J52144J05092m4429m043a59927A50920m4333N9856
$$ plain form
15589 187610 -131215 344606 -42806 -114548 208040 92910 -327318 -163997 -227530 -181791
15579 -181791 -260370 -41955 63566 -16821 118384 -172717 24972 88004 24206 145328 -146653
15567 -67978 -88430 108062 10481 -86370 -33745 144140 93829 84613 -15884 -219952 79893
15555 289882 -75002 160797 22524 -103628 204073 56405 145829 -27953 -103788 147792 -179431
15543 142571 -141659 344725 -258970 -72963 101240 -45145 -303071 -92693 30503 75418
15533 75418 -56010 -255323 -166871 78402 170531 -247473 -136704 209893 58486 128089 -57993
15521 108774 122666 -135474 -93204 19825 -18325 359957 84177 -66437 -143318 290621 65695
15509 28870 117434 -344387 22201 174345 279437 235008 230965 -159927 150920 106587 166443
15498A66443a73634I4654i0356B94068q5157o4896J08488n6683a41977B4326L67230
15487C91556b2235j02827N7826F5551M7935c55397A4411J7535M7586K67378j55524
15476A91386a44630P621B52030A25610o2318a69713b2595B23686I7889a20976
15465c6468G3031e9149A29410o0416b50324B63947h6542K3317j21550j80844a04318
15453A94479r1537p482f5209j1942D11034G7478c4948j08573A19540J30672a09009
15441G8754a72219P3779m8852J3405J3537e067j98819A1963b54085D1820N4081
15430I5901g4118o7492A53676D8467q387j1813J6731c3527j12026A36042b787
15418d4250q0417B17063H2228J6410k1284d29473A51011g4257B01861I1680c2828
$$ plain form
15498 166443 -173634 94654 -90356 294068 208911 144015 252503 195820 -141977 24326 391556
15487 391556 -22235 -125062 -67236 65551 113486 -355397 14411 31946 79532 346910 191386
15476 191386 -144630 -137009 252030 125610 63292 -169713 -22595 223686 97889 -120976
15465 -36468 73031 -59149 129410 68994 -250324 263947 -86542 -63225 -184775 -365619 -104318
15453 194479 102942 95460 -65209 -77151 411034 77478 -34948 -143521 119540 250212 -109009
15441 78754 -172219 -98440 -147292 -133887 -120350 -5067 -203886 11963 -254085 41820 95901
15430 95901 -74118 -141610 153676 48467 40080 28267 44998 -33527 -145553 136042 -2787
15418 -44250 -124667 217063 82228 98638 77354 -429473 151011 -74257 201861 91680 -32828
15406A14096a03188m5008M895B7384a64813m1448B18762j8364a6695D4647b95097
15394a4930k1379K520r2659n7546b1383j9344J2190A13499c67693B54394a87694
15382B1199d47463b10711G2423J26362A8160R8638a54495b120j31248m9231I3740
15370D7800b55259R1760P7891j2248P529C1912a76317A1991a58816B24343n4765
15359A69578q3189a39713N5634b6794j7538F914a61820j03006F39941c26155B40180
15347c69808A91835E1993A2955a14831A24357m9726a39715B56652I8572h6529
15336B19936b03814B58118a73196e3614j24827A32682Q9676J4C0914K566J30295
15325A63775f2017A61084b15947A53933f6494n4692A3708K15663a54540B07774
$$ plain form
15406 114096 -103188 -148196 -143301 27384 -164813 -206261 218762 200398 -16695 44647 -295097
15394 -14930 -36309 -33789 -126448 -183994 -21383 -40727 -28537 113499 -367693 254394 -187694
15382 21199 -447463 -210711 72423 198785 18160 116798 -154495 -2120 -133368 -182599 93740
15370 47800 -255259 -163499 -85608 -97856 -90327 31912 -176317 11991 -158816 224343 169578
15359 169578 86389 -139713 -84079 -26794 -44332 6914 -161820 -264826 639941 -326155 240180
15347 -369808 191835 51993 12955 -114831 124357 74631 -139715 256652 98572 -86529
15336 219936 -203814 258118 -173196 -53614 -178441 132682 222358 222372 30914 33480 163775
15325 163775 -62017 161084 -215947 153933 -66494 -121186 13708 229371 -154540 207774
15314a50427K1510B2246M0456h5591o6193G1226B569J99573o7580F6584c12599
15302B17501a22431E2160j128N0435c3519q3091E0399a39396C4541a89311e364
15290a07011E9576J53899d1709o5747B95736j9774b6914a246B18241b46240e3603
15278i2307H9144k5629Q262L1263J92009A6441L30118j19835K16900F1861c57998
15266A4001a0085A53365L68897a11462B07728L4234J0023E1901a45472B32091
15255B75022A18967O9330N3091b4744A160L71838M5830K68627L97564P10138o40567
15244A154590M86304o94511F7438K33217a5384A84863G8477f2256H8399D0040
15233B02162c8261j33454C47592a41384I2735D2562b26584B18164c52512I5240
$$ plain form
15314 -150427 -128917 22246 62702 -85591 -151784 71226 2569 202142 134562 66584 -312599
15302 217501 -122431 52160 51032 101467 -33519 -116610 50399 -139396 34541 -189311 -5364
15290 -107011 59576 213475 -41709 -107456 295736 275962 -26914 -1246 218241 -246240 -53603
15278 -92307 89144 63515 71777 103040 295049 16441 346559 226724 443624 61861 -357998
15266 14001 -10085 153365 522262 -111462 207728 241962 251985 51901 -145472 232091
15255 275022 118967 188297 241388 -24744 1160 372998 418828 687455 1085019 1795157 1154590
15244 1154590 1640894 946383 67438 300655 -15384 184863 78477 -62256 88399 40040
15233 202162 -38261 -171715 347592 -141384 92735 42562 -226584 218164 -352512 95240
15222A18093J4219M2198J38134C2618p407K4149J94173n4693a7952q1784A65466
15210d5504A42383i894p8666A04117k2711b46047A59844m0279Q426I227i3228
15198i6362A24749a19885G4673K31117D5482a15076P920j39281Q7970j76749H2029
15186A34932K17374k4173F1945O843i9492D04334b00016A88882E0604M31263i3922
15174A72036m5780d7910C6972J65658i7857I8493a15191I680J59540P7333f049
15162a69151I0685j8392J68476H4061K28432h5164J246E38089j84231a02205B44479
15150F7484J24261E6230J14206m1200B3575c06871A27585a144E0254Q9983k2068
15139A18169J18845N4695n910a17066M1311C6252K41258r309K58189g0455A15761
$$ plain form
15222 118093 132312 174510 312644 32618 25211 49360 243533 188840 -17952 -99736 165466
15210 -45504 142383 -9894 -88560 104117 81406 -246047 159844 119565 127991 9227 -93228
15198 -96362 124749 -119885 74673 305790 45482 -115076 -107156 -246437 -158467 -335216 82029
15186 134932 352306 328133 61945 68788 -99492 404334 -200016 188882 50604 481867 -93922
15174 172036 126256 -47910 36972 202630 -97857 98493 -115191 9680 169220 246553 -6049
15162 -169151 90685 72293 240769 84061 312493 -85164 -83918 538089 353858 -102205 244479
15150 67484 191745 56230 170436 129236 23575 -306871 127585 -1144 50254 140237 118169
15139 118169 237014 291709 285799 -117066 -75755 36252 277510 268201 526390 -70455 115761
15127D05750a2020j67306C96423j17595n2855o0249K24224A38223Q3225Q1784
15117C03232C2273J49413H2931P013f4990l10425B65751L5585j28514b1564C20565
15105F5771K63868j62187c9105A46187M1873a73525P9799c527A47046N7864l4388
15094A70522J69924B3573e2195D7299i6327L2401A46436o0330l8052K98656B0736
15082A24561j8444a20085b3008A33923o4895M4638K16761n4571j09724p4397J25488
15071B17223a77373A8562Q5689J75356E301J56427A5925K79853j40557P0853b04963
15059B21818J92859D2443O3376b2733A19150b0028A07582M59744j74095N7495
15049D50726g3874D7640b1855I0323M99766d0232D19772j98493a40783B26064
$$ plain form
15127 405750 -12020 -179326 396423 278828 225973 165724 389948 138223 221448 303232
15117 303232 32273 181686 82931 89944 -64990 -375415 265751 301336 172822 -21564 320565
15105 65771 329639 167452 -39105 146187 188060 -173525 -93726 -3527 147046 204910 170522
15094 170522 340446 23573 -52195 47299 -96327 -63926 146436 86106 48054 346710 20736
15082 124561 106117 -120085 -23008 133923 69028 113666 330427 275856 166132 91735 217223
15071 217223 -177373 18562 104251 279607 5301 161728 15925 295778 155221 226074 -204963
15059 221818 414677 42443 105819 -22733 119150 -20028 107582 567326 393231 450726
15049 450726 -73874 47640 -21855 90323 590089 -40232 419772 221279 -140783 226064
15038A30074J50219H5743M71926j66276A46596Q2380E1600Q4982m4089R4362L30413
15027E17268B41356n0257e8012D15193j34831J74655A38997K24781j35747Q4090
15017C12121e4762B54139a04526B69469a69779A32340J96446G8752J11420a2761
15006I0117g3177B41069J73522b974l4207H8595a0884a778H9189K0688Q9804k0201
14994A79480q9222K00503m121G4243L23481j97959L43152k01806j68821q5766
14984H6524a7870B76040A19981M81267H6931A7590P1606K70218j27141L3507J60441
14973D26221M5614K27446A54673R7569K13185A71557C0595Q3543b5666E69909
14962D21208A56537M33463H1263C1443N24351e9602F1080R7377N3227R4039a38351
$$ plain form
15038 130074 280293 85743 557669 391393 146596 228976 51600 136582 92493 186855 517268
15027 517268 241356 191099 -58012 415193 280362 455017 138997 363778 228031 312121
15017 312121 -54762 254139 -104526 269469 -169779 132340 328786 78752 190172 -12761
15006 90117 -73177 241069 414591 -2974 -37181 88595 -10884 -1778 89189 109877 199681 179480
14994 179480 90258 290761 286640 74243 397724 199765 542917 341111 172290 86524
14984 86524 -17870 276040 119981 601248 86931 17590 89196 359414 232273 265780 426221
14973 426221 471835 699281 154673 252242 465427 171557 30595 114138 -25666 569909
14962 421208 156537 590000 81263 31443 555794 -59602 61080 158457 211684 305723 -138351
14950F61768k80888J07882j20837j25581J64748O8447j48856c00240D40654k14955
14940B25699J86363A79499J03321O0550A51933j4272L70063j50401K79521k22451
14930D14393o3976F0363L04478G8261L91080j26397g866C32913j34468R0255L9349
14919C28049e113B54253K54282j6718k22359D5184L25043j2845R1586B21083m779
14908B16304M95403C43757A09027L00478a78675G0499M04201M5405B44112p059
14898B37053J56664L10833k90711j17404K8957k4067q9753N17796B33888I9438
14887H1796O37879C54736j22344J29986q5321J25191J5115r8795M8869n5196M7039
14876C59280J96220m301F7658N8043L51011L6274k55549J66978p0169P1752J10245
$$ plain form
14950 661768 380880 488762 367925 242344 407092 475539 326683 -300240 440654 225699
14940 225699 412062 179499 282820 343370 151933 137661 507724 357323 636844 414393
14930 414393 350417 60363 364841 78261 469341 342944 -7866 332913 198445 288700 328049
14919 328049 -5113 254253 508535 491817 269458 45184 370227 357382 448968 221083 216304
14908 216304 711707 343757 109027 409505 -178675 70499 474700 520105 244112 237053
14898 237053 393717 704550 413839 296435 325392 301325 211572 729368 233888 99438
14887 81796 719675 354736 232392 362378 277057 402248 417363 318568 367437 312241 359280
14876 359280 555500 551199 67658 125701 476712 512986 257437 424415 354246 425998 536243
14865E36243j10929j2496L20436C05369q9164L54943k79937L08761j27139A98901
14854A15577L90107A50852L43745E6896K06846K88716N8457Q7351j66188A62602
14843D46343j77826R3004L0457J05200J13384J33655L2645m4941j54040j80933
14833C96948K98451r6298j01811B27833L58162k22556M7806M4948j93228P5950
14823C38915J47155m2911q8196L961K44855J0630j42605n0507j72869N33000k19590
14812E61838j74556N8942R78G0390L44968N3239J87268B25157L66679j97897Q7927
14801D81866J5852B27340L00912K01616O075C23619L98424k29127P6567j2802
14791E56681Q9835J16780j42774j44804O3996O4170A06073N71925C01663Q9788
$$ plain form
14865 536243 425314 412818 733254 305369 216205 571148 291211 599972 472833 198901
14854 115577 505684 150852 494597 56896 263742 552458 610915 698266 532078 162602
14843 446343 268517 361521 391978 497178 610562 744217 776862 731921 577881 396948
14833 396948 695399 599101 497290 227833 585995 363439 411245 456193 262965 338915
14823 338915 486070 443159 354963 358924 603779 614409 471804 421297 248428 781428 561838
14812 561838 387282 446224 447202 70390 415358 468597 655865 225157 591836 393939 481866
14801 481866 497718 227340 528252 729868 735943 323619 722043 492916 569483 556681
14791 556681 646516 763296 620522 475718 539714 603884 106073 677998 301663 391451
14781C91451N2121J51086o3065J63813k30789R5774M4442B71173L16918k60233
14771C27858K31175K44382C51508M9638N08582m36832J62363j91843P8958J40032
14761F62406k99564K84622K05381Q1266k38898m4282k11773M46212j95811P3120
14751G62679O8065m6314Q682j59037m8104M2973n8574L97169l77139J16271r6392
14740F10279L13009l19811Q7432k4230m3759o7605R3470J08653l03399K47549
14730G01588J30844K21398j82823j21734p2459j32461M06903m28191K96246q8741
14720G30570P5625K80087J0847k57686N8625j26085J61974j48933K3024k3800
14710G84248J92885p7197q703D06045N52998Q3405p5865k03583P7971k32260N53096
$$ plain form
14781 391451 443572 594658 531593 695406 464617 560391 604833 271173 588091 327858
14771 327858 559033 803415 351508 401146 909728 472896 635259 443416 522374 662406
14761 662406 362842 647464 852845 934111 695213 650931 439158 885370 689559 762679
14751 762679 830744 784430 793112 634075 585971 628944 570370 967539 590400 706671 610279
14740 610279 923288 603477 690909 666679 622920 555315 648785 757438 454039 701588
14730 701588 832432 1053830 871007 749273 676814 544353 951256 523065 819311 730570
14720 730570 806195 1086282 1097129 839443 898068 771983 933957 785024 808048 784248
14710 784248 977133 899936 891233 406045 959043 1042448 966583 763000 840971 608711 1161807
14699A161807D36067N53775l53962L51914j74620j13536J21405J26379j65744
14690G81678J55999l3718j01444Q0317p1062L19159k62225J6454R1271j38637
14680H37792J72778q030j77594J87669K25221j50617q2282m2414K42725J2363
14670A217611l2981k10133K5037J99598q7368k8944J72331q7212J11008n96761
14660F82186N15736j33187k1939j48127M31862q6232j79783J28014r64J39819
14650A327385k38409J46157j35413k28828L75735j90723J19087J13256j42364
14641A145883K70858j25625k48946L68210j93661m6233J73839j44883J89403M6312
14631A435157Q6560m30549J92105M85265n15022R0027p5400k50187J19422K60021
$$ plain form
14699 1161807 436067 989842 635880 987794 813174 699638 821043 947422 781678
14690 781678 937677 903959 802515 882832 811770 1130929 868704 885158 976429 837792
14680 837792 1010570 1002540 824946 1012615 1237836 1087219 1004937 962523 1205248 1217611
14670 1217611 1184630 974497 999534 1199132 1111764 1082820 1255151 1167939 1278947 682186
14660 682186 1197922 1064735 1042796 894669 1326531 1240299 1060516 1188530 1187566 1327385
14650 1327385 1088976 1235133 1099720 870892 1246627 1055904 1174991 1288247 1145883
14641 1145883 1416741 1291116 1042170 1410380 1216719 1170486 1344325 1199442 1388845 1435157
14631 1435157 1521717 1091168 1283273 1768538 1253516 1343543 1268143 1017956 1137378 1397399
14621A397399M1894J03967L337j96827Q3837m8441P6197r1096J1827N2645k13090
14610A221649J75268K30841P6819j2415N3392k14639O1650J63864k99572k36052
14600A220805K73867J10185L33974l21291J88989j13605o3849Q3075k11456P2834
14590A573528J20156j5487L10865n4572K17966k34217K97145k19784M1746k11546
14580A825800L39825m68590N34336j27548j8895J84123k38280M87563k19676m8492
14570B250166m4243K09809P7208J2776l55388K67121K21245m63631O23447m52681
14560B345829N47461j4481k29947K31338L03108j63547J60312N21994K11057P80935
14550D694059P31472J559153K997350P299514J9254370J7865360B4599152A1800031
$$ plain form
14621 1397399 1439293 1543260 1546597 1349770 1433607 1385166 1461363 1370267 1382094 1434739 1221649
14610 1221649 1396917 1627758 1704577 1692162 1745554 1530915 1592565 1756429 1456857 1220805
14600 1220805 1494672 1604857 1938831 1617540 1806529 1692924 1629075 1712150 1500694 1573528
14590 1573528 1693684 1678197 1989062 1934490 2152456 1918239 2215384 1995600 2037346 1825800
14580 1825800 2165625 1697035 2231371 2103823 2084928 2269051 2030771 2518334 2298658 2250166
14570 2250166 2205923 2415732 2492940 2505716 2150328 2417449 2638694 2175063 2798510 2345829
14560 2345829 2893290 2878809 2648862 2880200 3183308 3019761 3180073 3702067 3913124 4694059
14550 4694059 5425531 6984684 9982034 17281548 36535918 54401278 24599152 11800031
14541E856252k722026m86547n64258J07607k22428j85214L02316j36998K69435
14532B218139m20359K46331K17030J7999q0224N9577j8247L73954j64542N781
14522B455439K49881o4410n28807K02172L28488P6365k59530K2841N65149o59117
14512B388471M89972j41962J81714O5052O1171M481J37878k19637p7991l7623
14502B851526n6228L95453j18944J46749M07L94049l66773L19206k37957J13102
14492C440590j35640j87710M17778j74703J00148n116M02186l34049K81161k7619
14482C777026L48432k76468K14945p9365j52201J07375K50913j4832K19834j63095
14472D232564J04258M39421m94242K95020j69413K04639k0083J67882N7894K28350
$$ plain form
14541 5856252 3134226 2647679 2083421 2191028 1968600 1783386 2085702 1948704 2218139
14532 2218139 1797780 2044111 2261141 2279140 2198916 2258493 2240246 2614200 2449658 2455439
14522 2455439 2705320 2640910 2112103 2314275 2642763 2719128 2459598 2482439 3047588 2388471
14512 2388471 2878443 2736481 2918195 2983247 3044418 3048899 3186777 2967140 2889149 2851526
14502 2851526 2795298 3190751 3071807 3218556 3218963 3613012 3246239 3565445 3327488 3440590
14492 3440590 3304950 3117240 3535018 3360315 3460463 3455347 3857533 3523484 3804645 3777026
14482 3777026 4125458 3848990 4063935 3984570 3832369 3939744 4190657 4175825 4395659 4232564
14472 4232564 4336822 4776243 4282001 4577021 4407608 4612247 4592164 4760046 4817940 5046290
14462E046290o02855N88886K12369j74856J74772m00419J78881L78986r9219Q9369
14452E392204J2484J40155J24291q4252j37368K74442L27202k27919M24972j96304
14442F049907K72590J24229k46105K48944J72029K4588m14201N99788k25847J95750
14432F801672J86373r8974j3995M39523j67898r3371R64453j32477K03667j53077
14422G935896l78206M47849K77884r1122K39927K11080K89307j03392P1771J41642
14412I042636L03654k58072N07721j73113K76478L03520l10194L40351r310K95146
14402A0318817J10513K03589O80503j80280k9976M73694J31102p6429L16216J45130
14392A2092879L16700J76716J61359L39547K27228M624K71094L30837J57171J74438
$$ plain form
14462 5046290 4443435 5032321 5244690 5069834 5244606 4844187 5023068 5402054 5302835 5392204
14452 5392204 5404688 5544843 5669134 5584882 5447514 5721956 6049158 5821239 6246211 6049907
14442 6049907 6322497 6446726 6200621 6449565 6621594 6646182 6231981 6831769 6605922 6801672
14432 6801672 6988045 6889071 6875076 7314599 7146701 7053330 8017783 7885306 8088973 7935896
14422 7935896 7557690 8005539 8283423 8192301 8432228 8643308 8932615 8829223 8900994 9042636
14412 9042636 9346290 9088218 9595939 9422826 9699304 10002824 9692630 10032981 10023671 10318817
14402 10318817 10429330 10632919 11313422 11133142 11103166 11576860 11707962 11631533 11947749 12092879
14392 12092879 12409579 12586295 12747654 13087201 13314429 13319053 13590147 13920984 14078155 14252593
14382A4252593M98491n9139M23752N70141J52724P0971M48284L57294M72511N4581
14372A7242203M65531j90878Q94110K1778Q75114J94335O32850j40951N18399
14363B0512491L14483Q43362M12571L94809O90987K63136N80528R34916M94936
14354B5442219N68792N71689M19916P09349M82221J015210O31073P25981R14564
14345C1481014P57688O65421J238372M05760J215607J079216Q86349J218263J196969
14336D0144659P25185J167023J160536J698269J632947P77565J730397J474720
14328E0511301J973741J159953K408104J307667K033064K147610K118819K071214
14320F5731473K684214K450573K510357K741385K626186L259955L140508L203409
$$ plain form
14382 14252593 14751084 14691945 15115697 15685838 15838562 15909533 16357817 16715111 17187622 17242203
14372 17242203 17707734 17516856 18410966 18432744 19307858 19502193 20135043 19994092 20512491
14363 20512491 20826974 21670336 22082907 22477716 23168703 23431839 24012367 24947283 25442219
14354 25442219 26011011 26582700 27002616 27711965 28194186 29209396 29840469 30566450 31481014
14345 31481014 32238702 32904123 34142495 34548255 35763862 36843078 37729427 38947690 40144659
14336 40144659 40869844 42036867 43197403 44895672 46528619 47306184 49036581 50511301
14328 50511301 52485042 53644995 56053099 57360766 59393830 61541440 63660259 65731473
14320 65731473 68415687 70866260 73376617 76118002 78744188 82004143 85144651 88348060
14312H8348060L661507L660439L861308M025276M138276M996100N020584N081501
14304A22793051N496708N449909O266590O452681O989638P063077P728878Q117681
14296A76358213Q596878Q909680R348799J0164385J0288236J1456464J1645960
14289B46768615J2119784J2808128J3027823J3677731J4060869J4267040J4522964
14282C41252954J4468162J4696386J4457921J3984443J3278628J2611288J1598935
14275D36348717J0211708Q354357N509372J833107L99017q67290j832522l722324
14267D56234142l983801o932995r105251j0726342j2256348j3860811j4243058
14260C85125536j5189644j5782770j5331137j5685618j5102015j4967703j3884642
$$ plain form
14312 88348060 92009567 95670006 99531314 103556590 107694866 112690966 117711550 122793051
14304 122793051 128289759 133739668 140006258 146458939 153448577 160511654 168240532 176358213
14296 176358213 184955091 193864771 203213570 213377955 223666191 235122655 246768615
14289 246768615 258888399 271696527 284724350 298402081 312462950 326729990 341252954
14282 341252954 355721116 370417502 384875423 398859866 412138494 424749782 436348717
14275 436348717 446560425 454914782 460424154 462257261 462656278 461788988 459956466 456234142
14267 456234142 452250341 445317346 436212095 425485753 413229405 399368594 385125536
14260 385125536 369935892 354153122 338821985 323136367 308034352 293066649 279182007
14253B79182007j2734944j3035783j2595927j1853351j1350651j0561297j0244565
14246A96805489r568058q871246q166843q026719p300932p270728p028074o124681
14238A34448208n821536m952142n849851m486242n359584m213926m230352l432980
14230I6101595l855874l512317l667550l419414l013637k750268k804786k598597
14222G0479152k667356k029212k128703j946264k419320k003073j786319j788709
14214E3710196j453869j359542j647149j670846j341270j598252q58538o75716
14206D3105014j058941j373578j396901r83743j496799o92239q4907j410327q56178
14197C3751401j191494n43156j191365m30428n26750r92729o84714n08766p47532
$$ plain form
14253 279182007 266447063 253411280 240815353 228962002 217611351 207050054 196805489
14246 196805489 187237431 178366185 170199342 162172623 154871691 147600963 140572889 134448208
14238 134448208 128626672 123674530 117824679 113338437 107978853 103764927 99534575 96101595
14230 96101595 92245721 88733404 85065854 81646440 78632803 75882535 73077749 70479152
14222 70479152 67811796 65782584 63653881 61707617 59288297 57285224 55498905 53710196
14214 53710196 52256327 50896785 49249636 47578790 46237520 44639268 43780730 43105014
14206 43105014 42046073 40672495 39275594 38291851 36795052 36102813 36017906 34607579 33751401
14197 33751401 32559907 32016751 30825386 30394958 29868208 28875479 28190765 27681999 26934467
14188B6934467j009114k09213o92678l64348o02250p29737j12840r04208k80352
14179B2029727m02695m01585m71687l18978m94718m39421k03939n52633m42213
14170A8301858r8301n05794m38889n64562K76249p35668k26041l81830J12075
14161A5739097n48141R3976m95210m78915j02274m47461k60069k62412p4241j24392
14151A3039958j95467l4753m81330p3666k32364j31214l34588J8071m04504j22220
14141A1047923j15721j76524m53928k83525N18330n36711o37225O93203p58612
14132I297210K29203M754m02142K13285k75301o9418m59364p2385j67995L5561
14122H333408j63660K64478o70287N40153l59375l58782j5479j03584j34995J05983
$$ plain form
14188 26934467 25925353 25716140 25023462 24659114 24056864 23327127 23214287 22310079 22029727
14179 22029727 21627032 21225447 20753760 20434782 19940064 19500643 19296704 18744071 18301858
14170 18301858 18203557 17697763 17258874 16694312 16970561 16234893 16008852 15627022 15739097
14161 15739097 15190956 15284932 14789722 14310807 14208533 13761072 13501003 13238591 13164350 13039958
14151 13039958 12844491 12809738 12328408 12254742 12022378 11891164 11556576 11574647 11170143 11047923
14141 11047923 10932202 10755678 10301750 10018225 10536555 9999844 9362619 10055822 9297210
14132 9297210 9526413 9531167 9129025 9342310 9067009 8997591 8538227 8465842 8297847 8333408
14122 8333408 8169748 8434226 7763939 8304092 7944717 7585935 7570456 7466872 7331877 7437860
14112G437860k49707j14662j36445L4525j68127j6894k81614N85164r41894N83446
14102F731652j12701m41074L45484m11825L2935j93185k57570O11278l14435J6013
14092F006572L2913k45100m23287J26421k13193K46012N1471l24623l5989P7058
14082E298255n5327k32411p9873K3296R344m33567M47493l44707K5790J42233
14072D800526k28585L2564l55266k33866P81205l88567K58955l03777k20506J97093
14062D339776O2930l05110K27400p0154m60824K4645O9395J00109J56960l0194
14052D114933m31887J82951J12639l09142J80223l03109J39031R4944k41924K4715
14042C563374o7230k63100J77175L411n4007K80386k78100J21930k27164j81454
$$ plain form
14112 7437860 7188153 7073491 6937046 6971571 6803444 6786550 6504936 7090100 6148206 6731652
14102 6731652 6618951 6177877 6523361 6111536 6144471 5951286 5693716 6304994 5990559 6006572
14092 6006572 6039485 5794385 5371098 5497519 5284326 5530338 5581809 5257186 5221197 5298255
14082 5298255 5242928 5010517 4930644 4953940 4963284 4529717 4977210 4632503 4658293 4800526
14072 4800526 4571941 4604505 4249239 4015373 4796578 4408011 4666966 4363189 4142683 4339776
14062 4339776 4402706 4097596 4324996 4254842 3794018 3818663 3888058 3988167 4145127 4114933
14052 4114933 3683046 3865997 3978636 3669494 3849717 3546608 3685639 3780583 3538659 3563374
14042 3563374 3496144 3233044 3410219 3413630 3359623 3640009 3361909 3483839 3256675 3075221
14032C075221K34120k02226J35719J14031J17291o11994J92970m0389m4695k61297
14022B708751J95494j21787j0103j4190K12530L841l46727K12377k8102p8044
14012B734040J48982k21923l24178P898L09010n9376L5410k68797j61325J60278
14002B360019j26238M87923k94940k21328M7352P477k87067Q7780J10540J38278
13992B309796J29421k021j70561P73843K132175N061552J6432758K7842660k3273603
13983C1236020A4769324o509308j959419j559040p70418l84307q8841n40886J49359
13974C106464r0824m19813J95983K8156l02054J80557j03703j60655N8017j7664
13964B474464k67755M33962l90600j59755L02279J0197j076l79208K19925k42822
$$ plain form
14032 3075221 3309341 3107115 3242834 3356865 3474156 2862162 3055132 3014743 2970048 2708751
14022 2708751 2904245 2782458 2772355 2758165 2970695 2974536 2627809 2840186 2812084 2734040
14012 2734040 2883022 2661099 2336921 2344819 2653829 2594453 2629863 2361066 2199741 2360019
14002 2360019 2233781 2721704 2426764 2205436 2252788 2260265 1973198 2060978 2171518 2309796
13992 2309796 2439217 2437196 2266635 3040478 5172653 10234205 26666963 54509623 31236020
13983 31236020 14769324 8260016 6300597 4741557 3971139 3586832 3497991 2957105 3106464
13974 3106464 3015640 2595827 2791810 2819966 2517912 2698469 2594766 2434111 2492128 2474464
13964 2474464 2206709 2640671 2250071 2090316 2392595 2402792 2401716 2022508 2242433 1999611
13954A999611K05088l1698j40020J2702o3894J57491k10931m0565N6197J14826
13944B058807k14700K1973k5494n9276j60889J46528J6734L000K1717J34682k69758
13933A673324L47332m98785L13467j12810p3367k6865j8746j30846N3044J26984
13923A652732K16478m03962R8723K76414l50925M15563l25371k55517K72564N4881
13913A651580J4060j96626n8482J78816j34810J3466J99498k95386L18434l18322
13903A372228J90157q7866K19292n62577K19497P3281k44580K43716J3821n1291
13893A385678j73349J00790K2099K98192k41017L4596l34116L95270r0099K05660
13883A603704l53182j11312M32062l19059l496j12712M03703k03003m58893J60910
$$ plain form
13954 1999611 2204699 2173001 2032981 2045683 1981789 2139280 1928349 1887784 1943981 2058807
13944 2058807 1844107 1866080 1840586 1781310 1620421 1766949 1783683 1786683 1808400 1943082 1673324
13933 1673324 2020656 1521871 1835338 1722528 1649161 1622296 1603550 1472704 1525748 1652732
13923 1652732 1869210 1465248 1563971 1840385 1489460 1905023 1579652 1324135 1596699 1651580
13913 1651580 1665640 1469014 1410532 1589348 1454538 1468004 1667502 1372116 1690550 1372228
13903 1372228 1562385 1474519 1693811 1131234 1350731 1424012 1179432 1423148 1436969 1385678
13893 1385678 1212329 1313119 1335218 1633410 1392393 1426989 1092873 1488143 1398044 1603704
13883 1603704 1250522 1139210 1571272 1252213 1248717 1136005 1539708 1336705 877812 1038722
13873A038722K31335k05011L44531l95273Q1982J81112l92417J72489K36913J13756
13863A408139j86786k76024K19654q0983j59205M10514l53186M11697l64027J35084
13853A164877j80713L73980n08007M94747j72278k01776J79462L14207m57410
13844A007089J34074L9275p7995n0273p2060n3891J49793j50290J29268O0685
13834A115675J02281l19569m6235K95987j51765J43409k22529K98488k43867R3151
13824A065026J20912m33486M96023n3149k55589k01027K52418j17107j01285J72543
13814I45279J44437K3091n6021j61810J46083l78913K18848J10336j03483j57093
13804G30754L09492N5066O5971l53348K69555l60975K32265K2988k81329K36803
$$ plain form
13873 1038722 1270057 1065046 1409577 1014304 1096286 1277398 884981 1057470 1294383 1408139
13863 1408139 1221353 945329 1164983 1084000 924795 1335309 982123 1393820 1029793 1164877
13853 1164877 984164 1358144 850137 1344884 1172606 970830 1150292 1464499 1007089
13844 1007089 1141163 1180438 1102443 1052170 980110 926219 1076012 925722 1054990 1115675
13834 1115675 1217956 898387 852152 1148139 996374 1139783 917254 1215742 971875 1065026
13824 1065026 1185938 752452 1248475 1195326 939737 738710 991128 874021 772736 945279
13814 945279 1089716 1112807 1056786 894976 1041059 662146 880994 991330 887847 730754
13804 730754 1040246 1095312 1161283 807935 1077490 716515 948780 971768 690439 927242
13794I27242k42006K58636j0968m14437J88522j08450K68702K17908K50239k70088
13784A065300l77046r6688o9908K11149j22812L52692J84825E30334L05906p2239
13774G64001O2522n3034q3561q0922J21416K62580m4189k66453j52272O25632
13764A155720E54237J14193l9883j61120M67958j47900J04815r6731l6284R8746
13754H58031j83221k168J65783L4772o9489A80158J91414N01541j53596l09369
13744D10148K85163K10002k75189l1591K07252j23218J68380j34436Q2017k98106
13734E00422L41704C27763J7888N05803l79818K89314k50105n7231L1832J12519
13724E97965L53914k65741k25931N5523l1607n3435K79784K105r7222K87685l23493
$$ plain form
13794 927242 685236 943872 932904 518467 706989 598539 867241 1085149 1335388 1065300
13784 1065300 688254 591566 521658 732807 609995 962687 1147512 530334 836240 764001
13774 764001 826523 773489 689928 609006 730422 993002 948813 682360 530088 1155720
13764 1155720 554237 668430 628547 467427 935385 787485 892300 795569 759285 858031
13754 858031 674810 672642 838425 873197 803708 180158 371572 873113 719517 410148
13744 410148 695311 905313 630124 598533 805785 682567 850947 716511 798528 500422
13734 500422 842126 327763 345651 851454 471636 760950 510845 453614 485446 597965
13724 597965 951879 686138 460207 515730 484123 430688 710472 712577 615355 903040 579547
13713E79547B24412J24868L52373l0904O44o5007m4276K16791l40782j8379J20354
13702E40094k52303L44743j39614o1824K10928j67831r0466L12753j0665j2159
13692F73656B63076L31886j64743M24K12495B94008K46049J38608j73564j48738
13682C56363L64737j11478j41401m5659J11139m4858j19560J54083P283M898j05433
13671D30114Q7775J73912H3763O18905C13941K58584J31927k48435j84378L74343
13661F45982l789j22445J23140j34510J64553M6262C52025J60263j19277K46227
13651F39238j3647j07933J21869k73928K94367j79879L8987j55033K99446p2446
13641E91041A99134J61221A19947K49185J34151J37253C14884J06693a0723F12181
$$ plain form
13713 579547 224412 349280 701653 670749 671393 606386 562110 778901 438119 419740 540094
13702 540094 287791 632534 492920 431096 642024 474193 383727 696480 685815 673656
13692 673656 263076 594962 430219 430643 643138 294008 540057 678665 505101 356363
13682 356363 721100 609622 468221 422562 533701 488843 369283 523366 530649 535547 430114
13671 430114 517889 691801 83763 702668 313941 572525 704452 456017 271639 645982
13661 645982 642193 519748 642888 508378 672931 719193 352025 512288 393011 639238
13651 639238 625591 517658 639527 365599 659966 480087 519074 364041 663487 591041
13641 591041 199134 360355 119947 369132 503283 640536 314884 421577 -10723 612181
13630E92285k40929A65577J11305L1565K58026P3229k69921J14854j87055N44831
13620H42411k31469j91480J20295A93500R7155J81912R7719d7085C87196j67064
13610B20132P6373K83581l5948K32809k51620j48311K61680A64537M15271A83696
13599G21567j41896j61661E1488J44924J01997r20L11463B03992J04543k8481
13589B80054Q3086A49302K14639A78078K35132j08919J48230A50120K98394A18400
13578E02366j50580L26289p9450q3246J60244l15640J29539j00886J45614G2920
13567C69050j63574K86296G8113P4330J66164L67484C25207g0516a1920A50781
13556I7891L59741j47945o6174L32716j57659a2504B91347K3896E3966K4702J90796
$$ plain form
13630 592285 351356 165577 276882 308447 566473 639702 369781 484635 297580 842411
13620 842411 610942 419462 539757 193500 290655 472567 570286 -47085 387196 220132
13610 220132 296505 580086 544138 776947 525327 377016 638696 164537 579808 183696
13599 721567 579671 418010 51488 196412 298409 297489 608952 203992 308535 280054
13589 280054 363140 149302 363941 178078 413210 304291 452521 150120 448514 118400
13578 502366 351786 678075 598625 515379 675623 359983 489522 388636 534250 72920
13567 369050 205476 491772 78113 152443 318607 686091 325207 -70516 -11920 150781
13556 97891 457632 309687 243513 576229 418570 -12504 291347 315243 53966 78668 269464
13545B69464r9755M70486k49053G9973P3320L04915B03256Q7830P3377O5985A95135
13533B56379Q7893K57944k58194m7013L6272l8512M2871o4619I067L12057j3768
13522C07356K3654O9752Q1915A70886K17355m2712A01370K2375K69439J65944
13512E59128k37169j20391J73598o3406J71050k11460l832K17655A18923K69625
13502C88548J04708b9186C73358j02200r5759J87120h8996B55417m8623j2541
13492A94253O05893k61095J2329A94580J50041J31871A61532J25460J03697r2813
13482B97876J36120o6857j07927K98630A1309L00981j01321O4156p2293J3493
13472B16325I4114K7384N10026A35424M91826j77330j21100M972A46086P5609
$$ plain form
13545 269464 169709 640195 391142 79973 153293 458208 203256 291086 364463 430448 195135
13533 256379 344272 602216 344022 297009 333281 294769 337640 273021 9067 321124 307356
13522 307356 331010 400762 482677 170886 388241 345529 101370 123745 393184 559128
13512 559128 321959 201568 375166 311760 482810 271350 267518 485173 118923 388548
13502 388548 493256 -29186 373358 271158 175399 362519 -88996 255417 206794 194253
13492 194253 800146 539051 551380 194580 344621 476492 161532 286992 390689 297876
13482 297876 433996 367139 259212 557842 11309 312290 210969 275125 202832 216325
13472 216325 94114 121498 631524 135424 627250 449920 328820 333792 146086 221695
13462B21695K11535j58600K76154B18614D4625M47663J2472j5966j06228q2612
13452B99954A26649C6028e6158h638B18892Q6834f6643D40590L8242j75645k3083
13441B80104n6275o4389N8867j8454J96179A34058M52613A56481K5811k9675A0082
13429D34532G8642K61041e460A92039O2598F5666J36807J99482K2242d1554B05608
13417B86383o4004G8611K73993c01814B41693h1609B24502D1358J16367J40009
13407B97734A18989K65290H7418L3280L64319m926n0236p7510J4906F8964N1218
13396A20182A9144R13c637B85481r5613C7267R9610d1770A79994f9705E15885
13384A2668R1906L02650J43852J5888A43212J93205a21453D96327j84230A07751
$$ plain form
13462 221695 433230 274630 550784 218614 44625 492288 504760 488794 382566 299954
13452 299954 126649 36028 -56158 -8638 218892 305726 -66643 440590 478832 303187 280104
13441 280104 223829 159440 218307 199853 396032 134058 586671 156481 182292 152617 10082
13429 434532 78642 339683 -5460 192039 254637 65666 202473 401955 424197 -41554 205608
13417 286383 222379 78611 352604 -301814 241693 -81609 224502 41358 157725 297734
13407 297734 118989 384279 87418 120698 485017 480091 429855 352345 367251 68964 120182
13396 120182 19144 20057 -3637 285481 189868 37267 136877 -41770 179994 -69705 515885
13384 12668 104574 407224 551076 566964 143212 336417 -121453 496327 312097 107751
13373B16519h7896A37674J99851A21698n6472k366k5935M48622k31224L87836
13363F42159B88651H2034J02104F1369R3179g8690A94685J31762I124c7618A13704
13351G6266d4106N889a3548B22273j7959N9793b2764G94015C47780J41468l2464
13340D56784K08748A00481K82390p01n0538A63326l6213o3253K50136m817A2984
13328C20601A08424c37483A32988K13461g0805B55068b31142B56837K7618J88444
13318D72899G1615K31592j36750J07915j5720j18371n6428J76717a51140A40409
13307D03555J2532I9933J48492p3719j3837K55301J10440B25698G9118h3779o5346
13296a49125F8739a62172B63554D7574J11539b65057B73609B952J25817L0378
$$ plain form
13373 216519 -87896 137674 337525 121698 65226 62860 36925 485547 254323 642159
13363 642159 288651 82034 184138 61369 154548 -78690 194685 326447 9124 -37618 113704
13351 76266 -44106 -38217 -13548 222273 204314 264107 -22764 794015 347780 489248 456784
13340 456784 665532 100481 382871 382170 331632 163326 127113 63860 313996 309179 12984
13328 320601 108424 -337483 132988 346449 -70805 255068 -231142 256837 284455 472899
13318 472899 71615 303207 166457 274372 258652 140281 83853 260570 -151140 140409
13307 403555 416087 99933 248425 174706 160869 416170 526610 225698 79118 -83779 -149125
13296 -149125 68739 -162172 263554 47574 159113 -265057 273609 2952 128769 159147
13286A59147J34291m7766H7709K90404A19293L880O6925k0167p5644m6437J39784
13275A87634J54360j21783J90832A44744L1408J43830A18217L0711O5876i691
13264h4276k18607B47622J87251L7098c2830A35369K08674j18319K0475E9003
13253B90848j08956d4868A05741p51a04034I1659J53321p8857K20786r7141B600
13241B14548j908F9784J56628K61185a14868C9349L0539A5922b2540A09400J19528
13230B28928a5327f892A94413J99495A82727M7831a3152k1824j18016B05095a85973
13218A64224K0858k0079B2496R5771K08595F3525K88964a39136A26944h0435B87467
13206B1435M0326b24219D18970A12022B0069J93382J18424A22316J78528a68372
$$ plain form
13286 159147 293438 245672 87709 378113 119293 123173 190098 169931 94287 47850 187634
13275 187634 341994 220211 411043 144744 176152 319982 118217 148928 214804 -9691
13264 -84276 -302883 247622 434873 471971 -32830 135369 344043 225724 246199 59003
13253 290848 181892 -44868 105741 104990 -104034 91659 244980 166123 386909 289768 2600
13241 214548 212640 69784 226412 487597 -114868 39349 69888 15922 -22540 109400 228928
13230 228928 -15327 -6892 194413 393908 182727 230558 -13152 -34976 -152992 205095 -185973
13218 164224 185082 165003 22496 118267 326862 63525 352489 -139136 126944 -80435 287467
13206 21435 61761 -224219 418970 112022 20069 213451 331875 122316 300844 -168372
13195e9695j01953A70588a68923g1505b8275A98741J87616A06215J19649f0036
13184d2963E44895a04826D2464J03356J61289A21609J68205b59059c3492a473
13173B63264M2849g4771B80673I6715J85628l6586c5571C14629n0965r8158J93473
13162C58979A24660b7848m1979k2482B70404F7K58954k3912b27449E2547J04110
13151A56657l5816a24031D04618A06616L92701j98792j01558I4657M2331J28907
13141B65895b92739B00778K33712j69377J5137a26598A26845m4652J82245D7959
13130A85716m024K7128a20282A36663P6738b82046B44407r9787b25784P6378A47382
13118B5197f1387C14316f1224G0648a61005C03506e4747I8420O6946g1457J4645
$$ plain form
13195 -59695 -161648 170588 -168923 -71505 -28275 198741 386357 106215 225864 -60036
13184 -42963 544895 -104826 42464 145820 307109 121609 289814 -259059 -33492 -1473
13173 263264 306113 -74771 280673 96715 282343 245757 -35571 314629 263664 165506 358979
13162 358979 124660 -27848 -69827 -92309 270404 67 259021 235109 -227449 52547 156657
13151 156657 120841 -124031 404618 106616 499317 300525 198967 94657 136988 265895
13141 265895 -292739 200778 434490 265113 280250 -126598 126845 82193 264438 47959
13130 185716 181692 208820 -120282 136663 213401 -282046 244407 144620 -225784 -149406 147382
13118 25197 -61387 314316 -61224 70648 -161005 303506 -54747 98420 165366 -71457 -56812
13107e6812A73606j6993m5021J02781k8321G7275l5893K31379B6722M1627N5024
13096A23373a643k40682B91953G7946K27237f6502C29352A52267J28133D3535
13085B24187A02937a18854E7979b32304R9092B07445J10522O9439H5076K6442
13075A11518D8318J11991E4304a91646b0719B26209j6102a12687A16721n6652
13065F0069O6109E9168i0077C88659a06022A72114J33626A44680i9330L9918B08786
13053G7896a59030A15443J13964I4979K41171A19735i420C02808F4040a26116
13042h1197A25310J8869g083p0501C3919J2016a28322A71639O1360R3343A03801
13030A29276E8755O780J17A4464L01236a29688H2785L17622b94968A65621L5492
$$ plain form
13107 -56812 173606 156613 111592 214373 186052 77275 41382 272761 26722 68349 123373
13096 123373 -1643 -242325 291953 77946 305183 -66502 329352 152267 280400 43535
13085 224187 102937 -118854 57979 -232304 -133212 207445 317967 387406 85076 111518
13075 111518 48318 160309 54304 -191646 -20719 226209 210107 -112687 116721 60069
13065 60069 126178 59168 -90077 388659 -106022 172114 305740 144680 -99330 -59412 208786
13053 77896 -159030 115443 229407 94979 336150 119735 -9420 302808 64040 -126116
13042 -81197 125310 144179 -7083 -77584 33919 45935 -128322 171639 232999 326342 103801
13030 129276 58755 65535 65652 14464 315700 -129688 82785 400407 -294968 165621 201113
13019B01113n8846o3017k9812P6819M9351P9869O1197A10361L4723a08950B68480
13007E20849f7796C5113e8853A16166J19992F4698a58338B22587a66750D6654
12996C02403A39115F4857e5395I8547a53803A90634a06104E46177I198b41606
12985G6491k6626K41175H8648a17071A92368q6152L82079C4154R318J60258b0638
12973f1698C36439i0825k5214j01735Q4508j5433A52527o8297K02936J99332a12215
12961B62395A13337n6236f3480K1238j37156E2400K70191a64691D657N4368A068
12949a63544F7958h305B304K17850K5579o4262D0974a41825k77645A51274C732
12937E1517H450K2136N4731f6914A49862c98669i2654p8266N9446C77502q1946
$$ plain form
13019 201113 142267 79250 49438 126257 175608 255477 316674 110361 145084 -108950 268480
13007 520849 -67796 35113 -58853 116166 236158 64698 -158338 222587 -166750 46654
12996 302403 139115 64857 -55395 98547 -153803 190634 -106104 546177 9198 -241606
12985 76491 49865 291040 88648 -117071 192368 106216 488295 34154 43472 203730 -20638
12973 -61698 336439 -90825 -116039 -217774 -133266 -148699 152527 84230 287166 486498 -112215
12961 262395 113337 57101 -63480 -42242 -179398 52400 322591 -164691 4657 59025 1068
12949 -163544 67958 -8305 2304 220154 245733 181471 40974 -141825 -419470 151274 3732
12937 51517 8450 30586 85317 -66914 149862 -398669 -92654 -170920 -111474 377502 295556
12926B95556q4266q38a30712D1388M02614j31617c46003M5058g383D78588A10817
12914A43279F8636N350a4770G5964O4351j3085k6479K29434A14958a33893F5584
12902F8566c5172A1115J61661K8028m5635C1222L6730c37241A46705A8024a25853
12890b16384D8953b7494p0289A41473m3820J11826a64774F7060N8227G057K97159
12879C04216j03183A8894f0103A96252H0406a53417d3391C14644F7463A0764R8435
12868A09199e6872L530J6495a2371A46089k6522a32012A60120a4465B99904I7872
12856A21166B5172b38949B45242a04229A00931L15209F6736a54952I449f8481
12845a20084E1419N0412J55470G5832J75301E9033k7786L79136A79903g6037I8044
$$ plain form
12926 295556 211290 210452 -130712 41388 444002 312385 -346003 -300945 -7383 478588 110817
12914 143279 68636 73986 -14770 75964 140315 127230 100751 330185 114958 -133893 65584
12902 68566 -35172 11115 172776 200804 155169 31222 67952 -337241 146705 18024 -125853
12890 -216384 48953 -27494 -97783 141473 97653 209479 -164774 67060 125287 7057 304216
12879 304216 201033 18894 -60103 196252 80406 -153417 -43391 314644 67463 10764 109199
12868 109199 -56872 -53342 -36847 -12371 146089 119567 -132012 160120 -14465 299904 97872
12856 121166 25172 -238949 245242 -104229 100931 416140 66736 -154952 9449 -68481
12845 -120084 51419 101831 257301 75832 251133 59033 31247 410383 179903 -76037 98044
12833B4480b2608k04622e4235j24564A36236J60696g6678c1737l34603g8281k66874
12822c45155G4065L33467A61636B9212J2297c9652F5415J15031b1100A31533a47630
12810B59329c33901A63235c0489A94329f4808G8816g4185p5265A19151J71616
12800B90767a55654J8120D7806J18772a43213B2230b12257D3335K19022a39869
12789c16551B10271k6535k1664o6040P4736G3176k2463b2532q6354a5956l38535
12778c54491B7476J26051b87326G0680J24456b20315i1943C26465a71184A82012
12767A06096J3124f9738M912B21787p2973a48928B53734O6561e7817B17782G3987
12755B86152q7076h0298j5528o7769Q0723D46880A09825A9067J35335m1228O1493
$$ plain form
12833 24480 -22608 -227230 -54235 -178799 136236 296932 -76678 -31737 -366340 -78281 -345155
12822 -345155 74065 407532 161636 29212 41509 -39652 65415 180446 -21100 131533 -147630
12810 259329 -333901 163235 -30489 194329 -64808 78816 -74185 -149450 119151 290767
12800 290767 -155654 -137534 47806 166578 -143213 22230 -212257 43335 262357 -139869
12789 -316551 210271 183736 162072 96032 170768 73176 50713 -22532 -108886 -15956 -354491
12778 -354491 27476 153527 -287326 70680 195136 -220315 -91943 326465 -171184 182012
12767 106096 119220 -69738 -64826 221787 148814 -148928 253734 320295 -57817 217782 73987
12755 286152 199076 -80298 -95826 -163595 -82872 446880 109825 19067 154402 113174 174667
12744A74667K1853a14141A38548i3219c2713A1581J27604j2483L4223l5805J98570
12733C23690j49616D0017J7275a27378A38814C4295e3229C3749J52899J1697d0296
12721f8128j46128B23181c31368c4534C9156K05640a13424d0628A48211N0254
12711A98465J60286O1975C5037J35758K39341J16745B20102E221N10284j03532
12701D11973j26405Q685B0157a8951B56440E355b7555A94416K8593l6028p5758
12690A11223J55508K187G2572B1213M1926d491A95965q78F3416b59884A42697
12678C47605n8425c51631h3554B01178n4160g1288b059C5561J60445q9311b50263
12666A50556p3042L08782j50693p8319N19131A31919J6760b0663A25349M35574
$$ plain form
12744 174667 196520 -114141 138548 -93219 -32713 11581 139185 126702 160925 125120 323690
12733 323690 174074 40017 57292 -127378 138814 34295 -53229 33749 186648 198345 -40296
12721 -68128 -214256 223181 -331368 -34534 39156 244796 -113424 -40628 148211 198465
12711 198465 358751 420726 35037 170795 410136 526881 220102 5221 515505 411973
12701 411973 285568 294253 20157 -18951 256440 5355 -27555 194416 223009 186981 111223
12690 111223 266731 268918 72572 21213 63139 -4491 195965 195087 63416 -259884 142697
12678 347605 289180 -351631 -83554 201178 147018 -71288 -2059 35561 196006 106695 -250263
12666 150556 77514 386296 235603 157284 676415 131919 148679 -20663 125349 560923
12656E60923K0429A55756i485A81028J08411c468D43569j94733a62419A97724
12645B8358J2811a30397B14195b4055B98553m7400j18410J95175j33221K8354
12635B23051b5750A25419K1953e148C77904A67438a09458A65089m1951B7014f1631
12623A94696d03712E69132k77059K6817r2859k0799R160m2564O2230b13805A65320
12611C62366j03894G0258K13443P048g5333h158o1397A84128F2832M3209P2140
12600A78181O3458q6533f7575A342L10305d0531P747H7266b32248A1581c0412
12588C636J12743J45332C3134J39708b4645L649B0293a93826P0488A16008d8620
12576a44133m9831Q5515A4220K37458e7404K2956A34500A5830b1130H4214A3052
$$ plain form
12656 560923 581352 155756 -9485 181028 289439 -3468 443569 248836 -162419 197724
12645 28358 41169 -130397 214195 -24055 298553 251153 132743 327918 194697 223051
12635 223051 -25750 125419 147372 -5148 377904 167438 -109458 165089 123138 27014 -61631
12623 194696 -403712 569132 292073 318890 226031 205232 214392 171828 234058 -213805 165320
12611 362366 258472 70258 283701 290749 -75333 -8158 -69555 184128 62832 106041 178181
12600 178181 241639 155106 -67575 1342 311647 -40531 -32784 87266 -232248 11581 -30412
12588 3636 116379 261711 33134 172842 -24645 -20996 20293 -193826 -123338 116008 -48620
12576 -144133 -193964 -108449 14220 251678 -57404 -34448 134500 15830 -21130 84214 13052
12564c2272I207L5187a14876B66772A4455K09656d10A02569K14953c69478A25866
12552A58380a93250B25950J03003a9924r9757A48693K2242a76257p2641A37241
12541A10303n1457J0552f1052b3200m14247a91741G934J84432c8115n9099M7483
12530d9731A37992J11011j07793M4359b09539H8729O6606A5382b65888j13303
12520c79191h4219l32179F2253a79499P4538j38494C10571a96939l10248J4931
12510d92256A62250b7255B45590k2006i1742B81887g5737k76086a39722E0993
12499C76416D7132e7160A44758F6340n676d2780B00337C416h3239A5384c362A85931
12486A66056c0975A6402e7292l0393A04597b72947R1946G6383g1892A05186D9822
$$ plain form
12564 -32272 9207 44394 -114876 266772 14455 224111 -410 102569 317522 -369478 125866
12552 158380 -193250 225950 328953 -19924 -119681 148693 170935 -176257 -248898 137241
12541 110303 58846 69398 -61052 -23200 -437447 -191741 7934 192366 -38115 -97214 -49731
12530 -49731 137992 249003 141210 185569 -209539 88729 155335 15382 -265888 -379191
12520 -379191 -84219 -416398 62253 -179499 -104961 -243455 310571 -196939 -507187 -492256
12510 -492256 162250 -27255 245590 223584 -91742 281887 -75737 -351823 -139722 50993
12499 376416 47132 -57160 144758 66340 60664 -42780 200337 3416 -83239 15384 -3362 185931
12486 166056 -30975 16402 -57292 -87685 104597 -272947 -181001 76383 -71892 105186 49822
12474D2318b03161N5936c0572l37539a49795E9636j588J60105k468R6345A10432
12462A5520a58428A79430b4487A3051L0709J84703J52997c02151A64686m4340
12452A20346J23910a72711A5580e1963G3947d38068A93536E2578R6689a65726
12441a88851C8392c82145a86609j91378A66688b39411n8716a13649C087L4570
12431C7657M6902l0205a0310A22552E0650O2932N50d8276A16367R6038E1225d1456
12418A04242M44967g3945j53717J11983A9597a25990o3226B66160a60018A12884
12407a49405o0850B38320j07838J4270a27423d9612A16893f6761J1064n3070l38622
12396d47389b0815F750d9490A00433D3386R2356g5442A34541O5767a43962j07876
$$ plain form
12474 42318 -203161 -147225 -30572 -368111 -149795 59636 58048 218153 215685 312030 110432
12462 15520 -158428 179430 -24487 13051 43760 228463 381460 -302151 164686 120346
12452 120346 244256 -172711 15580 -51963 73947 -438068 193536 52578 149267 -165726
12441 -188851 38392 -382145 -186609 -377987 166688 -239411 -298127 -113649 3087 37657
12431 37657 84559 54354 -10310 122552 50650 113582 114132 -48276 116367 212405 51225 -41456
12418 104242 549209 -73945 -227662 -115679 19597 -125990 -189216 266160 -160018 112884
12407 -149405 -210255 238320 130482 144752 -127423 -49612 116893 -66761 -55697 -108767 -447389
12396 -447389 -20815 6750 -49490 100433 43386 135742 -75442 134541 200308 -143962 -251838
12385b51838a21187G6892a81036C6017J73840K0444i058H8435L3022j6361a21311
12373B8365K5745M9055k8723c3031A92457B6417h258B68216f3867K3979A42530
12361C69374o0857l19E5903a71201n747E3538r069J07984R3788A03535P7292Q386
12349A89213g471E6638k2205B773a59067A41403f3280A2123a4031j40482K442
12338a52071B20631j06301j8713K1686a26772j2574o108K0631B5119b89375A54794
12326a35530A2713J6607J65335p6305a03280A58181a14684c8921I0514g5077I4702
12314A09319a5577B6978b49228Q9225e2408A77572m8262d7611m2167A52764h5767
12302a92341A72460B571L18044E8183c44451J69620M3039C54978j14921d328A3445
$$ plain form
12385 -251838 -121187 76892 -181036 36017 209857 230301 -9058 88435 121457 105096 -121311
12373 28365 54110 103165 74442 -33031 192457 26417 -8258 268216 -63867 -39888 142530
12361 369374 308517 308198 55903 -171201 -176948 53538 44469 152453 246241 103535 180827 189213
12349 189213 -7471 56638 34433 2773 -159067 141403 -63280 12123 -14031 -154513 -152071
12338 -152071 220631 114330 95617 117303 -126772 -139346 -145454 -124823 25119 -289375 154794
12326 -135530 12713 29320 194655 118350 -103280 158181 -114684 -38921 90514 -75077 94702
12314 109319 -15577 26978 -249228 -160003 -52408 177572 129310 -47611 -89778 152764 -85767
12302 -192341 172460 2571 320615 58183 -344451 -174831 -131792 354978 240057 -4328 13445
12290H2311j2920a8044B2021J03604b37421h1760A74652a59462O4051B73148J37390
12279D10538j39281a1509C44214b14094B71005c52B31642o6056a4953j77695C71288
12267a48858a1212a942j71088b8267B3896M50217b79040I8101g4660H1269a56942
12255B16938j05222J73731B4052K43821L949q0769c162A8929d0691A94699d7688
12243b32301A75737l7160l0491l4629Q7837b4315B5637A998J04452Q8191r358
12232A85283J81032H1625J81494K48738e2509A64565G7129J53940C9572J60559
12222B00131L33742A00822a13988E1615L33251P8322J05571A63516a05947A69181
12211C36968j18835r7635M8760N3436J39322k4401H4583k4716k3020L41971J17175
$$ plain form
12290 82311 69391 -18044 22021 125625 -237421 -81760 174652 -159462 -95411 273148 410538
12279 410538 271257 -11509 344214 -214094 271005 -352 231642 165586 -14953 -192648 371288
12267 -148858 -11212 -1942 -173030 -28267 23896 474113 -279040 98101 -74660 81269 -156942
12255 216938 111716 285447 24052 267873 271822 191053 -3162 18929 -40691 194699 -47688
12243 -232301 175737 138577 108086 73457 161294 -24315 25637 1998 106450 194641 185283
12232 185283 366315 81625 263119 511857 -52509 164565 77129 231069 39572 200131
12222 200131 533873 100822 -113988 51615 384866 463188 568759 163516 -105947 169181
12211 336968 218133 120498 169258 222694 362016 337615 84583 59867 36847 378818 495993
12200D95993k25347k1756J30036B696J32090K07253C7393K34991B0692a27762
12189D22700k06667E5738N8059a26255k5304B03737a22555B73801o8616E2149
12178C8094J62378n1056a20347A09975L20484h4526c9457B84719J13704B7067
12167d695G832K6779M43248j01404a46098D1939L5626l4287K49934c76878d9894
12155a17218A18793B6310j836L19968A64812c5555A258J75089J60775c701D5632
12143C79880a71004B32854B3613m110J97209Q5389a13905A22687a93179B86920
12132A04732O8231H4416a87990I5901R7444a6263j30941A00310J1434d9342C19489
12120b28709E0964g1006m8674B14748a70714Q0012A62033a81432n9040A42130
$$ plain form
12200 495993 270646 248890 378926 2696 134786 342039 37393 272384 20692 -127762
12189 422700 216033 55738 113797 -126255 -151559 203737 -122555 273801 205185 52149
12178 38094 200472 149416 -120347 109975 430459 -84526 -39457 284719 398423 27067
12167 -4695 7832 34611 477859 376455 -146098 41939 77565 43278 293212 -376878 -49894
12155 -117218 118793 26310 24474 344442 164812 -35555 1258 176347 337122 -3701 45632
12143 379880 -171004 232854 23613 19503 216712 302101 -113905 122687 -193179 286920
12132 104732 172963 84416 -187990 95901 193345 -16263 -147204 100310 111744 -49342 319489
12120 -228709 50964 -71006 -119680 214748 -170714 -90702 162033 -181432 -240472 142130
12109A58492F0986O7504a29994A44814a10171J1340Q968A54952m5576J54961i1151
12097A98837q6646a54113B53577A0071P8502b31312I2541c2520B18777K69866
12087D88643h514o8615a9479A01332a52919A74185P4976h5425j45241D02696P00187
12076A102883J408598r11544D38420j46821G1081E271b1058C7467K80251b336
12065e1255B35373A8040c2396l58583J45418B01958l6191P3872B0815a60543a7131
12053A52437m1292C6133K4589K06068j3472M2350f3821o4828b1188m6951D1694
12041e7531A27348E828h1390c3478k38490B85600a74091A12725a65484H824a91212
12029c1247B69582a66557E1218a63249d2196E4600K8970B2541K896K50830f727
$$ plain form
12109 158492 60986 128490 -129994 144814 -110171 -98831 -89863 154952 109376 264337 -91151
12097 198837 112191 -154113 253577 10071 88573 -231312 92541 -32520 218777 488643
12087 488643 -8514 -77129 -19479 101332 -152919 174185 249161 -85425 -230666 402696 1102883
12076 1102883 2511481 1599937 438420 291599 71081 5271 -21058 37467 317718 -2336
12065 -51255 235373 18040 -32396 -390979 -245561 201958 165767 239639 20815 -160543 -17131
12053 152437 111145 36133 60722 266790 253318 295668 -63821 -128649 -21188 -68139 41694
12041 -57531 127348 5828 -81390 -33478 -271968 285600 -174091 112725 -165484 8824 -191212
12029 -31247 269582 -166557 51218 -163249 -42196 54600 83570 22541 25437 276267 -6727
12017A8193e6644C71611a56703A26853b19594B96757A7296O4959L5154b35769
12006a31042e9986A15507j8203a3188r1716k79625A8542d211B90842D3008c20991
11994a30622k89049C718a1736b210k68610A4471K34282b81779g4164B07848b22327
11982C92240a89728B7929a4435B0477K31352F4863L8312J22856P751H445i8992
11970e5509B99064j3197d5705A85855F8512a3583C8308K1841J83856N3783j44231
11959A53557E2739A3479a22085B32229a18423F4248a13211c44k07221P228F8012
11947a96341B81959H1275a70840r835k58656B49881H4044L7592a52840A79955
11936A86726i4985B20218b60044A42784a89435A2391a02084E0866M2185h6334
$$ plain form
12017 18193 -56644 371611 -156703 126853 -219594 296757 17296 82255 117409 -235769
12006 -131042 -59986 115507 97304 -13188 -104904 -384529 18542 -4211 290842 43008 -320991
11994 -130622 -419671 3718 -11736 -2210 -270820 14471 248753 -281779 -74164 207848 -222327
11982 392240 -189728 27929 -14435 20477 251829 64863 103175 226031 233782 8445 -98992
11970 -55509 299064 285867 -45705 185855 68512 -13583 38308 60149 244005 297788 153557
11959 153557 52739 13479 -122085 232229 -118423 64248 -113211 -344 -207565 -200337 68012
11947 -196341 281959 81275 -170840 -180675 -439331 249881 84044 121636 -152840 179955
11936 186726 -94985 220218 -260044 142784 -189435 12391 -102084 50866 93051 -86334
11925b6625B5338N1925b00880D2483j1633M6104J69165i0617L0728a1482j9354
11914c0836B77611e1138j54297h4354C354b62578A60413b87384B58051o0041o5018
11903A32992L1743k6306n7603O8112a10474j45025j03238a7308M964j02245a4664
11891d09508A98456a27114J2009i920l45094B18177h9730j35365e4116o2236E3648
11879H840M6551a0358m06831A08526c4070k02160A87758n8934b9004k81933e3539
11867A66098B5222Q5760b12057B96537A6103J14386b24928e4646I3308J63047
11857B56355J60280E5687a80485B06015D7573a52675B80565a01545r3118M0654
11847a54009B7638i067A5776J83688a55251N3557B14655h4151j04968a1417l96566
$$ plain form
11925 -26625 25338 77263 -200880 42483 30850 76954 246119 -90617 -59889 -11482 -30836
11914 -30836 277611 -51138 -205435 -84354 3354 -262578 160413 -287384 258051 198010 132992
11903 132992 164735 138429 80826 148938 -110474 -255499 -358737 -17308 -12344 -114589 -14664
11891 -409508 198456 -127114 -115105 -9920 -355014 218177 -89730 -225095 -54116 -116352 53648
11879 8840 55391 -10358 -417189 108526 -34070 -236230 187758 128824 -29004 -310937 -53539
11867 166098 25222 110982 -212057 296537 16103 130489 -224928 -54646 93308 256355
11857 256355 416635 55687 -180485 206015 47573 -152675 280565 -101545 -194663 -154009
11847 -154009 27638 -9067 15776 199464 -155251 -101694 214655 -84151 -189119 -11417 -407983
11836d07983i5201J9790j25154i0548j64279f5486n7725j8836G0674B2268O8569
11825I0837m5198i5088G8458J46348F6228l0089a75632j06522Q8559C6663b57133
11813b94811J33171g2349c2325A04982a32255c2878r8520A62619D0002a90550
11802A50649a39508B18156B3256M4028K7772a0185j27910c551B85692e7383A57502
11790A08500a27763L2714k158A49413l8200C5155c4996m865o9125I0920L5313
11779A26233a5839j35805A49363i37C01568f3657m4231J893C32111A44231E9149
11767a6617q0086C30082a57377j9839D1948A5849b3821n6034B35978F1413a26007
11755A09396k3283N996c2972A56980a91847g2313A0257a71929M6049j77484M5344
$$ plain form
11836 -407983 -95201 -75411 -200565 -90548 -254827 -65486 -123211 -142047 70674 22268 90837
11825 90837 45639 -95088 78458 224806 66228 36139 -175632 -282154 -193595 36663 -257133
11813 -294811 -161640 -72349 -32325 104982 -132255 -32878 -131398 162619 40002 -190550
11802 150649 -139508 218156 23256 67284 95056 -10185 -138095 -3551 285692 -57383 157502
11790 108500 -127763 -95049 -97207 149413 111213 35155 -34996 -39861 -108986 90920 126233
11779 126233 -15839 -151644 149363 -937 301568 -63657 -107888 -105995 332111 144231 59149
11767 -16617 -96703 330082 -157377 -177216 41948 15849 -23821 -79855 235978 61413 -126007
11755 109396 86113 92109 -32972 156980 -191847 -72313 10257 -171929 -125880 -303364 -258020
11744b58020g8372B78122i139j76348B72296J1571d5991M222q861F8530f165A10955
11731A82551o375a85385Q3743l9916E2026K3803P647a6969A92514P183j8885a96661
11718A02085K12898B5795L4771a1465D4980b6053l63956e8872C68917b98880J44670
11707a54210O5422A36242a57824a5618E1085a3976j39491k5233B03297p3928L35065
11696D64434a92073A74470b19908A04880a2142l0309q967j96851P5496Q605B09497
11684A05493C1008g7224k4293F047J43661D7630M4573Q4024J18597e9428A01484
11672C4741j0933J83099d3628B83478h8222d2969A54544N1466b82627Q9938D2163
11660a33347A67905O7800a23376h348A26735a95962B14258d6746C57248h8051
$$ plain form
11744 -258020 -78372 278122 -9139 -185487 272296 283867 -45991 -41769 -50630 68530 -6165 110955
11731 182551 176176 -185385 -101642 -141558 52026 75829 83476 -16969 192514 199697 180812 -196661
11718 102085 314983 25795 60566 -11465 44980 -26053 -390009 -58872 368917 -298880 -154210
11707 -154210 -88788 136242 -157824 -15618 51085 -13976 -153467 -178700 203297 129369 464434
11696 464434 -192073 174470 -219908 104880 -12142 -42451 -51418 -248269 -172773 -164168 209497
11684 105493 31008 -77224 -101517 6047 149708 47630 92203 176227 294824 -59428 101484
11672 34741 23808 206907 -43628 283478 -88222 -42969 154544 206010 -282627 -192689 42163
11660 -133347 167905 235705 -123376 -8348 126735 -195962 214258 -46746 357248 -88051
11649A21296K17578g9329B3900P0145f097G5034b63845e3756A75998C3994J24931
11638A58925Q9053g8895B78644a7013G5415J3386c37484E9911K45089g7466C17544
11626a1987r51G8952N6716h0933j27085B15055k124c688q2702A46037a52959A08616
11613B0360J05155F2737h2131E802g0896A1150b28370N7787E2028k1690J42973
11602A73311a06888H3161K55108a10972a4888E78387B2925M9665a23907D6109
11591b31388A59355p8105a61451B41008C1060J61233K9094q6139J4005o5291j377
11580H2585h1599k00768I2798K8478E7847a1154j02949B23658F6532f7513C7315
11568A41967c8172B40105I955K37051H173b2841C01487d8214A2979L33398B929
$$ plain form
11649 121296 338874 -79329 23900 94045 -6097 75034 -263845 -53756 175998 33994 158925
11638 158925 247978 -78895 278644 -17013 75415 88801 -337484 59911 305000 -77466 317544
11626 -11987 -12938 78952 135668 -80933 -208018 215055 212931 -3688 -86390 146037 -152959 108616
11613 20360 125515 62737 -82131 5802 -70896 11150 -228370 -170583 52028 30338 173311
11602 173311 -106888 83161 338269 -110972 -14888 578387 22925 72590 -123907 46109
11591 -231388 159355 81250 -161451 241008 31060 192293 221387 135248 149253 83962 82585
11580 82585 -81599 -282367 92798 121276 57847 -11154 -114103 223658 66532 -67513 37315
11568 141967 -38172 240105 9955 247006 8173 -22841 301487 -48214 12979 346377 2929
11556a43080B95289k6242Q0744J8891A57544A2146J25877a87706L3580E5979a56655
11544a23235A56186J14226a20311A18947J15548e3711I8485f2924A52053a47429
11533G3397c52045C60163a8178A51272C56M2862a28928M1436b1876m0294A19484
11521B3917M0100Q9252C1368h1510H4003K97076E140b61080B16964p2185k4970
11510A19809C1206J13365K30867H9419K06603A18534J72514f6155C70P3862R6708
11499A70940p2287J87206j41487B1426N67933B71035n3555j07341m4990j7417
11489D7732K52478r9195G2473O3622i8622d3621A34587K39491h3389A73588K05043
11478C78631a218A05988a41044B68159n9960b4087B93846a09479C80739A13271
$$ plain form
11556 -143080 295289 269047 349791 368682 157544 12146 138023 -187706 -154126 55979 -156655
11544 -123235 156186 270412 -120311 118947 234495 -53711 98485 -62924 152053 -147429
11533 73397 -352045 360163 -18178 151272 356 43218 -128928 -87492 -21876 -62170 119484
11521 23917 64017 153269 31368 -81510 84003 381079 5140 -261080 216964 144779 119809
11510 119809 31206 144571 375438 89419 296022 118534 291048 -66155 370 74232 170940
11499 170940 98653 285859 144372 21426 589359 271035 217480 110139 65149 47732
11489 47732 300210 201015 72473 136095 -98622 -43621 134587 374078 -83389 173588 378631
11478 378631 -1218 105988 -141044 268159 208199 -24087 293846 -109479 380739 113271
11467A56340J12616N6209r8610J9646j1206M3740B3364f9246A021J41863a42794
11455B41963p1612o9788a01854A09707c9520b533B33993m6108E3715a34410j18976
11444b53386g3734A67925b74833B63904a53655L0876A92709G3916K09887L8903
11434C22706J22490F9714E210f8544B03442a20031C14768A28587J70144F7297
11423c28314a26947B265J41801f6142Q675p3630p2604A01216e7703m9143B319
11411d5506j14512C0321K77813A0794L3218e2511n245b0171B14012b03392h4664
11399B03419l7283J91363i5513b0965j30058A56893N4820f8888l45770g7116B1001
11387a45464B61785b15129J8235A5795c11627B83210B9096R2222a98321A3113
$$ plain form
11467 156340 268956 325165 226555 246201 234995 278735 23364 -69246 1021 142884 -142794
11455 241963 170351 100563 -101854 109707 -39520 -2533 233993 187885 53715 -134410 -253386
11444 -253386 -73734 167925 -274833 263904 -153655 -122779 192709 73916 283803 322706
11434 322706 445196 69714 5210 -68544 203442 -120031 314768 128587 298731 67297
11423 -328314 -126947 2265 144066 -66142 -57467 -131097 -203701 101216 -57703 -106846 2319
11411 -45506 -160018 30321 308134 10794 44012 -52511 -57756 -20171 214012 -203392 -84664
11399 203419 166136 357499 -95513 -20965 -151023 156893 211713 -68888 -414658 -77116 21001
11387 -145464 261785 -215129 -196894 15795 -311627 283210 29096 121318 -198321 13113
11376B39461H4518D0570c68629i0853A05552k4361O0564C5329J65578c0304k44920
11365b75224A20987K0474b33333B21888a02785d4577j47138O3846A57689P8795
11355B36484a21455F1151i1458j60294H7926a15799c2599r7400N883P143A38497
11343F1044c643B59745b56199O4316J8354A31838a88930A19364J26858e2782B04492
11331C7769a81406Q0302L9717J6329k97195i2382A9386e8384b1940q970A9625
11319h4569C12878j23716C1034J05253a37501c9085k7849j12732o0122A34535
11308b84353K0075g8127A9593a07070B34588A5097L3608a27947I9926a8046D82973
11296b27035p351f1837C5996J43664a44790A34591f2768k90081B08758B9881c3929
$$ plain form
11376 239461 84518 40570 -368629 -90853 105552 81191 141755 35329 200907 -30304 -275224
11365 -275224 120987 141461 -233333 221888 -102785 -44577 -191715 -127869 157689 236484
11355 236484 -121455 61151 -91458 -251752 87926 -115799 -32599 -129999 -124116 -116973 138497
11343 61044 -3643 259745 -256199 -191883 -173529 131838 -188930 119364 246222 -52782 204492
11331 37769 -181406 -101104 -61387 -45058 -342253 -92382 19386 -58384 -21940 -30910 19625
11319 -84569 312878 189162 31034 136287 -137501 -39085 -66934 -179666 -239788 134535
11308 -284353 -264278 -78127 19593 -107070 234588 15097 48705 -127947 99926 -18046 482973
11296 -227035 -234386 -61837 35996 179660 -144790 134591 -62768 -352849 208758 29881 -33929
11284b650H5347a39267C02516j15319a2712G1103c87107a4216I0708O8025B6004
11272g1089m0564L1677l2899a4342k32151H8854A6019Q2554A8965l31K7385a19291
11259a61435A65548k5183k5949A8114K7583b99479C1620a71055g0826q1721m9400
11248b01947d92A02964l6098a67845N2623l22057J59286A4394a16452k1958l4988
11237a73398m07382A56875b52638R3997j28925J33133I4521a24252q2091A640
11226b29675C7957L38915A40719c56650f9895j25436a5641k42123A9182b62458
11215a85315I6833b03725K3074o952k7395M6375A80100A7265i6565A28956n7304
11204G1652J56481g6950A62998D4261c46525A6143J7790K69886B1273J16434c8213
$$ plain form
11284 -2650 85347 -139267 302516 187197 -12712 71103 -387107 -14216 90708 158733 26004
11272 -71089 -111653 -79976 -112875 -14342 -246493 88854 16019 98573 18965 18634 46019 -119291
11259 -161435 165548 140365 114416 18114 45697 -299479 31620 -171055 -70826 -152547 -201947
11248 -201947 -492 102964 66866 -167845 -115222 -437279 -277993 14394 -116452 -138410 -173398
11237 -173398 -580780 156875 -252638 -158641 -287566 -154433 94521 -124252 -206343 1640
11226 -229675 37957 376872 140719 -356650 -69895 -195331 -15641 -257764 19182 -262458
11215 -185315 96833 -203725 -180651 -187603 -214998 -168623 180100 17265 -96565 128956 71652
11204 71652 228133 -76950 162998 44261 -346525 16143 33933 303819 21273 137707 -38213
11192A66222a15401m3894H9793a72852a0746m8069h080n5898j88617B31393a50032
11180a51547A25389J61373b84343A53069a31593G6569a9987j31937J9004J6551
11170a16369d6783I542J5763J52654J26519A26625i6356A88364l3282a3744j89519
11159b03263q3962m4984A2475b40218G0366a6029h73l54043f6104B22020a08534
11147a20309a4835j99079a5030A92729r4346b60945D83803a69829I1671h9400
11136e702j38547A55762a25828B9545c5378C54329j20586G1168R7770B9278c9031
11124f0147G4337J44421d5798k6671A4335a1841B02137a42325o5064A86253D8224
11112B15356a65584c8924m51343A13174A7123e0303B27396K25882B06591J22743
$$ plain form
11192 166222 -115401 -159295 89793 -172852 -10746 -58815 -8080 -63978 -252595 231393 -150032
11180 -151547 125389 286762 -284343 153069 -131593 76569 -19987 -151924 -132920 -116369
11170 -116369 -46783 9542 25305 177959 304478 126625 -96356 188364 155082 -13744 -203263
11159 -203263 -287225 -332209 12475 -240218 70366 -16029 -873 -354916 -66104 222020 -108534
11147 -120309 -14835 -213914 -15030 192729 98383 -260945 483803 -169829 91671 -89400
11136 -5702 -144249 155762 -125828 29545 -35378 354329 233743 71168 168938 29278 -39031
11124 -60147 74337 218758 -45798 -72469 14335 -11841 202137 -142325 -207389 186253 48224
11112 215356 -165584 -38924 -490267 113174 17123 -50303 227396 453278 206591 329334
11102C29334m4828j33299b1899n5572j05585B18480Q8491A22381M723E833L05292
11091C11125a0175A61837K04730D3535R3646J89957r6059K3285J69510A81614
11080C54620R2615K18749A78441J18946J99720I4761K90556j84329J04049J26247
11070D31284j0617p6448K5798j44962L03252A30157K59636D0993M98866d6620
11059D87202j3631J88444k60431J3200L1831K78353l51614K50675R8790j2158
11049G10661j89557M37580K99908m93930J56776k29587j84221J48777K34479k04134
11039F86752p6670M32845n1797l89760K1223P8438L4137j13176P0942M9439j88190
11028E54183L19133k50933K47845k68047J06605M3483j29625j70663J62066J18379
$$ plain form
11102 329334 284506 151207 -21899 -77471 -183056 218480 306971 122381 127104 5833 311125
11091 311125 -10175 161837 366567 43535 137181 327138 231079 254364 423874 181614
11080 354620 447235 665984 178441 297387 497107 94761 385317 200988 305037 431284
11070 431284 420667 344219 370017 225055 528307 130157 389793 40993 539859 -46620
11059 487202 473571 662015 401584 414784 446615 724968 373354 624029 722819 710661
11049 710661 521104 958684 1258592 764662 921438 691851 507630 656407 890886 686752
11039 686752 610082 1042927 991130 601370 622593 701031 735168 621992 692934 742373 554183
11028 554183 873316 622383 870228 602181 708786 752269 622644 451981 614047 732426
11018G32426j75623P8827r2546J67620J2744n4649o6044j41326A56249O91178
11008H47427j68337m5231N2241j6720J3121k06560J71350k88849L03798N8655
10998G20895B77899M46634k58856R5064j65932M96770m21470P18409n38870N6326
10988G05974N5752L32479k16264q911j1369K92114k14142J18660l3551l6077K35007
10977A219672J48987j3804N97499K62K68814L55366j92873O6893J90995K827n0372
10966B594266l03806m14414j27890R7938m48155L66150N3619k62950p8102K31162
10956A707818K49793j55184j86606O971n47106L53001m35489l66044J84546k31046
10946E80654K29793l10286R7541p9245j59005f2758B92747A13009P9535l5347
$$ plain form
11018 732426 556803 635630 543084 710704 723448 668799 602755 461429 156249 847427
11008 847427 679090 633859 686100 669380 682501 475941 647291 358442 662240 720895
10998 720895 277899 724533 465677 560741 394809 891579 470109 1188518 649648 705974
10988 705974 761726 1094205 877941 869030 857661 1149775 935633 1054293 1020742 984665 1219672
10977 1219672 1368659 1354855 1952354 1952616 2221430 2576796 2383923 2450816 2641811 2644638 2594266
10966 2594266 2290460 1876046 1748156 1846094 1397939 1764089 1817708 1554758 1476656 1707818
10956 1707818 1957611 1802427 1615821 1622792 1075686 1428687 993198 627154 811700 580654
10946 580654 810447 500161 597702 518457 359452 -62758 292747 113009 192544 157197
10936A57197K08957A32148J65803A26185B5446L7885K21407j23739b1117B39246
10925A51183M631b23653q1341a1616k48443g482j51442A40124N262C0126M6137
10914G6263L3697J51256F3160c1885C5976b01910a8927m95719I9152k0960R8933
10903A77125b01878a9468H9084a01509F6298f186A46293C4504J6116J03082e3970
10891a28153B5608a13497A24666k6853R6279j6070J922c29182A24402a60287e4221
10879f8676l07687B47583h0999G5892A7092b78527A22883a74794j16240M1082
10869b49952J4341a10817r1259R4034C410J46748b83179a2187j90108A93942b05708
10857f6254A70440L3875N3779b79260j7547B07592a86432m3711G4037a91962A70096
$$ plain form
10936 157197 366154 132148 297951 126185 25446 63331 284738 160999 -21117 239246
10925 151183 155814 -223653 -304994 -11616 -260059 -7482 -158924 140124 145386 30126 76263
10914 76263 109960 261216 63160 -31885 35976 -201910 -18927 -514646 99152 78192 177125
10903 177125 -201878 -19468 89084 -101509 66298 -6186 146293 34504 50620 153702 -53970
10891 -128153 25608 -113497 124666 97813 194092 178022 179944 -329182 124402 -160287 -54221
10879 -68676 -376363 247583 -80999 75892 17092 -278527 122883 -174794 -291034 -249952
10869 -249952 -235611 -110817 -202076 -108042 3410 150158 -283179 -12187 -202295 193942 -205708
10857 -66254 170440 204315 258094 -279260 -296807 207592 -186432 -230143 74037 -191962 170096
10845f0809A36491i9987A32952a31714d5289k60927a9273B47357R3942j36849
10835B04450i2286J7210j83546R9392j11979F7762L39619A28338a69009A5027
10824a86881e4833r4727H7762M7468L7464c9152E28440I2420C6835g1657l677
10813g5334N728H9766a71107e5634E5932a78959k7254o5141D3979b63915A72178
10801G0845a29478C01930C2246a10977i880A27336b57076H5401M5671d5582A20172
10789C5707e0077E1642a05964C60533c17316A91248a51176j44962j07356B39237
10778A73142f73236i165m50850e311C07066A40934e8049H497a25758k5545k6271
10767a77574D6468A0557K15040c3728I7925i0246C0174M9530k5377J68036a42598
$$ plain form
10845 -60809 136491 -99987 132952 -131714 -45289 -306216 -19273 247357 341299 204450
10835 204450 -92286 -75076 -258622 -159230 -271209 67762 407381 128338 -169009 15027
10824 -186881 -54833 -149560 87762 135230 172694 -39152 528440 92420 36835 -71657 -75334
10813 -75334 -69606 89766 -171107 -55634 55932 -178959 -206213 -271354 43979 -263915 172178
10801 70845 -129478 301930 32246 -110977 -9880 127336 -257076 85401 131072 -45582 120172
10789 35707 -50077 51642 -105964 360533 -317316 191248 -151176 -296138 -403494 239237
10778 173142 -673236 -9165 -460015 -5311 307066 140934 -58049 8497 -125758 -151303 -177574
10767 -177574 46468 10557 225597 -33728 97925 -90246 30174 79704 54327 222363 -142598
10755b94426p0751Q1773E7568P1914i8330r386D1388a00580c6560H2328K76660
10744C58988f6539A63449i4982B02419G2796a15936b770D2485a90438a9082A50652
10732b4158o7731E7185K1598k4267L8644H165i8780B0782b23908C72955C6082
10720b92713D0397L9215c01096C16718a15268j73883B56254a58430B18008g4885
10709B20873p7718K2584F5106a98384f2877b1495k41194o415B6072e4253H2593
10697e6232A41465i627n82355A52077b82101g6603l7028D1011J62740a27991C34651
10685h7391j22370m7975H8039c38993E09577g4063l5525o4123j2810A6752b0432
10673e353k93414B08729i4178A74300B5048h5945B93576H3394d81951B57378B0691
$$ plain form
10755 -294426 -365177 -283404 57568 129482 -98330 -107716 41388 -100580 -36560 82328 358988
10744 358988 -66539 163449 -94982 202419 72796 -115936 -2770 42485 -190438 -19082 150652
10732 -24158 -91889 57185 78783 54516 93160 8165 -98780 20782 -223908 372955 36082
10720 -292713 40397 79612 -301096 316718 -115268 -289151 256254 -158430 218008 -74885
10709 220873 143155 165739 65106 -198384 -62877 -21495 -262689 -269104 26072 -54253 82593
10697 -56232 141465 -9627 -591982 152077 -282101 -76603 -113631 41011 203751 -127991 334651
10685 -87391 -209761 -257736 88039 -338993 509577 -74063 -109588 -173711 -186521 16752 -20432
10673 -5353 -298767 208729 -94178 174300 25048 -85945 293576 83394 -481951 257378 20691
10661G8597J35866C8024c7640A32090f3319l31179e0795l04885a25007A04132
10650b31933A22659E2609a75117a3016j20919A18077C5237a11717h199G5283a6042
10638a28035G1573a27339j45868j42515b02883m204B58519r3236J6955a84164
10627e4746j55195A69944c1689A50638c54722H6517J08614e4424k7108k23487
10617c05019H0395g8249C710N7356A3898c17373A08627k1523b15540A48285a08156
10605b59616B4426h4929g242A6280f0143M189j38142B4798J37123A1240J0197
10594B1437K3024a82513j92608P5299a37722A07606J804a16931e7718n2560j80898
10583b91176J20772C69271a14710A81567a46809F3679a10094D6834c26135h8322
$$ plain form
10661 78597 214463 38024 -37640 132090 -63319 -394498 -50795 -355680 -125007 104132
10650 -231933 122659 52609 -175117 -13016 -133935 118077 35237 -111717 -8199 75283 -16042
10638 -128035 71573 -127339 -273207 -415722 -202883 -207087 258519 165283 182238 -184164
10627 -54746 -209941 169944 -31689 150638 -354722 86517 195131 -54424 -81532 -305019
10617 -305019 80395 -78249 3710 61066 13898 -317373 108627 87104 -215540 148285 -108156
10605 -259616 24426 -84929 -7242 16280 -60143 -55954 -194096 24798 161921 11240 21437
10594 21437 44461 -182513 -375121 -299822 -137722 107606 109410 -116931 -57718 -110278 -291176
10583 -291176 -170404 369271 -114710 181567 -146809 63679 -110094 46834 -326135 -88322
10572b48539A89267F5728a79187g3115j98531b6516j45418j82573A48888b29190
10561a24428E9549O784J15753M4716C8849a73693B16105p6241K6451b22095A72527
10549A3187e1145A50942a24900C92324E714K6305d6247F6735b08688C8689K2051
10538F0740c4638A36540a96314H9013e3484B5497d7599j01200O9472j97614O9941
10527b07000j06494i6038B60673I1280b97633d1589E0029a28827j39724a13953
10516c54309a35232G0754R0556c7319e842j3184j96853o705l999O8721P7142a336
10503e2533k4594k22615a2055C2589a41756B68854A0634a58j61379A08544M2971
10492A51515c83020B01263K5436j01603J87384h0339j69C10214E8277a53471C74802
$$ plain form
10572 -248539 189267 65728 -179187 -73115 -271646 -26516 -171934 -354507 148888 -229190
10561 -124428 59549 66333 182086 226802 38849 -173693 216105 139864 166315 -222095 172527
10549 13187 -51145 150942 -124900 392324 5714 32019 -46247 66735 -208688 38689 60740
10538 60740 -34638 136540 -196314 89013 -53484 25497 -47599 -148799 -79327 -276941 -207000
10527 -207000 -313494 -96038 260673 91280 -297633 -41589 50029 -128827 -268551 -113953
10516 -354309 -135232 70754 161310 -37319 -5842 -19026 -215879 -222584 -226583 -157862 -80720 -1336
10503 -52533 -77127 -299742 -12055 32589 -141756 268854 10634 -158 -161537 108544 151515
10492 151515 -383020 201263 226699 125096 312480 -80339 -80508 310214 58277 -153471 374802
10480C51182K47327O3407k83972q6943Q9155J6065H3503J63022c2548F5119B4970
10468B80748A7902K41866d5622A95124c55895f1882P948A89941B6127K11733A13521
10456B35606h6302E7674g5304j64350H8671A6494a31381B70731h7171C908K20194
10445B24102k2811a60381d8162k08473B80226g2185J1944k7898C02707b70707
10434a07550k00724A47271c8909O729A86439a22227p8984r2777F9434a54099B5021
10422c21498J45307H9025O6430J6231L3210a95181I4636b45064C61433A5997J21211
10411A37208a61144Q0429H9072D0005J00275a51089B02228b13580a02792j66184
10401b68976P4003D0448J66614c67480a07952b978D056K10054d7448j45761C16536
$$ plain form
10480 351182 598509 661916 377944 291001 380156 396221 83503 246525 -32548 65119 24970
10468 280748 17902 259768 -45622 195124 -355895 -61882 -53934 189941 26127 237860 113521
10456 235606 -86302 57674 -75304 -239654 88671 16494 -131381 270731 -87171 3908 224102
10445 224102 201291 -160381 -48162 -256635 280226 -72185 -60241 -88139 302707 -270707
10434 -107550 -308274 147271 -38909 -32180 186439 -122227 -201211 -293988 69434 -154099 25021
10422 -321498 -176191 89025 155455 171686 204896 -195181 94636 -245064 361433 15997 137208
10411 137208 -161144 -80715 89072 40005 140280 -151089 202228 -213580 -102792 -268976
10401 -268976 -194973 40448 207062 -367480 -107952 -2978 4056 214110 -47448 -193209 316536
10389A38804l5458h9096j15008J6173E62377A72687a36061b5398m9561k36615
10379c11574C25934a1258C03223n653K1010A56100a22459d902B95334E2862L44533
10368C97395n2259M7377K71880k34094j37255O8544a2496A2264K69597k6993e1850
10356D48152k09555P9094a15149A84013E7789M2764K09269L58485P1534l26718
10346D13123j78698K08982R6298F5504N36703k92002n475m8483A17292K07413
10336C24705r1200D7309j2020L5407O3362e6506n4802I8964a31058A43134o2444
10325H0690L28606A20542e0359B80113J30093J64910a54412B77951k2459I2760
10314f235j48917B82865A4941K03964E2348b08F7433D90a30928A78274A5780a72581
$$ plain form
10389 138804 103346 -89096 -204104 -187931 562377 172687 -136061 -25398 -74959 -311574
10379 -311574 325934 -11258 303223 297570 318580 156100 -122459 -4902 295334 52862 397395
10368 397395 345136 392513 664393 430299 293044 361588 -12496 12264 281861 254868 -51850
10356 448152 238597 317691 -115149 184013 57789 100553 309822 668307 739841 413123
10346 413123 234425 443407 539705 65504 602207 310205 304730 256247 117292 324705
10336 324705 233505 47309 35289 70696 134058 -56506 -111308 98964 -131058 143134 80690
10325 80690 409296 120542 -50359 280113 410206 575116 -154412 277951 255492 92760
10314 -6235 -155152 282865 14941 218905 52348 -208 67433 490 -130928 178274 15780 -172581
10301E8101e0646B00277o0755m2820g1217A09653a10253G6703l15b36801F9080
10289g8238J2410A39307a33759l4162F2744L58928a0175j71766a5275q8620G6867
10277B27915B4413p227L5959P7451a67524c5745B533K67472C4902N6699m3580
10266D8021c6743r309G942J11283l631a57866J6308A43779L4672M8941J15439
10255C42831K56781B61787J6961O771p9708B8735b01904B541e6124r5061g713
10243b17230a05845k16963J57023r7909A55469E9431M7668i6770J7712j8563a5144
10231c15829B38404a99732m2705d5342j0433j12350A4805a16230o4247J5199N3850
10220a11428N3895j70997J06371j19847A09056a7731p9993l89316d5146j21414
$$ plain form
10301 58101 -50646 200277 139522 96702 -71217 109653 -110253 76703 76388 -236801 69080
10289 -78238 -65828 139307 -133759 -167921 62744 421672 -10175 -181941 -15275 -103895 76867
10277 227915 24413 17186 53145 130596 -167524 -35745 2533 270005 34902 91601 48021
10266 48021 -36743 -46052 7942 119225 115594 -157866 -141558 143779 178451 227392 342831
10255 342831 599612 261787 278748 285519 205811 28735 -201904 2541 -56124 -151185 -7713
10243 -217230 -105845 -322808 -165785 -263694 155469 59431 107099 -96770 -79058 -97621 -15144
10231 -315829 238404 -199732 -242437 -45342 -55775 -168125 14805 -116230 -180477 -165278 -111428
10220 -111428 -57533 -228530 -122159 -242006 109056 -17731 -97724 -487040 -45146 -166560
10210a66560a2728j33864L8173A00770c58353J01040j05899g1177k03253b8131
10199c9069k9517c0114C2274J13428i4634A86828A883b47477a10607B76837k7376
10188B49461a45786a2058I6180j4038p931f57553g3466F0608a74085A36984d9846
10176F768a86496m92I7456f5353K0889p0460J1525E7562c7936B61593a82372N5730
10164a26642j42351B07225c35536a25330F596b47361O1144p8501F2836a59969
10153a8546o2535j26888j19917A6152J7288K43619d5384D6576c88550A00326e11
10141b10149O3722B93423a27789j56031J29979b5130C0878J54398h2911j36730
10131b19641B78997d5031j67987L3319j47415f0300l00209a09614M4105H1421
$$ plain form
10210 -166560 -12728 -146592 -108419 100770 -358353 -257313 -363212 -71177 -274430 -28131
10199 -39069 -68586 -30114 32274 145702 -94634 186828 1883 -247477 -110607 276837 249461
10188 249461 -145786 -12058 96180 82142 74211 -657553 -73466 60608 -174085 136984 -49846
10176 6768 -186496 -186988 97456 -65353 -44464 -114924 -103399 57562 -37936 261593 -182372 -126642
10164 -126642 -268993 207225 -335536 -125330 6596 -247361 -186217 -264718 62836 -159969
10153 -18546 -81081 -207969 -327886 16152 33440 277059 -45384 46576 -388550 100326 -511
10141 -210149 -146427 293423 -127789 -283820 -153841 -25130 30878 185276 -82911 -219641
10131 -219641 278997 -45031 -213018 -179699 -327114 -60300 -360509 -109614 -65509 81421
10120A11996b6417B42641J4138l4548b86223J08786H0290B0969d0911l96848d9419
10108a71986O6986F6862b8817C6641a38041J8069N7440j33724H5239c72699a62620
10096b76273J28376M0917A04311m7340K04416h2719I0664b49163A15990K1647
10086A37637O3842a31165B48895a7480B6773a93511M2867A60072d73842E2428
10075a44674A52665a51944j79081J30428R2975G1073a13320d484A41372b71213
10064c50024E6478j1455P2309P4445h5667B7520a18936q7752c6899j28027D7042
10052b73537B9703b51626A21310d4925k4374G0166b36481O4772j0929j4070f305
10040b64286d0239B8426K9862a67746Q0083r3341A40350i8538c0353a2348n027
$$ plain form
10120 111996 -26417 242641 256779 222231 -286223 -177437 80290 20969 -40911 -437759 -49419
10108 -171986 -105000 66862 -28817 36641 -138041 -119972 -62532 -196256 85239 -372699 -162620
10096 -276273 -147897 -106980 104311 56971 261387 -82719 90664 -249163 115990 137637
10086 137637 201479 -131165 248895 -17480 26773 -193511 -150644 160072 -473842 52428
10075 -144674 152665 -151944 -331025 -200597 -107622 71073 -113320 -4484 141372 -271213
10064 -350024 56478 45023 117332 191777 -85667 27520 -118936 -206688 -36899 -164926 47042
10052 -273537 29703 -251626 121310 -44925 -69299 70166 -236481 -171709 -182638 -196708 -6305
10040 -264286 -40239 28426 58288 -167746 -87663 -181004 140350 -98538 -30353 -12348 -17375
10029a7375k02660I1664a63729A08214c05071r0412A6818K39462d15266B20973
10018I5458d4301a0905A4891L5751c62865B170R9233a93501N3309O3994r3880
10007a70078E8060c62259A15808B5973J9534c34538a00111r2191j3167A80497
9996f3371D8191Q5712h1870B04180h0240j20348M6824a8430B13189b29089F0014
9984g3334F5891J95267E4834J14452H0591b61213n590h8182R581a750j66972Q0721
9972h8001A21675E628a6836k09262c314B8043a09378F4135a30792N6075D4467
9960A71745g2796k2360F9940p830c43296R5009A18691c20017J13852n6931A40609
9948A04306a45893A17784a01296k3626N5871L4153k67306L3075J33671e7646l35792
$$ plain form
10029 -17375 -220035 91664 -163729 108214 -305071 -395483 16818 256280 -415266 220973
10018 95458 -44301 -10905 14891 50642 -362865 2170 101403 -193501 -140192 -76198 -170078
10007 -170078 58060 -362259 115808 25973 45507 -334538 -100111 -192302 -205469 180497
9996 -63371 48191 133903 -81870 204180 -80240 -200588 -153764 -18430 213189 -229089 60014
9984 -73334 65891 261158 54834 169286 80591 -261213 -266803 -88182 -78601 -1750 -168722 -88001
9972 -88001 121675 5628 -16836 -226098 -3314 28043 -109378 64135 -130792 -74717 44467
9960 171745 -72796 -95156 69940 62110 -343296 -248287 118691 -320017 -206165 -263096 140609
9948 104306 -145893 117784 -101296 -124922 -69051 -34898 -302204 -269129 -135458 -57646 -393438
9937c93438D7626i7657L3870A49141a96090J6969D4843c77682m2265J84407O0426
9926a75114j14530a40924f0184A36065o6317g4171m9472g125F0953a86410n3612
9915b40022j03001a35520Q28G9356J03122b9240A84986b19166P723m2432C84892
9903i0604O07B0165L0802N94b17542A58846h0004l89564G9111O2713c00175q9081
9891c89256N4204a43440l0619Q6694B977i1095L6888r9211E8691J27974a68758
9879e06414C80317c77140D7034N9952e3856j66165A10607m9176a91391B09979
9868b99245a0643j10186A38909a6710A84184a00630L7961p4372j07297f3420C7273
9856i9569k6830K0588l5288A4364e34228i1059l75680b1830j23534B86031C132
$$ plain form
9937 -393438 47626 -97657 -63787 149141 -196090 -179121 44843 -377682 -419947 -235540 -175114
9926 -175114 -289644 -140924 -60184 136065 69748 -74171 -123643 -7125 60953 -186410 -240022
9915 -240022 -343023 -135520 -134692 79356 182478 -29240 184986 -219166 -211443 -253875 384892
9903 -90604 -89997 20165 50967 51561 -217542 158846 -80004 -469568 79111 141824 -300175 -389256
9891 -389256 -335052 -143440 -174059 -87365 2977 -91095 -54207 -153418 58691 186665 -168758
9879 -506414 380317 -377140 47034 106986 -53856 -220021 110607 61431 -191391 209979
9868 -299245 -10643 -120829 138909 -16710 184184 -100630 -62669 -137041 -244338 -63420 37273
9856 -99569 -126399 -105811 -141099 14364 -534228 -91059 -466739 -21830 -145364 286031 3132
9844a280I0114j366C0329a26497j06876d4595I0886b54585A87399P5234H2708
9832d4650A46308b59365L3058f8719j49206J601B77638D1092c01461N2509Q3113
9821a65839A34051E509c081k33911H079J90856F6378b59005A88387b24543c8570
9809i9977j9048G2609A1606a31844e4148k26153A3933d01018g5576j1047l729
9798i0352C58257b56760B1547b45591J07946j4149P0649H547d40457A46622a6006
9786a47922j06751C756J38779b21356E7080c81012a51719G8523A3992i9051E8745
9774h8460c3505r8220a055A61132j6874a59425j56117J37424Q7360l8796H6232
9762B15431c37477P3729H6676a88528P9904F9077b48904A24979c69083E5583b62284
$$ plain form
9844 -1280 90114 88748 30329 -126497 -233373 -44595 90886 -254585 187399 262633 82708
9832 -44650 146308 -259365 -226307 -68719 -217925 -216324 277638 41092 -301461 -248952 -165839
9821 -165839 134051 5509 -3081 -236992 8079 198935 66378 -259005 188387 -224543 -38570
9809 -99977 -119025 72609 11606 -131844 -54148 -280301 13933 -401018 -75576 -86623 -90352
9798 -90352 358257 -256760 21547 -245591 -137645 -151794 -81145 8547 -440457 146622 -16006
9786 -147922 -254673 3756 142535 -221356 57080 -381012 -151719 78523 13992 -99051 58745
9774 -88460 -33505 -131725 -1055 161132 144258 -159425 -315542 -178118 -90758 -129554 86232
9762 215431 -337477 -263748 86676 -188528 -108624 69077 -248904 124979 -369083 55583 -262284
9750A97032E3612A9283a96399o1350G2453g0732A4278a19237H6659b53821i7280
9738b91698H3126e8307D0890b24383P1241N3203j17279a04949j92577K6339b0263
9726h0702k4772A1662b53878i0420p7081P4920k42495A21233i418L864A14518
9714D8946b90977E1216a07891r0565B19661b18236G6741a61131g0277A8449f0291
9702a38224B1480O1388a75623M0407K6196D7668L5856g6761I8870i6681j5267
9691a11948k644k7950B10179l2821a86866P4695D2195a79458C6230a3369k59805
9680b73174P9286D05c38944F21J6232i3527c9418j64262A17312a803k1854o1095
9668h4752p911a0173A4078b9832j14661c1451j56245C0339a61102e1378B32806
$$ plain form
9750 197032 53612 19283 -196399 -257749 72453 -70732 14278 -119237 86659 -253821 -97280
9738 -291698 83126 -58307 40890 -224383 -153142 -99939 -217218 -104949 -297526 -271187 -20263
9726 -80702 -105474 11662 -253878 -90420 -167501 -92581 -335076 121233 -9418 -5554 114518
9714 48946 -290977 51216 -107891 -198456 219661 -218236 76741 -161131 -70277 18449 -60291
9702 -138224 21480 82868 -175623 -135216 -109020 47668 83524 -76761 98870 -96681 -111948
9691 -111948 -114592 -142542 210179 177358 -186866 -112171 42195 -179458 36230 -13369 -273174
9680 -273174 -193888 405 -338944 621 16853 -93527 -39418 -203680 117312 -1803 -23657 -84752
9668 -84752 -92663 -10173 14078 -29832 -144493 -31451 -187696 30339 -161102 -51378 232806
9656f0553A51788J68099a04825l8188A05776A5583e2796p5985j01930h2699A11976
9644E8584a13042q8344N761M7625A61548a08297I4375e56215N3496a26549n2581
9633a79130o7740i7251j06956N4995k61511J98267n4754C1728J38974B1235a51895
9621A95588J92066F916a87068g0876r2040j6572j74109a15701A1847J56829J68679
9610C37355a89123L4793A67494J70206A53410A6842P0185c4109p8801a0378q5828
9599i6206r309d0928m19572J95098n2129a3225m18065d7252r0568G3641b38130
9587b45857A44266d0142j92583n304e9333E1141B5327a04681k62611a9124A6563
9575c07857R1573J00027D3833e1121q5830j99589g5917K4002j15707g1195A47066
$$ plain form
9656 -60553 151788 319887 -104825 -143013 105776 15583 -52796 -128781 -230711 -82699 111976
9644 58584 -113042 -201386 -195625 -148000 161548 -108297 94375 -556215 -502719 -126549 -179130
9633 -179130 -246870 -97251 -204207 -149212 -410723 -212456 -267210 31728 170702 21235 -151895
9621 195588 387654 6916 -187068 -70876 -162916 -179488 -353597 -115701 11847 168676 337355
9610 337355 -189123 -154330 167494 337700 153410 16842 87027 -34109 -112910 -10378 -96206
9599 -96206 -105515 -40928 -460500 -265402 -317531 -13225 -431290 -47252 -137820 73641 -238130
9587 -245857 144266 -40142 -232725 -238029 -59333 51141 25327 -104681 -367292 -19124 16563
9575 -307857 -216284 -116257 43833 -51121 -136951 -336540 -75917 -51915 -167622 -71195 147066
9563b1433p934k07617N1477n8975a15164A67831a88945e216B94621b51341f388
9551c04356c0251c46A1435b08500C9026J8051K69415A02162A3788N254a82978
9539a55585j50678P785B0715K28246h5830a3831B03713C5794K34561m975K3306
9528B88686c22481B7862P963g6614A08317d1391B4761g1001m0027B41269h0989
9516e4797q5547O1378k1375A030b21307A93141c93307a94255g3561k6787M5902
9505e4446A48774A0493b15452E4250B4415a40967F3122e9055a5087A89648a7917
9493a72644Q1184B853a53815r0642j07382J36417l9806a02422A134c26362B51648
9481C1611J8234c70866f5700j10477m0102P13b7689E7395a47463n2612Q285A2322
$$ plain form
9563 -21433 -29367 -236984 -185507 -244482 -115164 167831 -188945 -5216 294621 -251341 -6388
9551 -304356 -30251 -346 11435 -208500 39026 57077 326492 102162 13788 19042 -182978
9539 -155585 -306263 -298478 20715 248961 -85830 -13831 203713 35794 270355 265380 288686
9528 288686 -322481 27862 35825 -76614 108317 -41391 24761 -71001 -111028 241269 -80989
9516 -54797 -140344 -78966 -100341 1030 -221307 193141 -393307 -194255 -73561 -100348 -54446
9505 -54446 148774 10493 -215452 54250 24415 -140967 63122 -59055 -15087 189648 -17917
9493 -172644 -91460 2853 -153815 -244457 -351839 -215422 -255228 -102422 1134 -326362 251648
9481 31611 49845 -370866 -65700 -176177 -216279 -215566 -27689 57395 -147463 -200075 -191790 12322
9468b23786a3210p6869A7755a75493P025i658j16958c4216k62462C61400b3157
9456A1404a76093B47126b21331f905j2507B84880H000a68671B43607J51344a14621
9444G7495Q179a67620B35963b38331g6029k3082j52849J7051Q8480r3931j53844
9433c94204b7418D29g7687L7020F4273c5903A84984a66776o2122C01742a89874
9421a26614B80916a6285j03698k03123B02898o0193b5291A24187a14283l6956
9411a51239A4666i8858j00073E29750h8668J6026L4230j759l950j035C22573a73319
9398A88075b33150g3013j14438j51535f9300e13p6845j8295A44465a16818j19151
9387b35969H0224b68080f1883I8599f4809B72110b49982j66988g3963l55846l9672
$$ plain form
9468 -223786 -13210 -90079 17755 -175493 -168468 -9658 -126616 -34216 -296678 361400 -23157
9456 11404 -176093 247126 -221331 -6905 -19412 284880 8000 -168671 243607 394951 -114621
9444 77495 85674 -167620 235963 -238331 -76029 -99111 -251960 -234909 -146429 -240360 -394204
9433 -394204 -27418 429 -77687 -40667 64273 -35903 184984 -166776 -228898 301742 -189874
9421 -126614 280916 -16285 -119983 -323106 202898 142705 -25291 124187 -114283 -151239
9411 -151239 14666 -98858 -198931 529750 -88668 -72642 -38412 -40171 -44121 -45156 322573 -173319
9398 188075 -233150 -73013 -187451 -338986 -69300 -513 -77358 -95653 144465 -116818 -235969
9387 -235969 80224 -268080 -61883 98599 -64809 272110 -249982 -416970 -73963 -429809 -469481
9376d69481a0164A14106h8289M441B02491B8865R915a18731l30008a92854F0134
9364e858A42152i0543r4046j35860a31506A13166B7533b78584A2771d2249j46932
9353a89181A11315i5480j64608A9016a10204l7944A00061h0038j67106j83103
9343d30247B2299K31223a6705B06417J41861E2190a72854A00908a91107F3777
9332b01459A01305a25361C343h7429d0747j06635c08k16461P9334q1515g3845
9320b38506J03508n5882N7935A95009c59261B26886E555a0596E1363J95766b36556
9308a6552A02617k5273J13479l8729b62476a23014j25823C49677F20i602A74773
9296a15803A31929a11603B28809j02008A2748a14211e67j43371l0658P4543k7938
$$ plain form
9376 -469481 -10164 114106 -88289 -83848 202491 28865 38780 -118731 -448739 -192854 60134
9364 -5858 142152 -90543 -184589 -320449 -131506 113166 27533 -278584 12771 -42249 -189181
9353 -189181 111315 -95480 -260088 19016 -110204 -148148 100061 -80038 -247144 -430247
9343 -430247 22299 253522 -16705 206417 348278 52190 -172854 100908 -191107 63777
9332 -201459 101305 -125361 3343 -87429 -40747 -147382 -308 -216769 -137435 -218950 -73845
9320 -238506 -134998 -190880 -132945 195009 -359261 226886 5555 -10596 51363 247129 -236556
9308 -16552 102617 77344 190823 152094 -262476 -123014 -248837 349677 620 -9602 174773
9296 -115803 131929 -111603 228809 126801 12748 -114211 -567 -143938 -174596 -100053 -127991
9285a27991J0626C8365a75456B60378I7910e4423l1389K3050A5053n809Q8350
9274I7594a98369A7258P1607c38785A58236K07815a35109A52075C0475b06653
9263A6136a42588P830A25451a36070b9807D0277i2785j26435i4820A41880R621
9252A51501a18576q694l75551K11713a15544a898j89066L6523A54839a79278G6637
9240E9380J27252J4852A6669a92166p7769h7959j82783J26372k02562a56882E969
9228B78820i6138L4434P76B8916a47159A9401b473C345g3324D1548o550c72684
9215B37772a15487B29633b10272N3923h039k9856G00c75953A24753l1569a6628
9203a52654B5912a5838p4744K885j43863b2106D38075g5862A01518b65512D2282
$$ plain form
9285 -127991 -117365 38365 -175456 260378 97910 -54423 -85812 -62762 15053 9244 97594
9274 97594 -198369 17258 88865 -338785 158236 366051 -135109 152075 30475 -206653
9263 16136 -142588 -134758 125451 -136070 -29807 40277 -92785 -219220 -94820 141880 151501
9252 151501 -118576 -127270 -502821 -291108 -115544 -1898 -190964 -154441 154839 -179278 76637
9240 59380 186632 201484 16669 -192166 -269935 -87959 -270742 -144370 -346932 -156882 5969
9228 278820 -96138 -61704 -60928 28916 -147159 19401 -2473 3345 -73324 41548 34998 -372684
9215 237772 -115487 229633 -210272 -156349 -8039 -37895 700 -375953 124753 93184 -16628
9203 -152654 25912 -15838 -90582 -87697 -231560 -22106 438075 -75862 101518 -265512 42282
9191D6182c51075I4101h3926J3241m5957L1894l6744A40398I888e6289j21130
9180a77419A43316b07549c9236j9724F1104i5844n3025F360a17125A64975a28461
9168A4747K21133e1074J1629j5252A27043b14826k7659B55119a06208k0286D6223
9156a14746G9810c9739E4307a43208a5917j96189n6055H8345K43422b93686J15891
9145a77795C3499C566K58984G3570b90170e6543E926b23475A27016e4348j28600
9134a82948e1446l4868A28700f4049B42636D4824d10169b03329J8340A43143c98401
9122c5147k390j58401J4131A67557a03824B28078a30936j78309H8707j4751c03139
9110e9903p6941j59233a40731C00539f1039j67626R7741A04445a30346c1821A56017
$$ plain form
9191 46182 -351075 94101 -83926 -70685 -116642 -84748 -121492 140398 9888 -56289 -177419
9180 -177419 143316 -207549 -39236 -58960 61104 -95844 -148869 6360 -117125 164975 -128461
9168 14747 235880 -51074 -39445 -54697 127043 -214826 -242485 255119 -106208 -126494 46223
9156 -114746 79810 -39739 54307 -143208 -15917 -212106 -268161 88345 331767 -293686 -177795
9145 -177795 33499 3566 262550 73570 -290170 -56543 5926 -223475 127016 -54348 -182948
9134 -182948 -51446 -86314 128700 -64049 242636 44824 -410169 -203329 -184989 143143 -398401
9122 -35147 -37537 -195938 -181807 167557 -103824 228078 -130936 -309245 88707 73956 -303139
9110 -59903 -136844 -296077 -140731 300539 -61039 -228665 -130924 104445 -130346 -31821 156017
9098B3968J05999B9066a70914o5094b32A11455d5113l15652n5257A91053J6460
9087B07513b1025l14397A09893A8206K05771h1716A03440J752f4682a1540j78883
9076a90423g3019j45306A2398a51920A79357c90405a72374H7149D0910J16889
9066A57799a03163a4824A26865l6947a80826L0111E013J06953h502C99510b48587
9054B08548f6388q2202O6265j34425A05399b13186E1584b66993d7055J4130a6196
9042a8062j77790I4454L8535a52113b5177B7833a70192g4517J261B54043a48500
9030b80002D3473L6421a33079c1540o5670k347j45127E6701h124j97059A00119
9018A82445b96195B52699b21458b94C8265c37224A87576b48485I0052c65707a38718
$$ plain form
9098 23968 129967 29066 -170914 -236008 -232 111455 -45113 -360765 -416022 191053 207513
9087 207513 -21025 -335422 109893 18206 223977 -81716 103440 105192 -64682 -11540 -190423
9076 -190423 -73019 -218325 12398 -151920 179357 -390405 -172374 87149 40910 157799
9066 157799 -103163 -14824 126865 89918 -180826 -150715 5013 111966 -8502 399510 -248587
9054 208548 -66388 -148590 -82325 -216750 105399 -213186 51584 -266993 -47055 -32925 -16196
9042 -18062 -195852 94454 132989 -152113 -25177 27833 -170192 -74517 -73256 254043 -148500
9030 -280002 43473 79894 -133079 -31540 -97210 -99557 -244684 56701 -8124 -205183 100119
9018 182445 -296195 252699 -221458 -294 38265 -337224 187576 -248485 90052 -365707 -138718
9006E9496b97810b3852k25345A57K61426b97959A05584a86008b521j99203C27805
8994B1277a38384j28997j64910a29764j90532M4958h4453C627Q4390i2601n9021
8983a51622d1409q9826E5051O5988a2082l25782a54349c7530j70614N9916Q519
8972a39709K0769A30912A1875a47389c2321k2725l56483A47315L0664l2955b54772
8960h3889B58633a20816D24906a07679m2244B9961a39820I397Q7318c0865C94754
8948A01804a07128H7189b6002k09508m4877A53633p2325h1108L702k02548b1339
8936B41050I0806j7114P57068B083c35118I0474J56580e1383A96859m8076L75913
8925E24696J6221L93124J466685N169703J6883347A0564853C160086E89693j23072
$$ plain form
9006 59496 -297810 -23852 -249197 157 261583 -297959 105584 -186008 -2521 -201724 327805
8994 21277 -138384 -267381 -432291 -129764 -320296 -275338 -84453 3627 88017 -92601 -151622
8983 -151622 -41409 -131235 55051 121039 -12082 -337864 -154349 -37530 -208144 -148228 -139709
8972 -139709 -118940 130912 11875 -147389 -32321 -55046 -411529 147315 177979 145024 -254772
8960 -83889 258633 -120816 424906 -107679 -149923 29961 -139820 9397 96715 -30865 394754
8948 101804 -107128 87189 -26002 -235510 -280387 153633 81308 -81108 -77406 -279954 -21339
8936 241050 90806 73692 830760 2083 -335118 90474 247054 -51383 196859 148783 524696
8925 524696 540917 934041 2400726 7570429 24453776 10564853 3160086 589693 466621
8916D66621B24503l7327q4381A6878a01758k2745C34415r642J08239o5051c11780
8904c29243J50738A83015o3771b74975j26531J92687r6957C9832A509g6761m8011
8893a24772j99922M6440i4964A3500b41645D6866i7046L2843E3236J56279d637
8881i3264c3184B10374c5836H6178K06164A8832F121i286C8563K786a65564p7058
8869b42622A32220a6803A88074a75461c9069B97006b20756K1781l8540C2244Q4594
$$ plain form
8916 466621 224503 187176 102795 16878 -101758 -124503 334415 324773 433012 367961 -311780
8904 -329243 -178505 183015 119244 -274975 -401506 -208819 -305776 39832 1509 -76761 -124772
8893 -124772 -324694 -278254 -94964 13500 -241645 46866 -97046 -64203 53236 209515 -4637
8881 -93264 -33184 210374 -35836 86178 292342 18832 6121 -9286 38563 41349 -165564 -242622
8869 -242622 132220 -16803 188074 -175461 -39069 297006 -220756 -198975 -237515 32244 116838
$$ [...]
##END NTUPLES=NMR SPECTRUM
##END=
