
##TITLE=UV1237_M8_1260-1248_20_7241032_W9OkGKhHRg
##JCAMPDX= 6.0         $$ Bruker NMR JCAMP-DX V2.0
##DATA TYPE= NMR SPECTRUM
##DATA CLASS= NTUPLES
##ORIGIN= BRUKER
##OWNER= Administrator
$$ 1.72 TOPSPIN		Version 2.1
$$ 2013-01-19 01:13:04.691 -0500  Administrator@X
$$ Compression mode = diff/dup
##.OBSERVE FREQUENCY= 400.02188249412
##.OBSERVE NUCLEUS= ^1H
##.ACQUISITION MODE= SIMULTANEOUS (DQD)
##.ACQUISITION SCHEME= undefined
##.AVERAGES= 8
##.DIGITISER RES= 22
##SPECTROMETER/DATA SYSTEM= spect
##.PULSE SEQUENCE= zg30
##.SOLVENT NAME= COFFEE_meoh
##.SHIFT REFERENCE= INTERNAL, COFFEE_meoh, 1, 14.98509
##AUDIT TRAIL= $$ (NUMBER, WHEN, WHO, WHERE, PROCESS, VERSION, WHAT)
$$ ##TITLE= Audit trail, TOPSPIN		Version 2.1
$$ ##JCAMPDX= 5.01
$$ ##ORIGIN= Bruker BioSpin GmbH
$$ ##OWNER= Administrator
$$ $$ E:\/data/COFFEE/nmr/UV1237_M8_1260-1248_20_7241032_W9OkGKhHRg/20/pdata/1/auditp.txt
$$ ##AUDIT TRAIL=  $$ (NUMBER, WHEN, WHO, WHERE, PROCESS, VERSION, WHAT)
(   1,<2013-01-19 01:12:56.738 -0500>,<Administrator>,<X>,<go>,<TOPSPIN 2.1>,
      <created by zg
	started at 2013-01-19 01:11:50.660 -0500,
	POWCHK enabled, PULCHK disabled,
       configuration hash MD5:
       86 BA 57 50 F2 9D 5C 9B 26 00 A9 28 5F 66 2E 89
       data hash MD5: 64K
       C3 B3 B7 D6 BA B2 6A 28 CB FB 80 9A DF 5A 62 E6>)
(   2,<2013-01-19 01:12:59.738 -0500>,<Administrator>,<X>,<proc1d>,<TOPSPIN 2.1>,
      <Start of raw data processing
       efp LB = 0 FT_mod = 6 PKNL = 1 PHC0 = 0 PHC1 = 0 SI = 32K 
       data hash MD5: 32K
       DE A3 7A F0 2A 33 B0 35 53 8D 76 AB 9D 9C FB F7>)
(   3,<2013-01-19 01:13:00.207 -0500>,<Administrator>,<X>,<proc1d>,<TOPSPIN 2.1>,
      <pk PHC0 = 93.98804 PHC1 = 0 
       data hash MD5: 32K
       FC 2A E9 5C 86 FD E4 41 0F D6 1A 20 57 78 91 DF>)
(   4,<2013-01-19 01:13:00.426 -0500>,<Administrator>,<X>,<proc1d>,<TOPSPIN 2.1>,
      <abs ABSG = 1 
       data hash MD5: 32K
       03 0D BA 55 6D 53 F9 E8 A7 97 3D F0 F8 C7 60 3C>)
(   5,<2013-01-19 01:13:00.582 -0500>,<Administrator>,<X>,<proc1d>,<TOPSPIN 2.1>,
      <abs ABSG = 2 
       data hash MD5: 32K
       6C AF 07 49 CE 08 09 35 AA 80 62 A5 86 EB 05 1A>)
(   6,<2013-01-19 01:13:00.738 -0500>,<Administrator>,<X>,<proc1d>,<TOPSPIN 2.1>,
      <abs ABSG = 3 
       data hash MD5: 32K
       71 32 51 81 68 B3 36 B6 67 00 AF 21 9C 99 E6 EB>)
(   7,<2013-01-19 01:13:00.879 -0500>,<Administrator>,<X>,<proc1d>,<TOPSPIN 2.1>,
      <abs ABSG = 4 
       data hash MD5: 32K
       1E 31 4D EB 52 46 7A 1A A0 E3 3C CF 5D F5 76 17>)
(   8,<2013-01-19 01:13:01.035 -0500>,<Administrator>,<X>,<proc1d>,<TOPSPIN 2.1>,
      <abs ABSG = 5 
       data hash MD5: 32K
       8C AA EF 7D 09 8A 45 84 89 A2 2C 4A 02 8C A5 26>)
$$ ##END=
$$ 
$$ $$ hash MD5
$$ $$ 06 D1 6F 3C 61 6B FF E7 E0 C5 39 BC 0A 7D 44 0A
##$RELAX= 
##$RELAX= 
##$RELAX= 
##$RELAX= 
##$RELAX= 
##$RELAX= 
##$RELAX= 
$$ Bruker specific parameters
$$ --------------------------
##$DU= <E:\>
##$EXPNO= 20
$$ [...]
##$TP= (0..7)
150 150 150 150 150 150 150 150
##$TP07= 0
##$TPNAME0= <>
##$TPNAME1= <>
##$TPNAME2= <>
##$TPNAME3= <>
##$TPNAME4= <>
##$TPNAME5= <>
##$TPNAME6= <>
##$TPNAME7= <>
##$TPOAL= (0..7)
0.5 0.5 0.5 0.5 0.5 0.5 0.5 0.5
##$TPOFFS= (0..7)
0 0 0 0 0 0 0 0
##$TUNHIN= 0
##$TUNHOUT= 0
##$TUNXOUT= 0
##$USERA1= <user>
##$USERA2= <user>
##$USERA3= <user>
##$USERA4= <user>
##$USERA5= <user>
##$V9= 5
##$VALIST= <valist>
##$VCLIST= <CCCCCCCCCCCCCCC>
##$VD= 0
##$VDLIST= <DDDDDDDDDDDDDDD>
##$VPLIST= <PPPPPPPPPPPPPPP>
##$VTLIST= <TTTTTTTTTTTTTTT>
##$WBST= 1024
##$WBSW= 4
##$XGAIN= (0..3)
0 0 0 0
##$XL= 0
##$YL= 0
##$YMAX_a= 651065
##$YMIN_a= -551744
##$ZGOPTNS= <>
##$ZL1= 120
##$ZL2= 120
##$ZL3= 120
##$ZL4= 120
##$ABSF1= 14.98509
##$ABSF2= -5.573092
##$ABSG= 5
##$ABSL= 3
##$ALPHA= 0
##$AQORDER= 0
##$ASSFAC= 0
##$ASSFACI= 0
##$ASSFACX= 0
##$ASSWID= 0
##$AUNMP= <proc_prof1d_extract_pilot.lims>
##$AXLEFT= 0
##$AXNAME= <>
##$AXNUC= <1H>
##$AXRIGHT= 0
##$AXTYPE= 0
##$AXUNIT= <>
##$AZFE= 0.1
##$AZFW= 0.1
##$BCFW= 0
##$BC_mod= 0
##$BYTORDP= 0
##$COROFFS= 0
##$CY= 15
##$DATMOD= 1
##$DC= 0
##$DFILT= <>
##$DTYPP= 0
##$F1P= 0
##$F2P= 0
##$FCOR= 0.5
##$FTSIZE= 32768
##$FT_mod= 6
##$GAMMA= 0
##$GB= 0
##$INTBC= 1
##$INTSCL= 1
##$ISEN= 128
##$LB= 0
##$LEV0= 0
##$LPBIN= 0
##$MAXI= 10000
##$MC2= 0
##$MEAN= 0
##$ME_mod= 0
##$MI= 0
##$NCOEF= 0
##$NC_proc= -8
##$NLEV= 6
##$NOISF1= 0
##$NOISF2= 0
##$NSP= 0
##$NTH_PI= 0
##$NZP= 0
##$OFFSET= 14.98509
##$PC= 1
##$PHC0= 93.98804
##$PHC1= 0
##$PH_mod= 1
##$PKNL= yes
##$PPARMOD= 0
##$PPDIAG= 0
##$PPIPTYP= 0
##$PPMPNUM= 2147483647
##$PPRESOL= 1
##$PSCAL= 4
##$PSIGN= 0
##$PYNMP= <proc.py>
##$REVERSE= no
##$SF= 400.02
##$SI= 32768
##$SIGF1= 0
##$SIGF2= 0
##$SINO= 400
##$SIOLD= 32768
##$SPECTYP= <>
##$SREGLST= <1H.CDCl3>
##$SSB= 0
##$STSI= 32768
##$STSR= 0
##$SW_p= 8223.68421052631
##$SYMM= 0
##$S_DEV= 0
##$TDeff= 65536
##$TDoff= 0
##$TI= <>
##$TILT= no
##$TM1= 0
##$TM2= 0
##$TOPLEV= 0
##$USERP1= <user>
##$USERP2= <user>
##$USERP3= <user>
##$USERP4= <user>
##$USERP5= <user>
##$WDW= 1
##$XDIM= 32768
##$YMAX_p= 466151465
##$YMIN_p= -792199
##$CURPLOT= <Network HP LaserJet P1505>
##$CURPRIN= <$Network HP LaserJet P1505>
##$DFORMAT= <normdp>
##$LAYOUT= <+/1D_H.xwp>
##$LFORMAT= <normlp>
##$PFORMAT= <normpl>
##$SURQMSG= 1
$$ End of Bruker specific parameters
$$ ---------------------------------
##NTUPLES= NMR SPECTRUM
##VAR_NAME=  FREQUENCY,     SPECTRUM/REAL,   SPECTRUM/IMAG
##SYMBOL=    X,             R,               I
##VAR_TYPE=  INDEPENDENT,   DEPENDENT,       DEPENDENT
##VAR_FORM=  AFFN,          ASDF,            ASDF
##VAR_DIM=   32768,         32768,           32768
##UNITS=     HZ,            ARBITRARY UNITS, ARBITRARY UNITS
##FACTOR=    0.250966925370066, 1,           1
##FIRST=     8223.43324360094, -125626,      -232763
##LAST=      0,             -73228,          74759
##MIN=       0,             -792199,         0
##MAX=       8223.43324360094, 466151465,    0
$$ Real data points
##PAGE= N=1
##DATA TABLE= (X++(R..R)), XYDATA
$$ [...]
$$ plain form
19551 89109 -188260 -25206 130333 44358 -71969 -173327 -118042 -56263 195805 51371 -86163
19539 -139528 -122741 -199068 -76654 -272203 120400 4164 -151403 345655 -187819 -240239 -243422
19528 -243422 -66565 -55787 -89203 -379273 242614 55206 15719 -36523 -233666 -219708 -505893
19517 -505893 -148196 32643 101029 -103260 -235279 216971 43399 -255633 -106903 -9883
19506 33298 440292 -288851 -142805 -227238 -201826 -88616 -67459 102819 -210530 -205422 56463
19494 154291 209280 -146064 -163141 109081 -268174 217765 25064 -123664 -283770 -4849
19483 -39051 6351 -203549 -110915 -240564 -89431 152041 -161635 969 99616 -242614 -98540
19471 -173053 -350727 -206898 -317310 77641 -46585 67043 -96803 -12025 -63933 95545 -291344
$$ packed form
19551H9109a88260b5206A30333D4358g1969j01358N5285e6263A95805E1371h6163
19539a39528J6787p6327g6654j95549A20400D164a51403C45655a87819n2420l183
19528b43422f6565J0778l3416k90070B42614E5206A5719c6523j97143J3958k86185
19517e05893a48196C2643O8386a03260j32019B16971D3399b55633a06903i883
19506C3298M06994b88851a42805q4433K5412h8616K1157A02819b10530N108E6463
19494A54291N4989a46064j7077A09081b68174B17765B5064a23664j60106d849
19483c9051F351b03549R2634j29649h9431A52041a61635I69R8647b42614i8540
19471a73053j77674J43829j10412G7641d6585F7043i6803a2025n1908I5545b91344
$$ plain form
19459 397298 130162 -116062 -189922 -329603 101552 171384 -158397 -219559 67345 27212
19448 -31993 77783 -168534 -292692 -315640 -160676 -128757 -279005 5568 -212401 -198431 -262623
19437 -262623 104301 207176 -13658 -162588 -71517 -17336 -173593 -30007 -32231 664 -468808
19425 73379 147667 67881 63019 -79119 13440 -176901 -78995 -8145 58644 -35393 -311381 -342629
19413 -342629 -58984 183651 -346135 -98941 -229011 -286605 -7346 -373108 -239859 -127808
19403 -127808 168117 49457 -203370 256115 -20340 -176917 -280183 577 33161 145917 -75223
19391 322427 -37101 -201178 -22026 -35311 -223057 158745 -53443 -115040 10999 -106068 -96200
19380 -96200 -74738 -67501 283106 -180104 216938 -139928 -162911 82166 -74056 -63339 -249655
$$ packed form
19459C97298A30162a16062p3860j39681A01552O9832a58397o1162F7345B7212
19448c1993G7783a68534j24158k2948J54964L1919j50248E568b12401J3970o4192
19437b62623A04301J02875a3658j48930g1517a7336j56257c0007k224F64d68808
19425G3379P4288F7881m862g9119A3440a76901g8995h145E8644c5393k75988l1248
19413c42629e8984A83651c46135i8941j30070n7594g346l65762J33249J12051
19403a27808A68117D9457b03370B56115b0340j56577j03266E77L2584J12756g5223
19391C22427c7101j64077b2026j3285j87746A58745e3443o1597A0999a06068R868
19380i6200K1462P237B83106a80104B16938a39928k2983H2166g4056J0717j86316
$$ plain form
19369 -249655 -184168 313848 -103533 -212511 -408606 -245540 -213911 574 -174147 -883 139942
19357 -300513 -237273 -251101 191860 112789 -407599 -211830 -103400 -87504 85605 -295075
19346 -63034 274541 27039 -375584 -10147 -230324 -17764 -65416 179099 214640 -107578 54125
19334 122578 167119 -306458 -70856 -13464 -114909 -86375 7032 -75135 -206121 -141359 -248974
19323 -248974 -26682 -295539 -54039 141149 153637 86118 190663 -227631 263929 9385 84768
19312 84768 21346 -44976 -4668 -52805 -601068 177772 -131232 -266641 -67877 179872 -147509
19300 123888 117848 43197 -23333 -135853 -111424 -190578 8463 -16768 39801 -378142 -311349
19289 -311349 -283984 27299 -134711 109310 140211 -220733 -25543 -586366 34989 -361060
$$ packed form
19369b49655O5487C13848a03533j08978j96095J63066L1629E74a74147h83A39942
19357c00513O3240j3828A91860p9071d07599J95769a03400J5896H5605b95075
19346f3034B74541B7039c75584a0147k20177a7764m7652A79099L5541a07578E4125
19334A22578M4541c06458g0856a3464j01445K8534G032g5135j30986O4762j07615
19323b48974b6682k68857e4039A41149J2488o7519J04545b27631B63929I385P5383
19312H4768B1346d4976d668m8137n48263A77772a31232j35409f7877A79872a47509
19300A23888o040D3197b3333j12520K4429p9154H463a6768C9801c78142O6793
19289c11349K7365B7299a34711A09310L0901b20733b5543n60823C4989c61060
$$ plain form
19278 -43361 -142180 -306555 -40649 -85219 105111 -61333 86784 -212848 -135188 -165558 -247793
19267 -247793 -300716 73384 -425368 -129506 -222563 175086 63762 393096 57930 -86269 -289450
19256 -289450 -71745 -33784 -271981 -214204 -117942 -136490 31658 -275640 -44404 236052 -196208
19244 57990 -74613 -172780 -72300 -298926 -166470 -28640 -223776 124237 -77057 -66213 -64464
19233 -64464 -229365 -123696 -7049 -347801 -123873 -32080 227186 -51903 -70694 -132687 20441
19221 -215424 225916 93348 35631 -126359 232201 -49817 -130153 -114206 -13988 -234322 -137648
19210 -137648 -55260 45256 173893 16816 -389584 -118497 -325442 155888 -236763 -77094
19199 -121928 -115629 99956 -199391 -242619 -120715 110324 199154 242328 -219636 247688 -150406
$$ packed form
19278d3361r8819j64375d0649m4570A05111f1333H6784b12848P7660l0370q2235
19267b47793n2923G3384d25368a29506r3057A75086F3762L29334E7930h6269k03181
19256b89450g1745c3784k38197N7777R6262j8548C1658b75640d4404B36052a96208
19244E7990g4613r8167g2300k26626J32456b8640j95136A24237g7057J0844J749
19233f4464j64901J05669g049l40752a23873c2080B27186e1903j8791o1993B0441
19221b15424B25916I3348C5631a26359B32201d9817q0336J5947a3988k20334R6674
19210a37648e5260D5256J28637A6816c89584a18497k06945A55888b36763g7094
19199a21928O299I9956a99391m3228a20715A10324Q8830M3174b19636B47688a50406
$$ plain form
19187 -59190 -131967 94759 100122 182136 -32112 59615 32505 -43132 -166677 135625 -44679
19175 -104004 109646 -188261 -104258 -15398 -147712 -302802 -275888 265503 105284 -264648
19164 43009 -91069 1053 -9078 -117019 103586 57141 -104028 110674 59182 -65151 116512
19152 -212350 -22866 -35720 -63810 -2231 46839 -265452 138483 -278616 -153608 11321 239820
19141 239820 -256715 -148882 152529 60757 -35797 68382 -203054 281915 32168 -175486
19130 75401 19116 285488 -238692 -222248 -127951 -201273 -341955 -201792 -251208 -116743 -370787
19119 -370787 25640 -44865 -340447 54648 91702 -38595 109310 -42938 -409804 -92046 -144277
19108 -144277 -144350 227006 -284678 -499406 199273 -208070 334052 -113495 54658 127254 -344987
$$ packed form
19187e9190p2777I4759N363Q2014c2112E9615k7110d3132j23545A35625d4679
19175a04004A09646a88261Q4003a5398j32314j55090K6914B65503A05284b64648
19164D3009i1069A053i078j07941A03586m6445a04028A10674n1492f5151A16512
19152b12350b2866j2854k8090b231D6839b65452A38483b78616J25008A1321K28499
19141B39820b56715J07833A52529F0757c5797F8382b03054B81915C2168a75486
19130G5401A9116K66372b38692J6444R4297p3322j40682J40163m9416a16743k54044
19119c70787B5640d4865k95582E4648L7054c8595A09310d2938l66866i2046n2231
19108a44277p3B27006b84678k14728A99273b08070C34052a13495E4658P2596c44987
$$ plain form
19096 -48046 -251866 -174801 -242058 145155 -110836 -113284 -48110 201 -170737 6131 -167309
19084 -91218 -158642 8273 290988 -28740 -44432 -435318 -76530 5181 -184349 4794 -33499 85308
19071 -1346 15202 -123987 292054 -305608 4925 233377 5795 -2154 -293277 27022 -228700
19059 -213986 144913 -360194 -285922 320420 13315 76333 178715 -191445 96151 39530
19048 108637 -373113 160780 -238134 26878 -116826 -273726 96116 -312731 133860 -138571
19037 -65255 -107432 255222 -206981 -430763 152836 379624 41198 -14705 -127884 121169
19026 -34967 147977 -88170 80197 -102774 304972 -80259 -145450 120038 -87104 -38988 -378952
19015 -378952 -75841 -176187 -402928 -197048 76358 205841 326771 -122640 -159115 51164
$$ packed form
19096d8046k03820P7065o7257A45155a10836k448d8110B01a70737F131a67309
19084i1218o7424H273K82715b8740j5692l90886g6530E181a84349D794c3499H5308
19071a346A5202a23987B92054c05608D925K28452E795b154k91123B7022b28700
19059b13986A44913c60194P4272C20420A3315O3018J02382a91445I6151C9530
19048A08637c73113A60780b38134B6878a16826j56900I6116c12731A33860a38571
19037f5255m2177B55222b06981k23782A52836K26788D1198a4705j13179A21169
19026c4967A47977h8170H0197a02774C04972h0259o5191A20038h7104c8988l39964
19015c78952g5841j00346k26741a97048G6358J29483J20930a22640l6475E1164
$$ plain form
19004 68640 -315472 -230036 21535 245705 -71254 -147088 -54442 41484 54741 -183670 45081
18992 -152849 -214955 -74788 -132334 -9743 -219319 -278369 175559 -76165 56320 -67434 55775
18980 -199593 -63225 32813 -14577 187 103991 -60355 -293322 184876 -345151 -389057 -126050
18968 188642 78585 -49043 -390489 -144072 -98199 -373033 278193 152273 -118807 -292392
18958 -292392 209031 12791 -21718 -65105 -51957 -22423 41890 -510659 41465 352717 4111
18946 -210557 83363 -197362 84894 -18100 -77782 -16864 136150 -266393 212647 24252 -144625
18934 -256038 17825 -26798 -26911 39745 -197880 176493 193501 -375735 -220309 -273553 101598
18922 72854 115492 77367 -386254 351420 -447074 -274664 64909 50700 -139889 -38697 -168016
$$ packed form
19004F8640c15472Q5436B1535K24170g1254p5834e4442D1484J3257a83670D5081
18992a52849o2106g4788n7546i743k09576n9050A75559g6165E6320f7434E5775
18980a99593f3225C2813a4577A87J03804f0355k32967A84876c45151m3906a26050
18968A88642G8585d9043l41446a44072M5873k74834B78193j25920a18807j73585
18958b92392B09031A2791b1718m3387J3148b2423D1890e10659D1465L11252D111
18946b10557H3363a97362H4894a8100n9682a6864A36150b66393B12647B4252a44625
18934b56038A7825b6798j13C9745a97880A76493J7008c75735J55426n3244A01598
18922G2854M2638l8125c86254C51420d47074J72410F4909j4209a39889c8697j29319
$$ plain form
18911 -168016 -115807 65454 59611 -337823 67993 1693 99051 256166 84756 -338532 -92325
18899 -104896 152567 2248 -202527 72231 261901 -283388 38001 -296107 238942 -103344
18888 243679 -44131 -48735 198701 -244496 -138060 -10084 240065 -67423 17988 -122102 -351316
18877 -351316 -411262 23369 -195531 96488 -98760 -195921 -59566 -255122 286071 76487 -153404
18865 59758 69319 10197 26616 66151 -452981 -293565 -311868 -46440 -31024 -96437 459825
18853 -33207 42882 -125948 -166061 -115529 83497 -311412 -179834 64975 -28140 -182762 216555
18841 -168666 -74323 -221480 141503 -24727 34322 287886 183239 89036 36567 -821 -229581
18830 -229581 -77382 -114003 -103928 -210176 298089 -412 -166100 -196519 59695 -159755 -11021
$$ packed form
18911a68016N2209F5454n843c37823F7993A693R7358J57115H4756c38532i2325
18899a04896A52567B248b02527G2231J89670b83388C8001b96107B38942a03344
18888B43679d4131m604A98701b44496J06436a0084B40065f7423A7988a22102k29214
18877c51316n9946B3369a95531I6488i8760r7161e9566j95556B86071G6487a53404
18865E9758R561A0197J6419L9535d52981J59416j8303d6440J5416o5413D59825
18853c3207D2882a25948m0113N0532H3497c11412J31578F4975b8140j54622B16555
18841a68666g4323j47157A41503b4727C4322K53564j04647H9036C6567h21k28760
18830b29581g7382l6621J0075j06248B98089d12j65688l0419E9695a59755a1021
$$ plain form
18818 -21985 -94251 221472 37003 -25083 157292 84804 182226 -129067 -12735 -149286 -29918
18806 -28434 99877 -36398 -1409 -1915 -400231 -223787 39769 264905 -146757 -111111 -488960
18795 -488960 -218750 34170 304160 90483 130285 -83987 173434 4284 306617 -41306 -362446
18784 -362446 64069 -17964 54045 -70594 139762 -216915 -110895 101996 13068 181562
18774 181562 -99216 -197219 -128477 166003 176855 -157151 -78336 -56300 160914 310867 -200591
18762 179061 174039 180806 -35131 60453 -444999 44792 -300003 -175685 -311960 -15680 153187
18750 -18104 -185913 -50944 -336059 -183674 -366709 -202106 -6898 79578 39554 6847 -68663
18738 88587 139388 -244869 -60772 -177100 60482 -158941 153078 -139084 -245043 -401919
$$ packed form
18818b1985p2266B21472C7003b5083A57292p2488R7422a29067a2735j36551b9918
18806b8434I9877c6398a409n06l98316J76444C9769K25136a46757L5646l77849
18795d88960b18750C4170K69990I0483L9802h3987A73434D284L02333d1306l21140
18784c62446F4069a7964E4045g0594A39762b16915J06020A01996A3068J68494
18774A81562i9216r8003O8742A66003J0852a57151g8336K2036A60914J49953b00591
18762A79061n022O767c5131F0453d44999D4792c00003J24318j36275a5680A53187
18750a8104j67809e0944k85115J52385j83035J64603f898G9578C9554F847f8663
18738H8587N0801b44869f0772j16328F0482a58941A53078a39084j05959j56876
$$ plain form
18728 -401919 129151 -55489 24493 7612 -5630 38989 -102618 -52113 -177364 -62585 -215721
18717 -215721 -307470 -265144 -8247 -274919 200179 -364123 168146 75124 -26514 -9845 -36100
18706 -36100 221176 218111 -408428 -251761 -64823 -200469 130527 82580 179746 109699 -9401
18694 -204341 123170 99801 -223439 19153 12796 -101255 -16013 -192493 35356 65028 -360464
18682 -137537 10688 156591 128234 190990 -106956 37915 149949 12664 -15584 -328322 -48714
18670 71486 71236 -249505 -141393 -101457 -244676 -387843 -90134 -190951 81061 36742 -201261
18658 -373923 -26896 -220430 -116803 -26362 -18041 27045 47561 -176335 -162739 -232995 -196307
18647 -196307 -125905 -255135 -127366 64688 186071 25327 -283369 -80788 71119 -162684
$$ packed form
18728d01919A29151e5489B4493G612e630C8989a02618N0505j25251f2585j53136
18717b15721r1749M2326h247k66672B00179c64123A68146G5124b6514i845k6255
18706c6100B21176l065d08428J56667f4823j35646A30527m7947R7166p0047i401
18694b04341A23170k3369b23439A9153o357a01255a6013j76480C5356K9672c60464
18682a37537A0688J45903k8357O2756a06956C7915J12034A2664a5584l12738d8714
18670G1486k50b49505J08112L9936j43219j43167i0134j00817H1061C6742b01261
18658c73923b6896j93534J03627b6362Q321B7045K0516a76335J3596p0256L6688
18647a96307P0402j29230a27366F4688J21383B5327b83369h0788G1119a62684
$$ plain form
18636 -157603 -10157 10821 -212650 -171934 -129507 -352584 21781 -346865 -86072 -209457 79904
18624 276103 7962 -97976 -134395 -23767 57159 -52607 -281965 65596 -45176 76256 32828
18612 152949 262206 40544 -214479 -138558 37291 -5867 -14297 85016 129572 -97127 63184
18600 -153855 66177 109237 -91555 -99026 23236 65900 -110420 -218442 -191532 62963 -117451
18588 250188 86716 -17623 -120132 -337612 -186355 -82575 61532 -24014 12199 -184250 -39193
18576 -219072 183133 -181424 97928 33437 -164426 364669 -222323 -189073 -106285 -158622
18566 -158622 273724 -307658 43328 -235943 -155818 16910 -31869 34000 -23139 -69162 48520
18554 -87804 86208 -47561 53199 -34065 -172334 -295782 -323889 -10399 65373 93557 -139737
$$ packed form
18636a57603a0157A0821b12650M0716M2427k23077B1781c46865h6072j23385G9904
18624B76103G962i7976l6419b3767E7159e2607k29358F5596d5176G6256C2828
18612A52949J09257D0544b14479P5921C7291e867q430H5016M4556i7127F3184
18600a53855F6177M3060i1555p471B3236M2664a10420j08022K6910F2963a17451
18588B50188H6716a7623j02509k17480J51257h2575F1532b4014A2199a84250c9193
18576b19072A83133a81424I7928C3437a64426C64669b22323L3250Q2788n2337
18566a58622B73724c07658D3328b35943Q0125A6910c1869C4000b3139m6023D8520
18554h7804H6208d7561E3199c4065j38269j23448k8107a0399F5373K8184a39737
$$ plain form
18542 216532 65805 -175680 168797 -45023 -2855 98123 -454350 278424 75897 -213291 -154384
18531 -154384 76308 205885 37433 -247111 -195908 -82506 -67069 50449 -184293 34831 -203060
18519 304140 -5579 -216686 217336 -58279 -96527 -215693 30392 96131 34516 -170954 353387
18507 223699 -40299 285765 -100684 31479 -55704 331012 -119101 -276772 -361810 -231204
18497 -231204 -144585 138129 -133274 -389212 378647 -161855 -131586 83746 298549 -494407
18486 24496 66673 -136508 -239840 -355482 -266017 232638 -255761 70332 -176889 98515
18475 196759 -71836 -31277 -206871 7668 -135315 529217 -65903 106263 203034 -318081 30258
18463 -20828 -83001 -183969 82062 -23976 -199860 -261927 -95798 -260850 -85884 19604 -154906
$$ packed form
18542B16532F5805a75680A68797d5023b855I8123d54350B78424G5897b13291N8907
18531a54384G6308J29577C7433b47111N1203h2506J5437E0449a84293C4831b03060
18519C04140e579k11107B17336e8279l8248j19166C0392O5739C4516a70954C53387
18507B23699d0299B85765a00684C1479e5704C31012a19101j57671q5038J30606
18497b31204Q6619A38129a33274k55938C78647a61855L0269H3746K14803d94407
18486B4496M2177a36508j03332j15642Q9465B32638b55761G0332a76889I8515
18475A96759g1836c1277j75594G668a35315E29217f5903A06263R6771c18081C0258
18463b0828o2173j00968H2062b3976j75884o2067i5798j65052h5884A9604a54906
$$ plain form
18451 263722 20869 72458 -79983 -300060 31959 77175 177440 -180860 46518 227330 -166613
18439 164168 23061 -3997 -94095 36166 -40083 -287399 162679 -183703 137121 20094 98781
18428 98781 354203 -24751 -72579 -175701 -170163 -197631 81894 -94040 171422 -22730 -108483
18417 -108483 52437 114759 -60696 -225613 -56904 -120187 115202 -158665 -83689 158922 17547
18405 -110268 -200889 119869 167890 139685 8686 114635 -106198 -112663 -381874 -150478 272
18393 -258835 45284 -256375 -169806 195315 -84272 249079 105769 -140659 -373569 -272850
18383 -272850 -219736 -51990 321389 31224 -58647 -281142 -276678 -172458 268557 -287981 189966
18371 -110129 -85194 -154716 144533 -3356 112428 53930 -35076 -176633 2504 -117558 101401
$$ packed form
18451B63722B0869N1589g9983k20077C1959M5216J00265a80860D6518J80812a66613
18439A64168B3061c997r0098C6166d0083k47316A62679a83703A37121B0094P8687
18428I8781K55422b4751m7828j03122N538k7468H1894i4040A71422b2730q5753
18417a08483E2437O2322f0696j64917e6904o3283A15202a58665P4976A58922A7547
18405a10268r0621A19869M8021k8205H686J05949a06198o465k69211a50478B72
18393b58835D5284b56375Q6569A95315h4272B49079A05769a40659k32910J00719
18383b72850N3114e1990C21389C1224e8647k22495M464J04220B68557b87981A89966
18371a10129K4935o9522A44533c356A12428E3930c5076j41557B504a17558A01401
$$ plain form
18359 93979 301439 -196470 -298814 -36605 -163012 20974 34250 47947 123871 56540 -175109
18347 229177 -84662 -245191 139984 192753 129995 -15201 -180910 -157291 -138489 -57667 18269
18335 190983 207080 -234437 -283095 212814 185330 -159622 98696 171032 -8057 37006 69003
18324 69003 -235483 -182326 24172 -262216 -464688 -186016 84825 181233 -227020 48562 -16165
18312 46661 299402 -170570 -468516 -195357 5026 -136955 -203042 -37428 123087 -17885 -7385
18300 372858 -144476 70651 5915 146463 -2755 -112745 -150039 -402919 -152794 10416 260231
18289 260231 -75916 233866 -220376 261270 124832 -18749 57561 53621 -124986 7296 -296343
18277 -267007 -371393 263133 -46636 62939 -365057 -152704 79979 -8382 -123779 277014
$$ packed form
18359I3979K07460a96470j02344c6605j26407B0974J3276J3697P5924E6540a75109
18347B29177h4662j60529A39984N2769o2758a5201j65709K3619J8802e7667A8269
18335A90983J6097b34437m8658B12814k7484a59622I8696P2336h057C7006L1997
18324F9003b35483N3157B4172b62216k02472a86016H4825R6408b27020D8562a6165
18312D6661K52741a70570k97946a95357E026a36955o6087c7428A23087a7885g385
18300C72858a44476G0651E915J40548b755j09990l7294k52880a52794A0416K49815
18289B60231g5916B33866b20376B61270A24832a8749E7561l940a24986G296b96343
18277b67007j04386B63133d6636F2939c65057a52704G9979h382j15397B77014
$$ plain form
18266 -185001 -597 20398 -367047 83010 32852 -149146 170046 -418569 193874 -79342 -91678
18255 -91678 65706 -22298 36372 -155315 291819 -134502 -146253 -111576 301515 -238099 214296
18243 -144621 -227803 -150771 -59314 65823 82498 -344773 10167 -174138 -208412 -68119 13671
18231 -72596 -245455 -13073 114076 -185664 -162841 99964 -47695 -162257 -206657 125651 -54247
18219 -252385 157844 37412 -107055 -177907 -108531 -28090 148938 86106 188056 -62373 108084
18207 -151399 123867 -161748 -115698 47903 -375676 -294690 -18540 695 -96339 266242 -367652
18195 156722 -412195 9987 62020 -68396 -94334 -160847 238095 58311 -272733 204102 -201161
18183 -64202 -186926 -181470 -342041 -385719 -125834 181964 -258859 268632 -29754 -80324 -330175
$$ packed form
18266a85001e97B0398c67047H3010C2852a49146A70046d18569A93874g9342j2336
18255i1678F5706b2298C6372a55315B91819a34502j1751L4677C01515b38099B14296
18243a44621q3182P7032e9314F5823J6675c44773A0167a74138l4274f8119A3671
18231g2596j72859a3073A14076a85664K2823I9964d7695j14562m4400A25651e4247
18219b52385A57844C7412a07055p0852O9376b8090A48938o2832J01950f2373A08084
18207a51399A23867a61748M6050D7903c75676Q0986a8540F95i6339B66242c67652
18195A56722d12195I987N2033f8396k5938o6513B38095E8311b72733B04102b01161
18183f4202j22724N456j60571m3678a25834A81964b58859B68632b9754n0570k49851
$$ plain form
18172 -330175 73875 -258321 375244 59653 115839 -224254 91675 152028 134392 -28815 154411
18160 -102078 -65840 50527 134961 172378 38439 -204103 -181467 237707 -69776 138767 -8011
18148 -269636 -256360 -93494 70883 -446272 133908 208710 95820 -78472 154736 -65135 -108027
18137 -108027 -122425 -295149 -45111 -142409 345390 30784 69933 -162068 -16714 -148957 -213840
18126 -213840 277251 -92134 -209579 32337 220136 -239128 -245331 -134251 373311 -348176
18115 -197465 22977 101246 2625 -312027 -219276 -236628 219404 -51932 43527 -106810 314340
18103 816 -46880 116521 -157945 -149063 64214 85742 -96717 -81471 -120932 172963 -47298 81363
18090 25422 78489 -416805 -3532 -343959 -248714 -317987 -82406 -100375 296712 -49910 117195
$$ packed form
18172c30175G3875b58321C75244E9653N6186b24254I1675O0353j7636b8815A54411
18160a02078L6238E0527Q4434L7417C8439b04103K2636B37707f9776A38767h011
18148b69636J3276i3494G0883d46272A33908P4802I5820g8472A54736f5135m2892
18137a08027j4398j72724d5111r7298C45390C0784L9149a62068a6714j32243o4883
18126b13840B77251i2134j17445C2337J87799b39128o203J11080C73311c48176
18115a97465B2977P8269B625c12027R2751j7352B19404e1932D3527a06810C14340
18103H16d6880A16521a57945Q882F4214K1528i6717J5246l9461A72963d7298H1363
18090B5422N3067d16805c532l40427R5245o9273h2406j7969B96712d9910A17195
$$ plain form
18078 -105802 -123029 90243 -213731 -4414 -136507 -33535 -81579 -274378 -132421 95293 -248084
18066 87326 -21937 -179796 -139154 36269 -428999 53792 98264 -54176 236652 111481 63349
18055 63349 -177742 -81319 161445 140016 196610 -210998 -147637 -142680 -172342 114903 488221
18044 488221 -33705 -115411 79674 223261 20399 31681 210070 -51813 62740 181507 -277484
18032 -201783 152349 -103453 118830 -69219 7335 -107249 322207 93907 189053 -222080
18021 -179246 31888 90252 -411619 -75328 -164700 -134132 56579 -278358 78211 232394 -66563
18009 1326 -385184 113262 132099 28049 -228240 -123866 -101171 137331 -79410 -37387 -194206
17998 -194206 -53158 137390 -18739 -212352 -13010 285095 -414448 -331369 117999 100376
$$ packed form
18078a05802j7227I0243b13731d414j32093c3535m8044j92799a32421I5293b48084
18066H7326b1937j57859M0642C6269d28999E3792M4472e4176B36652A11481m8132
18055F3349a77742h1319A61445k1429N6594b10998O3361M957k9662A14903L73318
18044D88221c3705q1706G9674J43587B0399J1282J78389e1813F2740J18767b77484
18032b01783A52349a03453A18830f9219G335a07249C22207I3907R5146b22080
18021a79246C1888N8364d11619g5328q9372L0568E6579b78358G8211J54183f6563
18009A326c85184A13262J8837B8049b28240J04374K2695A37331g9410c7387j56819
17998a94206e3158A37390a8739j93613a3010B85095d14448Q3079A17999j7623
$$ plain form
17988 100376 -63964 95741 -148676 -260501 -112990 80635 71051 138525 -27348 314440 236736
17977 236736 -107160 67334 -134572 370794 -360052 -93475 -7417 -118463 -276104 -121824
17966 101110 74008 2668 -168696 -19296 -133055 -2983 176804 63857 76617 202409 331396
17955 331396 21991 63266 54615 25186 -6221 190909 -29223 -51687 -85751 187349 -211356
17943 145363 -85016 -188939 -124611 66410 -221710 -136720 29669 -237714 166991 215179 -90148
17931 156131 221552 -20039 -17198 12440 31974 -238246 105472 -210318 -65792 -147151 280379
17919 78446 22805 -93631 197290 -316242 -296355 -208815 32712 124021 -188131 -96185 -4922
17907 83038 324387 169419 -145241 -95858 -55317 -138841 -136986 -34039 246961 -434130 143176
$$ packed form
17988A00376f3964I5741a48676j11825a12990H0635r584O7474b7348C14440p7704
17977B36736a07160F7334a34572C70794c60052i3475g417j11046j57641a21824
17966A01110k7102B668a68696a9296j13759b983A76804F3857J2760J25792J28987
17955C31396B1991M1275q651B5186f221A90909b9223k2464l4064A87349b11356
17943A45363h5016j03923O4328F6410b21710Q4990B9669b37714A66991M8188i0148
17931A56131O5421b0039K841A2440J9534b38246A05472b10318f5792q1359B80379
17919G8446B2805i3631A97290c16242J9887Q7540C2712R1309a88131R1946d922
17907H3038K41349j54968a45241M9383M0541q3524J855c4039B46961d34130A43176
$$ plain form
17895 -222189 -65567 -50884 -26226 -439465 11119 -79329 -11273 328675 267616 127367 85720
17884 85720 21150 -2451 -99798 -200929 -158889 -473563 -86310 236135 2294 25355 -77586
17872 -416258 154955 90071 101594 -133982 159206 -61228 96139 292655 -73149 -1877 40050
17860 -108183 -12620 -200062 -91570 -38933 -229360 77771 96250 49042 52917 -416620 115030
17848 -266316 305192 28568 304050 -141792 8040 -82756 56034 402552 -186461 -17681 179209
17836 -77084 -167602 48323 -279967 135012 -65519 -77602 108302 -90055 236904 41701 -1738
17824 244860 280496 -24677 -48551 152734 -169769 -34986 -13618 -214506 201876 -112841
17813 -337955 -92522 -249006 -11117 48190 -76822 67979 269016 143489 -133480 86189 166019
$$ packed form
17895b22189f5567J4683K4658m13239A1119g9329a1273C28675o1059A27367m1647
17884H5720B1150b451r7347j01131M2040l14674h6310B36135B294K3061g7586
17872d16258A54955o4884J1523a33982A59206f1228I6139J96516g3149a877D0050
17860a08183a2620j87442i1570c8933j90427G7771J8479m7208L875d16620A15030
17848b66316C05192B8568K75482a41792H040h2756E6034L46518a86461a7681A79209
17836g7084r0518D8323b79967A35012f5519j2083A08302i0055B36904D1701a738
17824B44860L5636b4677k3874A52734a69769c4986a3618k00888B01876a12841
17813c37955i2522j56484a1117D8190g6822F7979K01037j25527a33480H6189P9830
$$ plain form
17802 166019 -5657 -8155 -26714 -197506 -162776 -42356 -118165 -18587 -137345 -303139 -323214
17791 -323214 403462 185410 233432 397056 -118753 -267176 219423 -108857 -61527 63747
17780 -1535 317069 -54502 39225 4601 -43913 224308 13052 159333 -142422 275220 29180
17768 -80800 -33124 -106835 -65582 177141 122026 -63196 -219640 -147122 -29646 6073 29677
17757 29677 -76734 149485 -142821 17927 146285 -155758 219452 164424 -33154 178948
17746 13760 -2704 313554 -3782 -192916 188783 84740 284536 188066 -304927 -195754 -236726
17735 -236726 58533 -141088 -128060 -78271 46310 -76220 177832 -220085 -150915 -262209 -129077
17723 -47506 165163 143099 -132763 -167448 -241383 -29917 249068 -80088 129766 46911 -223574
$$ packed form
17802A66019e657k498j8559j70792L4730d2356p5809a8587j18758j65794k0075
17791c23214D03462A85410M8022J63624a18753j48423B19423a08857M7330F3747
17780a535C17069e4502C9225D601d3913B24308A3052J46281a42422B75220B9180
17768h0800c3124p3711M1253A77141n5115f3196j56444P2518b9646F073K3604
17757B9677g6734A49485a42821A7927J28358a55758B19452n5028c3154A78948
17746A3760b704C13554c782j89134A88783H4740J99796r6470c04927J09173m0972
17735b36726E8533a41088J3028M9789D6310g6220A77832b20085O9170j11294a29077
17723d7506A65163k2064a32763l4685p3935b9917B49068h0088A29766D6911b23574
$$ plain form
17711 1506 51493 48668 98950 46297 37347 201088 335042 112266 -89241 155753 137776
17700 137776 207030 269078 -128828 31065 -209411 -64338 -26706 197899 -34752 -108401 173981
17688 307008 378709 -2799 -14544 -85584 48382 530264 -38625 76452 -19175 -37703 -36775 -8890
17675 468514 -66563 90308 -83618 213913 173135 216651 -170465 295882 98919 36441 -177305
17663 9051 273375 -114822 -36288 211369 453633 -125563 -169260 23314 50177 61300 39353
17652 39353 293207 7641 26211 143611 360775 -183911 70893 -114211 27535 64930 91004
17641 91004 327667 -103842 -13547 106153 -29379 12334 -99921 54773 83210 -386058 34987
17629 -188467 130530 -186476 -60212 83417 -13484 -248113 133768 236725 129908 -134857
$$ packed form
17711A506M9987k825N0282D6297q950J63741J33954A12266h9241A55753j7977
17700A37776O9254O2048a28828C1065b09411f4338b6706A97899c4752p3649A73981
17688C07008P1701b799j1745p1040D8382M81882c8625G6452a9175j8528R28h890
17675D68514f6563I0308h3618B13913m0778M3516a70465B95882I8919C6441a77305
17663I051K64324a14822c6288B11369K42264a25563m3697B3314K6863J1123k1947
17652C9353K53854G641J8570J17400K17164a83911G0893a14211B7535L7395K6074
17641I1004K36663a03842a3547A06153b9379A2334i9921E4773K8437c86058C4987
17629a88467A30530a86476f0212H3417a3484k34629A33768J02957j06817a34857
$$ plain form
17618 275989 225273 -78908 -170006 53130 -216485 300256 160932 297303 -135572 -34529
17607 74719 353453 -11496 34269 -128641 -18220 -54776 143693 -6607 96436 67586 242809
17596 242809 -70904 118654 68029 -202868 116451 63045 267897 -63143 230199 71131
17585 55860 81345 301730 -126270 -22046 14587 -75102 70451 102535 62465 235258 225067
17574 225067 25595 106435 -22561 72408 -239696 315606 -155907 177961 -1882 -71247 -81574
17563 -81574 87327 -185038 25202 -162012 -90401 -77549 292691 -70145 -7542 393095 73959
17551 115609 -128996 -276776 205957 -17317 -63366 74365 -93443 -158216 -112788 312105 -64713
17539 132210 133339 -107146 83568 -90750 193222 -67883 -42335 412125 243955 225413 89897
$$ packed form
17618B75989n0716g8908r1098E3130b16485C00256j39324J36371a35572c4529
17607G4719K78734a1496C4269a28641a8220l6556A43693f607I6436k8850J75223
17596B42809g0904A18654n0625b02868A16451n3406K04852f3143B30199G1131
17585E5860K5485K20385a26270b2046A4587g5102G0451L2084m0070J72793j0191
17574B25067B5595Q0840b2561G2408b39696C15606a55907A77961a882o9365j0327
17563h1574H7327a85038B5202a62012P1611J2852B92691g0145g542C93095G3959
17551A15609a28996j47780B05957a7317m6049G4365i3443o4773M5428C12105f4713
17539A32210J129a07146H3568i0750A93222f7883K5548D12125j68170j8542H9897
$$ plain form
17527 -96661 93011 42505 68921 5418 143668 98663 176660 -54001 -100695 228174 289344
17516 289344 62629 -64894 330556 -89523 82468 105887 138891 244304 115407 323569 24902
17504 -71079 -77289 224370 -9192 297760 574505 27367 368402 454491 -84701 -199907 173399
17492 25609 -251674 40534 -52745 -95820 344554 139704 283249 227650 307894 92887 213999
17481 213999 232869 -192039 381186 160502 -225863 235087 -212300 203350 -12942 -16302
17471 -16302 -29149 317780 -162003 15729 51961 -24320 51690 198399 207157 258527 341751
17460 341751 429355 227687 -5837 -33434 -270832 -12425 -180436 627593 77180 194925 478830
17449 478830 180899 187339 447411 201567 208299 204434 348642 403528 180042 28180 321521
$$ packed form
17527i6661I3011D2505K6416E418J38250m5005P7997e4001m6694B28174O1170
17516B89344F2629f4894C30556h9523H2468K3419L3004J05413A15407K08162B4902
17504g1079o210B24370i192B97760K76745B7367L41035Q6089h4701j15206A73399
17492B5609b51674D0534e2745m3075C44554A39704J43545n5599Q0244I2887J21112
17481B13999J8870a92039C81186A60502b25863B35087b12300B03350a2942l360
17471a6302j2847C17780a62003A5729L6232b4320E1690J46709Q758N1370Q3224
17460C41751Q7604k01668e837k7597k37398a2425j68011F27593G7180J17745K83905
17449D78830A80899O440K60072B01567O732l865J44208N4886A80042B8180K93341
$$ plain form
17438 321521 236252 128792 552541 336379 -165132 -45920 159532 392446 347698 209277
17428 209277 344191 370056 173846 -74180 69454 220653 364300 249412 138724 105645
17418 105645 308320 331009 207354 168023 369065 76909 169580 558721 481277 69084 223399
17407 223399 359855 55688 230090 381016 150910 -72696 36774 167467 267167 301908
17397 301908 228469 352157 -2927 138171 22633 223440 114331 423401 54366 438500
17387 438500 366744 307331 66164 300324 326235 294705 422598 -44753 98336 283248 125072
17375 134022 25842 128257 -185969 439278 127869 158022 -451243 -6744 140850 -102889
17364 145020 201853 291378 196840 279922 120399 463864 30565 -135163 96572 27084 -116617
$$ packed form
17438C21521q5269j07460M23749k16162a65132d5920A59532K32914m4748j38421
17428B09277J34914K5865A73846g4180F9454J51199J43647j14888j10688l3079
17418A05645K02675K2689j23655l9331K01042G6909R2671L89141p7444F9084J54315
17407B23399J36456E5688J74402J50926A50910g2696C6774J30693R9700L4741
17397C01908p3439J23688b927A38171B2633K00807j09109L09070E4366L84134
17387D38500p1756n9413F6164K34160K5911l1530J27893d4753I8336J84912A25072
17375A34022B5842J02415a85969D39278A27869L0153d51243f744A40850a02889
17364A45020N6833Q9525r4538Q3082A20399L43465C0565a35163I6572B7084a16617
$$ plain form
17352 123474 214725 -84676 -95070 160374 238820 124689 187199 -40980 345332 296797 110956
17340 164984 140592 188203 122198 376636 202276 -38062 22018 400415 -368669 269446
17329 140897 193154 45703 294095 146954 243040 -13123 -229125 246212 -20385 63142 231011
17318 231011 52716 235030 -200526 236675 332697 361782 -30317 47564 429001 244971
17308 244971 260818 247149 231611 306499 385556 291330 -9157 -78480 124981 163104 122140
17297 122140 16434 -118225 86319 602951 195534 11465 94559 288641 290594 62768 352199
17286 352199 264357 372974 363018 271730 284158 11226 279328 248535 230161 -52680 96814
17274 213039 -2571 342985 367914 234962 198300 -90204 308362 104236 269246 79789 266157
$$ packed form
17352A23474R1251h4676j0394A60374P8446j14131O2510d0980C45332m8535A10956
17340A64984k4392M7611o6005K54438j74360c8062B2018L78397c68669B69446
17329A40897N2257D5703K48392A46954R6086a3123k16002B46212b0385F3142J67869
17318B31011E2716J82314b00526B36675R6022K9085c0317D7564L81437j84030
17308B44971J5847j3669j5538P4888P9057r4226i157o9323A24981L8123m0964
17297A22140A6434a18225H6319N16632A95534A1465Q3094J94082J953F2768K89431
17286C52199q7842J08617r956r1288J2428A1226K68102l0793j8374e2680I6814
17274B13039b571C42985K4929j32952l6662i0204C08362A04236J65010G9789J86368
$$ plain form
17263 266157 372174 -10952 158809 8617 72694 73201 186982 88761 237797 137416 243827
17252 243827 -46759 180241 447635 -15044 509131 464263 237236 56533 542573 215117
17241 138828 200232 181224 227362 -41613 53189 4024 349874 113901 382669 168548 297290
17230 297290 59623 116237 478385 238173 254334 210065 101503 85567 -168933 223436
17219 278714 94164 235024 254316 478291 -112601 139846 473979 330487 359830 543552
17209 543552 311582 252616 -35708 366849 436336 250001 456115 4157 179284 276419 265276
17198 265276 121230 199650 478027 146550 -16940 193964 625751 546338 38611 344034
17188 344034 452096 532531 462666 283625 573777 62322 193574 246913 438651 309395
$$ packed form
17263B66157J06017a0952A58809H617O4077N07J13781H8761J49036j00381J06411
17252B43827d6759A80241K67394a5044E09131m4868k27027E6533M86040B15117
17241A38828O1404j9008M6138d1613E3189D024L45850A13901K68768A68548J28742
17230B97290E9623N6614L62148B38173J6161m4269A01503j5936a68933B23436
17219B78714I4164J40860J9292K23975a12601A39846L34133j43492K9343J83722
17209E43552k31970n8966c5708C66849O9487j86335K06114D157J75127R7135j1143
17198B65276A21230P8420K78377A46550a6940A93964M31787p9413C8611L05423
17188C44034J08062Q0435o9865j79041K90152F2322J31252N3339J91738j29256
$$ plain form
17178 309395 -119831 258547 416724 -40469 318643 390837 266426 151993 160077 86789
17168 86789 452648 181922 408692 134825 218777 348558 406433 132998 301496 266095
17158 266095 403400 363317 372361 239865 410555 289970 257447 246626 293833 219133 379764
17147 379764 518813 527241 593059 512929 215621 327770 165899 447336 257397 410248
17137 410248 386032 133693 423717 520186 208502 230205 107780 292757 155476 685588
17127 685588 428966 568294 411329 553667 289579 406738 355708 244999 477785 624526
17117 624526 624272 443305 -10233 647550 175407 521513 643171 783740 588174 283007
17106 155598 449153 84994 423327 169298 692823 688626 313831 334505 432820 503487 447791
$$ packed form
17178C09395a19831B58547J58177d0469C18643P2194j24411j14433Q084p3288
17168H6789L65859A81922K26770A34825Q3952J29781N7875A32998J68498l5401
17158B66095J37305m0083R044j32496J70690j20585l2523j0821M7207p4700J60631
17147C79764J39049Q428O5818q0130B15621J12149j61871K81437j89939J52851
17137D10248k4216A33693K90024R6469B08502K1703A07780J84977j37281N30112
17127F85588k56622J39328j56965J42338k64088J17159n1030j10709K32786J46741
17117F24526k54j80967a0233F47550A75407L46106J21658J40569j95566B83007
17106A55598K93555H4994L38333A69298N23525m197C13831K0674R8315P0667n5696
$$ plain form
17095 447791 431081 398736 376035 263146 621768 306628 691865 423319 133278 572136
17085 572136 -15951 456365 784742 434315 440317 610555 432363 654042 158193 321713
17075 321713 460391 188078 413108 679817 619890 632867 601046 379015 574403 345349
17065 345349 727191 536060 326387 710562 483258 843213 693169 833372 690947 451631
17055 451631 712567 757266 697515 683801 595185 573406 745684 794179 590823 764632 690617
17044 690617 567617 522910 487590 813648 502562 604954 557856 571147 494784 604089
17034 604089 869686 613842 446291 507811 1027198 669994 599856 567621 859798 713474
17024 713474 707080 489535 531462 477212 747947 616738 1020519 858991 620284 1001777
$$ packed form
17095D47791j6710l2345k2701j12889L58622C06628L85237k68546A33278M38858
17085E72136a5951D56365L28377l50427O002J70238j78192K21679A58193J63520
17075C21713J38678A88078K25030K66709n9927J2977l1821k22031J95388k29054
17065C45349L81842j91131k09673L84175k27304L59955j50044J40203j42425k39316
17055D51631K60936M4699n9751j3714q8616k1779J72278M8495k03356J73809p4015
17044F90617j23000m4707l5320L26058l11086J02392m7098J3291p6363J09305
17034F04089K65597k55844j67551O1520N19387l57204p0138l2235K92177j46324
17024G13474o394k17545M1927n4250K70735j31209M03781j61528k38707L81493
$$ plain form
17014 1001777 657748 581852 800906 893313 567911 937035 653134 829662 383866 673784
17004 673784 1054048 545715 760341 881866 878611 734435 570750 743271 993694 1051197
16994 1051197 1020648 687922 854098 816412 803200 732721 1086685 1099544 918036 984384
16984 984384 1004398 941151 1009382 914108 785196 1127755 719693 885517 1228600 995499
16974 995499 1176685 1088501 1012734 1011414 801041 830469 1200221 1198756 1267605 1278019 1319036
16963 1319036 1054999 961597 1322763 1374281 946097 942311 1322345 1323103 1067689 1182759 1347530
16952 1347530 1199429 1200330 1133567 851017 1268581 1130579 1051875 1204795 1256678 1581856
16942 1581856 1311114 1608085 1412406 1181690 1169820 1231923 1274532 1300474 1407928 1827373
$$ packed form
17014A001777l44029p5896K19054R2407l25402L69124k83901J76528C83866K89918
17004F73784L80264n08333K14626J21525l255j44176j63685J72521K50423N7503
16994A051197l0549l32726J66176l7686j3212p0479L53964J2859j81508O6348
16984I84384K0014o3247O8231r5274j28912L42559m08062J65824L43083k33101
16974I95499J81186q8184p5767j320k10373K9428L69752j465O8849J0414M1017
16963A319036k64037r3402L61166N1518m28184l786L80034P58k55414J15070J64771
16952A347530j48101R01o6763k82550M17564j38002p8704J52920N1883L25178
16942A581856k70742K96971j95679k30716j1870O2103M2609K5942J07454M19445
$$ plain form
16932 1827373 1466683 1656289 1548735 1260167 1748970 1032981 1263602 1460484 1556291 1290927
16922 1290927 1578198 1681789 1444736 1671129 1677600 1443211 1597591 1450936 1604028 1623445
16912 1623445 1483122 1615654 1517873 1736110 1914121 1648237 1594610 1741409 2070433 1931665
16902 1931665 2107644 2102194 1794596 1794768 1932604 1568455 2048518 1928592 2456818 2024013
16892 2024013 2140734 2254789 2042180 2230762 1971318 2207159 2362972 2227651 2184144 2320412
16882 2320412 2492226 2093468 2768069 2438182 2569317 2725215 2328510 2501580 2688593
16873 2688593 2408618 2471369 2729575 2457031 2922346 2844635 2684236 2914128 2653532 2822994
16863 2822994 2859354 3198277 2994264 3052114 3117923 2944193 3295237 3054418 3528272 3433439
$$ packed form
16932A827373l60690J89606j07554k88568M88803p15989K30621J96882R5807k65364
16922A290927K87271J03591k37053K26393O471k34389J54380j46655J53092J9417
16912A623445j40323J32532r7781K18237J78011k65884n3627J46799L29024j38768
16902A931665J75979n450l07598J72J37836l64149M80063j19926N28226m32805
16892B024013J16721J14055k12609J88582k59444K35841J55813j35321m3507J36268
16882B320412J71814l98758O74601l29887J31135J55898l96705J73070J87013
16873B688593k79975O2751K58206k72544M65315p7711j60399K29892k60596J69462
16863B822994L6360L38923k04013N7850O5809j73730L51044k40819M73854r4833
$$ plain form
16853 3433439 3442686 3481011 3742339 3448106 3795360 3560067 3660207 3842823 3622774 3969458
16843 3969458 3522377 4152954 4138427 4288930 4175120 4596867 4447555 4205422 4453389 4301589
16833 4301589 4424586 4505232 4741152 4871986 4582203 4898215 4913348 4785002 5088518 5560605
16823 5560605 5459069 5770587 5333520 5481763 5624549 5858998 5946607 6001708 6250664 6237027
16813 6237027 6430176 6721296 6868684 7567158 6977113 6995191 7426997 7535165 7901605 7479167
16803 7479167 7917686 8083040 8099282 8579529 8525658 8749747 9095220 9110273 9621871 10134885
16793 10134885 9937506 10123637 10370533 10857108 10743777 11251099 11424504 12070605 12052195
16784 12052195 12468355 12962677 13165410 13530279 14187624 14159397 14913764 15199706 15624301
$$ packed form
16853C433439R247L8325K61328k94233L47254k35293J00140J82616k20049L46684
16843C969458m47081O30577j4527J50503j13810M21747j49312k42133K47967j51800
16833D301589J22997Q0646K35920J30834k89783L16012J5133j28346L03516M72087
16823E560605j01536L11518m37067J48243J42786K34449Q7609N5101K48956j3637
16813F237027J93149K91120J47388O98474n90045J8078M31806J08168L66440m22438
16803G479167M38519J65354J6242M80247n3871K24089L45473J5053N11598N13014
16793A0134885j97379J86131K46896M86575j13331N07322J73405O46101j8410
16784A2052195M16160M94322K02733L64869O57345k8227P54367K85942M24595
$$ plain form
16775 15624301 15752827 16409742 16972919 17819880 18247425 18864865 19318699 19956394 20464410
16766 20464410 21024623 22328613 22626903 23260899 24105306 25314768 26405854 27294024 28114676
16757 28114676 29444419 30307177 31810579 33266810 34490800 35744348 37632398 38899595
16749 38899595 41036170 42571340 44894756 46988086 49201677 51420646 54049305 56860782
16741 56860782 59411306 62754875 65916398 69373006 73109582 77270077 81108645 85712582
16733 85712582 90369525 95300328 100410609 105855723 111588207 117882546 123737830 130141479
16725 130141479 136325806 142875550 148977879 155100450 160745202 166346364 171081551 175443164
16717 175443164 178446028 180787387 182315985 182643287 181423314 179876853 177231831 173519082
$$ packed form
16775A5624301J28526O56915N63177Q46961M27545O17440M53834O37695N08016
16766B0464410N60213J303990K98290O33996Q44407J209462J091086Q88170Q20652
16757B8114676J329743Q62758J503402J456231J223990J253548J888050J267197
16749C8899595K136575J535170K323416K093330K213591K218969K628659K811477
16741E6860782K550524L343569L161523L456608L736576M160495L838568M603937
16733H5712582M656943M930803N110281N445114N732484O294339N855284O403649
16725A30141479O184327O549744O102329O122571N644752N601162M735187M361613
16717A75443164L002864K341359J528598L27302j219973j546461k645022l712749
$$ plain form
16709 173519082 168973800 164307019 158193080 152312990 145932549 139892115 133181838 126966841
16701 126966841 120305309 114302145 108492110 102373169 97013407 91814403 87033472 81998299
16693 81998299 77672122 73260067 69401934 65815904 62439335 58805678 55905487 53280332
16685 53280332 50441748 48373133 45401788 43742183 41199866 39299719 37639419 35951588
16677 35951588 34019914 32968730 31487746 30137433 28772353 27715486 26748314 25480794
16669 25480794 24663804 23674965 22783612 21998872 21052069 20261380 19567243 18911580 18274894
16660 18274894 17916013 17068207 16467978 16130434 15663466 14688858 14260702 14064150 13392431
16651 13392431 13204759 12899727 12060623 11962423 11601756 11243665 10792011 10755325 10518834 9989074
$$ packed form
16709A73519082m545282m666781o113939n880090o380441o040434o710277o214997
16701A26966841o661532o003164n810035o118941n359762n199004m780931n035173
16693H1998299m326177m412055l858133l586030l376569l633657k900191k625155
16685E3280332k838584k068615k971345j659605k542317j900147j660300j687831
16677C5951588j931674j051184j480984j350313j365080j056867r67172j267520
16669B5480794q16990r88839q91353p84740r46803p90689o94137o55663o36686
16660A8274894l58881q47806o00229l37544m66968r74608m28156j96552o71719
16651A3392431j87672l05032q39104r8200l60667l58091m51654l6686k36491n29760
$$ plain form
16641 9989074 9973528 9617945 9406994 8872193 8695631 8684470 8298001 8268936 8155647 8019737
16631 8019737 7538856 7432132 7583792 7255288 7102413 6686998 6727695 6450432 6254939 6488612
16621 6488612 6156494 5842334 5842846 5661475 5442048 5722382 5580402 4891778 5283132 5053933
16611 5053933 4890618 4610445 4642691 4578865 4488830 4309619 4245484 4336335 4529143 4024369
16601 4024369 4127461 3831685 4208972 4211017 3911915 3939162 3655471 3637519 3509173 3241460
16591 3241460 3441606 3457829 3320229 3444505 3313012 3373708 3261653 3544191 2870422 3110906
16581 3110906 3000412 2652297 3141266 2725976 2509853 2868914 2958021 2806141 2876105 2577811
16571 2577811 2455646 2330894 2308088 2473301 2336128 2237858 2419618 1987244 2221698 2004753
$$ packed form
16641I989074j5546l55583k10951n34801j76562j1161l86469k9065j13289j35910
16631H019737m80881j06724J51660l28504j52875m15415M0697k77263j95493K33673
16621F488612l32118l14160N12j81371k19427K80334j41980o88624L91354k29199
16611E053933j63315k80173L2246o3826r0035j79211o4135R0851J92808n04774
16601D024369J03092k95776L77287K045k99102K7247k83691j7952j28346k67713
16591C241460K00146J6223j37600J24276j31493O0696j12055K82538o73769K40484
16581C110906j10494l48115M88969m15290k16123L59061Q9107j51880O9964k98294
16571B577811j22165j24752k2806J65213j37173r8270J81760m32374K34454k16945
$$ plain form
16561 2004753 2053336 2109987 2321126 1741650 1776701 2026341 2117949 1797212 1954578 2001470
16551 2001470 1807324 1656457 2014815 1823424 1702271 1522556 1833585 1852478 1694837 1505208
16541 1505208 1786423 1669284 1440408 1627403 1428527 1421036 1699086 1499939 1258994 1472848
16531 1472848 1458356 1579559 1215231 1409009 1488144 1296136 1355543 1472553 1128981 1460649
16521 1460649 1170842 1493029 949989 1082632 1367771 1149588 1020321 1170479 1138200 1300888
16511 1300888 1260974 1235699 1017891 1455237 1597059 1188932 938273 1100584 1245070 903968
16501 903968 1260348 1022110 1156019 1097677 1162025 1229052 1304220 1287230 857871 626012
16491 626012 965883 749148 585506 890086 979476 886395 796467 566530 807476 586414
$$ packed form
16561B004753M8583N6651K11139n79476L5051K49640R1608l20737J57366M6892
16551B001470j94146j50867L58358j91391j21153j79715L11029J8893j57641j89629
16541A505208K81215j17139k28876J86995j98876p491K78050j99147k40945K13854
16531A472848j4492J21203l64328J93778P9135j92008N9407J17010l43572L31668
16521A460649k89807L22187n43040J32643K85139k18183j29267J50158l2279J62688
16511A300888l9914k5275k17808M37346J41822m08127k50659J62311J44486l41102
16501I03968L56380k38238J33909n8342O4348O7027P5168j6990m29359k31859
16491F26012L39871k16735j63642L04580Q9390r3081q9928k29937K40946k21062
$$ plain form
16481 586414 767769 414626 866741 426287 925077 837487 709523 560863 658196 680078
16471 680078 665698 822008 690228 549067 481950 902791 612529 541274 807718 642111
16461 642111 675860 443491 656247 857064 844035 403490 714668 654524 670101 600336
16451 600336 598961 412475 528169 815551 608119 469105 658842 749047 586353 117531
16440 651244 148038 438986 611034 313529 769708 448381 710195 380965 269922 427432
16430 427432 439936 435716 450371 608400 571745 643335 623600 434838 558135 375948 363599
16419 363599 189281 336213 370326 376131 540004 491436 729741 499033 394089 465582
16409 465582 377653 561494 349570 457055 286147 315798 142094 334246 426787 345607
$$ packed form
16481E86414J81355l53143M52115D26287M98790q7590j27964j48660R7333K1882
16471F80078j4380J56310j31780j41161o7117M20841k90262p1255K66444j65607
16461F42111L3749k32369K12756K00817j3029D03490L11178o0144J5577o9765
16451F00336j375j86486J15694K87382k07432j39014J89737R0205j62694A17531
16440F51244A48038K90948J72048k97505M56179l21327K61814l29230j11043J57510
16430D27432J2504m220J4655J58029l6655P1590j9735j88762J23297j82187j2349
16419C63599j74318J46932L4113N805J63873m8568K38305k30708j04944P1493
16409D65582q7929J83841k11924J07485j70908K9651A42094J92152R2541q1180
$$ plain form
16399 345607 139979 235548 421058 322565 348833 719810 298754 340805 120782 18968
16388 351422 249722 538224 391618 371856 267697 240045 577377 297281 289121 320583
16378 320583 321649 389957 232063 397405 322528 294576 351224 501653 101011 382861 108946
16366 395488 189668 466364 340843 379773 318791 211025 134728 229602 527721 469393
16356 469393 466419 447012 361023 486446 540936 437151 37012 695561 448829 414661 194008
16344 511166 130877 406347 55865 260307 190328 32042 346411 457903 26970 346473
16334 346473 527134 137655 658023 232241 -201389 681549 -3563 87920 337969 -123621
16323 192096 71570 276238 245835 6105 185064 -91437 -83174 351249 167487 -22386 190609
$$ packed form
16399C45607A39979R5569J85510r8493K6268L70977B98754M2051A20782A8968
16388C51422j01700K88502j46606j9762j04159k7652L37332k80096q160L1462
16378C20583J066O8308j57894J65342p4877k7952N6648J50429A01011K81850A08946
16366C95488A89668K76696j25521L8930o0982j07766p6297R4874K98119n8328
16356D69393k974j9407q5989J25423N4490j03785C7012O58549k46732l4168A94008
16344E11166A30877K75470E5865K04442o9979C2042L14369J11492B6970L19503
16334C46473J80661A37655N20368B32241b01389F81549c563H7920K50049a23621
16323A92096G1570K04668l0403F105J78959i1437Q263C51249A67487b2386A90609
$$ plain form
16311 207218 317313 394684 318155 -60063 354486 199190 428023 262997 -8701 -197268
16301 -197268 111430 341161 -18446 -43685 209682 288690 9900 393044 261799 538279
16291 538279 290367 406542 55199 154201 205372 77143 187191 300882 410210 391201
16281 391201 205110 228976 7368 -18357 280399 -120408 145406 226814 104611 151362 227261
16270 227261 211995 120814 -45290 -5040 -25464 152276 207850 59627 -15302 213083 58618
16258 -23551 372548 359211 -153560 -206215 209760 -158267 424026 156491 280351 9483
16247 -146800 -377232 -61265 106062 -83658 -32187 -57482 174070 103019 -129011 42901 -157039
16235 189977 257474 124993 190472 221634 154272 275503 335266 128965 407032 39715 141212
$$ packed form
16311B07218J10095P7371p6529f0063C54486j55296K28833j65026h701j88567
16301a97268A11430K29731a8446k5239B09682P9008I900L83144j31245K76480
16291E38279k47912J16175E5199R9002N1171G7143J10048J13691J09328j9009
16281C91201j86091K3866G368a8357B80399a20408A45406Q1408A04611M6751P5899
16270B27261j5266r1181d5290e040k0424A52276N5574E9627a5302B13083E8618
16258b3551C72548j3337a53560n2655B09760a58267D24026A56491J23860I483
16247a46800k30432f1265A06062h3658c2187k5295A74070p1051a29011D2901a57039
16235A89977O7497A24993O5479L1162o7362J21231N9763A28965K78067C9715J01497
$$ plain form
16224 141212 55776 11562 131314 9539 13011 26972 150075 59389 66967 -13829 112962
16212 55700 -153976 147733 44984 118392 214372 -35580 99704 145577 439193 -36298 226074
16200 2982 -28372 137894 -12512 158045 -83838 148624 151988 47288 203764 -2649 -652 125973
16187 77101 -32512 -78560 226798 -97039 208020 155568 6092 346146 -19067 196062 -28041
16175 265001 103791 30894 -386123 306134 202918 -309831 -152191 130364 24129 -103956
16164 -258971 40299 -115833 122767 -98901 -183576 -51565 418349 133552 -3749 -84569 164252
16152 -238099 60227 170589 -282105 -23304 265233 -61961 124087 -41669 -85966 -331189
16142 -331189 73050 33486 181547 373501 -25426 -94233 42309 176023 -98313 40985 71163
$$ packed form
16224A41212E5776A1562J19752I539L472J3961J23103E9389P578a3829A12962
16212E5700a53976A47733D4984P3408R5980c5580I9704M5873K93616c6298B26074
16200B982b8372A37894a2512A58045h3838A48624L364D7288J56476b649f52A25973
16187G7101c2512m6048B26798i7039B08020n2452F092L40054a9067A96062b8041
16175B65001A03791C0894c86123C06134j03216c09831a52191A30364B4129a03956
16164b58971D0299a15833A22767i8901q4675e1565D18349A33552c749q0820A64252
16152b38099F0227J10362b82105b3304B65233f1961A24087d1669m4297k45223
16142c31189G3050C3486J48061J91954b5426o8807D2309J33714i8313D0985L0178
$$ plain form
16131 71163 34095 -11542 112644 47734 212832 39486 -67956 -175836 87310 -109042 -23486
16119 114686 93062 163100 126559 124507 -81162 69365 95145 -178341 -129889 -81186 -267048
16108 -267048 -5421 9875 285734 101529 66746 124719 153835 466001 -67227 176709 -95709
16096 -70118 -203132 -112253 247624 59269 -83567 -257553 4398 -5787 -147971 44884 135580
16085 135580 -115888 438943 188051 -172933 -104840 -242200 -176145 186051 -12109 -65374
16075 -65374 -153841 -107347 -287611 -107047 -151942 163610 278541 2739 -35714 47677 120567
16064 120567 -377478 324055 -364263 360787 -43252 -57032 213002 -261446 -4693 -39204
16054 -39204 -430171 178896 27218 13690 -185953 127669 -85567 11493 38520 -192504 -144329
$$ packed form
16131G1163C4095a1542A12644D7734J65098C9486f7956j07880H7310a09042b3486
16119A14686k1624P0038l6541k052h1162F9365K5780a78341M8452M8703j85862
16108b67048e421I875K75859A01529l4783N7973K9116L12166f7227A76709i5709
16096g0118j33014R0879B47624E9269h3567j73986D398e787j42184D4884R0696
16085A35580a15888D38943A88051a72933O8093j37360O6055A86051a2109n3265
16075f5374q8467M6494j80264a07047m4895A63610J14931B739c5714D7677P2890
16064A20567c77478C24055c64263C60787d3252j3780B13002b61446d693l4511
16054c9204l90967A78896B7218j3528a85953A27669h5567A1493K7027a92504M8175
$$ plain form
16043 -144329 -266017 -263950 289296 -19864 57635 -295219 -101995 -68331 32909 -47647 74229
16031 -95697 112767 -49303 -126783 -388351 -144349 -722 -60594 -13593 -46905 -158639 -49276
16019 -260333 -111333 -6212 93933 185468 -143731 -493090 -352505 233115 -60482 -280774
16009 -280774 22529 120325 -113256 -276076 -24808 94668 154557 -19700 -183838 -189820 20129
15997 -93174 -252438 -198359 -205344 -162454 111836 230771 118889 -181424 -69546 124417 -152554
15985 122485 43473 111489 305016 869913 319883 212009 220964 224908 -234499 96149 -43526
15973 227336 -54140 -178089 186310 169345 17744 -108983 272548 131453 59075 262066
15963 262066 -49091 66069 16115 9685 97064 294518 -68819 3412 -118881 -102769 -6441 -58360
$$ packed form
16043a44329j21688K067B89296a9864E7635b95219a01995L3664C2909d7647G4229
16031i5697A12767d9303p7480k61568a44349g22n9872a3593l3312j11734d9276
16019b60333a11333f212I3933R1535a43731l49359J40585B33115f0482k20292
16009b80774B2529R7796a13256j62820b4808I4668N9889a9700j64138n982B0129
15997i3174j59264N4079o985M2890A11836J18935j11882a81424f9546A24417a52554
15985A22485D3473O8016J93527N64897C19883j07874Q955L944b34499I6149d3526
15973B27336e4140j23949A86310j6965A7744a08983B72548A31453E9075K02991
15963B62066d9091F6069A6115o430Q7379J97454f8819C412a18881J6112f441n1919
$$ plain form
15951 -58360 -86450 -396431 -185662 -30149 -142905 -29448 -175279 -65806 83878 -299776 -13612
15939 -248514 78198 -114664 -315689 -107951 -227572 -229174 15299 -64056 -404452 -2409 -96338
15928 -96338 40802 -143889 -176673 -33353 165392 -196370 159384 -271877 -174112 555013
15917 98299 -186022 -345589 106593 -40537 242682 -95758 -63414 52894 -142038 -63240 107114
15905 -89175 -294184 160491 -35671 -101402 -97035 -174819 124972 140181 10205 -43937 -105853
15894 -105853 -11867 -126565 38353 36458 -15021 375706 211539 -96872 -107332 -71137 256033
15882 -73189 28336 -115773 -177173 -85454 -179737 -3964 -365811 32759 147640 205540 -165456
15870 159373 63442 -156374 -55101 -104829 289200 -73856 -24333 -162584 75714 -293679 272997
$$ packed form
15951e8360k8090l09981a85662c0149j12756b9448j45831f5806H3878b99776a3612
15939b48514G8198a14664k01025a07951j19621j602A5299f4056l40396b409r3929
15928i6338D0802a43889l2784c3353A65392a96370A59384b71877R7765E55013
15917I8299a86022j59567A06593d0537B42682i5758L2344E2894a42038f3240A07114
15905h9175k05009A60491c5671o5731M367p7784A24972J5209A0205d3937o1916
15894a05853a1867j14698C8353j895a5021C75706j64167i6872j0460L6195B56033
15882g3189B8336a15773o1400h5454r4283c964l61847C2759J14881N7900a65456
15870A59373F3442a56374e5101m9728B89200g3856b4333j38251G5714b93679B72997
$$ plain form
15858 -48190 -9588 207830 170094 155131 56297 14339 -269886 84464 292691 145178 -45419
15846 -16353 -193667 118210 196768 258854 -93007 -40002 -41250 -365000 130595 67544 -24960
15834 -24716 -176137 -102942 -81336 100774 337199 -194664 -155811 79139 -38885 -330492 48616
15822 27054 -38451 127030 -27913 383623 192597 -421987 31921 -63138 -4800 -305034 -116594
15810 52618 120054 -61499 -365607 -110245 -290853 -199436 84319 -50795 -79311 -16168 -98599
15799 -98599 300420 25547 -20253 66773 179600 234737 109401 65226 209441 110592 342994
15788 342994 -129752 89397 -168072 189479 25302 -128912 102828 -234607 -157969 94225
15777 -134137 244803 44264 238972 -350673 286053 -180326 78798 -47932 185824 137982
$$ packed form
15858d8190i588B07830l7736j4963E6297A4339b69886H4464K08227A45178d5419
15846a6353j77314A18210P8558O2086i3007d0002j248l23750A30595o3051b4960
15834b4716j51421P3195K1606A00774K36425a94664L8853G9139c8885k91607D8616
15822B7054c8451A27030b7913C83623j91026d21987C1921f3138d800l00234a16594
15810E2618O7436f1499l04108a10245j80608R1417H4319e0795k8516a6168q2431
15799i8599C00420B5547b0253F6773J12827N5137A09401m4175J44215r8849K32402
15788C42994a29752H9397a68072A89479B5302a28912A02828b34607P6638I4225
15777a34137B44803D4264J94708c50673B86053a80326G8798d7932A85824m7842
$$ plain form
15767 137982 -72973 41613 -275558 -58322 101964 79729 159345 -236975 155740 -9100 340682
15755 -47247 95525 -57016 -15583 -10056 188786 -28049 -67087 -242878 181115 -95563 130094
15743 146789 -214487 17041 82126 131903 -71155 -4226 6500 -69981 127097 334821 154935
15731 -106801 -167852 -61907 -142735 106509 144314 -91188 -214779 -232184 -11629 -12908 154809
15719 -206159 -120822 -180999 -301698 -222056 67814 2790 258813 -11759 160989 -179146 908
15707 -7609 -96098 -81132 -355986 11419 -68202 -113081 -324928 -58224 -265903 50396 -61890
15695 8782 -164202 146692 -74899 198782 95954 120565 -65070 -33131 -233766 58223 14958
15683 -347877 -102068 -94427 -102744 -168750 5797 119959 -358809 47021 215635 150568 89586
$$ packed form
15767A37982g2973D1613b75558e8322A01964k2235P9616b36975A55740i100C40682
15755d7247I5525e7016a5583N527A88786b8049l9038j75791A81115i5563A30094
15743A46789b14487A7041O5085M9777g1155d226F500f9981A27097K07724A54935
15731a06801o1051f1907q0828A06509L7805i1188j23591j7405a1629j279A54809
15719b06159Q5337o0177j20699P9642F7814B790K56023a1759A60989a79146I08
15707g609q8489J4966k74854A1419f8202m4879k11847e8224k07679E0396f1890
15695H782a64202A46692g4899A98782I5954K4611f5070L1939k00635E8223A4958
15683c47877a02068P641q317o6006E797J14162c58809D7021J68614o5067o0982
$$ plain form
15672 89586 -74238 -73058 -46310 -209944 -12094 -326 208542 -12096 -159304 -6881 73205 -303138
15659 -374426 -204928 165480 -260644 -14001 144272 202616 -194636 8858 145738 -186332
15648 -77224 -207089 -89696 -52545 209011 -77132 11918 -22636 61457 -21640 -115427 -2843
15636 75830 23187 -16734 101396 -379782 194886 119649 17775 -137956 22276 290450 -6225
15624 99698 -83038 -20193 249809 157912 20746 -105578 182244 326851 98489 -153796 -38835
15612 -97685 -288661 -159280 166573 -7052 76797 -81667 -207048 1190 -17814 448106 -58919
15600 -150118 -50783 -18007 -87035 71985 196823 -229460 82865 -135670 -37758 202377 22256
15588 180429 318603 4264 326499 188352 -230525 113728 -117688 -125051 -318522 127987
$$ packed form
15672H9586g4238J180K6748j63634a2094c26B08542a2096j47208f881G3205c03138
15659c74426J69498A65480b60644a4001A44272N8344a94636H858J36880a86332
15648g7224j29865h9696L7151B09011g7132A1918b2636F1457b1640r3787b843
15636G5830B3187a6734A01396c79782A94886p5237A7775a37956B2276K68174f225
15624I9698h3038b0193B49809r1897B0746a05578A82244J44607I8489a53796c8835
15612i7685j90976J29381A66573g052G6797h1667j25381A190a7814D48106e8919
15600a50118e0783a8007o9028G1985J24838b29460H2865a35670c7758B02377B2256
15588A80429J38174D264L22235j38147b30525A13728a17688p363j93471A27987
$$ plain form
15577 96257 372692 -171484 148016 -77067 72739 -102103 25722 -29579 -93097 142532 -277171
15565 241394 20615 58216 269752 -133484 222048 201009 -9918 -80340 294886 -150158 -127786
15554 -127786 389799 -210212 -62237 170034 17120 58896 -135757 -85320 -305317 55888
15543 -140683 -72909 -32414 9507 88958 41364 -151152 64545 136384 96434 54384 -109344
15531 -311748 -9491 -118494 -18075 196763 -90406 122521 123309 -79942 -268049 -181072 152580
15519 -47375 -450091 112 -13302 154174 48714 -112782 -274955 324425 -32681 -60509 84290
15507 100428 -22888 -82057 -85092 413359 -131902 128065 -151977 168717 -93791 203546
15496 297463 188568 -69511 91548 312587 -150663 175725 -36119 -210767 53552 -25346
$$ packed form
15577I6257K76435a71484A48016g7067G2739a02103B5722b9579o3518A42532b77171
15565B41394B0615L7601K11536a33484B22048k1039i918p0422B94886a50158K2372
15554a27786C89799b10212f2237A70034A7120M1776a35757N0437k19997E5888
15543a40683O7774c2414I507P9451D1364a51152F4545P1839l9950m2050a09344
15531c11748i491j09003a8075A96763i0406A22521P88g9942j88107Q6977A52580
15519d7375m02716A12a3302A54174D8714a12782j62173C24425c2681k7828H4290
15507A00428b2888n9169l035D13359a31902A28065a51977A68717i3791B03546
15496B97463j08895f9511I1548K21039a50663A75725c6119j74648E3552b5346
$$ plain form
15485 -139780 117963 -70076 172478 -209234 -24108 -205681 -195237 143782 -30271 -11711
15474 170554 259663 -41858 309011 -178341 156379 182910 -32494 5300 -137559 -104104 -44284
15462 21300 -343296 72903 -247116 98038 235121 76453 220972 -245954 -42774 -96765 87476
15450 -103996 -156344 -121276 -290794 187947 109964 -11303 194291 199979 393123 -108864 12036
15438 299002 -205921 22248 165679 20457 309770 -109446 133685 225397 -228226 314588
15427 -163432 -241282 28313 -137496 -210291 12322 -465354 -77472 -433793 -286690 -228267 -20399
15415 55659 2907 406838 151183 -339685 1351 102238 78651 -630 57651 -18959 225618
15403 -98457 74257 97371 -55251 19752 192918 85205 -17024 15875 30294 -3879 -50276 -459020
$$ packed form
15485a39780A17963g0076A72478b09234b4108j81573J0444A43782c0271a1711
15474A70554Q9109d1858C09011a78341A56379K6531c2494E300a37559L3455d4284
15462B1300c43296G2903b47116I8038J37083G6453J44519b45954d2774n3991H7476
15450a03996n2348L5068j69518A87947p7983a1303A94291N688J93144a08864A2036
15438B99002b05921B2248J43431B0457K89313a09446A33685R1712b28226C14588
15427a63432p7850B8313a37496p2795A2322d65354g7472l56321J47103N8423b0399
15415E5659B907M03931A51183c39685A351J00887k3587f30E7651a8959B25618
15403i8457G4257K3114e5251A9752J73166H5205a7024A5875J4419c879m6397m08744
$$ plain form
15391 -459020 191317 -70200 45142 13948 3835 -148516 198665 55814 243679 133752 -86313
15379 51443 -21272 -70227 -11673 -43642 306149 -37444 -95917 -316129 137606 -201518 -93711
15367 -15028 -27357 -3215 130152 -124572 -112266 88971 -426785 -142914 279760 36283 -36749
15355 -37578 70379 212930 -137933 297954 -14385 -5838 114117 -65747 37572 58793 -212241
15343 214976 -143807 -71171 -349433 -1264 410380 118932 12409 -412515 11826 68528 114268
15332 114268 51188 146987 89379 56915 90105 -11904 250785 196131 48652 56280 9149 -107281
15319 -106461 -166975 -27629 -19009 177409 178410 417573 63783 280514 73500 -26053 58787
15307 131125 197513 216624 -54723 288881 -85479 -151837 -140738 -28066 109093 -204491 172426
$$ packed form
15391d59020A91317g0200D5142A3948C835a48516A98665E5814J87865j09927h6313
15379E1443b1272m8955a1673l1969C06149c7444n8473k20212A37606b01518i3711
15367a5028j2329c215A30152a24572J2306H8971d26785a42914B79760C6283c6749
15355c7578G0379J42551a37933B97954a4385e838A14117f5747C7572K1221b12241
15343B14976a43807g1171k78262a264D10380A18932A2409d12515A1826N6702M5740
15332A14268E1188R5799n7608l2464L3190a1904B50785n4654D8652P628I149a07281
15319a06461o0514b7629Q620A77409J001K39163F3783K16731G3500b6053E8787
15307A31125O6388J9111e4723B88881h5479o6358J1099b8066A09093b04491A72426
$$ plain form
15295 -36160 358400 184999 378979 7923 149089 87756 336815 -221212 187883 361796
15285 361796 88734 -119975 -99349 245514 18900 391348 270565 -196231 108368 -6898
15274 54635 29011 -272054 -190333 375669 -339495 -15227 227636 -103174 195027 170116
15264 170116 -35672 52922 176245 -113943 -48503 -85434 229036 -116414 377144 281552
15254 281552 -33164 288312 206974 200815 159636 524380 1254125 1748862 1460649 1413867 1578403
15243 1578403 355841 487657 133858 203935 259619 12658 85669 303612 90297 52234
15233 52234 156316 248281 -3788 101594 335249 104189 -102861 61202 48673 -74364 474024
15221 109743 37828 -187871 -220000 49203 -51991 -65298 50396 13255 -385411 310135 47592
$$ packed form
15295c6160C58400j73401J93980G923J41166o1333K49059b21212A87883J73913
15285C61796H8734a19975K0626B45514A8900L72448j20783a96231A08368f898
15274E4635k5624b72054Q1721C75669c39495a5227B27636a03174A95027k4911
15264A70116c5672E2922J23323a13943d8503l6931B29036a16414C77144r5592
15254B81552c3164B88312q1338o159m1179L64744P29745M94737k88213m6782J64536
15243A578403C55841J31816A33858P0077N5684A2658P3011K17943I0297l8063
15233E2234J04082R1965c788A01594K33655A04189a02861F1202j2529g4364D74024
15221A09743C7828a87871l2129D9203e1991j3307E0396A3255c85411C10135D7592
$$ plain form
15209 82753 -131692 192263 346575 24924 -167421 271320 -100400 66291 71458 -45134 327466
15197 -76645 32689 -275036 -4152 63416 373541 246377 147806 14330 45257 267341 -100412
15185 -27807 278984 -165763 370719 -58912 -67098 94751 -247835 11478 87413 -146851 97224
15173 19625 233734 129519 -141353 155116 137901 112544 472610 72972 443536 163746
15162 -22922 162891 82624 146092 165647 375599 59056 15962 159606 223675 -52068 158492
15150 130871 180181 200818 -21061 274736 -22584 202190 121051 -59124 -60249 210296 276345
15139 276345 -15268 -180881 128049 -23487 -44358 -9483 107101 310065 -169824 -149542 212360
15127 -14172 108125 333296 180591 155719 230988 -102535 292523 66324 207920 6637 128274
$$ packed form
15209H2753a31692A92263J54312B4924a67421B71320a00400F6291N167d5134C27466
15197g6645C2689b75036d152F3416L10125j27164r8571A4330L0927K22084a00412
15185b7807B78984a65763C70719e8912q186I4751b47835A1478P5935a46851I7224
15173A9625K14109j04215a41353A55116j7215k5357L60066G2972L70564A63746
15162b2922A62891q0267O3468J9555K09952E9056A5962J43644O4069e2068A58492
15150A30871M9310K0637b1061B74736b2584B02190q1139e9124j125B10296O6049
15139B76345a5268j65613A28049b3487k0871i483A07101K02964a69824K0282B12360
15127a4172A08125K25171j52705k4872P5269a02535B92523F6324J41596F637J21637
$$ plain form
15116 128274 154622 -129070 -4560 186030 -34911 216495 145523 6391 61191 -84777 26929
15104 211194 45579 189172 206890 253789 224884 188950 59095 203415 138836 275747 222274
15093 222274 372193 84799 -88930 279515 139233 -119049 222923 -31276 -35578 105977
15082 267276 271858 77668 114471 321157 105673 64137 251838 4751 331570 88963 408389
15071 408389 159286 347393 133635 236726 -318291 286260 -66119 35563 56626 210427
15061 210427 213456 410979 27941 184629 -157797 -36345 306836 471969 247232 248664 55167
15049 63773 73438 -106705 353995 225086 177340 41126 321979 325469 104437 73920 121763
15038 121763 124657 319069 21760 167051 -115106 113800 -49913 233617 269592 452006
$$ packed form
15116A28274K6348a29070d560A86030c4911B16495p0972F391N4800h4777B6929
15104B11194D5579J43593J7718M6899k8905l5934E9095J44320o4579J36911n3473
15093B22274J49919H4799h8930B79515A39233a19049B22923c1276m302A05977
15082B67276M582G7668L6803K06686A05673m1536J87701D751L26819H8963L19426
15071D08389A59286J88107A33635J03091c18291B86260f6119C5563K1063J53801
15061B10427L029J97523B7941J56688a57797c6345C06836J65133k24737J432E5167
15049F3773R665a06705C53995j28909m7746D1126K80853L490A04437l0517M7843
15038A21763K894J94412B1760J45291a15106A13800d9913B33617L5975J82414
$$ plain form
15028 452006 128152 25455 126688 21834 198460 127244 377556 184701 395390 427747
15018 427747 -69812 158495 82107 -138639 -112304 536680 7602 28959 107676 188602 214974
15007 214974 525563 183770 297137 364814 11003 127919 340157 421684 335005 -21999
14996 -160317 256713 -73867 563764 308510 12324 150521 159697 251214 93488 382018 -42290
14984 -24119 68082 371688 25979 330573 61141 238022 279680 214445 447430 273270 209339
14973 209339 465836 191250 186941 373336 480130 208976 461701 426606 162548 41130
14962 369140 259129 -6998 537675 449854 614857 319023 158526 36166 191087 196203 516283
14951 516283 385597 465423 149282 149783 16217 21494 457039 -25599 376152 282506 517318
$$ packed form
15028D52006A28152B5455J01233B1834J76626p1216K50312A84701K10689L2357
15018D27747f9812A58495p6388a38639K6335E36680G602K1357P8717Q0926K6372
15007B14974L10589A83770J13367O7677A1003J16916K12238Q1527q6679b1999
14996a60317B56713g3867E63764k55254A2324J38197R176R1517I3488K88530d2290
14984b4119F8082L03606B5979L04594F1141J76881M1658o5235K32985j74160o3931
14973B09339K56497A91250m309J86395J06794B08976K52725l5095A62548D1130
14962C69140j10011f998E37675q7821J65003k95834A58526C6166J54921N116L20080
14951E16283j30686P9826A49282N01A6217N277M35545b5599C76152r3646K34812
$$ plain form
14940 517318 320063 605312 287581 281362 720664 629208 215609 319519 170412 437514
14930 437514 278363 131383 -93071 513182 331429 597931 670254 293997 298707 258471
14920 258471 519722 79532 -55760 146395 234183 328738 144771 31900 432814 307321
14910 307321 565480 255724 326803 627739 380271 357371 258710 466643 -43167 598602
14899 344518 85325 340846 336617 205478 463147 358679 329215 214875 112851 485968
14889 485968 685459 260911 639539 550985 -123948 419897 656959 523604 348176 47518
14878 82092 269600 384623 516054 213065 664024 94214 361592 397013 219587 394238
14868 394238 278849 316508 588853 544959 372484 539049 271616 681895 284422 240497
$$ packed form
14940E17318j97255K85249B87581o219M39302r1456B15609J03910j49107K67102
14930D37514j59151A31383i3071E13182j81753K66502P2323B93997M710m0236
14920B58471K61251G9532e5760A46395Q7788R4555A44771C1900M00914j25493
14910C07321K58159B55724P1079L00936k47468k2900r8661K07933d3167E98602
14899C44518H5325K55521m229j31139K57669j04468k9464j14340j02024L73117
14889D85968J99491B60911L78628q8554a23948D19897K37062j33355j75428D7518
14878H2092J87508J15023J31431B13065M50959I4214K67378L5421j77426J74651
14868C94238j15389L7659K72345m3894j72475J66565k67433M10279B84422m3925
$$ plain form
14858 240497 391336 381940 278017 302161 461415 173012 725174 504008 474167 544153
14848 544153 613566 335044 262159 518815 235349 385742 396886 479703 286232 619437
14838 619437 734662 565960 735460 607341 478652 522250 656714 637460 318343 664726
14828 664726 612988 591686 222804 576642 297225 737889 432563 725981 495380 312342
14818 312342 415666 451226 672112 696711 555725 376200 445372 556633 693614 537337
14808 537337 755871 380296 372566 282175 725465 696881 619610 606971 662954 254378 301606
14797 301606 806550 381711 514628 526521 452335 460503 454244 431154 417616 562033 579876
14786 579876 105537 603192 786422 410336 650878 461972 942067 421556 869261 149751
$$ packed form
14858B40497J50839r396j03923K4144J59254A73012N52162k21166k9841O9986
14848E44153O9413k78522p2885K56656B35349J50393J1144Q2817j93471L33205
14838F19437J15225j68702J69500j28119j28689M3598J34464j9254C18343L46383
14828F64726n1738k1302B22804L53838k79417M40664l05326K93418k30601j83038
14818C12342J03324L5560K20886K4599j40986j79525O9172J11261J36981j56277
14808E37337K18534l75575p730r0391M43290k8584p7271j2639N5983B54378M7228
14797C01606N04944C81711J32917J1893p4186Q168o259k3090j3538J44417J7843
14786E79876A05537M97655J83230l76086K40542j88906M80095D21556M47705A49751
$$ plain form
14775 667625 767109 701696 725215 454659 636032 455502 494496 853027 324157 333245 758049
14764 758049 776301 661203 554926 617577 305721 757699 335701 446502 720970 809359
14754 809359 711141 695726 940043 656246 648905 718158 519643 644519 539976 776776
14744 776776 631985 722812 861148 689977 725491 940978 931356 710239 922196 785250
14734 785250 999964 816563 676400 490962 841338 868524 977049 580108 792785 633874
14724 633874 593432 1020412 602956 954683 710164 759303 409569 890808 725202 574610
14714 574610 849854 1035964 805382 851628 699160 942634 841275 1007884 1102871 799373
14704 799373 1078429 752625 780635 1006456 1109061 1119495 611493 936660 1230118 1004663
$$ packed form
14775F67625R9484o5413K3519k70556J81373j80530L8994L58531C24157R088M24804
14764G58049J8252j15098j06277O2651C05721M51978C35701J10801K74468Q8389
14754H09359r8218j5415K44317k83797p341O9253j98515J24876j04543K36800
14744G76776j44791R0827J38336j71171L5514K15487r622k21117K11957j36946
14734G85250K14714j83401j40163j85438L50376K7186J08525l96941K12677j58911
14724F33874m0442M26980m17456L51727k44519M9139l49734M81239j65606j50592
14714E74610K75244J86110k30582M6246j52468K43474j01359J66609R4987l03498
14704G99373K79056l25804K8010K25821J02605J0434n08002L25167K93458k25455
$$ plain form
14694 1004663 927124 746965 1002648 752221 1068988 699975 767349 1452662 1512882 1345526
14684 1345526 1070187 1228576 921370 1090155 528668 1118640 1027324 846493 623709 1266233
14674 1266233 1266514 852347 1154370 926127 1030177 1041052 1057185 1185708 1068032 1069214 1183533
14663 1183533 1234758 1174363 992183 1268283 1267444 1113556 1186561 1232737 1051619 1162547 1463192
14652 1463192 1209477 1267511 1318069 1231768 1240855 1119767 962791 1437668 1385975 1447867 1288749
14641 1288749 1162987 1460949 1627046 1428358 1417386 1472237 1288275 1356819 1589517 1659162
14631 1659162 1285858 1059421 1073885 1362048 1235406 1428613 1540591 1306310 1493034 1531073
14621 1531073 1206479 1457232 1435966 1462791 1316199 1461552 1200367 1541416 1553062 1704401
$$ packed form
14694A004663p7539j80159K55683k50427L16767l69013O7374O85313O0220j67356
14684A345526k75339J58389l07206J68785E28668N89972r1316j80831k22784O42524
14674A266233K81m14167L02023k28243J04050J0875J6133J28523j17676J182J14319
14663A183533N1225o0395j82180K76100q39j53888P3005M6176j81118J10928L00645
14652A463192k53715N8034N0558q6301R087j21088j56976M74877n1693O1892j59118
14641A288749j25762K97962J66097j98688j0972N4851j83962O8544K32698O9645
14631A659162l73304k26437J4464K88163j26642J93207J11978k34281J86724L8039
14621A531073l24594K50753k1266K6825j46592J45353k61185L41049J1646J51339
$$ plain form
14611 1704401 1686693 1407808 1475871 1481400 1673726 1680104 1830187 1532549 1886207 1781367
14601 1781367 1627906 1663603 1994648 1883987 1464698 1824271 1735988 1500898 2117097 1952350
14591 1952350 1879015 1899976 1927874 2243154 2078116 1686440 2099753 2025860 2202584 1900841
14581 1900841 1932716 2078382 2251676 2319012 2365773 2108895 2330009 2340803 2114479 2092186
14571 2092186 2109127 2281769 2547092 2275609 2485353 2520089 2651227 2448213 2858654 2683278
14561 2683278 2699467 2832183 2680574 2909935 2705908 3153246 3227677 3443126 3969412 4322802
14551 4322802 4680351 5465382 7139226 10347055 18099928 35294927 46488913 26060334
14543 26060334 14071774 6388415 4143628 3325927 2953909 2084645 2410258 2478710 2299427
$$ packed form
14611A704401j7708k78885O8063N529J92326O378J50083k97638L53658j04840
14601A781367j53461L5697L31045j10661m19289L59573q8283k35090O16199j64747
14591A952350p3335K0961K7898L15280j65038l91676M13313p3893J76724l01743
14581A900841L1875J45666J73294O7336M6761k56878K21114J0794k26324k2293
14571B092186J6941J72642K65323k71483K09744L4736J31138k03014M10441j75376
14561B683278J6189J32716j51609K29361k04027M47338P4431K15449N26286L53390
14551D322802L57549P85031J673844L207829P752873J7194999J1193986k0428579
14543B6060334j1988560F388415k244787q17701l72018q69264L25613O8452j79283
$$ plain form
14534 2299427 2133822 2387500 2084090 2226345 2416947 2365057 2288527 1917543 2462143 2516250
14524 2516250 2600018 2756252 2665625 2417523 2728629 2589128 2660966 2987788 3120953 2800056
14514 2800056 2673562 2835369 2843834 2978422 2833301 2753514 3012756 3188079 3156267 3287633
14504 3287633 3573524 3302844 3070250 3361504 3177439 3436702 3038027 3412043 3601577
14495 3601577 3406540 3437472 3717049 3715625 3615829 3690760 3888316 3270786 4078847 4012986
14485 4012986 3732350 4128903 3924974 4101491 4070554 4111089 4012205 4083425 4333533 4339294
14475 4339294 4118245 4432448 4270876 4403620 4610950 4592877 4532867 4589101 4656170 4423401
14465 4423401 4936660 5027894 4693313 4926476 4552687 4959120 5587240 5123442 5085653 5268295
$$ packed form
14534B299427j65605K53678l03410J42255J90602n1890p6530l70984N44600N4107
14524B516250Q3768J56234r0627k48102L11106j39501P1838L26822J33165l20897
14514B800056j26494J61807Q465J34588j45121p9787K59242J75323l1812J31366
14504C287633K85891k70680k32594K91254j84065K59263l98675L74016J89534
14495C601577j95037L0932K79577j424r9796P4931J97556o17530Q08061o5861
14485D012986k80636L96553k03929J76517l0937M0535r8884P1220K50108N761
14475D339294k21049L14203j61572J32744K07330j8073o0010N6234O7069k32769
14465D423401N13259R1234l34581K33163l73789M06433O28120m63798l7789J82642
$$ plain form
14455 5268295 5215892 5529087 5418137 5733278 5687007 5712557 5593881 5644135 6140404 5692109
14445 5692109 6095833 6049432 6154569 5917961 6301427 6233872 6428820 6581248 6594871 6641810
14435 6641810 6492525 6955443 7054623 7300222 7054891 7071716 7344244 7615546 7458940 7576404
14425 7576404 7921518 7806332 8126903 8106464 8191641 8145492 8477492 8670231 8894153 9051474
14415 9051474 8840510 8996049 9117238 9231557 9204116 9511659 9205032 9478899 10054458 10274694
14405 10274694 10097629 10146250 10626425 10722311 11010339 10898200 11212101 11472890 11649073 11608104
14395 11608104 11786159 12234358 12431037 12364449 12478473 13034122 13024897 13511370 13215459 13781655
14385 13781655 13904434 14285547 14498611 14810890 15473180 15351890 15538118 15768660 16145126
$$ packed form
14455E268295n2403L13195j10950L15141m6271K5550j18676N0254M96269m48295
14445E692109M03724m6401J05137k36608L83466o7555J94948J52428J3623M6939
14435F641810j49285M62918R9180K45599k45331J6825K72528K71302j56606J17464
14425G576404L45114j15186L20571k0439Q5177m6149L32000J92739K23922J57321
14415I051474k10964J55539J21189J14319k7441L07543l06627K73867N75559K20236
14405A0274694j77065M8621M80175R5886K88028j12139L13901K60789J76183m0969
14395A1608104J78055M48199J96679o6588J14024N55649r225M86473k95911N66196
14385A3781655J22779L81113K13064L12279O62290j21290J86228K30542L76466
$$ plain form
14376 16145126 16337225 16988100 16990724 17617101 17765112 18151883 18805072 19032935 19516568 20039884
14366 20039884 20303400 20706590 21287448 21376152 21967695 22414540 22990078 23868162 24259572
14357 24259572 24436158 24838062 25755479 26065240 27058602 27614506 28080773 29164684 29572036
14348 29572036 30089617 31200786 31790181 32475535 33272867 34419824 34869609 36495643 37149412
14339 37149412 38489439 39193421 40481873 41743359 42415794 43918985 45095980 46862398
14331 46862398 47624744 49231212 50839824 52909538 54463323 56138680 57776661 59999018
14323 59999018 62252839 64270127 66160369 68743073 70844456 73486105 76342116 78980477
14315 78980477 81993361 85149474 88458827 91875274 95577933 99528250 103901995 108302860
$$ packed form
14376A6145126J92099O50875K624O26377J48011L86771O53189K27863M83633N23316
14366B0039884K63516M03190N80858Q8704N91543M46845N75538Q78084L91410
14357B4259572J76586M01904R17417L09761R93362N55904M66267J083911M07352
14348B9572036N17581J111169N89395O85354P97332J146957M49785J626034O53769
14339C7149412J340027P03982J288452J261486O72435J503191J176995J766418
14331D6862398P62346J606468J608612K069714J553785J675357J637981K222357
14323E9999018K253821K017288J890242K582704K101383K641649K856011K638361
14315G8980477L012884L156113L309353L416447L702659L950317M373745M400865
$$ plain form
14307 108302860 112605694 117592306 122626022 128034697 133799613 139995837 146418799 153383451
14299 153383451 160638081 168127328 176137901 184749956 193724608 203471642 213698058 224335898
14291 224335898 235780594 247881029 260093415 272967625 286640560 300387412 314581865
14284 314581865 329538083 344486053 359333997 374320422 389176837 403845218 417151343
14277 417151343 430139475 441620378 451995890 460090163 465223577 466151465 465002816 463342737
14269 463342737 461376791 451921419 447909041 441587974 431857189 420227063 407464762 394127495
14261 394127495 380137680 366472281 352463786 337869095 322761134 308433743 293773216
14254 293773216 280425695 266632116 252934518 240095039 228226184 216512849 205700983
$$ packed form
14307A08302860M302834M986612N033716N408675N764916O196224O422962O964652
14299A53383451P254630P489247Q010573Q612055Q974652R747034J0226416J0637840
14291B24335898J1444696J2100435J2212386J2874210J3672935J3746852J4194453
14284C14581865J4956218J4947970J4847944J4986425J4856415J4668381J3306125
14277D17151343J2988132J1480903J0375512Q094273N133414R27888j148649j660079
14269D63342737j965946r455372m012378o321067r730785j1630126j2762301j3337267
14261C94127495j3989815j3665399j4008495j4594691j5107961j4327391j4660527
14254B93773216j3347521j3793579j3697598j2839479j1868855j1713335j0811866
$$ plain form
14247 205700983 195451993 185603059 177113478 168681374 161080908 153227640 146264380 139492268
14239 139492268 132760095 127394682 121973094 116321855 111492884 106459879 102354942 97945006
14231 97945006 94501746 91063447 87313730 83648398 80800756 77469175 74686518 71761034
14223 71761034 69165409 66903802 64892980 62293925 60583861 58615690 56244374 54251321
14215 54251321 52889326 51208749 49974990 48369392 46858559 45184590 43945584 42665443
14207 42665443 42248140 41118854 39559838 38542496 37262989 36374867 35472991 35185911 34003152
14198 34003152 32873413 32132526 31206122 30370958 29700121 29171513 28211904 27469442 26962634
14189 26962634 26418376 25782046 25236179 24665148 23872092 23270134 23222322 22668051 22031725
$$ packed form
14247B05700983j0248990r848934q489581q432104p600466p853268o963260o772112
14239A39492268o732173n365413n421588n651239m828971n033005m104937m409936
14231I7945006l443260l438299l749717l665332k847642l331581k782657k925484
14223G1761034k595625k261607k010822k599055j710064j968171k371316j993053
14215E4251321j361995j680577j233759j605598j510833j673969j239006j280141
14207D2665443m17303j129286j559016j017342j279507q88122r01876k87080j182759
14198C4003152j129739p40887r26404q35164o70837n28608r59609p42462n06808
14189B6962634n44258o36330n45867n71031p93056o01958m7812n54271o36326
$$ plain form
14180 22031725 21920161 20558691 20691671 20268223 20015755 19458570 19006222 18718793 18505973
14171 18505973 18029185 17560208 17349427 16775118 16626888 16210961 15980367 15586895 15601824
14162 15601824 15098760 14883812 14775799 14668254 14310194 14276195 13596713 13624038 13206400 12984706
14152 12984706 12763298 12673333 12367618 12175798 12051627 11713016 11849414 11394241 11004582
14143 11004582 11405968 10759081 10653642 10654404 10255974 10081311 9986043 10125013 9870906 9600991
14133 9600991 9263372 9293011 9432605 9278320 9023047 8700239 8748609 8378024 8542769 8176804
14123 8176804 8031647 8145240 8070344 8188781 7850237 8088135 7506799 7482942 7639261 7429549
14113 7429549 7342686 7271421 7197728 6768174 7166256 6794973 6610762 6592539 6251935 6506466
$$ packed form
14180B2031725j11564j361470J32980m23448k52468n57185m52348k87429k12820
14171A8505973m76788m68977k10781n74309j48230m15927k30594l93472J4929
14162A5601824n03064k14948j08013j07545l58060l3999o79482K7325m17638k21694
14152A2984706k21408q9965l05715j91820j24171l38611J36398m55173l89659
14143A1004582M01386o46887j05439P62l98430j74663r5268J38970k54107k69915
14133I600991l37619K9639J39594j54285k55273l22808M8370l70585J64745l65965
14123H176804j45157J13593p4896J18437l38544K37898n81336k3857J56319k09712
14113G429549q6863p1265p3693m29554L98082l71283j84211j8223l40604K54531
$$ plain form
14103 6506466 6427027 6455328 6473822 6096513 6036522 6040199 5939142 5905395 6057119 5660319 5537980
14092 5537980 5767686 5608485 5531764 5457450 5421671 5142018 5153016 5297094 5182161 5312936
14082 5312936 5003875 5021836 5027667 4691509 4417929 4763335 4854686 4856498 4483895 4721510
14072 4721510 4272197 4037413 4525752 4394790 4180756 4181514 4258841 4216512 4208440 3961921 4184469
14061 4184469 4192558 4013674 4136899 3960857 3989139 3996352 3728104 3534852 3820262 3643203
14051 3643203 3884003 3653567 3592301 3690841 3476543 3403859 3501526 3221965 3255067 3225040
14041 3225040 3244155 3257005 3174687 3168234 3020149 3276508 3226276 3150814 3184914 3242217 3112969
14030 3112969 3204626 3048225 2885107 3450604 3038534 2842204 2875044 2805358 2661591 2583420
$$ packed form
14103F506466p9439K8301J8494l77309n9991L677j01057l3747J51724l96800j22339
14092E537980K29706j59201p6721p4314l5779k79653J0998J44078j14933J30775
14082E312936l09061J7961N831l36158k73580L45406R1351J812l72603K37615
14072D721510m49313k34784M88339j30962k14034P58P7327m2329q072k46519K22548
14061D184469Q089j78884J23225j76042K8282P213k68248j93252K85410j77059
14051C643203K40800k30436o1266R8540k14298p2684R7667k79561L3102l0027
14041C225040J9115J2850q2318o453j48085K56359n0232p5462L4100N7303j29248
14030C112969R1657j56401j63118N65497m12070j96330L2840o9686j43767p8171
$$ plain form
14020 2583420 2710790 2559490 2820259 2343996 2848132 2491649 2596097 2524132 2721041 2290709
14010 2290709 2417633 2445933 2265868 2427660 2171261 2121948 2306555 2428945 2271006 2138688
14000 2138688 2169849 2136780 2233572 2117939 2300826 1939709 1953109 2096961 2233575 2374031
13990 2374031 2524401 3134487 5576334 11106017 26523883 46014934 29798024 16454810
13982 16454810 9741315 6508163 5454481 4848864 4152424 3945966 3305503 3490185 3191458
13973 3191458 2943118 2566886 2708264 3009479 2498409 2301676 2748808 2367045 2196133
13964 2196133 2131137 2349150 2169216 1969528 2077395 2359298 2016516 1902731 2077197 1788830
13954 1788830 2119697 1679335 1762008 2171946 2077558 1970636 1967475 1862624 1810491 1893563
$$ packed form
14020B583420J27370j51300K60769m76263N04136l56483J04448p1965J96909m30332
14010B290709J26924K8300j80065J61792k56399m9313J84607J22390j57939j32318
14000B138688L1161l3069R6792j15633J82887l61117J3400J43852J36614J40456
13990B374031J50370O10086K441847N529683J5417866J9491051j6216910j3343214
13982A6454810o713495l233152j053682o05617o96440k06458o40463J84682k98727
13973C191458k48340l76232J41378L01215n11070j96733M47132l81763j70912
13964B196133o4996K18013j79934j99688J07867K81903l42782j13785J74466k88367
13954A788830L30867m40362Q2673M09938r4388j06922l161j04851n2133Q3072
$$ plain form
13944 1893563 1982616 1911126 1861898 1954016 2192621 1851080 1424188 1862318 1762694 1643785
13934 1643785 1880673 1685219 1697474 1831849 1922797 1943673 1354855 1776595 2069631 1516870
13924 1516870 1896925 1697629 1782259 1354955 1376268 1359216 1749059 1908007 1555933 1287643
13914 1287643 1584238 1365862 1824957 1175553 1702551 1806840 1645767 1507451 1581719 1197603
13904 1197603 1374868 1182218 1541999 1224297 1000733 1377328 1381631 1533947 1437375 1246205
13894 1246205 1325519 1463361 1450332 1170440 1460185 1393410 1237253 1324505 1284906 1380056
13884 1380056 1479276 1075465 1240364 1090342 1187494 1321179 1348376 1133428 908196 1305098
13874 1305098 1098723 1115577 1201048 1268273 1147243 1362593 1055090 1178495 963127 965840
$$ packed form
13944A893563Q9053p1490m9228R2118K38605l41541m26892M38130r9624j18909
13934A643785K36888j95454J2255J34375R0948K0876n88818M21740K93036n52761
13924A516870L80055j99296Q4630m27304K1313j7052L89843J58948l52074k68290
13914A287643K96595k18376M59095o49404N26998J04289j61073j38316P4268l84116
13904A197603J77265j92650L59781l17702k23564L76595M303J52316r6572j91170
13894A246205P9314J37842j3029k79892K89745o6775j56157Q7252l9599R5150
13884A380056R9220m03811J64899j50022R7152J33685K7197k14948k25232L96902
13874A305098k06375J6854Q5471O7225j21030K15350l07503J23405k15368K713
$$ plain form
13864 965840 1346312 1171339 1293183 1287856 1210105 1120309 929804 1097035 1305590 970149
13854 970149 1325845 885332 886325 871783 821211 975395 1133133 1136698 888314 1021083 844053
13843 844053 1014741 1164536 1042441 972257 931974 1095517 1376967 726257 685237 845954
13833 845954 866599 1389973 1148244 1416342 1219632 721402 766599 863147 848016 894565
13823 894565 883025 960925 795883 857811 506296 1110200 920322 806546 1040147 925665
13813 925665 1131064 918676 1081947 1061968 1027783 707613 885617 776446 1086530 829164
13803 829164 914866 849562 729165 949420 864614 729662 753146 718764 907065 964851 704470
13792 704470 675391 730118 740319 776286 560985 512112 659981 811921 711130 638413 642896
$$ packed form
13864I65840L80472j74973J21844n327p7751q9796j90505J67231K08555l35441
13854I70149L55696m40513R93j4542n0572J54184J57738L565k48384J32769j77030
13843H44053J70688J49795j22095p0184m0283J63543K81450o50710m1020J60717
13833H45954K0645N23374k41729K68098j96710m98230M5197R6548j5131M6549
13823H94565j1540P7900j65042O1928l51515O03904j89878j13776K33601j14482
13813I25665K05399k12388J63271j9979l4185l20170J78004j09171L10084k57366
13803H29164Q5702o5304j20397K20255q4806j34952K3484l4382J88301N7786k60381
13792G04470k9079N4727J0201L5967k15301m8873J47869J51940j00791p2717M483
$$ plain form
13781 642896 886129 799930 616157 1116877 710193 894713 536200 669382 805705 465274
13771 465274 923002 606547 847655 609886 906146 555113 706462 779574 719601 765435
13761 765435 485905 650197 538960 527331 571119 586776 500346 822112 550376 691545
13751 691545 913890 598271 483543 812594 644519 460287 869936 649998 685760 807279
13741 807279 489746 557641 607941 449700 702431 743504 680155 815776 1067313 592037
13731 592037 482721 780842 792928 606120 676999 375150 913287 609062 599375 529730
13721 529730 530998 422468 505878 243571 478004 537326 544519 564753 999625 547435 557883
13710 557883 275986 601273 783205 391077 511263 809586 318074 426143 293469 424382
$$ packed form
13781F42896K43233q6199j83773N00720m06684J84520l58513J33182J36323l40431
13771D65274M57728l16455K41108k37769K96260l51033J51349P3112n9973M5834
13761G65435k79530J64292j11237j1629M3788J5657q6430L21766k71736J41169
13751F91545K22345l15619j14728L29051j68075j84232M09649k19938L5762J21519
13741H07279l17533O7895N0300j58241K52731M1073o3349J35621K51537m75276
13731E92037j09316K98121J2086j86808P0879l01849N38137l04225r687o9645
13721E29730J268j08530Q3410B43571K34433N9322P193K0234M34872m52190J0448
13710E57883B75986L25287J81932C91077J20186K98323C18074J08069j32674J30913
$$ plain form
13700 424382 422052 347787 618303 525506 865360 653200 736676 680520 590000 517871 395235
13689 395235 44401 600595 691385 762905 560716 561661 681822 558206 581520 261284 382694
13678 382694 474157 596077 579155 514583 599056 349018 778872 547894 65749 628566
13668 628566 604681 556945 204393 350703 437255 176742 522622 330680 536013 340073
13658 340073 399933 221067 547449 464307 692748 236061 432442 314763 553582 134137
13647 680283 630700 215916 380072 185526 1092310 349342 428620 454518 604184 504906
13637 504906 547286 606977 237812 79884 72517 682487 539756 391707 366296 540696 291435
13626 291435 413718 358815 506607 406841 313703 -36172 506096 521577 300213 480874
$$ packed form
13700D24382k330p4265K70516r2797L39854k12160Q3476n6156r0520p2129j22636
13689C95235D4401N56194R0790P1520k02189R45J20161j23616K3314B61284J21410
13678C82694R1463J21920j6922o4572Q4473k50038M29854k30978F5749N62817
13668F28566k3885m7736B04393J46310Q6552A76742L45880j91942K05333j95940
13658C40073N9860j78866L26382q3142K28441B36061J96381j17679K38819A34137
13647F80283m9583B15916J64156A85526R06784C49342P9278K5898J49666r9278
13637E04906M2380N9691B37812G9884p367O09970j42731j48049k5411J74400k49261
13626B91435J22283n4903J47792r9766r3138c6172E06096J5481k21364J80661
$$ plain form
13616 480874 215529 172863 296011 205861 336912 460303 333006 372784 108613 257196
13606 257196 448878 325090 381603 57326 1399 673869 228477 116019 274666 401335
13596 401335 368578 345881 223151 353893 197382 159634 422308 629691 458348 478090
13586 478090 263971 375809 591784 238023 127622 416671 234934 355073 213271 504133
13576 504133 629719 384009 344199 70612 488472 438394 349508 407092 588268 338470
13566 338470 124201 46988 446867 604718 451422 80883 344867 232463 332815 282903
13556 282903 428796 211241 434724 482338 210464 300297 286288 491965 130242 198180
13546 198180 224897 411890 457244 461734 449561 344886 346491 613418 442386 360148 233667
$$ packed form
13616D80874B15529m2666J23148r0150J31051J23391j27297L9778A08613J48583
13606B57196J91682j23788N6513E7326A399O72470B28477j12458J58647J26669
13596D01335l2757k2697j22730J30742j56511l7748K62674K07383j71343J9742
13586D78090k14119J11838K15975B38023j10401K89049j81737J20139j41802K90862
13576E04133J25586k45710l9810G0612M17860n0078q8886N7584J81176k49798
13566C38470A24201D6988L99879J57851j53296H0883K63984j12404J00352m9912
13556B82903J45893B11241K23483M7614B10464Q9833j4009K05677A30242O7938
13546A98180K6717J86993M5354M490j2173j04675J605K66927j71032q2238j26481
$$ plain form
13535 233667 455271 447290 683782 297372 385890 181050 256877 107702 271955 275225 307285
13524 307285 401560 450962 318262 106989 167709 238520 602738 147261 535044 64414
13513 318475 203221 317734 415721 209170 391777 270336 450832 40137 121625 520651
13503 520651 134119 280144 145176 329290 210281 130145 381318 312187 85061 237288
13493 237288 -16451 58805 272680 185389 289119 315973 276348 173188 2981 188792 76151
13481 -65410 253697 271495 345876 304840 -151092 232718 202995 -2310 79582 53856 308319
13470 308319 358796 252332 217644 316474 533014 385064 134578 129805 199232 40708 265359
13459 265359 192813 178734 378582 130039 289721 -115069 247873 -206715 128363 70435
$$ packed form
13535B33667K21604p981K36492B97372Q8518A81050P5827A07702J64253L270L2060
13524C07285R4275M9402j32700A06989O0720P0811L64218A47261L87783F4414
13513C18475j15254J14513R7987k06551J82607j21441J80496D0137Q1488L99026
13503E20651A34119J46025j34968J84114j19009q0136K51173o9131H5061J52227
13493B37288a6451E8805K13875q7291J03730K6854l9625j03160B981J85811G6151
13481f5410B53697J7798P4381m1036a51092B32718k9723b310G9582k5726K54463
13470C08319N0477j06464l4688R8830K16540j47950A34578m773O9427D0708K24651
13459B65359p2546j4079J99848A30039J59682a15069B47873b06715A28363n7928
$$ plain form
13449 70435 336519 119034 337867 -126292 282209 546109 400639 159632 475654 439309
13439 439309 143723 329395 750607 215786 556654 271317 134800 172597 -145836 249988
13428 190906 139869 195141 266448 309898 210795 156590 204110 183185 -66030 345056 179369
13417 179369 84308 173112 124940 365953 71901 -61627 -163935 415200 -117393 144674
13406 177782 95524 77267 338093 300379 109458 213348 8859 16111 489054 88475 208439
13395 208439 184708 267017 186279 213393 225765 200301 182979 283767 -48349 -203386 320677
13383 355493 -36704 -96785 325802 253169 366112 -101786 -166708 -26396 -8672 49127 72358
13372 72358 87107 637820 476318 213093 182334 70704 -82147 377215 513383 318939
$$ packed form
13449G0435K66084A19034K18833a26292B82209K63900j45470A59632L16022l6345
13439D39309A43723J85672M21212B15786L40868B71317A34800L7797a45836B49988
13428A90906n1037N5272P1307M3450r9103n4205M7520k0925f6030C45056j65687
13417A79369H4308Q8804m8172K41013G1901f1627j02308D15200a17393A44674
13406A77782q2258j8257K60826l7714A09458J03890H859P252M72943H8475J19964
13395B08439k3731Q2309q0738K7114J2372k5464j7322J00788d8349j55037C20677
13383C55493c6704o0081C25802p2633J12943a01786o4922b6396h672D9127K3231
13372G2358J4749N50713j61502B13093l0759G0704h2147C77215J36168j94444
$$ plain form
13362 318939 264697 334467 242888 -154590 199896 272840 378209 39214 67498 98774 323497
13351 323497 216971 -153602 258401 238569 293314 -72399 212898 360021 -44265 181291
13340 325148 186955 467738 -61684 354648 46526 -89631 250259 78484 153915 222859 280254
13329 280254 537516 234641 483351 -26991 199732 241424 236419 206001 73455 102795 481647
13318 481647 191810 -91433 157480 15580 111013 399572 18062 337902 185532 170580
13308 170580 451900 137322 176339 506566 -105704 301396 230817 292011 199320 417818
13298 417818 -82849 430761 -94517 -69375 388211 202463 305587 92868 224971 358166
13288 358166 41183 6369 358893 172876 404196 18257 87503 39203 74697 43399 109077
$$ packed form
13362C18939n4242O9770r1579a54590A99896P2944J05369C9214K8284L1276K24723
13351C23497j06526a53602B58401j9832N4745g2399B12898J47123d4265A81291
13340C25148j38193K80783f1684C54648D6526h9631B50259G8484P5431O8944N7395
13329B80254K57262B34641K48710b6991A99732M1692n005l0418G3455K9340L78852
13318D81647A91810i1433A57480A5580R5433K88559A8062L19840j52370j4952
13308A70580K81320A37322L9017L30227a05704C01396p0579O1194r2691K18498
13298D17818h2849D30761i4517K5142C88211j85748J03124I2868J32103J33195
13288C58166D1183F369L52524A72876K31320A8257O9246C9203L5494l1298O5678
$$ plain form
13277 109077 28380 124116 99193 -67456 129604 160403 123911 -52283 331678 194339 -117023
13265 73046 46854 306602 204465 110942 378827 3995 445611 52721 133100 -31288 149736
13253 -20682 41928 -131647 -10306 197336 -249662 354026 54666 348422 109955 4562 14298
13242 14298 35111 59980 31220 421439 289724 341614 179184 20787 301779 257810 74055
13230 178296 -86871 293151 85854 417029 -21338 52531 313563 87508 -73217 244809 49446
13218 165636 -149730 -12775 486284 4903 41802 108053 105370 69406 -4367 215257 -108037
13206 -12204 50598 256033 88432 -53886 90819 230439 101506 69462 97902 190465 -10614
13194 -31575 361598 -153624 177238 232603 -165473 -25373 -97448 437303 176275 230412
$$ packed form
13277A09077B8380R5736k4923f7456A29604L0799l6492e2283C31678j37339a17023
13265G3046k6192K59748j02137r3523K67885C995M41616E2721Q0379c1288A49736
13253b0682D1928a31647a0306A97336b49662C54026E4666K93756A09955D562R736
13242A4298K0813K4869k8760L90219j31715N1890j62430B0787K80992m3969G4055
13230A78296h6871B93151H5854L31175b1338E2531K61032H7508g3217B44809D9446
13218A65636a49730a2775D86284D903L6899O6251k683l5964d367B15257a08037
13206a2204E0598K05435H8432e3886I0819J39620A01506l2044K8440R2563a0614
13194c1575C61598a53624A77238N5365a65473b5373p2075D37303A76275N4137
$$ plain form
13184 230412 -1700 256967 82978 120390 -149153 123683 420449 133498 69307 110061 131051
13173 131051 443126 -216989 379383 112957 439119 23508 125512 -161145 136998 -42926
13162 127675 -115761 263415 121046 190123 35561 4038 291433 133100 79722 -94436 46312
13150 93748 272870 -68156 89302 273802 82823 245891 59700 -53680 -365533 -62287 -127627
13139 -127627 270698 154602 165701 -115556 54232 -278576 64291 -9545 280355 -102756
13128 -108603 170992 -131854 332076 -319248 219946 32914 386496 270 -107068 357824
13117 100602 216938 144778 199341 21509 273419 70404 147693 75602 174724 105809 216191
13106 216191 43434 184876 121621 2863 130038 102162 -257941 -295618 -31357 -26997 -95944
$$ packed form
13184B30412a700B56967H2978L7412a49153A23683K96766A33498o4191M0754K0990
13173A31051L12075b16989C79383A12957L26162B3508J02004a61145A36998d2926
13162A27675a15761B63415A21046O9077C5561D038K87395A33100n3378i4436D6312
13150I3748J79122f8156H9302J84500H2823J63068E9700e3680l11853f2287o5340
13139a27627B70698j16096J1099a15556E4232b78576F4291i545B80355a02756
13128a08603A70992a31854C32076c19248B19946C2914L53582B70a07068C57824
13117A00602J16336p2160N4563B1509K51910G0404P7289p2091R9122o8915J10382
13106B16191D3434J41442o3255B863J27175k7876b57941l7677c1357M360o8947
$$ plain form
13095 -95944 205157 60434 66544 214043 -12185 -38032 276464 353744 24077 165958 125380
13084 125380 -157528 97968 -89253 94982 -25431 81058 139062 243301 218832 27988 66044
13073 66044 304544 128782 389579 106772 124147 -175821 -179921 219744 497276 -45717
13062 191881 418283 46437 340319 167896 56514 -85006 212160 219525 -78794 -19356 33174
13050 118408 -43607 -76576 32604 48644 307785 -96585 172693 -19203 -7014 -22439 -184291
13039 -184291 410806 1007 71543 111713 113745 128601 146348 -188839 -264961 263923 447404
13028 447404 54657 148770 -1297 178382 323889 155619 263587 158717 232242 -259109
13017 467690 -248118 -286526 -190794 129039 67259 -75956 -57449 68293 -127130 80050 102650
$$ packed form
13095i5944B05157F0434O110J47499a2185k5847B76464P7280B4077J41881m0578
13084A25380a57528I7968h9253I4982b5431H1058N8004J04239k4469B7988L8056
13073F6044K38500A28782K60797A06772J7375a75821m100B19744K77532d5717
13062A91881K26402D6437K93882A67896E6514h5006B12160P365g8794a9356C3174
13050A18408d3607l2969C2604J6040K59141i6585A72693a9203g014j5425j61852
13039a84291D10806A007P0536M0170K032J4856J7747a88839p6122B63923J83481
13028D47404E4657R4113a297A78382J45507A55619J07968j04870P3525b59109
13017D67690b48118l8408R5732A29039o1780g5956J8507F8293a27130H0050K2600
$$ plain form
13006 102650 258951 -283420 312697 105195 -129341 18770 138362 -71610 143289 184244
12996 184244 160393 -81628 252828 -301401 59015 -92757 -159902 576465 114143 -154208
12985 342290 315324 471281 11274 -129210 178740 443010 -152798 102369 206886 363007
12975 363007 23666 -119577 -214119 5180 -119942 -28528 -9529 414064 -113232 178818 234704
12964 234704 -298728 127979 126975 -294240 47432 -46939 -29094 241595 12695 -51818 190269
12952 510311 2674 105269 100505 200437 103289 -107986 194793 94976 103428 13505 239024
12941 239024 292342 -109175 226807 -223686 -146851 109739 -136935 283532 -225704 -27281
12930 140564 -106494 -502319 179345 67638 -92289 203398 449802 201546 -153427 -268670
$$ packed form
13006A02650J56301b83420C12697A05195a29341A8770J19592g1610A43289M0955
12996A84244k3851h1628B52828c01401E9015i2757o7145E76465A14143a54208
12985C42290k6966J55957A1274a29210A78740K64270a52798A02369J04517J56121
12975C63007B3666a19577r4542E180a19942b8528i529D14064a13232A78818N5886
12964B34704b98728A27979j004b94240D7432d6939J7845B41595A2695e1818A90269
12952E10311B674J02595m764R9932r7148a07986A94793I4976Q452A3505K25519
12941B39024N3318a09175B26807b23686P6835A09739a36935B83532b25704b7281
12930A40564a06494l95825A79345F7638i2289B03398K46404B01546a53427j15243
$$ plain form
12920 -268670 214649 116641 -1522 203160 376946 -24530 -231803 239490 40066 21122 90051
12909 90051 118495 155538 35489 -39657 107011 10615 185063 172688 -167359 15854 146273
12898 146273 241475 126190 64257 46804 -31136 175768 17831 95096 -39105 108321 196528
12887 196528 94507 -285673 -79342 -155607 -6015 3288 -101751 100927 -221601 148158 95089
12876 95089 -196164 5938 236471 -32880 9959 -305257 -5522 3328 102530 -350835 237341
12864 -78538 -162709 22092 -51782 451544 -54279 206987 370996 301979 -105009 -145803 -6897
12852 210239 156774 133157 19936 -260541 77772 89251 -38270 94817 -183770 -227033 95000
12840 -353598 -29709 -188257 234253 29147 63391 92375 -110991 -12629 -337830 48607 191724
$$ packed form
12920b68670B14649r8008a522B03160J73786b4530k07273B39490D0066j8944O8929
12909I0051K8444L7043C5489c9657A07011A0615J74448j2375a67359A5854J30419
12898A46273R5202j15285o1933j7453c1136A75768A7831P7265c9105A08321Q8207
12887A96528I4507b85673g9342p6265f015C288a01751A00927b21601A48158n3069
12876I5089a96164E938K30533c2880I959c05257e522C328R9202c50835B37341
12864g8538q4171B2092e1782D51544e4279B06987J64009o9017a05009m0794f897
12852B10239n3465k3617A9936b60541G7772J1479c8270I4817a83770m3263I5000
12840c53598b9709j58548B34253B9147L4244K8984a10991a2629l25201D8607J43117
$$ plain form
12829 191724 172261 220659 -347868 77460 -46726 348296 289898 276474 -19574 58488 281757
12818 281757 -233907 161898 -137067 250619 123340 -151291 -142498 -172231 125277 -350705
12807 -35122 51990 -215722 -32842 -42309 -78937 65743 -399004 55516 -84529 57813 -104918
12795 -288583 364178 -355592 86720 -119623 126348 -26263 239316 -24807 -337576 -98798
12784 -209816 -2764 -7752 210118 254992 233970 -114051 -65950 -106026 36978 171112 -164463
12772 -89008 -48807 150689 362604 -37011 5617 -90789 154538 72084 218687 -190880 -65294
12760 120879 -112402 -109430 197353 -115411 96182 108177 252432 -93603 -15663 17580 156236
12749 156236 59107 145223 249447 -190422 201366 -70996 234044 232065 233537 187927 -29271
$$ packed form
12829A91724j9463M8398c47868G7460d6726C48296n8398j3424a9574E8488K23269
12818B81757b33907A61898a37067B50619A23340a51291Q793k9733A25277c50705
12807c5122E1990b15722c2842r467l6628F5743c99004E5516h4529E7813a04918
12795b88583C64178c55592H6720a19623A26348b6263B39316b4807l12769i8798
12784b09816b764m988B10118M4874k1022a14051M8101m0076C6978J34134a64463
12772h9008M0201A50689K11915c7011E617i0789A54538G2084J46603a90880f5294
12760A20879a12402K972A97353a15411I6182J1995J44255i3603a5663A7580J38656
12749A56236E9107Q6116J04224a90422B01366g0996B34044j979J472m5610b9271
$$ plain form
12737 234649 141959 260908 -47215 48835 185807 5479 263585 360844 38437 -16146 141916
12725 -138218 -18033 99714 -27312 -231272 -8853 116372 -116502 62087 99146 -101917 374937
12713 52784 136177 49063 11666 -74175 187647 359022 -33065 -38941 283619 301221 356630
12702 356630 43809 141131 -23746 229582 61160 185684 -45103 102105 48051 -49439 -38704
12691 -38704 197209 -178966 145809 -157565 -18622 -89205 79623 -210214 158320 75623
12680 -41425 155237 342583 -60223 336486 129771 125687 119855 -22405 -248032 -56615 45722
12668 285063 -202048 -149077 391942 80122 140679 323958 398662 -14433 38529 -113769 94243
12656 -59674 104658 32286 -232785 -13317 388295 -137282 197624 215132 165808 -66103 -858
$$ packed form
12737B34649r2690J18949d7215D8835J36972E479K58106R7259C8437a6146A41916
12725a38218a8033I9714b7312k03960h853A16372a16502F2087L7059a01917C74937
12713E2784Q3393D9063A1666g4175A87647J71375c3065n876B83619J7602N5409
12702C56630D3809R7322b3746B29582F1160J24524d5103A02105D8051d9439J0735
12691c8704A97209a78966A45809a57565a8622p0583G9623b10214A58320G5623
12680d1425A55237J87346f0223C36486A29771m084n832b2405k25627e6615D5722
12668B85063b02048N2971C91942H0122O0557J83279P4704a4433C8529a13769I4243
12656e9674A04658C2286b32785a3317C88295a37282A97624J7508m9324f6103h58
$$ plain form
12644 321699 -179940 -59194 11779 85214 71137 -93611 403370 26026 351805 289227 158345
12633 158345 -231251 -240884 112959 73216 142174 342468 255349 198820 480124 368855 220167
12622 220167 -39019 200425 131867 -1148 120571 128297 184577 116316 109848 186605 66119 239387
12610 239387 -35792 160083 78538 -69801 -34013 -351827 -45768 -172710 -207412 173384 -16473
12598 153695 107209 48119 -76101 240567 -166331 93765 -43413 148201 148487 116156 276535
12587 276535 233985 -142737 18426 101010 251414 301348 23483 171459 84304 -247274 233029
12575 338026 28900 420168 -119665 -195435 -219792 -98103 141430 -145770 -135391 155575
12564 -61619 -41064 -426687 9039 -35321 -133792 107726 151629 235863 31347 -42854 -66657
$$ packed form
12644C21699a79940e9194A1779P3435j4077i3611D03370B6026L25779o2578j30882
12633A58345b31251r633A12959l9743O8958K00294q7119n6529K81304j11269j48688
12622B20167c9019B00425o8558a148A20571P726N6280o8261o468P6757F6119J73268
12610B39387c5792A60083G8538f9801c4013l17814d5768j26942l4702A73384a6473
12598A53695m6486D8119g6101B40567a66331I3765d3413A48201K86l2331J60379
12587B76535m2550a42737A8426Q2584J50404M9934B3483J47976H4304b47274B33029
12575C38026B8900L91268a19665p5770k4357i8103A41430a45770J0379A55575
12564f1619K0555l85623I039c5321r8471A07726M3903Q4234C1347d2854k3803
$$ plain form
12553 -66657 103313 158824 69433 250322 -45330 -14355 -126032 94771 -101703 235677 -191393
12541 -95340 188069 34156 252845 -247369 -453919 -94101 258468 374475 -4154 -236985
12531 -236985 -54129 -362621 -12944 -193398 -159832 61437 -49271 -222161 248153 -35037 53274
12519 5032 -259017 -22845 -197452 -149692 116159 -76962 134930 62383 -29181 130421 29159
12507 82438 -165246 130172 -9067 -372075 -228343 -2959 78877 202477 346001 -57671 -143785
12496 -143785 -97275 147596 45395 -88232 -86654 42457 97290 39542 84671 469498 -152536
12484 120436 15725 -193926 182905 23664 26823 241763 146669 5659 -66369 -149298 428703
12472 -114873 -275118 313226 -189774 -199788 130133 -53443 328953 -339454 261330 95256
$$ packed form
12553f6657A03313N5511F9433J80889d5330a4355j11677I4771a01703B35677a91393
12541i5340A88069C4156K18689b47369k06550i4101B58468J16007d154k32831
12531b36985e4129l08492a2944j80454L3566F1437d9271j72890B48153c5037E3274
12519E032b59017b2845j74607M7760A16159g6962A34930F2383b9181A30421B9159
12507H2438a65246A30172i067l63008J43732b959G8877J23600J43524e7671q6114
12496a43785M6510A47596D5395h8232J578D2457N4833C9542M5129L84827a52536
12484A20436A5725a93926A82905B3664L159K14940r5094E659f6369q2929D28703
12472a14873j60245C13226a89774j0014A30133e3443C28953c39454B61330I5256
$$ plain form
12461 -97330 87755 -28576 -102340 102562 -324023 154199 237198 217221 217897 -72379 -51313
12450 -51313 -148916 -332033 -499719 -23464 55113 325434 89336 24331 -75466 -37423 -185470
12439 -185470 148967 199513 -43465 69753 -40014 135055 -229148 -98391 68775 236699 205151
12428 205151 40645 -130264 232238 -222130 -130189 -166835 -71930 -116396 169397 229346 -281446
12416 -29248 -144768 -141884 35057 112458 466643 313586 53294 50986 -409772 -437674 -116218
12404 -166901 -69906 -116609 221447 -167096 -280879 -215222 -86160 -62971 256415 27963 -82884
12392 61660 -197978 253114 134883 -42485 -504187 -7275 67225 12789 206020 151887 -131598
12380 -87360 433350 -207806 240596 127501 -160595 -309994 74397 -126981 244109 228379
$$ packed form
12461i7330H7755b8576p3764A02562c24023A54199Q2999j9977O76g2379K1066
12450e1313r7603j83117j67686b3464E5113K70321H9336B4331g5466c7423j48047
12439a85470A48967N0546d3465F9753d0014A35055b29148i8391F8775J67924l1548
12428B05151D0645a30264B32238b22130R1941l6646g1930m4466A69397N9949b81446
12416b9248j15520K884C5057P7401L54185j53057E3294k308d09772k7902a16218
12404a66901f9906m6703B21447a67096j13783O5657h6160K3189B56415B7963h2884
12392F1660a97978B53114j18231d2485m61702g275F7225A2789J93231n4133a31598
12380h7360D33350b07806B40596j13095a60595j49399G4397a26981B44109j5730
$$ plain form
12370 228379 -131176 7548 -35614 259127 -29196 -232760 15593 -59733 -206930 89408 -117347
12358 332791 -69215 28072 142619 -182971 163819 21670 -109872 65422 366653 51797
12347 -7279 -64840 -177064 55511 -287634 -130342 -115152 99365 258966 -206888 93040 -8495
12335 -82650 72572 192669 21529 128681 -127851 -83993 -153060 194933 219694 -207568 268965
12323 -337918 -25149 -139733 27579 130024 -162287 -84817 44821 150094 277522 248654
12313 248654 35775 -333738 178710 -198011 26184 242540 -174423 -156929 22664 95868
12303 95868 -118446 42986 172009 -62550 -226545 -67046 171491 -326864 161930 25394
12292 244725 184747 101418 213169 -144767 -147472 11293 -39728 66011 -192324 288309 -165818
$$ packed form
12370B28379a31176G548c5614B59127b9196k03564A5593e9733j47197H9408a17347
12358C32791f9215B8072J14547a82971A63819B1670a09872F5422L01231E1797
12347g279n7561j12224E5511b87634a30342J5190I9365J59601b06888I3040h495
12335h2650G2572J20097B1529J07152a27851M3858o9067A94933K4761b07568B68965
12323c37918b5149j14584B7579J02445a62287P7470D4821J05273J27428k8868
12313B48654C5775c33738A78710a98011B6184K16356a74423J7494B2664P3204
12303I5868a18446D2986J29023f2550j63995f7046A71491c26864A61930B5394
12292B44725n9978q3329J11751a44767k705A1293c9728F6011a92324B88309a65818
$$ plain form
12280 158054 45295 -75711 118730 163728 134755 232557 259474 418677 228079 150188 368318
12269 368318 48692 329466 -269016 408475 -68547 191870 400178 46880 139236 197109
12259 197109 -271805 33558 170335 243619 93572 -346 -10054 167332 -133841 74676 71582
12248 71582 266745 173442 -10104 -805 -30828 257170 -77120 278881 265005 104870 464809
12237 464809 -115612 356252 375282 16412 249984 104019 -163145 123626 275782 295207
12227 295207 227542 264623 98788 198044 185546 141962 106035 294794 311 348572 170184
12215 304000 279017 -14827 105971 -16840 337296 -5610 73068 212527 -71149 13231 508671
12204 508671 301972 173426 -50592 294697 -38215 -94533 214392 201818 43058 218545
$$ packed form
12280A58054D5295g5711A18730M4998k8973R7802K6917J59203j90598p7891K18130
12269C68318D8692K80774b69016D08475f8547A91870K08308D6880R2356N7873
12259A97109b71805C3558J36777P3284I3572c46r708A67332a33841G4676l094
12248G1582J95163r3303a0104h05l0023B57170g7120B78881j3876A04870L59939
12237D64809a15612C56252J9030A6412K33572A04019a63145A23626J52156J9425
12227B95207o7665L7081I8788R9256j2498m3584l5927J88759C11L48261A70184
12215C04000k4983a4827A05971a6840C37296e610G3068J39459g1149A3231M95440
12204E08671k06699j28546e0592B94697c8215n6318B14392j2574D3058J75487
$$ plain form
12194 218545 -83561 69702 -120340 3768 105669 132798 -29154 -108606 -98299 -213365 16500
12182 28582 137800 89856 198235 -258611 20110 81040 255085 -177734 108703 -49087
12171 311438 8752 157510 59395 341207 108551 180611 72110 183349 -161040 188171
12160 222290 -44788 -265687 36289 -41961 -91337 418843 -162854 -11144 237935 18355 117728
12149 117728 179503 -90945 -181977 60969 301853 356857 -132874 -129715 140365 349643 106114
12137 -106830 -64 -45519 -6814 132407 95133 280505 319342 92390 95980 -45130 -20828 237334
12124 7048 2817 -279655 50705 -85808 43172 216611 344798 -8300 7942 50671 331014 196785
12112 196785 32101 -118003 110477 -126173 -43796 -247222 -158766 157529 128752 -189722
$$ packed form
12194B18545h3561F9702a20340C768J01901K7129b9154p9452J0307j15066A6500
12182B8582J09218m7944J08379b58611B0110O0930J74045a77734A08703d9087
12171C11438H752J48758E9395K81812A08551P2060G2110J11239a61040A88171
12160B22290d4788k20899C6289d1961m9376D18843a62854a1144B37935A8355R9373
12149A17728O1775i0945r1032F0969K40884N5004a32874L159A40365K09278A06114
12137a06830f4m5455f814A32407l7274J85372L8837I2390L590d5130b0828B37334
12124G048B817b79655E0705h5808D3172J73439J28187h300G942M2729K80343j34229
12112A96785C2101a18003A10477a26173d3796k03426Q8456A57529k8777a89722
$$ plain form
12101 15999 233296 -123242 -254714 146422 143592 -174253 14593 275694 -235216 -166735
12091 -166735 -44075 -89285 125755 -51494 -111007 150016 113751 132129 -191353 333140 -50577
12079 -66778 -60648 66327 219706 461204 1033277 2244462 956866 612495 216056 252761
12069 252761 9215 -79905 -271199 833 212322 282241 -113381 143596 -96462 -5968 12234
12057 -95908 -18057 41970 -49429 129037 -147969 73840 -132123 -109196 -104208 -127138 44364
12045 -82291 178760 -50311 -110713 243877 129929 159091 -122871 -152830 -49590 23016 304286
12034 304286 199575 -96817 -160001 -66191 703 42631 -154929 250784 -43486 -108648 -59684
12023 -59684 92313 -20933 -113467 -73612 -118247 233182 -122955 123037 -61447 22310 -29776
$$ packed form
12101A5999K17297a23242j31472A46422k830a74253A4593K61101b35216O8481
12091a66735d4075m5210A25755e1494n9513A50016l6265J8378a91353C33140e0577
12079f6778O130F6327J53379K41498N72073J211185I56866l44371B16056L6705
12069B52761I215g9905j91294H33K11489O9919a13381A43596i6462e968A2234
12057i5908a8057D1970d9429A29037a47969G3840a32123K2927M988k2930D4364
12045h2291A78760e0311o0402B43877j13948K9162a22871k9959d9590B3016K81270
12034C04286j04711i6817o3184f6191G03M1928a54929B50784d3486o5162M8964
12023e9684I2313b0933r2534L9855m4635B33182a22955A23037f1447B2310b9776
$$ plain form
12011 -132007 -140949 -195887 245420 -65341 -14050 -68960 -131444 164784 -83187 171603 141385
12000 141385 152064 -116988 272 22521 -58421 56054 -102073 23654 -187156 154327 55893
11988 -285771 -310498 -170906 -188478 177234 -156277 301412 236955 -205320 24448 179238
11978 179238 -172158 -169860 -1084 282308 -95692 173296 -104187 131766 84663 103381 -129228
11966 275006 56799 -23975 27383 -59341 -37279 -30258 7146 163903 -22653 -21041 88010 -15942
11953 348384 -46629 -61598 218944 -149387 -225864 166598 -199370 -401624 65869 228785
11943 228785 -282325 -78947 42320 184785 -158250 -135610 -92851 172976 -154597 -43733
11932 101381 -185348 -29303 52455 -302910 -6125 -59979 -42648 236312 -43092 424 287371
$$ packed form
12011a32007q942n4938B45420f5341a4050n4910o2484A64784h3187A71603l0218
12000A41385J0679a16988B72K2249e8421E6054a02073B3654a87156A54327E5893
11988b85771k4727J39592j7572A77234a56277C01412o4457b05320B4448J54790
11978A79238a72158K298a084B82308i5692A73296a04187A31766m7103J8718a29228
11966B75006E6799b3975B7383e9341K2062P021G146J56757b2653J612H8010a5942
11953C48384d6629j4969B18944a49387p6477A66598a99370k02254F5869J62916
11943B28785b82325g8947D2320J42465a58250K2640M2759A72976a54597d3733
11932A01381a85348b9303E2455c02910f125n3854J7331B36312d3092D24K86947
$$ plain form
11921 287371 12791 -43753 -248370 -89522 47219 -117152 -174653 -189925 18464 217049 -261769
11909 -404016 -258192 -37802 188785 196551 -78191 -38825 39593 324068 -242735 126208 20059
11897 252751 121972 87144 12146 -111503 -171951 -243690 -80106 183443 155572 -80012 73820
11885 51905 -155513 53660 177581 75236 -55233 9136 -60086 234814 182543 26396 -33283
11873 986 126556 -4374 -44266 35583 322970 -157014 -425447 -168513 -45729 -248760 -117501
11861 -2845 175145 101028 -460205 292511 376579 4772 147971 256649 102823 348615 445418
11850 445418 -146212 -77744 -130485 105837 125141 315449 -29400 -255404 -15808 -148109
11840 -148109 -48595 -220798 -237486 20957 -275703 90563 -215557 -481845 -79270 2430 159300
$$ packed form
11921B87371A2791d3753k04617h9522D7219a17152n7501j5272A8464J98585b61769
11909d04016J45824c7802A88785P766g8191c8825C9593K84475b42735A26208B0059
11897B52751A21972l4828A2146a11503o0448p1739h0106A83443k7871h0012G3820
11885E1905a55513E3660J23921G5236e5233I136f0086B34814n2271B6396c3283
11873I86J25570d374l9892C5583K87387a57014k68433a68513d5729k03031a17501
11861b845A75145p4117d60205B92511Q4068D772J43199J08678A02823K45792R6803
11850D45418a46212O8468n2741A05837J9304J90308b9400k26004a5808j32301
11840a48109d8595j72203j6688B0957b75703I0563b15557k66288g9270B430J56870
$$ plain form
11829 159300 -236534 100857 9523 76454 -383604 -64977 187773 -158675 80356 -70799 -187544
11818 -187544 -63634 24910 -128034 72681 -533218 -21157 -301747 -50353 42973 13618 -82210
11806 416396 127828 -146794 135617 86267 57268 -183153 296197 -5151 -53013 103078
11795 -142445 154088 -156828 35464 123343 -125120 132840 -128502 -47504 -588654 -96322
11784 127027 -331050 120949 -256981 -512832 -58158 93498 -18576 -76064 1166 63781 -32174
11772 38525 146568 465342 -237413 -15604 -203495 -37881 52222 -130671 283774 22391
11761 -48385 83686 53048 -78184 -22135 35234 85264 -193532 -93919 -65779 -288871 17483
11749 -183620 75725 -137368 134817 -218208 -168588 44911 146848 -267409 -124940 232196
$$ packed form
11829A59300b36534A00857I523O6931c83604f4977A87773a58675H0356g0799j16745
11818a87544f3634B4910a28034G2681e33218b1157k80590e0353D2973A3618h2210
11806D16396A27828a46794A35617m9350k8999a83153B96197e151m7862A03078
11795a42445A54088a56828C5464Q7879a25120A32840a28502d7504n41150i6322
11784A27027c31050A20949b56981k55851e8158I3498a8576n7488A166O2615c2174
11772C8525J08043L18774b37413a5604j87891c7881E2222a30671B83774B2391
11761d8385H3686l0638g8184b2135C5234N0030a93532i3919K8140k23092A7483
11749a83620G5725a37368A34817b18208M9620D4911J01937b67409a24940B32196
$$ plain form
11738 -248654 -34004 -6288 -540133 90699 -40615 109184 130650 -54928 329826 -312619 191646
11726 127280 -88659 -128776 -241252 108077 134930 77562 150809 204619 -17888 -99439 69881
11714 -40812 -55197 11481 -188119 -85032 58523 -12570 234163 157034 88560 69236 -8782
11702 56867 254120 -254475 64866 252577 -17152 -38685 460695 201392 -809 122276 162026
11691 162026 129966 65154 188546 -54385 143532 47483 137733 4351 -2861 278780 143328
11680 143328 120039 -128250 52213 104222 -189689 -210732 45093 208665 136268 252360 -17170
11668 197453 -27308 -153233 82510 -144264 -125885 -118075 8136 -14323 104081 -115281 -13667
11656 173188 94156 129915 -128782 -151898 151588 -162538 211874 153342 -48374 -203599
$$ packed form
11738b48654c4004f288n33845I0699d0615A09184K1466e4928C29826c12619A91646
11726A27280h8659m0117j12476A08077K6853n7368P3247N3810a7888q1551F9881
11714d0812j4385A1481a88119h5032E8523a2570B34163p7129o8474j9324h782
11702E6867J97253b54475F4866J87711a7152k1533D60695B01392h09A22276L9750
11691A62026l2060o4812J23392e4385A43532D7483R0250D351b861B78780j35452
11680A43328k3289a28250E2213N2009a89689k1043D5093J63572p2397J16092a7170
11668A97453b7308j25925H2510a44264J8379P810H136a4323A04081a15281a3667
11656A73188p9032L5759a28782k3116A51588a62538B11874n8532d8374j55225
$$ plain form
11646 -203599 -103198 -162992 427547 313517 126753 -377337 217933 -79095 -120128 -73421
11636 -73421 26804 -234664 120933 -44493 105555 90433 50867 177985 89426 28033 348722
11625 348722 199283 -260307 -393831 81418 165892 419153 179706 176176 160224 -125070
11614 286055 -145143 305378 -156522 -159786 -27182 -92291 48029 -117657 -65584 151497 164282
11603 164282 107922 92279 -51733 145645 129070 261888 84288 160062 10770 8112 -70174
11591 5534 266230 75905 -36792 -13513 43748 186616 20078 -188383 101 241656 -285239
11579 271496 -68706 82576 355652 38968 -183005 281260 -54094 -93049 197307 399830
11569 399830 69421 39797 -122176 -32666 469519 143258 -204006 -253877 -186379 -15788 -8789
$$ packed form
11646b03599J00401n9794D27547j14030A26753c77337B17933g9095m1033M6707
11636g3421B6804b34664A20933d4493A05555j5122l9566J27118q8559B8033L20689
11625C48722j49439b60307j33524H1418Q4474K53261A79706l530j5952a25070
11614B86055a45143C05378a56522l264b7182o5109D8029a17657N2073A51497J2785
11603A64282n6360j5643e1733A45645j6575J32818H4288P5774A0770k658g0174
11591E534K60696G5905c6792a3513D3748J42868B0078a88383A01K41555b85239
11579B71496f8706H2576K73076C8968a83005B81260e4094l8955A97307K02523
11569C99830F9421k9624a22176c2666D69519A43258b04006m9871O7498a5788O999
$$ plain form
11558 -8789 -173598 -16249 -42587 247476 28138 -79531 -215961 -181809 32147 -12896 -150568
11547 -150568 216185 -21087 52490 113966 159479 31803 378462 -38731 299974 132461 371226
11536 371226 -34875 -52819 33746 232675 117780 278020 -172032 320768 340466 -209687
11525 -172421 -205977 38506 -371366 -159937 167510 82407 -116409 -117075 270425 66780 -72453
11513 242524 261797 147119 -19379 -169556 40478 181458 100983 183409 248949 185120 357235
11502 357235 131233 199786 282750 -45071 489064 -143629 112408 250004 18291 -173553
11491 -127740 282419 -88360 30649 293837 139459 181125 268248 49402 471511 -296895
11480 -228186 371879 42245 91086 33976 37249 51831 -126350 259855 62398 118790 -93523
$$ packed form
11558h789j64809a6249k6338B47476B8138g9531j36430L4152C2147a2896j37672
11547a50568B16185b1087E2490O1476M5513C1803L46659c8731B99974A32461K38765
11536C71226c4875j7944C3746J98929j14895J60240a72032C20768J9698b09687
11525a72421l3556C8506c71366a59937A67510H2407a16409o66B70425F6780g2453
11513B42524J9273j14678a9379j50177D0478J40980q0475Q2426O5540o3829J72115
11502C57235A31233O8553Q2964d5071D89064a43629A12408J37596A8291a73553
11491a27740B82419h8360C0649K63188A39459M1666Q7123D9402M22109b96895
11480b28186C71879D2245M8841C3976L273J4582a26350B59855F2398N6392i3523
$$ plain form
11468 -143618 490354 386611 59454 27310 430061 172833 643331 390618 444193 136366
11457 179930 213892 613626 -75243 -170075 121064 230918 -30064 9805 158448 49233 63943
11446 63943 95344 -200025 302504 218542 -7383 -243271 -261519 -39228 101248 219573 47110
11434 -11168 185672 -151949 181811 -47619 2433 54315 -44052 76611 170134 241237 -1042
11422 266275 247986 -110350 65040 129529 -173081 441374 248923 108365 -42261 -15682
11411 152202 20990 -73063 -259660 44318 148557 -116630 -148128 62854 92970 -125621 -31768
11399 144534 25332 -89822 -45566 -28243 -72691 12681 -67475 -11384 231158 169481 260927
11388 260927 88776 11714 172582 -67721 198817 -233931 151509 273326 -58892 -49292 -3465
$$ packed form
11468a43618D90354j03743E9454B7310M02751A72833M70498k52713N3575A36366
11457A79930L3962L99734g5243r4832A21064J09854c0064I805J48643D9233J4710
11446F3943L1401b00025C02504q3962g383k35888j8248c9228A01248J18325D7110
11434a1168A85672a51949A81811d7619B433N1882d4052G6611R3523P1103a042
11422B66275j8289a10350F5040O4489a73081D41374j92451A08365d2261a5682
11411A52202B0990g3063j86597D4318J04239a16630l1498F2854L0116a25621c1768
11399A44534B5332h9822M4256J7323m4448A2681f7475a1384B31158o1677R1446
11388B60927H8776A1714J60868f7721A98817b33931A51509J21817e8892R600c465
$$ plain form
11376 123733 -216440 -419321 19787 -227606 5578 -30057 37020 -53434 -203377 -79094 18632
11364 147767 -282792 114545 -131730 12975 126161 29223 -115953 -313824 -35604 -129646
11354 -129646 -16720 -40944 75506 64775 84693 -213794 -74332 156243 -48231 1183 112394
11343 112394 196755 117988 -11914 174332 -162094 -342457 -54926 -9190 -219954 -135313 -51602
11331 -25934 -127454 44510 -44095 147548 202615 28420 -64228 35138 123571 -33073 -194504
11320 -194504 118846 -10430 -334615 1364 198300 -70045 -183421 -137403 -200283 -17873 96214
11308 287887 327319 322696 4643 87815 346521 -176422 147567 219199 -84332 -261548 33251
11296 -100171 33835 -511525 -5321 -120343 57739 -14538 -161199 -157273 172701 -247184 -85143
$$ packed form
11376A23733b16440k02881A9787b27606E578c0057C7020e3434j49943g9094A8632
11364A47767b82792A14545a31730A2975J13186B9223a15953j97871c5604r4042
11354a29646a6720k4224G5506j0731J9918b13794g4332A56243d8231A183J11211
11343A12394Q4361p8767a1914A74332a62094j80363e4926i190k10764Q4641e1602
11331b5934j01520D4510d4095A47548N5067B8420f4228C5138Q8433c3073j61431
11320a94504A18846a0430l24185A364J96936g0045j13376M6018o2880a7873I6214
11308B87887L9432m623D643Q3172K58706a76422A47567P1632h4332j77216C3251
11296a00171C3835e11525e321j15022E7739a4538j46661L926A72701b47184h5143
$$ plain form
11284 173460 -118896 -9485 130525 -91646 -142049 8538 -108833 -115036 32468 -20369 160103
11272 50456 -291631 -11926 38765 50987 -76239 -96807 -124935 255012 -32153 -198286 146597
11260 -34170 -296330 -71673 -139416 186721 -10156 -41163 139520 -383599 -253512 -136317
11250 -136317 -621205 -96362 39144 -237073 16106 -150538 -174435 180429 -97634 -6385 69801
11238 105427 -55750 -95987 -95053 60829 154789 -3924 211357 -311026 243559 37746 167046
11227 167046 -25634 -4546 -32832 13704 50604 -46996 248612 -16569 -51857 -14595 54986
11215 215517 89007 -168157 67962 -131236 37261 177836 -99149 168797 -101824 -214619
11205 -214619 -144675 -477472 235675 139577 40220 -51382 -8669 -301225 -65312 -14248 -123536
$$ packed form
11284A73460a18896i485A30525i1646n0403H538a08833o203C2468b0369A60103
11272E0456b91631a1926C8765J2222g6239k0568k8128B55012c2153j66133A46597
11260c4170k62160g1673o7743A86721a0156l1007A39520c83599J30087J17195
11250a36317m84888i6362C9144b37073A6106a50538k3897A80429i7634f385F9801
11238A05427e5750m0237R34F0829R3960c924B11357c11026B43559C7746J29300
11227A67046b5634d546k8286A3704L6900d6996B48612a6569l5288a4595E4986
11215B15517H9007a68157F7962a31236C7261J40575i9149A68797a01824j12795
11205b14619O9944l32797B35675r6098D0220e1382h669k92556f5312a4248j09288
$$ plain form
11194 -123536 -117149 -135649 -150144 -65943 -204737 59464 -21648 94582 -65335 61719 -293468
11182 232832 -122611 -287031 136272 -7640 -248997 109331 104395 -255569 21272 -265862
11171 -106961 -144571 -242965 -149206 -12128 -369127 -143870 -121768 6470 20817 -60204 218235
11159 -67338 13260 -252180 -14399 60366 68769 -186765 -46446 68292 -101345 -138955 -15328
11147 -137934 261660 -194543 -33530 -114883 120460 -148435 -218831 104010 -57653 -156746
11137 -156746 281450 39125 -68515 -24502 -12201 139604 53417 -17620 32130 289981 -31769
11125 -70653 121910 142512 299378 120607 258450 -145240 -163253 -20014 95320 191939 12196
11113 463366 201335 -177178 160068 -20751 108664 -46596 4141 101498 167975 154717 215180
$$ packed form
11194a23536O387j8500j4495f5943j38794E9464b1648I4582f5335F1719b93468
11182B32832a22611j64420A36272g640k41357A09331m936b55569B1272b65862
11171a06961l7610r8394R3759a2128l56999a43870K2102F470J4347f0204B18235
11159f7338A3260b52180a4399F0366Q403a86765d6446F8292a01345l7610a5328
11147a37934B61660a94543c3530q1353A20460a48435p0396A04010e7653r9093
11137a56746B81450C9125f8515b4502a2201A39604E3417a7620C2130K57851c1769
11125g0653A21910K0602J56866A20607J37843a45240j8013b0014I5320R6619A2196
11113D63366B01335a77178A60068b0751A08664d6596D141R7357O6477j3258O0463
$$ plain form
11102 215180 212388 -2801 -90391 208225 283771 167504 40516 185655 247508 233586 455494
11091 455494 396614 229701 218291 44109 19435 -27692 368043 103590 485352 -39360 357323
11079 70580 -35149 448533 267808 269709 499305 -224895 202373 387571 589895 434101
11069 434101 103159 354306 288848 517414 162047 485801 202692 642879 295432 169219
11059 169219 259108 452382 335425 929011 529541 621012 622766 698433 963938 510781
11049 510781 497455 452386 735012 730052 737029 697163 543744 592531 489329 618426 695550
11038 695550 664468 675127 789010 338741 463320 450165 791541 331266 869209 379793
11027 472738 715369 424700 522164 555226 498129 703370 621956 418701 669363 564665
$$ packed form
11102B15180k792b801q7590B08225P5546j16267D0516J45139O1853j3922K21908
11091D55494n8880j66913j1410D4109A9435b7692C68043A03590L81762c9360C57323
11079G0580c5149D48533j80725J901K29596b24895B02373J85198K02324j55794
11069D34101A03159K51147o5458K28566A62047L23754B02692M40187B95432j26213
11059A69219Q9889J93274j16957N93586l99470R1471J754P5667K65505m53157
11049E10781j3326m5069K82626m960O977l9866j53419M8787j03202J29097P7124
11038F95550l1082J0659J13883C38741J24579j3155L41376C31266N37943C79793
11027D72738K42631k90669R7464L3062n7097K05241q1414k03255K50662j04698
$$ plain form
11017 564665 766835 592511 729979 660523 219605 827225 645639 789191 430932 870945
11007 870945 389699 592573 649623 211324 732143 660273 964552 820257 737384 425191
10997 425191 976744 500976 1036225 748718 801348 601978 554629 606192 892095 824582
10987 824582 884335 790959 497994 950433 1052874 1243118 1068039 1267435 1150181 1213834
10977 1213834 1463138 1338462 1898457 2020661 2344419 2355141 2551629 2991600 2545472 2548840
10967 2548840 2435691 1935674 1817555 1608711 1544467 1336429 1641679 1359689 1743282 1152508
10957 1152508 1593059 1845826 1487324 1538313 1521616 1152716 867896 720785 572916 330103
10947 330103 403676 563001 339403 137583 304926 325029 -36483 230914 -82536 265812
$$ packed form
11017E64665K02170j74324J37468o9456B19605O07620j81586J43552l58259M40013
11007H70945C89699K02874N7050B11324N20819p1870L04279j44295q2873l12193
10997D25191N51553m75768N35249k87507N2630j99370m7349N1563K85903o7513
10987H24582N9753r3376k92965M52439J02441J90244j75079J99396j17254O3653
10977A213834K49304j24676N59995J22204L23758J0722J96488M39971m46128L368
10967B548840j13149n00017j18119k08844o4244k08038L05250k81990L83593n90774
10957A152508M40551K52767l58502N0989j6697l68900k84820j47111j47869k42813
10947C30103P3573J59325k23598A37583J67343K0103c6483B30914h2536B65812
$$ plain form
10936 297365 334925 393210 -202997 6568 89491 -35028 -59906 -181121 200895 -158293 149307
10924 168565 385290 81467 -357587 12439 72667 -203164 -17632 109129 123120 414164
10914 414164 244427 -145229 474415 -78442 -122805 88642 -246786 235263 -216348 269244
10903 103299 286765 82645 287400 47669 42164 -163448 -277689 78398 147386 -82142 36313
10891 149959 90202 -44231 -74135 -220921 -268203 -103898 24926 -200603 137180 24221 -321844
10879 -112914 14187 225305 275651 -89055 -134597 -9220 35123 -135220 131825 -213598 122198
10867 198486 37117 -217687 59214 72661 129574 234510 -18384 89860 -25721 236040 91002
10855 -114109 111539 253710 -203095 -210995 -14612 -470433 17119 -12905 322215 -363673
$$ packed form
10936B97365L7560N8285b02997F568Q2923c5028k4878j21215B00895a58293A49307
10924A68565K16725H1467c57587A2439O0228b03164a7632A09129J3991K91044
10914D14164j69737a45229D74415g8442m4363H8642b46786B35263b16348B69244
10903A03299J83466H2645K04755D7669n505a63448j14241G8398O8988h2142C6313
10891A49959n9757d4231k9904j46786m7282a03898B4926b00603A37180B4221c21844
10879a12914A4187K11118N0346h9055m5542i220C5123a35220A31825b13598A22198
10867A98486C7117b17687E9214J3447N6913J04936a8384H9860b5721B36040I1002
10855a14109A11539J42171b03095p900a4612m55821A7119a2905C22215c63673
$$ plain form
10844 -195011 137227 -173956 139520 -180978 -323070 33060 86662 -94185 -18940 -107271
10834 -107271 -98633 -139036 -70606 205093 -167134 161854 4626 -496230 6448 162214 69401
10822 -112322 57035 242347 -556551 347414 -101925 -347065 163404 94990 -73205 -129255
10812 -129255 -33953 -69769 196857 -165970 -360555 -358570 55219 -491469 404 16875 14615
10801 14615 -205194 -303017 -155050 175093 -162620 86977 -254484 -182310 -44261 -211739
10791 -211739 -154507 -153713 -231866 -40934 -169251 -163604 45994 -7694 -185315 -62432 -333246 -125174
10778 61222 -40148 -3845 80097 -280444 126837 -110701 -14880 241030 24945 10745 -152370
10766 49932 404801 -238152 151755 6690 -74444 -70844 -235069 -25639 170079 -47590 29706
$$ packed form
10844a95011A37227a73956A39520a80978j42092C3060N3602i4185a8940q8331
10834a07271Q638m0403O8430B05093a67134A61854D626d96230F448J55766F9401
10822a12322E7035J85312e56551C47414a01925k45140A63404o8414g3205n6050
10812a29255c3953l5816A96857a65970j94585J985E5219d91469D04J6471k260
10801A4615b05194r7823J47967A75093a62620H6977b54484P2174d4261j67478
10791b11739N7232P94p8153d0934j28317N647D5994g694j77621f2432k70814a25174
10778F1222d0148c845H0097b80444A26837a10701a4880B41030B4945A0745a52370
10766D9932L54869b38152A51755F690g4444L600j64225b5639A70079d7590B9706
$$ plain form
10754 444902 50795 22283 357690 65469 -108803 254580 56034 115112 196592 -205317 18175
10742 -20261 43180 411265 229663 -121073 -16403 -170373 3970 76818 -42848 88523 -454567
10730 -334442 19577 -108796 382655 -138548 -200093 -38384 -47626 116723 400482 -52457 -9333
10718 117246 256124 -124875 86673 169037 -75740 -67391 126656 30710 -15468 51551 -171961
10706 -105613 161135 -11856 -39177 83842 -77398 -137886 -346804 -261131 -246775 -81330 -226213
10695 -226213 -215059 -155782 292409 -20533 29688 -263215 -184994 -139116 74058 163729 -8760
10683 80622 130872 -10117 110564 -306272 286890 -619860 -255772 132793 34325 -27815
10672 -292022 -87819 -83768 -51840 -103971 -24863 63069 20579 -389188 -24276 -11132 210091
$$ packed form
10754D44902E0795B2283L35407F5469a08803B54580E6034N9078Q1480b05317A8175
10742b0261D3180L68085j81602a21073a6403j53970C970P2848d2848H8523d54567
10730c34442A9577a08796C82655a38548o1545c8384r242A16723K83759e2457i333
10718A17246J38878a24875H6673Q2364g5740Q349A26656C0710a5468E1551a71961
10706a05613A61135a1856k7321H3842g7398o0488k08918Q5673J4356h1330j44883
10695b26213J1154N9277B92409b0533B9688b63215P8221M5878G4058Q9671h760
10683H0622N0250a0117A10564c06272B86890f19860b55772A32793C4325b7815
10672b92022h7819M051L1928n2131b4863F3069B0579c89188b4276a1132B10091
$$ plain form
10660 199349 83253 104047 -97971 -335982 -29013 127035 86395 13864 -2003 42473 -148434
10648 -517445 -245625 -235678 59246 165497 2624 -208866 95433 -278270 5991 -525764 -50492
10636 -158939 -98479 304368 70538 -326166 -54380 -142256 140898 225864 -171399 154986
10625 -270675 -61260 109818 -81218 -48735 -195303 -85762 9127 -25416 -37358 89615 -61571
10613 -188886 -242344 -29847 44887 -20641 185929 179358 -53524 91235 -5872 -225894 -86748
10601 51107 -152898 64376 -59616 -70171 -119982 59566 -180320 -164126 94636 -49194 88740
10589 -333884 -174098 141125 -17431 117914 -230106 244896 311 -47907 -84902 -217643 5969
10577 -30835 -155510 127072 -99827 170696 233211 -63540 -88216 -321889 110557 88563 207689
$$ packed form
10660A99349H3253K0794i7971k38011b9013A27035m0640A3864b003D2473a48434
10648e17445b45625R947E9246J06251B624b08866I5433b78270E991e25764e0492
10636a58939O0460C04368G0538c26166e4380q7876A40898Q4966a71399A54986
10625b70675f1260A09818h1218L2483j46568h5762I127b5416j1942H9615f1571
10613a88886n3458b9847D4887b0641A85929o571e3524I1235e872k20022h6748
10601E1107a52898F4376e9616j0555m9811E9566a80320J6194I4636d9194H8740
10589c33884J59786A41125a7431A17914b30106B44896C11d7907l6995j32741E969
10577c0835j24675A27072i9827A70696O2515f3540k4676k33673A10557k1994J19126
$$ plain form
10566 207689 -149172 -26996 82977 -36616 16088 -364877 -198169 -271972 162633 68816 -199495
10554 -55519 -44617 139049 -202408 359067 -24724 -272761 55295 -94125 107640 325853
10544 325853 96557 -442788 -305827 -194396 161597 -138058 -197853 -118503 -52689 31616
10533 60289 159837 -17521 -305277 -21525 -238958 200514 -209160 224803 154931 39854 -251795
10521 -273940 200230 -33132 -47368 -294901 -82593 -391342 -101475 81705 203644 -59423
10510 82612 199308 -150916 -73213 -130746 48340 185044 -118439 41355 -211431 -170741 -98462
10499 -98462 -148322 -81117 142563 -73849 180136 -18891 -191733 -37775 -345332 -7769 -151318
10488 -151318 -211968 69757 276020 73666 -63255 79887 485289 114904 450105 174501
$$ packed form
10566B07689a49172b6996H2977c6616A6088c64877J66708p3803A62633F8816a99495
10554e5519J0902A39049b02408C59067b4724k48037E5295i4125A07640K18213
10544C25853I6557d42788J36961J11431A61597a38058n9795P9350e2689C1616
10533F0289R9548a7521k87756b1525k17433B00514b09160B24803o9872C9854b51795
10521b73940B00230c3132j4236k47533h2593l08749a01475H1705J21939e9423
10510H2612J16696a50916g3213n7533D8340J36704a18439D1355b11431M0690P2279
10499i8462m9860O7205A42563g3849A80136a8891j72842c7775l07557g769j43549
10488a51318o0650F9757K06263G3666f3255G9887M05402A14904L35201A74501
$$ plain form
10477 256934 156980 175911 -107828 141100 -173158 -21444 173338 80216 86104 189576 -160192
10465 -202914 188926 -47214 -224236 -225803 285584 -1606 -5856 8774 291819 -193904 65144
10453 -244831 131179 51513 373147 -301971 5597 -53353 -96512 194943 91533 -223101 -29254
10441 -119547 -146559 132963 282 87186 202227 -26423 69729 -93483 -85170 -175388 -98446 51626
10428 240636 99721 -103633 103752 -329347 -88080 4183 -437748 -2074 -379446 305830 37936
10416 57102 -97147 -68602 407993 -87308 -209557 -178076 -16924 103810 189297 60122 83502
10405 83502 10 115032 -13902 -245837 -53441 167039 96213 83959 104922 -139919 -247355
10394 -247355 -53401 18331 363570 154706 357577 -101324 275067 -34608 -42903 310856
$$ packed form
10477B56934r9954J8931a07828A41100a73158b1444A73338H0216N888J03472a60192
10465b02914A88926d7214j77022j567B85584a606m250H774K83045a93904F5144
10453b44831A31179E1513L21634c01971E597e3353m3159A94943I1533b23101b9254
10441a19547k7012A32963B82Q6904J15041b6423F9729i3483Q313r0218P6942E1626
10428B40636I9721a03633A03752c29347h8080D183d37748b074l77372C05830C7936
10416E7102i7147K8545D07993h7308j22249L1481a6924A03810Q5487F0122K3380
10405H3502A0J15022a3902k31935e3441A67039p0826j2254K0963a39919j07436
10394b47355e3401A8331L45239A54706K02871a01324B75067c4608q295C10856
$$ plain form
10383 75225 -6867 135417 129932 228388 575224 8115 165034 78764 357610 -25958 141152
10371 410519 67704 373667 151525 294134 303491 351820 365404 201699 141361 -8455 270420
10359 355535 362458 379384 260146 35921 82098 16793 220371 160906 33259 490487 890499
10348 890499 327951 425340 368211 480339 188552 365926 336396 208193 197423 -21875
10337 -34865 -129805 22708 491537 241122 8215 485480 -175051 264896 9951 204306 67512
10325 -16770 -41892 -10953 360878 277293 331414 373215 19126 155534 -219978 -56526 319690
10313 -202122 -82986 220499 -175898 157440 304140 120720 -87790 -107646 295120 -73124
10302 -73877 119231 61879 -198142 70037 52846 151065 91405 -79567 148815 -81955 -7775
$$ packed form
10383G5225f867A35417n485R8456L46836H115J56919G8764K78846b5958A41152
10371D10519F7704L05963A51525J42609R357M8329J3584j63705o0338h455B70420
10359C55535O923J6926j19238C5921M6177A6793K03578n9465C3259M57228M00012
10348H90499C27951R7389n7129J12128A88552J77374k9530j28203j0770b1875
10337c4865r4940B2708M68829B41122H215M77265a75051B64896I951J94355F7512
10325a6770k5122a0953C60878q3585N4121M1801A9126J36408b19978e6526C19690
10313b02122h2986B20499a75898A57440J46700A20720h7790j9856B95120g3124
10302g3877A19231n7352a98142G0037j7191R8219n9660g9567A48815h1955g775
$$ plain form
10290 232066 -94130 52672 22578 -569485 -59467 112937 -276196 325274 48598 163175
10280 163175 -27150 12452 82844 -80019 -226123 -33943 42790 69565 -65659 -86985 -173130
10269 -173130 -169012 10882 511853 -33717 49111 123124 -352130 9490 301427 192427 112110
10258 112110 -105337 262334 245055 315662 257978 -148421 11355 -174543 -110839 189239
10247 -117227 -168661 -269577 -189352 -255414 -24878 -66962 19162 97266 9202 239146 187063
10236 187063 72825 -34018 224255 24514 -72292 -259215 -340287 -156238 -352261 240251
10225 -125077 -111750 -275159 119081 -79754 126860 -84559 -46223 378700 -85684 199872
10214 -271158 -340915 -219781 -143739 -321079 -200478 -371255 98066 8559 33371 106888 224804
$$ packed form
10290B32066i4130E2672B2578e69485e9467A12937b76196C25274D8598J14577
10280A63175b7150A2452P0392h0019j46104c3943D2790K6775f5659k1326q6145
10269a73130M118A0882N00971c3717D9111P4013c52130I490K91937j09000q0317
10258A12110a05337B62334j7279P0607n7684a48421A1355a74543O3704A89239
10247a17227n1434j00916Q0225o6062b4878m2084A9162P8104I202K29944n2083
10236A87063G2825c4018B24255B4514g2292j86923q1072a56238j96023B40251
10225a25077J3327j63409A19081g9754A26860h4559L8336C78700h5684A99872
10214b71158o9757J21134P6042j77340J20601j70777I8066H559K4812P3517J17916
$$ plain form
10203 224804 55973 -211198 -64839 436 168602 -57541 -380989 -213340 100461 24027 -3727
10191 -300180 -171461 -280946 -286606 -124276 335471 -325999 154819 -64703 3112 -41482 -190698
10180 -190698 -150964 -175214 -82961 -122825 -226797 46051 -148231 7215 -91615 -239421 -152233
10169 -152233 -102765 -174451 -221750 47221 71158 19743 202978 -55353 149239 -380185 -16374
10157 -65037 100569 -57107 -366262 -97866 114334 -113488 -6668 85195 195754 61657 -201836
10145 293435 -562933 44813 -113927 -40095 32288 -49079 -122315 -145753 -265256 -233931 -95841
10133 -48800 -40541 153581 -41944 -216333 -218865 -348242 -149135 57611 -29311 -33401 2090 213824
10121 213824 342602 -271206 -212427 -130414 -429359 -192346 -4368 -319457 134902 -186603
$$ packed form
10203B24804E5973b11198f4839D36J68166e7541l23448J67649A00461B4027c727
10191c00180J28719j09485n660a24276C35471c25999A54819f4703C112d1482j49216
10180a90698L9734k4250h2961l9864j03972D6051a48231G215i1615j47806Q7188
10169a52233M9468p1686m7299D7221K3937A9743J83235e5353A49239c80185a6374
10157f5037A00569e7107l09155i7866A14334a13488f668H5195J10559F1657b01836
10145B93435e62933D4813a13927d0095C2288d9079p3236k3438j19503L1325i5841
10133d8800Q259A53581d1944j74389k532j29377a49135E7611b9311m090B090K11734
10121B13824J28778b71206N8779Q2013k98945a92346d368l15089A34902a86603
$$ plain form
10110 -41635 -111371 -152096 -29399 -391734 -55859 228586 -30850 -257106 -217389 62460 82320
10099 82320 105981 284373 -267196 -226181 -175134 -82092 -472642 -132409 82923 10889 -309812
10087 59914 172417 31240 -15523 -542027 22577 -259253 172350 138353 43245 -88924 -136237
10076 -136237 97147 150290 94813 -247437 -103585 -427822 -41863 248666 -236665 65051
10065 -52472 158914 24513 -7783 71685 -129666 -44678 -6376 -8878 -126556 -72985 -400139
10054 -400139 74908 -241849 -228622 -22022 218323 -136183 18548 63624 177478 -23977 -57004
10043 -57004 -412599 12904 -337368 -380314 51924 -127280 291489 -101460 259499 -27848
10032 177247 6614 -284034 47308 -245755 101257 -119255 -171396 -475782 -85060 53787 -157848
$$ packed form
10110d1635o9736m0725b9399l62335e5859B28586c0850k26256L9717F2460J9860
10099H2320K3661J78392b67196M1015N1047h2092l90550a32409H2923A0889c09812
10087E9914J12503C1240a5523n26504B2577b59253A72350l3997D3245h8924m7313
10076a36237I7147N3143n5477b47437a03585l24237d1863B48666b36665F5051
10065e2472A58914B4513g783G1685a29666d4678f376k502j17678N3571l27154
10054d00139G4908b41849J3227b2022B18323a36183A8548M5076J13854b3977l3027
10043e7004l55595A2904c37368m2946E1924a27280B91489a01460B59499b7848
10032A77247F614b84034D7308b45755A01257a19255n2141l04386h5060E3787a57848
$$ plain form
10020 107966 -78295 -89280 -68987 -275066 26794 -278738 96874 7770 34118 -181644 -197078
10009 -197078 -182601 46920 -219074 240423 -866 -41357 -403708 -184718 74280 -94627 71278
9997 -111568 63859 -7058 146403 -111985 -283107 -220920 -229036 180966 -85002 13721 -160626
9985 -319460 -68319 -89515 112542 -57783 -258713 -244730 84061 -199816 -11198 -91627 -235636
9974 -235636 -63132 -225413 -36416 -248121 -20524 -138450 121596 60554 -365169 -130652
9963 236259 -5637 -129948 -106394 -176318 -73574 -124137 144057 -237529 137456 -130728 -171068
9952 -171068 -92089 14254 175970 -97078 -94277 -220264 139280 -155391 114160 -67794 -139968
9941 -139968 -480746 -78160 96420 -142445 -188119 -21935 -170513 -66587 148225 -150143 -196523
$$ packed form
10020A07966g8295j0985K0293k06079B6794b78738I6874G770K6348a81644j5434
10009a97078J4477D6920b19074B40423h66m0491l62351a84718G4280i4627G1278
9997a11568F3859g058A46403a11985j71122O2187q116A80966h5002A3721a60626
9985c19460f8319k1196A12542e7783k00930J3983H4061a99816a1198q0429j44009
9974b35636f3132j62281c6416k11705b0524j17926A21596F0554c65169a30652
9963B36259e637j24311K3554o9924g3574n0563A44057b37529A37456a30728m0340
9952a71068P8979A4254J61716i7078K801j25987A39280a55391A14160f7794p2174
9941a39968l40778g8160I6420a42445m5674b1935j48578f6587A48225a50143m6380
$$ plain form
9930 -196523 141035 -79475 -98745 -27279 16500 -183165 -53043 -142135 -55700 46098 352628
9919 352628 -106905 -265137 43514 -265868 -215232 125914 -71606 -20521 -397856 -93365 206827
9907 -40239 2413 -110678 296167 97607 24226 -237735 -288458 217583 -25791 -240283 -37532
9895 73056 91072 72353 -122158 130797 -66868 -220217 -216839 63555 71146 -4933 -20999 -124032
9883 -124032 -330404 26540 -85797 -179491 158604 -66335 52936 -233720 17550 184681 -81046
9871 -64761 -335421 -29336 145838 188295 -69787 -148478 -62511 -160345 -55851 43688 237316
9860 237316 -109617 -111172 185669 64937 69943 -127042 224917 -210384 74799 181282 -165212
9848 -467531 150288 -114983 155239 -263004 97040 197790 148886 143670 49667 -74299 -178710
$$ packed form
9930a96523A41035g9475j9270b7279A6500a83165e3043q9092e5700D6098L06530
9919C52628a06905j58232D3514b65868N0636A25914g1606b0521l77335i3365B06827
9907d0239B413a10678B96167I7607B4226b37735n0723B17583b5791k14492c7532
9895G3056J8016j8719a22158A30797f6868j53349L378F3555P591d933j6066j03033
9883a24032k06372B6540h5797r3694A58604f6335E2936b33720A7550J67131h1046
9871f4761k70660b9336A45838M2457f9787p8691f2511r7834e5851D3688J93628
9860B37316a09617j555A85669F4937N006a27042B24917b10384G4799J06483a65212
9848d67531A50288a14983A55239b63004I7040J00750m8904n216D9667g4299j04411
$$ plain form
9837 -178710 -457913 -120574 -177899 -192746 -53260 -429034 -157795 60756 -183703 -15313 19733
9825 53266 -344045 114550 156001 -133699 -236676 -3868 -395324 295399 -259084 -253448 196682
9813 129377 11194 -368726 192909 32318 70575 198666 -8378 -430976 208244 -258531 -97433
9801 -109100 -73510 333965 367 29119 -38824 100635 124760 -52247 11216 114294 -105407
9789 -62598 -12533 -166263 -279073 41944 -39763 -216523 233292 -144979 -283035 -2970 -276534
9778 -276534 -94887 -91081 222932 -168340 -94375 -226751 -141372 -110802 -323591 -11421 70182
9766 -24811 -108575 123753 27768 2100 10687 -86566 219903 -13584 -266997 -206805 -109111 61759
9753 -79716 -131680 90613 58066 -265877 144104 -74004 12562 -230961 -139675 350570 -148398
$$ packed form
9837a78710k79203a20574n7325j4847e3260l75774a57795F0756a83703a5313A9733
9825E3266c44045A14550M1451a33699j02977c868l91456B95399b59084N636A96682
9813A29377A1194c68726A92909C2318L8257J28091h378m22598B08244b58531i7433
9801a09100L5590C33965C67K8752c8824A00635K4125e2247A1216J03078a05407
9789f2598a2533j53730j12810D1944c9763j76760B33292a44979j38056b970k73564
9778b76534i4887L806B22932a68340P3965j32376Q5379L0570k12789a1421G0182
9766b4811q3764A23753B7768B100Q587h6566B19903a3584k53413O0192R7694F1759
9753g9716n1964I0613l2547b65877A44104g4004A2562b30961R1286C50570a48398
$$ plain form
9741 190125 -61246 -131287 -29261 -231792 177946 -165963 -39026 -62449 80757 213123 235392
9730 235392 -11384 -133400 112134 -97501 -222839 -127588 -11630 -21032 175755 -167057 144270
9718 -193337 -118416 -145538 69094 256772 -57675 5837 -190685 -23488 6584 -28406 -45818 -225084
9706 -225084 -42620 -289706 -157791 -136490 -56348 -356210 -309465 -64309 -188110 -238302 -170523
9695 -170523 -297878 -191643 -60958 2240 258205 -319506 164451 -79517 -134138 109859 107482
9684 107482 -371365 -175428 89124 171862 -297248 -175548 -93909 47654 -51829 -311532 151792
9672 -176975 8394 -172681 -119826 77103 185174 -41826 -314793 46062 13269 -129645 -210411
9661 -210411 -217138 -148884 -245307 61808 -327478 -108385 -117904 -229369 -165915 -56584 -335403
$$ packed form
9741A90125f1246p0041b9261k02531A77946a65963c9026k3423H0757J32366K2269
9730B35392a1384j22016A12134i7501j25338R5251a1630r402A75755a67057A44270
9718a93337P4921k7122F9094J87678e7675E837a90685b3488F584b8406j7412j79266
9706b25084d2620k47086J31915K1301e6348k99862M6745f4309j23801n0192O7779
9695a70523j27355J06235f0958B240K55965c19506A64451g9517n4621A09859k377
9684A07482c71365a75428H9124Q2738b97248J21700Q1639D7654e1829k59703A51792
9672a76975H394a72681N2855G7103J08071d1826k72967D6062A3269a29645q0766
9661b10411o727O8254r6423F1808c27478a08385r519j11465O3454e6584k78819
$$ plain form
9650 -335403 34447 -225425 -139224 -299994 -58779 -331863 -93144 202451 223977 -72091 -277832
9639 -277832 -99898 220552 -186863 217025 24662 -56088 -403305 -125997 -125713 -196950 67591
9627 -8619 -356186 -280783 -19983 309513 -56788 179753 -44717 -20232 -130166 -301808 -38856
9615 -206212 64687 -125335 65840 -73256 -84252 -330617 253894 -216807 -146897 -289538 182562
9603 -115840 -2098 -257891 -159672 -172077 147050 -88144 -410906 -20142 -180641 58038 -168368
9591 363339 -73215 -206295 43621 -29564 -169595 -117914 -57485 298681 -58202 -322200 -385953
9580 -385953 -213991 -128610 -69607 -50046 -66313 36619 41870 -242374 175773 -65360 14939
9568 -27421 58917 -221147 13960 -274652 176711 -352629 2940 -18300 93061 -172322 -47048
$$ packed form
9650c35403C4447b25425Q6201j60770e8779k73084i3144B02451K1526g2091k05741
9639b77832i9898B20552a86863B17025B4662e6088l47217a25997K84p1237F7591
9627h619l47567P5403a9983C09513e6788A79753d4717b0232j09934j71642c8856
9615b06212F4687a25335F5840g3256j0996k46365B53894b16807O9910j42641A82562
9603a15840b098k55793R8219j2405A47050h8144l22762b0142j60499E8038a68368
9591C63339g3215j33080D3621b9564j40031N1681e7485B98681e8202k63998o3753
9580c85953J71962Q5381N9003J9561j6267C6619N251b42374A75773f5360A4939
9568b7421E8917b21147A3960b74652A76711c52629B940a8300I3061a72322d7048
$$ plain form
9556 18966 78205 282467 278261 -441704 -162182 -92119 -33880 206308 -140002 51220 91695
9545 91695 36339 -234240 -128516 -109134 -205484 266742 -319995 195357 -359381 -3348 -361880
9534 -361880 -215346 -96832 -12513 -59100 -57926 -272120 -37469 -116054 -183151 -398618 126192
9522 152040 209944 -358631 112419 -112311 447295 52227 -350951 -67671 -215778 -254715
9512 -254715 -219116 -24270 -213820 -112496 160119 -93824 261387 149312 -151583 280891
9501 -125566 20288 -260519 2852 -209903 -24768 69662 -94492 -52524 -448759 -168354 -385160
9490 -385160 98027 250827 -8901 105146 -160380 52160 15223 -417464 42098 -301491 -316985
9479 -316985 114621 6220 -279137 -56828 -25764 147314 32984 -53765 -313804 29502 -149776
$$ packed form
9556A8966N9239K04262m206d41704a62182P0063c3880B06308a40002E1220M0475
9545I1695C6339b34240J05724J9382r6350B66742c19995A95357c59381c348l58532
9534c61880J46534i6832a2513m6587J174k14194c7469p8585o7097k15467A26192
9522A52040N7904c58631A12419a12311D47295E2227c50951f7671j48107l8937
9512b54715L5599b4270j89550J01324A60119i3824B61387j12075a51583B80891
9501a25566B0288b60519B852b09903b4768F9662i4492M1968l96235a68354k16806
9490c85160I8027J52800h901A05146a60380E2160A5223d17464D2098c01491j5494
9479c16985A14621F220b79137e6828b5764A47314C2984e3765k60039B9502a49776
$$ plain form
9467 58681 147467 -592 -66971 90002 -172507 -199944 71276 -340719 -139229 -246421 -257291
9456 -257291 -153053 16672 18804 -222610 -255506 -153893 101327 -287037 205268 52047 77111
9445 77111 309 -53403 19783 83811 -139917 375482 23690 -137901 -234136 -146172 -105279 -117280
9433 -117280 -200574 -184757 277512 -85395 -87435 -143564 175923 -64001 -297335 -258265 40027
9421 -107447 -32002 134364 -301873 67788 -248929 123080 212742 179381 348817 -303968
9410 37782 29484 -324516 121271 538 -79445 -301614 -131344 -124296 -271101 5997 -162321 -73510
9397 -104495 -454268 -15996 -14696 168655 174402 -80982 -97893 -56309 18580 122726 -112153
9385 -265297 129753 170174 -11585 124883 -508694 -180000 -203610 -6051 -232997 44291 80597
$$ packed form
9467E8681Q8786e92o6379I0002a72507k7437G1276c40719a39229j07192j0870
9456b57291J04238A6672K132b22610l2896J01613A01327b87037B05268E2047K5064
9445G7111C09e3403A9783O4028a39917C75482B3690a37901r6235Q7964M0893j2001
9433a17280q3294J5817B77512h5395k040n6129A75923f4001k33334L9070D0027
9421a07447c2002A34364c01873F7788b48929A23080Q9662l3361J69436c03968
9410C7782q298c24516A21271E38g9445k22169a31344P048j46805E997a62321g3510
9397a04495l49773a5996J300A68655N747h0982j6911M1584A8580J04146a12153
9385b65297A29753M0421a1585A24883e08694a80000k3610f051k26946D4291L6306
$$ plain form
9374 80597 -13757 -121637 -200950 -158578 12215 -96230 -237634 -74201 -106093 -176656 -14287
9362 -212609 -107239 -126081 -194951 -178640 -12225 -215917 -209056 -206860 -369431 114584 69498
9351 69498 -114440 26838 -178103 -247469 -30446 -327034 13388 185137 -46086 -132545 -52587
9339 -354655 76374 -108210 63549 -122192 34779 -298053 -238652 127421 -150823 -201958 161538
9327 67097 81123 -263360 -4184 57652 -215564 -134259 89780 136535 -81183 -16252 92652 -57142
9314 -179628 185920 -10472 -56477 -217495 -322320 180582 64965 29100 57016 261935 -71123
9302 -123955 283758 -47292 -78715 -86497 91456 -23695 -196173 40148 -21800 -106261 -16909
9290 -99198 -24393 -142662 -4788 44532 -205217 83507 20510 -105052 -207713 69511 -240913
$$ packed form
9374H0597a3757j07880p9313M2372A2215i6230j41404g4201l1892p0563a4287
9362b12609J05370j8842o8870J6311a2225k03692O861K196j62571A14584m5086
9351F9498a14440B6838a78103o9366c0446k96588A3388J71749d6086q6459e2587
9339c54655G6374a08210F3549a22192C4779b98053N9401A27421a50823n1135A61538
9327F7097J4026b63360d184E7652b15564Q1305H9780M6755h1183a6252I2652e7142
9314a79628A85920a0472m6005j61018j04825A80582F4965B9100K7916K04919g1123
9302a23955B83758d7292l1423p782I1456b3695j72478D0148b1800q4461a6909
9290i9198b4393j18269d788D4532b05217H3507B0510a05052j02661F9511b40913
$$ plain form
9278 -59481 10093 347003 -121819 -337213 151845 -249838 161822 -341853 133186 -38642
9267 73551 180911 -327688 189348 15530 -246950 -140210 67846 -250039 -323530 9166 -161921
9255 -30239 22913 -80204 -67268 -90159 -16119 137549 26912 294105 -149881 -202797 30975
9243 -241554 59544 -330356 -187274 200966 -74420 141908 -319336 46966 -186455 -253818
9233 -253818 -28277 -180067 -75765 121371 -220013 -146825 -246251 -4364 107251 -176796 -99565
9222 -99565 -90223 -43665 51414 -71894 130345 298203 43989 -217990 124796 -308801 -230321
9211 -230321 -38543 -133837 -395070 170124 -35625 60522 -369452 144076 -244720 -210438 51799
9199 88131 68066 -44964 -54854 148055 77943 -149108 -269724 -226839 -202579 -244047 -7645 -28100
$$ packed form
9278e9481A0093L36910a21819k15394A51845b49838A61822c41853A33186c8642
9267G3551J07360c27688A89348A5530b46950J06740F7846b50039p3491I166a61921
9255c0239B2913h0204J2936k2891a6119A37549B6912K67193a49881n2916C0975
9243b41554E9544c30356J43082B00966g4420A41908c19336D6966a86455o7363
9233b53818b8277j51790g5765A21371b20013P3188r9426d364A07251a76796P7231
9222i9565R342d3665E1414g1894A30345J67858D3989b17990A24796c08801P8480
9211b30321c8543r5294k61233A70124c5625F0522c69452A44076b44720L4282E1799
9199H8131k0065d4964r890A48055p0112a49108j20616M2885K4260m1468g645k0455
$$ plain form
9187 -28100 109968 79417 -94084 -48230 -150845 102839 -195643 13705 -252029 3581 154187
9176 154187 -159317 -158181 84154 190341 -147150 204589 42442 23546 126732 110793 -114875
9164 -206979 -221150 426024 -3527 -364341 -151787 -132999 -208712 -211376 59488 -254044 -88824
9152 -154008 16894 -23153 17109 -58053 53457 -252704 106469 -8951 108147 -207971 72925
9140 -229546 -20081 -20306 293140 -68899 -125925 -193595 18247 110681 -376159 -63732 -22404 -274807
9128 -274807 60920 -108790 -161680 234732 -92294 59840 -315783 -254064 -71144 67626 -116565
9116 77027 -135279 8126 106316 167394 -146729 -71989 283775 25636 -113617 -54682 17557
9104 229667 -32662 67763 -70599 10300 -184023 -218742 -151113 -14598 -92938 41398 227979
$$ packed form
9187b8100A09968l0551i4084M5854j02615A02839a95643A3705b52029C581J50606
9176A54187a59317J136H4154J06187a47150B04589D2442j8896J03186j5939a14875
9164b06979j4171D26024c527l60814a51787J8788p5713k664E9488b54044h8824
9152a54008A6894b3153A7109e8053E3457b52704A06469h951A08147b07971G2925
9140b29546b0081k25B93140f8899n7026o7670A8247R2434c76159f3732b2404k52403
9128b74807F0920a08790n2890B34732i2294E9840c15783O1719g1144F7626a16565
9116G7027a35279H126R8190O1078a46729g1989B83775B5636a13617e4682A7557
9104B29667c2662F7763g0599A0300a84023l4719O7629a4598p8340D1398J86581
$$ plain form
9093 227979 92886 -220879 72753 -35976 -85248 -247766 -167006 -308883 55067 158033 49243
9081 -8370 -47796 252262 -153616 -94004 56341 -70871 -45057 358258 5859 -331455 -313452
9070 -313452 -368998 -65464 225911 -208899 -66142 -383602 -137780 76451 -14958 110143 -171465
9058 172140 -188759 172290 -109900 45924 125307 91086 -78233 -200606 196610 -183081
9047 29075 -313404 58595 -167299 -147972 110077 102512 -233504 81348 7375 -191141 139453
9035 198798 73073 52298 69768 -140272 53498 -136480 219340 106380 18530 -55643 -203416
9024 -203416 -20479 -101276 142977 116396 49322 -392644 -269304 -384772 -266571 -239098 343062
9012 23641 -91313 -53740 -269820 -77097 -4636 -111583 159893 114688 -23417 -132541 -201412
$$ packed form
9093B27979I2886b20879G2753c5976m9272j62518Q0760j41877E5067J02966D9243
9081h370l9426B52262a53616N9612E6341g0871K5814C58258E859c31455J8003
9070c13452n5546f5464B25911b08899f6142l17460a37780G6451a4958A10143a71465
9058A72140a88759A72290a09900D5924P9383l4221g8233j22373A96610a83081
9047B9075c13404E8595a67299J9327A10077p565b33504H1348G375a91141A39453
9035A98798G3073k0775J7470a40272E3498a36480B19340A06380A8530e5643j47773
9024b03416b0479q0797A42977k6581D9322c92644J23340j15468J18201K7473C43062
9012B3641i1313L7573k16080g7097d636j06947A59893m5205b3417j09124o8871
$$ plain form
9001 -201412 -138983 -339441 -414840 -65995 -24094 -59263 -173414 -317642 -81424 42136 69187
8990 69187 88358 -254804 -30210 -73157 88990 189415 -100169 -214146 119674 70447 -217678
8978 164612 -25192 -314175 -37599 116892 -626888 135395 -175765 -172576 8022 -211606 62966
8966 204180 -164322 76908 -89049 -155062 74813 -123953 211146 -7281 -31629 -47927 290036
8954 109095 -108277 56909 -310039 129919 -91369 -48355 -129714 -334408 -124330 7624 -23269
8942 362226 -120501 240492 222219 -220529 -170915 61870 -22869 141457 254423 184189 -241349
8930 -74186 -223446 -106870 154327 -44210 758468 563717 1519540 3229571 10062680 20227072
8920 20227072 8548169 3421310 1362155 635035 415610 238531 386221 265074 3540
$$ packed form
9001b01412O2429k00458p5399f5995b4094l5169j14151j44228h1424D2136K7051
8990F9187J9171b54804c0210m2947H8990J00425a00169j13977A19674m9227b17678
8978A64612b5192k88983c7599A16892f26888A35395a75765L189H022b11606F2966
8966B04180a64322G6908h9049o6013G4813a23953B11146g281k4348j6298B90036
8954A09095a08277E6909c10039A29919i1369M3014q1359k04694a24330G624b3269
8942C62226a20501B40492j8273b20529M9614F1870b2869A41457J12966p0234b41349
8930g4186j49260a06870A54327d4210G58468j94751R55823J710031O833109J0164392
8920B0227072H548169C421310A362155F35035k19425j77079J47690j21147C540
$$ plain form
8910 -76471 191551 182154 713327 119731 -304881 -112655 -23137 -237019 33752 -44571 -52902
8899 -52902 -67217 -80181 -377533 -63481 -57688 -23496 -62585 395356 74760 -17533 -65058 -52314
8887 -52314 -441293 -265001 5356 -58839 172356 -357615 -39611 361491 -343770 -86358 -166378
8876 -166378 -361118 -115394 239446 -110738 -31224 -238786 -169450 13040 -243331 215280
$$ packed form
8910g6471A91551r397N31173A19731c04881a12655b3137k13882C3752d4571q331
8899e2902j4315j2964k97352f3481N793b3496l9089C95356G4760a7533m7525J2744
8887e2314l88979J76292E356e8839A72356c57615c9611C61491c43770h6358q0020
8876a66378j94740a15394B39446a10738c1224k07562O9336A3040b43331B15280
$$ [...]
##END NTUPLES=NMR SPECTRUM
##END=
