
##TITLE=UV1238_M8_1260-1248_30_7240900_m97PJ6L8Xe
##JCAMPDX= 6.0         $$ Bruker NMR JCAMP-DX V2.0
##DATA TYPE= NMR SPECTRUM
##DATA CLASS= NTUPLES
##ORIGIN= BRUKER
##OWNER= Administrator
$$ 1.72 TOPSPIN		Version 2.1
$$ 2013-01-18 22:25:35.216 -0500  Administrator@X
$$ Compression mode = diff/dup
##.OBSERVE FREQUENCY= 400.02188249412
##.OBSERVE NUCLEUS= ^1H
##.ACQUISITION MODE= SIMULTANEOUS (DQD)
##.ACQUISITION SCHEME= undefined
##.AVERAGES= 64
##.DIGITISER RES= 22
##SPECTROMETER/DATA SYSTEM= spect
##.PULSE SEQUENCE= noesygpps1d.comp
##.SOLVENT NAME= COFFEE_meoh
##.SHIFT REFERENCE= INTERNAL, COFFEE_meoh, 1, 14.96125
##AUDIT TRAIL= $$ (NUMBER, WHEN, WHO, WHERE, PROCESS, VERSION, WHAT)
$$ ##TITLE= Audit trail, TOPSPIN		Version 2.1
$$ ##JCAMPDX= 5.01
$$ ##ORIGIN= Bruker BioSpin GmbH
$$ ##OWNER= Administrator
$$ $$ E:\/data/COFFEE/nmr/UV1238_M8_1260-1248_30_7240900_m97PJ6L8Xe/22/pdata/1/auditp.txt
$$ ##AUDIT TRAIL=  $$ (NUMBER, WHEN, WHO, WHERE, PROCESS, VERSION, WHAT)
(   1,<2013-01-18 22:25:29.356 -0500>,<Administrator>,<X>,<go>,<TOPSPIN 2.1>,
      <created by zg
	started at 2013-01-18 22:13:58.808 -0500,
	POWCHK enabled, PULCHK disabled,
       configuration hash MD5:
       86 BA 57 50 F2 9D 5C 9B 26 00 A9 28 5F 66 2E 89
       data hash MD5: 64K
       3F EC CE 04 00 E7 70 64 C9 03 C5 5E A3 77 A4 93>)
(   2,<2013-01-18 22:25:32.434 -0500>,<Administrator>,<X>,<proc1d>,<TOPSPIN 2.1>,
      <Start of raw data processing
       efp LB = 0.3 FT_mod = 6 PKNL = 1 PHC0 = 0 PHC1 = 0 SI = 128K 
       data hash MD5: 128K
       AC 79 00 C3 90 3A FF 1C B1 32 FE 00 D6 20 A2 DF>)
(   3,<2013-01-18 22:25:33.528 -0500>,<Administrator>,<X>,<proc1d>,<TOPSPIN 2.1>,
      <pk PHC0 = -83.77075 PHC1 = 0 
       data hash MD5: 128K
       0D 52 46 78 3A C0 B7 D3 04 12 82 3C A3 C0 3D E8>)
(   4,<2013-01-18 22:25:34.200 -0500>,<Administrator>,<X>,<proc1d>,<TOPSPIN 2.1>,
      <abs ABSG = 1 
       data hash MD5: 128K
       99 49 2A D7 4A DF AB 8E 97 E1 51 E2 F3 96 32 11>)
(   5,<2013-01-18 22:25:34.356 -0500>,<Administrator>,<X>,<proc1d>,<TOPSPIN 2.1>,
      <abs ABSG = 2 
       data hash MD5: 128K
       93 17 2D 7D 70 B9 E3 25 8A 1D 97 9F FD BB 80 5C>)
(   6,<2013-01-18 22:25:34.528 -0500>,<Administrator>,<X>,<proc1d>,<TOPSPIN 2.1>,
      <abs ABSG = 3 
       data hash MD5: 128K
       C9 A9 94 98 0C A6 93 5E CB 89 A3 31 12 A4 31 91>)
(   7,<2013-01-18 22:25:34.716 -0500>,<Administrator>,<X>,<proc1d>,<TOPSPIN 2.1>,
      <abs ABSG = 4 
       data hash MD5: 128K
       BB 21 B6 4C 2B A1 A8 92 28 67 B4 BA 39 C5 29 C0>)
(   8,<2013-01-18 22:25:34.872 -0500>,<Administrator>,<X>,<proc1d>,<TOPSPIN 2.1>,
      <abs ABSG = 5 
       data hash MD5: 128K
       A5 EF 52 84 BD DE 27 96 A4 C6 89 AB 07 AB D5 2B>)
$$ ##END=
$$ 
$$ $$ hash MD5
$$ $$ C8 30 BC 4D FD C5 3F 82 60 E2 46 7C 6D A3 59 55
##$RELAX= 
##$RELAX= 
##$RELAX= 
##$RELAX= 
##$RELAX= 
##$RELAX= 
##$RELAX= 
##$RELAX= 
$$ Bruker specific parameters
$$ --------------------------
##$DU= <E:\>
##$EXPNO= 22
$$ [...]
##$TP07= 0
##$TPNAME0= <>
##$TPNAME1= <>
##$TPNAME2= <>
##$TPNAME3= <>
##$TPNAME4= <>
##$TPNAME5= <>
##$TPNAME6= <>
##$TPNAME7= <>
##$TPOAL= (0..7)
0.5 0.5 0.5 0.5 0.5 0.5 0.5 0.5
##$TPOFFS= (0..7)
0 0 0 0 0 0 0 0
##$TUNHIN= 0
##$TUNHOUT= 0
##$TUNXOUT= 0
##$USERA1= <user>
##$USERA2= <user>
##$USERA3= <user>
##$USERA4= <user>
##$USERA5= <user>
##$V9= 5
##$VALIST= <valist>
##$VCLIST= <CCCCCCCCCCCCCCC>
##$VD= 0
##$VDLIST= <DDDDDDDDDDDDDDD>
##$VPLIST= <PPPPPPPPPPPPPPP>
##$VTLIST= <TTTTTTTTTTTTTTT>
##$WBST= 1024
##$WBSW= 4
##$XGAIN= (0..3)
0 0 0 0
##$XL= 0
##$YL= 0
##$YMAX_a= 5620755
##$YMIN_a= -12202013
##$ZGOPTNS= <>
##$ZL1= 120
##$ZL2= 120
##$ZL3= 120
##$ZL4= 120
##$ABSF1= 14.96125
##$ABSF2= -5.596931
##$ABSG= 5
##$ABSL= 3
##$ALPHA= 0
##$AQORDER= 0
##$ASSFAC= 0
##$ASSFACI= 0
##$ASSFACX= 0
##$ASSWID= 0
##$AUNMP= <proc_prof1d_extract.lims>
##$AXLEFT= 0
##$AXNAME= <>
##$AXNUC= <1H>
##$AXRIGHT= 0
##$AXTYPE= 0
##$AXUNIT= <>
##$AZFE= 0.1
##$AZFW= 0.1
##$BCFW= 0
##$BC_mod= 0
##$BYTORDP= 0
##$COROFFS= 0
##$CY= 15
##$DATMOD= 1
##$DC= 0
##$DFILT= <>
##$DTYPP= 0
##$F1P= 0
##$F2P= 0
##$FCOR= 0.5
##$FTSIZE= 131072
##$FT_mod= 6
##$GAMMA= 0
##$GB= 0
##$INTBC= 1
##$INTSCL= 1
##$ISEN= 128
##$LB= 0.3
##$LEV0= 0
##$LPBIN= 0
##$MAXI= 10000
##$MC2= 0
##$MEAN= 0
##$ME_mod= 0
##$MI= 0
##$NCOEF= 0
##$NC_proc= -2
##$NLEV= 6
##$NOISF1= 0
##$NOISF2= 0
##$NSP= 0
##$NTH_PI= 0
##$NZP= 0
##$OFFSET= 14.96125
##$PC= 1
##$PHC0= -83.77075
##$PHC1= 0
##$PH_mod= 1
##$PKNL= yes
##$PPARMOD= 0
##$PPDIAG= 0
##$PPIPTYP= 0
##$PPMPNUM= 2147483647
##$PPRESOL= 1
##$PSCAL= 4
##$PSIGN= 0
##$PYNMP= <proc.py>
##$REVERSE= no
##$SF= 400.020009536249
##$SI= 131072
##$SIGF1= 0
##$SIGF2= 0
##$SINO= 400
##$SIOLD= 131072
##$SPECTYP= <>
##$SREGLST= <1H.CDCl3>
##$SSB= 0
##$STSI= 131072
##$STSR= 0
##$SW_p= 8223.68421052631
##$SYMM= 0
##$S_DEV= 0
##$TDeff= 65536
##$TDoff= 0
##$TI= <>
##$TILT= no
##$TM1= 0
##$TM2= 0
##$TOPLEV= 0
##$USERP1= <user>
##$USERP2= <user>
##$USERP3= <user>
##$USERP4= <user>
##$USERP5= <user>
##$WDW= 1
##$XDIM= 131072
##$YMAX_p= 447822809
##$YMIN_p= -12144
##$CURPLOT= <Network HP LaserJet P1505>
##$CURPRIN= <$Network HP LaserJet P1505>
##$DFORMAT= <normdp>
##$LAYOUT= <+/1D_H.xwp>
##$LFORMAT= <normlp>
##$PFORMAT= <normpl>
##$SURQMSG= 1
$$ End of Bruker specific parameters
$$ ---------------------------------
##NTUPLES= NMR SPECTRUM
##VAR_NAME=  FREQUENCY,     SPECTRUM/REAL,   SPECTRUM/IMAG
##SYMBOL=    X,             R,               I
##VAR_TYPE=  INDEPENDENT,   DEPENDENT,       DEPENDENT
##VAR_FORM=  AFFN,          ASDF,            ASDF
##VAR_DIM=   131072,        131072,          131072
##UNITS=     HZ,            ARBITRARY UNITS, ARBITRARY UNITS
##FACTOR=    0.0627417313425164, 1,          1
##FIRST=     8223.62146879497, 117,          -57361
##LAST=      0,             1957,            -57411
##MIN=       0,             -12144,          0
##MAX=       8223.62146879497, 447822809,    0
$$ Real data points
##PAGE= N=1
##DATA TABLE= (X++(R..R)), XYDATA
$$ [...]
63904A602451j35125j19033j03397q9140p7015o6676n7443m9154m1820l5315k9896
63893G98437k6122k3723k1435j8640j6365j5884j6848j7696j7440j6282j4772
63882E93230j3187j1664j0254q755o839m509k133n2J743L583N788Q281J0552J2203
63868E77987J3461J4934J6995J9631K2646K5593K7788K8986K9832L0957L1835
63857H40645L1440K9940K8643K8038K6984K4333K0425J6350J2449Q350L927m55
63845A071069m491q197j1813j5657j9834k3906k7274k9956l2486l4930l6674l7435
63833G88416l7749l7941l7363l5279l2096k9035k6862k5386k4008k2355k0494
63822D59848j8751j7263j5718j3839j1997j0752r912q767p311o358o237o269n902
$$ y = [1602451, 1467326, 1348293, 1244896, 1155756, 1078741, 1012065, 954622, 905468, 863648, 828333, 798437, 772315, 748592, 727157, 708517, 692152, 676268, 659420, 641724, 624284, 608002, 593230, 580043, 568379, 558125, 549370, 542531, 538022, 535889, 535837, 537580, 541163, 546951, 555232, 565784, 577987, 591448, 606382, 623377, 643008, 665654, 691247, 719035, 748021, 777853, 808810, 840645, 872085, 902025, 930668, 958706, 985690, 1010023, 1030448, 1046798, 1059247, 1067597, 1071524, 1071069, 1066578, 1058381, 1046568, 1030911, 1011077, 987171, 959897, 929941, 897455, 862525, 825851, 788416, 750667, 712726, 675363, 640084, 607988, 578953, 552091, 526705, 502697, 480342, 459848, 441097, 423834, 408116, 394277, 382280, 371528, 361616, 352849, 345538, 339180, 332943, 326674, 320772]
63809C20772n371m913m141k886j833j635k032k453k831l226l317k933k550k586
63795B78065k811k966l274l753l828l332l046l408l489k384q84l96p92p55j8K39
63779B43168o14j650j751j028l79l30p01r23n20L97J063Q73J68k56k14j53k95
63762B36855l95k78M0O53J516J991J399N8r39j059q38r24j185j103n74m3M8k20
63744B35002k26M85J475J762J138N79R63J909K489K545K487K290J692J088J195
63729B56873J905K431K595K969L693M101L840L429L408L667L894M072M159L909
63715C04945L306K665K090J364M78k79r46j917l089l723l460k883k648k621k315
63700B90967j721j180p72k80M05J218K010K615K986L366L966M459M268L426K593
$$ y = [320772, 315401, 310488, 306347, 303461, 301628, 299993, 297961, 295508, 292677, 289451, 286134, 283201, 280651, 278065, 275254, 272288, 269014, 265261, 261433, 258101, 255055, 251647, 248158, 245774, 244890, 244494, 243702, 242947, 242929, 243168, 242554, 240904, 239153, 238125, 237746, 237416, 236715, 235792, 235272, 235669, 236732, 237605, 237773, 237517, 237303, 237150, 236855, 236460, 236182, 236222, 236875, 238391, 240382, 241781, 241839, 240900, 239841, 239003, 238079, 236894, 235791, 235217, 235174, 235222, 235002, 234776, 235261, 236736, 238498, 239636, 240215, 241178, 243087, 245576, 248121, 250608, 252898, 254590, 255678, 256873, 258778, 261209, 263804, 266773, 270466, 274567, 278407, 281836, 285244, 288911, 292805, 296877, 301036, 304945, 308251, 310916, 313006, 314370, 314848, 314569, 313623, 311706, 308617, 304894, 301434, 298551, 295903, 293282, 290967, 289246, 288066, 287294, 287014, 287419, 288637, 290647, 293262, 296248, 299614, 303580, 308039, 312307, 315733, 318326]
63685C18326K023J211j46j433j877j503q91l53J46N85R34J353J835J907J187J25
63669C23429l31K74J542K718L208K802J808R12M84J42o58j770k568k876l127l551
63653C22438l859l889l946m167m101l406k581k331k452k079j058k70k98m65K09
63638B87745J523K349K184J734J849K481L034L225L281L514M045M825N682O424
63624C33895P004P490P837P998Q261R143J0753J2593J4193J5686J7413J9258K0746
63611D92270K1702K2558K3975K6275K9078L1416L2396L1819K9972K6836K2018
63600G90315J5595Q507J774m198r131j2303j3086j1878r898q230p470q040j0085
63587G21872j3051j5966j8316k0297k2123k3492k3839k2910k0938j8415j5735
$$ y = [318326, 320349, 321560, 321414, 319981, 318104, 316601, 315710, 315357, 315503, 316088, 317022, 318375, 320210, 322117, 323304, 323429, 323098, 323372, 324914, 327632, 330840, 333642, 335450, 336362, 336846, 336988, 336330, 334560, 331992, 329116, 325989, 322438, 318579, 314690, 310744, 306577, 302476, 299070, 296489, 294158, 291706, 289627, 288569, 288299, 288001, 287536, 287745, 289268, 291617, 293801, 295535, 297384, 299865, 302899, 306124, 309405, 312919, 316964, 321789, 327471, 333895, 340899, 348389, 356226, 364224, 372485, 381628, 392381, 404974, 419167, 434853, 452266, 471524, 492270, 513972, 536530, 560505, 586780, 615858, 647274, 679670, 711489, 741461, 768297, 790315, 805910, 814417, 816191, 811993, 802862, 790559, 777473, 765595, 755697, 747467, 739997, 731957, 721872, 708821, 692855, 674539, 654242, 632119, 608627, 584788, 561878, 540940, 522525, 506790]
63576E06790j3080j0598q534o937n336l197p32J277K543L565M601N128M880M655
63562D85025N361O750P860Q334Q529Q615Q497Q454R080J0609J2843J5667J9045
63549F14669K2694K6381L0330L4794L9389M3312M5636M4792L8647K6632J1540
63538I78816k168j1980j8247k1819k2554k0470j6769j2806r187o547o016p946
63526H22307j1072j4041j7047k0931k5268k8524k9811k9483k8212k6467k4806
63515E66645k3677k2705k0911j7989j4810j2456j1124j0281r510q792q103p217
63503C99070o096n200n056n489n675n123m211l519k999k322j716j727k229k422
63489C45286j892j022j97O65J533J902J459O79L65R13K193L759M889M933M034
$$ y = [506790, 493710, 483112, 474578, 467641, 462305, 459108, 458376, 459653, 462196, 465761, 470362, 475490, 480370, 485025, 490386, 497136, 504996, 513330, 521859, 530474, 538971, 547425, 556505, 567114, 579957, 595624, 614669, 637363, 663744, 694074, 728868, 768257, 811569, 857205, 901997, 940644, 967276, 978816, 976648, 964668, 946421, 924602, 902048, 881578, 864809, 852003, 842816, 836269, 830253, 822307, 811235, 797194, 780147, 759216, 733948, 705424, 675613, 646130, 617918, 591451, 566645, 542968, 520263, 499352, 481363, 466553, 454097, 442973, 432692, 423182, 414390, 406287, 399070, 392974, 387774, 382718, 377229, 371554, 366431, 362220, 358701, 355702, 353380, 351664, 349937, 347708, 345286, 343394, 342372, 342175, 342840, 344373, 346275, 347734, 348413, 348778, 349691, 351884, 355643, 360532, 365465, 369499]
63474C69499L123K920L193L232K640J350n69k682m159m512m236m209m693n204
63460C55693n243m772m035l248k477j654p13K51J080J785K440K972L361L983N247
63445C54670O852P972Q314Q449Q912R621J0514J2017J4423J7332K0372K4015K8844
63432E32307L4124L7720L7538L2913K4894J5668P523J809j372k461j677R57N190
63419G25133J0519J6409K2323K7732L2324L5876L7723L6783L2537K5690J7523
63408A020572Q959O83o314j1109j3691j4838j5160j4768j3863j3062j3029j4126
63396I00254j6494k0015k4047k7602l0008l1222l1419l0542k8523k5773k3121
63385F11488k1186j9883j8571j6666j4110j1315q758o677m971l256j206J008K741
$$ y = [369499, 372622, 375542, 378735, 381967, 384607, 385957, 385388, 382706, 378547, 374035, 369799, 365590, 360897, 355693, 350450, 345678, 341643, 338395, 335918, 334264, 333551, 333802, 334882, 336667, 339107, 342079, 345440, 349423, 354670, 361522, 369494, 377808, 386257, 395169, 404790, 415304, 427321, 441744, 459076, 479448, 503463, 532307, 566431, 604151, 641689, 674602, 699496, 715164, 722687, 724496, 723124, 720663, 718986, 719943, 725133, 735652, 752061, 774384, 802116, 834440, 870316, 908039, 944822, 977359, 1003049, 1020572, 1029531, 1030214, 1023900, 1012791, 999100, 984262, 969102, 954334, 940471, 927409, 914380, 900254, 883760, 863745, 839698, 812096, 782088, 750866, 719447, 688905, 660382, 634609, 611488, 590302, 570419, 551848, 535182, 521072, 509757, 500999, 494322, 489351, 486095, 484889, 485897, 488638]
63372D88638L639M166N051O361P587Q615R934J1850J4051J6200J8389K0674K2719
63359F37874K4337K5966K8112L0598L2843L4559L5740L6029L4617L0796K4541
63348I76012J6632Q406J109m735r207j2338j3915j4073j3542j3066j3002j3669
63336H94612j5471j8206k0901k2962k4940k7408k9580l0026k8554k6375k4301
63325F25888k1831j8318j4173j0302o815k964J647O078Q308O519N89p496j4859
63312E52271j9629k1743k2063k1200j9321j6708j3986j1660r753p959o184m740
63300C77325l953l711l508k981k240j666j516j784k280k767l098l248l200k858
63286C38515k295j938k155k676k848k504k097j883j474n60M41Q53N36j45q57j358
$$ y = [488638, 492277, 496443, 501494, 507855, 515442, 524057, 533991, 545841, 559892, 576092, 594481, 615155, 637874, 662211, 688177, 716289, 746887, 779730, 814289, 850029, 886058, 920675, 951471, 976012, 992644, 1001050, 1002159, 997424, 988217, 975879, 961964, 947891, 934349, 921283, 908281, 894612, 879141, 860935, 840034, 817072, 792132, 764724, 735144, 705118, 676564, 650189, 625888, 604057, 585739, 571566, 561264, 554449, 551485, 553132, 559210, 567518, 574037, 574626, 567130, 552271, 532642, 510899, 488836, 467636, 448315, 431607, 417621, 405961, 396208, 388249, 382065, 377325, 373372, 369661, 366153, 363172, 360932, 359266, 357750, 355966, 353686, 350919, 347821, 344573, 341373, 338515, 336220, 334282, 332127, 329451, 326603, 324099, 322002, 320119, 318645, 318085, 318526, 319379, 319915, 319770, 318913, 317555]
63270C17555j343p17P0M63M92O51J191J903K493K758K483J610O08K19P28J712
63254C32876K554K999L103K977K690K351K169K381L031L813M296M439M700N429
63240C79808O368P002P298P791Q967J0735J2588J4070J5122J5998J6907J7757
63228E20411J8366J8830J9382J9899J9882J9117J8031J7163J6596J6080J5506
63217G19263J4978J4666J4864J5879J7504J8792J8730J7141J4626J1767Q606M903
63205H91719N77m155q956j3600j7940k1629k4089k5057k5037k4710k3982k2241
63193F80900j9573j6965j5003j3093j0476p374m511k028L40K506M269O047Q488
63180F13527J1337J3547J4608J5107J5699J6211J6049J5141J4083J3479J3402
$$ y = [317555, 316212, 315495, 315565, 316028, 316520, 317171, 318362, 320265, 322758, 325516, 327999, 329609, 330217, 330436, 331164, 332876, 335430, 338429, 341532, 344509, 347199, 349550, 351719, 354100, 357131, 360944, 365240, 369679, 374379, 379808, 386176, 393178, 400476, 408267, 417234, 427969, 440557, 454627, 469749, 485747, 502654, 520411, 538777, 557607, 576989, 596888, 616770, 635887, 653918, 671081, 687677, 703757, 719263, 734241, 748907, 763771, 779650, 797154, 815946, 834676, 851817, 866443, 878210, 886816, 891719, 892296, 888141, 879185, 865585, 847645, 826016, 801927, 776870, 751833, 727123, 703141, 680900, 661327, 644362, 629359, 616266, 605790, 598416, 593905, 591877, 592217, 594723, 598992, 605039, 613527, 624864, 638411, 653019, 668126, 683825, 700036, 716085, 731226, 745309, 758788, 772190]
63169G72190J3441J3233J2816J2379J1737J0459Q587O692M899K387j561o360j0719
63156H50180j4204j7479k0980k4096k5906k6200k5526k4583k3748k2929k1716
63145F02813j9833j7481j5101j2890j0811q984p753p260p208p028o255m859l330
63132D74020k260j739j373r42n60l0J206L013M155L752K726K759M134N521N915
63117E00297N700N628N705N540N092M624M301M207M368M566M486M206M085M074
63103E66879L691K826J996J517R96O6q52j023l46O12J264J333Q48K46K26J021
63087E81300J913J977J252P04R17J307R49j66j140j279p72j10N93J367J842J620
63071E92274J113J293K411L547L850L675L965M943O113P293Q831J0816J2785J4413
$$ y = [772190, 785631, 798864, 811680, 824059, 835796, 846255, 854842, 861534, 866433, 868820, 867259, 860899, 850180, 835976, 818497, 797517, 773421, 747515, 721315, 695789, 671206, 647458, 624529, 602813, 582980, 565499, 550398, 537508, 526697, 517713, 509960, 502700, 495492, 488464, 482209, 477350, 474020, 471760, 470021, 468648, 467706, 467146, 467116, 468322, 471335, 475490, 479242, 481968, 484727, 488861, 494382, 500297, 505997, 511625, 517330, 522870, 527962, 532586, 536887, 541094, 545462, 550028, 554514, 558720, 562805, 566879, 570570, 573396, 575392, 576909, 577905, 577971, 577119, 576096, 575750, 576362, 577626, 578959, 579807, 580053, 580279, 581300, 583213, 585190, 586442, 587146, 588063, 589370, 590319, 590153, 589013, 587734, 586962, 586852, 587445, 588812, 590654, 592274, 593387, 594680, 597091, 600638, 604488, 608163, 612128, 617071, 623184, 630477, 639308, 650124, 662909, 677322]
63057F77322J5946J7711J9731K1966K4601K7726L1017L4041L6680L9098M1383
63046I87222M3410M4974M5942M6287M6042M5239M4006M2663M1522M0491L9225
63035A467023L7825L7024L7242L7822L7686L6613L5197L3595L1015K6655K0561
63024A838258J3171M496n676j6839k7650l6926m4524n1016n6586o0610o2393o2011
63012A431694o0102n7046n2789m7474m1687l5931l0231k4411j8417j2208n817
63001A045581K91N359R188J2391J5552J8538K0978K2902K4504K5702K6382K6644
62989A254012K6500K5898K5392K5961K7478K8146K6406K2820J9063J5552J1289
62978A508517N723n86p119j3962k0961k7438l3054l8077m2482m5618m7139m7482
$$ y = [677322, 693268, 710979, 730710, 752676, 777277, 805003, 836020, 870061, 906741, 945839, 987222, 1030632, 1075606, 1121548, 1167835, 1213877, 1259116, 1303122, 1345785, 1387307, 1427798, 1467023, 1504848, 1541872, 1579114, 1616936, 1654622, 1691235, 1726432, 1760027, 1791042, 1817697, 1838258, 1851429, 1855925, 1850249, 1833410, 1805760, 1768834, 1724310, 1673294, 1616708, 1556098, 1493705, 1431694, 1371592, 1314546, 1261757, 1214283, 1172596, 1136665, 1106434, 1082023, 1063606, 1051398, 1045581, 1045872, 1051231, 1060419, 1072810, 1088362, 1106900, 1127878, 1150780, 1175284, 1200986, 1227368, 1254012, 1280512, 1306410, 1331802, 1357763, 1385241, 1413387, 1439793, 1462613, 1481676, 1497228, 1508517, 1514240, 1513654, 1506535, 1492573, 1471612, 1444174, 1411120, 1373043, 1330561, 1284943, 1237804, 1190322]
62966A190322m7114m5958m3932m1375l8639l5733l2723k9921k7485k5272k3346
62955G98824k2083k1550k1226k0567j9435j7929j6245j4760j3741j2944j2007
62944F06337j1205j1124j1582j1635j0880r954r459r057q108o636n238m381m127
62931D92951m181m045l392k455j753j457j405j549j852j887j271m24j71n63r35
62916D65611j074j410j917j910j210o03o75j100j457j913k528k762k216j291n52
62901D42993p9J91J99K78J122K679L837L808L115K551J983R80m9l19J33O62J026
62884D65110J452J835J746J137L72l32r93j493j602j334r99r71j559k771m037
62869D55561m554m141l435l016k837k680k503k109j183p4K05o85j760j982j554
$$ y = [1190322, 1143208, 1097250, 1053318, 1011943, 973304, 937571, 904848, 874927, 847442, 822170, 798824, 776741, 755191, 733965, 713398, 693963, 676034, 659789, 645029, 631288, 618344, 606337, 595132, 584008, 572426, 560791, 549911, 539957, 530498, 521441, 513333, 506697, 501459, 497078, 492951, 488770, 484725, 481333, 478878, 477125, 475668, 474263, 472714, 470862, 468975, 467704, 467280, 467109, 466546, 465611, 464537, 463127, 461210, 459300, 458090, 457487, 456812, 455712, 454255, 452342, 449814, 447052, 444836, 443545, 442993, 442914, 443105, 443304, 443582, 444704, 447383, 451220, 455028, 458143, 460694, 462677, 463657, 463608, 463289, 463422, 464084, 465110, 466562, 468397, 470143, 471280, 471652, 471320, 470327, 468834, 467232, 465898, 464899, 463928, 462369, 459598, 455561, 451007, 446866, 443431, 440415, 437578, 434898, 432395, 430286, 429103, 429029, 429234, 428549, 426789, 424807, 423253]
62854D23253j223j018m87K70P68J017J427J949K057J472M66m58q68o58l35n50
62838D27082j084r87j09L91k49j088r14j45j20r55j514j266p67l34M61J654K389
62821D22445K067J216P55R88J624K250K537K461K440K873L437L390K671K116K379
62806D55649L131L589L467L197L407M361N702O766P221P368P609P881P878P642
62792E34868P580Q023R132J1035J3647J6520J9221K1729K4153K6445K8792L1866
62780G53011L6075M0829M5238M9322N3767N8612O2972O6197O8591P0654P2177
62769A377445P2308P0298O5903N9344N0962M0932K9427J7009M531p637j9783l1925
62757A728814m3144n2349n9355o4623o8330p0342p0819p0088o8156o5042o1353
$$ y = [423253, 422030, 421012, 420525, 420795, 421563, 422580, 424007, 425956, 428013, 429485, 429951, 429493, 428625, 427967, 427632, 427082, 425998, 425011, 424902, 425293, 425044, 423956, 423042, 422897, 422777, 421822, 420308, 419042, 418275, 417941, 418402, 420056, 422445, 424512, 425728, 426483, 427471, 429095, 431345, 433882, 436343, 438783, 441656, 445093, 448483, 451154, 453270, 455649, 458780, 462369, 465836, 469033, 472440, 476801, 482503, 489269, 496490, 503858, 511467, 519348, 527226, 534868, 542448, 550471, 559603, 570638, 584285, 600805, 620026, 641755, 665908, 692353, 721145, 753011, 789086, 829915, 875153, 924475, 978242, 1036854, 1099826, 1166023, 1234614, 1305268, 1377445, 1449753, 1520051, 1585954, 1645298, 1696260, 1737192, 1766619, 1783628, 1788159, 1780522, 1760739, 1728814, 1685670, 1633321, 1573966, 1509343, 1441013, 1370671, 1299852, 1229764, 1161608, 1096566, 1035213]
62746A035213n7803n4290n0275m5890m1746l7797l3372k8581k4585k2110k0478
62735F18286j8620j6402j4444j3080j2036j0889r394p559n599l795k373j550j498
62722E01047j935k004j106L03J260J521J646K007K499L221M524O191P445Q172
62708E34791R318J1553J4216J6260J7695J9344K1581K4063K6585K9374L2464L5440
62696G92684L8086M0800M3991M7415N0475N3029N5362N7371N8207N7036N3723
62685A348179M8552M1581L2841K2894J2483J702r770k1451l1940m0312m6885n2207
62673A305667n6063n8106n8769n8623n7343n4333n0142m6208m3245m0693l7830
62662G44312l4650l1511k8548k5710k2929k0090j7187j4514j2411j0828r555q685
$$ y = [1035213, 977410, 923120, 872845, 826955, 785209, 747412, 714040, 685459, 660874, 638764, 618286, 599666, 583264, 568820, 555740, 543704, 532815, 523421, 515862, 510263, 506468, 504095, 502545, 501047, 499112, 497108, 496002, 496305, 497565, 499086, 500732, 502739, 505238, 508459, 512983, 519174, 526619, 534791, 544109, 555662, 569878, 586138, 603833, 623177, 644758, 668821, 695406, 724780, 757244, 792684, 830770, 871570, 915561, 962976, 1013451, 1066480, 1121842, 1179213, 1237420, 1294456, 1348179, 1396731, 1438312, 1471153, 1494047, 1506530, 1508232, 1498462, 1477011, 1445071, 1404759, 1357874, 1305667, 1249604, 1191498, 1132729, 1074106, 1016763, 962430, 912288, 866080, 822835, 782142, 744312, 709662, 678151, 649603, 623893, 600964, 580874, 563687, 549173, 536762, 525934, 516379, 507694]
62650E07694q452q683q861q682q128p180n904m631l683k956k243j614j102m01
62636D35174N89J278J123M63j26q07j933k972l114k684k735l307l387k635j824
62621D13103j349o55M21J085R95J028J798K519K334J864K224L196L580L095K669
62606D37907K907L332L478L811N038O972Q681R666J0499J2109J4657J7457J9952
62593E56466K2377K5173K8130L0647L2572L4264L5784L6701L6666L5724L3814
62582I08318L0481K5316J8503J0821L288l378r255j4994k0786k5830k9284l1383
62570H61817l2892l3823l3627l2421l1023k9740k8095k5931k3704k1550j9097
62559E49914j6476j4479j3283j2023j0182q431p488p040o440n706n075m321l283
$$ y = [507694, 499242, 490559, 481698, 473016, 464888, 457708, 451804, 447173, 443490, 440534, 438291, 436677, 435575, 435174, 435763, 437041, 438164, 438627, 438501, 437694, 435761, 432789, 429675, 426991, 424256, 420949, 417562, 414927, 413103, 411754, 411099, 411520, 412605, 413600, 414628, 416426, 418945, 421279, 423143, 425367, 428563, 432143, 435238, 437907, 440814, 444146, 447624, 451435, 456473, 463445, 472126, 481792, 492291, 504400, 519057, 536514, 556466, 578843, 604016, 632146, 662793, 695365, 729629, 765413, 802114, 838780, 874504, 908318, 938799, 964115, 982618, 993439, 996727, 993349, 984094, 969100, 948314, 922484, 893200, 861817, 828925, 795102, 761475, 729054, 698031, 668291, 640196, 614265, 590561, 569011, 549914, 533438, 518959, 505676, 493653, 483471, 475040, 467552, 460512, 454072, 448366, 443291, 438970, 435687]
62546D35687k436k128j885j230o08o33r40p81l15k86o74p82n31o03j160j404q06
62529D18485P3M70N61J225K884N053O943Q133Q627Q641Q598R229J1158J4140J7054
62514E21274J9041K0390K1869K3521K4881K6199K8395L1536L4310L5582L5635
62503H22633L5228L4068L1122K6160K0176J4335R113M390j06m442q224j0684j1334
62490I62435j0413q422n533j814K161N553Q155J0680J4081J8660K3754K7919K9483
62477A076699K7297K1446J3421N541l01m007p474j3042k1357l0785l8863m4123
62465I84452m6634m7370m7260m6546m4855m1971l8396l4853l1392k7559k3361
62454E54255j9411j6082j3213j0801r191q361p623o437m883l143j164Q41K246
$$ y = [435687, 433251, 431123, 429238, 428008, 427400, 426767, 425827, 425046, 424731, 424445, 423771, 422989, 422458, 421855, 420695, 419291, 418485, 418558, 419028, 419589, 420814, 423698, 428751, 435694, 443827, 452454, 461095, 469693, 478922, 490080, 504220, 521274, 540315, 560705, 582574, 606095, 630976, 657175, 685570, 717106, 751416, 786998, 822633, 857861, 891929, 923051, 949211, 969387, 983722, 992835, 997225, 997119, 992677, 984453, 973769, 962435, 952022, 943600, 938067, 936253, 938414, 943967, 952122, 962802, 976883, 995543, 1019297, 1047216, 1076699, 1103996, 1125442, 1138863, 1144404, 1144103, 1140096, 1132622, 1119580, 1098223, 1067438, 1028575, 984452, 937818, 890448, 843188, 796642, 751787, 709816, 671420, 636567, 605175, 577616, 554255, 534844, 518762, 505549, 494748, 485557, 477196, 469573, 463136, 458253, 455110, 453946, 454787, 457033]
62441D57033K869L273L814M105L972M138N167O363O577N685M375K820N93k186
62427E08598m543n747o098o385o978p599p784p397o798o456o404o330o085n743
62413D18251n133l948k529j843k234k845k825k478k559k925k771j893q97k72N0
62398C83149K53M12P82J672K966M101M672M699M351L744L132K939L422M319N004
62383D29617N039M702M824N881P381Q454Q881Q992Q845Q261P630P672Q249Q375
62369E32803P828P720Q896J0686J2004J2916J4254J6324J8920K2141K6213L0812
62357G21517L5404L9969M4719M9361N3283N6139N7629N7127N4265M9448M3153
62346A262014L5222K5684J5758P043j9o024j1344j5999k0430k5194k9919l3623
$$ y = [457033, 459902, 463175, 466989, 471094, 475066, 479204, 484371, 490734, 497311, 502996, 507371, 510191, 510784, 508598, 504055, 498308, 492210, 485825, 478847, 471248, 463464, 456067, 449269, 442813, 436409, 430079, 423994, 418251, 413118, 409170, 406641, 404798, 402564, 399719, 396894, 394416, 391857, 388932, 386161, 384268, 383371, 383099, 383149, 383402, 383814, 384596, 386268, 389234, 393335, 398007, 402706, 407057, 410801, 413933, 416872, 420294, 424613, 429617, 434656, 439358, 444182, 450063, 457444, 465898, 474779, 483771, 492616, 500877, 508507, 516179, 524428, 532803, 540631, 548351, 557247, 567933, 579937, 592853, 607107, 623431, 642351, 664492, 690705, 721517, 756921, 796890, 841609, 890970, 944253, 1000392, 1058021, 1115148, 1169413, 1218861, 1262014, 1297236, 1322920, 1338678, 1345721, 1345702, 1339678, 1328334, 1312335, 1291905, 1266711, 1236792, 1203169]
62334A203169l6029l7584l8271l7549l5555l3297l1283k9020k6199k3534k1907
62323H52941k1301k1059k0705k0185j9673j9356j9195j8880j8335j7978j8037
62312F38237j7875j6789j5194j4068j3350j1981r695p590o573o154n397m246l227
62299E06098k520j935j431j034n37K17J030J612J939K109K165K262K664L300L692
62284E19631L584L267L079K949K694K394K155J853J473J338J638K033K174K344
62270E52606L100M429N745O744P774R287J1276J3532J6129J9303K2985K6865L0929
62257G30704L5569M0965M6692N2274N7716O2955O7057O8620O7120O3180N7432
62246A350284M9861M0526L0287K0279J1143L112l877j0586j8291k7298l6179m3222
$$ y = [1203169, 1167140, 1129556, 1091285, 1053736, 1018181, 984884, 953601, 924581, 898382, 874848, 852941, 831640, 810581, 789876, 769691, 750018, 730662, 711467, 692587, 674252, 656274, 638237, 620362, 603573, 588379, 574311, 560961, 548980, 539285, 531695, 525122, 518968, 513571, 509325, 506098, 503578, 501643, 500212, 499178, 498641, 498858, 499888, 501500, 503439, 505548, 507713, 509975, 512639, 515939, 519631, 523215, 526482, 529561, 532510, 535204, 537598, 539753, 541606, 543079, 544417, 546055, 548088, 550262, 552606, 555706, 560135, 565880, 572624, 580398, 589685, 600961, 614493, 630622, 649925, 672910, 699775, 730704, 766273, 807238, 853930, 906204, 963920, 1026875, 1093932, 1162552, 1229672, 1292852, 1350284, 1400145, 1440671, 1470958, 1491237, 1502380, 1505492, 1501615, 1491029, 1472738, 1445440, 1409261, 1366039]
62234A366039m8329n2577n6247n8318n7866n5147n1211m7096m3489m0409l7103
62223H18247l2911k8330k4714k2685k1402j9569j6811j3851j1684j0727j0580
62212F04983j0517j0189r687q908p407n220l318k598k742k661j847o86L24J047
62198E40574J513J884K505L555M725N627O222O539O454O200O503P539Q415Q494
62184F16749Q508R337J0382J0414R565R015Q972Q510P306O032N004L954L347M277
62170G21372O636Q976J0839J3639J8414K4106K9130L3460L7889M2129M4949M5615
62158A037154M4095M0231L3934K5957J7635R926L262k046o040r524j3545j8398
62146A162641k3586k8467l2519l5252l6493l6582l5883l4265l1474k7818k4029
$$ y = [1366039, 1317710, 1265133, 1208886, 1150568, 1092702, 1037555, 986344, 939248, 895759, 855350, 818247, 785336, 757006, 732292, 709607, 688205, 668636, 651825, 637974, 626290, 615563, 604983, 594466, 584277, 574590, 565682, 558275, 553055, 549737, 547139, 544397, 541736, 539889, 539203, 539527, 540574, 542087, 543971, 546476, 550031, 554756, 560383, 566605, 573144, 579598, 585798, 592301, 599840, 608255, 616749, 625257, 634594, 644976, 655390, 664955, 673970, 682942, 691452, 698758, 704790, 709794, 713748, 717095, 721372, 728008, 736984, 747823, 761462, 779876, 803982, 833112, 866572, 904461, 946590, 991539, 1037154, 1081249, 1121480, 1155414, 1181371, 1199006, 1208932, 1212194, 1210148, 1204108, 1194584, 1181039, 1162641, 1139055, 1110588, 1078069, 1042817, 1006324, 969742, 933859, 899594, 868120, 840302, 816273]
62135H16273k0574j7481j4667j2063r572p265n547m787m804m930m573l647k523
62122G03840j657j174p67PJ396L477O188R072J1356J2758J3835J4918J5058J2872
62108H01179Q423L367p77l621n106m848k886l67J178R26r81l790o426p999q344
62093G69928p815o625m832k902j437l58Q60K121K751K718K741L054L205L358M536
62078G71303O988R520J1187J2548J4323J5954J6625J6821J7618J8933J9720J9574
62066I51114J9095J8940J9430K0876K3329K6072K8106K8956K8461K6151K1632
62055A212162J5397Q576K052l607p827j0555j2848j5977j9944k3603k6257k8377
62043A089192l0723l3437l6093l8131l9070l8730l7349l5296l2795l0103k7592
$$ y = [816273, 795699, 778218, 763551, 751488, 741916, 734651, 729104, 724317, 719513, 714583, 710010, 706363, 703840, 702183, 701009, 700242, 700249, 701645, 705122, 711310, 720382, 731738, 744496, 758331, 773249, 788307, 801179, 809602, 812969, 812192, 808571, 803465, 798617, 795731, 795364, 796542, 797468, 796487, 792697, 786271, 778272, 769928, 762113, 755488, 750656, 747754, 746317, 745959, 746819, 748940, 751691, 754409, 757150, 760204, 763409, 766767, 771303, 778291, 787811, 798998, 811546, 825869, 841823, 858448, 875269, 892887, 911820, 931540, 951114, 970209, 989149, 1008579, 1029455, 1052784, 1078856, 1106962, 1135918, 1164379, 1190530, 1212162, 1227559, 1236135, 1238187, 1234580, 1226753, 1216198, 1203350, 1187373, 1167429, 1143826, 1117569, 1089192, 1058469, 1025032, 988939, 950808, 911738, 873008, 835659, 800363, 767568, 737465, 709873]
62032G09873k5288k2705j9634j6724j4638j3044j1164r054p510o738n965m539
62020E52870k829j789j997l170m330m524l693k788k616k860k643j881j344j387
62006E15019j341m50J132K594L475M011M566M955M615L401J986J153Q44M12k73
61991E46099o64o44j050k606m929p113q769r920j0346r842q847q071p628p122
61977D58548o472n963n634n184m477l635k669j534m72J29K58K14J58J64N21J455
61961D25407K547K935K285J167M29M82J175K042K647K921L172L610M056M292M466
61946D63633M854N474O287P521R357J1517J3545J5326J6922J8160J8864J9344
61934F10804K0075K0941K1315K0883J9956J8907J7668J5928J3599J1022Q725O835
$$ y = [709873, 684585, 661880, 642246, 625522, 610884, 597840, 586676, 577622, 570112, 563374, 557409, 552870, 550041, 548252, 546255, 543085, 538755, 534231, 530538, 527750, 525134, 522274, 519631, 517750, 516406, 515019, 513678, 513228, 514360, 516954, 520429, 524440, 529006, 533961, 538576, 541977, 543963, 545116, 545960, 546372, 546099, 545435, 544791, 543741, 541135, 536206, 529093, 520324, 510404, 500058, 490216, 481369, 473298, 465670, 458548, 452076, 446113, 440479, 435295, 430818, 427183, 424514, 422980, 422508, 422637, 422895, 423109, 423267, 423431, 423952, 425407, 427954, 430889, 433174, 434341, 434770, 435252, 436427, 438469, 441116, 444037, 447209, 450819, 454875, 459167, 463633, 468487, 473961, 480248, 487769, 497126, 508643, 522188, 537514, 554436, 572596, 591460, 610804, 630879, 651820, 673135, 694018, 713974, 732881, 750549, 766477, 780076, 791098, 799823, 806658]
61922H06658M713J546k466n976p938q773r551j0316j0021q050n065k076P40L926
61908G47351P709J1470J4350J6182J7550J8804J9280J7952J4757J0678O472K018
61896I04573k829p451j1082j3719j5863j7684j8961j9531j9315j8265j6693j5308
61884G27872j4443j3634j2460j1322j0764j0511r978r369r307r554r084p559n893
61871E93994m999m659m020k783j398l00O41J796L150M243M881N569O823Q325R431
61856F20694J0453J2543J5974J9431K1572K2666K4047K6476K9664L2878L5339
61845H71737L6404L6094L5136L3951L1915K8166K2747J6382R606K770l574r003
61833A112331j3554j7096j8871j8408j6322j3416r531m297J466O360J0119J3447
$$ y = [806658, 811371, 812917, 810451, 804475, 796537, 787764, 778213, 767897, 757876, 749826, 744761, 742685, 743425, 747351, 755060, 766530, 780880, 797062, 814612, 833416, 852696, 870648, 885405, 896083, 902555, 904573, 901744, 894293, 883211, 869492, 853629, 835945, 816984, 797453, 778138, 759873, 743180, 727872, 713429, 699795, 687335, 676013, 665249, 654738, 644760, 635391, 626084, 616530, 607446, 599887, 593994, 588995, 584336, 580316, 577533, 576135, 575835, 576476, 578272, 581422, 585665, 590546, 596115, 602938, 611263, 620694, 631147, 643690, 659664, 679095, 700667, 723333, 747380, 773856, 803520, 836398, 871737, 908141, 944235, 979371, 1013322, 1045237, 1073403, 1096150, 1112532, 1122138, 1124908, 1121334, 1112331, 1098777, 1081681, 1062810, 1044402, 1028080, 1014664, 1005133, 1000836, 1002302, 1008662, 1018781, 1032228]
61821A032228J6271J7395J6056J2779Q394L162k821r209j5686k2089k7947l2496
61809I96037l5303l6515l6378l5020l2725k9916k6955k4177k1945k0245j8508
61798F78350j6362j4177j2355j0619q704p162o545o304n553m527m073m048l508
61785E74413k408j732j909k322k581k939l352l271k687k292k321k301k161k458
61771E39679l164l430k914k270j913j442p32l33k30N31K194L396K938J544Q64
61756E34718J365K261K895L218L177K588J561M46n97j589k489l250l870m198m015
61741E32221l457k926k512k009j567j521j579j002Q0N96J35l63j51J48k28o64
61725E15201j6J561K762K894K532K488K877L265L213K663K073K006K400K559K103
$$ y = [1032228, 1048499, 1065894, 1081950, 1094729, 1103123, 1106285, 1103464, 1094255, 1078569, 1056480, 1028533, 996037, 960734, 924219, 887841, 852821, 820096, 790180, 763225, 739048, 717103, 696858, 678350, 661988, 647811, 635456, 624837, 616133, 608971, 602426, 596122, 590569, 586042, 581969, 577921, 574413, 572005, 570273, 568364, 566042, 563461, 560522, 557170, 553899, 551212, 548920, 546599, 544298, 542137, 539679, 536515, 533085, 530171, 527901, 525988, 524546, 523814, 523481, 523251, 523782, 525976, 529372, 532310, 533854, 534718, 536083, 538344, 541239, 544457, 547634, 550222, 551783, 552229, 551632, 550043, 547554, 544304, 540434, 536236, 532221, 528764, 525838, 523326, 521317, 519750, 518229, 516650, 515648, 515728, 516324, 516459, 516096, 515945, 516093, 515865, 515201, 515185, 516746, 519508, 522402, 524934, 527422, 530299, 533564, 536777, 539440, 541513, 543519, 545919, 548478, 550581]
61710E50581J439R40K76q98k131k817l178l827m632m806m128l301l030l315l742
61695E13431l996l908l440k830k554k903l689m404m642m416m057l824l659l384
61681D61725l004k669k458k448k762l230l294k658j850j574j676j459q34m51n61
61666D30797o42l27j4j87p21j179j377j285q99l77M0L49P00J002J161J477K177
61649D30695K707K404J735J805K673L314L392L662M274M200L021J915J854K094
61635D69745J530M67k95j114k759m697n614n346m841m497l897l077k701k853k850
61620D27201k460k244k443k555k318k111k038j512l64M31j58j817l353m205m851
61605C95203n723o386o110m937l719l140l023k852k637k742k991k648j533n79
$$ y = [550581, 552020, 552960, 553236, 552338, 550207, 547390, 544212, 540385, 535753, 530947, 526819, 523518, 520488, 517173, 513431, 509435, 505527, 502087, 499257, 496703, 493800, 490111, 485707, 481065, 476649, 472592, 468768, 465109, 461725, 458721, 456052, 453594, 451146, 448384, 445154, 441860, 439202, 437352, 435778, 434102, 432643, 431809, 431358, 430797, 430155, 429828, 429814, 429627, 428906, 427727, 426350, 425065, 424166, 423789, 423829, 424178, 424878, 425880, 427041, 428518, 430695, 433402, 435806, 437541, 439346, 442019, 445333, 448725, 452387, 456661, 460861, 463882, 465797, 467651, 469745, 471275, 471742, 471447, 470333, 467574, 462877, 457263, 451917, 447076, 442579, 438682, 435605, 432904, 430051, 427201, 424741, 422497, 420054, 417499, 415181, 413070, 411032, 409520, 409156, 409587, 409429, 407612, 404259, 400054, 395203, 389480, 383094, 376984, 372047, 368328, 365188, 362165, 359313, 356676, 353934, 350943, 348295, 346762, 346183]
61591C46183p56j817k643k595j964j258o32j82k44r92j921k156j372k47K78O3
61575C27745k28j87j67n08q03n58j20k03p38j031r37r45j096q38j41K08j55m77
61557C18821O7J353K668L482L435K339O40o53r93p33k64N45J628K305K137J562
61541C38339J146Q78O36O69J021J221J134J400K384L436L890L966L938L296J759
61526C69113K93j14p6r37k647l826l823l361l095k693j707m53L87M46j77r78j225
61509C45127n69M44Q80M57k71o42m74o3M6m59j130j125l57K65J51j06K32Q26R32
61490C44164O40N42O66P38J059J899K434J570k83j518j407p50l15J22Q67J532
61474C51960J730J683J577J110J79o22p14l35j16j96j97J23N29N29j19j027j330
$$ y = [346183, 345427, 343610, 340967, 338372, 336408, 335150, 334518, 334336, 334092, 333100, 331179, 329023, 327651, 327404, 327682, 327745, 327517, 327330, 327163, 326655, 325852, 325294, 325174, 324971, 324233, 323202, 322265, 321320, 320224, 319386, 319245, 319453, 319298, 318821, 318888, 320241, 322909, 326391, 329826, 332165, 332805, 332152, 331159, 330426, 330162, 330707, 332335, 334640, 336777, 338339, 339485, 340363, 340999, 341668, 342689, 343910, 345044, 346444, 348828, 352264, 356154, 360120, 364058, 367354, 369113, 369406, 369292, 369216, 368279, 365632, 361806, 357983, 354622, 351527, 348834, 347127, 346674, 347061, 347507, 347330, 346352, 345127, 344558, 345002, 345882, 346339, 346068, 345426, 344952, 344889, 344935, 344476, 343346, 342221, 341864, 342129, 342280, 342174, 342406, 343232, 344164, 344804, 345346, 346012, 346750, 347809, 349708, 352142, 353712, 353429, 351911, 350504, 349754, 349439, 349561, 350428, 351960, 353690, 355373, 356950, 358060, 358239, 357617, 356903, 356568, 356452, 356256, 356059, 356182, 356711, 357240, 357121, 356094, 354764]
61457C54764n72O42J197O93j46l30M59J708K517K299J340O09O83J103J117P95
61441C68878Q62J578K399K795K825K905L301L983M576M589L974L347L299L591
61427D12902L470K695J804J408J606K021K202J988J708J859K431K849K742K322
61413D44007J794R30k94j263j526j558j987k582k736k594k806l403l784l686l379
61398D15133l004k435j793j399j278j204j122j023o90k02k06j043j911j842j130
61383C94851q08r47o15N40J766K444K800L144L324L172K831K327J568Q67Q07J362
61367D19433J833J845J677J576J413J226J345J797K182K365K634L052L373L764
61353D49515M816O611Q361R397R901J0424J1169J1961J2473J2201J0793Q613O587
$$ y = [354764, 354192, 354834, 356031, 356724, 356578, 356248, 356707, 358415, 360932, 363231, 364571, 365180, 365863, 366966, 368083, 368878, 369740, 371318, 373717, 376512, 379337, 382242, 385543, 389526, 394102, 398691, 402665, 406012, 409311, 412902, 416372, 419067, 420871, 422279, 423885, 425906, 428108, 430096, 431804, 433663, 436094, 438943, 441685, 444007, 445801, 446731, 446437, 445174, 443648, 442090, 440103, 437521, 434785, 432191, 429385, 425982, 422198, 418512, 415133, 412129, 409694, 407901, 406502, 405224, 404020, 402898, 401875, 401185, 400983, 400777, 399734, 397823, 395981, 394851, 394043, 393096, 392481, 393021, 394787, 397231, 400031, 403175, 406499, 409671, 412502, 414829, 416397, 417264, 418071, 419433, 421266, 423111, 424788, 426364, 427777, 429003, 430348, 432145, 434327, 436692, 439326, 442378, 445751, 449515, 454331, 460942, 469303, 478700, 488601, 499025, 510194, 522155, 534628, 546829, 557622, 566235, 572822]
61340E72822N284M498L776K921J926R22K21m9l57j285k700l928m706n265n560
61325E68520n215m346l597l177k576j531n64j88k58m07n85p87o54J73J584L101
61309E49493M258M849N156N894P520R576J1181J2111J2865J3652J3887J2851J0311
61296F73604O505J989k365n735p898r195r950j0263j0206r823r083q168p493p010
61282E84909n992m109k269j478j383r23k7N64R51K078M009N546N975N991O400
61267F00242O920O848O096N092M299M231N233O979Q785J0606J2909J5444J7086
61254G10770J7198J6202J4400J1268O600J556k295m514n853p165q688j0097j0925
61241G28457j1087j1019j0990j0496q952o770m978l893l058k428k391k673k394
$$ y = [572822, 578106, 582604, 586380, 589301, 591227, 592149, 592370, 592321, 591964, 590679, 587979, 584051, 579345, 574080, 568520, 563305, 558959, 555362, 552185, 549609, 548078, 547514, 547326, 547068, 546661, 546076, 545289, 544635, 544808, 546392, 549493, 553751, 558600, 563756, 569650, 577170, 586746, 597927, 610038, 622903, 636555, 650442, 663293, 673604, 680109, 682098, 679733, 673998, 666100, 656905, 646955, 636692, 626486, 616663, 607580, 599412, 591919, 584909, 578917, 574808, 572539, 571061, 569678, 568755, 568728, 569292, 570243, 572321, 576330, 581876, 587851, 593842, 600242, 607162, 614010, 620106, 625198, 629497, 633728, 638961, 645940, 654725, 665331, 678240, 693684, 710770, 727968, 744170, 758570, 769838, 776438, 777994, 775699, 771185, 765332, 758167, 749479, 739382, 728457, 717370, 706351, 695361, 684865, 675913, 669143, 664165, 660272, 657214, 654786, 652395, 649722, 647328]
61228F47328j487q05m85N06K573M513N173N042N291N962O169N484M305L199K567
61213F95335K620L140L532L546L483L460K973J647p2j323j629j077j56N68J154
61198G17201K598N686R626J2794J4877J7082K0091K2993K4715K5166K4436K2059
61186I19324J7960J3178Q763M819J313j061j790j537j402j747k448l672n554p663
61172I38483r486j1038j2471j3634j4469j5264j6040j6361j6160j5974j5983j5731
61160G65872j5192j5064j5429j5211j3773j1952j0611r223o946m142j679N11K909
61147F50070N155O471O845O651N596L161k08l481o296q897j1093j2194j1879j0358
61133F19543p965n163k621n77J447L729N676O776P618R112J1241J3377J5354J7350
$$ y = [647328, 645841, 645036, 644551, 645057, 647630, 652143, 657316, 662358, 667649, 673611, 679780, 685264, 689569, 692768, 695335, 697955, 701095, 704627, 708173, 711656, 715116, 718089, 719736, 719664, 718341, 716712, 715635, 715479, 716047, 717201, 719799, 725485, 735111, 747905, 762782, 779864, 799955, 822948, 847663, 872829, 897265, 919324, 937284, 950462, 959225, 964044, 965357, 964296, 962506, 960969, 959567, 957820, 955372, 951700, 946146, 938483, 928997, 917959, 905488, 891854, 877385, 862121, 846081, 829720, 813560, 797586, 781603, 765872, 750680, 735616, 720187, 704976, 691203, 679251, 668640, 659417, 652471, 648329, 646650, 647161, 650070, 655225, 661696, 668541, 675192, 680788, 683949, 683741, 680260, 673964, 665067, 653974, 641780, 629901, 619543, 611578, 606415, 603794, 603217, 604664, 608393, 614069, 620845, 628463, 637575, 648816, 662193, 677547, 694897]
61119F94897J9145K0395K1389K2698K4345K5912K7118K7753K7547K6663K5747
61108I63609K4930K3498K1228J9145J8030J7057J4926J1674Q205M745R61k976
61096A125032o739j0875j6098k1752k6197k8615k9498k9548k9126k8639k8361
61085H69584k7900k6657k4734k2670k0580j8389j6496j5277j4222j2534j0433
61074F59692q848p983p128n805m307l044k111j472r85l99K99P71R74J458K507
61059F23619L643M411N075N978O959P983R419J1085J2059J2303J3236J5668J8306
61046G49744J9618K0076K1097K2773K4211K5285K6397K7206K7252K7205K7872
61035A018736K8684K8744K8609K9251K9997K9596K8667K8890L0193L1007L1101
$$ y = [694897, 714042, 734437, 755826, 778524, 802869, 828781, 855899, 883652, 911199, 937862, 963609, 988539, 1012037, 1033265, 1052410, 1070440, 1087497, 1102423, 1114097, 1122302, 1127047, 1128008, 1125032, 1118293, 1107418, 1091320, 1069568, 1043371, 1014756, 985258, 955710, 926584, 897945, 869584, 841684, 815027, 790293, 767623, 747043, 728654, 712158, 696881, 682659, 670125, 659692, 650844, 642861, 635733, 629928, 625621, 622577, 620466, 618994, 618009, 617610, 617909, 618680, 619654, 621112, 623619, 627262, 631673, 636748, 642726, 649685, 657668, 667087, 678172, 690231, 702534, 715770, 731438, 749744, 769362, 789438, 810535, 833308, 857519, 882804, 909201, 936407, 963659, 990864, 1018736, 1047420, 1076164, 1104773, 1134024, 1164021, 1193617, 1222284, 1251174, 1281367, 1312374, 1343475]
61024A343475L1946L4133L6543L8130L8721L8153L6603L5717L7414M1732M7663
61013A760230N5654O6635P9073Q9969R8971J08724J21143J36603J57122J86582
61003B860706K26741K76478L36168M09339M99343O09288P47170R25782J154996
60994H046011J439760J784688K179006K551936K749087K596395K032902J193638
60986B4573423L47116k64490n36599m88020j91671K42441O36079P64899M76674
60977B5559852j91096j021092j754370k230983k426764k399285k224283j968027
60969A1343952j682745j404093j150922r31347p48374o00202m80657l83593l06052
60960C655967k46283k01149j67125j41972j23736j09690r7888q8417q1588p5958
$$ y = [1343475, 1375421, 1409554, 1446097, 1484227, 1522948, 1561101, 1597704, 1633421, 1670835, 1712567, 1760230, 1815884, 1882519, 1961592, 2051561, 2150532, 2259256, 2380399, 2517002, 2674124, 2860706, 3087447, 3363925, 3700093, 4109432, 4608775, 5218063, 5965233, 6891015, 8046011, 9485771, 11270459, 13449465, 16001401, 18750488, 21346883, 23379785, 24573423, 24920539, 24656049, 24119450, 23631430, 23439759, 23682200, 24318279, 25083178, 25559852, 25368756, 24347664, 22593294, 20362311, 17935547, 15536262, 13311979, 11343952, 9661207, 8257114, 7106192, 6174845, 5426471, 4826269, 4345612, 3962019, 3655967, 3409684, 3208535, 3041410, 2899438, 2775702, 2666012, 2568124, 2479707, 2398119, 2322161]
60950B322161o9709o2987n7265n2991m9506m7001m6854m9641n4022n8057o0794
60939A713334o2178o2122o0588n8253n6322n5385n4711n2968m9574m5224m1142
60928A114867l8002l5572l3221l0624k7992k5673k3666k1662j9518j7492j5911
60917H25534j4813j4062j3473j2611j0883q290n756m180l373k531j498q57q13
60904G32394p97k69O41J426J530N19j423l228l914l820m025m700n096n114n640
60889F98484o843p565p045o145n920o009n510m622m310m776n414n980o773p738
60875F13834q282q017p247o591o510o983p367o937n846n115n247n485m949l914
60861E25344l200k813k097r43J02P87J363J798J601O30n17j170j192q23k67L92
$$ y = [2322161, 2252452, 2189465, 2132200, 2079209, 2029703, 1982702, 1935848, 1886207, 1832185, 1774128, 1713334, 1651156, 1589034, 1528446, 1470193, 1413871, 1358486, 1303775, 1250807, 1201233, 1156009, 1114867, 1076865, 1041293, 1008072, 977448, 949456, 923783, 900117, 878455, 858937, 841445, 825534, 810721, 796659, 783186, 770575, 759692, 751402, 745646, 741466, 738093, 735562, 734064, 733207, 732394, 731597, 731328, 731969, 733395, 734925, 735444, 734021, 730793, 726879, 723059, 719034, 714334, 709238, 704124, 698484, 691641, 684076, 677031, 670886, 664966, 658957, 653447, 648825, 644515, 639739, 634325, 628345, 621572, 613834, 605552, 597535, 590288, 583697, 577187, 570204, 562837, 555900, 550054, 544939, 539692, 534207, 529258, 525344, 522144, 519331, 517234, 516291, 516393, 517180, 518543, 520341, 521942, 522572, 522055, 520885, 519693, 518870, 518603, 518995]
60845E18995J125J883K434K361J435n6j559k750l607m151m387m398m304m143l888
60830D94990l455k683j534l55L89O91R87J459J824J977K267K816L020K251P56
60815E05400o14j380j718j968k244k437k378k000j548j465j956k719l292l446
60801D76235l262k978k847k949l088l098l128l381l735l971m209m609m852m511
60787D25617l777l214k918k644k567k983l332k683j322o80j320k106j922j082
60773C93067m04O4O14J060J246J598K378L037L194L493M507N495N411M570M154
60758D33484M331M162L268K437K387K813K959K468J431K06p03r66o95j64N71J332
60742D59321J417K23j832l683m919o047p418q530q704p972o947o088n392m702
$$ y = [518995, 520120, 522003, 524437, 526798, 528233, 528177, 526618, 523868, 520261, 516110, 511723, 507325, 503021, 498878, 494990, 491535, 488852, 487318, 486963, 487352, 488043, 489030, 490489, 492313, 494290, 496557, 499373, 502393, 504644, 505400, 504786, 503406, 501688, 499720, 497476, 495039, 492661, 490661, 489113, 487648, 485692, 482973, 479681, 476235, 472973, 469995, 467148, 464199, 461111, 458013, 454885, 451504, 447769, 443798, 439589, 434980, 430128, 425617, 421840, 418626, 415708, 413064, 410497, 407514, 404182, 401499, 400177, 399497, 398177, 396071, 394149, 393067, 392663, 392727, 393341, 394401, 395647, 397245, 399623, 402660, 405854, 409347, 413854, 419349, 424760, 429330, 433484, 437815, 441977, 445245, 447682, 450069, 452882, 455841, 458309, 459740, 459946, 459243, 458277, 457582, 457418, 457989, 459321, 460738, 460961, 459129, 455446, 450527, 444480, 437062, 428532, 419828, 411856, 404909, 398821, 393429, 388727]
60728C88727m000l374k814k243j734j532j657j703j375r85r88j108n87O21J551
60713C66799J404N01k59m46k44rK8j07q2L95J079J449J483J692K203K485K185
60696C80556J705J621K036K692L212L184K586K183K732L723L878L068K638L402
60682D19216M504M892M820N020N345N294N138N417N836N602M547L078J490J5r39
60667D79275j412k266m024n859o596o358o244o712p177p069o313m949l117j451
60653D09728o84p56q26k35R17K051K632K588K390K516K651J981M10j166k110k742
60637D19345l389l682l401l134l266l192k379j425j025o88L84J797K503K305J714
60622D02467Q39l36j061n48O33J183Q72N09M54M01N30J303K192J942M65q38j008
$$ y = [388727, 384727, 381353, 378539, 376296, 374562, 373030, 371373, 369670, 368295, 367310, 366322, 365214, 364627, 365248, 366799, 368203, 368704, 368445, 367999, 367755, 367746, 367774, 367667, 367585, 367980, 369059, 370508, 371991, 373683, 375886, 378371, 380556, 382261, 383882, 385918, 388610, 391822, 395006, 397592, 399775, 402507, 406230, 410108, 413176, 415814, 419216, 423720, 428612, 433432, 438452, 443797, 449091, 454229, 459646, 465482, 471084, 475631, 478709, 480199, 480214, 479275, 477863, 475597, 471573, 465714, 459118, 452760, 446516, 439804, 432627, 425558, 419245, 414296, 411179, 409728, 409044, 408288, 407462, 407227, 408144, 410195, 412827, 415415, 417805, 420321, 422972, 424953, 425363, 424197, 422087, 419345, 415956, 412274, 408873, 405739, 402473, 399281, 396902, 395477, 394452, 393764, 394148, 395945, 398448, 400753, 402467, 403306, 402970, 401909, 401361, 401994, 403177, 404049, 404558, 405012, 405413, 405943, 407246, 409438, 411380, 411845, 411007, 409999]
60605D09999o10n10o24m76j36M4M0Pm2j19j34o3R9N66J471K440K940L009L155
60586D21056L528L742L498K880K090J292O66K44k01p30r97p62k50L97J535L330
60570D41318N209O604P763R090J0352J1315J2585J4767J7254J8911J9520J9531
60558E94219J8760J6567J3015Q751L956j336o136r082j0164j0596j0981j0721
60546E96252r384p367n026k290O48L233N406P671J0131J2457J4895J8229K2525
60533F67380K6855L0432L3067L4302L3297K9948K5089J9283J2330M404l298r575
60521I03514j4156j7172j8492j8148j6864j5611j4880j4483j3729j1814q689n482
60509G33994l427k444j458L8J650L229N262P919J0720J3469J6710K0981K6318
$$ y = [409999, 409389, 408879, 408255, 407779, 407643, 407687, 407727, 407734, 407692, 407573, 407439, 407376, 407475, 408041, 409512, 411952, 414892, 417901, 421056, 424584, 428326, 431824, 434704, 436794, 438086, 438752, 438996, 438795, 438065, 437068, 436306, 436056, 436453, 437988, 441318, 446527, 453131, 460894, 469984, 480336, 491651, 504236, 519003, 536257, 555168, 574688, 594219, 612979, 629546, 642561, 651312, 655268, 653932, 647796, 638714, 628550, 617954, 606973, 596252, 586868, 579501, 574475, 572185, 572833, 576066, 581472, 589143, 599274, 611731, 626626, 644855, 667380, 694235, 724667, 757734, 792036, 825333, 855281, 880370, 899653, 911983, 916387, 913089, 903514, 889358, 872186, 853694, 835546, 818682, 803071, 788191, 773708, 759979, 748165, 739476, 733994, 730567, 728123, 726665, 726703, 728353, 731582, 736844, 744763, 755483, 768952, 785662, 806643, 832961]
60496H32961L2675M0057M8054N5911O3232O9894P5260P8242P8311P5797P1093
60485A521487O4297N5533M4862L2006J7003J030j4463k9260m3936n8069p0089
60474A520401p8967q4677q7016q5478q0735p4746o8759o2349n5012m7483m0818
60463G54361l5271l0703k7164k4360k1540j8526j6052j4477j3043j1065q908p188
60451E26064n877m831m352m518m691m410m080m147m217l698k742j930j514j403
60437D73654j439j314p68j43j11o39r16n66j43j52m22p28j161j564j519j225j388
60420D59456j955j938r50J77P47J005J116O09m47r42l18M39L62m0R5M56L25P5
60402D58272N38J467J818J302N76J72R7K62O28J056J548K269K992L117K686K591
$$ y = [832961, 865636, 905693, 953747, 1009658, 1072890, 1142784, 1218044, 1296286, 1374597, 1450394, 1521487, 1585784, 1641317, 1686179, 1718185, 1735188, 1736218, 1721755, 1692495, 1648559, 1590490, 1520401, 1441434, 1356757, 1269741, 1184263, 1103528, 1028782, 960023, 897674, 842662, 795179, 754361, 719090, 688387, 661223, 636863, 615323, 596797, 580745, 566268, 553225, 542160, 533252, 526064, 520187, 515356, 511004, 506486, 501795, 497385, 493305, 489158, 484941, 481243, 478501, 476571, 475057, 473654, 472215, 470901, 470133, 469990, 469879, 469240, 468324, 467758, 467615, 467463, 467041, 466313, 465152, 463588, 462069, 460844, 459456, 457501, 455563, 454613, 454790, 455537, 456542, 457658, 458267, 457820, 456878, 456560, 456999, 457361, 457321, 457416, 457872, 458197, 458272, 458810, 460277, 462095, 463397, 463973, 464145, 464242, 464504, 465132, 466188, 467736, 470005, 472997, 476114, 478800, 481391]
60386D81391L240L820L563K980K911L131K838J978J153O73N37Q75J602K072J923
60371E14687J770K258K942K970K457K200K350K353K002J673J555J413J132R09
60357E42671Q85J052J377J753K029K341L074M259N475O638Q155R924J0854J0045
60343F10532P958N796M161K823J339n78k950n299o951p752q038p776o600m882
60329E81783l763l604l487k775k126k226k598k577k488k832l199l005k565k351
60315E42187j929p13R05K149L040L984M862N606O960R508J2567J5139J7427K0203
60301F41895K3357K6193K8549L0203K9768K5875J9226J1948M934k665j1267j9588
60289H08428k5894k9360k9942k7998k4483k0649j7186j4105j1445r501q351p737
$$ y = [481391, 484631, 488451, 492014, 494994, 497905, 501036, 503874, 505852, 507005, 507678, 508215, 509090, 510692, 512764, 514687, 516457, 518715, 521657, 524627, 527084, 529284, 531634, 533987, 535989, 537662, 539217, 540630, 541762, 542671, 543556, 544608, 545985, 547738, 549767, 552108, 555182, 559441, 564916, 571554, 579709, 589633, 600487, 610532, 618490, 624286, 628447, 631270, 632609, 632031, 629081, 623782, 616831, 609079, 601041, 593265, 586665, 581783, 578020, 574416, 570929, 568154, 566028, 563802, 561204, 558627, 556139, 553307, 550108, 547103, 544538, 542187, 540258, 539545, 540450, 542599, 545639, 549623, 554485, 560091, 567051, 576559, 589126, 604265, 621692, 641895, 665252, 691445, 719994, 750197, 779965, 805840, 825066, 837014, 841948, 839283, 828016, 808428, 782534, 753174, 723232, 695234, 670751, 650102, 632916, 618811, 607366, 597865, 589514, 581777]
60277E81777p366o852n752m295l633m461n781n971m800l403k503j833j141p11
60263E23275p02q55r61r32n68N1K49l37q77m27N09O81P1j17N13R83O33R3J13N09
60243E21904P57P85O27Q2p90j463j532j077k80O84J284R68J04j42Q36K355L399
60226E28501L681L479L090K767K760K976K897K236J401J142J871L399N166O675
60212E72041P790Q639R145Q990Q161P194O592O346O269O356O464O139N276M439
60198F69841L993L499K523J473Q73L54p16k049k829l021l347m162n178o085o627
60183F48542o383n307m333m426n215n467m767l776k984k220j411q59n70j66L91
60168F01049O60L85k12q38j216j042m09q7o44j508j670j062m06LM36Q45Q65O61
$$ y = [581777, 574411, 567559, 561807, 557512, 553879, 549418, 543637, 537666, 532866, 529463, 526960, 525127, 523986, 523275, 522573, 521718, 520757, 519825, 519257, 519308, 519557, 519220, 518343, 517916, 518425, 519106, 519177, 519060, 519573, 520556, 521189, 521282, 521395, 521904, 522661, 523446, 524073, 524155, 523365, 521902, 520370, 519293, 519013, 519697, 520981, 521949, 522053, 521911, 522747, 525102, 528501, 532182, 535661, 538751, 541518, 544278, 547254, 550151, 552387, 553788, 554930, 556801, 560200, 565366, 572041, 579831, 588470, 597615, 606605, 614766, 621960, 628552, 634898, 641167, 647523, 653987, 660126, 665402, 669841, 673834, 677333, 679856, 681329, 682202, 682556, 681840, 679791, 676962, 673941, 670594, 666432, 661254, 655169, 648542, 642159, 636852, 632519, 628093, 622878, 617411, 612644, 608868, 605884, 603664, 602253, 601394, 600824, 600658, 601049, 601709, 602094, 601882, 601044, 599828, 598786, 598377, 598290, 597646, 596138, 594468, 593406, 593000, 593003, 593439, 594284, 595149, 595810]
60150E95810Q72J657K587L369L964M164L844L508L722M248M499M543M777N011
60136F46575M938N095O180P703Q622R003R596J0048R153O991N086M118L046J123
60122G37277p69j499j209o59p6N80J066J218J189R01O6r18r99PQ12J84j616l417
60104G32138m524m981n077n092n171n123m724m243m138m253m075l692l517l136
60090F70392j582R30K818L123K694K775L428L995M228M252M029L571L167K878
60076G10698K269J049n25k240m344o936r459j1194j1862j1595j0760r937r440
60063F25724q842p569o022n267n562o078o191o067n744m768l194j948j558j427
60049E55487q38O4Q71J646K532L321L988M903O020O568O113N257M691M224L425
$$ y = [595810, 596682, 598339, 600926, 604295, 608259, 612423, 616267, 619775, 623497, 627745, 632244, 636787, 641564, 646575, 651513, 656608, 662788, 670491, 679113, 688116, 697712, 707760, 716913, 723904, 728990, 733108, 736154, 737277, 736508, 735009, 733800, 733141, 733065, 733645, 734711, 735929, 737118, 738019, 738085, 737167, 736168, 736175, 736987, 737171, 735555, 732138, 727614, 722633, 717556, 712464, 707293, 702170, 697446, 693203, 689065, 684812, 680737, 677045, 673528, 670392, 668810, 669740, 672558, 675681, 678375, 681150, 684578, 688573, 692801, 697053, 701082, 704653, 707820, 710698, 712967, 714016, 713491, 711251, 706907, 699971, 690512, 679318, 667456, 655861, 645101, 635164, 625724, 616882, 609313, 603291, 598024, 592462, 586384, 580193, 574126, 568382, 563614, 560420, 558472, 556914, 555487, 554649, 554713, 555584, 557230, 559762, 563083, 567071, 571974, 577994, 584562, 590675, 595932, 600623, 604847, 608272]
60034F08272K503J826J109j54j774l090l840m334m932n748o677p440p777p725
60020E60219p452o844n702m346l465l236l252l307l675m491n409o007n978n045
60006D92010l410k056j794k048j648o38j18k69l3R67J636J197M73N52J240J728
59990D87789J922K243K793L431M082M435M011L033K467K676K791K005O05p19j825
59975E21739k716l098k931k707k592k111j169n12n66p21m23P4O32J811L621M831
59959E13162M625L976M201M951M944L957K735J475j85j888k711k542k207k113
59945E32380j797r98l03m38j417k650l496l722l595l509l423k909j868p64M4O81
59929E02216J232J532J812K812M684O440P148P115P233P662P917P916Q194R095
$$ y = [608272, 610775, 612601, 613710, 613556, 611782, 608692, 604852, 600518, 595586, 589838, 583161, 575721, 567944, 560219, 552767, 545923, 540221, 535875, 532410, 529174, 525922, 522615, 518940, 514449, 509040, 503033, 497055, 492010, 488600, 486544, 484750, 482702, 481054, 480416, 480298, 480029, 479996, 480963, 482599, 483796, 484269, 484821, 486061, 487789, 489711, 491954, 494747, 498178, 502260, 506695, 510706, 513739, 516206, 518882, 521673, 523678, 524283, 523564, 521739, 519023, 515925, 512994, 510287, 507695, 505584, 504415, 503903, 503337, 502616, 502193, 502267, 502899, 504710, 508331, 513162, 517787, 521763, 525964, 530915, 535859, 539816, 542551, 544026, 543841, 541953, 539242, 536700, 534493, 532380, 530583, 529585, 529282, 528844, 527427, 524777, 521281, 517559, 513964, 510455, 507032, 504123, 502255, 501491, 501535, 502216, 503448, 504980, 506792, 509604, 514288, 520728, 527876, 534991, 542224, 549886, 557803, 565719, 573913, 583008]
59915E83008J0223J0628R476O872M077K433K055K095K151K451K690K057O96j02
59901F40810J24J65r86k593l477l676l759l515k595j626j370j347o21O20J452
59886F17606J775K274L083L698M015M454N132N794O383O918P070O605N986N773
59872F86566N710N140L939K351M16j674l126l434l261l533m035l917l215k745
59858F75182k734k681k498k722l498m235m439m178l643k845j813n89R18K719M575
59843F47519O365Q231R868J0210Q502N354K063o56k625l418k566l48K316M573
59829F95388N700M986K332j275m550o931q358q772q445q190q323q001o468m364
59815F34729k783j691m72M87K15j108k231k646l013l675m039l743l310l246l299
$$ y = [583008, 593231, 603859, 613335, 620207, 624284, 626717, 628772, 630867, 633018, 635469, 638159, 640216, 640912, 640810, 640934, 641099, 640113, 637520, 634043, 630367, 626608, 623093, 620498, 618872, 617502, 616155, 615534, 616154, 617606, 619381, 621655, 624738, 628436, 632451, 636905, 642037, 647831, 654214, 661132, 668202, 674807, 680793, 686566, 692276, 697416, 701355, 703706, 704122, 702448, 699322, 695888, 692627, 689094, 685059, 681142, 677927, 675182, 672448, 669767, 667269, 664547, 661049, 656814, 652375, 648197, 644554, 641709, 639896, 639307, 640225, 642944, 647519, 653884, 662115, 671983, 682193, 690695, 696049, 698112, 697456, 694831, 691413, 688847, 688499, 690815, 695388, 701088, 706074, 708406, 707131, 702581, 695650, 687292, 678520, 670075, 661885, 653562, 645561, 639093, 634729, 631946, 630255, 629783, 630270, 630485, 629377, 627146, 624500, 621487, 617812, 613773, 610030, 606720, 603474, 600175]
59800F00175l038k519k023j736j808k287k852l101l100l187l331l237k935k750
59786E62271k689k509k292k367k635k582k024j366j072j169j300j037k51O49J138
59771E40765J281J596K116K339K267K592L375L641K955K410L066M361N140N410
59757E83314N822O167N872N422N741O476O403N427M754N040N742O342O849O953
59743F66324O023M351L180L032L007K216R63l9p73j632k576l172l187k845k595
59728F72277k736l064l021k427j859j906k352k602k575k552k445j944j301j170
59714F40323j687k294k424j968j193n42l53l86rQ24J333J082P11R01J330J476
59698F37124J712K619L713M022L509K890K390J735J084R05J055R77O36L38n3q27
$$ y = [600175, 597137, 594618, 592595, 590859, 589051, 586764, 583912, 580811, 577711, 574524, 571193, 567956, 565021, 562271, 559582, 557073, 554781, 552414, 549779, 547197, 545173, 543807, 542735, 541566, 540266, 539229, 538978, 539627, 540765, 542046, 543642, 545758, 548097, 550364, 552956, 556331, 559972, 562927, 565337, 568403, 572764, 577904, 583314, 589136, 595303, 601175, 606597, 612338, 618814, 625217, 630644, 635398, 640438, 646180, 652522, 659371, 666324, 672347, 676698, 679878, 682910, 685917, 688133, 689096, 689057, 688284, 686652, 684076, 680904, 677717, 674872, 672277, 669541, 666477, 663456, 661029, 659170, 657264, 654912, 652310, 649735, 647183, 644738, 642794, 641493, 640323, 638636, 636342, 633918, 631950, 630757, 630215, 629862, 629476, 629467, 630291, 631624, 632706, 633417, 634318, 635648, 637124, 638836, 641455, 645168, 649190, 652699, 655589, 657979, 659714, 660798, 661703, 662758, 663735, 664371, 664709, 664656, 663829]
59682F63829j562j601j159j063j518k097k666l457m357n022n499n973o238o127
59668F15490o015o044n562m261l165l246l711l131j701q20p67m38P09K037L012
59653E82387L683L885L393K907L386M367M251K553M68q71j501j889k323l202m695
59638E96799n970n968m939m038l506k628j409p12o06j85O27P15l60j589k149k441
59622E61641k971l389l339l123l051l073l367m195m916m416k849j727j778j979
59608E17468j221K83J792L091M091M371L877L240K908K646K252J922J586Q65o4
59593E49107m42q8L59N68Q55J184R61J55n19q51j428k330k706k205j676j926k639
59576E36379l102l106k705j938j159q21p15k73K49l3j110j859j620r11l34R2K68
$$ y = [663829, 662267, 660666, 659507, 658444, 656926, 654829, 652163, 648706, 644349, 639327, 633828, 627855, 621617, 615490, 609475, 603431, 597869, 593608, 590443, 587197, 583486, 580355, 578654, 577834, 577067, 576629, 577338, 579375, 582387, 586070, 589955, 593348, 596255, 599641, 604008, 608259, 610812, 611280, 610409, 608908, 607019, 604696, 601494, 596799, 590829, 584861, 579922, 575884, 572378, 569750, 568341, 567629, 567023, 566838, 567465, 568180, 567820, 566231, 564082, 561641, 558670, 555281, 551942, 548819, 545768, 542695, 539328, 535133, 530217, 525801, 522952, 521225, 519447, 517468, 516247, 516530, 518322, 521413, 525504, 529875, 533752, 536992, 539900, 542546, 544798, 546720, 548306, 549171, 549107, 548665, 548577, 548936, 549504, 550359, 551543, 552504, 552659, 552140, 551289, 549861, 547531, 544825, 542620, 540944, 539018, 536379, 533277, 530171, 527466, 525528, 524369, 523548, 522833, 522560, 522809, 522776, 521666, 519807, 518187, 517276, 516942, 517034, 517302]
59559E17302q3n28j60R33J592J312Q55Q49R86R68J008J037O50J66M89J604K605
59542E31585L432N087P641R733J0778J2201J5579K0581K5216K6983K3670J4886
59530G07372L659n117q898r088q102o559m197j637K57J551K568K989K606J854
59516F79258Q35j044l707n979p392q912j0992j2359j1973j0725r929r421q486
59503E79174p456o849o040m369k671k195k662k795k168j281l99M33P92L93j74
59488E41733k18P5K14L49Q46J508K032K547L097L302L172L472M558N767O537P113
59472E86104P572P298O131M842L772K360P41K94J418K389J763M95K89J112K015
59457F28595L117M985O997Q129Q706R655J0645J0612R654Q862Q625Q393P782O660
$$ y = [517302, 517219, 516691, 516531, 517464, 519056, 520368, 521223, 522072, 523058, 524026, 525034, 526071, 526721, 526887, 527376, 528980, 531585, 535017, 540104, 547745, 557478, 568256, 580457, 596036, 616617, 641833, 668816, 692486, 707372, 711031, 705914, 697016, 687928, 679826, 673267, 669070, 667433, 667690, 669241, 671809, 674798, 677404, 679258, 680093, 679049, 675342, 669363, 661971, 653059, 642067, 629708, 617735, 607010, 597081, 587660, 579174, 571718, 564869, 558829, 554460, 551789, 549594, 546932, 544137, 541969, 540688, 540289, 540722, 541514, 541907, 541733, 541515, 541590, 541804, 542153, 542999, 544507, 546539, 549086, 552183, 555485, 558657, 562129, 566687, 572454, 578991, 586104, 593676, 600974, 607105, 611947, 615719, 618079, 618820, 619114, 620532, 622921, 624684, 625179, 625468, 626580, 628595, 631712, 636697, 643694, 651823, 660529, 670184, 680829, 691441, 701095, 709957, 718582, 726975, 734757, 741417]
59443G41417M583J362k279n533q448j1110j2790j2997j2456j1815j0354p426m314
59430F47840k937l289l705l169j845J14K694N258P133Q806J1165J3868J5752J6631
59416G14316J7461J8821K0432K2095K4057K6443K8876L0188K8074K0150O699q249
59404I49363j9768k5665k6650k4099j8927j1828l147O810J6013K0190J6003M732
59392H83027q487j8820k4313k5393k3733k1330j9171j6626j2997r073o106m050
59380F92928k201q66o90r93m69P31J342J169J262J964K449K298K081K152K141
59365G05298J885J806K166K767L403L906M042M024M606N973P154P483P766Q925
59351G71204J0433J1417J2413J4360J6628J7810J7980J8357J9107J9219J8334
$$ y = [741417, 746000, 747362, 745083, 739550, 731102, 719992, 707202, 694205, 681749, 669934, 659580, 652154, 647840, 644903, 641614, 637909, 634740, 632895, 633009, 635703, 640961, 648094, 656900, 668065, 681933, 697685, 714316, 731777, 750598, 771030, 793125, 817182, 843625, 872501, 902689, 930763, 950913, 957612, 949363, 929595, 903930, 877280, 853181, 834254, 822426, 819279, 826089, 842102, 862292, 878295, 883027, 874540, 855720, 831407, 806014, 782281, 760951, 741780, 725154, 712157, 703084, 696978, 692928, 690727, 689861, 689171, 688178, 687709, 688440, 689782, 690951, 692213, 694177, 696626, 698924, 701005, 703157, 705298, 707183, 708989, 711155, 713922, 717325, 721231, 725273, 729297, 733903, 739876, 747030, 754513, 762279, 771204, 781637, 793054, 805467, 819827, 836455, 854265, 872245, 890602, 909709, 928928, 947262]
59340I47262J6940J4936J1721P767M364J730j172m825q565j1891j4954j7620j9299
59327I26394j9876j9816j9291j8192j6796j5480j4010j2167j0618j0068j0030
59316G60050r617q973q706q514p864p317p548p747o725n111m505m831m590l435
59302F64567k419j787o43J101K488L604N865R729J3875J6998J8765J8486J4827
59289G65456P694r25q657j4277j7317j7673j6144j4127j2141r579o185k697K81
59276F53709K943N489P673R441J1160J3004J4770J6246J7098J6738J5161J3389
59264G96821J2140J0659Q060M997K562L23k723n883p528p776q310r664j0723j0891
59250G72064j0702j0188q678o475m819l918k771j122K87J521L483N899P284P310
$$ y = [947262, 964202, 979138, 990859, 998626, 1002990, 1004720, 1003548, 998723, 990158, 978267, 963313, 945693, 926394, 906518, 886702, 867411, 849219, 832423, 816943, 802933, 790766, 780148, 770080, 760050, 750433, 741460, 732754, 724240, 716376, 709059, 701511, 693764, 687039, 681928, 677423, 672592, 668002, 664567, 662148, 660361, 659718, 660819, 663307, 666911, 672776, 682505, 696380, 713378, 732143, 750629, 765456, 773150, 772225, 763568, 749291, 731974, 714301, 698157, 684030, 671889, 662310, 656125, 653428, 653709, 656652, 662141, 669814, 679255, 690415, 703419, 718189, 734435, 751533, 768271, 783432, 796821, 808961, 819620, 827680, 832677, 835239, 835562, 832839, 826956, 819428, 811652, 803342, 793678, 782955, 772064, 761362, 751174, 742496, 736021, 731202, 727284, 724513, 723391, 723678, 725199, 728682, 734581, 741865, 749175]
59236G49175P266P767P954P389O762O182M818K806J498J096mk603n373p038q058
59221G79637r131r778r531r072r045q997q445p795p400o937o424o546p279p472
59207F65785o566n476n023m742l939k817j857j146p87r53j162o99R9K81J04P54
59191F31856K108K611J851J328K043L126L631L958M584N024N003N156N729N979
59177F83987N620N399N542N192M192L729M430N324N648O055P165Q352Q913R007
59163G68555Q607P076M626K596J429k6k392m704o391q450j1386j3810j4504j4263
59149G16963j4194j3776j2149j0045q716q089p400o706o386o125n600n310n574
59136F06893n650m969m134l776l380k368j176l50L58J062J195Q64J361L194N019
$$ y = [749175, 756441, 764208, 772162, 779551, 786313, 792495, 797313, 800119, 801617, 802713, 802709, 800106, 794733, 787695, 779637, 770506, 760728, 751197, 742125, 733080, 724083, 715638, 707843, 700443, 693506, 687082, 680536, 673257, 665785, 659219, 653743, 648720, 643978, 640039, 637222, 635365, 634219, 633432, 632479, 631317, 630618, 630717, 630998, 631102, 631856, 633964, 636575, 638426, 639754, 641797, 644923, 648554, 652512, 657096, 662120, 667123, 672279, 678008, 683987, 689607, 695006, 700548, 705740, 709932, 713661, 718091, 723415, 729063, 735118, 742283, 750635, 759548, 768555, 777162, 784238, 788864, 791460, 792889, 792863, 790471, 785767, 779376, 770926, 759540, 745730, 731226, 716963, 702769, 688993, 676844, 666799, 658083, 649994, 642594, 635888, 629502, 623377, 617777, 612467, 606893, 601243, 596274, 592140, 588364, 584984, 582616, 581440, 581090, 581448, 582510, 583705, 584569, 585930, 589124, 594143]
59121E94143N701O074P316Q974J0046J0782J1865J2893J3254J3475J4215J4809
59109G23547J4359J3410J2945J2466J0769Q121O066N217M552K962M46k164m154
59096H08542n522o922q613r665q991p093n504m548l161j207p6l75q93q28j217
59081G43927l032n457p322q709r889j0152r086p703o942o281n098m053l805l652
59067F52746k876k223k650l663m202m177l882l085j840j105j316j538j102p78
59053F18309j216j654j440j337j921k194j245N3N46N78P40L87r35j984j535m21
59037F04731m1j86J8K55J6J53J507L117L740M015N203O911Q085R186J1225J3523
59021F71458J4692J4947J5384J5647J4472J1886Q899N609J585k393n033o416p486
$$ y = [594143, 599844, 605918, 613234, 622208, 632254, 643036, 654901, 667794, 681048, 694523, 708738, 723547, 737906, 751316, 764261, 776727, 787496, 795617, 801683, 806900, 811452, 814414, 814860, 812696, 808542, 803020, 796098, 787485, 777820, 768829, 761736, 756232, 751684, 748523, 747316, 747240, 746865, 745972, 745144, 743927, 740895, 735438, 728116, 719407, 709518, 699366, 690280, 682577, 675635, 669354, 664256, 660203, 656398, 652746, 649870, 647647, 644997, 641334, 637132, 632955, 629073, 625988, 624148, 623043, 621727, 620189, 619087, 618309, 617093, 615439, 613999, 612662, 610741, 608547, 607302, 607355, 607901, 608479, 609219, 609606, 608671, 606687, 605152, 604731, 604690, 604504, 604522, 604777, 604793, 604946, 606453, 609570, 613310, 617325, 622528, 629439, 637524, 646710, 657935, 671458, 686150, 701097, 716481, 732128, 746600, 758486, 767385, 772994, 774579, 772186, 767153, 760737, 753251]
59008G53251q216q055p452p028o028l575p43Q30J705L721O752Q723Q666P617O505
58993G56673N240L970L250K874K110J131O29J99j233l501n343o276o759o676n409
58978G40879l388j892j158j93J542L578N592P705R600J0619J0820J0944J1331
58965H05979J1768J2170J2547J2699J2714J3115J3736J3311J1169Q322N774K857
58953I36161j348o131j0221j3655j6905j9180j9555j8904j8792j9058j8387j6623
58941G57402j4640j2533r839p080n246m134k882j668j243j345j176r09j054j103
58927F92550m62O0n98j827k452k824l881n033m994m024l239k503j182j19n47j659
58911F57266j673o46Q9O48K197M373N755O532Q062J0063J1024J1245J2628J5305
$$ y = [753251, 745035, 736980, 729528, 722500, 716472, 712897, 712154, 712984, 714689, 718410, 725162, 733885, 742551, 750168, 756673, 761913, 765883, 769133, 772007, 774117, 775248, 775877, 776076, 774843, 771342, 765999, 759723, 752964, 746288, 740879, 737491, 735599, 734441, 734248, 735790, 739368, 744960, 752665, 762265, 772884, 783704, 794648, 805979, 817747, 829917, 842464, 855163, 867877, 880992, 894728, 908039, 919208, 927530, 933304, 936161, 934813, 928682, 918461, 904806, 887901, 868721, 849166, 830262, 811470, 792412, 774025, 757402, 742762, 730229, 720390, 713310, 708064, 703930, 701048, 699380, 698137, 696792, 695616, 694707, 693653, 692550, 692088, 692148, 691550, 689723, 687271, 684447, 680566, 675533, 670539, 666515, 663276, 660773, 659591, 659472, 658925, 657266, 655593, 654947, 655036, 655684, 657881, 662254, 668009, 674541, 682603, 692666, 703690, 714935, 727563, 742868]
58897G42868J7192J7283J6791J6601J6050J4938J4415J5151J6555J8407K1356
58886I27607K5184K8272K9326K8246K5227K0561J5395J1006P203K940j694n771
58874A113502r446j3665j8104k1320k2837k3214k2347j9747j6237j3407j1446
58863I21732r490p741p111p180o841o671q118j0518j1613j1068j0804j1574j1875
58850H01128j0726r094p912o970o302o544p397p740p675q469j0194j1465j1689
58837F88951j1565j1173r820p982p129p296o962n626m326l488k449j369j235j675
58823F06856j090O85K105K532K907L549L698L477L937M760M390K785J667J719
58809F43977J901J829K267K893K266M53q54j256k061l398l783l056k886l659l793
$$ y = [742868, 760060, 777343, 794134, 810735, 826785, 841723, 856138, 871289, 887844, 906251, 927607, 952791, 981063, 1010389, 1038635, 1063862, 1084423, 1099818, 1110824, 1118027, 1120967, 1119273, 1113502, 1104056, 1090391, 1072287, 1050967, 1028130, 1004916, 982569, 962822, 946585, 933178, 921732, 912242, 904501, 897390, 890210, 883369, 876698, 868580, 858062, 846449, 835381, 824577, 813003, 801128, 790402, 781308, 773396, 766426, 760124, 753580, 746183, 738443, 730768, 722299, 712105, 700640, 688951, 677386, 666213, 656393, 648411, 641282, 633986, 627024, 621398, 617072, 613584, 611135, 609766, 608531, 606856, 605766, 606451, 608556, 611088, 613995, 617544, 621242, 624719, 628656, 633416, 637806, 640591, 642258, 643977, 645878, 647707, 649974, 652867, 655133, 655586, 654732, 653476, 651415, 648017, 644234, 641178, 638292, 634633, 630840]
58794F30840k947k958m492n672n236m387m194l773k350p52M49J988M001N271N436
58779F11224N714O447O263M717L421L467L913L742L085J753j011m479o651p281
58765F34324q081r196q556n717l231k680k444r42P95J588K291L576M160L168J982
58750F11037J775J530L55m94J80J447K284L536N949Q230Q993Q843Q822Q602P824
58735F78913P434Q046Q714Q791R128J0183J0817J0374R851R796R112P324N773
58722G94256N195M425K915K219L334N003O124P471R346J0103Q881P405P076O579
58708H80332M343J128j793m812q360j1375j3293j5447j8455k0590k0761k0782
58696G50135k2348k4008k3550k1367j9079j6749j3850j1237r771q626o991n803
$$ y = [630840, 627893, 624935, 620443, 614771, 609535, 605148, 600954, 597181, 594831, 594079, 594528, 596516, 600517, 605788, 611224, 616938, 623385, 629648, 634365, 637786, 641253, 645166, 648908, 651993, 653746, 652735, 648256, 641605, 634324, 626243, 617047, 608491, 602774, 599543, 596863, 594419, 593477, 594272, 595860, 598151, 601727, 605887, 609055, 611037, 612812, 614342, 614697, 614203, 614383, 615830, 618114, 621650, 627599, 635829, 644822, 653665, 662487, 671089, 678913, 686347, 694393, 703107, 711898, 721026, 731209, 742026, 752400, 762251, 772047, 781159, 788483, 794256, 799451, 803876, 806791, 809010, 812344, 817347, 823471, 830942, 840288, 850391, 859272, 866677, 873753, 880332, 884675, 885803, 884010, 879198, 870838, 859463, 846170, 830723, 812268, 791678, 770917, 750135, 727787, 703779, 680229, 658862, 639783, 623034, 609184, 597947, 588176, 579550, 572559, 566756]
58684E66756n823n888n074m605n504o298n333l497k422j815p15L64P61J362K918
58669E25187M444N250O551R120J1463J2589J4220J7743K0985K0730J6729J0899
58657F75910M454j726n923p517q526j0662j2569j2315j0717r651q911p500o261
58644E78086o356o681n511l467k253j841j233n81k42O73K456L330K153P61J128
58629E60422K109J702N67L79M99m81j599j065L94R04R09K103L945M400L487L239
58613E81914M580O635Q426R289Q446O124M026L024J842l44k003j895j463k247
58599F26354l136k730k203l047m012l281j750j131p09R80L010L773M103N681P941
58584F29843R490J0926J3220J5048J4832J3639J3091J2279R856P255O402O173
$$ y = [566756, 560933, 555045, 549971, 545366, 539862, 533564, 528231, 524734, 522312, 520497, 519782, 520146, 520907, 522269, 525187, 529631, 534881, 541432, 550552, 562015, 574604, 588824, 606567, 627552, 648282, 665011, 675910, 680364, 678638, 672715, 665198, 656672, 646010, 633441, 621126, 610409, 600758, 591847, 584347, 578086, 571730, 565049, 559538, 556071, 553818, 551977, 550744, 550163, 549921, 550594, 553050, 556380, 558533, 559294, 560422, 562531, 564233, 564800, 565179, 565678, 565197, 563598, 562533, 562927, 563831, 564740, 566843, 570788, 575188, 578675, 581914, 586494, 593129, 601555, 610844, 619290, 625414, 629440, 632464, 634306, 633962, 631959, 630064, 628601, 626354, 623218, 620488, 618285, 615238, 611226, 607945, 606195, 605064, 604355, 605335, 608345, 612118, 616221, 621902, 629843, 639333, 650259, 663479, 678527, 693359, 706998, 720089, 732368, 742224, 749479, 755881, 762054]
58572G62054M561K618K655M286N805P757J1536J6080J9586K2894K7483L1884L3772
58559I52971L3941L4242L3432K9225K2822J7107J1830N036k133o657q669j0713
58547A112434j2874j3097j1679j1067j1639j1893j2251j4579j8311k1059k2613
58536I51372k4517k6255k5864k3749k1992k0502j7671j4153j2000j0686p999m289
58524G41695j826o34J030K765K756J731J981K972K235O3r06m23p33k239l208l465
58508G43794m384n555n402m510m516m506k652m29o78k464k571j315j792l965m704
58493F94351l517k974l436k465K04K110K780M276O624P524P031P903J0727J3184
58479G44322J4565J6560J9211K0400J9748J8741J6940J2454O163J006k814p341
$$ y = [762054, 766615, 769233, 771888, 776174, 781979, 789736, 801272, 817352, 836938, 859832, 887315, 919199, 952971, 986912, 1021154, 1054586, 1083811, 1106633, 1123740, 1135570, 1140606, 1138473, 1131816, 1123147, 1112434, 1099560, 1086463, 1074784, 1063717, 1052078, 1040185, 1027934, 1013355, 995044, 973985, 951372, 926855, 900600, 874736, 850987, 828995, 808493, 790822, 776669, 764669, 753983, 745984, 741695, 739869, 739235, 740265, 743030, 745786, 747517, 749498, 752470, 754705, 754768, 753862, 753439, 752706, 750467, 747259, 743794, 739410, 733855, 728453, 723943, 719427, 714921, 712269, 711840, 711162, 708698, 706127, 704812, 703020, 699055, 694351, 690834, 687860, 684424, 681959, 682163, 684273, 687053, 691329, 697953, 705477, 712508, 720411, 731138, 744322, 758887, 775447, 794658, 815058, 834806, 853547, 870487, 882941, 889104, 890110, 887296, 879955]
58467H79955j1939j3822j3340j3494j4293j2870r406p254o749m506K82M393O416
58454G83373Q635J1882J3771J3390J2821J2620J0547N998J203k942p627j1982
58442H51689j3097j1127r557r482q445n705l669l062j744O78J905J609K196M095
58428G96284N130N318P168J0523J2242J1793J1872J2803J1783Q566O194N138K371
58415I07185k583o416p980r822j2599j3691j2648j2254j2965j2020r283q028q687
58402G78209p877m972l402l974l241j22K111K181K874N026N725M260L594M261
58388G84653L224M47j79J762J991l94q82K138M371L575L246N410O902N953N526
58373H27743O930O941M543L641N804P181N898N625Q358J0614J0321J0592J3054
$$ y = [879955, 868016, 854194, 840854, 827360, 813067, 800197, 790791, 783537, 776788, 772282, 772564, 776957, 783373, 792008, 803890, 817661, 831051, 843872, 856492, 867039, 873037, 874240, 871298, 863671, 851689, 838592, 827465, 817908, 808426, 799981, 794276, 790607, 787545, 785801, 786479, 788384, 789993, 792189, 796284, 801414, 806732, 813900, 824423, 836665, 848458, 860330, 873133, 884916, 893482, 899676, 904814, 907185, 904602, 898186, 890206, 880384, 867785, 854094, 841446, 829192, 816227, 804207, 794924, 786896, 778209, 770332, 765360, 761958, 757984, 754743, 754621, 756732, 758913, 761787, 766813, 772538, 776798, 780392, 784653, 787877, 788324, 788145, 789907, 791898, 791504, 790622, 792760, 797131, 800706, 803952, 809362, 816264, 822217, 827743, 834673, 841614, 846157, 849798, 855602, 862783, 868681, 874306, 882664, 893278, 903599, 914191, 927245]
58360I27245J4355J2914J2228J3778J3675J0108P060O800N768J926r98p00n82
58347A023577k662l349n80J936J858K497N744Q005P493Q195J2104J4976J4319
58334A094113J4115J6931J8995J7813J6848J7868J6639J1374P295P429O967K435
58322A248822j732j623p16k261k846K09K868K040J530M275O435N318N139Q690
58308A276148J1464J0300R545J2326J4292J2540J1929J5649J8480J6508J4535
58297A423716J6556J8068J5347J3157J5444J7597J5902J5193J9027K1883J9585
58286A611475J7686K0827K3627K1234J8890K1554K4163K1922K0176K3999K8078
58275A853631K7197K6604L1348L5676L3947L1831L5521M0103L9945M0113M5926
$$ y = [927245, 941600, 954514, 966742, 980520, 994195, 1004303, 1011363, 1018163, 1023931, 1025857, 1024859, 1024159, 1023577, 1020915, 1017566, 1016986, 1018922, 1020780, 1023277, 1029021, 1037026, 1044519, 1052714, 1064818, 1079794, 1094113, 1108228, 1125159, 1144154, 1161967, 1178815, 1196683, 1213322, 1224696, 1231991, 1239420, 1246387, 1248822, 1247090, 1245467, 1244751, 1242490, 1239644, 1239853, 1242721, 1244761, 1246291, 1250566, 1257001, 1262319, 1267458, 1276148, 1287612, 1297912, 1307457, 1319783, 1334075, 1346615, 1358544, 1374193, 1392673, 1409181, 1423716, 1440272, 1458340, 1473687, 1486844, 1502288, 1519885, 1535787, 1550980, 1570007, 1591890, 1611475, 1629161, 1649988, 1673615, 1694849, 1713739, 1735293, 1759456, 1781378, 1801554, 1825553, 1853631, 1880828, 1907432, 1938780, 1974456, 2008403, 2040234, 2075755, 2115858, 2155803, 2195916, 2241842]
58264B241842N1775N2087N2550N8563O3655O1671N8870O1384O2706N6758N1056
58253B872917N2976N5547N1276M7371N2192N9393O1073O3391P3137Q2284Q2828
58242C554385Q3290R3047J04164J06768J08196J18092J29128J32132J35383J48590
58232D713175J62922J68024J73064J89034K06672K14830K23606K45113K69130
58223F565570K83211K98470L28510L62071L84896M08774M48996M93984N28938
58214A0103420N67687O27363O94662P53175Q19634R14806J024836J132829J260543
58205A7898955J434108J639301J860410K131143K493835K943527L470042M115087
58197C7986408M924830N895731P044016Q478199J0324581J2653171J5575818J9322473
$$ y = [2241842, 2293617, 2345704, 2398254, 2456817, 2520472, 2582143, 2641013, 2702397, 2765103, 2821861, 2872917, 2925893, 2981440, 3032716, 3080087, 3132279, 3191672, 3252745, 3316136, 3389273, 3471557, 3554385, 3637675, 3730722, 3834886, 3941654, 4049850, 4167942, 4297070, 4429202, 4564585, 4713175, 4876097, 5044121, 5217185, 5406219, 5612891, 5827721, 6051327, 6296440, 6565570, 6848781, 7147251, 7475761, 7837832, 8222728, 8631502, 9080498, 9574482, 10103420, 10671107, 11298470, 11993132, 12746307, 13565941, 14480747, 15505583, 16638412, 17898955, 19333063, 20972364, 22832774, 24963917, 27457752, 30401279, 33871321, 37986408, 42911238, 48806969, 55850985, 64329184, 74653765, 87306936, 102882754, 122205227]
58189A22205227K4084071K9872084L6607007M3931052N0313299N2446748M6585416
58182D06044904L1503521J0274384j1265402k8030639l7940130m1562950m0620419
58175B88403269l7042094l2616549k8594143k5359181k2649075k0123781j7668360
58168A04350086j5304548j3069197j1019563r220139p678554o357197n244462
58161C6456426m350041l643026l061985k579074k197298j895793j634179j403124
58153A5691906j219526j078174r53655q42373p59095o98357o39233n81667n40509
58144H379317n10263m71523m25982l90932l65133l32848k95787k69217k51424
58135E066208k27560j99632j83536j79778j74506j66088j64275j66302j59567
$$ y = [122205227, 146289298, 176161382, 212768389, 256699441, 307012740, 359459488, 406044904, 437548425, 447822809, 436557407, 408526768, 370586638, 329023688, 288403269, 251361175, 218744626, 190150483, 164791302, 142142227, 122018446, 104350086, 89045538, 75976341, 64956778, 55736639, 48058085, 41700888, 36456426, 32106385, 28463359, 25401374, 22822300, 20625002, 18729209, 17095030, 15691906, 14472380, 13394206, 12440551, 11598178, 10839083, 10140726, 9501493, 8919826, 8379317, 7869054, 7397531, 6971549, 6580617, 6215484, 5882636, 5586849, 5317632, 5066208, 4838648, 4639016, 4455480, 4275702, 4101196, 3935108, 3770833, 3604531, 3444964]
58126C444964j45623j37298j34470j25850j12117j04547j02806r6176q4982p9628
58116B321467p9897p5694o6942o3038o3716n9626n0928m6874m7787m5195l8983
58105A682787l7202l9630l8279l3424l2970l6604l6491l2742l2726l5898l4745
58094A292076k9894k9090l1801k9954k3544k0741k2495k1564j6825j4566j5329
58083A036273j3344r255r911j4967j6886j4765j5239j9116j9980j6975j6302j8847
58071H50686j8625j4858j3722j6388j6818j3190j0694j1245j0759q237p489q507
58059G00154o818k651j286l383m331l717n925j0682j2626j1054j0697j2110j0831
58046F04043o796n119o511o234l557l082n556o440m790m705o777o866m500l905
$$ y = [3444964, 3299341, 3162043, 3027573, 2901723, 2789606, 2685059, 2582253, 2486077, 2401095, 2321467, 2241570, 2165876, 2098934, 2035896, 1972180, 1912554, 1861626, 1814752, 1766965, 1721770, 1682787, 1645585, 1605955, 1567676, 1534252, 1501282, 1464678, 1428187, 1395445, 1362719, 1326821, 1292076, 1262182, 1233092, 1201291, 1171337, 1147793, 1127052, 1104557, 1082993, 1066168, 1051602, 1036273, 1022929, 1013674, 1003763, 988796, 971910, 957145, 941906, 922790, 902810, 885835, 869533, 850686, 832061, 817203, 803481, 787093, 770275, 757085, 746391, 735146, 724387, 716150, 708661, 700154, 693336, 690685, 689399, 686016, 681685, 677968, 672043, 661361, 648735, 637681, 626984, 614874, 604043, 597247, 592128, 585617, 579383, 575826, 572744, 567188, 560748, 555958, 551253, 544476, 537610, 533110, 529205]
58032E29205n575n421l328l866p377q998p728p851j0089j0070p105n829p324p078
58018D31566l725j575k384k547o20J44j201j355K31j21k817l549j253o4j331j210
58002D08189J618L265K049J431L122M154L264L398N454O126M311L213L856K990
57988D56440l42k669k641l331n821o971n820n712p758q605p053o436p972q173
57974C77136n525l459l896l993k136j082k238k655p38O98m5m99P50J311J77J54
57958C53960K274L302J631K52J017J334n12k061j693j675l220l672j717k71j141
57943C47808j668J03J882J893K298M668O735O899P393R717J1507J1214J1353J3708
57929D35510J5606J4413J1742R801P539L668j41k339m199o694q170p817p742r056
$$ y = [529205, 523630, 518209, 514881, 511015, 503638, 494640, 486912, 479061, 468972, 458902, 451797, 445968, 438644, 431566, 427841, 426266, 423882, 421335, 420715, 420859, 419658, 418303, 418534, 418413, 415596, 412047, 410794, 410730, 409399, 408189, 409807, 413072, 415121, 416552, 419674, 423828, 427092, 430490, 435944, 442070, 446381, 449594, 453450, 456440, 456098, 453429, 450788, 447457, 441636, 434665, 428845, 423133, 415375, 406770, 399717, 393281, 385309, 377136, 371611, 368152, 364256, 360263, 358127, 357045, 354807, 352152, 351414, 352112, 352067, 351568, 352318, 353629, 353806, 353960, 356234, 359536, 361167, 361419, 362436, 363770, 363258, 361197, 359504, 357829, 354609, 350937, 349220, 348949, 347808, 346140, 346243, 348125, 350018, 352316, 356984, 363719, 370618, 378011, 387728, 399235, 410449, 421802, 435510, 451116, 465529, 477271, 487072, 494611, 498279, 498138, 495799, 491600, 484906, 476736, 468919, 461177, 452121]
57915D52121r635q253o963p013o455m300k776k861j927J387M252M474L900M141
57901D20092L254J0k931l462l619n307o545n417l848l825l709j907n13j419k426
57886C78428j059J059J392Q77J364J758M87r82p44P4k81r53p79j014k728m227
57870C72672m077l731m331m078j833R3j63n54J044K969L228L419N442P511P374
57855C84985O527P257Q310P530O130O332P124O327M547L334J830j054l541l896
57841D41742l941n841p883p548o383p428r854j0552r298q119p090n031k978k847
57827C46949l649k886p47O58J066J719K340J870J057J166J357M27l88M88J699
57812C53126J246K96J097K548J711j394m206n842p284q267p562n817m846m644
$$ y = [452121, 442486, 434233, 427270, 420257, 413802, 409502, 406726, 403865, 401938, 403325, 407577, 412051, 415951, 420092, 423346, 423356, 420425, 416963, 413344, 408037, 401492, 396075, 392227, 388402, 384693, 382786, 382273, 380854, 378428, 377369, 378428, 379820, 380697, 382061, 383819, 384306, 383324, 382580, 382654, 382373, 381420, 380641, 379627, 376899, 372672, 368595, 364864, 360533, 356455, 354622, 354715, 354552, 353998, 355042, 358011, 361239, 364658, 370100, 377611, 384985, 391512, 398769, 407079, 414609, 420739, 427071, 434195, 440522, 445069, 448403, 450233, 449179, 445638, 441742, 437801, 431960, 424077, 416529, 410146, 402718, 392864, 382312, 373014, 364895, 357805, 352774, 349796, 346949, 343300, 340414, 339667, 340325, 341391, 343110, 345450, 347320, 348377, 349543, 350900, 351327, 350939, 351427, 353126, 354372, 354668, 355765, 358313, 360024, 358630, 354424, 348582, 341298, 333031, 325469, 319652, 314806, 310162]
57798C10162l975l141l231l592k874j637j151q22M11J521J242R36K463M587M945
57783C05844M220M788O427O974O349O298O958P127P175Q242R277Q399O441N710
57769D00229N868M622J940l2r11k344m570o118o844q012r475r920r677j0167j0845
57754C33744r900p744o527o331n189k831j091m33O31K395L357L159L167L703L614
57739C13724K920L127M356M922M193L330K811J838N89M62J500K040J448R29J025
57724C49214P10m71j454j502j245j345j798k702m125n135m759l758l700m464m621
57709C08845l989l797m446n129n559o099o308n392l911l102k772j819m50J13j90
57694B55995l73l34n84o31K27R80J36j620k308j693j053m50J087L049L867L749
$$ y = [310162, 306187, 303046, 299815, 296223, 293349, 291712, 290561, 289739, 290150, 291671, 292913, 293849, 296312, 300899, 305844, 310064, 314852, 321279, 328253, 334602, 340900, 347858, 354985, 362160, 370402, 379679, 388078, 394519, 400229, 406097, 410719, 412659, 412627, 411716, 409372, 404802, 398684, 391840, 383828, 374353, 364433, 354756, 344589, 333744, 323844, 316100, 309573, 303242, 298053, 295222, 294131, 293698, 294329, 296724, 300081, 303240, 306407, 310110, 313724, 316644, 319771, 324127, 329049, 333242, 336572, 339383, 341221, 341810, 342272, 343772, 345812, 347260, 348189, 349214, 349924, 349453, 347999, 346497, 345252, 343907, 342109, 339407, 335282, 330147, 325388, 321630, 317930, 313466, 308845, 304856, 301059, 296613, 291484, 285925, 279826, 273518, 268126, 264215, 261113, 258341, 256522, 256072, 256185, 255995, 255622, 255288, 254704, 254073, 254300, 255280, 255416, 253796, 251488, 249795, 248742, 248292, 249379, 252428, 256295, 260044]
57678B60044M448O335Q216J0005J2936J7107K1384K5927L2288M0902N0854O2227
57666E52673P6025R1162J03297J06717R6151O8506K6419k0058n8783q3555r5432
57655H63122r7425r1460q0275o7858n6506m5980l6380k9125k4366k0234j5718
57644B97795j1817r164o896m717l575l453k885j516q08j407k008j710j253j087
57630B45499m59P54J343Q29K87L78M20L1k23l07r07j732j648q64q30j631j796
57613B39144j083r92j946k483j962j634k195k586k079j317n70Q07K399K648J495
57598B27646P93J249J389M30l44j15j9q27j511j358j278j804j917j152o94j162
57582B19326j416q31o07j432k034j543j172j963k786k306j239j027j672k378k916
$$ y = [260044, 264492, 270827, 279043, 289048, 301984, 319091, 340475, 366402, 398690, 439592, 490446, 552673, 628698, 719860, 823157, 929874, 1026025, 1094531, 1120950, 1100892, 1042109, 958554, 863122, 765697, 674237, 593962, 526104, 469598, 423618, 387238, 358113, 333747, 313513, 297795, 285978, 276814, 269918, 265201, 261626, 258173, 255288, 253772, 252964, 251557, 249549, 247839, 246586, 245499, 245040, 245794, 247137, 247966, 248253, 248631, 249051, 249082, 248859, 248552, 247645, 245913, 244265, 243401, 242571, 240940, 239144, 238061, 237069, 235123, 232640, 230678, 229044, 226849, 224263, 222184, 220867, 220297, 221104, 223503, 226151, 227646, 228439, 229688, 231077, 231507, 231163, 231048, 231029, 230202, 228691, 227333, 226055, 224251, 222334, 221182, 220488, 219326, 217910, 217079, 216472, 215040, 213006, 211463, 210291, 208328, 205542, 203236, 201997, 200970, 199298, 196920, 194004]
57567A94004l104k347q65J0k25m94j89j56o86n43Q05J862J402M00K10N21M99M29
57549A91533P60R71O56M61Q17J111J015J135J447R49j69o2J853L536L329K368
57533B11710K283K406J249p48j970k047j718j271o22j50j11o4P1m57j745k553
57517B04263k122j427j453j653j204m60k9L07O74M56l43n51L20J122J010P45R97
57500B00652J026L05k24R0K52o07j633j887j953k460k605j756j033j595k654k824
57484A81094k211j630j062l05M7k89m25P2J45q86j885j837j582k060k443j748
57468A62995q54r23j229m63R66J801K051K376K478J865J246J436J856J668J356
57453A78625J573J588N66p26j080o78j74P16K054K521J300j31l1R58J184P64Q47
$$ y = [194004, 190900, 188553, 187688, 187698, 187473, 186979, 186790, 186634, 185948, 185405, 186210, 188072, 189474, 189874, 190084, 190605, 191104, 191533, 192293, 193264, 193920, 194381, 195198, 196309, 197324, 198459, 199906, 200855, 200686, 200624, 202477, 206013, 209342, 211710, 213993, 216399, 217648, 216900, 214930, 212883, 211165, 209894, 209272, 209122, 209011, 208947, 209018, 208561, 206816, 204263, 202141, 200714, 199261, 197608, 196404, 195944, 195915, 196222, 196896, 197352, 197009, 196458, 196778, 197900, 198910, 199655, 200652, 201678, 201983, 201759, 201849, 202101, 201494, 199861, 197974, 196021, 193561, 190956, 189200, 188167, 186572, 183918, 181094, 178883, 177253, 176191, 175886, 175933, 175644, 175219, 175291, 175436, 174550, 172665, 170828, 169246, 167186, 164743, 162995, 162141, 161218, 159989, 159526, 160492, 162293, 164344, 166720, 169198, 171063, 172309, 173745, 175601, 177269, 178625, 180198, 181786, 182352, 181626, 180546, 179868, 179694, 180410, 182464, 184985, 186285, 186154, 186123, 187081, 188265, 189029, 189876]
57436A89876J228Q53o0n26o26r54j036k69M59J6r07q96j52K24L54R48J426Q11
57418A90769j76j45N42M28n05j019q06n05n3R23J660J234M27O14J321R73l99j322
57400A93961j352j298j338r87n96q42j036o1J350J386M6q76o20j92k86m16k30
57383A86613J03Q17K165L262K976J818J230J269Q95J96K16P30L41j014j746j105
57367A98766j09L82O89J107J256J102J175J447J324Q91Q75J255J237P21M70P58
57351B13346J068J222J599K237K692K759K508J895J218J195J673J219p98k737
57337B31096k838j744j086p55K98J538J558P16O25J343J480P66J95j68j166k367
57321B29491k293q70M81J188J807K051R61r26j917j865k180k978k672q60Q11J249
$$ y = [189876, 191104, 191957, 191897, 191371, 190745, 189791, 188755, 188486, 188945, 188961, 188054, 187158, 187006, 187230, 187584, 188532, 189958, 190769, 190593, 190448, 190990, 191418, 190913, 189894, 189088, 188583, 188530, 189453, 191113, 192347, 192774, 193388, 194709, 195682, 195283, 193961, 192609, 191311, 189973, 188986, 188390, 187548, 186512, 186451, 187801, 189187, 189233, 188357, 187737, 187545, 187259, 186843, 186613, 186716, 187533, 189698, 192960, 195936, 197754, 198984, 200253, 201148, 201344, 201560, 202290, 202631, 201617, 199871, 198766, 198657, 199039, 199728, 200835, 202091, 203193, 204368, 205815, 207139, 208030, 208905, 210160, 211397, 212118, 212588, 213346, 214414, 215636, 217235, 219472, 222164, 224923, 227431, 229326, 230544, 231739, 233412, 234631, 233833, 231096, 228258, 226514, 225428, 224673, 224971, 226509, 228067, 228783, 229408, 230751, 232231, 232997, 233192, 233024, 231858, 229491, 227198, 226328, 226809, 227997, 229804, 231855, 232816, 231890, 229973, 228108, 225928, 222950, 220278, 219418, 220229, 221478]
57305B21478J211J362J161L80k39m27p07q09K37K065K920K233J309J018P82L11
57289B34285L12R12J319J545K444L648L706K871L338N820Q178Q649Q292Q974J0714
57274C05007J2381J3399J3562J2584J0943R838R450Q630O971N577N003M201K451
57261D19997O72k39q37j817k744l110l268l371k821j652j028j368j478n64L81
57246C96753L33l3L46J159J497J392J419J622J849K309K976L229K847K551K910
57231D23159L584M116M604N087N316N443N960O701P035P265Q480J0690J2509J3109
57217E23058J3073J3029J2885J2766J3168J3834J3976J3878J4633J6099J6955
57206F77354J7082J7853J9559K0761K0833K1006K1927K2417K1729K0991K1186
$$ y = [221478, 222689, 224051, 225212, 225592, 225353, 224926, 224219, 223410, 223647, 225712, 228632, 230865, 232174, 233192, 233974, 234285, 234597, 235509, 236828, 238373, 240817, 244465, 248171, 251042, 254380, 260200, 268378, 277027, 285319, 294293, 305007, 317388, 330787, 344349, 356933, 367876, 377714, 387164, 395794, 402765, 408342, 413345, 417546, 419997, 420669, 420430, 419593, 417776, 415032, 411922, 408654, 405283, 402462, 400810, 399782, 398414, 396936, 396372, 396753, 397086, 397053, 397399, 398558, 400055, 401447, 402866, 404488, 406337, 408646, 411622, 414851, 417698, 420249, 423159, 426743, 430859, 435463, 440550, 445866, 451309, 457269, 463970, 471005, 478270, 486750, 497440, 509949, 523058, 536131, 549160, 562045, 574811, 587979, 601813, 615789, 629667, 644300, 660399, 677354, 694436, 712289, 731848, 752609, 773442, 794448, 816375, 838792, 860521, 881512, 902698]
57195I02698K1579K1395K1290K1822K2229K2033K2186K3299K4239K3881K2839
57184A149490K2297K2444K3126K4522K6094K6489K5609K5182K6144K7089K6593
57173A425079K5337K4584K4194K3618K3313K3719K4148K4109K4417K5710K7189
57162A695417K8115K9051L0486L1673L2164L2872L4312L5297L4913L4260L4774
57151B053334L6167L7472L8687L9957M0635M0600M1134M2967M4863M5606M5996
57140B507418M7394M9711N2247N5098N8239O0667O1950O3239O5415O7785O9854
57129C159017P2666P6837Q1149Q4637Q8396R3625R9730J06000J13311J22312J31819
57118D229499J40854J50231J60168J68607J74381J80137J89487K02985K19440
$$ y = [902698, 924277, 945672, 966962, 988784, 1011013, 1033046, 1055232, 1078531, 1102770, 1126651, 1149490, 1171787, 1194231, 1217357, 1241879, 1267973, 1294462, 1320071, 1345253, 1371397, 1398486, 1425079, 1450416, 1475000, 1499194, 1522812, 1546125, 1569844, 1593992, 1618101, 1642518, 1668228, 1695417, 1723532, 1752583, 1783069, 1814742, 1846906, 1879778, 1914090, 1949387, 1984300, 2018560, 2053334, 2089501, 2126973, 2165660, 2205617, 2246252, 2286852, 2327986, 2370953, 2415816, 2461422, 2507418, 2554812, 2604523, 2656770, 2711868, 2770107, 2830774, 2892724, 2955963, 3021378, 3089163, 3159017, 3231683, 3308520, 3389669, 3474306, 3562702, 3656327, 3756057, 3862057, 3975368, 4097680, 4229499, 4370353, 4520584, 4680752, 4849359, 5023740, 5203877, 5393364, 5596349, 5815789]
57109E815789K39415K64457K94265L27532L64784M08231M60105N23616O04532
57100I302726P09887Q46317J021185J243118J519403J855323K258274K739218
57092B1495451L306189L957955M685686N475981O306599P141482P935359Q642552
57084F8947254R219564R625325R825575R789958R471221Q789662P660395O057868
57076A39386822M061069J835149m33662k597830m570085o308561p784720q957712
57068A14630470r774894j0197880j0229395r917217r337158q573417p706350o804936
57060D2089223n921717n092418m339203l673438l097092k605318k190056j842204
57052A3327777j552299j311387j111829r47036q10969o98501o05602n28669m64251
$$ y = [5815789, 6055204, 6319661, 6613926, 6941458, 7306242, 7714473, 8174578, 8698194, 9302726, 10012613, 10858930, 11880115, 13123233, 14642636, 16497959, 18756233, 21495451, 24801640, 28759595, 33445281, 38921262, 45227861, 52369343, 60304702, 68947254, 78166818, 87792143, 97617718, 107407676, 116878897, 125668559, 133328954, 139386822, 143447891, 145283040, 144849378, 142251548, 137681463, 131372902, 123588182, 114630470, 104855576, 94657696, 84428301, 74511084, 65173926, 56600509, 48894159, 42089223, 36167506, 31075088, 26735885, 23062447, 19965355, 17360037, 15169981, 13327777, 11775478, 10464091, 9352262, 8405226, 7594257, 6895756, 6290154, 5761485, 5297234]
57043E297234m09785l63625l24043k89199k58356k31930k09797j90635j73301
57034B846563j57591j43234j29515j16288j04035r2442q0231o6831n2754l7893
57024A865749k0844l15K4266N3123Q3815J07039J08128P7024J7911n1947j12988
57013B150961j53405j71616j72517j62515j46594j28059j09368r2177p6982o3788
57003H73940n3074m5252l9398l3943k8666k4669k2288k0480j8570j7044j6190
56992E54366j5338j4042j2730j1525r633o508k532J924O991J2418J7168K0204
56980E40763K0586J6881Q154m001j5846k4492k9404l1016k9690k6511k3201k0344
56968C81879j7102j3314j0128p881n135q92L876Q085J2290J7384K2923K8173L3317
$$ y = [5297234, 4887449, 4523824, 4199781, 3910582, 3652226, 3420296, 3210499, 3019864, 2846563, 2688972, 2545738, 2416223, 2299935, 2195900, 2103458, 2023227, 1956396, 1903642, 1865749, 1844905, 1844590, 1868856, 1921979, 2005794, 2112833, 2220961, 2297985, 2315896, 2263949, 2150961, 1997556, 1825940, 1653423, 1490908, 1344314, 1216255, 1106887, 1014710, 937728, 873940, 820866, 775614, 736216, 702273, 673607, 648938, 626650, 606170, 587600, 570556, 554366, 539028, 524986, 512256, 500731, 491098, 484590, 482058, 483982, 490973, 503391, 520559, 540763, 561349, 578230, 586384, 582383, 566537, 542045, 512641, 481625, 451935, 425424, 402223, 381879, 364777, 351463, 341335, 333454, 328319, 327427, 331303, 339388, 351678, 369062, 391985, 420158, 453475]
56955D53475L7884L8947L2967J9460J893j4857k7350l4584l7449l7303l4828l0342
56943C67913k4866j9784j5410j1075o721l156l38L128Q174J4208K0484K7281L4922
56930C94760M2566M8417N0123M4832L0702R565j3067l1680m3854m9798n0575m7775
56918C84216m3341l8359l2711k6603k1295j7594j4793j2035r615p999o689n065
56906A48117l440k381j735j138o11l0J033K387L132L151L558N009O781Q226R883
56891A81942J2341J5105J7593K0209K3596K7755L2369L6718L8577L4812K4383
56880D65400R891m677j6748k5193k9343k9444k7067k3664j9370j4031q420l423
56868B73911J078N588J0171J5134K1451K9564L8616M7855N7889O9292Q0325Q6611
$$ y = [453475, 491359, 530306, 563273, 582733, 584626, 569769, 542419, 507835, 470386, 433083, 398255, 367913, 343047, 323263, 307853, 296778, 290057, 286901, 286563, 289691, 297865, 312073, 332557, 359838, 394760, 437326, 485743, 535866, 580698, 611400, 620965, 607898, 576218, 532364, 482566, 431991, 384216, 340875, 302516, 269805, 243202, 221907, 204313, 189520, 177485, 167870, 159871, 153182, 148117, 144677, 142296, 140561, 139423, 138812, 138782, 139815, 142202, 145334, 148485, 152043, 157052, 163833, 172059, 181942, 194283, 209388, 226981, 247190, 270786, 298541, 330910, 367628, 406205, 441017, 465400, 475291, 470614, 453866, 428673, 399330, 369886, 342819, 319155, 299785, 285754, 277334, 273911, 274989, 280577, 290748, 305882, 327333, 356897, 395513, 443368, 501257, 570549, 650874, 737485]
56856G37485Q2952O5941L6724J923k9535n1771o4007o7998o5441n8284m9041l9251
56844D99697k8844j7905p550J795J1224K1475L1990M2897N6032P2632R1657J11345
56832H86445J29755J41786J38355J12370O5682Q727m5926q8802j15120j25099
56822A108173j22991j13774j00313q4123o7333n2012l8397k5670j3854l358O713
56811D93061J7941L0737M4490N9099P4705Q9935J01028J02392Q8317N6647J2691
56800A171043l2034o7125q9064r9468j00292r3171q1383o8793n6892m5141l3849
56789D03831k4399j6925j0084l194L304R573J6765K5446L4987M4246N1400N3320
56777E88270M6881L1465R667j4077l4964m9241n5947n7088n5147n0989m4896l8156
$$ y = [737485, 820437, 886378, 923102, 925025, 895490, 843719, 779712, 711714, 646273, 587989, 538948, 499697, 470853, 452948, 445398, 447193, 458417, 479892, 511882, 554779, 610811, 683443, 775100, 886445, 1016200, 1157986, 1296341, 1408711, 1474393, 1483120, 1437194, 1348392, 1233272, 1108173, 985182, 871408, 771095, 686972, 619639, 567627, 529230, 503560, 489706, 486348, 493061, 511002, 541739, 586229, 645328, 720033, 809968, 910996, 1013388, 1101705, 1158352, 1171043, 1139009, 1071884, 982820, 883352, 783060, 689889, 608506, 539713, 482821, 437680, 403831, 379432, 362507, 352423, 349229, 352533, 362106, 378871, 404317, 439304, 483550, 534950, 588270, 635151, 666616, 676283, 662206, 627242, 578001, 522054, 464966, 409819, 358830, 313934, 275778]
56765B75778l2092k6634k1471j7475j5311j3760j1336q551o680n437l940k898
56753A10193l432m545m268k745j740j591j125k82k57j130j681j615j776k136j741
56738H0129p33l41p23q60n53o02r75q07k78l78q37l79Q64J366Q04M87R02R57J76
56719G8219m30k34J22L03J004K448L734M254M286L843K479O39l54q2N56R58J302
56702A03047J349M60q21r44L73J596J621J064Q20P57M98K21J01r7m42o95r07j264
56684A06737j395q97l20m97j175j556j789k430k814j786J65J305J157P68N64k9
56668I6008p22k07J612L048K954K168J943K345K674K432J487K13n25l69j63o29
56652A14269j001l18P27R35Q71J836L226L303K228J853K538K748K007J616J976
$$ y = [275778, 243686, 217052, 195581, 178106, 162795, 149035, 137699, 129148, 122468, 117031, 113091, 110193, 106761, 102216, 97948, 95203, 93463, 91872, 90747, 90465, 90208, 89078, 87397, 85782, 84006, 81870, 80129, 79396, 79055, 78332, 77472, 76919, 76317, 75342, 74535, 74257, 73879, 73042, 72663, 73527, 74893, 75697, 76184, 77086, 78043, 78219, 77789, 77555, 77677, 77980, 78984, 81432, 85166, 89420, 93706, 97549, 100028, 100667, 100313, 100231, 100787, 101745, 103047, 104396, 104856, 104035, 103091, 103464, 105060, 106681, 107745, 108565, 109322, 109820, 110041, 110142, 110045, 109603, 108908, 108001, 106737, 105342, 104445, 104125, 103628, 102453, 100897, 99108, 96678, 93864, 92078, 92243, 93548, 94705, 95473, 96037, 96008, 95286, 95079, 96691, 99739, 102693, 104861, 106804, 109149, 111823, 114255, 115742, 115955, 115430, 115061, 114898, 114269, 113268, 112950, 113677, 114612, 115483, 117319, 120545, 123848, 126076, 127929, 130467, 133215, 135222, 136838, 138814]
56637A38814J726K96r44r58m71l25k35P9K61L66R30J518R40p18j989k225k106
56620A34959j832q64K99L06p12j137n86m00r11p45M63J050L5j382k041k383k776
56603A21343k409j058k2j14m05o8L04J76J68O85J058R47R86J283J018K01oN84
56585A24671P44J86K42J339K008J448Q85J222J439O74j46m5M33P56J551K921L468
56568A43796K520J506J820K809L318L546M055M536M861N818P554Q812Q831Q396
56554B12178P952O557L939J705J088J199Q83N58P58P06j45p51k77K93j54j043
56538B35446j496j992l116m073m007l462l219k950k338k055k364k243j234o05
56524B00292j343k435k552j894j097P8J476J697L7k088l073l139l130k975k600
$$ y = [138814, 140540, 140836, 139892, 138934, 138463, 138138, 137903, 137982, 138243, 138609, 139539, 141057, 141997, 141279, 139290, 137065, 134959, 133127, 132263, 132562, 132868, 132156, 131019, 130433, 130033, 129122, 128377, 128840, 129890, 129925, 128543, 126502, 124119, 121343, 118934, 117876, 117854, 117740, 117335, 117267, 117571, 117747, 117915, 118600, 119658, 120605, 121591, 122874, 123892, 124093, 124087, 124671, 125415, 125601, 125843, 127182, 129190, 130638, 131523, 132745, 134184, 134858, 134712, 134667, 135100, 135856, 137407, 140328, 143796, 146316, 147822, 149642, 152451, 155769, 159315, 163370, 167906, 172767, 178585, 186139, 194951, 203782, 212178, 220130, 226687, 230626, 232331, 233419, 234618, 235501, 236059, 236817, 237523, 237378, 236627, 236350, 236643, 236489, 235446, 233950, 231958, 228842, 224769, 220762, 217300, 214081, 211131, 208793, 206738, 204374, 202131, 200897, 200292, 198949, 196514, 193962, 192068, 190971, 191049, 192525, 194222, 194259, 192171, 189098, 185959, 182829, 179854, 177254]
56509A77254k764l537l611k477j557j798k103j619j577k982m370l947k304j075
56495A41533l76M20R14O58N59J315J792Q40n31o41M13J496K402L298L548K792
56479A60432J992J844J474K20q01n26K44M93Q46J928K591J760N08K66M68on46
56462A73187j03O17L54m86q05p95j021q87J47J096J042Q03J250J476N31n97o66
56445A75143k70l45j99Q19J492P18l38k80N1m98q37L99K018K089J137Q14Q71J55
56427A82939o48j33J086J416R54P15L85n85j014K23J740J603N59M98J077P45l8
56410A91522L12J361J375M11j41k71q91j551j275p58j145j647r89o8l47q90j2
56393A84996J362J142r4j24J033J497J139J426K286K385K029K606L622L438K524
$$ y = [177254, 174490, 170953, 167342, 164865, 163308, 161510, 159407, 157788, 156211, 153229, 148859, 144912, 142608, 141533, 141157, 141577, 142491, 143149, 143708, 145023, 146815, 147655, 147124, 146483, 146896, 148392, 150794, 154092, 157640, 160432, 162424, 164268, 165742, 165962, 165161, 164635, 164879, 165372, 166218, 168146, 170737, 172497, 173005, 173271, 173739, 173733, 173187, 173084, 173701, 174055, 173569, 172764, 171969, 170948, 170061, 170208, 171304, 172346, 173149, 174399, 175875, 176406, 175809, 175143, 174873, 174528, 174329, 175148, 176640, 177358, 177020, 176740, 176791, 176293, 175456, 175855, 177873, 179962, 181099, 181913, 182784, 182939, 182291, 182158, 183244, 184660, 185614, 186329, 186714, 186129, 185115, 185338, 187078, 188681, 189240, 189738, 190815, 191560, 191522, 191834, 193195, 194570, 194981, 194840, 194569, 193678, 192127, 190852, 190094, 188949, 187302, 186313, 186245, 185898, 185008, 184996, 186358, 187500, 187406, 187282, 188315, 189812, 190951, 192377, 194663, 197048, 199077, 201683, 205305, 208743, 211267]
56378B11267K767L969M128K916J861J355N17l89l22J53k93j009m01R23J096L86
56362B28924N15J216Q53j01K85J656J831P69N47J465J709R42P38J273R95j23l01
56345B43193P09J083K06m91k30K35O33J368J733P18o71n94M70P01M48J432K940
56328B53883K515L84n26Q02K309K662K760L089K817K024J869K226J905J223J429
56313B81371J923J154p8K96J669J548M8k95Q69J327O60Q73K384L331L434M481
56297C04995O395O804N273M148M292L906K393J652K428K982K511K432L292L780
56283C57283L662M355N806O156N241N012N889O186N697O181P686Q197P612Q206
56269D43169J0345J1629J1217J1141J2379J3409J3697J4778J6912J8398J9177
$$ y = [211267, 214034, 218003, 222131, 225047, 226908, 228263, 228780, 228391, 228069, 228222, 227929, 226920, 226519, 227442, 228538, 228924, 229439, 230655, 231508, 231407, 231692, 233348, 235179, 235948, 236495, 237960, 239669, 240611, 241349, 242622, 243617, 243494, 243193, 243902, 244985, 245191, 244700, 244470, 244705, 245338, 246706, 248439, 249157, 248486, 247892, 248362, 249063, 249511, 250943, 253883, 256398, 256782, 256256, 257058, 259367, 262029, 264789, 267878, 270695, 272719, 274588, 276814, 278719, 279942, 281371, 283294, 284448, 284370, 284666, 286335, 287883, 287931, 287636, 288505, 289832, 290492, 291365, 293749, 297080, 300514, 304995, 311390, 318194, 323467, 327615, 331907, 335813, 338206, 339858, 342286, 345268, 347779, 350211, 353503, 357283, 360945, 365300, 371106, 377262, 382503, 387515, 393404, 399590, 405287, 411468, 419154, 427351, 434963, 443169, 453514, 465143, 476360, 487501, 499880, 513289, 526986, 541764, 558676, 577074, 596251]
56258E96251K1387K5379K9045L1892L5801M0990M5407M9083N4724O2921P1066
56247A063946P8159Q6184R5398J02862J07383J11415J16189J19257J18737J15863
56237B115393J11361J03409R1144P6363N9934M0444J8176l578k2913m1063n8273
56226B490397p2156q1847q9581r6329j00208j00909j01114j01568r9399r3581
56216A553705q7405q3121p8618p2104o5599o0986n6774n1643m7256m4766m2307
56205H63126l8541l5035l2709k9777k5476k1968k0216j8069j4605j2235j2135
56194F02360j1914j0169q880q991q190n684m353n433n835l718j939k646l311j598
56180E19699K95q0j106o75l9n49m79J423L014K631K086K811L039J755J257K750
$$ y = [596251, 617638, 643017, 672062, 703954, 739755, 780745, 826152, 875235, 929959, 992880, 1063946, 1142105, 1228289, 1323687, 1426549, 1533932, 1645347, 1761536, 1880793, 1999530, 2115393, 2226754, 2330163, 2421307, 2497670, 2557604, 2598048, 2616224, 2612646, 2589733, 2548670, 2490397, 2418241, 2336394, 2246813, 2150484, 2050276, 1949367, 1848253, 1746685, 1647286, 1553705, 1466300, 1383179, 1304561, 1232457, 1166858, 1105872, 1049098, 997455, 950199, 905433, 863126, 824585, 789550, 756841, 727064, 701588, 679620, 659404, 641335, 626730, 614495, 602360, 590446, 580277, 571397, 562406, 554216, 548532, 544179, 538746, 532911, 529193, 527254, 524608, 521297, 519699, 519994, 519914, 518808, 518133, 518094, 517545, 517066, 518489, 521503, 524134, 526220, 529031, 532070, 533825, 535082, 537832]
56164E37832L804L096L182N402O845N723M985P012R461R979J0286J1886J2602
56151F32095J1288J1185J4538J8468K0183K1592K4885K8386L0792L4669M1605
56140H89686M8902N5142O3865P7407R2469J06168J20830J37586J50667J53660
56130A896382J46867J33637J14783R2166P2495O1237N6458N3541N1194M8000L8816
56119B765576K1034R4j6945k8956l7157l9981l7923l8220m7695o4826q4359j04748
56107B285894j24972j39511j43813j40579j34261j23867j07587q9548p4937o2765
56097A144054n0143l9173l2777k8225k1781j5409j2252j0066n876k302k322k745
56085I20983J15L278K837J549L303N403M143K623M966Q073P431N793P567R928
$$ y = [537832, 541636, 544732, 547914, 553316, 560161, 565884, 570869, 577881, 587342, 597321, 607607, 619493, 632095, 643383, 654568, 669106, 687574, 707757, 729349, 754234, 782620, 813412, 848081, 889686, 938588, 993730, 1057595, 1135002, 1227471, 1333639, 1454469, 1592055, 1742722, 1896382, 2043249, 2176886, 2291669, 2383835, 2456330, 2517567, 2574025, 2627566, 2678760, 2726760, 2765576, 2786610, 2786704, 2769759, 2740803, 2703646, 2663665, 2625742, 2587522, 2539827, 2475001, 2390642, 2285894, 2160922, 2021411, 1877598, 1737019, 1602758, 1478891, 1371304, 1281756, 1206819, 1144054, 1093911, 1054738, 1021961, 993736, 971955, 956546, 944294, 934228, 928352, 926050, 923728, 920983, 921098, 924376, 927213, 928762, 932065, 937468, 941611, 944234, 949200, 957273, 964704, 970497, 978064, 987992]
56071I87992Q477O431Q922J3151J3622J2355J4322J7463J6941J4871J6043J8283
56059A148873J6755J3605J3646J4805J2550R372J0115J2329J1111Q886J0454J3199
56047A295700J2392J1104J4363J8632J7976J5475J7360K1106K0813J9187K2267
56036A486375K7328K8040K6588K8575L1156K8742K5103K7071L1557L1754L0562
56025A802851L4533M0339M1096M0184M4520N0147M9321M5855M8137N3108N2890
56014B302981N0934N5136O1339O0799N7745O1808O9410P0889O9652P5265Q4027
56003C019985Q6133Q5677R3063J04018J07376J07212J15171J27386J32023J33246
55993D111290J43593J58940J66014J68582J80243J97484K06837K12518K28957
$$ y = [987992, 996469, 1002900, 1011822, 1024973, 1038595, 1050950, 1065272, 1082735, 1099676, 1114547, 1130590, 1148873, 1165628, 1179233, 1192879, 1207684, 1220234, 1229606, 1239721, 1252050, 1263161, 1272047, 1282501, 1295700, 1308092, 1319196, 1333559, 1352191, 1370167, 1385642, 1403002, 1424108, 1444921, 1464108, 1486375, 1513703, 1541743, 1568331, 1596906, 1628062, 1656804, 1681907, 1708978, 1740535, 1772289, 1802851, 1837384, 1877723, 1918819, 1959003, 2003523, 2053670, 2102991, 2148846, 2196983, 2250091, 2302981, 2353915, 2409051, 2470390, 2531189, 2588934, 2650742, 2720152, 2791041, 2860693, 2935958, 3019985, 3106118, 3191795, 3284858, 3388876, 3496252, 3603464, 3718635, 3846021, 3978044, 4111290, 4254883, 4413823, 4579837, 4748419, 4928662, 5126146, 5332983, 5545501, 5774458]
55984E774458K52192K67802K80702L06506L40128L65017L86531M22315M66953
55975H862604N02298N35291N87192O52912P11913P71653Q56730R63106J069792
55966A5513491J187516J345631J540193J750129J995876K323140K739356L231037
55958C1626369L831031M596264N536109O648848Q014138R757820J1954886J4685961
55950I6651426J8153066K2583285K8045149L4494395M1743152M8734096N2645121
55943C43049690M9524645L6973045J6656965o109099k5577022l8568146m4936649
55936C31013429m6116987m3762779l9310070l3937436k8474703k3392897j8948440
55929I7070117j5270034j2331956r993526q128318o667253n532001m620157l870808
$$ y = [5774458, 6026650, 6294452, 6575154, 6881660, 7221788, 7586805, 7973336, 8395651, 8862604, 9364902, 9900193, 10487385, 11140297, 11852210, 12623863, 13480593, 14443699, 15513491, 16701007, 18046638, 19586831, 21336960, 23332836, 25655976, 28395332, 31626369, 35457400, 40053664, 45589773, 52238621, 60252759, 70010579, 81965465, 96651426, 114804492, 137387777, 165432926, 199927321, 241670473, 290404569, 343049690, 392574335, 429547380, 446204345, 440095246, 414518224, 375950078, 331013429, 284896442, 241133663, 201823593, 167886157, 139411454, 116018557, 97070117, 81800083, 69468127, 59474601, 51346283, 44679030, 39147029, 34526872, 30656064]
55921C0656064l274163k806045k413958k072978j795441j577026j385548j208935
55913A4121970j064508r53886q53798p57193o80856o26388n73314n16177m71131
55904G624719m40626m07168l67078l36575l19050k98357k69850k47636k35770
55895D702609k21158k00283j85461j79319j69250j52205j40019j35419j26851
55886C192644j11700j01287r8156r0928p6367o4829n9130m9108l1997j8201j2217
55875B478724p150k409p543k3758l9751n0441o2393p6807q4877q4463q4237q6842
55863A868053q4379p4960o7491o5454o1692n3724m8811m9223m7495m1024l6849
55852A236951l7331l5375k8661k4727k6951k8732k6457k5429k8138k9004k5561
$$ y = [30656064, 27381901, 24575856, 22161898, 20088920, 18293479, 16716453, 15330905, 14121970, 13057462, 12103576, 11249778, 10492585, 9811729, 9185341, 8612027, 8095850, 7624719, 7184093, 6776925, 6409847, 6073272, 5754222, 5455865, 5186015, 4938379, 4702609, 4481451, 4281168, 4095707, 3916388, 3747138, 3594933, 3454914, 3319495, 3192644, 3080944, 2979657, 2881501, 2790573, 2714206, 2649377, 2590247, 2541139, 2509142, 2490941, 2478724, 2471574, 2469165, 2461622, 2437864, 2398113, 2347672, 2285279, 2208472, 2123595, 2039132, 1954895, 1868053, 1783674, 1708714, 1641223, 1575769, 1514077, 1460353, 1411542, 1362319, 1314824, 1273800, 1236951, 1199620, 1164245, 1135584, 1110857, 1083906, 1055174, 1028717, 1003288, 975150, 946146, 920585]
55841I20585k3065k3656k2405j8095j6362j8397j8050j3785j1942j4466j5089
55830G25273j1467r475j1326j1095o442l496n458p196n821n900r457j1216q731
55817F18193p253r678j1295r221p582q673q271m432j816k668k408J298L916L010
55803E53120L015O503R275Q822R164J2536J4377J1478P251M373l7p359j3270j5263
55789F03985j6878k0086k0966j7413j3715j2814j1283o723l078l726n906o633
55777D64764p672j0210j0952q011m643l001k68N231J0181J2276J3604J4501J0878
55764D86678J781p012j1190j3325j6146j7118j4393j1600j1700j1887r354o633
55752C58101o506p050o218o103q242r819q783p709q550q721o351m225m530m760
$$ y = [920585, 897520, 873864, 851459, 833364, 817002, 798605, 780555, 766770, 754828, 740362, 725273, 713806, 704331, 693005, 681910, 675468, 671972, 666514, 659318, 653497, 647597, 638140, 626924, 618193, 610940, 601262, 589967, 580746, 573164, 564491, 556220, 551788, 549972, 547304, 544896, 546194, 550110, 553120, 556135, 562638, 571913, 580735, 589899, 602435, 616812, 628290, 635541, 639914, 639877, 632518, 619248, 603985, 587107, 567021, 546055, 528642, 514927, 502113, 490830, 484107, 481029, 477303, 471397, 464764, 457092, 446882, 435930, 427919, 423276, 420275, 420007, 425238, 435419, 447695, 461299, 475800, 486678, 488459, 481447, 470257, 456932, 440786, 423668, 409275, 397675, 385975, 374088, 364734, 358101, 351595, 344545, 338327, 332224, 323982, 314163, 305380, 297671, 289121, 280400, 274049, 269824, 265294, 260534]
55738B60534k813r98j191j175M30R16j062k188m83Q94k98j222Q2L89k566n310
55722B43939m731l565m871o276m833k668k579k631l08K301K461J848K821L818
55708B24726L069K760M638N771L508O01M41J104p72l914n268n440o433p263o467
55693B11061n769o702o933m388j612j514k193o46J751K202J674K409L292K489
55679A95121J727L262N334N209L967L901L908K059j01k94N8j337l022k542j221
55664B16029j666k794j975J04J090J408K756M204L972L218M048N565N659M822
55650B46440M594M315K830J234N74p58l967o904p602p824r462j0512q703o118
55636A98137n857o832o301m934m947n585m915l766l672l311j285K07j081k797
$$ y = [260534, 257721, 256723, 255532, 254357, 254787, 255703, 254641, 252453, 251970, 252864, 252566, 251344, 251426, 251815, 249249, 243939, 239208, 235643, 230772, 224496, 219663, 216995, 214416, 211785, 211477, 213778, 216239, 218087, 220908, 224726, 227795, 230555, 235193, 240964, 244472, 245073, 245514, 246618, 245846, 241932, 236664, 231224, 224791, 217528, 211061, 205292, 198590, 191657, 187269, 185657, 184143, 181950, 181304, 183055, 185257, 186931, 189340, 192632, 195121, 196848, 200110, 205444, 210653, 214620, 218521, 222429, 224488, 224387, 224093, 224151, 222814, 219792, 217250, 216029, 214363, 211569, 209594, 209698, 210788, 212196, 214952, 219156, 223128, 226346, 230394, 235959, 241618, 246440, 251034, 255349, 258179, 259413, 259987, 259229, 255262, 248358, 240756, 232932, 223470, 212958, 204255, 198137, 192280, 185448, 179147, 174213, 169266, 163681, 158766, 155000, 151328, 148017, 146732, 146939, 145858, 143061]
55622A43061j668P36Q79n57n71K86o09k319j811K05L07j683k784k252k026k382
55606A26812j733l97k39j000q93k30o12j423r40N8l39j308p83M41J95p26n1J303
55588A18135O12j490j883l69L80j98o3J030J124P7p8R58J399R06R22J470J193
55571A24125N08J141K654K916J950J788K685K891K156J955K318J752L65k65k58
55556A48681j281l225m178l732l319l323k753j725j388j555j083k62j70l01M57
55541A20843J229N11p54n34O74P49j90k86M73M76j71M4P98M10r23j531j457k040
55523A18321k905k632j806k029k625j824m28o38j855j632k65l70k095k860j909
55508I2448j102j027k60J156J346K61K3J147J889J730K097L111L179K173J717
$$ y = [143061, 141393, 142129, 143008, 142451, 141880, 142166, 141557, 139238, 137427, 137632, 137939, 136256, 133472, 131220, 129194, 126812, 125079, 124682, 124443, 123443, 122550, 122320, 121708, 120285, 119345, 119403, 119064, 117756, 116973, 117414, 117609, 116883, 116832, 118135, 118747, 117257, 115374, 115005, 115385, 115187, 115124, 116154, 117278, 117355, 117277, 118235, 119634, 120540, 121462, 122932, 124125, 124633, 125774, 128428, 131344, 133294, 135082, 137767, 140658, 142814, 144769, 147087, 148839, 149204, 148939, 148681, 147400, 144175, 139997, 136265, 132946, 129623, 126870, 125145, 123757, 122202, 121119, 120857, 120687, 120386, 120843, 122072, 122583, 121829, 121295, 121969, 122718, 122528, 122242, 122715, 123191, 123020, 123064, 123862, 124272, 123349, 121818, 120361, 118321, 115416, 112784, 110978, 108949, 106324, 104500, 104072, 103434, 101579, 99947, 99682, 99312, 97217, 94357, 92448, 91346, 90319, 90059, 91215, 92561, 92822, 92845, 93992, 95881, 97611, 99708, 102819, 105998, 108171, 109888]
55493A09888J901J150l30n85K78j01k064l191k498j833k171k033o65M65M99M78
55477I9188Q06L97p60j058k10J73l39k17R23J376M34m41l97m17r34r74m57o77
55459I6416j658j774p41k70r37j221m33R0l68p03k87M3K2M84J232R81k6k0J166
55440I1996J743J287J383K295K100J66j450j292n18m10m21J20O74R10J308J682
55424A01573J133Lm44m11j138k045j314N36R90j30k38J401K325J278L19J014J871
55407A06723J406N78L72j85j678k616j945r27q31r91o46m48p41n62L00N75m7j63
55389I8174N75N51p48j537r06m31j152j675r27r0j50p4Q22J255M33l75l55o84
55371I2706j824k027m48R50O39N9O83J199J46j045m00J178J597J001Q49J092P48
$$ y = [109888, 111789, 112939, 112609, 112024, 112302, 112201, 110137, 106946, 104448, 102615, 100444, 98411, 97746, 98211, 98710, 99188, 99994, 100391, 99631, 98573, 98363, 98536, 98197, 97980, 98903, 100279, 100713, 100272, 99875, 99458, 98524, 97550, 97093, 96416, 94758, 92984, 92243, 91973, 91036, 89815, 89382, 89472, 89104, 88401, 88114, 88157, 88179, 88663, 89895, 90876, 90850, 90830, 91996, 93739, 95026, 96409, 98704, 100804, 100970, 99520, 98228, 97710, 97300, 96879, 96999, 97673, 98583, 99891, 101573, 102706, 102709, 102265, 101854, 100716, 98671, 97357, 97893, 98883, 98753, 98515, 99916, 102241, 103519, 103838, 104852, 106723, 108129, 108707, 109079, 108894, 107216, 104600, 102655, 101728, 100897, 99906, 99260, 98812, 98071, 97509, 97809, 98384, 98337, 98174, 98749, 99300, 98552, 97015, 96109, 95678, 94526, 92851, 91924, 91834, 91684, 91610, 92432, 93687, 94120, 93745, 93390, 92706, 90882, 88855, 88407, 89357, 89996, 90055, 90738, 91937, 92083, 91038, 90638, 91816, 93413, 94414, 95263, 96355, 97103]
55354I7103J69L38R17R70O81N77K44o22j081m68K06q6o29l88J80K02o1j71o21
55335I7460j540j772o65N78P28L25K94L42N8O3O60Q75J42n04k67L1l73p92o21
55316I5022n25p69l23J018J567L62j059j112m79k96n5Q45J347N42m88n27k80o76
55298I4114r21j98M15j89r42m07P10R52N87N78N45j25m69N05J676J389J04n68
55280I7756m05k25p2K98K09p67j512r68J6K00l2J23L0r49j603o49P97Q65p5k89
55260I2748L89P90P79J068J376Q67m8k93M8K44N19J315J754P70q90j695j639j732
55242I6370j872j210n5M85L19J87J55r1j13N04R76N18n8L24R46M21q46j278o50
55223I5032m6J61M43N97n4j127j507j037m44K6N96R32N83J9J3L84N33N96R61J306
$$ y = [97103, 97272, 97610, 98527, 99497, 100178, 100755, 100999, 100377, 99296, 98828, 99034, 98948, 98319, 97931, 98111, 98313, 98252, 98081, 97460, 95920, 94148, 93483, 94061, 94789, 95114, 95408, 95750, 95808, 95871, 96531, 97406, 97548, 97044, 96777, 96808, 96435, 95643, 95022, 94497, 93728, 93405, 94423, 95990, 96352, 95293, 94181, 93702, 93406, 93351, 94196, 95543, 96085, 95597, 95070, 94790, 94114, 93193, 92995, 93410, 93221, 92279, 91872, 92582, 93534, 94121, 94699, 95244, 95119, 94650, 95155, 96831, 98220, 98324, 97756, 97351, 97126, 97054, 97352, 97561, 96794, 95282, 94314, 94330, 94530, 94498, 94621, 94651, 93702, 92099, 91450, 92247, 93112, 93037, 92748, 93137, 93927, 94706, 95774, 97150, 98017, 97969, 97676, 97724, 97968, 98487, 99802, 101556, 102326, 101436, 99741, 98102, 96370, 94498, 93288, 93233, 93718, 94037, 94224, 94379, 94288, 94175, 94679, 95655, 96173, 96115, 96439, 97385, 97806, 96960, 95682, 95032, 94986, 95147, 95590, 96187, 96133, 95006, 93499, 92462, 92018, 92044, 92640, 93572, 94155, 94174, 94187, 94571, 95104, 95700, 96661, 97967]
55203I7967J294J374J787J713O84k49j10L15q1p47n74L7K1l58j41M08L26k50m54
55184A02962k69k04j37J65J44m87p55Q4J062R91L38M8j92p96o95R64K680K390
55166A08293N47p92j064j172j132j92J145J417M14o96j214j171l85J139K299K067
55150A09503J046L62j12r00j385r15m08r11j582j189m99r35j856j583l08M00K99
55133I9027L06L59j51n28K24J114M59j133j618q28k95k82L24J418J735J343J459
55116A02933J935J504M06J11N12P4j124j321j86O86O42P51J288J095l6p34l87
55099A08149O8J25L02M25l54j506j454k43M34K29N90J813K279J350N02O32O49
55082A13990j75p20j16O83O23J40o4k50o41o59l9O27J011J401J581R25j48m17
$$ y = [97967, 99261, 100635, 102422, 104135, 104819, 104570, 104460, 104775, 104694, 103947, 103373, 103410, 103431, 103073, 102932, 103340, 103666, 103416, 102962, 102693, 102489, 102352, 102517, 102661, 102174, 101419, 101503, 102565, 103556, 103894, 103942, 103750, 102954, 102259, 103223, 105903, 108293, 108840, 108048, 106984, 105812, 104680, 104488, 105633, 107050, 107464, 106768, 105554, 104383, 103998, 105137, 107436, 109503, 110549, 110911, 110799, 109899, 108514, 107599, 107191, 106280, 104698, 103509, 103010, 102075, 100219, 98636, 98328, 98728, 99027, 99333, 99692, 99541, 99013, 99237, 100351, 100810, 99677, 98059, 97231, 96936, 96654, 96978, 98396, 100131, 101474, 102933, 104868, 106372, 106778, 106889, 107401, 107475, 106351, 105030, 104844, 105530, 106172, 106923, 108211, 109306, 109270, 108536, 108149, 108217, 108342, 108644, 109069, 108715, 107209, 105755, 105512, 105946, 106175, 106765, 108578, 110857, 112207, 112709, 113341, 113990, 113815, 113095, 112979, 113662, 114285, 114425, 114361, 114111, 113470, 112811, 112772, 113399, 114410, 115811, 117392, 118317, 118169, 117752]
55064A17752R8J40m59m56M42Q88J99n96o59m91n36l70J11L18K62N10O41l66j895
55045A15533k072p46J14m14r31m10K28J82J72O22N52m82j279j031o75r77j126
55028A07260l94M39O11O69J052J026J85m94l05k0k97m53M2M08Pm07j27K67J63
55009A09632M7K51J12n57o33M67J548J448P75N80P12P00R35J663K057J569J039
54992A22345J221J452R07O1l94q54j773k448k087j139l45M88J642K442K235J547
54976A25300J159R50O05M43N87L62m40q45k36M50K64j77J41R28J215Q72L52k31
54958A31699p49o41K26J020J121R15P84M26q6O1Q59R62k34j354j181n63p90j386
54940A31089j152l34J6m4L28J035J201O80J51L2L33J149K356L353L899M538N602
$$ y = [117752, 117850, 117990, 117531, 117075, 117517, 118405, 118604, 118008, 117349, 116858, 116322, 115952, 116063, 116381, 116643, 117153, 117794, 117428, 115533, 113461, 112715, 112829, 112415, 111484, 111074, 111302, 111484, 111656, 112278, 112830, 112348, 111069, 110038, 109363, 108386, 107260, 106866, 107305, 107916, 108585, 109637, 110663, 110848, 110354, 110049, 110029, 109732, 109279, 109321, 109729, 109736, 109329, 109202, 109469, 109632, 109679, 109930, 110042, 109485, 108852, 109319, 110867, 112315, 113090, 113670, 114382, 115082, 116017, 117680, 119737, 121306, 122345, 123566, 125018, 125925, 125986, 125592, 124738, 122965, 120517, 118430, 117291, 116946, 117434, 119076, 121518, 123753, 125300, 126459, 127409, 128014, 128457, 129044, 129406, 128966, 128121, 127885, 128335, 128599, 128422, 128563, 129491, 130706, 131578, 131930, 131699, 130950, 130309, 130535, 131555, 132676, 133591, 134375, 134801, 134715, 134776, 135635, 136597, 136363, 135009, 133828, 133265, 132475, 131089, 129937, 129603, 129619, 129575, 129903, 130938, 132139, 132819, 132970, 133002, 133335, 134484, 136840, 140193, 144092, 148630, 154232]
54923A54232O557P116P892R116R844R375Q370P457N954L223J28k178l985o102
54909B16999q116r030q884q403p723o710n819n386m823l686k747k712k769j830
54895A38361m09K45J55K32N08L65L6K78Q79R84P50J228K695M325N503O353P073
54878A69561P699Q408R214R585R058P873O343M186J266j673l958n934p985r419
54864B04224r394q336p287o402n308m362m247m699m762m046k878j640p93r03j764
54849A37403k193j624j056j438k102k014j599j768k082j551n83l54p12m99L52
54834A18180Q09O58O91J033Q97J88k17J9K29Nk78m14o68r22o29J80P37O15J40
54815A21253l14n87m19L12J057J137O75K38j01m32k41Q92K115K187J340R54J433
$$ y = [154232, 160789, 167905, 175797, 184913, 194757, 204132, 212502, 219959, 225913, 229136, 229264, 227086, 223101, 216999, 208883, 199853, 190969, 182566, 174843, 168133, 162314, 156928, 152105, 148419, 145672, 142960, 140191, 138361, 137952, 138197, 138352, 138584, 139092, 139457, 139493, 139771, 140650, 141634, 142384, 143612, 146307, 150632, 156135, 162488, 169561, 177260, 185668, 194882, 204467, 213525, 221398, 227741, 231927, 233193, 231520, 227562, 221628, 213643, 204224, 194830, 186494, 179207, 172805, 167497, 163135, 158888, 154189, 149427, 145381, 142503, 140863, 140070, 139167, 137403, 135210, 133586, 132530, 131092, 128990, 126976, 125377, 123609, 121527, 119976, 119393, 119039, 118327, 117828, 118180, 118989, 119647, 120338, 121371, 122268, 122456, 122239, 122258, 122487, 122492, 122214, 121800, 121132, 120210, 119581, 119761, 120498, 121113, 121253, 120939, 120352, 119933, 120245, 121302, 122439, 123114, 123352, 123251, 122819, 122578, 123470, 125585, 127772, 129112, 130066, 131499]
54798A31499J776J361P78N45K33n64j372j550j177p31m36k74j70J4L55O83Q58
54781A31828J126J722K251K056J167L54L42J275K797M225N005N319N974P237Q351
54766A81029Q655Q574Q811R156Q842P575N460K551p64l460m950n936p231q387
54752B09925q521p913p569p533p034n992n068m384l454k377j810j632r15N34J647
54737A47904J492M29m91n96R2R98J352R50N94J267K928M674N945O900P740Q335
54721A90513Q566Q473Q050P213N948M163J734j070l646n781p726r309r802r158
54707A88168q408q080p253n147k747j555j510j439r79p21q30r01j003j546k227
54692A43822k260j580q76n36m30m96o46m17L61Q94L82p14j296j166r21q14o89
$$ y = [131499, 133275, 134636, 135414, 135959, 136192, 135628, 134256, 132706, 131529, 130798, 130362, 130088, 129918, 129932, 130287, 130970, 131828, 132954, 134676, 136927, 138983, 140150, 140504, 140846, 142121, 144918, 149143, 154148, 159467, 165441, 172678, 181029, 189684, 198258, 207069, 216225, 225067, 232642, 238102, 240653, 239889, 236429, 231479, 225543, 218312, 209925, 201404, 193491, 185922, 178389, 171355, 165363, 160295, 155911, 152457, 150080, 148270, 146638, 145723, 146257, 147904, 149396, 149825, 149334, 148738, 148830, 149828, 151180, 152130, 152724, 153991, 156919, 161593, 167538, 174438, 182178, 190513, 199079, 207552, 215602, 222815, 228763, 232926, 234660, 233590, 229944, 224163, 216437, 207128, 197326, 188168, 179760, 171680, 164427, 159280, 156533, 154978, 153468, 152029, 151050, 150329, 149499, 148598, 147595, 146049, 143822, 141562, 139982, 139106, 138570, 138140, 137644, 136998, 136581, 136942, 137836, 138218, 137504, 136208, 135042, 134121, 133307, 132618]
54675A32618p19j097j348r21j34M14Q22J283J179M9j190j350p05k89j02M76J044
54658A30030O77k77o51m05m32p00m07J81J1o20k86J045J695R55J31K87O92M40
54640A32366k1M6L39K56k8q1QNKJ8j17k17J24O21M89k85p62m61O0K26Q4k46p51
54617A31675r54k92P80J082M33r0J90O91P78O36N01R0o48j153j072o97k58L45
54599A32037Q63O58k51r75r11l99pJ26K3k23k33K55P79P15K82R3K1l53m70N28
54579A32558K022K383J350L21R7m4o80j213j104p16l46K68R69J020M27R3K68K20
54561A37893j53M6Q90J117J75p77q43p77j296j558o45P38J396J500J920K572K743
54544A44941K398K005J601J058O72O43N50J34n7L53P34M32j72m70p33j408k016
$$ y = [132618, 131899, 130802, 129454, 128533, 128399, 128813, 129635, 130918, 132097, 132146, 130956, 129606, 128901, 128612, 128510, 128986, 130030, 130707, 130430, 129779, 129374, 128942, 128242, 127835, 128016, 128027, 127407, 127121, 128166, 129861, 130816, 130947, 131234, 131926, 132366, 132345, 132391, 132730, 132986, 132958, 132877, 132885, 132890, 132892, 132910, 132793, 132576, 132700, 133321, 133810, 133525, 132763, 132302, 132362, 132588, 132672, 132426, 131675, 130721, 130429, 131209, 132291, 132724, 132634, 132824, 133515, 134293, 134929, 135430, 135520, 134872, 133719, 132647, 131950, 131692, 132037, 132900, 133558, 133307, 132332, 131421, 131022, 131015, 131141, 131164, 130941, 130708, 130963, 131742, 132457, 132739, 132832, 132853, 132500, 132030, 132558, 134580, 136963, 138313, 138634, 138731, 138687, 138007, 136794, 135690, 134974, 134628, 134896, 135865, 136885, 137312, 137405, 137673, 137893, 137740, 137786, 138676, 139793, 139968, 139191, 138348, 137571, 136275, 134717, 134072, 134810, 136206, 137706, 139626, 142198, 144941, 147339, 149344, 150945, 152003, 152675, 153318, 153868, 154002, 153945, 154298, 155032, 155464, 155292, 154822, 154089, 152681, 150665]
54527A50665j800r46k15J93M99N89K54j74k25MK05M29O32L05o94j503j277m18
54509A46523R8J59L65Q12R62O38K73J83J85Q6QJ71N33P42M47k03n15q3N27M90
54489A52401m1k52p1k68r60j229n70L24P66J059J632K155K180J888J535R21N8
54472A61528l72M1O63P31L93K14K49K87M27P69J002Q91O73N30K31k70n34m48n94
54453A66411j261j811j633j030n74j93L83Q83R04N86K86K7k34l33k99n11j002
54436A60599j231r35n97o09o89n22l08k13j7L14M26L10L76N38J80n30m72P04J819
54417A59143J841J265R65P90K22m20n42l17k22j92l0pk93m44j75J23K53P29J721
54398A64410K456K397K034J757J064j32o82J14J080P79m10j149j195j122q45p
$$ y = [150665, 148865, 147919, 147704, 147897, 148396, 148985, 149239, 149065, 148840, 148844, 149049, 149478, 150110, 150415, 149721, 148218, 146941, 146523, 146621, 146780, 147145, 147957, 148919, 149557, 149830, 150013, 150198, 150284, 150292, 150463, 150996, 151738, 152185, 151982, 151467, 151384, 151911, 152401, 152360, 152108, 152037, 151769, 150809, 149580, 149010, 149334, 150100, 151159, 152791, 154946, 157126, 159014, 160549, 161470, 161528, 161156, 161197, 161860, 162591, 162984, 163198, 163447, 163734, 164161, 164930, 165932, 166823, 167496, 168026, 168257, 167987, 167453, 167005, 166411, 165150, 163339, 161706, 160676, 160102, 159909, 160292, 161175, 162079, 162665, 162951, 162978, 162744, 162411, 162112, 161601, 160599, 159368, 158433, 157836, 157227, 156538, 156016, 155708, 155495, 155478, 155792, 156218, 156528, 156904, 157442, 157622, 157092, 156620, 157324, 159143, 160984, 162249, 163214, 164004, 164226, 163806, 163264, 162947, 162725, 162533, 162503, 162496, 162203, 161759, 161584, 161707, 161960, 162689, 164410, 166866, 169263, 171297, 173054, 174118, 173986, 173304, 173418, 174498, 175277, 174867, 173718, 172523, 171401, 170556, 170549]
54382A70549P97P15J01j31j03m69q62l96N97R14L73j21k38n05r48r13l03K33M81
54363A69771Q33J265J323J150J433K176K692K830L112L526L368K496J715J496
54349A99186J325N89o19j907k998l462k836j425l71n44j644k650k849k303j613
54334A75879j312j403j503j473j513j549j102j20O74P30L86J79J8k96m31j47Q3
54317A67100k03o37p07o45q30r21n41k20o14j302j382q77m67k48J83P32R82J015
54299A60418J082Q04j96j287j526j062p09n20LN91N23O9K32J067J599J471J321
54282A63880J343Q49l53j310j150j76O75P81P7r48j404q13K42Q56R91J069Q55
54265A65464j33j231j036N56K015K131J390R23J062J380J499J345J073R54R82
$$ y = [170549, 171346, 172061, 172162, 172031, 171928, 171459, 170597, 170201, 170798, 171712, 172085, 171964, 171726, 171221, 170273, 169360, 169057, 169290, 169771, 170604, 171869, 173192, 174342, 175775, 177951, 180643, 183473, 186585, 190111, 193479, 195975, 197690, 199186, 200511, 201100, 200481, 198574, 195576, 192114, 189278, 187853, 187482, 186938, 185294, 182644, 179795, 177492, 175879, 174567, 173164, 171661, 170188, 168675, 167126, 166024, 165904, 166578, 167308, 167694, 167873, 167891, 167595, 167164, 167017, 167100, 166897, 166260, 165553, 164908, 164078, 163157, 162616, 162396, 161782, 160480, 159098, 158221, 157754, 157506, 157689, 158421, 159403, 160418, 161500, 162304, 162108, 160821, 159295, 158233, 157524, 157004, 157007, 157598, 158121, 158190, 158422, 159489, 161088, 162559, 163880, 165223, 166072, 165719, 164409, 163259, 163083, 163758, 164539, 164616, 163668, 162264, 161451, 161693, 162549, 163540, 164609, 165464, 165331, 164100, 163064, 163620, 165635, 167766, 169156, 170079, 171141, 172521, 174020, 175365, 176438, 177392, 178374]
54250A78374O59k88j228j314p21l50n16q23j121j583j938j646q89l81k09J62O96
54233A66884P26J79k77l81n91r84r74m34ok1l2K37M66N74R63J524J458N61k39
54214A69633k55l0l42r44j060n28K06P88J047P67l3q34j048n94J00M69J22q51
54196A66613j734j762r59j41on57j272j527q83M55J584J729J079M00K4k14l15
54179A62514j21K24M26O06R76J200P97L2m05m12l98l35P8M60Mj193j988j686p62
54160A60017M1N68R41J089R34N25p9o99r26o34l57n34p25l56J59K4n15m58M15
54141A59430J381J979K293K163J324L66K21P32Q51K85k29l74n77q08m49L89P71
54124A69748M84L01M15J30m94k63J188K500K544J970J869K079J893J412J074O66
$$ y = [178374, 179033, 178745, 177517, 176203, 175482, 175132, 174616, 173793, 172672, 171089, 169151, 167505, 166616, 166235, 166026, 166188, 166884, 167610, 167789, 167512, 167131, 166540, 165556, 164582, 164148, 164142, 164121, 164089, 164326, 164792, 165366, 166329, 167853, 169311, 169872, 169633, 169378, 169348, 169006, 168062, 167002, 166474, 166680, 167468, 168515, 169282, 169249, 168415, 167367, 166773, 166873, 167342, 167464, 166613, 164879, 163117, 162158, 162017, 162011, 161454, 160182, 158655, 157772, 158227, 159811, 161540, 162619, 163019, 163043, 162829, 162514, 162393, 162617, 163043, 163649, 164625, 165825, 166622, 166654, 166249, 165837, 165439, 165104, 165182, 165642, 165646, 164453, 162465, 160779, 160017, 160058, 160626, 161567, 162656, 163590, 164115, 164036, 163337, 162411, 161777, 161420, 160886, 160161, 159805, 159964, 159988, 159473, 159015, 159430, 160811, 162790, 165083, 167246, 168570, 168936, 169157, 169889, 170740, 171025, 170796, 170422, 169845, 169037, 168588, 168977, 169748, 170232, 170533, 170948, 171078, 170584, 170321, 171509, 174009, 176553, 178523, 180392, 182471, 184364, 185776, 186850, 187516]
54108A87516j30q02o59RL42L9n81j253j839k063j723r65k9R12J515J419Q34M14
54090A82956L79M06N19J206K505L750M562N234O005O757P653R046J0489J0872
54076B52339R779P728M870Q21l829p317q684q774q529p722o196m991m962n343
54062B09190m948l902l005k215j049J40N50K31j37l42n22m24K27R29R81O14O72
54045A96990J419K393L215L776L931L719L616L904M128L830L495M031N515P133
54031B51095Q208Q738R029R271R398R103Q159O803N332L448P15k151l540k999
54017C20609k029k214l380m339m649m654m529m209l907l908m120m377m740n082
54003B64472m980m527m427m792m672l562k382k101k216j725q84p36j420k117k356
$$ y = [187516, 187386, 186584, 185925, 185934, 186276, 186315, 185734, 184481, 182642, 180579, 178856, 177891, 177862, 178774, 180289, 181708, 182542, 182956, 183335, 183741, 184260, 185466, 187971, 191721, 196283, 201517, 207522, 214279, 221932, 230978, 241467, 252339, 262118, 269846, 274716, 275537, 271708, 264391, 255707, 246933, 238404, 230682, 224486, 219495, 214533, 209190, 204242, 200340, 197335, 195120, 194071, 194211, 194761, 194992, 194855, 194513, 193991, 193567, 193794, 194723, 195704, 196318, 196990, 198409, 200802, 204017, 207793, 211724, 215443, 219059, 222963, 227091, 230921, 234416, 238447, 243962, 251095, 259303, 268041, 277070, 286341, 295739, 304842, 313001, 319804, 325136, 328584, 329299, 327148, 323608, 320609, 318580, 316366, 312986, 308647, 303998, 299344, 294815, 290606, 286699, 282791, 278671, 274294, 269554, 264472, 259492, 254965, 250538, 245746, 241074, 237512, 235130, 233029, 230813, 229088, 228204, 227468, 226048, 223931, 221575]
53988B21575k294j974j343q05p97j023r49o94o77o74k16L75L25l74r93j202j309
53971B06951j461j382r57l84J56N05M11o2l21N4O86J048J224J432J348P03M2P
53953B10000L67N62P78J414K042J983J600J765K364K576K521L209M738N922O109
53938B47950O122O856P940Q560Q837R592J1181J3316J5769J8480K0803K1201J8170
53925D14777J1688L566l833r182j2380j3609j2971j1047q835o728m246j264J320
53912C47256K704L341M188N369O245O362N681M369K977K294K323K016O95r07j843
53897C93070k373l227m085m135l637l620m287m929n317n915o677o860o226n460
53883C26322n178n335n692o094o200n738n037m627m412l958l421l330l590l590
$$ y = [221575, 219281, 217307, 215964, 215159, 214362, 213339, 212390, 211696, 211019, 210345, 210129, 210504, 210829, 210455, 209462, 208260, 206951, 205490, 204108, 203151, 202767, 202923, 203428, 203839, 203777, 203456, 203510, 204196, 205244, 206468, 207900, 209248, 209951, 209993, 210000, 210367, 210929, 211707, 213121, 215163, 217146, 218746, 220511, 222875, 225451, 227972, 231181, 235919, 241841, 247950, 254072, 260928, 268868, 277428, 286265, 295857, 307038, 320354, 336123, 354603, 375406, 396607, 414777, 426465, 430031, 426198, 417016, 404636, 391027, 378056, 367009, 358174, 351446, 347200, 345936, 347256, 349960, 353301, 357489, 362858, 369103, 375465, 381146, 385515, 388492, 390786, 393109, 395125, 395820, 394913, 393070, 390697, 387470, 383385, 379250, 375613, 371993, 367706, 362777, 357460, 351545, 344868, 338008, 331782, 326322, 321144, 315809, 310117, 304023, 297823, 292085, 287048, 282421, 278009, 274051, 270630, 267300, 263710, 260120]
53869B60120l259l069l083k924k633k592k630k243j664j681k285k604k353k227
53855B24873k569k743k245j478r78p16n47n43n03J9P81Q47np88p42l81m37o39
53837B11206m37k25o85j395j229j09P82O52O5j11L2j01m32l25K51N18J68L9Q78
53818B09542J970J965Q85J92O50J281J000L04L73J243J958K130K256K655L121
53803B31525L620M406N320N764N559N158M895M660M397M348M521M453L787K739
53789B95152J843J418J411J517J449J203R53N49m44j949l071l092k419k083k521
53774B89916l402m291m866m835m244l746l863m309m466m280m066l760l095k212
53760B34481j449q31m06o25j559k255j832r05p83j517j947j576j126j115j061
$$ y = [260120, 256861, 253792, 250709, 247785, 245152, 242560, 239930, 237687, 236023, 234342, 232057, 229453, 227100, 224873, 222304, 219561, 217316, 215838, 214860, 214144, 213597, 213054, 212551, 212570, 213351, 214198, 214193, 213405, 212663, 212282, 211845, 211206, 210769, 210544, 209859, 208464, 207235, 207126, 207908, 208560, 208625, 208514, 208546, 208445, 208013, 207688, 207939, 208457, 208625, 208664, 209542, 211512, 213477, 214362, 214554, 215204, 216485, 217485, 217789, 218162, 219405, 221363, 223493, 225749, 228404, 231525, 235145, 239551, 244871, 250635, 256194, 261352, 266247, 270907, 275304, 279652, 284173, 288626, 292413, 295152, 296995, 298413, 299824, 301341, 302790, 303993, 304946, 305495, 305051, 303102, 300031, 296939, 294520, 292437, 289916, 286514, 282223, 277357, 272522, 268278, 264532, 260669, 256360, 251894, 247614, 243548, 239788, 236693, 234481, 233032, 232201, 231795, 231170, 229611, 227356, 225524, 224619, 223836, 222319, 220372, 218796, 217670, 216555, 215494]
53745B15494n17J74N63P80J071J277J130O37J5m08k57M32R68P96L28L25O94P28
53727B24230L42J05K06L44N63J149J714J496O81L12O90R77O49K71L67N54L79J13
53709B35142K02N28Q25J207J850K625L349L917M020L324K154J409J571K324L224
53694B67671M054M514M273L501K712J965J037K35J43M53J53q74j512j029o9M52
53678B87679M97M13K26r1l22n58j257k306k819k384j662j241p03L65J289J141
53662B78267K05l45K7P57J076P81J64l19l08K11Q72J204R50J89n80o87j6O83O75
53643B83806J85j00r5j04J18R94J990K062J266P39R50J222J212J422J831J543
53627B99041M92Q3J102K277K180J384J409K252K523J703P87P74J602K674L578
$$ y = [215494, 214977, 215151, 215714, 216494, 217565, 218842, 219972, 220609, 220624, 220216, 219959, 220391, 221359, 222155, 222483, 222808, 223502, 224230, 224572, 224677, 224883, 225227, 225790, 226939, 228653, 230149, 230830, 231142, 231832, 232809, 233458, 233729, 234096, 234650, 235029, 235142, 235344, 235872, 236697, 237904, 239754, 242379, 245728, 249645, 253665, 256989, 259143, 260552, 262123, 264447, 267671, 271725, 276239, 280512, 284013, 286725, 288690, 289727, 289962, 290105, 290558, 290711, 289837, 288325, 287296, 287227, 287679, 288176, 288589, 288815, 288724, 288402, 287844, 286587, 284281, 281462, 279078, 277416, 276175, 275472, 275837, 277126, 278267, 278472, 278127, 278154, 278911, 279987, 280768, 280932, 280613, 280305, 280516, 281388, 282592, 283542, 283731, 283151, 282464, 282448, 283131, 283806, 283991, 283891, 283796, 283692, 283810, 284804, 286794, 288856, 290122, 290861, 291811, 293033, 294245, 295667, 297498, 299041, 299533, 299616, 300718, 302995, 305175, 306559, 307968, 310220, 312743, 314446, 315233, 316007, 317609, 320283, 323861]
53612C23861M150M464M786N175N253M819M380M561N201N663N771N907O249O413
53598C96653N984M958L726K733K064J309M1j541k779l422l801m022l618k413j154
53583C94718p97j432k329k778k591k018j542j550k016k546k770k495j697o80q0
53568C67397j74m26k74r3n47j278j269m72J14J3j72k4Q9mJ46O03P20K90K1L50
53548C65010Q39J178J674K210J979R99N96J480K521K468J837J836K401K606K379
53533C92013K436K961L535M054M704N356N905O790Q306R775J0306J0028R765R914
53519D85848J0386J1169J2056J2401J2043J1991J3161J4916J5967J6308J7092
53508F33338J8759K0511K1586K2062K2249K2211K2012K1803K1537K1075K0513
$$ y = [323861, 328011, 332475, 337261, 342436, 347689, 352508, 356888, 361449, 366650, 372313, 378084, 383991, 390240, 396653, 402637, 407595, 411321, 414054, 416118, 417427, 417468, 415927, 413148, 409726, 405925, 401903, 398285, 395872, 394718, 393921, 392489, 390160, 387382, 384791, 382773, 381231, 379681, 377665, 375119, 372349, 369854, 368157, 367477, 367397, 367223, 366797, 366523, 366430, 365883, 364605, 363336, 362864, 362978, 362991, 362819, 362795, 362884, 362880, 363026, 363629, 364349, 364639, 364660, 365010, 365849, 367027, 368701, 370911, 372890, 373889, 374485, 375965, 378486, 380954, 382791, 384627, 387028, 389634, 392013, 394449, 397410, 400945, 404999, 409703, 415059, 420964, 427754, 436060, 445835, 456141, 466169, 475934, 485848, 496234, 507403, 519459, 531860, 543903, 555894, 569055, 583971, 599938, 616246, 633338, 652097, 672608, 694194, 716256, 738505, 760716, 782728, 804531, 826068, 847143, 867656]
53497H67656J9948J9170J8103J7221J6990J7197J7374J7505J7640J7347J6377
53486A062528J5470J5584J6507J7090J6759J6030J5594J5608J5836J5933J5631
53475A238570J4982J4280J3427J1859R494P170N584M371K851J051p34k752n283
53462A314870p869r942j1706j3513j4876j5142j4731j4613j4958j5319j5812j6970
53450A149419j8576j9746k0056j9723j8904j7780j7071j7406j8275j8564j7953
53439I45365j6888j5423j3209j0507q100o269m812l911l829l841k786p22J027
53426H56095J742K132L097M616O230P750R126J0280J1288J2279J3154J3935J5148
53413I66872J7082J8957J9834K0084K0922K2538K3901K4466K4942K6078K7765
$$ y = [867656, 887604, 906774, 924877, 942098, 959088, 976285, 993659, 1011164, 1028804, 1046151, 1062528, 1077998, 1093582, 1110089, 1127179, 1143938, 1159968, 1175562, 1191170, 1207006, 1222939, 1238570, 1253552, 1267832, 1281259, 1293118, 1302612, 1309782, 1315366, 1319737, 1322588, 1323639, 1322905, 1320153, 1314870, 1307001, 1297059, 1285353, 1271840, 1256964, 1241822, 1227091, 1212478, 1197520, 1182201, 1166389, 1149419, 1130843, 1111097, 1091041, 1071318, 1052414, 1034634, 1017563, 1000157, 981882, 963318, 945365, 928477, 913054, 899845, 889338, 881238, 874969, 870157, 866246, 862417, 858576, 855790, 855068, 856095, 857837, 859969, 863066, 867682, 873912, 881662, 890788, 901068, 912356, 924635, 937789, 951724, 966872, 983954, 1002911, 1022745, 1042829, 1063751, 1086289, 1110190, 1134656, 1159598, 1185676, 1213441]
53402A213441K9575L1296L2729L3835L5220L7536M0322M2461M3863M5473M7446
53391A633197M8644M8511M8141M8739M9988N0807N0888N0587M9939M8676M6880
53380B174997M4907M2825M0519L8065L5567L2819K9457K5424K1083J7007J3620
53369B516290J0698P387L082j860o805j1990j8191k5279l2060l7711m2517m6856
53357B314188n0251n2002n2226n1785n1487n1531n1427n0338m7965m5071m2747
53346A767358m1139l9589l7930l6884l6967l7732l8368l8480l7998l6867l5074
53335A350330l2675k9732k6565k3866k1997k0344j8062j5360j3170j1705j0337
53324A126517q964q377q916r744r929r516r116r048r229r371r012p951o732o059
$$ y = [1213441, 1243016, 1274312, 1307041, 1340876, 1376096, 1413632, 1453954, 1496415, 1540278, 1585751, 1633197, 1681841, 1730352, 1778493, 1827232, 1877220, 1928027, 1978915, 2029502, 2079441, 2128117, 2174997, 2219904, 2262729, 2303248, 2341313, 2376880, 2409699, 2439156, 2464580, 2485663, 2502670, 2516290, 2526988, 2534375, 2537457, 2535597, 2528792, 2516802, 2498611, 2473332, 2441272, 2403561, 2361044, 2314188, 2263937, 2211935, 2159709, 2107924, 2056437, 2004906, 1953479, 1903141, 1855176, 1810105, 1767358, 1726219, 1686630, 1648700, 1611816, 1574849, 1537117, 1498749, 1460269, 1422271, 1385404, 1350330, 1317655, 1287923, 1261358, 1237492, 1215495, 1195151, 1177089, 1161729, 1148559, 1136854, 1126517, 1117553, 1109176, 1100260, 1090516, 1080587, 1071071, 1061955, 1052907, 1043678, 1034307, 1025295, 1017344, 1010612, 1004553]
53310A004553n653m475k230K16K100L448M379M716M722N216O461P795Q912J0478
53296A050638J2904J5352J6752J7158J7363J7841J8767K0415K2715K4795K5707
53285A260407K5426K4603K3680K2678K1510K0035J8135J6035J4190J2578J0581
53274A469858P887M962K272l38l096n662p585r026j0544j2512j4980j7695k0067
53261A383474k1641k2850k4611k6977k8877k9580k9516k9292k8815k8021k7547
53250A085747k7803k8055k7391k6088k5103k4574k3815k2584k1442k0875k0747
53239H17270k0749k0776k0800k0685k0207j9135j7520j5967j5137j4767j3752
53228F17775j1585r186p742p209o662n711m862m624m953n642o673q045r493j0530
$$ y = [1004553, 998900, 994425, 992195, 992411, 994511, 997959, 1002338, 1007054, 1011776, 1016992, 1023453, 1031248, 1040160, 1050638, 1063542, 1078894, 1095646, 1112804, 1130167, 1148008, 1166775, 1187190, 1209905, 1234700, 1260407, 1285833, 1310436, 1334116, 1356794, 1378304, 1398339, 1416474, 1432509, 1446699, 1459277, 1469858, 1477745, 1482707, 1484979, 1484641, 1481545, 1475883, 1468298, 1459272, 1448728, 1436216, 1421236, 1403541, 1383474, 1361833, 1338983, 1314372, 1287395, 1258518, 1228938, 1199422, 1170130, 1141315, 1113294, 1085747, 1057944, 1029889, 1002498, 976410, 951307, 926733, 902918, 880334, 858892, 838017, 817270, 796521, 775745, 754945, 734260, 714053, 694918, 677398, 661431, 646294, 631527, 617775, 606190, 597004, 589262, 582053, 575391, 569680, 564818, 560194, 555241, 549599, 542926, 534881, 525388, 514858]
53214E14858j0749j0285r820r901j0221j0039r266q577q365q297q048p749p490
53201C96051p019o351n915n838n753n637n945o514o361n174m129m319n235n678
53187C16183n412m912m184l026j998j895k445k650k289k062k289k531k487k386
53173B75617k315k008j450j020q50p19o02p19r48q57m65l53q14j372j404q95l22
53156B58504j47m91j101j496j358q24k55J35K92J75j63n43r19j416j889j836j083
53139B45585j72L20M79O19O14K32j97j20L95Q21R60R60P71K98n1K71J007J260
53121B54052P56K66N69J479K209K271J806J281J079J209J312J063N17p8o11j075
53105B68105j399j560j676j742j594j410j800k874l700l283j867n52J10L92M06
$$ y = [514858, 504109, 493824, 484004, 474103, 463882, 453843, 444577, 436000, 427635, 419338, 411290, 403541, 396051, 389032, 382681, 376766, 370928, 365175, 359538, 353593, 347079, 340718, 335544, 331415, 327096, 321861, 316183, 310771, 305859, 301675, 298649, 296651, 294756, 292311, 289661, 287372, 285310, 283021, 280490, 278003, 275617, 273302, 271294, 269844, 268824, 267974, 267255, 266653, 265934, 264986, 264129, 263664, 263311, 262497, 261125, 259721, 258826, 258504, 258357, 257866, 256765, 255269, 253911, 253087, 252832, 252967, 253259, 253434, 253271, 252728, 251809, 250393, 248504, 246668, 245585, 245413, 245733, 246212, 246831, 247445, 247677, 247480, 247360, 247755, 248576, 249536, 250496, 251267, 251565, 251514, 251785, 252792, 254052, 254808, 255074, 255643, 257122, 259331, 261602, 263408, 264689, 265768, 266977, 268289, 269352, 269869, 269791, 269180, 268105, 266706, 265146, 263470, 261728, 260134, 258724, 256924, 254050, 250350, 247067, 245200, 244648, 244758, 245150, 245556]
53090B45556j48j103j586j045lO92Q79R90J284J585J619J315Q21L63M8k24n48
53073B50495p94q06p19q16j023r31l78J95J68n50j397j715j453j193j402j776
53057B35905j612q21j31r0l72l45K7L86P06J236J880K132J730R27R4n38p74m66
53039B39874K34Q56R47M18m31j092j224r57p00n51k01M38R01P59K87J23M18P42
53021B40841P31M75L03M02O41O64K77k26l24Q7O36J096J562J870J512M75m41o60
53003B49921n76p17p52j63O39P94L44J31L97M82j4n56m57L17J305K041K200J805
52985B57141J357J289J319Q91K08Q2O39J016O87K87N84J244J366Q08K62J06ql35
52967B68943m81p4M89M96l3k99K38J126J519J133L18n47j250j550j321r91j216
$$ y = [245556, 245408, 244305, 242719, 241674, 241671, 242363, 243242, 244232, 245516, 247101, 248720, 250035, 250856, 251219, 251267, 251043, 250495, 249701, 248895, 248176, 247360, 246337, 245406, 245028, 245223, 245391, 244841, 243444, 241729, 240276, 239083, 237681, 235905, 234293, 233472, 233341, 233251, 232879, 232534, 232561, 232947, 233653, 234889, 236769, 238901, 240631, 241558, 241652, 241114, 240340, 239874, 240108, 240964, 241911, 242329, 241898, 240806, 239582, 238625, 237925, 237374, 237173, 237611, 238512, 239271, 239558, 239681, 240099, 240841, 241572, 242047, 242350, 242752, 243393, 244057, 244334, 244108, 243784, 243871, 244507, 245603, 247165, 249035, 250547, 251022, 250581, 249921, 249345, 248628, 247876, 247713, 248352, 249146, 249490, 249621, 250018, 250500, 250486, 249930, 249473, 249790, 251095, 253136, 255336, 257141, 258498, 259787, 261106, 261997, 262205, 262287, 262926, 263942, 264629, 264916, 265500, 266744, 268110, 268918, 269180, 269286, 269278, 268943, 268462, 268388, 268877, 269373, 269340, 269041, 269279, 270405, 271924, 273057, 273375, 272828, 271578, 270028, 268707, 267716, 266500]
52950B66500j981k483k169j469j188j519j959j916j144J21J197J427Q18K7l78
52935B53884l39k4L99N53Q4p09j081q95q18j134j198n35L30P43Q70J017Q24M5
52917B52016o06m32L2n4k84K99J328J457N41j29M6K1j027k228k244j106J8L49
52899B47997j3o74j272j407q87p2L78J99j79j06N78J279J249M67k88m35k16o3
52881B46535J70P40J217R99L84K64P56J023O01J6j37N5L39Q42J582K055J855J343
52863B60639J284J973L067L995M271L678K417R97k09j186k040k809l524m232m830
52848B63491n134n080m738m105l171k108j221p37p71j299j940k114j750j501j728
52833B26094j706n55J322K520K371J552Q94M76R5j44j51k35o01q93o13J87Q95
$$ y = [266500, 264519, 262036, 259867, 258398, 257210, 255691, 253732, 251816, 250672, 250793, 251990, 253417, 254235, 254262, 253884, 253545, 253521, 253920, 254473, 254557, 253848, 252767, 251872, 251054, 249920, 248722, 248187, 248517, 249260, 250130, 251147, 251971, 252016, 251410, 250978, 251010, 250956, 250672, 250971, 252299, 253756, 254297, 254168, 254214, 254235, 253208, 250980, 248736, 247630, 247648, 247997, 247984, 247310, 246038, 244631, 243744, 243672, 244050, 244249, 244070, 243964, 244542, 245821, 247070, 247537, 247249, 246814, 246598, 246535, 246705, 247445, 248662, 249661, 250045, 250309, 251065, 252088, 252689, 252705, 252568, 252623, 252962, 253804, 255386, 257441, 259296, 260639, 261923, 263896, 266963, 270958, 275229, 278907, 281324, 282321, 282112, 280926, 278886, 276077, 272553, 268321, 263491, 258357, 253277, 248539, 244434, 241263, 239155, 237934, 237197, 236426, 235127, 233187, 231073, 229323, 227822, 226094, 224388, 223833, 225155, 227675, 230046, 231598, 232492, 232968, 233063, 232919, 232768, 232533, 231932, 231039, 230426, 230613, 231508]
52816B31508R64L99k14j75O47J639K192K427K852L438L560K782J308l58j744k512
52800B48713k635k460k283k021j605j321j260r49j96J67n77j605j472l16K64l31
52784B30113p82N2J461K072J681J003L96j18k11L50R55P59j16o88m27K14N85N73
52766B37872M40K82l7n54r85r33m02N9ll09j98M72J171J406J153N70j80p57q06
52747B38261l95N8L70O59Q74Q56Q36J228J853K029J587J077Q06M55j36n46n06
52730B49366k53J66J152K559L310K664J271K85l4j86l97n99r60j603k058j798
52714B52885j168r79j294j346p84k40l65q88r78l41M48O53K31j63J2N36P65M70
52696B47454M0r2J61O84J288J585J209L61k78k93J36P01J277J622J416Q55N91
$$ y = [231508, 232472, 232871, 232657, 232482, 233129, 234768, 236960, 239387, 242239, 245677, 249237, 252019, 253327, 252969, 251225, 248713, 246078, 243618, 241335, 239314, 237709, 236388, 235128, 234179, 233983, 234150, 233573, 231968, 230496, 230180, 230444, 230113, 229331, 229383, 230844, 232916, 234597, 235600, 235996, 235878, 235667, 236017, 236972, 237731, 237615, 236927, 236500, 236714, 237299, 237872, 238312, 238594, 238557, 238003, 237018, 236085, 235683, 235742, 235739, 235430, 235232, 235704, 236875, 238281, 239434, 240004, 239824, 239067, 238261, 237866, 237924, 238294, 238953, 239827, 240683, 241519, 242747, 244600, 246629, 248216, 249293, 250099, 250554, 250418, 249872, 249366, 249113, 249279, 250431, 252990, 256300, 258964, 260235, 260520, 260486, 260300, 259903, 259304, 258344, 256741, 254683, 252885, 251717, 250738, 249444, 248098, 247314, 247074, 246709, 245821, 244843, 244502, 244950, 245603, 245834, 245671, 245683, 246219, 246984, 247454, 247494, 247402, 247563, 248247, 249535, 251120, 252329, 252690, 252412, 252119, 252255, 252956, 254233, 255855, 257271, 258126, 258717]
52679B58717P57O16l11j372j604j061n98o91j081j484j898k236k152j436k76R38
52663B44828J836K173J982J594J281R78N80M07R32K045K955L028K476K007J898
52648B71000J719J026L4p22j176j701k268k177j069L45J025P77J95k54m58k31
52632B66065N81J603K192K261K278K518K848L169L380K968J442p77k659l785m562
52617B79522n122n007m101k981j984q26M76J183Q75J28l48n43o10l28K66M80n1
52600B61029o06l77K95N27K54J27L68N24L21mj67j72j18r1j02K9N32J169J353
52581B64891J021R20J508K110J817Q45K32L36M11k10j172j600j179m69j65l09
52565B68987l92j97r6k97l16K28P13K54q38j370j057q28j155j283o48P1Q4k63
$$ y = [258717, 259474, 260090, 259779, 258407, 256803, 255742, 255144, 254453, 253372, 251888, 249990, 247754, 245602, 244166, 243890, 244828, 246664, 248837, 250819, 252413, 253694, 254672, 255252, 255659, 256591, 258636, 261591, 264619, 267095, 269102, 271000, 272719, 273745, 273779, 273057, 271881, 270180, 267912, 265735, 264666, 265011, 266036, 266813, 267008, 266754, 266296, 266065, 266646, 268249, 270441, 272702, 274980, 277498, 280346, 283515, 286895, 289863, 291305, 290528, 287869, 284084, 279522, 274400, 269393, 265292, 262311, 260327, 259501, 259977, 261160, 262035, 262163, 261815, 261272, 260662, 260334, 260600, 261080, 261029, 260423, 260046, 260341, 260868, 261122, 261249, 261617, 262141, 262462, 262458, 262291, 262119, 262001, 261910, 261808, 261837, 262369, 263538, 264891, 265912, 266832, 268340, 270450, 272267, 273112, 273344, 273680, 274091, 273881, 272709, 271109, 269930, 269461, 269296, 268987, 268595, 268398, 268302, 268005, 267689, 267917, 268630, 268884, 268046, 266676, 265619, 264791, 263636, 262353, 261705, 261776, 261860, 261597]
52547B61597j83K94N87M94Q7o88j565j739r08M9J88k00k43J53M63N74O94O44K20
52528B60518q4L38J113J327Q25K32r8k87k57J98Q06J110J330K049L057L425K850
52511B78452K136K086K574K971K922K445J660O96l39j331k033k181j925j839k187
52496B84107k541k484k202j963j509o31R5ro13p66k41K98M22M29O75J035J180
52479B75282R68M66n3k03J05M91O14O07O76O62M63M10P52J117J137J157J707K577
52461B88935L155L365L454L236K304Q79m24j507k704l889m483m332l913l593l281
52446B77202k846k311j700j095p55p28o17j76K06P6l83p65j078j318r76J66J253
52429B64155J328O42M3m00j043j396o39P35J278P25L70J014J858J928J481J245
$$ y = [261597, 261414, 261708, 262295, 262789, 262876, 262188, 260623, 258884, 257976, 258025, 258213, 258013, 257770, 257923, 258386, 258960, 259654, 260298, 260518, 260434, 260772, 261885, 263212, 264037, 264269, 264171, 263884, 263627, 263825, 264631, 265741, 267071, 269120, 272177, 275602, 278452, 280588, 282674, 285248, 288219, 291141, 293586, 295246, 295942, 295603, 294272, 292239, 290058, 288133, 286294, 284107, 281566, 279082, 276880, 274917, 273408, 272777, 272872, 272863, 272250, 271484, 271243, 271541, 271963, 272392, 273067, 274102, 275282, 276250, 276716, 276663, 276460, 276565, 277056, 277670, 278277, 278953, 279615, 280078, 280488, 281240, 282357, 283494, 284651, 286358, 288935, 292090, 295455, 298909, 302145, 304449, 305328, 304904, 303397, 300693, 296804, 292321, 287989, 284076, 280483, 277202, 274356, 272045, 270345, 269250, 268495, 267767, 267150, 266974, 267180, 267256, 266873, 266108, 265030, 263712, 262736, 262902, 264155, 265483, 266125, 266168, 265768, 264725, 263329, 262690, 263425, 264703, 265428, 265798, 266812, 268670, 270598, 272079, 273324]
52413B73324J220R76O20P41J617K954M218N129N943P254R257J1336J2621J2638
52399C49848J1173Q037L590r92m734p588r570r958q483o560n838n966n331l737
52385C03891k561k310j932q79pJ78M59J249J521N93l65J50J848L228L589L421
52369C12073L301L406L783M158L793K266K44j106j344r47n74n12o70p48n43k78
52353C26302k45k49J62Q53J111O32j14o00p09l88M17J349J850J997K298K642K343
52336C39651J498J198J973L031L550L788M281M945N668O869Q556R742R715R277
52322D13742R667J0767J1413J1136J0590J0367J0309J0099R821R777J0143J0820
52310E38651J1415J1546J1360J1481J2200J3115J3747J4154J4603J5083J5529
$$ y = [273324, 274544, 275520, 276140, 276881, 278498, 281452, 285670, 290799, 296742, 303996, 313253, 324589, 337210, 349848, 361021, 369058, 372648, 371656, 366922, 359334, 349764, 339806, 331323, 324763, 318925, 312959, 307628, 303891, 301330, 299020, 297088, 296209, 296202, 296380, 296839, 298088, 299609, 300202, 299837, 299987, 301835, 305063, 308652, 312073, 315374, 318780, 322563, 326721, 330514, 332780, 333024, 331918, 330574, 329627, 329053, 328541, 327871, 327123, 326580, 326302, 326057, 325808, 325970, 326823, 327934, 328566, 328452, 327852, 327143, 326755, 327172, 328521, 330371, 332368, 334666, 337308, 339651, 341149, 342347, 344320, 347351, 350901, 354689, 358970, 363915, 369583, 376452, 385008, 394750, 404465, 413742, 423409, 434176, 445589, 456725, 467315, 477682, 487991, 498090, 507911, 517688, 527831, 538651, 550066, 561612, 572972, 584453, 596653, 609768, 623515, 637669, 652272, 667355, 682884]
52299F82884J6055J6656J6990J6768J5941J4342J1740Q558N864M235L127J883
52287H15043O85o5o31j531k651l519m061m470m652m423l996l675l287k497j470
52272G74800o99l05k0L76R76J921L112L982M070L697L636M221N209O310P459Q569
52256H27314R500J0318J1338J2752J4310J5365J5375J4446J3299J2398J1317R362
52244I77094O637M005K069Q39K43J52j17j371l382m997n693o092o657o879o426
52229I49425o097o771q069q932q972q514p821p058o657o828p005o450n216l975
52215H51060l130k620k302j925j119J25J224J788K214K990L808L981L419K599
52201H62112J850J285J163J690K580L397M179N258O656Q017Q942R005P877N870
$$ y = [682884, 698939, 715595, 732585, 749353, 765294, 779636, 791376, 799934, 805798, 810033, 813160, 815043, 815728, 815663, 815032, 813501, 810850, 807331, 803270, 798800, 794148, 789725, 785729, 782054, 778767, 776270, 774800, 774101, 773796, 773776, 774152, 775128, 777049, 780161, 784143, 788213, 791910, 795546, 799767, 804976, 811286, 818745, 827314, 836814, 847132, 858470, 871222, 885532, 900897, 916272, 930718, 944017, 956415, 967732, 977094, 983731, 987736, 989805, 990644, 990887, 991039, 990922, 989551, 986169, 981172, 975479, 969387, 962730, 955851, 949425, 943328, 936557, 928488, 919556, 910584, 902070, 894249, 887191, 880534, 873706, 866701, 860251, 855035, 851060, 847930, 845310, 843008, 841083, 839964, 840089, 841313, 843101, 845315, 848305, 852113, 856094, 859513, 862112, 863962, 865247, 866410, 868100, 870680, 874077, 878256, 883514, 890170, 898187, 907129, 916134, 924011, 929881]
52187I29881L970K784J776J45j912l501m337m984n885o806p347p523p612p722
52173H80927p666p172o239n209m359l582k728k049j789j472l93J245K489L006
52159H45009L356L743L637K958K459K366J816M41o61n45L8j14o78l68J091K793
52143H67341M014M644M599L904L045K356J336m52k249k902k446j841j446q07L70
52128H79466K048M410P435J0193J1754J2621J4068J6178J7829J8557J9039J9603
52116A033201J9529J8354J6743J5572J4905J4381J3820J3133J2277J1603J1613
52105A195131J2166J2550J2524J2630J3240J3978J4302J4063J3326J2085J0368
52094A336363Q175N313J746j962n159p925j0746j3432j5171j5645j5370j4853
$$ y = [929881, 933851, 936635, 938411, 938556, 936644, 933143, 928806, 923822, 917937, 911131, 903784, 896261, 888649, 880927, 873261, 866089, 859850, 854641, 850282, 846700, 843972, 841923, 840134, 838662, 838269, 839514, 842003, 845009, 848365, 852108, 855745, 858703, 861162, 863528, 865344, 865785, 865124, 864579, 864617, 864503, 863825, 863457, 864548, 867341, 871355, 875999, 880598, 884502, 887547, 889903, 891239, 890787, 888538, 885636, 883190, 881349, 879903, 879096, 879466, 881514, 885924, 893359, 903552, 915306, 927927, 941995, 958173, 976002, 994559, 1013598, 1033201, 1052730, 1071084, 1087827, 1103399, 1118304, 1132685, 1146505, 1159638, 1171915, 1183518, 1195131, 1207297, 1219847, 1232371, 1245001, 1258241, 1272219, 1286521, 1300584, 1313910, 1325995, 1336363, 1344538, 1349851, 1351597, 1349635, 1344476, 1336551, 1325805, 1312373, 1297202, 1281557, 1266187, 1251334]
52082A251334j4144j3291j2462j1507j0086q370o974o153n646n255m876m059k439
52069A146072n88M98Q04J206J965K430K472L035M704O787Q468R905J1512J2938
52055A212208J3582J3566J3356J2841J1562R534P229M963K842J033m13j806l463
52042A297034n214o632p555q099q356q369q277q154p889p428p034p103p812r023
$$ y = [1251334, 1237190, 1223899, 1211437, 1199930, 1189844, 1181474, 1174500, 1168347, 1162701, 1157446, 1152570, 1148511, 1146072, 1145484, 1145982, 1146786, 1147992, 1149957, 1152387, 1154859, 1157894, 1162598, 1169385, 1177853, 1187758, 1199270, 1212208, 1225790, 1239356, 1252712, 1265553, 1277115, 1286649, 1293878, 1298841, 1301683, 1302716, 1302303, 1300497, 1297034, 1291820, 1285188, 1277633, 1269534, 1261178, 1252809, 1244532, 1236378, 1228489, 1221061, 1214027, 1206924, 1199112, 1190089]
$$ [...]
##END NTUPLES=NMR SPECTRUM
##END=
