
##TITLE=UV1239_M8_1260-1248_50_7241349_E9UsV6gr8g
##JCAMPDX= 6.0         $$ Bruker NMR JCAMP-DX V2.0
##DATA TYPE= NMR SPECTRUM
##DATA CLASS= NTUPLES
##ORIGIN= BRUKER
##OWNER= Administrator
$$ 1.72 TOPSPIN		Version 2.1
$$ 2013-01-19 01:48:56.193 -0500  Administrator@X
$$ Compression mode = diff/dup
##.OBSERVE FREQUENCY= 400.02188249412
##.OBSERVE NUCLEUS= ^1H
##.ACQUISITION MODE= SIMULTANEOUS (DQD)
##.ACQUISITION SCHEME= undefined
##.AVERAGES= 8
##.DIGITISER RES= 22
##SPECTROMETER/DATA SYSTEM= spect
##.PULSE SEQUENCE= zg30
##.SOLVENT NAME= COFFEE_meoh
##.SHIFT REFERENCE= INTERNAL, COFFEE_meoh, 1, 14.98509
##AUDIT TRAIL= $$ (NUMBER, WHEN, WHO, WHERE, PROCESS, VERSION, WHAT)
$$ ##TITLE= Audit trail, TOPSPIN		Version 2.1
$$ ##JCAMPDX= 5.01
$$ ##ORIGIN= Bruker BioSpin GmbH
$$ ##OWNER= Administrator
$$ $$ E:\/data/COFFEE/nmr/UV1239_M8_1260-1248_50_7241349_E9UsV6gr8g/20/pdata/1/auditp.txt
$$ ##AUDIT TRAIL=  $$ (NUMBER, WHEN, WHO, WHERE, PROCESS, VERSION, WHAT)
(   1,<2013-01-19 01:48:48.037 -0500>,<Administrator>,<X>,<go>,<TOPSPIN 2.1>,
      <created by zg
	started at 2013-01-19 01:47:42.416 -0500,
	POWCHK enabled, PULCHK disabled,
       configuration hash MD5:
       86 BA 57 50 F2 9D 5C 9B 26 00 A9 28 5F 66 2E 89
       data hash MD5: 64K
       C8 D4 0D A4 AA 5B E6 3F 39 0D C9 21 79 56 19 18>)
(   2,<2013-01-19 01:48:51.146 -0500>,<Administrator>,<X>,<proc1d>,<TOPSPIN 2.1>,
      <Start of raw data processing
       efp LB = 0 FT_mod = 6 PKNL = 1 PHC0 = 0 PHC1 = 0 SI = 32K 
       data hash MD5: 32K
       19 68 01 7F 53 2C 75 3A 9C 93 88 DF 46 1F 1A B1>)
(   3,<2013-01-19 01:48:51.599 -0500>,<Administrator>,<X>,<proc1d>,<TOPSPIN 2.1>,
      <pk PHC0 = 95.24048 PHC1 = 0 
       data hash MD5: 32K
       57 8F 29 21 6B 29 E8 9E 74 3C C0 4F 9E 60 C0 E4>)
(   4,<2013-01-19 01:48:51.834 -0500>,<Administrator>,<X>,<proc1d>,<TOPSPIN 2.1>,
      <abs ABSG = 1 
       data hash MD5: 32K
       EF DC 03 DB 32 58 44 AF E3 06 22 31 AB EB A0 6D>)
(   5,<2013-01-19 01:48:51.974 -0500>,<Administrator>,<X>,<proc1d>,<TOPSPIN 2.1>,
      <abs ABSG = 2 
       data hash MD5: 32K
       F1 4E 46 35 4A DE FE 9B 0E 5B D4 01 1F B7 05 1E>)
(   6,<2013-01-19 01:48:52.130 -0500>,<Administrator>,<X>,<proc1d>,<TOPSPIN 2.1>,
      <abs ABSG = 3 
       data hash MD5: 32K
       4B 61 4B C6 A9 A8 D3 38 6E 61 9A AC EB F2 B4 A6>)
(   7,<2013-01-19 01:48:52.271 -0500>,<Administrator>,<X>,<proc1d>,<TOPSPIN 2.1>,
      <abs ABSG = 4 
       data hash MD5: 32K
       2B D4 D8 86 B4 AE 54 D9 AA FF 8C F5 02 32 E4 2E>)
(   8,<2013-01-19 01:48:52.412 -0500>,<Administrator>,<X>,<proc1d>,<TOPSPIN 2.1>,
      <abs ABSG = 5 
       data hash MD5: 32K
       B5 E3 EC 44 17 45 6B F8 07 96 3D 6F DA CE 94 90>)
$$ ##END=
$$ 
$$ $$ hash MD5
$$ $$ 6B F2 2A 9A 19 25 0B 09 19 35 01 8E 0A 29 C6 29
##$RELAX= 
##$RELAX= 
##$RELAX= 
##$RELAX= 
##$RELAX= 
##$RELAX= 
##$RELAX= 
$$ Bruker specific parameters
$$ --------------------------
##$DU= <E:\>
##$EXPNO= 20
$$ [...]
150 150 150 150 150 150 150 150
##$TP07= 0
##$TPNAME0= <>
##$TPNAME1= <>
##$TPNAME2= <>
##$TPNAME3= <>
##$TPNAME4= <>
##$TPNAME5= <>
##$TPNAME6= <>
##$TPNAME7= <>
##$TPOAL= (0..7)
0.5 0.5 0.5 0.5 0.5 0.5 0.5 0.5
##$TPOFFS= (0..7)
0 0 0 0 0 0 0 0
##$TUNHIN= 0
##$TUNHOUT= 0
##$TUNXOUT= 0
##$USERA1= <user>
##$USERA2= <user>
##$USERA3= <user>
##$USERA4= <user>
##$USERA5= <user>
##$V9= 5
##$VALIST= <valist>
##$VCLIST= <CCCCCCCCCCCCCCC>
##$VD= 0
##$VDLIST= <DDDDDDDDDDDDDDD>
##$VPLIST= <PPPPPPPPPPPPPPP>
##$VTLIST= <TTTTTTTTTTTTTTT>
##$WBST= 1024
##$WBSW= 4
##$XGAIN= (0..3)
0 0 0 0
##$XL= 0
##$YL= 0
##$YMAX_a= 667439
##$YMIN_a= -565569
##$ZGOPTNS= <>
##$ZL1= 120
##$ZL2= 120
##$ZL3= 120
##$ZL4= 120
##$ABSF1= 14.98509
##$ABSF2= -5.573092
##$ABSG= 5
##$ABSL= 3
##$ALPHA= 0
##$AQORDER= 0
##$ASSFAC= 0
##$ASSFACI= 0
##$ASSFACX= 0
##$ASSWID= 0
##$AUNMP= <proc_prof1d_extract_pilot.lims>
##$AXLEFT= 0
##$AXNAME= <>
##$AXNUC= <1H>
##$AXRIGHT= 0
##$AXTYPE= 0
##$AXUNIT= <>
##$AZFE= 0.1
##$AZFW= 0.1
##$BCFW= 0
##$BC_mod= 0
##$BYTORDP= 0
##$COROFFS= 0
##$CY= 15
##$DATMOD= 1
##$DC= 0
##$DFILT= <>
##$DTYPP= 0
##$F1P= 0
##$F2P= 0
##$FCOR= 0.5
##$FTSIZE= 32768
##$FT_mod= 6
##$GAMMA= 0
##$GB= 0
##$INTBC= 1
##$INTSCL= 1
##$ISEN= 128
##$LB= 0
##$LEV0= 0
##$LPBIN= 0
##$MAXI= 10000
##$MC2= 0
##$MEAN= 0
##$ME_mod= 0
##$MI= 0
##$NCOEF= 0
##$NC_proc= -8
##$NLEV= 6
##$NOISF1= 0
##$NOISF2= 0
##$NSP= 0
##$NTH_PI= 0
##$NZP= 0
##$OFFSET= 14.98509
##$PC= 1
##$PHC0= 95.24048
##$PHC1= 0
##$PH_mod= 1
##$PKNL= yes
##$PPARMOD= 0
##$PPDIAG= 0
##$PPIPTYP= 0
##$PPMPNUM= 2147483647
##$PPRESOL= 1
##$PSCAL= 4
##$PSIGN= 0
##$PYNMP= <proc.py>
##$REVERSE= no
##$SF= 400.02
##$SI= 32768
##$SIGF1= 0
##$SIGF2= 0
##$SINO= 400
##$SIOLD= 32768
##$SPECTYP= <>
##$SREGLST= <1H.CDCl3>
##$SSB= 0
##$STSI= 32768
##$STSR= 0
##$SW_p= 8223.68421052631
##$SYMM= 0
##$S_DEV= 0
##$TDeff= 65536
##$TDoff= 0
##$TI= <>
##$TILT= no
##$TM1= 0
##$TM2= 0
##$TOPLEV= 0
##$USERP1= <user>
##$USERP2= <user>
##$USERP3= <user>
##$USERP4= <user>
##$USERP5= <user>
##$WDW= 1
##$XDIM= 32768
##$YMAX_p= 467741401
##$YMIN_p= -696469
##$CURPLOT= <Network HP LaserJet P1505>
##$CURPRIN= <$Network HP LaserJet P1505>
##$DFORMAT= <normdp>
##$LAYOUT= <+/1D_H.xwp>
##$LFORMAT= <normlp>
##$PFORMAT= <normpl>
##$SURQMSG= 1
$$ End of Bruker specific parameters
$$ ---------------------------------
##NTUPLES= NMR SPECTRUM
##VAR_NAME=  FREQUENCY,     SPECTRUM/REAL,   SPECTRUM/IMAG
##SYMBOL=    X,             R,               I
##VAR_TYPE=  INDEPENDENT,   DEPENDENT,       DEPENDENT
##VAR_FORM=  AFFN,          ASDF,            ASDF
##VAR_DIM=   32768,         32768,           32768
##UNITS=     HZ,            ARBITRARY UNITS, ARBITRARY UNITS
##FACTOR=    0.250966925370066, 1,           1
##FIRST=     8223.43324360094, 405,          -133597
##LAST=      0,             99940,           112478
##MIN=       0,             -696469,         0
##MAX=       8223.43324360094, 467741401,    0
$$ Real data points
##PAGE= N=1
##DATA TABLE= (X++(R..R)), XYDATA
$$ [...]
$$ plain form
19541 60484 126952 -135548 -33070 -50085 -165239 -281747 160 -88961 36633 -237058 68406
19529 -93388 -254939 152216 -284715 116518 -176574 101531 -274125 -539127 -52251 -286546
19519 -286546 -70837 -231405 -7445 -108822 152430 89961 -278339 -377993 -230964 -263022 199936
19507 170388 368793 302864 -306108 16688 146095 -239291 -176138 -177282 -144826 -42563 237747
19495 -353797 39306 -334801 -34898 -54187 -35160 -179364 23254 22321 31997 -125069 150458
19483 -89994 177002 -40603 -77968 -253669 -225370 -216820 -82122 -153596 127555 -112966 -141638
19472 -141638 -5291 -75747 -91686 -40197 125185 73330 92459 150350 -252096 -275702 -203432
19461 -203432 94931 -144127 -19653 -408936 269132 52152 -162640 126747 -283231 -218112
$$ packed form
19541F0484O6468a35548c3070j7015j15154j16508A60h8961C6633b37058F8406
19529i3388j61551A52216b84715A16518a76574A01531b74125k65002e2251k34295
19519b86546g0837j60568g445j01377A52430o2469b78339r9654J47029l2058A99936
19507A70388J98405o5929c06108A6688J29407b39291O3153j144L2456d2563B37747
19495c53797C9306c34801c4898j9289J9027j44204B3254r33R676a25069A50458
19483h9994A77002d0603l7365j75701K8299Q550h2122p1474A27555a12966k8672
19472a41638e291p0456j5939d0197A25185n1855J9129N7891b52096k3606P2270
19461b03432I4931a44127a9653l89283B69132E2152a62640A26747b83231O5119
$$ plain form
19451 -218112 -295874 96414 -155146 -70923 -166590 68579 52089 5247 -3377 219291 -82703
19439 -368007 -319768 -405634 -154113 162434 -235915 118745 -39048 -150542 -72053 -13994
19428 69093 -85467 -32567 -52484 -186606 196690 -107780 -305810 -153773 33290 -250827
19417 -31682 133129 265722 -404947 117466 256511 24576 -57963 -367628 -224609 3103
19406 -382567 -137391 -43858 -46282 -137588 109240 98276 -174338 94769 -35947 -310518 -268221
19395 -268221 -48550 -64553 -129406 76568 -171776 -59539 -297885 -203794 214619 -120112 -346612
19384 -346612 21229 325123 164371 -77105 -154068 -327931 -92137 -214420 -49685 251255
19373 -70930 -236577 -143923 -14763 -27552 -55390 -135385 -139638 66435 24607 -157435 75488
$$ packed form
19451b18112p7762I6414a55146g0923r5667F8579j6490E247c377B19291h2703
19439c68007M8239q5866a54113A62434b35915A18745c9048j11494g2053a3994
19428F9093h5467c2567j9917j34122A96690a07780j98030J52037C3290b50827
19417c1682A33129J32593d04947A17466J39045B4576e7963l09665J43019C103
19406c82567a37391d3858k424r1306A09240j0964a74338I4769c5947k74571M2297
19395b68221d8550j6003o4853G6568a71776e9539k38346R4091B14619a20112k26500
19384c46612B1229L03894j60752g7105p6963j73863i2137j22283d9685B51255
19373g0930j65647R2654a4763j2789k7838p9995m253F6435B4607a57435G5488
$$ plain form
19361 75216 -6664 -56219 122327 -156283 116414 28128 -90532 -183721 82890 115289 -122412
19349 -6401 8957 73317 316570 308890 22212 238823 -229859 48327 141102 -295280 -286191 -212013
19337 -212013 329151 -134273 -184166 -165246 -186556 -212181 -146782 -78822 94760 258629 -134172
19325 -75821 3301 -388712 -233267 -148113 -220932 -108652 230008 -143137 -282265 -165914
19315 -165914 99738 -290242 45230 -157354 106789 184862 -363534 10371 13371 -268328 40747
19303 -136175 -12330 71313 89515 -118392 -34174 190400 51854 -329271 -210550 -309218 146096
19291 145413 -10174 23528 -195176 -292034 214732 -114506 -65894 -139791 -200799 30585 -153723
19279 52600 -199228 -146401 -102908 -108243 -223994 280227 -41843 -63296 30049 -37126 -128514
$$ packed form
19361G5216f664m9555A22327a56283A16414B8128i0532r3189H2890L2399a22412
19349f401H957O4360K43253p680B2212K16611b29859D8327R2775b95280R089P4178
19337b12013C29151a34273m9893J8920k1310k5625O5399O7960I4760J63869a34172
19325g5821C301c88712J55445Q5154p2819a08652B30008a43137j39128J16351
19315a65914I9738b90242D5230a57354A06789P8073c63534A0371L000b68328D0747
19303a36175a2330G1313J8202a18392c4174A90400E1854c29271J18721r8668A46096
19291A45413a0174B3528a95176r6858B14732a14506M8612p3897o1008C0585a53723
19279E2600a99228N2827M3493n335j15751B80227d1843k1453C0049c7126r1388
$$ plain form
19268 -128514 229798 34701 139947 -974 -348846 164826 -323689 122418 -37329 -14109 -70206
19257 -70206 -153881 -6482 149707 106548 46025 -174622 -228695 -145679 -400782 -70653 -88351
19246 -88351 -126073 154757 -224050 -313749 14492 223504 29557 73983 275341 13279 -47012
19234 75074 -207638 175452 -148964 -282368 -79346 -361007 40147 -51984 14493 -264404
19223 -39859 171873 -134929 -322064 -160549 259020 -54287 -277994 -194338 -240643 20042
19212 -199778 34554 -326611 -283218 -82254 149315 -100817 -58756 42219 -96468 -320447 -76180
19200 12493 148937 -119399 -282463 131665 -71669 260595 171374 374828 195588 528594
19190 528594 -192837 -40276 -60135 137208 -88273 276696 -124537 -192607 -90769 -147927 124301
$$ packed form
19268a28514B29798C4701J05246i74l47872A64826c23689A22418c7329a4109n6097
19257g0206q3675f482A49707m3159D6025a74622n4073Q3016k55103g0653j7698
19246h8351l7722A54757b24050q9699A4492K09012B9557M4426K01358A3279d7012
19234G5074b07638A75452a48964j33404g9346k81661D0147e1984A4493b64404
19223c9859A71873a34929j87135a60549B59020e4287k23707Q3656m6305B0042
19212a99778C4554c26611M3393h2254A49315a00817M2061D2219i6468k23979g6180
19200A2493J36444a19399j63064A31665g1669B60595q9221K03454j79240L33006
19190E28594a92837d0276j9859A37208h8273B76696a24537o8070i0769n7158A24301
$$ plain form
19178 -189954 -253330 -482527 51101 -69896 -42192 106279 28034 107670 166912 -22517 -411707
19167 -411707 -135967 42719 -5987 30203 284467 15195 47982 -23241 -43815 -31380 -118298
19156 -118298 1774 53245 277469 -72790 60345 -14405 173320 75649 -299453 -132317 71838
19144 -213964 -118748 -47470 -282612 137882 105775 -377425 -137019 92512 -219194 -408868
19134 -408868 -63771 -37338 -97053 -157613 -83712 -37743 -287720 8482 -109791 62547 -144800
19122 -174143 -361305 324769 -36699 -152682 21028 42107 -200662 -136189 99619 -154353
19111 -193927 47843 -312558 157869 68679 -113576 34805 -55117 -106314 -256743 203962
19100 -18614 30286 81336 127119 -63140 -90881 -420718 -114211 -158969 104777 -59376 -96133
$$ packed form
19178a89954o3376k29197E1101f9896K7704A06279B8034P9636N9242b2517l89190
19167d11707a35967D2719e987C0203K54264A5195L2787b3241k0574J2435q6918
19156a18298A774N1471K24224g2790F0345a4405A73320G5649b99453a32317G1838
19144b13964R5216d7470k35142A37882l2107c77425a37019I2512b19194j89674
19134d08868f3771K6433n9715o0560P3901c7743k49977H482a09791F2547a44800
19122a74143j87162C24769c6699j15983B1028K1079b00662O4473I9619a54353
19111a93927D7843c12558A57869F8679a13576C4805e5117n1197j50429B03962
19100a8614C0286N1050M5783f3140k7741l29837a14211m4758A04777e9376l6757
$$ plain form
19089 -96133 19113 -241865 280344 -65278 82712 343296 265165 -294899 -54313 13125 -13090
19077 -335505 163709 -51191 -246768 -38744 -32540 -23991 -123402 118104 363055 -108770 122986
19065 -51785 -94326 -130993 1888 -35483 -226113 -378636 -125766 -79456 -84646 201520 -73757
19053 236569 100222 -3929 -278882 -8111 11498 -160905 -98076 -75101 165182 101431 -5581
19041 51360 -105242 -138729 129163 -3639 227751 25050 -54769 -105855 490692 -359902 -68076
19029 6300 321130 78795 -178310 125735 -76792 -37611 23663 -48936 31791 -127324 -193354
19018 -193354 51693 -212360 -85401 -192238 143095 -181534 -125464 225678 127664 -152689
19007 113425 -100491 -302591 117152 -73706 -92111 -409864 -237540 36028 -191319 20514
$$ packed form
19089i6133A9113b41865B80344f5278H2712K60584p8131b94899e4313A3125a3090
19077c35505A63709e1191j95577c8744O204Q549r9411A18104K44951a08770A22986
19065e1785m2541l6667A888c5483j90630j52523a25766M6310n190B01520g3757
19053B36569A00222c929k74953h111A1498a60905O2829K2975A65182o3751e581
19041E1360a05242l3487A29163c639B27751B5050e4769n1086D90692c59902f8076
19029F300L14830G8795a78310A25735g6792c7611B3663d8936C1791a27324o6030
19018a93354E1693b12360h5401j06837A43095a81534N6070B25678r8014a52689
19007A13425a00491k02100A17152g3706j8405l17753J72324C6028a91319B0514
$$ plain form
18996 242936 -169526 154884 101074 90095 -130045 -226755 193540 123851 296959 -255913
18985 140201 122466 -444742 120489 185580 -33831 -52072 182726 -255672 -270103 -119684
18974 -20626 -75343 34620 64244 -26646 4600 -74402 -132743 -82205 170301 -84182 -249541
18963 -249541 37777 -127094 87610 -114087 -43699 -174788 -475464 49823 43276 205559 -23031
18951 -67589 134866 139183 -55134 -155673 273365 -43783 -174610 86510 135169 219037 -12680
18939 157000 -1315 -108463 342936 155426 257618 10381 116920 230673 -85458 -143720
18929 -143720 191928 175091 15203 46715 -209434 43803 255580 -383224 -317499 348853
18918 100860 -183257 63549 -41974 417955 -590551 -19294 307225 -83412 106382 115815 208771
$$ packed form
18996B42936a69526A54884n3810j0979a30045r6710A93540o9689J73108b55913
18985A40201j7735d44742A20489O5091c3831j8241A82726b55672j4431a19684
18974b0626n4717C4620K9624b6646D600g4402n8341N0538A70301h4182j65359
18963b49541C7777a27094H7610a14087d3699j31089l00676D9823o547J62283b3031
18951f7589A34866M317e5134j00539B73365d3783j30827H6510M8659Q3868a2680
18939A57000a315j07148C42936A55426J02192A0381J06539J13753h5458n8262
18929a43720A91928j6837A5203L1512b09434D3803K11777c83224O5725C48853
18918A00860a83257F3549d1974D17955e90551a9294C07225h3412A06382R433R2956
$$ plain form
18907 208771 -256406 -43605 18395 -409890 -76673 -67440 101341 46617 -190113 -111235 17876
18895 371451 -97514 53817 -20482 -23548 -19371 152175 226728 89957 -262076 -39113 -253540
18884 -253540 120055 -150830 -170858 -389447 -157395 -61633 186357 -186519 -37746 -221435
18874 -221435 -91292 435609 81199 -4107 -100280 -35188 210668 -44946 180331 264720 40348
18862 -175604 -487139 -46272 197737 -211193 -318266 -209759 -463913 -354345 -45863 -140637
18852 -140637 -135873 -9245 -52884 -126682 -59372 -358 96520 -152564 109058 119068 -18068 -36845
18840 -36845 7384 -68690 -24810 -370391 -167520 -142435 288952 -177064 -190879 -114838 65088
18828 209398 -103817 132320 141977 147114 110177 223756 291329 -219382 209677 -280538 -287105
$$ packed form
18907B08771b56406d3605A8395d09890g6673R233A01341D6617a90113P8878A7876
18895C71451i7514E3817b0482l066M177A52175P4553H9957b62076c9113k14427
18884b53540A20055a50830k0028k18589a57395f1633A86357a86519c7746j83689
18874b21435i1292D35609H1199d107r6173c5188B10668d4946A80331Q4389D0348
18862a75604l11535d6272A97737b11193j07073J08507k54154J09568d5863r4774
18852a40637M764i245m3639p3798e9372c58I6520a52564A09058J0010a8068j8777
18840c6845G384f8690b4810l45581a67520K5085B88952a77064j3815P6041F5088
18828B09398a03817A32320R657N137l6937J13579O7573b19382B09677b80538o567
$$ plain form
18817 -287105 -165727 251243 93900 -2199 2840 -227576 -110842 291835 230310 -85581 -85696
18806 -85696 148157 -160034 111185 356645 -142005 88644 -187135 143009 -556 63581 23547
18794 -67902 169658 -148249 -187960 -238954 46916 -121906 44487 -163811 -45578 -33416 96740
18782 9957 -145906 141730 -419619 410 24517 -120231 -93669 -20214 -81827 149408 -30907
18770 21034 -66047 -276060 55689 -68839 -79116 -113948 239966 74025 -45260 -320007 -199112
18759 -199112 36206 112511 142417 -213131 52100 43934 107009 -85237 -150133 174203 151358
18748 151358 -161389 -126745 149127 -404807 87058 -278941 -668101 -217869 -169290 190035
18737 -407568 -284219 229357 -291560 136802 86047 -244637 -152210 85481 170205 -98555
$$ packed form
18817b87105J21378B51243I3900b199B840b27576a10842B91835o1525h5581j15
18806h5696A48157a60034A11185K45460a42005H8644a87135A43009e56F3581B3547
18794f7902A69658a48249l9711n0994D6916a21906D4487a63811d5578J2162I6740
18782I957a45906A41730d19619D10K4107a20231K6562b0214o1613A49408c0907
18770B1034f6047k10013E5689f8839j0277l4832B39966G4025d5260k74747J20895
18759a99112C6206P6305K9906b13131E2100q166O3075h5237o4896A74203k2845
18748A51358a61389L4644A49127d04807H7058b78941l89160b17869M8579A90035
18737d07568J23349B29357b91560A36802n0755b44637R2427H5481Q4724i8555
$$ plain form
18726 -164620 -307257 -115395 11178 21838 -101995 -166625 244515 -203634 188398 45124
18715 -75196 175206 -20925 -30640 -293253 23923 -214492 -285240 -228340 -182743 222715 108754
18703 -60302 88237 11266 10729 -218733 -91715 3421 103482 74631 -644 -142599 -250249 -201757
18691 -201757 215521 -132233 9541 165986 -90509 -28654 -282169 49701 -300710 -80227 -58455
18680 -58455 -107314 -140620 172286 21034 78170 -79317 122646 -88397 -45712 -339311 9791
18668 -59245 118981 -192880 3639 25069 365754 29277 323870 40434 -166337 -123899 -273675
18657 -273675 -32139 -116157 -165860 -245636 70016 -50752 -161995 50394 -88197 -244537 91084
18645 -50571 76907 12877 -248938 -57739 91603 -142360 16458 39335 -337049 -170021 -210373
$$ packed form
18726a64620j42637a15395A1178J0660a01995o4630B44515b03634A88398D5124
18715g5196A75206b0925r715k62613B3923b14492p0748N6900M5597B22715A08754
18703f0302H8237A1266n37b18733i1715C421J00061k8851f44j41955j07650M8492
18691b01757B15521a32233I541J56445i0509b8654k53515D9701c00710h0227K1772
18680e8455m8859l3306A72286B1034N7136g9317A22646h8397M2685k93599I791
18668e9245A18981a92880C639K1430L40685B9277K94593D0434a66337M2438j49776
18657b73675c2139q4018m9703p9776G0016e0752j11243E0394h8197j56340I1084
18645e0571G6907A2877b48938e7739I1603a42360A6458K2877c37049J67028m0352
$$ plain form
18634 -210373 -246576 -26267 12920 124318 -68471 -146046 357237 -69160 -212328 328993 54947
18622 -75907 -217311 136593 -49146 -257588 16486 -195623 239048 105502 147982 180814
18612 180814 -23056 103376 102083 32813 -234723 -58649 189275 -219797 -309593 -243144 152699
18600 113691 16060 -176745 -132818 181245 40067 -265139 -55774 -372429 -201565 -124583
18590 -124583 -83887 -198768 -320018 119983 31288 273033 144249 -35639 -404819 -149774
18579 372323 185381 205503 -18408 -61487 174146 -22557 -122011 -23869 -105610 -35750 -132765
18568 -132765 -215001 -50011 105436 -87116 101626 52752 -183647 -30797 -3536 53147 34761
18557 34761 -292822 -125038 117504 212401 -248745 -298074 -420764 1175 -77507 168419 -87682
$$ packed form
18634b10373l6203b6267A2920J11398f8471p7575C57237f9160j43168C28993E4947
18622g5907j41404A36593d9146k08442A6486a95623B39048A05502M2480L2832
18612A80814b3056A03376j293C2813b34723e8649A89275b19797q9796O6449A52699
18600A13691A6060a76745M3927A81245D0067b65139e5774l16655J70864P6982
18590a24583M0696j14881j21250A19983C1288K41745j28784c5639l69180a49774
18579C72323A85381K0122a8408m3079A74146b2557r9454b3869q1741c5750r7015
18568a32765q2236e0011A05436h7116A01626m8874a83647c0797c536E3147j8386
18557C4761b92822a25038A17504R4897b48745m9329j22690A175g7507A68419h7682
$$ plain form
18545 -125267 -240188 70867 -53302 -253053 -57736 -379497 27816 -36353 89167 99245 -79871
18533 -322453 75122 133631 -32847 102386 109987 -109671 45899 -122462 -174625 -190227 -178
18521 148502 -187241 84674 262565 -89321 -44831 -262079 -208646 -109638 -16083 -21270 -448
18509 -326389 -432349 301352 52872 280323 -285371 -102034 -468357 -25402 58974 -150504
18498 70252 -321438 -161969 -153027 28843 -5170 37068 331164 -206235 -162615 361239 -272858
18486 236867 -151136 419057 26073 -8140 140976 -47103 -284761 52848 71068 -169627 48996
18474 -331378 108249 -58981 -433535 -105570 26800 -199201 -294353 74150 -111895 -160610
18464 -160610 -177886 -83095 -196899 -285394 -89435 -238301 -221228 -178307 -220433 -153502 -356768
$$ packed form
18545a25267j14921G0867e3302j99751e7736l21761B7816c6353H9167J0078g9871
18533c22453G5122N8509c2847A02386P601a09671D5899a22462n2163j5602a78
18521A48502a87241H4674J77891h9321M4490k17248N3433R9008a6083n187d48
18509c26389j05960C01352E2872K27451b85371a02034l66323b5402E8974a50504
18498G0252c21438J59469Q942B8843e170C7068K94096b06235M3620C61239b72858
18486B36867a51136D19057B6073h140A40976d7103k37658E2848J8220a69627D8996
18474c31378A08249e8981l74554a05570B6800a99201r5152G4150a11895m8715
18464a60610j7276h3095j13804q8495h9435j48866J7073M2921m2126O6931k03266
$$ plain form
18453 -356768 -1121 -150163 133146 185580 162054 199472 -274028 -43920 -32993 -97220 149270
18441 -164886 -61617 -305599 -53670 206955 227359 33077 -34710 5052 -54371 -177738 122629
18429 -188484 221305 -152920 46040 133019 27465 -190564 -103470 -224683 -182346 -56618 -95057
18418 -95057 228057 51781 -40991 -225191 -108682 162014 30766 -11129 -34731 -108058 -73032
18407 -73032 314830 94625 257117 -96031 143366 36610 61056 52259 33212 195228 -179808
18395 -62918 -197618 -4666 -129885 297166 -260653 194973 209954 276314 89762 -61944 26448
18383 -12665 -87085 98246 228157 -88003 -83940 220180 153594 -57862 140023 -141207 -84525
18372 -84525 39689 53260 40027 -143764 60977 107375 -132689 -189100 -159934 77948 -43427
$$ packed form
18453c56768a121j49042A33146N2434k3526L7418b74028d3920J0927o4227A49270
18441a64886f1617k43982e3670B06955K0404C3077c4710E052e4371j23367A22629
18429a88484B21305a52920D6040Q6979B7465a90564Q7094j21213M2337e6618l8439
18418i5057B28057E1781d0991j84200a08682A62014C0766a1129k3602p3327L5026
18407g3032C14830I4625J62492i6031A43366C6610K4446q797j9047J62016a79808
18395f2918j34700d666j25219B97166b60653A94973J4981O6360H9762f1944B6448
18383a2665p4420I8246J29911h8003M063B20180o6586e7862A40023a41207N6682
18372h4525C9689J3571j3233a43764F0977M6398a32689n6411K9166G7948d3427
$$ plain form
18360 57501 -86215 28356 -335820 2046 144121 34244 -161966 187707 64898 -7121 430774
18348 -204879 -198124 81650 -43082 116722 -28128 46078 48858 -71381 -52700 -296391 47027
18336 66157 54909 -212356 210027 -221383 -96691 55015 48094 -25781 -199683 115504 -123
18324 -402582 -53749 -182807 -225032 -277932 -27021 -176842 -108488 3541 -184784 -617 -210157
18313 -210157 -60177 -60740 -30884 -257909 -233368 -135667 -140887 -213789 -130878 184701 -157685
18301 -61226 -19489 -140425 85946 108647 295861 -78272 -179611 23343 -215127 -263204 194499
18289 -153030 40740 -192007 -199493 160129 72343 -65037 -8748 -317454 -36835 -359254 73803
18277 176859 75830 -263815 -144273 -47303 195771 66914 81094 -103321 -117801 12221 225019
$$ packed form
18360E7501h6215B8356c35820B046J42075C4244a61966A87707F4898g121D30774
18348b04879O755H1650d3082A16722b8128D6078K780g1381J8681k43691D7027
18336F6157j1248b12356B10027b21383i6691E5015o921b5781j73902A15504a23
18324d02582e3749j29058m2225n2900b7021j49821O8354C541a84784f17k09540
18313b10157f0177n63K9856k27025K4541R7701n220p2902Q2911A84701a57685
18301f1226a9489j20936H5946K2701J87214g8272j01339B3343b15127m8077A94499
18289a53030D0740a92007p486A60129G2343f5037h748l08706c6835l22419G3803
18277A76859G5830b63815J19542d7303A95771F6914J4180a03321j4480A2221K12798
$$ plain form
18266 225019 49003 173358 -30729 -93219 -326080 -131370 114985 -53754 -28357 -45523 -101679
18255 -101679 90404 -146206 209438 -250488 -213996 42918 142257 29894 307542 -103878
18244 -84351 -48105 186623 -83277 -360132 -129328 462511 31158 65865 -194952 385305
18233 41778 28866 31670 -57137 -143858 65271 102046 123242 -188168 240976 210064 -69505
18221 -314372 -118818 63786 -18122 -275366 -119291 -330459 -215999 -246355 -126157 36196
18210 74881 -178680 -223523 -160427 -108548 -169817 241482 -69394 166729 105443 -126874 -73291
18199 -73291 48381 261336 -56376 261556 -3182 145670 185138 194190 -160622 35071 -180604
18187 -332913 53436 -128638 -266733 256265 -114643 -314519 -79939 399436 -59617 25074
$$ packed form
18266B25019D9003J24355c0729o2490k32861a31370A14985e3754K5397j7166n6156
18255a01679I0404a46206B09438b50488L6492D2918R9339B9894K77648a03878
18244h4351L6246A86623h3277k76855a29328D62511C1158L4707a94952C85305
18233D1778j2912K804e7137q6721F5271L6775K1196a88168B40976l0912f9505
18221c14372a18818F3786a8122k57244a19291k11168J14460l0356J20198C6196
18210G4881a78680m4843O3096N1879o1269B41482f9394A66729o1286a26874N3583
18199g3291D8381K12955e6376B61556c182A45670L9468R052a60622C5071a80604
18187c32913E3436a28638j38095B56265a14643j99876g9939C99436e9617B5074
$$ plain form
18176 -38291 -254 138963 -134217 -221034 -155158 325094 25747 51943 -26820 24703 85974
18165 85974 -74894 137546 -181438 2961 -101614 55616 -26785 175060 114562 -170415 197508
18153 503452 -266094 -178411 -103703 239019 -303274 -1994 220527 -61833 -171782 166092
18142 98466 -171694 -312081 -28035 136226 -140251 -75434 41730 -64458 -262486 -209953 257951
18130 -350283 -49304 -121135 -30485 -446657 57021 -25829 -330882 23244 -18357 -1305 -81012
18119 -81012 -280479 62564 -177474 -83581 -245800 -249832 145234 13152 372739 18967 28689
18108 28689 101482 19402 119910 127560 24343 -150301 104210 86016 28816 -177280 28151
18096 -168846 -19262 61648 -111218 4428 -263052 3470 354184 -162216 -93058 292118 -224708
$$ packed form
18176c8291b54A38963a34217q6817O5876C25094B5747K6196b6820B4703O1271
18165H5974g4894A37546a81438B961a01614E5616b6785A75060o0498a70415A97508
18153E03452b66094Q7683P4708B39019c03274a994B20527f1833j09949A66092
18142I8466a71694j40387b8035A36226a40251O4817D1730f4458j98028N2533B57951
18130c50283d9304p1831c0485m16172E7021b5829l05053B3244a8357a305p9707
18119h1012j99467F2564a77474h3581j62219m032A45234A3152L59587A8967R722
18108B8689P2793A9402J00508P650B4343a50301A04210j8194B8816a77280B8151
18096a68846a9262F1648a11218D428b63052C470L50714a62216O9158B92118b24708
$$ plain form
18084 56592 -102792 43235 42310 78874 -132165 -6118 -68575 -16194 292256 -56195 -238544
18073 -238544 -80334 -44954 -64668 -195360 39376 -73885 -178272 85104 -40007 299119 -68723
18061 -456926 257041 378678 133720 34507 -383915 -43278 -104202 -256502 -157704 -60134
18050 -223870 10143 -62849 77148 134114 19961 -85421 -174077 119554 206522 17648 329996
18039 329996 164294 1894 -175024 -72077 -213173 -232371 148946 92789 -191351 -14907 -110766
18028 -110766 173130 79708 299779 -85743 -158588 321084 50898 27718 -173910 -73336 -26106
18016 190629 86658 105877 87724 330385 111112 98805 -239061 -409431 215894 187760
18006 187760 63456 80901 -73451 236168 98146 179035 9048 285528 -392258 55326 213516
$$ packed form
18084E6592a02792D3235r25L6564a32165f118o2457a6194B92256e6195j82349
18073b38544h0334L5380j9714j30692C9376g3885j04387H5104d0007B99119f8723
18061d56926B57041J21637A33720C4507c83915d3278o0924j52300R8798f0134
18050b23870A0143f2849G7148N6966A9961h5421q8656A19554Q6968A7648L12348
18039C29996A64294A894a75024g2077j41096j9198A48946n6157a91351a4907r5859
18028a10766A73130G9708K20071h5743p2845C21084E0898k3180a73910g3336b6106
18016A90629H6658J9219j8153K42661A11112j2307b39061j70370B15894k8134
18006A87760F3456J7445g3451B36168I8146Q0889I048K76480c92258E5326J58190
$$ plain form
17995 213516 376775 -8638 -133616 -30120 177304 -157346 -300896 -140084 -68412 112021
17984 159456 86546 -192735 110699 -176051 89984 -16179 -399333 21772 65159 -409123
17973 -112516 272739 303074 -37293 -187715 162007 -200415 241564 -198225 115349 -154475
17962 -105046 -94212 -20507 -130561 -112733 -69707 -313987 81804 -99277 -139280 13238 259939
17951 259939 -56853 113584 177286 -113417 257510 266933 -88927 -100536 -49069 110797 321735
17940 321735 38444 58271 -590873 -158038 204638 71207 -175518 -129258 331628 270010
17930 270010 -337424 28937 16641 -10086 216638 -52115 -138183 -219453 23988 -185568 -15168
17918 304706 19494 -57056 165128 152175 -11808 -23304 445050 -33086 -61682 -166905 191095
$$ packed form
17995B13516J63259h638j24978c0120A77304a57346j43550a40084f8412A12021
17984A59456p2910a92735A10699a76051H9984a6179l83154B1772M3387d09123
17973a12516B72739L0335c7293j50422A62007b00415B41564a98225A15349a54475
17962a05046J0834b0507j10054J7828M3026k44280H1804i9277m0003A3238K46701
17951B59939e6853A13584O3702a13417B57510R423h8927j1609d9069A10797K10938
17940C21735C8444J9827e90873a58038B04638G1207a75518M6260C31628o1618
17930B70010c37424B8937j2296a0086B16638e2115q6068q1270B3988a85568a5168
17918C04706A9494e7056A65128j2953a1808j1496D45050c3086k8596j05223A91095
$$ plain form
17906 -272869 258663 -150027 -20578 92979 296038 -159152 -245129 -50140 70938 -14137 -242412
17895 -242412 197294 -289428 104424 77625 146185 -274067 89101 -297986 -83608 -169199
17885 -169199 64804 -81916 10952 -151654 -54434 -386344 57508 -131496 171657 325931
17875 325931 83728 208424 -138400 -313985 -142551 -5935 -53531 133665 107464 117920 101222
17864 101222 300513 -174953 -168846 36527 -63138 319659 -38310 -25036 -186969 -121870 80398
17852 40816 131149 -258207 222771 -82249 70798 -77700 -364743 -176868 213422 -412894
17841 -38305 -280796 -31782 100000 -86546 17100 -135178 47616 -49240 -8865 -225958 -272850
17830 -272850 -373447 -200066 -82596 218690 -84549 33509 -10870 269371 38646 49037 -125846
$$ packed form
17906b72869B58663a50027b0578I2979K03059a59152q5977e0140G0938a4137k28275
17895b42412A97294b89428A04424k6799O8560b74067H9101b97986h3608q5591
17885a69199F4804h1916A0952a51654e4434l31910E7508a31496A71657J54274
17875C25931H3728J24696a38400j75585a42551e935m7596A33665k6201J0456j6698
17864A01222J99291a74953O107C6527f3138C19659c8310J3274j61933O5099H0398
17852D0816R0333b58207B22771h2249G0798g7700k87043a76868B13422d12894
17841c8305k42491c1782A00000h6546A7100a35178D7616d9240h865k17093m6892
17830b72850j00597J73381h2596B18690h4549C3509a0870B69371C8646J0391a25846
$$ plain form
17818 -50038 161247 -99984 -369627 -12267 -141812 -128897 218682 -473829 -190302 132673
17807 60638 229227 -128083 -65076 -81227 -16980 69156 -323933 -85229 -38146 110027 141013
17796 141013 6124 -138277 -201450 -108266 59195 40451 99645 -60799 -43519 -37031 -37301 -204676
17784 -204676 -5900 -192117 -118697 206587 -103085 -135107 -235478 28470 -155886 -124540 182185
17772 -255250 349374 -191543 149828 46330 -46567 -1303 294794 138116 131583 -35339 78592
17760 34648 -114830 -201158 -139370 286753 67744 62029 -42889 -191573 309012 92305 -115400
17748 -41349 243934 294195 147893 -71311 -56853 -104273 -70982 -76022 -267941 -36320 -114945
17737 -114945 101107 46778 207495 -16490 -71543 -57233 42496 15380 260960 -24583 73295
$$ packed form
17818e0038A61247i9984k69643a2267j29545J2915B18682d73829a90302A32673
17807F0638J68589a28083O3007j6151a6980F9156c23933h5229c8146A10027L0986
17796A41013F124a38277o3173R3184E9195j8744N9194f0799J7280O488k70j67375
17784b04676e900j86217P3420B06587a03085l2022j00371B8470a55886L1346A82185
17772b55250C49374a91543A49828D6330d6567a303B94794A38116o533c5339G8592
17760C4648a14830q6328O1788B86753F7744n715d2889j48684C09012I2305a15400
17748d1349B43934N0261j46302g1311J4458m7420L3291n040j91919c6320p8625
17737a14945A01107D6778J60717a6490n5053J4310D2496A5380K45580b4583G3295
$$ plain form
17725 -71927 -214574 117955 -214686 -132061 -60248 -45750 336198 128120 -107357 163542
17714 -17510 -149428 -42144 -6641 22546 382850 -104409 88145 150494 -132440 -248079 11538
17702 181252 -60744 267880 78995 132888 91392 118456 -40347 124754 43104 -305780 48724
17690 76420 118989 335205 51782 177119 -78552 254622 133132 -166613 -50671 -176337
17680 -176337 -91132 441058 165443 -129519 -48367 126376 46223 39134 -215349 216597
17669 58968 -218530 -233814 628 -227685 -332230 -6127 194330 359214 133179 -264955 153477
17657 -175007 157797 14988 -14130 11024 -45228 227136 158282 73536 8368 114895 133331
17646 133331 -206345 18455 -24610 282397 -339150 86176 142846 150103 -64736 38706 -94219
$$ packed form
17725g1927j42647A17955b14686Q2625f0248J4498C36198A28120a07357A63542
17714a7510j31918d2144f641B2546L60304a04409H8145O2349a32440j15639A1538
17702A81252f0744B67880G8995N3893m1496K7064d0347A24754D3104c05780D8724
17690G6420M2569K16216E1782J25337g8552B54622j21490a66613e0671j25666
17680a76337Q5205D41058A65443a29519d8367A26376D6223p089b15349B16597
17669E8968b18530j5284F28b27685j04545f127A94330J64884A33179b64955A53477
17657a75007A57797A4988a4130A1024d5228B27136o8854G3536H368J06527J8436
17646A33331b06345A8455b4610B82397c39150H6176N6670P257f4736C8706i4219
$$ plain form
17634 62017 16959 41105 67878 208039 234380 44413 67028 102854 -59112 -68555 81072 48454
17622 48454 70749 -96390 158620 424412 -42575 240333 -191341 129751 -346519 128644
17611 -111774 -34671 -219602 120451 -6281 5484 96526 357966 -191975 142378 207646 -29484
17599 89784 117025 42199 135040 17106 262559 92455 131628 96542 -281888 74493 -25755
17587 262345 54540 -135182 -118267 80992 -5675 15094 -218658 351678 -113353 180309 143208
17576 143208 -25812 202343 -127057 122197 171448 -2678 26087 -7659 -120363 -99691 -204463
17565 -204463 194061 -28757 -289389 -76409 -127246 -241292 240790 -59079 34838 102926 -47800
17553 -96781 164120 322236 -254580 129803 188632 -94822 -222306 -152056 -100237 13291 67857
$$ packed form
17634F2017A6959K4146K6773J40161K6341D4413K2615L5826e9112r443H1072l2618
17622D8454K2295i6390A58620K65792d2575B40333a91341A29751c46519A28644
17611a11774c4671j84931A20451f281E484R1042K61440a91975A42378O5268b9484
17599H9784K7241D2199R2841A7106K45453I2455L9173l5086b81888G4493b5755
17587B62345E4540a35182J6915H0992e675A5094b18658C51678a13353A80309l7101
17576A43208b5812B02343a27057A22197M9251b678B6087g659j12704K0672j04772
17565b04463A94061b8757k60632g6409n0837j14046B40790e9079C4838O8088d7800
17553i6781A64120J58116b54580A29803N8829i4822j27484P0250N1819A3291N4566
$$ plain form
17542 67857 105937 363707 -114832 223878 -83971 94050 52235 279843 83479 102700 289820
17531 289820 -82570 87237 76250 119674 -57278 131293 247898 306452 -198915 -93416 406145
17519 -370796 150829 -75075 -184511 -9341 -5426 284873 264576 161558 -196397 123999 15676
17507 479910 164919 118051 38816 651701 199064 24523 182199 149212 174680 101040 208491
17496 208491 409021 244326 277893 119268 123232 225382 -422 183926 -299866 360725 151331
17484 6594 -103966 -16804 130398 524916 -86690 -100589 157572 -1385 117079 133403 203586
17473 203586 141768 -2025 108473 31408 180777 354868 -10806 -138130 193215 -189859
17462 165846 -23376 294783 -65879 -49264 47016 308702 280972 219532 266539 493210 14792
$$ packed form
17542F7857L8080K57770a14832B23878h3971I4050m1815K27608H3479J9221J87120
17531B89820h2570H7237j0987M3424e7278A31293J16605N8554a98915i3416D06145
17519c70796A50829g5075j09436i341L915B84873k0297j03018a96397A23999A5676
17507D79910A64919m6868C8816O12885A99064B4523J57676l2987K5468p3640J07451
17496B08491K00530j64695L3567A19268L964J02150d22A83926b99866C60725A51331
17484F594a03966a6804A30398L94518h6690j3899A57572a385A17079J6324P0183
17473B03586o1818b025A08473C1408J49369J74091a0806j27324A93215a89859
17462A65846b3376B94783f5879J6615D7016K61686k7730o1440M7007K26671A4792
$$ plain form
17450 37394 211200 288446 327216 365908 385267 186296 290650 -102161 395731 -66502 300026
17438 -31003 519918 402890 481243 178608 356561 -39446 104496 242039 -40723 175180
17427 19719 78405 59278 248205 -34802 290790 386447 422467 116832 503014 412056 130492
17415 369823 121153 232526 414155 382334 36710 267718 -75136 308243 293696 152781
17405 152781 249321 16306 -75557 -122164 258500 239886 96398 -54077 183223 922 375108
17394 375108 478571 353900 -131388 231258 286094 -77252 226440 360671 -133763 235748
17383 120984 236370 218124 39041 245004 393836 243218 -122116 262167 -28711 504879
17372 107141 -219309 -97254 40820 -85878 543648 -122628 382385 171762 -30467 394481
$$ packed form
17450C7394J73806P7246L8770L8692J9359A86296J04354a02161C95731f6502C00026
17438c1003E19918j17028P8353A78608J77953c9446A04496J37543d0723A75180
17427A9719N8686j9127J88927c4802B90790R5657L6020A16832L86182r0958A30492
17415C69823A21153J11373J81629l1821C6710K31008g5136C08243j4547j40915
17405A52781R6540A6306g5557m6607B58500j8614I6398e4077A83223I22L74186
17394C75108J03463j24671a31388B31258N4836g7252B26440J34231a33763B35748
17383A20984J15386j8246C9041K05963J48832j50618a22116B62167b8711E04879
17372A07141b19309i7254D0820h5878E43648a22628C82385A71762c0467C94481
$$ plain form
17361 380246 -3050 172725 263383 -72278 197063 190885 118942 -235788 6620 258053 314135
17350 314135 534389 57808 244825 361160 73044 91421 275830 341035 259779 50060 246755
17339 246755 206531 252812 206435 705668 240920 -27867 391363 115293 454610 189825
17328 482946 423581 133027 172435 67394 251592 130998 284720 227149 -129815 384375
17317 32645 347827 157854 183968 322445 114914 149049 -164342 275122 113724 186472
17307 186472 28138 174198 259870 120080 241723 460961 88571 20757 337998 409849
17297 409849 235937 132635 181890 300238 29054 201819 457083 248940 148159 158476
17287 158476 187108 18750 254265 -50599 456377 65571 54487 295530 634901 83061 13693
$$ packed form
17361C80246c050A72725R0658g2278A97063o178p1943b35788F620K51433N6082
17350C14135K20254E7808J87017J16335G3044J8377J84409O5205q1256E0060J96695
17339B46755m0224M6281m6377M99233B40920b7867C91363A15293L39317A89825
17328D82946n9365A33027L9408F7394J84198j20594J53722n7571a29815C84375
17317C2645L15182A57854K6114J38477A14914L4135a64342B75122A13724P2748
17307A86472B8138J46060Q5672A20080J21643K19238H8571B0757L17241P1851
17297D09849j73912j03302M9255J18348B9054J72765K55264k08143j00781J0317
17287A58476K8632A8750K35515e0599D56377F5571j1084K41043L39371H3061A3693
$$ plain form
17275 156368 131195 427162 553579 75587 165681 233195 308249 -46481 -9090 -108723 216681
17263 364898 161022 427087 100220 214490 175456 130761 91818 89507 27389 318565 108572
17251 352983 -103020 85478 -12053 331773 125208 327167 207671 122373 183068 -3056 161508
17239 291724 195474 -130636 319937 261980 470609 200796 342152 22700 126564 263550
17229 263550 500139 295012 306006 -80263 278147 527522 363590 386517 442947 304348
17219 304348 177081 192926 112792 70342 232400 66696 405016 373639 285022 191192 304579
17208 304579 304354 350890 351726 293021 477580 134306 278926 245036 279892 525007 293900
17197 293900 90919 97428 210564 416866 239357 310631 378470 275683 578526 128505
$$ packed form
17275A56368k5173K95967J26417G5587R0094O7514P5054d6481i090r9633B16681
17263C64898A61022K66065A00220J14270l9034m4695l8943k311B7389K91176A08572
17251C52983a03020H5478a2053C31773A25208K01959j19496q5298O0695c056A61508
17239B91724r6250a30636C19937n7957K08629B00796J41356B2700J03864J36986
17229B63550K36589k05127J0994h0263B78147K49375j63932K2927N6430j38599
17219C04348j27267J5845q0134m2450J62058F6696L38320l1377q8617r3830J13387
17208C04579k25M6536Q36n8705J84559A34306J44620l3890L4856K45115k31107
17197B93900I0919O509J13136K06302j77509P1274O7839j02787L02843A28505
$$ plain form
17186 225507 665918 19075 236356 160134 84285 252015 59487 347186 228860 36705
17175 57746 459209 180515 258548 297661 136943 338041 476128 310471 352685 338067
17165 338067 -37925 99516 229409 410356 206228 104139 393145 570342 526160 94898
17154 71461 228371 438506 442005 281198 388350 311709 365600 120590 533819 138253
17143 792771 369744 252867 451990 376118 193818 199039 890594 512046 269172 507100
17133 507100 233963 224737 215803 -131648 231214 298311 559727 711004 364008 569683
17123 569683 624217 559623 229539 284091 285283 709195 364148 243218 551543 309075
17113 309075 349908 658929 441397 109427 704958 337766 326688 398645 663450 616717
$$ packed form
17186B25507M40411A9075K17281p6222p5849J67730E9487K87699j18326C6705
17175E7746M01463A80515P8033L9113A36943K01098J38087j65657M2214j4618
17165C38067c7925I9516J29893J80947k04128j02089K89006J77197m4182I4898
17154G1461J56910K10135L499j60807J07152p6641N3891A20590M13229A38253
17143G92771C69744j16877J99123p5872j82300N221O91555l78548k42874K37928
17133E07100B33963r226q934a31648B31214O7097K61416J51277l46996K05675
17123E69683N4534o4594B29539N4552J192M23912l45047j20930L08325k42468
17113C09075M0833L09021k17532A09427N95531C37766j1078P1957K64805m6733
$$ plain form
17103 616717 635729 505457 221135 571422 477650 235280 506044 240034 122469 470808
17093 470808 534307 51268 113022 519718 569405 373062 332174 308847 396662 501991 702754
17082 702754 570103 620801 445518 548241 344593 796857 547654 470836 700419 491353
17072 491353 568185 573538 346118 603333 991204 433508 887931 349871 565782 717834
17062 717834 515497 505658 622587 489031 558782 920051 698154 560941 884557 800957
17052 800957 389245 562534 537975 662900 223071 368218 712467 575034 676752 91514
17041 636910 536634 546010 590218 894461 358565 680569 710919 478420 572590 518302 438648
17030 438648 788276 560140 877874 713778 840164 595385 568223 426847 779281 691738
$$ packed form
17103F16717J9012j30272B21135L50287r3772B35280K70764B40034j17565L48339
17093D70808O3499E1268O1754M06696M9687j96343m0888k3327Q7815J05329K00763
17082G02754j32651N0698j75283J02723k03648M52264k49203p6818K29583k09066
17072D91353P6832N353k27420K57215L87871D33508M54423C49871K15911J52052
17062G17834k02337r839J16929j33556O9751L61269k21897j37213L23616q3600
17052H00957C89245J73289k4559J24925B23071J45147L44249j37433J01718I1514
17041F36910j00276R376M4208L04243C58565L22004L0350k32499R4170n4288p9654
17030D38648L49628k28136L17734j64096J26386k44779k7162j41376L52434q7543
$$ plain form
17020 691738 525828 617663 693612 755215 670006 786348 963077 837443 924626 941092 960091
17009 960091 603426 750704 966709 985845 867250 855096 823675 973653 1017870 780879
16999 780879 746417 1032900 972344 838810 725732 761956 1150929 420691 798202 1064020
16989 1064020 1098676 1003439 891632 872494 913803 1215189 826200 1030426 1000535 969854
16979 969854 884509 983674 1065354 694066 1032328 863046 1251766 1000355 1151476 1175870
16969 1175870 1129673 824932 1128053 883642 1062089 1468013 787447 1084899 1408798 1107861
16959 1107861 972429 905659 1146316 1321741 1318050 1211288 939385 1203682 1418674 1202645
16949 1202645 1247496 1365445 1062535 1401509 1247794 1311689 1379276 1331854 1327186 991617
$$ packed form
17020F91738j65910R1835P5949O1603q5209J16342J76729j25634Q7183J6466J8999
17009I60091l56665J47278K16005J9136j18595j2154l1421J49978M4217k36991
16999G80879l4462K86483o0556j33534j13078L6224L88973D20691L77511K65818
16989A064020L4656r5237j11807j9138M1309L01386l88989K04226k9891l0681
16979I69854q5345R9165Q1680l71288L38262j69282L88720k51411J51121K4394
16969A175870m6197l04741L03121k44411J78447M05924o80566K97452L23899l00937
16959A107861j35432o6770K40657J75425l691j06762k71903K64297K14992k16029
16949A202645M4851J17949l02910L38974j53715O3895O7587m7422m668l35569
$$ plain form
16939 991617 1248427 1359467 1607203 1117047 1148595 1622976 1417268 1175914 1679090 1240046
16929 1240046 1100764 1292846 1330664 1491173 1732189 1963336 1675813 1961209 1656453 1331964
16919 1331964 1702902 1719444 1904709 1468543 1857740 1643232 1538352 1910183 1811198 1808486
16909 1808486 2070032 1988335 1996908 2069817 1587236 1462119 2219879 2208344 2244130 2056464
16899 2056464 1814226 2137711 2380693 2071576 1980321 2061674 2160238 2172230 2297880 2422992
16889 2422992 2326676 2556022 2266234 2377785 2118044 2432240 2132672 2548299 2428296 2394866
16879 2394866 2182486 2612595 2673660 2869870 2453458 2571371 2739030 2800510 2934198 2840126
16869 2840126 2625989 3076809 2797677 3063233 2923120 3019840 3284266 3275486 3178360 3483297
$$ packed form
16939I91617K56810J11040K47736m90156L1548M74381k05708k41354N03176m39044
16929A240046j39282J92082L7818J60509K41016K31147k87523K85396l04756l24489
16919A331964L70938J6542J85265m36166L89197k14508j04880L71831r8985k712
16909A808486K61546q1697Q573P2909m82581j25117P57760j1535L5786j87666
16899B056464k42238L23485K42982l09117r1255Q1353R8564J1992J25650J25112
16889B422992r6316K29346k89788J11551k59741L14196k99568M15627j20003l3430
16879B394866k12380M30109O1065J96210m16412J17913J67659O1480J33688r4072
16869B840126k14137M50820k79132K65556j40113R6720K64426q780r7126L04937
$$ plain form
16859 3483297 3183910 3192907 3513251 3571486 3506217 3503746 3775824 3602412 3434692 3631765
16849 3631765 3979317 3780500 4005074 4223142 4123034 4217425 4110625 4107944 4258738 4144192
16839 4144192 4646649 4604820 5077561 4808952 4986877 4736001 4750058 5377587 5101278 5194690
16829 5194690 5356381 5367107 5188426 5847593 5544100 6185431 5601428 5941125 6287845 6417009
16819 6417009 6394224 6268696 6620839 6861586 6586455 6900651 7119592 7280522 7205031 7464514
16809 7464514 7782293 8186844 7795454 7991860 8209680 8703716 8570347 8930656 8864615 9279560
16799 9279560 9668213 9915018 9887132 10479785 10530103 10717505 10994726 11242136 11672665 11720068
16789 11720068 12033424 12399109 12722680 12976704 13881399 13577347 13692361 14536805 14960547
$$ packed form
16859C483297k99387Q997L20344N8235o5269k471K72078j73412j67720J97073
16849C631765L47552j98817K24574K18068j00108R4391j06800k681J50794j14546
16839D144192N02457m1829M72741k68609J77925k50876J4057O27529k76309R3412
16829E194690J61691J0726j78681O59167l03493O41331n84003L39697L46720J29164
16819F417009k2785j25528L52143K40747k75131L14196K18941J60930p5491K59483
16809G464514L17779M04551l91390J96406K17820M94036j33369L60309o6041M14945
16799I279560L88653K46805k7886N92653N0318J87402K77221K47410M30529M7403
16789A1720068L13356L65685L23571K54024R04695l04052J15014Q44444M23742
$$ plain form
16780 14960547 15840945 15991166 16538720 17308673 17852182 18027206 18481252 18940218 19713143
16771 19713143 20399975 21013263 21763952 22416975 23358547 24186756 24939988 26131212 27238727
16762 27238727 27975445 29043386 30204513 31432086 32225605 33867509 35288179 36733010
16754 36733010 38218306 39714208 41804311 43320527 45875792 47781579 50180778 52450564
16746 52450564 54473591 57421041 60435244 63304779 66396918 69344118 73214430 77202254
16738 77202254 81149408 85813177 89660634 94464015 99516324 104636561 109984666 115621048
16730 115621048 121138568 127126644 133154192 138815348 144600190 150159607 155433018 160233103
16722 160233103 164879799 168998982 172324574 174504235 176303345 177395475 176934237 176115083
$$ packed form
16780A4960547Q80398J50221N47554P69953N43509J75024M54046M58966P72925
16771A9713143O86832O13288P50689O53023R41572Q28209P53232J191224J107515
16762B7238727P36718J067941J161127J227573P93519J641904J420670J444831
16754C6733010J485296J495902K090103J516216K555265J905787K399199K269786
16746E2450564K023027K947450L014203K869535L092139K947200L870312L987824
16738G7202254L947154M663769L847457M803381N052309N120237N348105N636382
16730A15621048N517520N988076O027548N661156N784842N559417N273411M800085
16722A60233103M646696M119183L325592K179661J799110J092130m61238q19154
$$ plain form
16714 176115083 173968546 171159974 167810427 163474493 158595034 153568189 148062388 142183342
16706 142183342 136318823 130281243 124061120 118330668 112393945 106592575 101657917 96410780
16698 96410780 91403462 86827039 82018156 78216158 73985429 70393394 66662136 63330572
16690 63330572 60245870 57555849 54755212 51981969 49507515 47107916 45121861 43006586
16682 43006586 40685349 39073985 37496024 36488195 34347644 33286829 31363459 30459112
16674 30459112 29201667 28486911 27026155 26276388 25174103 24345401 23701052 22631629 22172318
16665 22172318 21009760 20104263 19283606 19164456 18138282 17843335 17265328 16697155 16232421
16656 16232421 15675632 14972029 14550918 14305776 13749614 13347357 12784645 12739037 12435312
$$ packed form
16714A76115083k146537k808572l349547m335934m879459n026845n505801n879046
16706A42183342n864519o037580o220123n730452n936723n801370m934658n247137
16698I6410780n007318m576423m808883l801998m230729l592035l731258l331564
16690F3330572l084702k690021k800637k773243k474454k399599j986055k115275
16682D3006586k321237j611364j577961j007829k140551j060815j923370r04347
16674C0459112j257445p14756j460756p49767j102285q28702o44349j069423m59311
16665B2172318j162558r05497q20657j19150j026174k94947n78007n68173m64734
16656A6232421n56789p03603m21111k45142n56162m02257n62712m5608l03725
$$ plain form
16647 12435312 11880200 11526450 11614384 11370560 10579153 10270236 10450885 9884521 9497575
16638 9497575 9431680 9411938 8907970 8926040 8775969 8285194 8410702 8108450 8017261 7934796
16628 7934796 7719607 7156124 7467691 6968796 6772355 6794064 6560774 6399116 6225117 6342344
16618 6342344 6019321 5582999 5642002 5776999 5581514 5105180 5133235 5385829 5436580 4852673
16608 4852673 4889029 4979183 4716278 4943925 4763947 4568465 4703361 4512155 4339550 4473675
16598 4473675 4034280 3997904 4374964 3765968 3764312 3827127 3443108 3674173 3665965 3656439 3621273
16587 3621273 3532639 3492723 3428583 3308613 3028595 3135453 3028786 3444612 3079929 3100844
16577 3100844 3004208 2776875 3120657 2914410 2641436 2686265 3017829 2628004 2672716 2617808
$$ packed form
16647A2435312n55112l53750Q7934k43824p91407l08917J80649n66364l86946
16638I497575o5895j9742n03968J8070j50071m90775J25508l02252r1189q2465
16628G934796k15189n63483L11567m98895j96441K1709k33290j61658j73999J17227
16618F342344l23023m36322N9003J34997j95485m76334K8055K52594N0751n83907
16608D852673L6356R0154k62905K27647j79978j95482J34896j91206j72605J34125
16598D473675m39395l6376L77060o08996j656O2815l84019K31065q208r526l5166
16587C621273q8634l9916o4140j19970k80018J06858j06667M15826l64683K0915
16577C100844r6636k27333L43782k06247k72974M4829L31564l89825M4712n4908
$$ plain form
16567 2617808 2459934 2730643 2648546 2723042 2427680 2115022 2596529 2131928 2387035 2306962
16557 2306962 2268219 2506712 2281259 2089244 1889289 1875757 2080516 2085202 2007371 2050996
16547 2050996 1912195 1970395 2016445 1926756 1877944 2015167 1616982 1694468 1959901 1830456
16537 1830456 1831595 1545797 1728936 1557148 1922875 1374201 1607986 1475992 1471162 1730123
16527 1730123 1527521 1568025 1719477 1738304 1727313 1191924 1441581 989373 1433336 1272231
16517 1272231 1537619 1423060 1321285 1447437 1382672 1245338 1058601 1402055 1161270 1410779
16507 1410779 1314696 1154540 1314709 1144482 1272126 1196633 1216007 1156783 1137985 1347691
16497 1347691 1084084 1111186 1234272 1261400 767743 1235989 1025111 925729 923152 862914
$$ packed form
16567B617808j57874K70709q2097P4496k95362l12658M81507m64601K55107q0073
16557B306962l8743K38493k25453j92015j99955j3532K04759M686p7831M3625
16547B050996j38801N8200M6050q9689m8812J37223l98185P7486K65433j29445
16537A830456J139k85798J83139j71788L65727n48674K33785j31994m830K58961
16527A730123k02602M0504J51452J8827j0991n35389K49657m52208M43963j61105
16517A272231K65388j14559j01775J26152o4765j37334j86737L43454k40785K49509
16507A410779r6083j60156J60169j70227J27644p5493J9374n9224j8798K09706
16497A347691k63607K7102J23086K7128m93657M68246k10878r9382k577o0238
$$ plain form
16487 862914 1022972 937471 1211131 1156824 1197176 1003718 943668 818238 848875 1011760
16477 1011760 1229115 995991 955227 848996 824636 909710 904744 1114986 925322 728152
16467 728152 997939 1006968 755442 1100248 533292 883958 775903 731213 732583 982971
16457 982971 776597 673066 925302 749699 874654 705881 930873 886241 641795 926512
16447 926512 704763 775754 671676 760062 752926 433202 583134 395176 790633 317407
16436 600727 898702 635764 399335 567520 663817 647764 665852 626326 545471 481078 563254
16425 563254 555941 594790 521261 833634 847553 518686 540017 519793 306831 782691 769400
16414 769400 634441 667416 516170 473453 473843 602402 439308 311141 621773 39976 177341
$$ packed form
16487H62914J60058q5501K73660n4307M0352j93458o0050j25430L0637J62885
16477A011760K17355k33124m0764j06231k4360Q5074m966K10242j89664j97170
16467G28152K69787R029k51526L44806E33292L50666j08055m4690J370K50388
16457I82971k06374j03531K52236j75603J24955j68773K24992m4632k44446K84717
16447I26512k21749P0991j04078Q8386p136l19724J49932j87958L95457C17407
16436F00727K97975k62938k36429J68185R6297j6053J8088l9526q0855o4393Q2176
16425E63254p313L8849p3529L12373J3919l28867K1331k0224k12962M75860j3291
16414G69400j34959L2975j51246m2717L90J28559j63094j28167L10632C9976J37365
$$ plain form
16403 177341 226050 508692 566058 835628 528777 167512 737222 -54768 238403 348360
16393 348360 250400 656752 384229 271812 347068 469345 150335 676867 587128 316820
16383 316820 719468 426799 234015 515818 592755 220730 480444 217447 549428 685635
16373 685635 341186 576635 371155 315964 336523 202156 389160 321335 386699 429682
16363 429682 253110 194414 262431 4340 421664 390973 189752 235647 238541 295547 248196
16352 248196 329371 295879 227176 36783 566581 234365 727417 467781 377708 130899
16341 559712 154964 164459 195552 429512 535646 346534 210070 181168 263494 67912 282962
16330 282962 -168846 305625 403181 314780 70256 230733 360972 190285 235478 247613
$$ packed form
16403A77341M8709K82642N7366K69570l06851A67512N69710e4768B38403J09957
16393C48360r7960M06352k72523j12417P5256J22277A50335N26532q9739k70308
16383C16820M02648k92669j92784K81803P6937B20730K59714B17447L31981J36207
16373F85635C41186K35449k05480n5191K0559j34367J87004o7825O5364M2983
16363D29682j76572n8696O8017D340M17324l0691A89752M5895K894N7006m7351
16352B48196Q1175l3492o8703C6783N29798B34365M93052k59636r0073A30899
16341E59712A54964R495L1093K33960J06134j89112j36464k8902Q2326F7912K15050
16330B82962a68846C05625R7556q8401G0256J60477J30239j70687M5193J2135
$$ plain form
16320 247613 260379 131304 336899 -74481 74781 261280 78421 286514 520805 268336
16310 268336 255906 458129 328391 317332 339747 345206 139696 -177689 286262 132113
16299 179334 362875 -18367 127454 154477 -417 2621 114195 291144 155213 288882 163875
16288 163875 245948 219543 154447 141141 479898 207974 156638 26072 209340 234971 56077
16276 -44925 423136 152465 84809 311361 -66077 259861 225648 35549 -159128 -279085
16266 -279085 266229 392385 297470 229016 305763 45494 12263 185149 102897 120078 247604
16255 247604 42596 311187 124033 442524 -41055 -17261 175764 -132246 77231 -99460
16244 441274 236659 238837 52721 221707 114255 114037 76072 291287 98494 591740 275136
$$ packed form
16320B47613J2766j29075K05595g4481G4781J86499G8421K08093K34291k52469
16310B68336j2430K02223j29738j1059K2415N459A39696a77689B86262A32113
16299A79334J83541a8367A27454K7023d17B621J11574J76949j35931J33669j25007
16288A63875Q2073k6405o5096j3306L38757B07974n1336B6072J83268K5631E6077
16276d4925D23136A52465o7656K26552f6077B59861l4213C5549a59128j19957
16266b79085B66229J26156r4915o8454P6747D5494A2263J72886q2252J7181J27526
16255B47604D2596K68591A24033L18491d1055a7261A75764a32246G7231i9460
16244D41274k04615K178E2721J68986j07452k18l7965K15215I8494M93246B75136
$$ plain form
16232 -31612 85038 265911 321856 122877 108794 -94709 131715 327269 256193 148591 119649
16221 119649 157864 4717 277722 137490 59130 149575 137418 125288 331543 79714 -65477
16209 394199 269953 210546 96784 1242 90524 7086 136065 -33801 20966 250050 87114
16197 -18684 100134 -10060 -172190 133519 291338 -65640 442837 204666 -4208 135579
16186 214159 149572 80322 59806 -160557 -224758 -12553 262589 316929 -68263 251536 121973
16174 -3183 -26893 1436 -4821 213905 -69230 -94876 -71162 14944 35456 121262 30800 92629
16162 92629 -183656 36349 -35075 -23586 61454 169560 86373 40498 -90059 -34020 -249548
16151 -249548 -54888 215579 231503 -17170 190554 43394 163317 -5510 227394 270426 33598
$$ packed form
16232c1612H5038J80873N5945A22877j4083i4709A31715J95554p1076j07602k8942
16221A19649L8215D717K73005A37490E9130R0445j2157j2130K06255G9714f5477
16209C94199j24246n9407I6784A242Q9282G086J28979c3801B0966K29084H7114
16197a8684A00134a0060j62130A33519J57819f5640D42837B04666d208A35579
16186B14159o4587o9250k0516a60557o4201a2553B62589N4340f8263B51536A21973
16174c183k3710A436d821B13905f9230k5646K3714A4944K0512Q5806C0800O1829
16162I2629a83656C6349c5075J1489F1454J08106q3187D0498i0059c4020k15528
16151b49548e4888B15579J5924a7170A90554D3394J19923e510B27394M3032C3598
$$ plain form
16139 115469 85753 -5021 -327672 471561 98970 -38540 251084 344166 -112790 19500 234098
16128 234098 -165799 -213591 170205 -108830 92817 -163665 -140813 421229 -89225 100908
16117 -16232 178336 -286597 121256 187195 181467 85666 112912 51033 45470 -71280 243468
16105 -268632 151464 -232189 169387 259951 285345 123917 -169597 397527 -16325 197197
16094 490328 366496 392721 -171365 161794 4888 -84097 -188231 -118266 73111 -312801 15244
16082 930 200521 289224 -224859 -59790 1404 219406 -17771 143735 -129778 -136520 -240344
16071 -240344 -16228 44934 -189641 -91079 -25948 -242963 118082 -161928 39283 -424644
16060 -186295 -171752 -52646 -28685 253702 -60695 -45591 197007 15012 -81234 316 -68413
$$ packed form
16139A15469k9716e021l22651D71561I8970c8540B51084R3082a12790A9500K14598
16128B34098a65799m7792A70205a08830I2817a63665K2852D21229h9225A00908
16117a6232A78336b86597A21256O5939n728H5666K7246E1033n563g1280B43468
16105b68632A51464b32189A69387R0564K5394A23917a69597C97527a6325A97197
16094D90328j23832K6225a71365A61794D888h4097j04134O9965G3111c12801A5244
16082I30J99591Q8703b24859e9790A404K18002a7771A43735a29778o742j03824
16071b40344a6228D4934a89641i1079b5948k17015A18082a61928C9283d24644
16060a86295J4543e2646K3961B53702f0695J5104A97007A5012h1234C16f8413
$$ plain form
16048 83390 -234349 -299370 -35386 -27523 -134639 415512 -88992 32494 -8315 90991 -29002
16036 -88744 -88196 -326658 -372176 375114 40548 -56308 13047 174287 -76121 63850 128248
16025 128248 306896 23069 131141 46651 -120343 44794 -34406 -297571 207769 -55634
16014 -86674 112415 42604 227985 125107 35363 153395 -393091 -394986 -235485 43207 185732
16003 185732 -340259 12500 -175739 -328657 59978 -33314 113252 -10397 -3564 -263092 -79176
15991 52983 119230 -169068 1710 -244854 41856 -113927 27936 96784 -9995 454321 345064
15980 345064 241111 359163 -91079 48026 -10675 5020 -192227 -63100 -65796 -120404 -68549
15969 -68549 57494 -151865 454498 151757 57494 173229 -42798 167172 68860 139606 268863
$$ packed form
16048H3390b34349o5021c5386P863j07116D15512h8992C2494h315I0991b9002
16036h8744N48k38462m5518C75114D0548e6308A3047J61240g6121F3850O4398
16025A28248J78648B3069J08072D6651a20343D4794c4406k63165B07769e5634
16014h6674A12415D2604J85381j02878C5363J18032c93091j895J59501D3207J42525
16003A85732c40259A2500a75739j52918E9978c3314A13252a0397c564k59528g9176
15991E2983O6247a69068A710b44854D1856a13927B7936O8848i995D54321j09257
15980C45064j03953J18052i1079D8026a0675E020a92227f3100k696n4608N1855
15969f8549E7494a51865D54498A51757E7494J15735d2798A67172F8860P0746J29257
$$ plain form
15958 268863 154528 -47670 50119 -189551 -326957 144172 108275 98279 -144427 20371 -170613
15946 -248656 -335149 184007 -196316 31692 -123110 124844 20603 -269034 2630 115 -313368
15934 -37868 -102204 125551 -16785 145420 131419 32654 -251480 -35417 -66484 -146909 272248
15922 -79511 139438 111236 -93883 435642 -339201 86524 302085 141477 -178283 -246294
15912 -246294 72483 46188 -86848 64894 175931 64514 57831 -189353 198539 -102594 -100922
15901 -100922 133601 270995 -156136 206160 -127530 -67540 -99512 -314576 42645 -167303
15890 -4976 84074 96823 9496 -21282 -252740 -53345 -179222 -132524 -145792 -59107 -105902 11031
15877 238750 72930 9200 226917 -149550 -143500 -43596 -222835 87511 -163466 -351080 -149968
$$ packed form
15958B68863j14335d7670E0119a89551j37406A44172l5897r996a44427B0371a70613
15946b48656q6493A84007a96316C1692a23110A24844B0603b69034B630A15c13368
15934c7868o4336A25551a6785A45420j4001C2654b51480c5417l1067q0425B72248
15922g9511A39438k8202i3883D35642c39201H6524K15561A41477a78283o8011
15912b46294G2483k6295h6848F4894J11037F4514o683a89353A98539a02594J672
15901a00922A33601J37394a56136B06160a27530N9990l1972k15064D2645a67303
15890d976H4074J2749I496b1282k31458e3345j25877M6698j3268e9107m6795A1031
15877B38750G2930I200K17717a49550O050d3596j79239H7511a63466j87614a49968
$$ plain form
15865 329306 203565 -279255 465 100401 -398289 -241343 132971 -22475 22454 -312534 174478
15853 82383 -94221 -58698 -227775 74043 -294155 473433 133920 -102237 -90371 -274763
15843 -274763 -119868 -149188 61577 -44197 341544 -27443 182703 456655 235624 55179
15832 -106384 -43565 -149390 -171318 -212490 -16478 -199042 -106821 -191475 -18172 99798 -229398
15820 -119501 -192748 -82345 31926 79365 67393 -121342 -15919 -104705 -26826 18391 -43341
15808 54522 13159 92154 -139586 -188022 -18518 -328435 124441 -98187 -2390 447975 -166077
15796 -27827 -304708 -50304 -87367 -276124 -92595 -82489 42441 33628 48423 -83382 32977
15784 77084 262561 -100843 -25207 117055 -79608 -69437 -203138 66917 146493 -254788 261663
$$ packed form
15865C29306j25741b79255D65R9936c98289J56946A32971b2475B2454c12534A74478
15853H2383i4221L5523j69077G4043b94155D73433A33920a02237J1866j84392
15843b74763a19868k9320F1577d4197C41544b7443A82703K73952k21031E5179
15832a06384d3565j05825k1928m1172a6478j82564R2221q4654a8172I9798b29398
15820a19501p3247h2345C1926M7439j1972a21342a5919q8786b6826A8391d3341
15808E4522A3159P8995a39586m8436a8518l09917A24441i8187b390D47975a66077
15796b7827k76881e0304l7063j88757i2595J0106D2441q813J4795h3382C2977
15784G7084J85477a00843b5207A17055g9608J0171j33701F6917P9576b54788B61663
$$ plain form
15772 56677 -251275 -160755 193736 -62557 182947 -231836 -56371 -409570 -353618 123749
15761 -141609 318199 170075 230788 179734 -204404 -21785 -445930 -131802 237592 -24054
15750 -243146 99786 1997 82312 -143594 66343 154440 -118509 -46969 -155768 -171680 7225
15738 -10649 -69657 52823 54293 -92228 -398579 -1615 -197254 28396 8848 -256538 -73136 -29408
15725 -199474 -214277 -66808 415642 128616 -235008 80377 -127243 -112408 -344822 -48520
15714 101079 -33615 -101888 -314558 -7227 45567 152598 -83368 48623 71149 -34965 74385
15702 306593 -234896 132232 -203634 -65980 -50653 181669 -47864 -108609 281917 42782
15691 6703 235662 -443398 -76487 190975 -109591 8696 -227979 242613 32798 311708 -435648
$$ packed form
15772E6677b51275R0520A93736f2557A82947b31836e6371l53199N5952A23749
15761a41609C18199j48124O0713n1054b04404b1785m24145a31802B37592b4054
15750b43146I9786A997Q0315a43594F6343Q8097a18509d6969j08799j5912G225
15738a0649n9008E2823J470i2228l06351a615j95639B8396H848b56538g3136b9408
15725a99474j4803f6808D15642A28616b35008H0377a27243J4835k32414d8520
15714A01079c3615o8273k12670g227D5567J07031h3368D8623K2526c4965G4385
15702C06593b34896A32232b03634f5980J5327A81669d7864o0745B81917D2782
15691F703K28959d43398g6487A90975a09591H696b27979B42613C2798K78910d35648
$$ plain form
15679 -263398 -1018 -178510 -65509 199085 -142493 -184224 -209861 37192 -205209 492938 -378354
15667 -150636 20880 47948 -108777 156693 -271587 -254729 -7538 114193 -61027 75311 151160
15656 151160 34352 -99717 -137499 -134222 -213397 -5155 -171145 -246677 -124588 152542 -52783
15644 -83474 118395 -91727 826 -61402 94048 18114 86494 -121900 86005 -2890 -77166 -100856
15632 -100856 166211 138082 66829 -539761 -54768 -11946 256174 -177084 -166276 -150961 166645
15620 108290 87121 99547 261917 13293 145116 67594 -109888 -274038 97860 263382
15610 263382 -183951 -149657 -177460 -58787 221770 -1541 -179524 -263479 58216 -154173 -193816
15599 -193816 127282 -128037 -112751 -105893 26194 131685 29660 -16659 219497 -112924 785
$$ packed form
15679b63398a018j77492f5509A99085a42493m1731k5637C7192b05209D92938c78354
15667a50636B0880K7068a08777A56693b71587J6858g538A14193f1027G5311P5849
15656A51160C4352i9717l7782L277p9175e155j65990p5532J22089A52542e2783
15644h3474A18395i1727H26f1402I4048A8114O8380a21900H6005b890p4276k3690
15632a00856A66211k8129F6829e39761e4768a1946B56174a77084J0808J5315A66645
15620A08290k1169J2426J62370A3293J31823F7594a09888j64150I7860J65522
15610B63382a83951L4294k7803e8787B21770a541j77983q3955E8216a54173l9643
15599a93816A27282a28037J5286O858B6194J05491B9660a6659B19497a12924G85
$$ plain form
15587 -149527 -110757 212184 -146871 133048 -113269 -95600 137645 58565 -283061 -169962
15577 -169962 -69980 -8127 2842 -226197 -213494 -113497 313525 90586 206267 118993 -19024
15565 -138137 -218650 -26070 24142 240590 260959 61738 -64477 -369180 74198 30272 70235
15554 70235 117124 43207 -237910 -34372 -30165 -388713 148360 121772 -167310 16191 -186299
15542 64029 -30034 6761 -96530 -1666 30378 1964 -64908 57448 -183567 277360 -216772 -139658
15530 -139658 -190788 -76442 -311273 113438 -47013 -58637 87200 -58745 252015 -238840 -55909
15518 -192022 10773 134325 136370 161272 -112087 108599 -84302 137075 -43905 2478 63860
15507 63860 249368 258430 -328079 44211 -12526 -228536 -141262 54590 -148764 -244898 116460
$$ packed form
15587a49527L8770B12184a46871A33048a13269J7669A37645E8565b83061J13099
15577a69962f9980h127B842b26197J2703R9997C13525I0586J15681q7274a9024
15565a38137q0513b6070B4142K16448K0369F1738f4477l04703G4198C0272L9963
15554G0235M6889D3207b37910c4372M207l58548A48360k6588a67310A6191a86299
15542F4029c0034F761i6530a666C0378A964f4908E7448a83567B77360b16772P7114
15530a39658n1130g6442k34831A13438d7013j1624H7200e8745B52015b38840e5909
15518a92022A0773J23552K045K4902a12087A08599h4302A37075d3905B478O1382
15507F3860J85508R062c28079D4211a2526k16010Q7274E4590a48764r6134A16460
$$ plain form
15495 -2720 -64390 -46619 -187006 -115498 103942 -101464 143589 14367 -330073 -195944 94799
15483 -254766 -38622 -152895 162071 77688 -237039 73683 -84391 -191418 148226 -141041
15472 -114609 -4948 318281 -216845 -126848 -45652 297046 24189 -130269 72614 -38856 26842
15460 19278 -109902 -1805 301879 202996 61392 -161401 275237 -126581 375693 -363357
15449 199280 -141494 -255005 278260 -121770 45479 -245405 -255630 -11070 -111139 -194117
15439 -194117 -187600 -9963 -104672 -187704 271911 315222 37252 -223990 -169968 -229229 -85797
15427 44759 -128297 -58082 158689 -97602 73219 108651 297948 -29857 -126476 73580 166129
15416 166129 -385844 -213310 -54756 -86835 279472 115848 -35546 -91965 -4698 120611 -23961
$$ packed form
15495b720o1670J7771j40387P1508A03942a01464A43589A4367c30073J34129I4799
15483b54766c8622j14273A62071G7688b37039G3683h4391j07027A48226a41041
15472a14609d948C18281b16845Q9997d5652B97046B4189a30269G2614c8856B6842
15460A9278a09902a805C01879r8883F1392a61401B75237a26581C75693c63357
15449A99280a41494j13511B78260a21770D5479b45405j0225a1070j00069q2978
15439a94117O517i963r4709q3032B71911M3311C7252b23990N4022n9261h5797
15427D4759a28297e8082A58689i7602G3219L5432J89297b9857r6619G3580R2549
15416A66129c85844J72534e4756l2079B79472A15848c5546n6419d698A20611b3961
$$ plain form
15404 201158 36221 -45891 6702 -18855 -231892 208544 -149290 285325 -74234 -240507 102016
15392 462789 377265 97142 19608 -224407 121317 -21132 -17029 223014 455943 -23232 18348
15380 -153816 -40436 875 225977 212801 -164794 -40125 -53332 10559 -66724 36220 -106917
15368 -33832 15316 -152352 -12133 310990 6456 153930 49418 -11778 -280769 -397163 -252238
15357 -252238 204479 -86887 -6671 -330376 248830 -6888 -49667 -37536 134728 -136376 18712
15345 36163 -111242 -40671 -163557 -312148 -166766 26075 438288 257840 -19945 138581
15334 -10731 -67812 85809 -73103 -53514 174999 158582 363964 -179771 -98082 11072 276486
15323 276486 175964 -180355 29139 128903 -254506 -39782 -128144 -145659 -217692 -73969 151043
$$ packed form
15404B01158C6221d5891F702a8855k13037B08544a49290B85325g4234j66273A02016
15392D62789q5524I7142A9608b24407A21317b1132M103B23014K32929b3232A8348
15380a53816d0436H75K25102j3176a64794d0125j3207A0559f6724C6220a06917
15368c3832A5316a52352a2133C10990F456J47474D9418a1778k68991j16394J44925
15357b52238B04479h6887f671l23705B48830f888m2779J2131A34728a36376A8712
15345C6163a11242d0671j22886j48591J45382B6075M12213j80448a9945A38581
15334a0731n7081H5809g3103J9589A74999j6417K05382a79771Q1689A1072K65414
15323B76486j00522a80355B9139R9764b54506c9782q8362j7515p2033g3969A51043
$$ plain form
15311 -137186 -230087 457046 180486 -129605 159105 165529 -152595 45835 60680 83566 208972
15300 208972 63142 224578 198869 158681 -215191 264662 316347 -209256 -48531 -85108 -13445
15288 11586 345330 188183 144407 -139147 216828 64296 17440 40010 8642 34850 20950
15277 20950 66242 284334 -19485 -179241 91071 99250 -131769 176604 -41576 -65726 65433
15265 145722 140047 -323838 -90862 52048 327358 -50941 65461 -72666 177506 -74168 -419589
15254 -419589 309513 182558 242545 78463 189874 458116 495415 1431655 1946472 1181331
15244 1181331 2288306 1857176 584610 322707 95993 148303 396320 69867 -88261 746173
15233 -59421 -102 138612 282159 -127501 87852 -236193 -59300 220112 77738 44272 -215484
$$ packed form
15311a37186r2901D57046A80486a29605A59105O424a52595D5835J4845K2886J25406
15300B08972F3142J61436k5709m0188b15191B64662N1685b09256d8531l6577a3445
15288A1586L33744j57147m3776a39147B16828F4296A7440K2570H642K6208j3900
15277B0950M5292K18092a9485j59756I1071Q179a31769A76604d1576k4150F5433
15265A45722n675c23838i0862E2048K75310e0941F5461g2666A77506g4168l45421
15254d19589C09513j26955N9987G8463J11411K68242L7299R36240N14817p65141
15244A181331J106975m31130E84610k61903I5993N2310K48017F9867h8261G46173
15233e9421a02A38612J43547a27501H7852b36193e9300B20112G7738l3466b15484
$$ plain form
15221 391355 17235 -49736 3411 -10132 3212 245721 135356 140009 135090 -229699 33353 230007
15209 230007 -154602 -157534 -62707 -81432 -18629 -227721 43053 19407 -128230 310268 -96215
15197 -46595 70597 -99331 -171009 304807 223058 79693 392175 40858 -103743 -56727 -15029
15185 -161492 -26293 -46332 -117476 -19569 62037 -163070 258557 213969 492016 383268 173043
15173 -692 243156 272220 77023 -37768 33611 377659 182250 73356 11385 156118 200266
15162 200266 -36300 133300 158689 216354 -144003 -3825 -55747 -146155 -112444 -51778 54224
15150 46387 9455 -103889 -111882 -33762 51382 -67365 122404 117557 292218 -16796 310519
15138 307672 -19212 17948 82364 267865 114392 49742 283134 34144 195099 193763 -74403
$$ packed form
15221C91355A7235d9736C411a0132C212K42509j10365M653m919b29699C3353J96654
15209B30007a54602k932f2707j8725a8629k09092D3053A9407a28230C10268i6215
15197d6595G0597i9331p1678C04807q1749G9693L12482D0858a03743M7016a5029
15185a61492b6293k0039p1144a9569F2037a63070B58557m4588K78047j08748A73043
15173f92B43156K9064G7023c7768C3611L44048A82250G3356A1385J44733M4148
15162B00266c6300A33300K5389N7665a44003c825n1922r0408L3711e1778E4224
15150D6387I455a03889p993c3762E1382f7365A22404m847J74661a6796C10519
15138C07672a9212A7948O4416J85501A14392D9742K33392C4144J60955j336g4403
$$ plain form
15126 192568 -15150 -154541 243545 -42209 249903 228306 267071 645868 -6462 200540 59769
15114 262371 96147 -165551 -20410 -153113 400635 -103610 -123 85988 113458 194495 -2085
15102 -176659 109103 -8595 -31707 623704 86403 -178801 -49970 79320 141830 348899 127244
15090 44733 357525 307510 11181 128147 -69279 -121684 58085 134117 40254 58531 318290
15079 318290 153788 111852 66239 222445 212153 311208 126564 109897 134376 191717 -23228
15067 226348 283239 294477 238058 270330 -84909 -85393 129603 12165 269506 275022 77519 289007
15055 289007 -186029 248990 284557 180426 142326 123614 442077 4967 203637 -138093
15044 225549 264059 420302 142530 -43076 119892 -41793 225557 430703 44254 418086
$$ packed form
15126A92568a5150j39391B43545d2209B49903k1597L8765L78797f462B00540E9769
15114B62371I6147a65551b0410j32703D00635a03610a23H5988K7470Q1037b085
15102a76659A09103h595k3112F23704H6403a78801d9970G9320O2510K07069A27244
15090D4733L12792n0015A1181J16966f9279n2405E8085P6032D0254J8277K59759
15079C18290A53788m1936m5613J56206j0292R9055A26564j6667K4479N7341b3228
15067B26348N6891J1238n6419L2272h4909m84A29603A2165K57341N516G7519K11488
15055B89007a86029B48990L5567j04131l8100j8712L18463D967J98670a38093
15044B25549L8510J56243A42530d3076A19892d1793B25557K05146D4254L73832
$$ plain form
15034 418086 291543 96500 85628 274880 225422 -54427 232232 346909 252435 91531 -4378
15022 18659 461964 11694 267268 99859 407470 420195 255569 425415 157129 592065
15012 592065 426009 275598 216833 331051 207822 12670 333553 122166 235642 186676
15002 186676 277331 521465 254864 494028 238302 49464 231419 520214 205437 215583
14992 215583 351112 318003 283180 297914 159634 198952 426470 136118 44558 -165683
14981 304652 557589 -79425 179020 406550 391563 296423 120435 384106 719302 252889
14970 121456 331655 266898 338033 181304 -88869 4384 343140 454004 42707 218659 164077
14959 164077 323804 288277 168615 246785 133488 166740 320169 88550 235465 495932
$$ packed form
15034D18086j26543I6500j0872J89252m9458e4427B32232J14677r4474I1531d378
15022A8659M43305A1694K55574I9859L07611J2725j64626J69846A57129M34936
15012E92065j66056j50411n8765J14218j23229A2670L20883A22166J13476m8966
15002A86676R0655K44134B54864K39164B38302D9464J81955K88795B05437J0146
14992B15583J35529l3109l4823J4734j38280L9318K27518A36118D4558a65683
14981C04652K52937g9425A79020K27530j4987r5140A20435K63671L35196B52889
14970A21456K10199o4757P1135j56729h8869D384L38756J10864D2707J75952n4582
14959A64077J59727l5527j19662P8170j13297L3252J53429H8550J46915K60467
$$ plain form
14949 495932 454889 160188 351648 2807 363389 295699 24953 339518 435195 414691 305555
14938 305555 43454 291233 441877 380722 -83136 5980 209297 365257 310169 183679 211180
14927 211180 443803 201162 556417 165719 533676 148278 195586 465027 34029 346103
14917 346103 252051 276138 385423 176701 261547 554127 626979 439144 257504 639825
14907 639825 327504 249635 109049 191839 -339003 538072 304607 563203 170479 443144
14897 443144 393675 446939 105658 329239 219168 450903 360914 451048 274123 552629
14887 552629 190555 201148 335320 242436 751559 27172 107956 160562 333269 316513 147790
14875 523150 382903 331843 403085 333591 210081 788304 118707 248344 358849 310725
$$ packed form
14949D95932m1043A60188J91460B807L60582o7690B4953L14565R5677k0504j09136
14938C05555D3454K47779J50644o1155h3136E980K03317J55960n5088j26490K7501
14927B11180K32623B01162L55255A65719L67957A48278M7308K69441C4029L12074
14917C46103r4052K4087J09285A76701Q4846K92580P2852j87835j81640L82321
14907F39825l12321p7869A09049Q2790c39003E38072k33465K58596A70479K72665
14897D43144m9469N3264A05658K23581j10071K31735q9989R0134j76925K78506
14887E52629A90555J0593J34172r2884N09123B7172Q0784N2606J72707j6756A47790
14875E23150j40247n1060P1242o9494j23510N78223A18707J29637J10505m8124
$$ plain form
14865 310725 517044 493531 259686 833695 260275 445344 143445 189033 572403 383805
14855 383805 639019 178444 422231 461451 568138 387904 348444 337422 520244 635836
14845 635836 542797 599975 434924 640856 296180 206066 443017 518190 50615 558998
14835 558998 406326 443839 126918 828630 586897 741775 691032 525053 411084 585081
14825 585081 236315 674071 569838 236943 570008 409395 524386 296888 659280 307040
14814 380941 690014 439385 596781 527351 694677 610727 623706 566679 287141 259756
14804 259756 601052 584346 347979 302863 305025 344929 730749 816666 628381 710836 361299
14793 361299 344954 976401 710773 724432 525763 502014 434748 596510 778520 703106
$$ packed form
14865C10725K06319k3513k33845N74009B60275J85069A43445M5588L83370j88598
14855C83805K55214A78444K43787L9220J06687j80234l9460j1022J82822J15592
14845F35836r3039N7178j65051K05932B96180r0114K36951P5173E0615N08383
14835E58998j52672L7513A26918P01712k41733J54878n0743j65979j13969J73997
14825E85081B36315M37756j04233B36943L33065j60613J14991k27498L62392C07040
14814C80941L09073k50629J57396o9430J67326q3950J2979n7027k79538k7385
14804B59756L41296j6706k36367m5116K162L9904L85820Q5917j88285Q2455l49537
14793C61299j6345O31447k65628J3659j98669k3749o7266J61762J82010p5414
$$ plain form
14783 703106 800268 850996 871982 635258 541673 510781 740342 685586 757089 562425 601933
14772 601933 757475 656983 604923 418531 597724 556507 743821 961345 638886 986113
14762 986113 727643 344137 819988 778937 662068 479921 769508 789932 821646 672588
14752 672588 658524 742926 530484 684678 788241 865605 864026 701840 767936 774040 437856
14741 437856 681353 609098 283105 940738 686053 805938 558418 790505 552711 648098
14731 648098 555804 771921 1001037 906691 920939 662277 665184 624247 892913 1030196 863808
14720 863808 738162 873396 634782 691817 926703 740629 878230 765102 580430 961278
14710 961278 837796 905264 886894 813326 544032 821937 966001 938525 658293 931090
$$ packed form
14783G03106R7162N0728K0986k36724r3585l0892K29561n4756P1503j94664L9508
14772F01933J55542j00492n2060j86392J79193m1217J87314K17524l22459L47227
14762I86113k58470C44137M75851m1051j16869j82147K89587K0424L1714j49058
14752F72588j4064Q4402k12442J54194J03563P7364j579j62186O6096O104l36184
14741D37856K43497p2255B83105O57633k54685J19885k47520K32087k37794R5387
14731F48098r2294K16117K29116r4346J4248k58662K907m0937K68666J37283j66388
14720H63808j25646J35234k38614N7035K34886j86074J37601j13128j84672L80848
14710I61278j23482O7468j8370p3568k69294K77905J44064k7476k80232K72797
$$ plain form
14700 931090 969603 977323 984001 870631 946207 1107091 765604 842074 1153182 1069776 1084154
14689 1084154 849797 992203 748312 745785 1145481 1058533 1329163 837511 952142 1060232
14679 1060232 967550 834050 1487771 1458811 909722 1260157 1203193 1042796 898575 866792
14669 866792 1119465 1027273 1093426 1153910 1288000 1086698 1002977 638798 1239959 1120390
14659 1120390 1435487 1271506 1606569 1461826 1188869 1306162 1412528 1282742 1283748 1273217
14649 1273217 1146773 1393597 1140726 969384 1415633 1436992 1067737 1366946 1193137 1350481
14639 1350481 1358966 1072851 1224646 1198728 1668470 1398160 1409489 1355821 1515243 1123027
14629 1123027 1469340 1427532 1416279 1497811 1269429 1476091 1400556 1436311 1632206 1485666
$$ packed form
14700I31090L8513P720O678j13370P5576J60884l41487P6470L11108q3406J4378
14689A084154k34357J42406k43891k527L99696q6948K70630m91652J14631J08090
14679A060232r2682j33500O53721k8960n49089L50435n6964j60397j44221l1783
14669H66792K52673r2192O6153O0484J34090k01302q3721l64179O01161j19569
14659A120390L15097j63981L35063j44743k72957J17293J06366j29786J006j0531
14649A273217j26444K46824k52871j71342M46249K1359l69255K99209j73809J57344
14639A350481Q485k86115J51795k5918M69742k70310J1329n3668J59422l92216
14629A123027L46313m1808j1253Q1532k28382K06662p5535L5755J95895j46540
$$ plain form
14619 1485666 1450215 1572981 1459635 1538236 1424552 1689146 1582180 1370787 1693745 1463197
14609 1463197 1667058 1527310 1926815 1884202 1839111 1608398 1845524 1569056 2010376 1435580
14599 1435580 2032274 1618895 1640942 2008997 1628580 1833685 1892155 1925057 1944236 2116824
14589 2116824 1658005 1748027 1867191 2150883 1690964 2053128 2082555 2212000 2004391 2020482
14579 2020482 2271160 2232558 2020688 2253795 2114184 2256311 2817380 1799136 2416412
14570 2416412 2103845 2210598 2538943 2681955 2685851 2363949 2853874 2694065 2434688 2293765
14560 2293765 2843427 3075842 3073778 3145348 3525902 3225293 3874594 4016686 4300318 4575228
14550 4575228 5606735 6984745 10822069 19297151 37940389 48636673 23926202 12962757
$$ packed form
14619A485666l5451J22766j13346P8601j13684K64594j06966k11393L22958k30548
14609A463197K03861j39748L99505m2613m5091k30713K37126k76468M41320n74796
14599A435580N96694m13379K2047L68055l80417K05105N8470L2902J9179J72588
14589B116824m58819R0022J19164K83692m59919L62164K9427J29445k07609J6091
14579B020482K50678l8602k11870K33107j39611J42127N61069j018244O17276
14570B416412l12567J06753L28345J43012L896l21902M89925j59809k59377j40923
14560B293765N49662K32415k064P1570L80554l00609O49301J42092K83632K74910
14550D575228J031507J378010L837324Q475082J8643238J0696284B3926202j0963445
$$ plain form
14542 12962757 7864989 3904534 2994771 2321230 2070388 2070484 2015968 2075643 1833007 2109686
14532 2109686 1995627 2180205 2591630 2209568 2452288 2426245 2197785 2567591 2560103 2396405
14522 2396405 2404931 2510644 2304914 2674689 2687670 2557797 2590650 2937355 2707642 2775189
14512 2775189 3018054 2710316 2711839 2948953 2981809 3026981 2995421 3138925 3169819 3289346
14502 3289346 3154938 3105325 3555809 3264524 3214114 3240870 3148599 3631827 3410158 3450775
14492 3450775 3607341 3610339 3087670 3525599 3616069 3880917 3871957 3930069 3774397 3960096
14482 3960096 3971996 4189540 4333471 4130345 4298473 4076905 4340855 4129699 4052053 4350682
14472 4350682 4528326 4657617 4434355 4779499 4653183 4622800 4416847 4593026 4774283 4882435
$$ packed form
14542A2962757n097768C904534r09763o73541k50842R6n4516N9675k42636K76679
14532B109686j14059J84578M11425l82062K42720k6043k28460L69806p488j63698
14522B396405Q526J05713k05730L69775J2981j29873L2853L46705k29713O7547
14512B775189K42865l07738J523K37114L2856M5172l1560J43504L0894J19527
14502C289346j34408m9613M50484k91285n0410K6756r2271M83228k21669M0617
14492C450775J56566K998n22669M37929R0470K64848q960N8112j55672J85699
14482C960096J1900K17544J43931k03126J68128k21568K63950k11156p7646K98629
14472D350682J77644J29291k23262L45144j26316l0383k05953J76179J81257J08152
$$ plain form
14462 4882435 4842146 5005720 5198889 5014080 5062909 5535897 5049681 5366623 5275443 5336484
14452 5336484 5469957 5524272 5748420 5617862 5772689 5744750 5919849 5954142 5889500 6335823
14442 6335823 6322763 6663726 6658475 6454885 6448527 6941225 6816382 6958847 7091228 7333338
14432 7333338 6935994 7172982 7490587 7447737 7729878 7414553 7929095 7755369 7754657 8057167
14422 8057167 8096972 8177957 8037747 8443747 8690046 8824056 9036326 9014569 9233676 9126492
14412 9126492 9188700 9249809 9434800 9736268 10021441 9914145 9921203 10683273 10608905 10985393
14402 10985393 10719970 10640927 10944343 11176468 11193728 11680960 12109231 11958875 12254531 12467201
14392 12467201 12510153 13150708 13363091 13526901 13325642 14098534 13852020 14337455 14564559
$$ packed form
14462D882435m0289J63574J93169j84809M8829M72988m86216L16942r1180O1041
14452E336484J33473N4315K24148j30558J54827k7939J75099L4293o4642M46323
14442F335823j3060L40963n251k03590o358M92698j24843J42465J32381K42110
14432G333338l97344K36988L17605m2850K82141l15325N14542j73726p12L02510
14422H057167L9805Q0985j40210M06000K46299J34010K12270k1757K19107j07184
14412I126492O2208O1109J84991L01468K85173j07296P058P62070p4368L76488
14402A0985393k65423p9043L03416K32125J7260M87232M28271j50356K95656K12670
14392A2467201M2952O40555K12383J63810k01259P72892k46514M85435K27104
$$ plain form
14383 14564559 14689427 15062363 15599901 15375296 15892399 16518896 16512910 16836338 16866458 17596145
14373 17596145 17663558 18681367 18386648 18750329 19377895 19926459 20181974 20515852 21007996
14364 21007996 21349350 21645022 22423201 22400683 23060995 23522110 24217135 24818750 25315506
14355 25315506 25779085 26511745 27287752 27778265 28381094 29284954 29636366 30445502 31414118
14346 31414118 32231980 32968538 33646191 34895083 35743610 36786572 37893053 38517446 39986730
14337 39986730 40867746 42040116 43152704 44595231 45969164 47301339 49011460 50226961
14329 50226961 51614528 53483133 55174749 56796787 58768053 60836783 62931938 64888195
14321 64888195 67482695 69912499 72282304 74943274 77728884 80597819 83759115 87051338
$$ packed form
14383A4564559J24868L72936N37538k24605N17103O26497n986L23428L0120P29687
14373A7596145O7413J017809k94719L63681O27566N48564K55515L33878M92144
14364B1007996L41354K95672P78179k2518O60312M61115O95025O01615M96756
14355B5315506M63579P32660P76007M90513O02829R03860L51412Q09136R68616
14346C1414118Q17862P36558O77653J248892Q48527J042962J106481O24393J469284
14337C9986730Q81016J172370J112588J442527J373933J332175J710121J215501
14329E0226961J387567J868605J691616J622038J971266K068730K095155J956257
14321F4888195K594500K429804K369805K660970K785610K868935L161296L292223
$$ plain form
14313 87051338 90338022 93884024 97679343 101881895 106128155 110734338 115088534 120154723
14305 120154723 125593420 131136626 137214639 143551873 150372146 156966920 164256972 172396877
14297 172396877 180485865 189627302 198579970 208266620 218607984 229336673 240747738
14290 240747738 252835865 265191806 278138945 291576967 305172534 319368582 333960861
14283 333960861 348621033 363410093 377978682 392055270 406227922 419720180 431999648
14276 431999648 443276155 452776624 460722180 466063837 467741401 466495882 465267321 463177587
14268 463177587 456310339 451156101 447017481 438875841 428824016 416664186 403199325
14261 403199325 389166968 374014680 358258698 342647497 327189109 312246032 297310080
$$ packed form
14313H7051338L286684L546002L795319M202552M246260M606183M354196N066189
14305A20154723N438697N543206O078013O337234O820273O594774P290052Q139905
14297A72396877Q088988R141437Q952668R686650J0341364J0728689J1411065
14290B40747738J2088127J2355941J2947139J3438022J3595567J4196048J4592279
14283C33960861J4660172J4789060J4568589J4076588J4172652J3492258J2279468
14276D31999648J1276507R500469P945556N341657J677564j245519j228561k089734
14268D63177587o867248n154238m138620q141640j0051825j2159830j3464861
14261D03199325j4032357j5152288j5755982j5611201j5458388j4943077j4935952
$$ plain form
14254 297310080 282808444 270356287 257691835 244819556 232819162 221603238 210841063
14247 210841063 200755350 190942766 182316796 173865738 165805830 158220629 150679111 143820701
14239 143820701 137608671 131931664 126456680 120936356 115430334 110974587 106398351 102534235
14231 102534235 98562783 94706052 90822633 87591133 83865673 80835667 78161279 75290744
14223 75290744 72428908 70069873 67500458 65387976 63290110 61358830 59126752 57135874
14215 57135874 55285093 53955846 52522062 50757223 49119037 47544267 46317451 45254082
14207 45254082 44228010 43360612 41857954 40682339 39196991 38395001 37297262 36678417
14199 36678417 35845340 34615260 33897110 32833266 31859407 31150697 30570655 29830384 29224122
$$ packed form
14254B97310080j4501636j2452157j2664452j2872279j2000394j1215924j0762175
14247B10841063j0085713r812584q625970q451058q059908p585201p541518o858410
14239A43820701o212030n677007n474984n520324n506022m455747m576236l864116
14231A02534235l971452l856731l883419l231500l725460l030006k674388k870535
14223G5290744k861836k359035k569415k112482k097866j931280k232078j990878
14215E7135874j850781j329247j433784j764839j638186j574770j226816j063369
14207D5254082j026072q67398j502658j175615j485348q01990j097739o18845
14199C6678417q33077j230080p18150j063844r73859p08710n80042p40271o06262
$$ plain form
14190 29224122 28240477 27705073 27146270 26291538 25632451 25284916 24352317 23968133 23571408
14181 23571408 22920280 22393739 21877751 21623116 21187862 20862995 20193868 20138725 19555513
14172 19555513 19298701 18806318 18131537 18138000 17725404 17338692 16895670 16460552 16648377 16252490
14162 16252490 15910124 15787035 15333363 15081700 14760076 14491517 14470427 14129139 13719078
14153 13719078 13249087 13324882 13077728 12893458 12638297 12386052 12121181 11940121 11849462 11877583
14143 11877583 11400350 11673468 11260404 11008265 10666658 10735631 10593893 10416260 10333565 10146821
14133 10146821 9726421 9713073 9549099 9450602 9878727 9371030 9003430 9156270 9082757 9173367
14123 9173367 8914225 8552080 8332226 8576507 7941487 8320147 7943552 8239794 7707975
$$ packed form
14190B9224122r83645n35404n58803q54732o59087l47535r32599l84184l96725
14181B3571408o51128n26541n15988k54635m35254l24867o69127n5143n83212
14172A9555513k56812m92383o74781O463m12596l86712m43022m35118J87825l95887
14162A6252490l42366j23089m53672k51663l21624k68559k1090l41288m10061
14153A3719078m69991P5795k47154j84270k55161k52245k64871j81060r0659K8121
14143A1877583m77233K73118m13064k52139l41607O8973j41738j77633q2695j86744
14133A0146821m20400j3348j63974r8497M28125n07697l67600J52840p3513R0610
14123I173367k59142l62145k19854K44281o35020L78660l76595K96242n31819
$$ plain form
14114 7707975 7915097 7633349 7683356 7517716 7252622 7221882 7013589 7456217 7004473 7117029
14104 7117029 6921045 7011570 6265049 6589479 6456692 6459506 6213933 6330645 5947477 5929053
14094 5929053 6139070 6151514 5967758 5993271 5922983 6094021 5533618 5607151 5875923 5530200
14084 5530200 5621400 5335743 5561606 5124480 5298031 5089086 4825807 5375425 5267088 4883271
14074 4883271 4657108 4837218 4730472 4849426 4634545 4794424 4706469 4550788 4507734 4434225
14064 4434225 4477060 4394215 4296207 4456835 4354336 4619111 4188960 4441985 4063970 4050698
14054 4050698 3908580 3766322 3981528 3930357 4102819 4004840 3753685 4127719 3719777 3698080
14044 3698080 3559952 3563779 3849779 3614191 3463527 3181568 3407106 3489907 2935618 3313040
$$ packed form
14114G707975K07122k81748N0007j65640k65094l0740k08293M42628m51744J12556
14104G117029j95984R0525p46521L24430j32787K814k45573J16712l83168j8424
14094E929053K10017J2444j83756K5513p0288J71038n60403P3533K68772l45723
14084E530200R1200k85657K25863m37126J73551k08945k63279N49618j08337l83817
14074D883271k26163J80110j06746J18954k14881J59879q7955j55681m3054p3509
14064D434225M2835q2845r8008J60628j02499K64775m30151K53025l78015j3272
14054D050698j42118j42258K15206n1171J72462r7979k51155L74034m07942k1697
14044C698080j38128L827K86000k35588j50664k81959K25538Q2801n54289L77422
$$ plain form
14034 3313040 3421791 3537271 3213671 3699793 3071080 3386744 3336728 3089745 3113323 3062499
14024 3062499 3066155 2976349 2953715 3094967 3257275 2979932 2850465 3036731 2797898 2966815
14014 2966815 2523322 2561367 2764261 2658649 2990534 2616083 2355550 2521564 2457967 2689553
14004 2689553 2388463 2341099 2697008 2573810 2187777 2313409 1956220 2091648 2251729 1948297
13994 1948297 2619951 2233430 2600936 2346755 2288180 3205678 5586737 11384090 28641574
13985 28641574 50072106 30944470 16613745 9761681 6908358 5211500 4129129 3663578
13977 3663578 3728684 3484941 3109162 3103561 2924792 2557281 2880531 2613403 2835321 2776208
13967 2776208 2474483 2509228 2558002 2466590 2352632 2570821 2042247 2252541 2245384 2127716
$$ packed form
14034C313040J08751J15480l23600M86122o28713L15664n0016k46983K3578n0824
14024C062499L656q9806k2634J41252J62308k77343j29467J86266k38833J68917
14014B966815m43493L8045K02894j05612L31885l74451k60533J66014o3597K31586
14004B689553l01090m7364L55909j23198l86033J25632l57189J35428J60081l03432
13994A948297O71654l86521L67506k54181n8575R17498K381059N797353J7257484
13985B8641574K1430532j9127636j4330725o852064k853323j696858j082371m65551
13977C663578O5106k43743l75779n601j78769l67511L23250k67128K21918n9113
13967B776208l01725L4745M8774r1412j13958K18189n28574K10294p157j17668
$$ plain form
13957 2127716 2283943 2026590 2068619 1987936 2303657 2357309 1979461 2531289 2242318 2220324
13947 2220324 2276648 1981591 2069617 2208978 2371420 2036450 2059754 1946579 1708939 1984160
13937 1984160 2062717 1894786 1869590 1933967 2033434 1765241 1625673 1814086 1767218 1551366
13927 1551366 1706460 1980655 1881010 1988372 1794318 1871849 1482614 1611551 1875136 1608090
13917 1608090 1718665 1698092 1549414 1652116 1827447 1721269 1813336 1568271 1458360 1397643
13907 1397643 1768168 1604187 1335141 1664459 1408004 1442855 1339902 1810217 1551585 1318853
13897 1318853 1580157 1636646 1607807 1223044 1357585 1312878 1452450 1359068 1286398 870214
13887 870214 1289765 1392777 1211022 1166873 1617416 1415295 1063395 1073373 1407500 1309513
$$ packed form
13957B127716J56227k57353M2029q0683L15721N3652l77848N51828k88971k1994
13947B220324N6324k95057Q8026J39361J62442l34970K3304j13175k37640K75221
13937A984160P8557j67931k5196O4377R9467k68193j39568J88413m6868k15852
13927A551366J55094K74195r9645J07362j94054P7531l89235J28937K63585k67046
13917A608090J10575k0573j48678J02702J75331j06178R2067k45065j09911o0717
13907A397643L70525j63981k69046L29318k56455L4851j02953M70315k58632k32732
13897A318853K61304N6489k8839l84763J34541m4707J39572r3382p2670m16184
13887H70214M19551J03012j81755m4149M50543k02121l51900R978L34127r7987
$$ plain form
13877 1309513 1146465 1425590 1213516 1191864 1014393 1391153 1189778 1119671 932346 1104850
13867 1104850 1485380 1005542 1079978 1249368 1046886 1225050 1467345 1110378 891864 890769
13857 890769 1119616 1068676 1575907 1014666 1125514 1236132 952218 1342433 1377193 1006652
13847 1006652 1202287 910374 1167794 980446 871771 885346 1038689 931745 710807 1242562
13837 1242562 1214602 1272023 1084267 1056431 1299897 693621 1040725 1094555 887298 1111906
13827 1111906 880408 938663 1037291 771427 935887 1024858 1077456 1105384 734129 1097989
13817 1097989 431892 1470667 1221319 818067 746916 1093337 771876 761619 705244 779279
13807 779279 1114390 892228 828628 882207 1005651 804531 845184 661388 481957 946930
$$ packed form
13877A309513j63048K79125k12074k1652j77471L76760k01375p0107j87325J72504
13867A104850L80530m79838P4436J69390k02482J78164K42295l56967k18514j095
13857H90769K28847n0940N07231n61241J10848J10618k83914L90215L4760l70541
13847A006652J95635k91913K57420j87348j08675J3575J53343j06944k20938N31755
13837A242562k7960N7421j87756k7836K43466o06276L47104N3830k07257K24608
13827A111906k31498N8255R8628k65864J64460Q8971N2598K7928l71255L63860
13817A097989D31892J038775k49348m03252p1151L46421l21461j0257n6375P4035
13807G79279L35111k22162o3600N3579J23444k01120M0653j83796j79431M64973
$$ plain form
13797 946930 1142158 822933 707717 834434 896771 632326 573753 931407 1051474 743924
13787 743924 747952 843402 1049084 567770 856761 564310 817647 732446 1067564 780543
13777 780543 725483 979705 601289 689558 982544 1023203 883123 700834 558085 678333
13767 678333 835943 1095251 1039242 934005 903549 908347 1003811 694810 730781 766688 437200
13756 437200 669381 644340 885189 842878 880517 536099 843414 823172 639250 614156
13746 614156 711730 590286 543650 469055 892465 769105 506594 807114 454803 456821
13736 456821 973351 481442 615026 858762 675944 595366 692152 580623 662360 608668
13726 608668 884933 806477 351444 317471 843486 494928 787354 736220 774458 485904
$$ packed form
13797I46930J95228l19225j15216J26717O2337k64445n8573L57654J20067l07550
13787G43924M028R5450K05682m81314K88991k92451K53337q5201L35118k87021
13777G80543n5060K54222l78416Q8269K92986M0659j40080j82289j42749J20248
13767F78333J57610K59308n6009j05237l0456M798R5464l09001L5971L5907l29488
13756D37200K32181k5041K40849m2311L7639l44418L07315k0242j83922k5094
13746F14156R7574j21444m6636p4595M23410j23360k62511L00520l52311K018
13736D56821N16530D81442J33584K43736j82818q0578R6786j11529Q1737n3692
13726F08668K76265p8456C51444l3973N26015l48558K92426n1134L8238k88554
$$ plain form
13716 485904 507027 633247 561545 479791 367064 702766 210219 599241 585039 590068 561834
13705 561834 295310 941943 534975 591588 330145 628176 787647 634631 478881 577364
13695 577364 660304 665124 412260 458390 625150 257842 712017 380003 686734 477257
13685 477257 406628 725366 637834 379480 716282 505348 524109 490095 762551 644547
13675 644547 343406 453203 515584 337697 337303 440055 598721 227341 360715 785096
13665 785096 337996 440931 279811 530845 327935 512785 185103 385151 403872 761440
13655 761440 567240 552800 401679 565484 428043 544779 321908 355676 278643 466158
13645 466158 341226 509499 448484 627636 556928 287804 546536 566521 755059 734325
$$ packed form
13716D85904K1123J26220p1702q1754j12727L35702B10219L89022j4202N029k8234
13705E61834k66524O46633m06968N6613k61443K98031J59471j53016j55750R8483
13695E77364Q2940M820k52864M6130J66760B57842M54175l32014L06731k09477
13685D77257p0629L18738q7532k58354L36802k10934J8761l4014K72456j18004
13675F44547l01141J09797O2381j77887l94J02752J58666B27341J33374M24381
13665G85096C37996J02935j61120K51034k02910J84850A85103K00048J8721L57568
13655G61440j94200j4440j51121J63805j37441J16736k22871L3768p7033J87515
13645D66158j24932J68273o1015J79152p0708k69124K58732J9985J88538k0734
$$ plain form
13635 734325 327289 289264 482034 593153 458657 571990 1033138 514065 481538 649248
13625 649248 443477 436027 394169 478379 343922 534402 630197 328194 358351 439246 324964
13614 324964 326775 778784 575328 209159 322360 550485 581086 417109 383445 151628
13603 324548 640106 326797 290214 261147 496201 667865 414431 107913 511176 595872
13593 595872 427958 246101 438551 379391 185290 237758 485910 408796 178022 313711
13583 313711 6143 548878 228431 14334 192634 234256 278477 407217 587795 541150 600849
13572 600849 415000 500489 299905 227496 -71392 165886 206562 290932 461796 259084
13562 259084 357580 363435 232726 258957 747500 395845 278335 294260 75657 194921 544583
$$ packed form
13635G34325C27289l8025J92770J11119j34496J13333M61148E14065l2527J67710
13625F49248k05771p450m1858Q4210j34457J90480R5795l02003L0157Q0895j14282
13614C24964J811M52009k03456B09159J13201K28125L0601j63977l3664A51628
13603C24548L15558l13309l6583k9067K35054J71664k53434A07913M03263Q4696
13593E95872j67914j81857J92450n9160A85290N2468K48152p7114A78022J35689
13583C13711F143N42735B28431A4334J78300M1622M4221J28740J80578m6645N9699
13572F00849j85849Q5489k00584p2409g1392A65886M0676Q4370J70864k02712
13562B59084R8496N855j30709K6231M88543l51655j17510J5925G5657J19264L49662
$$ plain form
13551 544583 499751 295562 187653 296378 120981 432841 298870 457352 231216 387929
13541 387929 437818 164448 497214 173376 351233 675215 395550 156469 63313 457453
13531 457453 290353 238637 264529 236441 314811 276730 468522 379071 -112758 254193 345787
13520 345787 259082 452902 50494 401011 169242 470375 232048 587059 247705 287218
13510 287218 320838 358580 484113 291809 221944 264839 416627 67791 -8535 10328 81519
13499 81519 248240 318324 537395 471310 456643 274851 207668 7129 454093 296655 352837
13488 352837 531427 -157316 13729 249153 432937 456432 318221 658502 344854 95620
13477 459342 279450 616136 215908 217614 342827 95017 456791 404203 83509 259648
$$ packed form
13551E44583m4832k04189j07909J08725A20981L11860j33971J58482k26136J56713
13541C87929M9889A64448L32766A73376J77857L23982k79665A56469F3313L94140
13531D57453j67100n1716K5892k8088P8370l8081J91792q9451a12758B54193R1594
13520C45787q6705J93820E0494L50517A69242L01133B32048L55011B47705L9513
13510B87218L3620L7742J25533j92304o9865M2895J51788F7791h535A0328P1191
13499H1519J66721P0084K19071o6085j4667j81792o7183G129M46964j57438N6182
13488C52837J78590a57316A3729K35424J83784K3495j38211L40281l13648I5620
13477D59342j79892L36686B15908J706J25213I5017L61774n2588H3509J76139
$$ plain form
13467 259648 360838 175276 9650 255675 189588 164788 18313 378651 246672 325907 265860
13456 265860 219212 175370 137047 492491 -73028 190779 596711 92228 347594 107486
13445 430540 256454 -62760 185987 288814 92947 480675 439583 -104033 138040 160220
13435 160220 236778 100009 -21704 2982 100659 314362 397908 537664 -749 -19601 104138
13423 397189 328080 206806 413546 292700 48431 252704 306390 371274 153800 218177
13413 218177 293112 36020 208191 251725 185683 70438 164363 201349 294348 127495 199223
13402 199223 285862 111371 73855 35377 166827 469209 50253 446872 -91510 308413
13391 621357 273330 224038 113338 320329 92730 -45768 106799 50071 310674 620987
$$ packed form
13467B59648J01190A75276I650K46025o6087k4800A8313L60338j31979P9235o0047
13456B65860m6648m3842l8323L55444g3028A90779M05932I2228K55366A07486
13445D30540j74086f2760A85987J02827I2947L87728m1092a04033A38040K2180
13435A60220P6558A00009b1704B982R7677K13703Q3546J39756g49j8852A04138
13423C97189o9109j21274K06740j20846D8431K04273N3686O4884A53800O4377
13413B18177P4935C6020J72171M3534o6042G0438R3925L6986R2999A27495P1728
13402A99223Q6639A11371l7516C5377J31450L02382E0253L96619i1510C08413
13391F21357B73330m9292j10700K06991I2730d5768A06799E0071K60603L10313
$$ plain form
13381 620987 -28699 318409 328222 9103 99742 -237222 131299 358093 42106 438287 353873
13370 353873 207647 134963 125011 67699 324152 146636 250889 -95787 233041 -47625 -169517
13359 -169517 378475 126857 168394 155977 133390 318947 125870 370851 189095 323899
13349 323899 193487 345227 8157 282460 470898 478462 71863 187679 274830 141700 341404
13338 341404 535932 205346 297986 143343 253432 267710 32455 373180 131504 136202
13328 136202 229558 429995 341711 69268 141294 469987 29580 310116 503955 303458
13318 303458 543149 382694 294238 255314 186226 91462 -19788 330864 41396 84282 129252
13307 129252 416239 420267 320388 188603 124102 -7210 325298 185915 -288 283062 303499
$$ packed form
13381F20987b8699C18409R813I103R0639b37222A31299K26794D2106L96181q4414
13370C53873j46226p2684r952n7312K56453A46636J04253i5787B33041d7625j21892
13359a69517C78475A26857M1537j2417k2587J85557A25870K44981j81756J34804
13349C23899j30412J51740H157K74303J88438P564G1863J15816Q7151j33130J99704
13338C41404J94528B05346R2640A43343J10089J4278C2455L40725A31504M698
13328A36202R3356K00437q8284F9268P2026L28693B9580K80536J93839k00497
13318C03458K39691j60455q8456l8924o9088I1462a9788C30864D1396M2886M4970
13307A29252K86987M028r9879j31785o4501g210C25298j39383b88B83062K0437
$$ plain form
13296 303499 297652 67199 -315173 -18543 208400 -58976 198801 379457 144079 -129308
13285 124359 353566 65422 231121 -47149 423285 -154577 177365 171063 217472 164358 -170502
13273 -111384 347979 191641 349879 134836 126661 356649 222238 -27615 194218 104354
13263 104354 325824 91784 235104 524292 247933 583690 101529 334236 186551 93939
13253 93939 246027 35106 122106 -156544 336903 -11187 -61767 192998 228257 -64807 228491
13241 -89036 -39530 395727 43341 338031 103581 -130342 239565 43072 228516 -40752
13230 -44324 245872 -46084 65619 292326 475008 128526 -250292 237364 -7535 141731
13219 191387 266419 288004 -180833 235263 309051 91418 121618 -175384 34412 623 169091
$$ packed form
13296C03499n847F7199c15173a8543B08400e8976A98801J80656A44079a29308
13285A24359K29207F5422J65699d7149D23285a54577A77365o302M6409n3114a70502
13273a11384C47979j56338J58238A34836q175K29988j34411b7615A94218q9864
13263A04354K21470I1784J43320K89188B47933L35757A01529K32707j47685r2612
13253I3939J52088C5106Q7000a56544C36903a1187n0580A92998L5259f4807B28491
13241h9036c9530C95727D3341K94690A03581a30342B39565D3072J85444d0752
13230d4324B45872d6084F5619K26707J82682A28526b50292B37364g535A41731
13219A91387P5032K1585a80833B35263P3788I1418L0200a75384C4412F23J68468
$$ plain form
13208 169091 181789 42776 -51328 15576 138705 190248 58359 -139759 337680 85072 232156
13197 232156 163892 270134 -288475 267980 -46384 157619 59670 49090 126554 -143039
13186 164522 8403 8173 425396 43697 -52278 -41057 -239866 7927 -33595 257231 175889 -194350
13173 100580 -140120 110406 132514 128756 77908 -233640 -114547 258414 105721 -33023
13162 -26616 -29050 57455 -197717 219414 270633 -170196 30875 200627 144047 57829 -232988
13150 72634 86492 122076 54252 -244383 221777 -75407 189282 -44130 -61725 111906 290041
13139 290041 14381 -207985 -204831 136394 187976 183802 -325756 187366 40956 168013 24269
13127 76936 317980 200516 499647 -273670 184828 130760 -36736 308952 -121523 501422
$$ packed form
13208A69091J2698D2776e1328A5576J23129N1543E8359a39759C37680H5072J47084
13197B32156o8264J06242b88475B67980d6384A57619E9670j0580P7464a43039
13186A64522H403k30M17223D3697e2278J1221j98809G927c3595B57231q1342a94350
13173A00580a40120A10406K2108l758n0848b33640a14547B58414A05721c3023
13162b6616k434E7455a97717B19414N1219a70196C0875J69752n6580E7829b32988
13150G2634J3858L5584E4252b44383B21777g5407A89282d4130j7595A11906J78135
13139B90041A4381b07985L154A36394N1582m174c25756A87366D0956J27057B4269
13127G6936K41044j17464K99131b73670A84828n4068c6736C08952a21523E01422
$$ plain form
13116 294840 186589 244628 271968 -16842 -232923 -53694 207266 -34286 334635 102860
13105 115657 225841 488436 108130 182799 -4271 31212 -49469 -301982 41720 22534 53048
13094 53048 233836 -46627 -45907 197827 176645 62557 123185 -20705 -24846 -80879 -100598 -120375
13082 -120375 443608 17406 -30223 -12993 215078 148218 -48616 239211 -150183 -41311 90476
13070 -23554 14035 154910 234405 -214243 251036 130041 176398 106859 163936 259244 10734
13058 -14883 142155 -4062 -195970 213428 -286622 257495 141926 158484 124441 210442 -132183
13046 48362 32724 110852 277494 68680 -9896 -87958 220643 74691 -166292 196018 50505
13034 423129 338434 128665 208567 280202 345281 -111286 6359 477553 55077 221350 216579
$$ packed form
13116B94840j08251N8039K7340a6842k16081e3694B07266c4286C34635A02860
13105A15657J10184K62595A08130P4669d271C1212d9469k52513D1720j9186L0514
13094E3048J80788d6627P20A97827k1182F2557O0628b0705m141n6033j9719j9777
13082a20375D43608A7406c0223a2993B15078o6860d8616B39211a50183d1311I0476
13070b3554A4035J40875P9495b14243B51036j20995M6357o9539N7077R5308A0734
13058a4883A42155d062j91908B13428b86622B57495j15569J6558l4043Q6001a32183
13046D8362j5638P8128J66642F8680i896p8062B20643G4691a66292A96018E0505
13034D23129q4695A28665P9902P1635O5079a11286F359M71194E5077J66273m771
$$ plain form
13023 216579 197246 159941 44688 175943 85869 48014 -155410 135344 197519 105282 -182984
13011 201961 51706 -102644 588935 131067 -277377 335922 74152 153065 -55526 -78357
13001 -78357 54199 -26166 189988 -81954 273823 224867 -162056 70056 57364 35039 160886
12990 160886 -9920 211111 198113 250766 388415 17899 2381 162910 -144118 63180 -162782
12978 372582 108303 82080 346371 47212 174865 487670 230952 246053 155299 -88991
12967 -75218 126465 75111 246535 105068 119823 284455 -240480 -26311 -15356 -98104 -274134
12956 -274134 12170 112111 -126209 151661 234799 85828 -5182 127418 411885 -98471 -3078
12944 -90647 12115 -20100 135107 49874 128021 25862 179028 -377861 377249 -159800 65376
$$ packed form
13023B16579j9333l7305D4688J31255H5869l7855a55410A35344O2175r2237a82984
13011B01961E1706a02644E88935A31067b77377C35922G4152P8913e5526k2831
13001g8357E4199b6166A89988h1954B73823m8956a62056G0056j2692k2325J25847
12990A60886i920B11111j2998N2653J37649A7899B381J60529a44118F3180a62782
12978C72582A08303k6223K64291D7212J27653L12805B30952J5101r0754h8991
12967g5218A26465n1354J71424A05068J4755J64632b40480b6311J0955q2748j76030
12956b74134A2170R9941a26209A51661Q3138H5828e182A27418K84467i8471c078
12944i0647A2115b0100A35107D9874P8147B5862J53166c77861C77249a59800F5376
$$ plain form
12932 -34650 -57136 129000 64671 99035 -38639 277012 27566 47477 -182617 10923 -139831
12920 220989 89824 -1298 -236562 161052 7675 -17546 101627 18454 205720 -142623 180672
12908 -221762 -196566 75288 -294015 -65327 -133437 184368 -424747 126095 34998 -154206
12897 290723 -31582 279450 -201901 87428 149140 -97539 69411 -171823 143321 146606 188358
12886 188358 11490 78186 268009 194429 143786 -163711 444197 -170655 224817 -99862
12875 44359 187693 -54643 70600 -61535 -6355 -78225 9405 -412528 193812 217398 322773
12864 322773 30353 -160402 159755 161907 -2600 154006 -38092 -47352 103807 1855 85806
12853 85806 -240280 -152490 271978 -118214 41153 113355 129090 569048 10490 -147823 42740
$$ packed form
12932c4650k2486A29000o4329L4364c8639B77012B7566J9911a82617A0923a39831
12920B20989H9824a298k35264A61052G675a7546A01627A8454J87266a42623A80672
12908b21762K5196G5288b94015f5327o8110A84368d24747A26095C4998a54206
12897B90723c1582B79450b01901H7428O1712i7539F9411a71823A43321L285M1752
12886A88358A1490O6696J89823p3580n0643a63711D44197a70655B24817i9862
12875D4359J43334e4643G0600f1535f355p1870I405d12528A93812K3586J05375
12864C22773C0353a60402A59755K152b600A54006c8092r260A03807A855Q3951
12853H5806b40280Q7790B71978a18214D1153P2202J5735M39958A0490a47823D2740
$$ plain form
12841 98543 61513 419371 203396 20484 214677 -176320 -94568 -179185 -252229 55405 160366
12830 160366 140334 26598 -56102 -158150 72818 337706 70203 -120671 124202 93673 157886
12819 157886 -60662 130122 211487 -93334 -21434 542502 -184061 -167004 -43706 -31797 -50895
12808 -50895 248725 -229018 -261046 -271231 60499 -67509 45034 153638 -73466 231828 -84480
12796 -39459 -58044 136939 -161104 256513 42223 -136883 69514 151052 -33457 -27525 195058
12784 -62624 7525 59372 -84735 99000 123635 172112 169054 200179 41507 203475 -197428 91310
12771 -257893 -125483 186493 78014 16755 102643 -1014 -89760 -116333 103578 127536 273529
12760 273529 414715 224548 43840 277360 185719 176001 -111649 117910 197402 45598 8252
$$ packed form
12841I8543l7030L57858B03396B0484J94193a76320Q1752q4617p3044E5405J04961
12830A60366k0032B6598e6102j02048G2818K64888G0203a20671A24202l0529O4213
12819A57886f0662A30122Q1365i3334b1434E42502a84061J7057d3706J1909j9098
12808e0895B48725b29018l2028j0185F0499f7509D5034J08604g3466B31828h4480
12796c9459j8585A36939a61104B56513D2223a36883F9514Q1538c3457N932A95058
12784f2624G525N1847h4735I9000K4635M8477l058L1125D1507J61968a97428I1310
12771b57893a25483A86493G8014A6755Q5888a014q8746k6573A03578K3958J45993
12760B73529J41186j90167D3840K33520r1641r718a11649A17910P9492D5598H252
$$ plain form
12748 56217 -88907 148033 31593 374347 -204716 -183685 123375 41886 170252 161187 297035
12737 297035 -75920 -148677 -5692 222362 -99543 76285 16641 -188002 221195 -168946 -556141
12726 -556141 66352 -27903 100551 -76776 -210200 -266398 17590 -40070 170235 235192 13874
12714 206397 -61384 5375 -26604 156024 27566 -77166 283887 348694 209544 327407 245327
12703 245327 35198 324201 472383 259172 -184174 -17347 -7901 -113546 76733 303859
12693 303859 30330 41623 -53426 -68748 -79001 202288 -194001 99496 19795 215684 -9235
12681 565415 81092 558 97986 96833 375799 387825 137918 81923 94775 161124 -25599 -108313
12669 -108313 -36285 134566 389512 188015 173111 -163793 -1494 185185 28847 -134759
$$ packed form
12748E6217h8907A48033C1593L42754b04716K1031A23375D1886J28366r065J35848
12737B97035g5920p2757e692B22362i9543G6285A6641a88002B21195a68946l87195
12726e56141F6352b7903A00551g6776j33424n6198A7590d0070A70235O4957A3874
12714B06397f1384E375b6604A56024B7566g7166B83887O4807j39150J17863q2080
12703B45327C5198K89003J48182k13211a84174a7347g901j05645G6733K27126
12693C03859C0330J1293e3426j5322j0253B02288a94001I9496A9795J95889i235
12681E65415H1092E58R7428j153K78966J2026A37918n5995J2852O6349b5599q2714
12669a08313c6285A34566K54946A88015j4904a63793a494A85185B8847a34759
$$ plain form
12658 -49833 -11149 98729 -18032 -114262 -193598 35959 202554 -72385 120815 -82436 -28314
12646 -1498 108924 378894 169227 -289950 181043 57600 110973 -164044 135640 31855
12635 121436 149183 98488 383479 -145624 105354 415480 266957 178611 26830 476738
12625 476738 90757 -7240 126508 457672 84162 231590 146126 206248 239462 134770 67508
12614 67508 -59497 87930 166558 -24054 -220685 -261140 -120821 25810 -51788 371989 144812
12602 -180227 193549 200249 353266 129701 -154565 418951 172031 -106029 -54447 -109127
12592 -109127 159340 700026 99243 -64329 -207581 147883 -85675 -80296 -182995 65239 179593
12581 179593 111575 97989 -127147 -345326 21937 -45611 -90357 -132415 -97680 -321862 86677
$$ packed form
12658d9833a1149I8729a8032r6230p9336C5959J66595g2385A20815h2436b8314
12646a498A08924K69970A69227b89950A81043E7600N3373a64044A35640C1855
12635A21436K7747n0695K84991a45624A05354L10126j48523q8346B6830M49908
12625D76738I0757g240A26508L31164H4162J47428q5464O0122L3214j04692o7262
12614F7508e9497H7930P8628b4054j96631m0455a20821B5810e1788C71989A44812
12602a80227A93549O700J53017A29701a54565D18951A72031a06029N1582n4680
12592a09127A59340N40686I9243f4329j43252A47883h5675N379j02699F5239J14354
12581A79593o8018j3586a27147k18179B1937d5611m4746m2058L4735k24182H6677
$$ plain form
12569 226190 109808 8226 -56610 -207028 -87497 198310 -12804 139236 97911 56830 191514
12558 191514 -171634 -326849 -146170 120314 -55085 7902 138245 -285007 211036 239797
12548 239797 108770 190129 -6194 173874 -74642 -66199 118409 70963 127934 14468 -131960
12536 86521 225390 77247 11020 280122 263870 1048 44377 -371940 -1506 -41715 52353
12524 280200 -41508 321963 73302 307255 121300 172618 -333172 221171 -52378 183600
12513 -153132 -278804 59250 -5742 -114481 67002 -42744 -161706 -211142 3741 88252 120669
12502 120669 -148027 335939 -18716 97211 -11175 40640 180562 202001 182525 189789 -119564
12490 -76650 54995 35973 -3527 52247 188743 31336 -183727 -316007 -46840 250523 40125
$$ packed form
12569B26190A09808H226e6610j50418h7497A98310a2804A39236m1325m1081J34684
12558A91514a71634j55215a46170A20314e5085G902J30343b85007B11036K8761
12548B39797A08770Q1359f194A73874g4642Q443A18409m7446N6971A4468a31960
12536H6521J38869G7247A1020K69102j6252A048M3329c71940a506m0209E2353
12524B80200d1508C21963G3302K33953A21300N1318c33172B21171e2378A83600
12513a53132j25672E9250e742j08739F7002d2744j18962m9436C741Q4511L2417
12502A20669a48027C35939a8716I7211a1175D0640J39922K1439j9476P264a19564
12490g6650E4995j9022c527E2247J36496C1336a83727j32280d6840B50523D0125
$$ plain form
12478 -10421 -92577 -148822 12989 343641 11141 389949 238434 -133528 -46965 205935 44314
12466 225141 76235 262709 65323 56766 84537 116218 -185695 9701 128636 -52921 58043
12454 -37454 343448 147646 -225870 -140772 200965 -95154 31161 331012 73865 -21830 -41181
12443 -41181 27252 168349 -243480 -37207 147639 42576 -166050 103463 -24283 -116190 54038
12431 -131560 -184114 -245960 -93820 2652 -125457 111609 173031 20480 -7452 342487 268817
12420 268817 44083 -56612 -146394 5322 -154218 -80000 -75831 1912 -247013 106137 117839
12409 117839 -353 179343 315520 71003 18245 -176242 -93727 136382 -267305 63020 24145
12397 -212837 -297167 -4841 124161 -286767 -248283 -249125 241065 187234 7337 -68979 160763
$$ packed form
12478a0421q2156n6245A2989L30652A1141L78808j51515a33528d6965B05935D4314
12466B25141G6235J86474F5323q557K7771L1681a85695I701J18935e2921E8043
12454c7454C43448A47646b25870Q5098B00965i5154C1161K99851G3865b1830j9351
12443d1181B7252J41097b43480c7207A47639D2576a66050A03463b4283r1907E4038
12431a31560n2554o1846i3820B652a25457A11609O1422B0480g452C42487p3670
12420B68817D4083e6612q9782E322a54218P4218M169A912b47013A06137J1702
12409A17839c53A79343J36177G1003A8245a76242Q2515A36382b67305F3020B4145
12397b12837q4330d841A24161b86767L8484q42B41065n3831G337f8979A60763
$$ plain form
12385 140016 395896 47886 160622 2308 -77770 239383 -297026 289569 -172081 88757
12374 -131508 142768 71007 80462 386469 210941 72624 -109348 -148533 25342 202142 -75953
12362 79589 90337 444087 -17194 -441332 10536 -197235 -69788 214748 257299 145000 -86177
12350 316489 54492 -114768 53480 128697 -36093 45880 -77936 122637 -26968 416033 50096
12338 153631 44609 -86983 -246938 152614 123960 242458 -145986 -110129 -87430 138902
12327 -198134 58827 96505 77419 45356 -162732 -254550 -64156 233362 -190464 55295 143225
12316 143225 -492713 -46810 -7663 -198424 -23716 -165782 -126079 213909 90281 288898 113023
12304 -65624 -251937 249162 -275150 -34458 60011 51567 108499 -300447 269920 3354 106904
$$ packed form
12385A40016K55880D7886J12736B308g7770B39383b97026B89569a72081H8757
12374a31508A42768G1007R455L06007j75528G2624a09348l9185B5342J76800g5953
12362G9589J0748L53750a7194m24138A0536a97235f9788B14748M2551j12299h6177
12350C16489E4492a14768E3480P5217c6093D5880g7936A22637b6968D16033E0096
12338A53631D4609h6983j59955A52614k8654J18498a45986L5857K2699A38902
12327a98134E8827L7678j9086l2063a62732r1818f4156B33362a90464E5295Q7930
12316A43225d92713d6810g663j90761b3716j42066L9703B13909I0281J98617A13023
12304f5624j86313B49162b75150c4458F0011q444N6932c00447B69920C354J03550
$$ plain form
12293 106904 -77091 126798 216090 -140521 246802 -105959 72789 338944 -175477 39942
12282 122695 -37811 -148231 11839 -109600 -26828 -52171 86898 -29762 174318 215933 73736
12270 170176 145014 136144 -155012 364963 410479 -133847 241402 54654 257380 89741 -91011
12258 95821 -112902 362059 -200022 300508 131747 88462 -47435 -18053 -129741 66994
12247 77279 -132915 161596 154275 12187 -227288 -40686 223572 60861 15885 120136 -68430
12235 59849 -5278 26879 -206433 95185 -20166 -364800 83973 56870 -22426 420320 322132
12224 322132 164205 162329 186796 -145728 159373 147713 250406 -56196 101029 -46934 109568
12212 -164501 549805 225782 -148542 -92189 131801 2446 -242889 20136 202733 326926
$$ packed form
12293A06904g7091A26798Q9292a40521B46802a05959G2789K66155a75477C9942
12282A22695c7811j10420A1839a09600b6828k5343H6898b9762A74318M1615G3736
12270A70176k5162q870a55012C64963M5516a33847B41402E4654K02726H9741i1011
12258I5821a12902C62059b00022C00508A31747m3285d7435a8053j11688F6994
12247G7279a32915A61596p321A2187b27288d0686B23572F0861A5885J04251f8430
12235E9849e278B6879b06433I5185b0166l44634H3973k7103b2426D20320r8188
12224C22132j57927j876K4467a45728A59373j1660J02693e6196A01029d6934A09568
12212a64501E49805B25782a48542N6353A31801B446b42889B0136J82597J24193
$$ plain form
12202 326926 191009 339865 264605 179426 290690 297564 131188 304376 -53014 363195
12191 133271 100270 153401 96859 214461 655211 -169528 142797 287801 27503 197815
12181 197815 320822 84115 -193077 54143 12084 172792 183358 195540 20659 -73332 133114
12169 373134 -84911 205539 221470 428925 175032 350974 360796 132520 366732 -89795
12158 131793 56371 -13767 289310 47012 107705 194929 -19658 -114655 127509 96016 63121
12147 63121 191021 10892 -2921 -22106 71434 -52333 -114166 15243 -143292 17028 -180028
12135 -16721 270994 86346 119074 -167797 149417 285080 -150643 -4282 201582 -59681 -40759
12124 -40759 83154 -119898 190793 305887 -234759 274872 173779 179909 61779 252597
$$ packed form
12202C26926j35917J48856p5260q5179J11264O874A31188J73188e3014C63195
12191A33271l3001N3131n6542J17602M40750a69528A42797J45004B7503J70312
12181A97815J23007H4115a93077E4143A2084J60708J0566J2182B0659g3332A33114
12169C73134h4911B05539J5931K07455A75032J75942R822A32520K34212h9795
12158A31793E6371a3767B89310D7012O0693Q7224a9658r4997A27509l1493l2895
12147F3121J27900A0892b921j9185G1434e2333o1833A5243a43292A7028a80028
12135a6721B70994H6346L2728a67797A49417J35663a50643d282B01582e9681J8922
12124d0759H3154a19898A90793J15094b34759B74872j01093O130F1779J90818
$$ plain form
12114 252597 -23613 -54371 -17122 -77512 75166 -110242 -171858 -5699 -101038 -80906 -135772
12103 -135772 59341 -160733 9364 -162641 -175836 285410 -186463 -67534 227223 -173807
12092 -74261 -52744 11397 -61394 18966 72359 -69567 36933 -132472 154525 6524 -367070
12080 55609 230702 212873 -143766 74734 43146 303623 161461 -58146 26424 664150 1276452
12069 1276452 1675612 756710 532375 -39867 -31951 -80393 -211927 98136 399851 161746
12058 -59590 -117597 127875 187135 22339 -97220 -53349 46871 15736 -114803 31759 262411
12047 262411 23169 88402 -164696 -222685 -169069 -216877 -50058 -191036 194819 253593 -89982
12035 25339 -52548 -140663 -193261 258813 -1836 -194570 80285 -541646 -130605 5577 123113
$$ packed form
12114B52597b3613l0758a7122o0390G5166a10242o1616e699r5339K0132n4866
12103a35772E9341a60733I364a62641j3195B85410a86463f7534B27223a73807
12092g4261K1517A1397f1394A8966N3393f9567C6933a32472A54525F524c67070
12080E5609J75093j7829a43766G4734l1588K60477j42162e8146B6424O37726O12302
12069A276452L99160G56710k24335c9867P916m8442j31534I8136L01715A61746
12058e9590n8007A27875N9260B2339i7220M3871D6871A5736a14803C1759K30652
12047B62411B3169O5233a64696n7989N3616m7808e0058j40978A94819N8774h9982
12035B5339e2548q8115n2598B58813a836j92734H0285e41646a30605E577J17536
$$ plain form
12024 123113 146680 117840 -56771 113029 -290345 253702 -25846 -188313 -120696 -54469 222717
12012 205346 149317 101001 48908 342173 -171041 114287 123704 42671 -22459 112284 24209
12000 46317 -133587 -289900 149528 -122207 -135211 359723 -145902 -139541 167534 -318667
11989 55689 141565 -55248 271676 -225451 -3399 -196360 -378318 178101 -16087 -189697 -12659
11977 -120514 -143978 79005 -89445 154754 -124107 -190461 131318 -5922 -29902 -101915 -237146
11966 -237146 254143 125590 -164161 169843 196182 -216728 392532 194318 206945 -392971
11955 -34577 42028 181716 202748 -135607 -250939 -102843 -27274 -13900 31854 -200082 -50810
11943 60711 191840 72763 355291 68680 74280 -4332 58763 -26733 76944 124065 -27974 104327
$$ packed form
12024A23113K3567k8840e6771A13029b90345B53702b5846j62467O7617e4469B22717
12012B05346n6029m8316D8908K93265a71041A14287R417D2671b2459A12284B4209
12000D6317a33587j56313A49528a22207j3004C59723a45902O361A67534c18667
11989E5689Q5876e5248B71676b25451c399j92961j81958A78101a6087j73610a2659
11977a20514k3464G9005h9445A54754a24107o6354A31318e922k3980p2013j35231
11966b37146B54143A25590a64161A69843K6339b16728C92532A94318J2627c92971
11955c4577D2028J39688K1032a35607j15332a02843b7274J3374C1854b00082e0810
11943F0711J31129G2763K82528F8680N600d332E8763b6733G6944M7121b7974A04327
$$ plain form
11930 -317295 -34426 -11957 10235 290833 -61653 -26037 51407 -37785 -19351 23973 103705
11919 103705 259327 -104380 -39693 -180782 370457 233109 94606 -231448 184847 -172685
11908 257211 20645 148885 219364 -13718 -95147 183164 -247802 -346549 153224 126091 11631
11896 -211630 -44711 -32357 -25987 23743 157682 17614 229267 -248654 64324 22264 45364
11885 45364 169484 124568 -185533 -24847 -80296 222365 126661 -118963 -14599 -11093 30902
11873 -52079 -139057 -289903 219843 103358 3504 -573607 -156570 215033 -183586 -117250
11863 -117250 216956 177031 -29743 -102905 -20278 -176332 -50562 2941 -331451 104157 154466
11852 154466 -41303 -214830 80212 -210335 -103837 8884 -280977 202049 -333775 23031
$$ packed form
11930c17295c4426a1957A0235K80598f1653b6037E1407c7785J8434B3973P9732
11919A03705J55622a04380c9693j41089C70457j37348I4606b31448A84847a72685
11908B57211B0645J28240P0479a3718q1429A83164b47802r8747A53224k7133A1631
11896b11630d4711J2354O370B3743J33939A7614K11653b48654F4324B2264K3100
11885D5364J24120m4916a85533b4847n5449B22365r5704a18963a4599L506C0902
11873e2079q6978j50846B19843A03358C504e73607a56570B15033a83586O6336
11863a17250B16956l9925b9743p3162b0278j56054e0562B941c31451A04157N0309
11852A54466d1303j73527H0212b10335a03837H884b80977B02049c33775B3031
$$ plain form
11841 117572 111621 -143228 -185040 -62575 78804 215580 -180164 1478 73097 92030 -303385
11829 17709 -139119 -68397 -266496 -364491 -277954 -189311 196637 -202804 -125859 -50621 -116971
11818 -116971 1928 110334 38430 157195 -81861 -480104 36531 -207820 -119025 30141 -281814
11806 -171764 -168891 135846 -88528 -262565 -112770 -49742 31509 -114442 -239262 -125952
11796 -125952 -127622 130705 -57324 -323118 -242096 -20862 95417 -222454 505141 56024 -61585
11784 372669 -20210 -243901 -417652 -118867 118729 -35931 -295024 -133688 -114512 3735
11773 180078 -201541 -74022 16955 198130 -169674 127434 -81776 272413 62556 -37027
11762 109599 -18653 -127199 -26606 -51639 -67302 -27787 -420835 -8403 34337 -356578 -92964
$$ packed form
11841A17572n951a43228m1812f2575G8804J36776a80164A478P1619J8933c03385
11829A7709a39119f8397j98099r7995Q6537Q8643A96637b02804P6945e0621o6350
11818a16971A928J08406C8430J18765h1861l98243C6531b07820Q8795C0141b81814
11806a71764K873A35846h8528j74037a12770d9742C1509a14442j24820J13310
11796a25952j670A30705e7324k65794Q1022b0862I5417b22454E05141E6024f1585
11784C72669b0210k23691j73751a18867A18729c5931k59093a33688J9176C735
11773A80078b01541g4022A6955J81175a69674A27434h1776B72413F2556c7027
11762A09599a8653j08546b6606k5033j5663b7787l93048h403C4337c56578i2964
$$ plain form
11750 51100 -360289 -365041 82135 199039 67639 110129 -53336 -159984 -255968 -347298 13260
11738 108878 44731 -35034 86631 52329 425495 -24508 186567 283868 -194550 193807 230357
11727 230357 -263874 271468 45698 117509 -152523 -172295 -93540 -184403 -76917 -202207 -163577
11716 -163577 -150338 4855 68886 235612 214987 -76619 -104183 6045 -233412 7789 167310
11705 167310 24954 229593 -210670 208993 -168374 -77787 424296 -75400 92805 -125668
11694 226497 -106090 -92024 295538 111983 152312 -66276 -105473 -286788 161425 183546
11684 183546 -44604 53076 32352 -178717 101845 107087 277580 119126 -162109 -25800 -50050
11673 -50050 140974 144016 275961 274032 86036 236696 116669 431596 186312 102679 43639
$$ packed form
11750E1100c60289m752H2135J16904F7639M2490e3336j06648r5984r1330A3260
11738A08878D4731c5034H6631l4302L73166b4508A86567R7301a94550A93807L6550
11727B30357b63874B71468D5698P1811a52523j9772P8755r0863g6917j25290L8630
11716a63577J3239D855O4031J66726k0625g6619k7564F045b33412G789J59521
11705A67310B4954K04639b10670B08993a68374g7787D24296g5400I2805a25668
11694B26497a06090J4066B95538A11983M0329f6276l9197j81315A61425K2121
11684A83546d4604E3076k0724a78717A01845N242J70493A19126a62109b5800k4250
11673e0050A40974L042J31945j929H6036J50660A16669L14927A86312q3633D3639
$$ plain form
11661 17600 -37901 -131227 -204748 -20826 403086 75666 -95671 -105297 11498 -35194 -177807
11650 -177807 393221 -217233 258753 -177605 -378693 123858 -18461 -175088 311353 -172994
11639 -50244 -188986 222880 -51861 -205276 106854 -204228 76109 -169600 155107 61827
11628 -144519 -171698 76348 140404 -85533 178484 -44761 -130283 75036 -22341 69298 38706
11617 38706 -125986 -50065 -68482 -140925 -12268 -147172 -149858 -56058 85129 -109497 -143181
11606 -143181 -9598 90646 -15472 -72389 -78751 -121546 201578 -35153 -260616 2829 -302090
11594 94489 280603 244560 -156948 -5999 -238932 165398 103923 339197 -177597 206099
11583 -17810 47088 -87646 320832 44574 3775 46736 37411 221851 -185950 -28474 -57340
$$ packed form
11661A7600c7901r3326p3521b0826D03086G5666i5671r626A1498c5194j42613
11650a77807C93221b17233B58753a77605k01088A23858a8461j56627C11353a72994
11639e0244j38742B22880e1861j53415A06854b04228G6109a69600A55107F1827
11628a44519k7179G6348O4056h5533A78484d4761q5522G5036b2341F9298l0592
11617C8706a25986e0065j8417p2443a2268j34904k686e6058H5129a09497l3684
11606a43181i598I0646a5472n6917o362m2795B01578c5153k25463B829c02090
11594I4489J86114l6043a56948e999k32933A65398o1475K35274a77597B06099
11583a7810D7088h7646C20832D4574C775M2961r325J84440a85950b8474k8866
$$ plain form
11572 -57340 83395 138549 272774 41899 6236 -487 -72402 160267 -60797 -166241 7004 -39453
11559 200353 -73771 196265 34235 290435 -160001 71981 -274183 85644 378261 -96814
11548 -230373 -223914 160329 38218 93419 330088 -156850 -226171 64181 -48406 -146228 339934
11536 -44563 -76720 282498 60307 240179 -31449 -130955 169727 -77935 -7236 137094 192651
11525 192651 -186279 31765 330969 -177447 14472 223932 -108515 11169 327927 -88567
11514 186096 -50165 -114920 -6495 263795 36508 -200440 94349 349124 81843 -18995 299466
11502 23406 -39371 251825 -4541 284177 192619 -102360 145856 280468 94431 114326 137799
11491 137799 22931 588269 95436 59293 82382 173144 211767 -171786 -31615 -65149 20899
$$ packed form
11572e7340H3395N5154J34225D1899F236d87p1915A60267f0797j05444G004c9453
11559B00353g3771A96265C4235K56200a60001G1981b74183H5644K92617i6814
11548b30373O459A60329C8218N5201K36669a56850o9321F4181d8406r7822C39934
11536d4563l2157B82498F0307J79872c1449r9506A69727g7935g236A37094N5557
11525A92651a86279C1765K99204a77447A4472K09460a08515A1169L16758h8567
11514A86096e0165o4755f495B63795C6508b00440I4349K54775H1843a8995B99466
11502B3406c9371B51825d541B84177r1558a02360A45856J34612I4431J9895K3473
11491A37799B2931N65338I5436l6143K3089R0762L8623a71786c1615l3534B0899
$$ plain form
11479 -103142 -310609 37197 47341 100530 133871 416478 208167 362546 365225 -205487 422234
11467 561752 891 127804 -6408 -245927 9648 316332 -33146 48415 242958 -184367 -2239
11455 -232413 -76786 109932 365691 33265 51227 -109191 61066 -224590 134293 63981
11444 27226 108978 6101 -53549 -302550 21148 50194 151346 266319 104014 -45352 -83225
11433 -83225 19018 -100912 79934 -168069 -7465 59124 -72063 12414 -44988 -88501 96630
11421 -128308 189279 -141699 85446 -95963 -269341 -52630 92706 9817 70562 271347 -172923
11409 75811 21078 -296464 539927 122542 106601 -82763 149963 -135097 182011 129547
11399 129547 149038 -104960 193525 -43796 -27209 -48177 227920 -108149 -155122 -269500
$$ packed form
11479a03142k07467C7197J0144N3189L3341K82607B08167J54379K679b05487D22234
11467E61752H91J26913f408k39519I648L06684c3146D8415J94543a84367b239
11455b32413g6786A09932K55759C3265J7962a09191F1066b24590A34293F3981
11444B7226Q1752F101e3549k49001B1148K9046J01152J14973A04014d5352l7873
11433h3225A9018a00912G9934a68069g465E9124g2063A2414d4988m3513I6630
11421a28308A89279a41699H5446i5963j73378e2630I2706I817O0745K00785a72923
11409G5811B1078b96464E39927A22542j5941h2763A49963a35097A82011n2464
11399A29547J9491a04960A93525d3796J6587k0968B27920a08149m6973j14378
$$ plain form
11389 -269500 222308 -138747 134334 95994 209346 39376 -99324 81677 -189559 -58233
11378 50918 -49678 109475 72537 113599 -300158 172239 -99898 -149207 123524 80716 -167440
11366 -120337 18728 -294122 -153650 81966 192894 -16060 -3952 -54160 202903 -220874 -193077
11355 -193077 65474 232359 -214703 -175377 -102856 171960 -204480 -189200 -76207 -188866
11345 -188866 -37486 -246373 -438015 -128890 103249 -116757 23077 315315 95696 -38109
11334 68765 94493 -36853 -164301 -99438 63542 459446 -40976 179565 25556 183476 74626
11322 -101384 139211 -143955 -76558 35750 -12809 -177516 72882 198239 70126 380415
11312 380415 -262343 -370604 -10485 48305 -4132 -212242 135625 -74494 -179171 -115138 178950
$$ packed form
11389b69500B22308a38747A34334l8340J13352C9376i9324H1677a89559e8233
11378E0918d9678A09475l6938M1062c00158A72239i9898m9309A23524m2808a67440
11366a20337A8728b94122J40472H1966J10928a6060c952n0208B02903b20874K7797
11355a93077F5474J66885b14703L9326P2521A71960b04480J5280g6207j12659
11345a88866c7486k08887j91642a28890A03249a16757B3077K92238I5696c8109
11334F8765K5728c6853j27448O4863F3542L95904d0976A79565B5556J57920G4626
11322a01384A39211a43955O7397C5750a2809j64707G2882J25357G0126L10289
11312C80415b62343j08261a0485D8305d132k08110A35625g4494j04677O4033A78950
$$ plain form
11300 -159449 165382 -362456 -88296 -84088 -104323 -66742 -269388 -18773 23489 62630 129923
11289 129923 14593 -236045 82903 12076 -268745 147582 723 -445708 152903 28692 330586
11278 330586 105137 -198761 160496 212860 405843 -42119 -297168 8710 201094 -418166
11267 164751 -129566 59488 -155037 28147 -278303 -356455 -36175 -67134 -370738 -96109 -149839
11256 -149839 -152642 -296265 3657 150525 127001 70219 52304 -68094 -3986 -212097 -282366
11245 -282366 -361347 39729 75752 -160163 122822 -146739 -77488 60031 136153 -131791 78742
11233 -43166 231414 117397 198707 21770 419719 -616400 32699 159899 -259761 -206792
11223 -206792 149936 -135192 -400787 184551 157162 45520 196583 241020 -362190 -103724
$$ packed form
11300a59449A65382c62456h8296M208k0235L7581k02646a8773B3489L9141O7293
11289A29923A4593b36045H2903A2076b68745A47582G23d45708A52903B8692L01894
11278C30586A05137a98761A60496N2364J92983d2119k55049H710J92384d18166
11267A64751a29566E9488a55037B8147b78303p8152c6175l0959l03604i6109n3730
11256a49839k803j43623C657J46868k3524n6782j7915f8094c986k08111p0269
11245b82366p8981C9729L6023a60163A22822a46739O9251F0031P6122a31791G8742
11233d3166B31414j14017Q1310B1770L97949f16400C2699J27200b59761N2969
11223b06792A49936a35192k65595A84551k7389D5520J51063M4437c62190a03724
$$ plain form
11212 49861 -7022 309332 90985 113071 -67283 62620 -19868 -50303 47479 89159 40542 33382
11200 33382 114868 -91299 92267 106731 -34426 -111196 -4531 -226414 -122829 6102 -21366 -371934
11188 -371934 -105246 -44642 -291447 -132972 368790 -93455 272119 164702 -468081 -148615
11177 -99472 82689 -180375 41942 -131116 -150089 78220 -403772 151288 199894 78434 -168846
11165 350066 -25589 163382 -29662 -242524 -245868 -128603 -36345 -233734 -69124 127107 64065
11154 64065 -405091 -260041 -198815 -240795 -171965 -18687 -117047 108355 12871 -212346 -146562
11143 -146562 -59658 122971 -134977 97541 -47788 104660 -25503 -130861 -398752 507472
11132 183365 -378483 -88375 222793 -12493 271236 134189 119941 134903 -166 -51223 6247
$$ packed form
11212D9861g022C09332I0985K2086f7283F2620a9868l0435D7479M1680D0542p160
11200C3382Q1486i1299I2267J4464c4426p6770d531k21883J03585F102b1366l50568
11188c71934a05246d4642k46805a32972C68790i3455B72119j07417d68081a48615
11177i9472H2689a80375D1942a31116j8973G8220d03772A51288M8606G8434a68846
11165C50066b5589A63382b9662k12862l344J17265c6345j97389f9124A27107o3042
11154F4065d05091J45050O1226m1980O8830a8687r8360A08355A2871b12346O5784
11143a46562e9658A22971a34977I7541d7788A04660b5503j05358k67891E07472
11132A83365c78483h8375B22793a2493B71236A34189j4248J4962a66n1057F247
$$ plain form
11120 104499 156941 199095 86411 -130709 151488 89349 -208311 454924 37365 146423
11110 146423 -81865 237662 58476 -263788 -19966 159801 388195 -11729 352303 28277
11099 -20659 -246525 16632 88375 17765 273282 265291 -29477 -86388 147829 64425 48342
11088 48342 530487 262066 106231 169221 262130 147535 -69393 281492 -28533 18032 379052
11077 379052 397470 280705 18716 29578 250844 258824 23714 164294 223742 557689 64011
11065 97978 456108 327790 98880 543018 490245 355103 498886 641615 509267 362946
11055 362946 576146 645216 624100 251548 580977 435618 551453 1020307 575954 672923
11045 672923 738823 249051 391218 760233 556034 968173 655067 772268 637313 621980
$$ packed form
11120A04499N2442M2154H6411a30709A51488o2139b08311D54924C7365J09058
11110A46423h1865B37662E8476b63788a9966A59801K28394a1729C52303B8277
11099b0659k25866A6632P1743A7765K55517p991b9477n6911A47829F4425j6083
11088D8342M82145B62066A06231O2990R2909j14595f9393B81492b8533A8032L61020
11077C79052J8418j16765A8716J0862K21266P980B3714J40580N9448L33947F4011
11065I7978L58130j28318I8880M44138n2773j35142J43783J42729j32348j46321
11055C62946K13200O9070k1116B51548L29429j45359J15835M68854m44353R6969
11045F72923O5900B49051J42167L69015k04199M12139l13106J17201j34955j5333
$$ plain form
11035 621980 533708 700533 494078 607263 345936 312437 493787 587801 772487 378625
11024 770003 488525 877167 467774 642913 582301 370535 207683 724100 565141 604388
11014 604388 314937 401754 111529 891105 668721 543518 559119 567088 483647 546787 489039
11003 489039 660130 581282 503701 680449 819279 730975 686152 516077 747782 737424
10993 737424 652142 660251 494354 505712 650999 513151 673931 552559 719097 881413
10983 881413 808925 890181 919025 1232619 1159868 1022519 1549308 1394628 2054445 1945384
10973 1945384 2134017 2476542 2238021 2596915 2850607 2635844 2467560 2069829 1877929
10964 1877929 1805623 1343375 1331089 1031014 1167560 1135609 1381263 1465806 1486456 1158275
$$ packed form
11035F21980q8272J66825k06455J13185k61327l3499J81350R4014J84686C78625
11024G70003k81478L88642m09393J75139o0612k11766j62852N16417j58959L9247
11014F04388k89451Q6817A11529P79576k22384j25203J5601P969q3441O3140n7748
11003D89039J71091p8848p7581J76748J38830q8304m4823j70075K31705j0358
10993G37424q5282Q109j65897J1358J45287j37848J60780j21372J66538J62316
10983H81413p2488Q1256K8844L13594p2751j37349N26789j54680O59817j09061
10973A945384J88633L42525k38521L58894K53692k14763j68284l97731j91900
10964A877929p2306m62248j2286l00075J36546l1951K45654Q4543K0650l28181
$$ plain form
10954 1158275 1367143 1209791 984806 833869 789052 840223 654820 519302 497387 80448
10943 367756 580304 120253 73307 440215 176334 155474 217418 145593 236602 -21057 88697
10931 -252336 36400 355990 -109350 -217114 -80646 -670 -50507 197614 -152574 -93947 -147700
10920 -147700 367706 113088 -212769 -14214 -215560 -50552 -1970 -205559 27365 -245935
10909 -10699 98332 -11642 -228155 -203150 50735 8674 288390 76569 139318 38880 -340068
10897 -18724 100741 -18014 77867 -112207 -229070 53999 170457 164904 -188740 10418 -207119
10885 -295814 67005 140892 137529 83518 -85826 58212 -134363 222401 106209 18975 38091
10874 38091 -142001 -58465 -100364 -133842 306162 92861 -39182 37624 36819 -291100 -307703
$$ packed form
10954A158275K08868j57352k24985j50937m4817N1171j85403j35518k1915H0448
10943C67756K12548A20253m6946L66908A76334k0860O1944p1825R1009b1057H8697
10931b52336C6400L19590a09350j07764h0646f70m9837A97614a52574N8627n3753
10920a47700C67706A13088b12769a4214k01346e0552a970k03589B7365b45935
10909a0699I8332a1642k16513K5005E0735H674K79716G6569O2749C8880c40068
10897a8724A00741a8014G7867a12207j16863E3999J16458n553a88740A0418b07119
10885b95814F7005P3887l363n4011h5826E8212a34363B22401A06209A8975J9116
10874C8091a42001e8465m1899l3478C06162I2861c9182C7624q05b91100j6603
$$ plain form
10863 -307703 -57756 314328 -83271 -150561 -69150 159028 -67228 -220529 -112589 148339
10852 352447 -174396 -67829 -179539 -328896 -330616 299762 -158889 -11204 -49314 30154 35853
10841 35853 -336905 -97443 -65912 -48714 -425801 120222 138908 -178569 222645 -194488
10830 162707 -141959 556054 -160889 93214 -104644 -80535 -18771 21729 -126188 -42515
10819 54014 155031 -31385 292090 59577 26035 55884 -101490 -169566 27119 87606 -71512
10807 -218438 -258084 45889 -165855 18486 44699 -290067 13859 -40736 155121 -21545 136747
10795 -242504 -263232 -67710 170469 41045 43785 -42905 133096 -87576 -147849 -86421 281820
10783 -77696 140238 -53132 20699 107960 29039 4935 -75855 -440114 -430019 -49133 -127159
$$ packed form
10863c07703e7756C14328h3271o7290f9150A59028f7228j53301J07940A48339
10852C52447a74396f7829j11710j49357j720B99762a58889a1204l8110C0154N699
10841C5853c36905i7443L1531J7198l77087A20222J8686a78569B22645a94488
10830A62707a41959E56054a60889I3214a04644K4109a8771B1729a26188d2515
10819E4014J01017c1385B92090E9577B6035K9849a01490o8076B7119O0487g1512
10807b18438l9646D5889a65855A8486K6213b90067A3859d0736A55121b1545A36747
10795b42504k0728f7710A70469D1045K740d2905A33096h7576o0273O1428B81820
10783g7696A40238e3132B0699Q7261B9039D935g5855l64259J0095d9133p8026
$$ plain form
10772 -127159 27308 256194 307541 132744 -71322 88838 -200180 -337924 -3560 -190724 8206
10760 -73884 370282 -224999 184988 -108168 -183589 23497 -78962 -98633 -472526 -366473
10750 -366473 -16407 -204895 58342 69600 89743 400670 -28010 56216 -163865 -279345 370196
10738 -269909 -228941 98798 -227966 115802 -121706 -168270 79017 146078 -136067 156343
10727 -1666 -60058 -180467 114317 -145029 127626 -36505 203383 -93185 -10375 -16508 -299066
10716 -299066 11646 83557 233906 -74563 -480434 -93497 109190 -360655 -236645 136557
10705 53267 -208460 -452798 -433690 -66644 117991 -358497 -68705 -59370 186403 13200 -52385
10693 -63691 -209482 215028 -60844 42412 12324 -131144 -31658 -388914 27538 74786 -311027
$$ packed form
10772a27159B7308K28886N1347A32744g1322H8838b00180j37744c560j87164H206
10760g3884C70282b24999A84988a08168p5421B3497g8962j9671l73893J06053
10750c66473a6407j88488E8342J1258K0143L10927b8010E6216a63865j15480C70196
10738b69909M0968I8798b27966A15802a21706m6564G9017O7061a36067A56343
10727a666n8392j20409A14317a45029A27626c6505B03383i3185a0375o133k82558
10716b99066A1646P1911J50349g4563m05871i3497A09190c60655J24010A36557
10705E3267b08460k44338J9108f6644A17991c58497f8705R335A86403A3200e2385
10693f3691j45791B15028f0844D2412A2324a31144c1658l57256B7538M7248c11027
$$ plain form
10681 -279802 138707 -9067 -16607 -460851 101878 179003 4581 -171833 -97627 -63280 -39385
10670 -39385 -234262 -140680 -161452 156895 78379 175080 201895 -201112 -344544 -206975 -304765
10659 -304765 227796 91729 50065 -42573 -344383 20272 -191835 5333 -147951 91115 -12389
10647 -77014 49378 75827 -398995 -189743 19764 109064 69475 -56067 -1693 -10011 83838 256133
10635 256133 189135 108546 -50329 -202097 -44403 -213780 -173034 -130545 -269365 -136942 -17200
10623 -214229 -190529 88664 -158620 25275 160863 229296 -157714 -27432 -246509 -195289 79132
10611 -19296 216954 128013 6735 -13963 -91286 -6059 32552 17204 -70581 81340 -131521 118040
10598 31169 49642 -23564 838 213641 -109428 -198241 120154 77260 88781 -146222 22395
$$ packed form
10681b79802A38707i067p540m44244A01878P7125D581a71833P4206L4347K3895
10670c9385j94877R3582k0772A56895G8379R6701K6815b01112j43432J37569r7790
10659c04765B27796I1729m1664d2573l01810B0272a91835E333a47951I1115a2389
10647g7014D9378K6449c98995a89743A9764Q9300l9589e6067a693q318H3838J72295
10635B56133o6998q0589e0329j51768d4403j69377M0746M2489j38820J32423a7200
10623b14229K3700H8664a58620B5275J35588O8433a57714b7432k19077N1220G9132
10611a9296B16954q8941F735a3963p7323f059C2552j5348g0581H1340a31521A18040
10598C1169J8473b3564H38K12803a09428q8813A20154m2894J1521a46222B2395
$$ plain form
10586 -103923 -253478 -235895 -121791 -338315 247470 133553 -81756 115283 33292 152778
10576 152778 -542122 -48890 -2010 -306568 -151131 48201 82535 75439 87130 9543 16123 99367
10564 99367 -15227 -151486 174376 22923 173740 95386 -797 46946 -351899 671716 -127768
10552 -246225 380437 -273542 -128423 17057 80524 -213054 -145117 -181440 -208425 -2478 -4662
10541 -4662 -69832 -128950 -116611 -227980 -439703 -107600 -71074 -22091 71263 -50774 119417
10529 11736 -192359 -195793 -33074 -173756 50407 82129 -137211 -376483 147099 -26982 -244110
10518 -244110 -349556 80075 -506718 -73807 -10671 3612 222836 -300331 -74346 -208715 -85814
10506 -108311 -285238 -328458 -103740 -61933 49976 158283 -116822 78029 622 107892 84331
$$ packed form
10586a03923j49555J7583J14104k16524B47470j13917h1756A15283C3292J19486
10576A52778e42122d8890b010l04558a51131D8201L4334p096J1691I543O580Q3244
10564I9367a5227j36259A74376B2923J50817p8354g97D6946c51899F71716a27768
10552b46225C80437b73542a28423A7057O3467b13054O7937l6323k6985b478k184
10541d662o5170n9118J2339j11369k11723a07600L6526b2091G1263e0774A19417
10529A1736a92359l434c3074j40682E0407L1722a37211k39272A47099b6982k17128
10518b44110j05446H0075e06718g3807a0671C612K19224c00331g4346j34369h5814
10506a08311j76927m3220a03740M1807D9976J08307a16822G8029F22J07270k3561
$$ plain form
10495 84331 -83360 103727 17015 -80688 57125 -2455 64466 -112561 -64461 -197864 235354
10483 316517 -344956 -134966 209714 276331 387987 305793 400358 -135721 -143442 170344
10472 -414499 -5977 -209967 -5682 -270730 -85096 -100391 -13772 -227844 -211294 -275178 -175431
10461 -175431 -161066 -167793 58129 -48136 55154 -12107 71613 -239846 -8047 -140871 -183431
10450 -183431 219971 -6725 -71838 -27836 230725 -17866 42330 141651 238816 -3074 -97869
10439 -97869 -100708 208301 -106736 79387 -271940 224763 -26267 178667 5233 96187 2940
10427 48906 -168914 -124560 -332756 159464 -49085 262298 -133736 -85569 320784 -305850
10416 -173210 100043 -21642 97982 -269126 173233 -61236 17547 -54691 268776 -125272
$$ packed form
10495H4331h3360A03727A7015h0688E7125b455F4466a12561M8100j33403B35354
10483C16517c44956a34966B09714O6617J11656q2194R4565a35721p721A70344
10472d14499e977k03990e682k65048h5096j5295a3772k14072J6550o3884R9747
10461a75431J4365o727E8129d8136E5154a2107G1613b39846h047j32824m2560
10450a83431B19971f725o5113b7836B30725a7866D2330R9321R7165c074r4795
10439i7869k839B08301a06736G9387b71940B24763b6267A78667E233R0954B940
10427D8906a68914M4354k08196A59464d9085B62298a33736M8167C20784c05850
10416a73210A00043b1642I7982b69126A73233f1236A7547e4691B68776a25272
$$ plain form
10405 -215191 487321 -112125 302323 -205671 224114 -300752 254744 -114026 66194 261218
10395 261218 277717 -50451 110071 30861 266524 116542 -10172 207031 -120602 99358
10384 185697 373115 -130421 -235508 225963 23440 -22945 454029 271341 147140 -30810
10373 245033 226745 348998 41724 228632 249100 401526 802583 492635 406069 410993 47481
10361 198673 457264 11729 271268 691461 -213002 43206 350375 361371 271884 419054
10351 419054 290813 290429 723541 669601 373951 288023 222860 135887 86243 50314 16203
10339 431340 370509 473570 215107 325286 86340 266423 -5584 119218 218361 -47929 174173
10327 -182973 256198 -53415 527688 275743 72252 -23914 156606 465707 200401 214166
$$ packed form
10405b15191D87321a12125C02323b05671B24114c00752B54744a14026F6194J95024
10395B61218J6499e0451A10071C0861K35663A16542a0172B07031a20602I9358
10384A85697J87418a30421j05087B25963B3440b2945D54029j82688j24201c0810
10373B45033j8288J22253D1724J86908K0468J52426M01057l09948q6566M924D7481
10361A98673K58591A1729K59539M20193b13002D3206L07169J0996q9487J47170
10351D19054j28241l84M33112n3940k95650q5928o5163q6973m9644l5929A6203
10339D31340o0831J03061B15107J10179H6340J80083e584A19218R9143d7929A74173
10327a82973B56198e3415E27688k51945G2252b3914A56606L09101B00401J3765
$$ plain form
10317 214166 -192285 49834 205899 280347 -17790 26043 157550 -187500 175944 -446750
10306 52588 -109336 80256 -43301 16846 71393 9111 -75923 -39822 21997 -225220 94727
10294 -85191 -33734 -75428 159800 -15324 -202680 178790 -77595 -63513 -447581 15056 86336
10283 86336 -55659 -103791 -98550 26454 149862 -110754 -132026 132332 215766 -221401 -66602
10271 -209376 274182 -262489 -90948 -231680 52606 -14953 119831 -286141 12869 942 -163080
10259 -59078 72550 155810 14847 100260 -29407 -137938 52385 78574 103660 161172 -112315
10247 -57128 96390 29972 -226787 -219824 34028 60456 28553 -268026 -114238 -214237 -14931
10235 327742 254575 7929 -54573 321076 -158410 -61245 -176555 164450 -60153 -44211 -288321
$$ packed form
10317B14166a92285D9834J56065P4448a7790B6043J31507a87500A75944d46750
10306E2588a09336H0256d3301A6846N4547I111g5923L6101B1997b25220I4727
10294h5191c3734m1694A59800a5324j87356A78790g7595J4082l84068A5056P1280
10283H6336e5659m8132N241B6454J23408a10754k1272A32332Q3434b21401f6602
10271b09376B74182b62489i0948j40732E2606a4953A19831b86141A2869I42a63080
10259e9078G2550Q3260A4847Q5413b9407j08531E2385K6189K5086N7512a12315
10247e7128I6390B9972b26787O963C4028K6428B8553b68026a14238r9999a4931
10235C27742p3167G929e4573C21076a58410f1245j15310A64450f0153J5942k44110
$$ plain form
10224 -288321 190064 -208873 -228967 -36425 104254 174807 -375967 -244350 -61160 -131111
10214 -131111 91916 -4909 -24536 -59613 -35608 10570 289708 25951 136550 195044 10496
10202 -239242 23624 -229443 -128346 -185389 75729 -169382 -7497 -65389 -91921 91899 172298
10191 172298 105422 -554654 -125729 -79992 63737 -106881 -132891 -39835 -206839 73970 -85358
10179 8563 -111063 135711 -107678 -138710 -146817 83049 -132152 -33493 91750 -439335 -247212
10168 -247212 -133716 169518 -408548 -133750 21813 -197923 -5077 -279329 -225951 -219347 -309196
10157 -309196 317626 -132708 35934 -485060 185126 -152028 4273 -200997 -287390 156576
10146 -87237 -207831 5417 161778 -146 13528 -166412 -59130 82768 -127368 1394 -309036
$$ packed form
10224b88321A90064b08873k0094c6425A04254P0553c75967J31617f1160o9951
10214a31111I1916d909j9627l5077K4005A0570K79138B5951J10599N8494A0496
10202b39242B3624b29443J01097n7043G5729a69382g497n7892k6532I1899Q0399
10191A72298o6876e54654a25729M5737F3737a06881k6010c9835j67004G3970h5358
10179H563a11063A35711a07678l1032q107H3049a32152c3493I1750d39335J92123
10168b47212J13496A69518d08548a33750B1813a97923e077k74252N3378O604q9849
10157c09196C17626a32708C5934d85060A85126a52028D273b00997q6393A56576
10146h7237j20594E417J56361a46A3528a66412e9130H2768a27368A394c09036
$$ plain form
10134 54263 68841 139684 -159074 339400 -37002 -2421 248064 75548 -350854 -229441 68588
10122 107971 122595 -196687 -214965 -50739 277161 -157160 -456492 118047 82868 -562384
10111 -278800 -38762 -282494 53526 -76857 48575 -99849 -43211 -345936 -1733 -209476 119507
10099 -14442 -287315 -120016 50397 -70831 -114861 -106497 -221026 -153607 242829 -145837 163387
10087 -167842 66622 -98045 -387076 -128369 -330437 248203 -151167 -24089 158337 -170673
10076 167045 74068 -199691 -262094 78395 27816 -135284 74052 71835 -301281 -199460 -40927
10064 124846 62775 225022 4018 75639 -31910 -183876 -111586 -199468 81268 -96634 120815
10052 -53757 -429029 -164524 -41093 -92986 -170703 -140489 -341627 -275870 75007 -93679 -56079
$$ packed form
10134E4263J4578P0843a59074C39400c7002b421B48064G5548c50854J21413F8588
10122A07971J4624a96687j8278e0739B77161a57160k99332A18047l5179e62384
10111b78800c8762k43732E3526g6857D8575i9849d3211l02725a733k07743A19507
10099a4442k72873a20016E0397g0831m4030Q364j14529O7419B42829a45837A63387
10087a67842F6622i8045k89031a28369k02068B48203a51167b4089A58337a70673
10076A67045G4068a99691o2403G8395B7816a35284G4052k217c01281J01821d0927
10064A24846o2071J62247D018P1621c1910j51966P2290q7882H1268i6634A20815
10052e3757l75272a64524d1093n1893p7717L0214k01138O5757G5007i3679L7600
$$ plain form
10041 -56079 205456 105753 -174135 -157810 50830 -156632 -276404 -265480 -67409 -194399 -185089
10030 -185089 -245558 -218989 97398 -136660 -17029 -292199 43141 -25132 13492 -126709 -171340
10019 -171340 11456 -21683 130890 -13855 -174818 153495 -79665 -43764 60223 12692 71585
10008 71585 193864 -327131 -151554 -72991 -131676 94791 -175309 -72613 -64783 -405038 -53934
9996 -88136 -59334 -401880 -41892 -25483 154043 -42627 -23932 -181724 24924 304462 -16041
9984 -76232 -290904 -229549 -141932 -58156 -36300 220432 -64210 -177131 49285 102353 14752
9972 82358 -115648 -71830 -139591 -238380 -87499 -245601 -446349 -51904 -136343 -156729 127289
9960 -126481 124756 -356752 235301 -79435 -222127 228554 990 48746 73348 -329520 -1784
$$ packed form
10041e6079B05456r9703a74135J6325E0830a56632j19772J0924f7409j26990R310
10030a85089o0469K6569I7398a36660a7029k75170D3141b5132A3492a26709m4631
10019a71340A1456b1683A30890a3855j60963A53495g9665L5901F0223A2692N8893
10008G1585J22279c27131a51554g2991n8685I4791a75309g2613P830l40255e3934
9996h8136K8802l42546d1892J6409A54043d2627J8695j57792B4924K79538a6041
9984g6232k14672O1355Q7617e8156K1856B20432f4210j12921D9285N3068A4752
9972H2358a15648M3818o7761r8789h7499j58102k00748e1904q4439k0386A27289
9960a26481A24756c56752B35301g9435j42692B28554I90M7756K4602c29520a784
$$ plain form
9948 -205041 -237622 -227351 623487 101197 -115866 -196453 -81246 -155777 234103 -90202 121325
9936 -245158 111988 28563 -301729 -7260 -149345 208810 55807 214365 34647 53223 -103719
9924 -80843 -325143 88654 61858 147356 -185707 189454 -201002 -139024 209331 -157508 -20837
9912 -36594 -156233 116361 116912 -280941 73661 -23834 72732 68803 110470 79713 147238 -358421
9899 221643 79430 -117673 171656 -391584 -173114 -143601 -123048 -163008 -128878 47930 149822
9888 149822 83112 418977 -334528 -82109 107748 -429674 -155735 -218046 59165 -26636 358209
9876 -90126 123257 -119405 -365540 -291067 -281590 -136519 479773 -280614 4837 187212 20870
9864 13129 -82282 -237887 344663 769 41540 -27919 -150270 193315 -76710 -12465 -303 -260632
$$ packed form
9948b05041l2581J0271F23487A01197a15866q0587h1246p4531B34103i0202A21325
9936b45158A11988B8563c01729g260j42085B08810E5807J58558C4647J8576a03719
9924h0843k44300H8654k6796Q5498a85707A89454b01002O1978B09331a57508b0837
9912c6594j19639A16361N51b80941G3661b3834G2732l929M1667l0757O7525c58421
9899B21643G9430a17673A71656c91584a73114K9513K0553l9960L4130D7930J01892
9888A49822o6710L35865c34528h2109A07748d29674a55735o2311E9165b6636C58209
9876i0126A23257a19405k46135P4473R477a36519D79773b80614D837J82375B0870
9864A3129h2282j55605C44663G69M0771b7919j22351A93315g6710a2465c03k60329
$$ plain form
9852 -260632 132949 -172214 -24631 -147255 22918 -23041 -210468 188987 -248776 106668
9841 216596 116 -218158 -130432 147778 -239282 -107436 -18758 -171478 -36980 -23429 -388910
9830 -388910 394414 -41932 -302396 -254104 75694 -234932 51996 -131050 63203 -156457 -46125
9818 4878 -65003 -224010 -238954 -281253 -210686 126278 -211457 -127058 -67518 -34843 -106023
9807 -106023 -147358 -82030 -10575 183916 -558073 -930 -337969 -365755 -13227 -188687 10891
9795 -242266 -63860 -6795 -114029 -166128 149825 15958 111239 47303 -86880 51820 -113334
9783 -124111 48492 -95614 182907 57717 -72420 109300 222496 -272360 8510 -159858 -162513
9772 -162513 -151062 -96524 44468 204295 182598 -176648 -167362 29396 -148025 247649 -135462
$$ packed form
9852b60632A32949a72214b4631j22624B2918b3041j87427A88987b48776A06668
9841B16596A16b18158Q7726A47778b39282a07436a8758j52720c6980J3551l65481
9830c88910C94414d1932k60464M8292G5694b34932E1996a31050F3203a56457d6125
9818D878f5003j59007j4944m2299P0567A26278b11457Q4399N9540L2675p1180
9807a06023m1335O5328a0575A83916e58073i30l37039k7786a3227j75460A0891
9795b42266f3860f795j07234n2099A49825A5958R5281D7303h6880E1820a13334
9783a24111D8492i5614A82907E7717g2420A09300J13196b72360H510a59858k655
9772a62513J1451N4538D4468J59827k1697a76648R286B9396a48025B47649a35462
$$ plain form
9760 -177393 -106479 170174 -389520 101885 -85751 -145926 179186 117101 30295 -224212 62185
9748 -36996 -310228 105810 197766 269389 -85881 74707 -186410 -143211 -482170 291583 -282552
9736 -177580 -112910 -176579 12810 83218 281811 28735 96357 -182211 96300 12258 -34245
9724 -223850 293469 -165545 -3184 -37018 -236765 -208852 9382 139191 -278998 -150632 -36899
9712 90026 -156127 -150690 -7019 -95653 -219663 -202811 -246259 -208785 108212 -228113 137832
9700 23975 -268937 -116921 -107495 -27264 -132398 79273 38238 -188639 -5289 250115 -205469
9688 136685 98371 -286673 -4111 -87246 -51036 69776 270908 -111788 321888 -185321 -13926
9676 -310280 -197231 -39081 -211797 -14110 -334785 163757 97318 47392 86758 -282346 88045
$$ packed form
9760a77393P0914A70174c89520A01885h5751o0175A79186o2085C0295b24212F2185
9748c6996k73232A05810R1956P1623h5881G4707a86410M3199l38959B91583b82552
9736a77580O4670o3669A2810P0408J98593B8735O7622a82211I6300A2258c4245
9724b23850B93469a65545c184l3834j99747K7913I382J29809b78998J28366c6899
9712I0026a56127N437g019q8634j24010J6852m3448L7474A08212b28113A37832
9700B3975b68937a16921R426b7264j05134G9273C8238a88639e289B50115b05469
9688A36685l8314b86673d111q3135L6210F9776K01132a11788C21888a85321a3926
9676c10280J13049c9081j72716a4110l20675A63757o6439D7392L9366b82346H8045
$$ plain form
9664 -496454 -428110 15591 194713 -37490 -42608 -11068 6451 129565 -187230 20111 -93698
9652 -217177 -99798 -338610 -29174 -118076 -175411 -237277 170595 -108487 -356834 385579 -376443
9640 32317 -467894 105308 -142903 -209152 -128366 189113 83598 -16007 -10820 -20135 66616
9628 -31598 103312 -145190 44473 -57638 -70747 -312542 -53094 -62865 49646 -21079 -189601
9617 -189601 -166686 -145065 83314 -49093 -10889 75615 186856 -158858 -90955 81407 -119499
9605 -180630 320696 -131403 79323 -121915 -131292 -154470 146895 -196211 -2733 46630 63287
9594 63287 -318383 24664 19689 -73246 -39916 312815 -154649 -429894 -98806 -20717 -306242
9583 -306242 -278280 101043 193606 -93534 -297141 -571964 -383544 283634 -242439 -142252
$$ packed form
9664d96454O8344A5591J79122c7490n118a1068F451J23114a87230B0111i3698
9652b17177i9798k38812b9174q8902n7335o1866A70595a08487k48347C85579c76443
9640C2317d67894A05308a42903o6249Q0786A89113H3598a6007N187r315F6616
9628c1598A03312a45190D4473e7638j3109k41795e3094r771D9646b1079j68522
9617a89601K2915K1621H3314d9093a0889G5615J11241a58858O7903H1407a19499
9605a80630C20696a31403G9323a21915r377k3178A46895a96211b733D6630J6657
9594F3287c18383B4664m975g3246L3330C12815a54649k75245i8806b0717k85525
9583c06242K7962A01043R2563i3534k03607k74823J88420B83634b42439J00187
$$ plain form
9573 -142252 -82766 -1424 26033 -30572 -218794 156870 -67170 -58035 -90971 -160836 -27967 -48416
9561 -48416 30951 42839 230219 93272 75628 95799 -4139 -13723 -266709 -69565 -83015 164407
9548 -183471 204424 295722 59831 120042 -220098 144205 -134668 -28666 102256 -36944 -57082
9537 -57082 -144881 -292692 -104630 35468 125436 -117550 -439062 150556 -239142 -77004 -254386
9526 -254386 -166706 24534 -173561 -43186 -77117 40356 -206836 103302 -139181 -26528 -210025
9515 -210025 -147407 -153011 46586 77822 -295633 -40634 -380262 149166 14854 156863 -111390
9503 -213667 -58823 34790 -63149 -273880 187628 -80310 -393340 -249170 30174 432607 -330478
9491 27162 231035 53523 -43447 9543 -307571 -4346 131698 -27411 -309807 60121 128868
$$ packed form
9573a42252N9486a424B6033c0572j88222A56870f7170R135l2936o9865b7967k0449
9561d8416C0951J1888J87380I3272j7644K0171d139r584k52986f9565j3450A64407
9548a83471B04424R1298E9831O0211b20098A44205a34668b8666A02256c6944k0138
9537e7082q7799j47811a04630C5468Q9968a17550l21512A50556b39142g7004j77382
9526b54386Q7680B4534a73561d3186l3931D0356b06836A03302a39181b6528j83497
9515b10025O2618n604D6586L1236b95633d0634l39628A49166A4854J42009a11390
9503b13667e8823C4790f3149k10731A87628h0310l13030J44170C0174M02433c30478
9491B7162K03873E3523d3447I543c07571d346A31698b7411k82396F0121O8747
$$ plain form
9480 128868 5497 81231 111027 -337252 56619 27559 117011 300596 -6297 -41258 -142251
9469 -142251 -25113 -169904 5943 -59081 11313 -16093 -3986 311505 -248922 -37861 -20621
9458 -20621 296452 152510 -87382 275594 -192867 -344282 -11423 382973 -266742 -107162
9447 34726 152494 -315444 245160 -48175 -133262 -57941 68946 -235089 -233281 49047 -70612
9435 -35847 44073 -422944 -126105 -246289 -309738 -29527 -108270 -5221 -169328 152057 -403975
9423 82058 -256395 -256424 -149325 -79320 -63102 -349816 -16792 151669 -36402 -57139 -238771
9412 -238771 -522344 326331 -175690 -43319 65377 -317236 49525 -135867 -171007 -69414 12599
9400 46337 148786 -179292 -86281 95169 78306 -231092 -188775 268305 416699 -113459 -217926
$$ packed form
9480A28868E497P5734K9796c37252E6619B7559Q9452J83585f297l4961j00993
9469a42251b5113j44791E943e9081A1313a6093c986C11505b48922c7861J7240
9458b0621B96452j43942h7382B75594a92867j51415a1423C82973b66742a07162
9447C4726J17768c15444B45160d8175q5087e7941F8946b35089J808D9047g0612
9435c5847D4073d22944a26105j20184o3449b9527p8743e221j64107A52057d03975
9423H2058b56395k9J07099P0005J6218k86714a6792A51669c6402k0737j81632
9412b38771k83573C26331a75690d3319F5377c17236D9525a35867l5140f9414A2599
9400D6337J02449a79292h6281I5169j6863b31092M2317B68305J48394a13459j04467
$$ plain form
9389 -217926 -143178 -184176 107218 3747 -202235 -117410 31122 6849 -139491 -276794 -25575
9377 -308191 93783 227098 37138 107002 -291897 -278240 196101 -140374 -62906 59947 95962
9366 95962 -28788 -178563 -98311 -55402 20247 -297203 -3400 -210719 -23996 40231 -265493
9354 -113882 -42505 -21064 156203 126956 91064 114449 112622 -207208 -45824 -143054 -118061
9343 -118061 -116226 74740 -81850 -259024 -235069 44935 -186213 628 -376508 -173365 -40398
9331 5507 254894 -36241 -212510 -177755 -92854 -122900 109516 -61206 16362 172562 -130960
9319 -409587 -321174 -25266 -139550 -7950 -231136 29644 72817 -313810 32401 231451 13844
9307 -421532 -11629 8581 -293641 -268340 272236 -82582 -197067 26297 -115625 187837 -17174
$$ packed form
9389b17926P4748m0998A07218C747b02235Q4825C1122F849a39491j37303b5575
9377c08191I3783J33315C7138O9864b91897J3657A96101a40374f2906E9947L6015
9366I5962b8788j49775Q0252M2909B0247b97203c400k07319b3996D0231b65493
9354a13882d2505b1064A56203k9247l5892K3385j827b07208d5824r7230K4993
9343a18061J835G4740h1850j77174K3955D4935a86213F28c76508a73365d0398
9331E507K49387c6241j76269L4755Q4901l0046A09516f1206A6362J56200a30960
9319d09587Q8413b5266j14284g950k23186B9644M3173c13810C2401J99050A3844
9307d21532a1629H581b93641K5301B72236h2582j14485B6297a15625A87837a7174
$$ plain form
9295 -175849 -347915 28053 -136582 14604 -192062 -173738 -8936 4229 -193852 -57613 49609
9283 -298827 133694 78645 -179146 -38175 -250436 49499 -262549 -231918 -127812 -14217 -154251
9272 -154251 -73611 303094 -454834 19007 -186778 -209263 144115 181708 22875 -154622 100788
9260 -138051 -6713 67798 47467 -31317 -21748 342512 73216 150777 107229 209203 89174 72583
9248 72583 5208 181404 93226 54033 -298407 241444 -133539 -12378 -197317 154203 126163
9237 126163 -394940 -316120 -41880 11574 51123 68615 1286 -40469 21246 -104518 14751
9225 -325602 -131236 -24161 -160667 -238488 -222216 -264265 211865 92680 -423405 -265441 -225546
9214 -225546 37168 83582 100874 125698 99628 -188438 -2713 -178852 186460 137702 132091
$$ packed form
9295a75849j72066B8053a36582A4604a92062J8324h936D229a93852e7613D9609
9283b98827A33694n5049a79146c8175k12261D9499b62549L0631J04106a4217j40034
9272a54251g3611C03094d54834A9007a86778k2485A44115L7593B2875a54622A00788
9260a38051f713F7798k0331c1317R569C42512G3216P7561m3548J01974H9174j6591
9248G2583E208J76196q8178l9193b98407B41444a33539a2378j84939A54203k8040
9237A26163c94940P8820d1880A1574L9549J7492A286d0469B1246a04518A4751
9225c25602a31236b4161j36506p7821J6272m2049B11865I2680d23405J57964L9895
9214b25546C7168M6414J7292K4824k6070a88438b713j76139A86460m8758n611
$$ plain form
9203 132091 -93632 -134436 -38345 -233933 100497 -329892 173404 62486 248068 134448
9193 134448 -298682 -84789 77717 -110668 -29818 -58618 -141363 -159360 -211617 57341 -221379
9181 90137 -125830 -1489 -209945 -455184 12424 -17154 -384317 -401164 65928 -154064 -48947
9169 -75127 -11830 8834 122188 -158172 -48217 -60318 76602 -56711 85210 207063 51843
9157 -233188 -39127 -23239 110860 14554 117185 1530 -240908 143210 163477 -222176 -10520
9145 -21807 178209 -434059 -134762 -25480 -213124 264261 -257081 -10075 102347 41372
9134 -262229 3867 220703 46464 -138483 -60833 -23228 -277639 -212061 -43313 121852 228538
9123 228538 -198190 48584 -15393 -321214 -409290 -268606 -124734 40250 -166522 -56199 -10715
$$ packed form
9203A32091i3632m0804c8345j95588A00497c29892A73404F2486J85582j13620
9193A34448b98682h4789G7717a10668b9818k8800q2745j7997n2257E7341b21379
9181I0137a25830a489k08456k45239A2424a7154l67163j6847F5928a54064d8947
9169g5127a1830H834J13354a58172d8217j2101G6602e6711H5210J21853E1843
9157b33188c9127J5888A10860A4554J02631A530b40908A43210K0267b22176a0520
9145b1807A78209d34059a34762b5480j87644B64261b57081a0075A02347D1372
9134b62229C867K16836D6464a38483f0833b3228k54411O5578d3313A21852J06686
9123B28538a98190D8584a5393l05821q8076J40684a24734D0250a66522e6199a0715
$$ plain form
9111 -234005 9595 -108448 100305 -72629 176466 147691 53966 -112080 -166506 -270720 265825
9099 -210579 -26443 -34191 1711 25261 -202501 -133736 -38709 -207033 -17564 -107105 -173647 168163
9086 -175254 -10062 122099 -467605 168220 12211 10095 -336550 70390 -50107 126074 -62005
9074 223700 -20251 -201276 91853 -161975 157911 -40976 -217077 -4436 19708 77565 -82552
9062 132931 4315 61377 -23695 161921 -75728 -147065 -66886 -223942 32900 -139667 -95701
9051 -95701 -193023 -139009 46428 81042 -18976 -9446 -103228 -6466 194728 -295457 -128987 -122531
9039 -122531 5682 -145807 95786 -67150 -156840 5775 184441 12229 145466 -19590 27993
9027 -59804 -263863 -195383 -10426 126763 -196298 160946 -332887 -222483 -207713 125826
$$ packed form
9111b34005I595a08448A00305g2629A76466k8775E3966a12080n4426j04214B65825
9099b10579b6443p748A711K3550b02501O8765c8709j68324a7564q9541o6542A68163
9086a75254a0062A22099d67605A68220A2211k116c36550G0390e0107A26074f2005
9074B23700b0251j81025I1853a61975A57911d0976j76101d436A9708N7857h2552
9062A32931D315N7062b3695A61921g5728p1337f6886j57056C2900a39667M3966
9051i5701r7322N4014D6428L4614a8976i446r3782f466A94728b95457a28987O456
9039a22531E682a45807I5786f7150q9690E775J78666A2229J33237a9590B7993
9027e9804k04059O8480a0426A26763a96298A60946c32887J10404J4770A25826
$$ plain form
9016 144918 30799 -53486 76915 -22448 60651 -72871 -1248 -181585 20598 -17449 -191532
9005 -191532 76774 -179946 -135529 213000 25325 10032 -423380 142261 95507 434753 -73688
8993 -74911 -24403 -176357 -300841 -169141 91974 -227220 -79424 -82886 44272 -193435 -297202
8982 -297202 -302808 6963 -264075 79514 -123379 -143626 11217 -218058 46058 -240294 48873
8970 -49146 -24681 -30963 -216754 -184231 -346570 -67319 -112239 -74363 237856 115868 -344995
8958 -149527 -181650 -86419 76576 -30537 -367935 -186545 -180193 122209 -283870 -124317 -212214
8947 -212214 25775 163742 -20206 -140123 -301830 -40754 3172 43599 -186342 -14368 279032
8935 -108822 95285 543147 482119 42412 67068 312946 40433 138720 66476 194572 776193
$$ packed form
9016A44918C0799e3486G6915b2448F0651g2871a248j80337B0598a7449j74083
9005a91532G6774a79946M4417B13000B5325A0032d23380A42261m6754L39246g3688
8993g4911b4403j51954j24484J31700I1974b27220g9424l462D4272a93435j03767
8982b97202n606F963b64075G9514a23379k0247A1217b18058D6058b40294D8873
8970d9146K4465o282j85791L2523j62339f7319m4920L7876B37856A15868c44995
8958a49527l2123h6419G6576c0537l37398J81390O352A22209b83870a24317q7897
8947b12214B5775J37967b0206j19917j61707d0754C172M0427a86342a4368B79032
8935a08822I5285M47862o1028D2412K4656K45878D0433R8287F6476J28096N81621
$$ plain form
8924 776193 1010224 1759743 5808691 20493191 11391686 3591036 1363926 555442 568405
8915 568405 349133 343677 248214 -179562 240961 -142035 124796 66661 171179 78078 243365
8904 243365 -169087 -245623 92621 5974 63238 13424 -164073 -441894 -73080 37979 -88181
8892 335365 6055 -140766 39289 61636 231691 -200200 -262606 -144134 139713 -7624 542648
8880 108774 -166033 -107674 247934 -19515 -148837 4089 -67963 -85016 -198862 -142765 209434
8868 -311120 -31100 6933 -216235 -39696 105086 -123687 -82122 -267545 -176322 -14424 33226
$$ packed form
8924G76193K34031P49519M048948J4684500r101505C591036A363926E55442J2963
8915E68405k19272n456r5463a79562B40961a42035A24796n8135J04518G8078J65287
8904B43365a69087p6536I2621E974N7264A3424a64073k77821g3080C7979h8181
8892C35365F055a40766C9289K2347J70055b00200o2406J18472A39713g624E42648
8880A08774a66033N8359B47934a9515j29322D089f7963j7053j13846N6097B09434
8868c11120c1100F933b16235c9696A05086a23687M1565j85423R1223a4424C3226
$$ [...]
##END NTUPLES=NMR SPECTRUM
##END=
