
##TITLE=UV1241_M8_1260-1248_90_7241437_K57V22cx5a
##JCAMPDX= 6.0         $$ Bruker NMR JCAMP-DX V2.0
##DATA TYPE= NMR SPECTRUM
##DATA CLASS= NTUPLES
##ORIGIN= BRUKER
##OWNER= Administrator
$$ 1.72 TOPSPIN		Version 2.1
$$ 2013-01-19 00:00:32.971 -0500  Administrator@X
$$ Compression mode = diff/dup
##.OBSERVE FREQUENCY= 400.02188249412
##.OBSERVE NUCLEUS= ^1H
##.ACQUISITION MODE= SIMULTANEOUS (DQD)
##.ACQUISITION SCHEME= undefined
##.AVERAGES= 8
##.DIGITISER RES= 22
##SPECTROMETER/DATA SYSTEM= spect
##.PULSE SEQUENCE= zg30
##.SOLVENT NAME= COFFEE_meoh
##.SHIFT REFERENCE= INTERNAL, COFFEE_meoh, 1, 14.98509
##AUDIT TRAIL= $$ (NUMBER, WHEN, WHO, WHERE, PROCESS, VERSION, WHAT)
$$ ##TITLE= Audit trail, TOPSPIN		Version 2.1
$$ ##JCAMPDX= 5.01
$$ ##ORIGIN= Bruker BioSpin GmbH
$$ ##OWNER= Administrator
$$ $$ E:\/data/COFFEE/nmr/UV1241_M8_1260-1248_90_7241437_K57V22cx5a/20/pdata/1/auditp.txt
$$ ##AUDIT TRAIL=  $$ (NUMBER, WHEN, WHO, WHERE, PROCESS, VERSION, WHAT)
(   1,<2013-01-19 00:00:24.924 -0500>,<Administrator>,<X>,<go>,<TOPSPIN 2.1>,
      <created by zg
	started at 2013-01-18 23:59:18.533 -0500,
	POWCHK enabled, PULCHK disabled,
       configuration hash MD5:
       86 BA 57 50 F2 9D 5C 9B 26 00 A9 28 5F 66 2E 89
       data hash MD5: 64K
       A6 52 54 EB D5 65 F7 66 10 B3 6B BE 7D D2 91 C3>)
(   2,<2013-01-19 00:00:27.940 -0500>,<Administrator>,<X>,<proc1d>,<TOPSPIN 2.1>,
      <Start of raw data processing
       efp LB = 0 FT_mod = 6 PKNL = 1 PHC0 = 0 PHC1 = 0 SI = 32K 
       data hash MD5: 32K
       3A 5A C4 EC 7A 03 FD B3 5A 48 9D 7A EE 95 78 88>)
(   3,<2013-01-19 00:00:28.408 -0500>,<Administrator>,<X>,<proc1d>,<TOPSPIN 2.1>,
      <pk PHC0 = 95.49866 PHC1 = 0 
       data hash MD5: 32K
       EA 48 E4 40 25 CE E3 1F 06 44 B2 71 F6 71 5A 8C>)
(   4,<2013-01-19 00:00:28.643 -0500>,<Administrator>,<X>,<proc1d>,<TOPSPIN 2.1>,
      <abs ABSG = 1 
       data hash MD5: 32K
       A8 B9 D7 69 AB A4 70 D9 36 42 53 01 13 13 9F 77>)
(   5,<2013-01-19 00:00:28.799 -0500>,<Administrator>,<X>,<proc1d>,<TOPSPIN 2.1>,
      <abs ABSG = 2 
       data hash MD5: 32K
       7E 4B A6 3D 8C CE B9 E8 DA 88 BB A6 9D 36 53 98>)
(   6,<2013-01-19 00:00:28.940 -0500>,<Administrator>,<X>,<proc1d>,<TOPSPIN 2.1>,
      <abs ABSG = 3 
       data hash MD5: 32K
       AE 9F 8F 70 7A 9B 41 BD 2E 13 CB 38 3A 33 6D FF>)
(   7,<2013-01-19 00:00:29.080 -0500>,<Administrator>,<X>,<proc1d>,<TOPSPIN 2.1>,
      <abs ABSG = 4 
       data hash MD5: 32K
       72 11 22 55 BD 59 90 97 4F A9 E6 94 51 AF F3 E5>)
(   8,<2013-01-19 00:00:29.236 -0500>,<Administrator>,<X>,<proc1d>,<TOPSPIN 2.1>,
      <abs ABSG = 5 
       data hash MD5: 32K
       C2 AD B3 62 50 F1 0E AD 2F E8 93 06 03 83 EB 05>)
$$ ##END=
$$ 
$$ $$ hash MD5
$$ $$ 74 C3 27 AE 6A C3 99 07 D5 02 6E 97 5F FD 7A 30
##$RELAX= 
##$RELAX= 
##$RELAX= 
##$RELAX= 
##$RELAX= 
##$RELAX= 
##$RELAX= 
$$ Bruker specific parameters
$$ --------------------------
##$DU= <E:\>
##$EXPNO= 20
$$ [...]
150 150 150 150 150 150 150 150
##$TP07= 0
##$TPNAME0= <>
##$TPNAME1= <>
##$TPNAME2= <>
##$TPNAME3= <>
##$TPNAME4= <>
##$TPNAME5= <>
##$TPNAME6= <>
##$TPNAME7= <>
##$TPOAL= (0..7)
0.5 0.5 0.5 0.5 0.5 0.5 0.5 0.5
##$TPOFFS= (0..7)
0 0 0 0 0 0 0 0
##$TUNHIN= 0
##$TUNHOUT= 0
##$TUNXOUT= 0
##$USERA1= <user>
##$USERA2= <user>
##$USERA3= <user>
##$USERA4= <user>
##$USERA5= <user>
##$V9= 5
##$VALIST= <valist>
##$VCLIST= <CCCCCCCCCCCCCCC>
##$VD= 0
##$VDLIST= <DDDDDDDDDDDDDDD>
##$VPLIST= <PPPPPPPPPPPPPPP>
##$VTLIST= <TTTTTTTTTTTTTTT>
##$WBST= 1024
##$WBSW= 4
##$XGAIN= (0..3)
0 0 0 0
##$XL= 0
##$YL= 0
##$YMAX_a= 666613
##$YMIN_a= -566114
##$ZGOPTNS= <>
##$ZL1= 120
##$ZL2= 120
##$ZL3= 120
##$ZL4= 120
##$ABSF1= 14.98509
##$ABSF2= -5.573092
##$ABSG= 5
##$ABSL= 3
##$ALPHA= 0
##$AQORDER= 0
##$ASSFAC= 0
##$ASSFACI= 0
##$ASSFACX= 0
##$ASSWID= 0
##$AUNMP= <proc_prof1d_extract_pilot.lims>
##$AXLEFT= 0
##$AXNAME= <>
##$AXNUC= <1H>
##$AXRIGHT= 0
##$AXTYPE= 0
##$AXUNIT= <>
##$AZFE= 0.1
##$AZFW= 0.1
##$BCFW= 0
##$BC_mod= 0
##$BYTORDP= 0
##$COROFFS= 0
##$CY= 15
##$DATMOD= 1
##$DC= 0
##$DFILT= <>
##$DTYPP= 0
##$F1P= 0
##$F2P= 0
##$FCOR= 0.5
##$FTSIZE= 32768
##$FT_mod= 6
##$GAMMA= 0
##$GB= 0
##$INTBC= 1
##$INTSCL= 1
##$ISEN= 128
##$LB= 0
##$LEV0= 0
##$LPBIN= 0
##$MAXI= 10000
##$MC2= 0
##$MEAN= 0
##$ME_mod= 0
##$MI= 0
##$NCOEF= 0
##$NC_proc= -8
##$NLEV= 6
##$NOISF1= 0
##$NOISF2= 0
##$NSP= 0
##$NTH_PI= 0
##$NZP= 0
##$OFFSET= 14.98509
##$PC= 1
##$PHC0= 95.49866
##$PHC1= 0
##$PH_mod= 1
##$PKNL= yes
##$PPARMOD= 0
##$PPDIAG= 0
##$PPIPTYP= 0
##$PPMPNUM= 2147483647
##$PPRESOL= 1
##$PSCAL= 4
##$PSIGN= 0
##$PYNMP= <proc.py>
##$REVERSE= no
##$SF= 400.02
##$SI= 32768
##$SIGF1= 0
##$SIGF2= 0
##$SINO= 400
##$SIOLD= 32768
##$SPECTYP= <>
##$SREGLST= <1H.CDCl3>
##$SSB= 0
##$STSI= 32768
##$STSR= 0
##$SW_p= 8223.68421052631
##$SYMM= 0
##$S_DEV= 0
##$TDeff= 65536
##$TDoff= 0
##$TI= <>
##$TILT= no
##$TM1= 0
##$TM2= 0
##$TOPLEV= 0
##$USERP1= <user>
##$USERP2= <user>
##$USERP3= <user>
##$USERP4= <user>
##$USERP5= <user>
##$WDW= 1
##$XDIM= 32768
##$YMAX_p= 460663101
##$YMIN_p= -659731
##$CURPLOT= <Network HP LaserJet P1505>
##$CURPRIN= <$Network HP LaserJet P1505>
##$DFORMAT= <normdp>
##$LAYOUT= <+/1D_H.xwp>
##$LFORMAT= <normlp>
##$PFORMAT= <normpl>
##$SURQMSG= 1
$$ End of Bruker specific parameters
$$ ---------------------------------
##NTUPLES= NMR SPECTRUM
##VAR_NAME=  FREQUENCY,     SPECTRUM/REAL,   SPECTRUM/IMAG
##SYMBOL=    X,             R,               I
##VAR_TYPE=  INDEPENDENT,   DEPENDENT,       DEPENDENT
##VAR_FORM=  AFFN,          ASDF,            ASDF
##VAR_DIM=   32768,         32768,           32768
##UNITS=     HZ,            ARBITRARY UNITS, ARBITRARY UNITS
##FACTOR=    0.250966925370066, 1,           1
##FIRST=     8223.43324360094, -109110,      -190749
##LAST=      0,             157471,          -75213
##MIN=       0,             -659731,         0
##MAX=       8223.43324360094, 460663101,    0
$$ Real data points
##PAGE= N=1
##DATA TABLE= (X++(R..R)), XYDATA
$$ [...]
$$ plain form
19532 -87826 105365 -31978 -152564 72164 -4925 -180308 -118680 66517 -260143 38501 -184367
19520 80209 45977 -152439 -5394 48124 -86039 87887 -290081 -106601 -96585 -378279 170679
19508 118760 -127993 84008 -180691 154657 -111038 -173781 52158 -236787 -6754 -545520
19498 -545520 113846 -88453 -134385 -146026 11104 44713 -10738 35592 -191480 -293358 -81443
19486 -96314 43832 146429 -156108 151692 -394863 95381 270488 117408 -117441 313612
19475 2374 -234918 -62716 -103781 -334238 -590962 -216962 -54869 -92941 55554 -221945 104724
19463 92726 97406 31362 112059 -93994 -163188 -132500 85788 -31515 -37836 132338 -215884 95939
19450 -395171 50514 60543 -184785 -132587 46796 -94685 -129001 -101051 -152953 -34949 105878
$$ packed form
19532h7826A05365c1978j20586G2164d925j75383O1628F6517b60143C8501a84367
19520H0209l4232a52439e394D8124h6039H7887b90081a06601J0016k81694A70679
19508A18760a27993H4008a80691A54657a11038o2743E2158b36787f754n38766
19498e45520A13846h8453m5932j1641A1104L3609a0738C5592a91480j01878h1443
19486i6314D3832J02597a56108A51692c94863I5381J75107A17408a17441C13612
19475B374b34918f2716m1065k30457k56724b16962e4869l8072E5554b21945A04724
19463I2726M680C1362Q0697i3994o9194L0688H5788c1515o321A32338b15884I5939
19450c95171E0514J0029a84785N2198D6796i4685l4316K7950n1902c4949A05878
$$ plain form
19438 -214381 -201210 251164 -239653 53110 -53708 -63903 98512 -7108 -190353 45136 -362371
19426 248116 -243123 -373642 -112908 -172819 -118325 116352 -169821 4875 15985 -459231
19415 36248 -37241 73005 -103956 25639 122240 -331468 -36936 254888 32843 -288353 119029
19403 162373 -271953 60100 160399 -61507 -178717 -189782 -110202 -385017 104966 104269 143376
19392 143376 26760 127467 -128291 -212773 292140 -390039 123079 -179941 262683 -156938
19381 54119 -38407 -119273 -231888 18286 223302 -127905 -201260 -7517 -23633 -9117 216954
19369 -147563 -186163 78218 -122097 293876 -203863 114645 -62947 129522 -260442 -192862
19359 -192862 81389 331504 -129109 -190199 -204747 1960 4768 188099 -304974 -172523 130970
$$ packed form
19438b14381J3171B51164b39653E3110e3708j0195I8512g108j83245D5136c62371
19426B48116b43123j30519a12908n9911N4494A16352a69821D875J1110d59231
19415C6248c7241G3005a03956B5639R6601c31468c6936B54888C2843b88353A19029
19403A62373b71953F0100J00299f1507j17210j1065P9580k74815A04966o97L9107
19392A43376B6760J00707a28291q4482B92140c90039A23079a79941B62683a56938
19381E4119c8407q0866j12615A8286K05016a27905p3355g517j6116i117B16954
19369a47563l8600G8218a22097B93876b03863A14645f2947A29522b60442O7580
19359a92862H1389K50115a29109o1090j4548A960K808J83331c04974J32451A30970
$$ plain form
19347 59858 347725 142235 324508 -17505 49542 -45945 -29661 213957 11187 -22069 97391
19335 -159579 -236137 -70986 307921 -89378 -13695 118660 -151253 129479 -165373 143235
19324 -140543 -148602 -187505 -244924 339963 66316 -242846 70128 -30365 -162030 155823 -165135
19312 24882 -21461 37420 -81386 -97964 -117935 -453793 2857 49325 -216665 79395 -47985
19300 157574 -98141 93284 62080 -11083 166637 -231182 -28660 2248 108464 144542 102829
19289 102829 -14466 87763 29065 228959 -250710 -65488 -44631 -300685 17480 -59274 -219235
19278 -219235 -57545 -191362 204007 24535 -78243 192608 -272829 -246721 229503 -72652
19267 -353750 -395389 -41288 151492 -311117 92983 222214 -287200 -74288 -269030 -110888
$$ packed form
19347E9858K87867A42235J82273a7505D9542d5945J6284B13957A1187b2069I7391
19335a59579p6558g0986C07921h9378a3695A18660a51253A29479a65373A43235
19324a40543q059l8903n7419C39963F6316b42846G0128c0365j31665A55823a65135
19312B4882b1461C7420h1386j6578j9971l35858B857M6468b16665G9395d7985
19300A57574i8141I3284l1204a1083A66637b31182b8660B248J06216L6078m1713
19289A02829a4466H7763B9065J99894b50710f5488K0857k56054A7480e9274j59961
19278b19235e7545j33817B04007B4535g8243A92608b72829K6108B29503g2652
19267c53750m1639d1288A51492c11117I2983J29231b87200g4288j94742a10888
$$ plain form
19256 -250370 -242983 -134847 -178039 75959 5717 -242403 240838 43282 -138236 -102912 9021
19244 -406728 -15403 116315 -146167 140964 -108805 55287 25374 -82236 101415 36605
19233 -148037 118984 -300551 142654 -304496 -178564 -377755 -96935 199064 292390 91385
19222 -148493 -93043 70708 236873 -167883 4027 101447 -139115 -37629 133754 196386 146201
19211 146201 29865 -344350 103848 -62986 -22390 -176941 -149090 -108687 -328210 -100522
19200 89143 -248702 -101657 91120 -231340 6155 2700 -252693 -230719 -260685 631 126616
19189 126616 -173266 159021 -190723 -247116 65041 -328197 417001 -38746 -22580 182551
19178 -93793 -133350 -64990 186508 -293830 -442951 -189341 -195809 196408 -386806 128792
$$ packed form
19256b50370P387J08136m3192G5959E717b42403B40838D3282a38236L5324I021
19244d06728a5403A16315a46167A40964a08805E5287B5374h2236A01415C6605
19233a48037A18984c00551A42654c04496J25932j99191i6935A99064R3326I1385
19222a48493N5450G0708J66165a67883D027R7420a39115c7629A33754O2632n0185
19211A46201B9865c44350A03848f2986b2390j54551K7851M0403k19523a00522
19200H9143b48702a01657I1120b31340F155B700b52693K1974k9966F31J25985
19189A26616a73266A59021a90723n6393F5041c28197D17001c8746J6166A82551
19178i3793l9557f4990A86508b93830j49121a89341o468A96408c86806A28792
$$ plain form
19167 -262670 -102633 -138837 -4780 -206909 -106918 -226683 -34842 -197009 237684 -293165
19156 41508 -245492 -211947 -9036 -38536 -241207 -18143 252880 -178641 218689 -127915 -139245
19145 -139245 50106 118738 155812 113635 -86089 166297 -26805 -8064 -22852 220966 -95817
19133 -69394 -47909 -63052 -83280 209838 -315502 124754 -126914 11670 112009 -106753
19122 -152081 41048 -115328 -118637 149700 -43265 -309998 191393 4186 -183904 165103 310588
19111 310588 97800 26500 -239851 206955 -22525 -81002 6294 -144168 -291932 -71179 -131221
19100 -131221 -97749 -45578 -3401 -147617 -85463 -204265 -85222 124738 -170122 135853 51360
19088 -126015 -138445 -294587 -89183 -89935 -219241 -84552 -106099 269666 -259112 -174315 132713
$$ packed form
19167b62670a02633l6204d780k02129R9991j19765c4842j62167B37684b93165
19156D1508b45492L3545i036k9500k02671a8143B52880a78641B18689a27915j1330
19145a39245E0106O8632L7074m2177h6089A66297b6805h064j4788B20966i5817
19133f9394K1485j5143k0228B09838c15502A24754a26914A1670J00339a06753
19122a52081D1048a15328l309A49700d3265k66733A91393D186a83904A65103J45485
19111C10588I7800B6500b39851B06955b2525n8477F294a44168j47764g1179o0042
19100a31221L3472d5578c401j44216O2154j18802h5222A24738a70122A35853E1360
19088a26015j2430j56142h9183p52j29306h4552k1547B69666b59112Q4797A32713
$$ plain form
19076 -389756 -230841 -448133 -141744 -262147 -141280 -82461 -218653 -120626 131060 -414522
19065 -119475 19794 -134139 -216501 -570280 58361 -113909 -84843 -79667 74070 -39152 -292484
19054 -292484 -79026 -51003 384178 70521 -195933 58090 26571 -85155 79364 94795 -35276
19042 -45176 181975 28418 224961 -28378 -27429 -113715 -10916 183258 337749 -151475 11162
19030 182568 -132627 115059 105735 -314036 -11193 -6802 -80508 -34074 -62948 -18662 -107951
19019 -107951 198849 19442 -53020 180015 -1522 -124769 -167770 -14210 12284 186347 -102150
19007 -58367 -388545 -35382 286322 -164766 -2818 223321 99343 275277 -256101 -39172 -164423
18996 -164423 -14770 78171 184978 -272129 2071 -424199 299825 -23404 -45735 306815 63686
$$ packed form
19076c89756J58915k17292a41744j20403J20867N8819j36192R8027A31060d14522
19065a19475A9794a34139q2362l53779E8361a13909K9066N176G4070c9152k53332
19054b92484g9026K8023C84178G0521a95933E8090B6571h5155G9364J5431c5276
19042d5176A81975B8418J96543b8378R49q6286a0916A83258J54491a51475A1162
19030A82568a32627A15059r324c14036a1193M391p3706c4074k8874a8662q9289
19019a07951A98849A9442e3020A80015a522j23247m3001a4210A2284J74063a02150
19007e8367l30178c5382B86322a64766b818B23321I9343J75934b56101c9172j25251
18996a64423a4770G8171J06807b72129B071d24199B99825b3404k2331C06815F3686
$$ plain form
18984 -90510 130961 528897 -46686 58996 140982 -104531 -97237 -176669 -284519 75660 -238546
18972 132389 46964 188173 -376640 -315644 104144 -399465 43908 -58191 -313565 114994
18961 -87562 115392 127747 -252294 63292 165014 64880 202091 -66001 -31939 292515 186711
18950 186711 -95940 105722 141196 -113801 -219595 -144961 -2115 -94606 -230731 268342 -109170
18938 167539 15918 -86936 -237167 -71627 109489 -122511 -53239 -324578 -192658 209474
18927 -194729 -25507 293948 -9515 -217320 -42355 -70950 47073 -41107 42583 252591 61454
18915 363386 79772 -140025 -101471 -312161 -102510 -28668 -266730 -259232 -313539 -225659 -101530
18903 96674 -253377 58576 -338175 -62566 44681 180418 48746 134129 69095 125526 -142395
$$ packed form
18984i0510A30961L97936d6686E8996Q1986a04531P294p9432j07850G5660b38546
18972A32389D6964J41209c76640O0996A04144c99465D3908e8191k55374A14994
18961h7562A15392J2355b52294F3292J01722F4880J37211f6001c1939B92515j05804
18950A86711i5940A05722L5474a13801j05794P4634b115r2491j36125B68342a09170
18938A67539A5918h6936j50231g1627A09489a22511e3239k71339J31920B09474
18927a94729b5507B93948i515k07805d2355k8595D7073d1107D2583K10008F1454
18915C63386G9772a40025L8554k10690a02510b8668k38062P498n4307Q7880a01530
18903I6674b53377E8576c38175f2566D4681J35737D8746Q5383o5034N6431a42395
$$ plain form
18891 -301360 18008 152740 -115408 -133728 47206 146141 -339146 -86290 41798 -155789 -195392
18880 -195392 -69995 -170393 -49792 -57245 -238775 111587 105305 -246735 64744 -178787 174216
18868 -134663 -76299 -109917 -95378 228052 -261532 -193324 -305203 -55988 234678 140395 -133495
18856 -445033 39114 -150131 70407 134450 116635 -156622 -38651 -170748 -176666 137140 -47483
18844 -196219 22866 -507381 -69346 109297 -86824 -300799 4052 -4300 -54468 -63678 -147075
18833 -147075 -136755 -135968 -101242 -83239 -65513 -50066 -252025 2422 53574 63125 137614 -322852
18820 -283150 124777 -210094 50983 45847 -144536 179907 14201 -106641 -26025 89093 -253320
18808 -102210 113650 -18587 171205 126191 216332 -8334 52286 129991 74091 -200657 41478
$$ packed form
18891c01360A8008J34732a15408j8320D7206R8935c39146h6290D1798a55789l9603
18880a95392f9995j00398d9792p453j81530A11587o282b46735F4744a78787A74216
18868a34663N8364l3618J4539B28052b61532O8208j11879e5988B34678r4283a33495
18856d45033C9114a50131G0407O4043j7815a56622c8651j32097n918A37140d7483
18844a96219B2866e07381f9346A09297h6824k13975D052d300n0168r210q3397
18833a47075J0320P87L4726J8003J7726J5447k01959B422N1152R551P4489c22852
18820b83150A24777b10094E0983n136a44536A79907A4201a06641b6025H9093b53320
18808a02210A13650a8587A71205m5014R0141h334E2286P7705n5900b00657D1478
$$ plain form
18796 -152166 -187017 -93256 21967 61147 -98024 -160635 292789 405 30672 66801 -214327
18784 -384513 -53758 -450743 -247035 13803 -9738 44512 -48408 33656 -12080 -212693 19016
18772 205085 -307251 -17571 -96687 -208552 14040 57269 -194123 -67101 -69051 -83857 80275
18760 -256906 72850 113074 -71366 -12790 -34752 50146 55606 167391 222839 -354765 -269646
18749 -269646 140913 -189128 -136056 -59550 -125548 -77568 360742 -266739 194830 34399
18738 -302699 -627600 371917 -75429 -214567 -126889 -204961 11106 -98550 -59964 -81813 94750
18726 50383 -252451 -213384 -170049 -4557 116192 -233169 257716 173959 -55775 -358334 82517
18714 -395284 -124606 -72284 -52843 -200189 170772 -47315 -72391 -103107 -49662 -411611 -243971
$$ packed form
18796a52166l4851i3256B1967L9180i8024o2611B92789D05L0267L6129b14327
18784c84513e3758l96985K03708A3803i738D4512d8408C3656a2080k00613A9016
18772B05085c07251a7571p9116j11865A4040M3229a94123f7101j950j4806H0275
18760b56906G2850M0224g1366a2790k1962E0146N460J11785N5448c54765Q5119
18749b69646A40913a89128N3072e9550o5998M7980C60742b66739A94830C4399
18738c02699l24901C71917g5429j39138Q7678p8072A1106i8550L8586k1849I4750
18726E0383b52451L9067M3335d557A16192b33169B57716q3757e5775l02559H2517
18714c95284a24606N2322J9441j47346A70772d7315k5076l0716d9662l61949J67640
$$ plain form
18703 -243971 1812 -108438 196779 108976 -133191 -47594 -32074 -93047 -194725 53177 194353
18692 194353 -83945 -168907 -138183 -179366 235196 -133893 -363024 -25924 -146030 -376847
18682 -376847 -19342 -293991 -27100 112351 152927 -9706 -183360 65239 -4847 41300 1181
18670 -226546 327748 -99173 -104092 -378455 488227 -6419 125805 -30011 51679 -77218 243762
18658 66988 62904 215732 -68809 -111152 -138758 -245086 -35697 -7168 -8090 66682 -229168 -110801
18645 -163364 133360 -26171 -287462 29916 12841 -119440 -31429 71909 23420 74590 -35194
18633 -28828 28629 -229214 205202 213489 62382 -298456 -60608 -20655 -651532 -3742 -371638
18622 -371638 -64670 -191937 86948 264850 -125289 192127 -143885 -278585 211656 -40406
$$ packed form
18703b43971A812a08438A96779q7803a33191d7594J5520o0973j01678E3177J41176
18692A94353h3945q4962L0724m1183B35196a33893k29131b5924j20106k30817
18682c76847a9342k74649b7100A12351M0576i706j73654F5239d847D1300A181
18670b26546C27748i9173m919k74363D88227f419A25805c0011E1679g7218B43762
18658F6988m084J52828f8809m2343k7606j06328c5697g168r22F6682b29168a10801
18645a63364A33360b6171k61291B9916A2841a19440c1429G1909B3420N1170c5194
18633b8828B8629b29214B05202Q287F2382b98456f0608b0655o30877c742l67896
18622c71638f4670j27267H6948J77902a25289A92127a43885j34700B11656d0406
$$ plain form
18611 -133787 179001 -113507 -96786 -138727 111705 -122066 161151 -74620 -42264 248099
18600 -240889 128068 -104540 207127 17133 -222823 -28290 18223 54809 -51735 -213751
18590 -213751 -119670 138434 118557 63008 -6240 -42238 -27393 80149 114274 -26704 -206316
18579 -206316 -42852 -55578 205602 -209360 71709 -220629 50095 37287 -101141 97268 57220
18568 57220 -269138 -39445 100155 -127210 43822 -158029 -23974 115614 41542 -206795
18557 -273421 -194073 74624 -313914 -254295 -104900 -58842 -112109 89032 -314243 52757 196631
18546 196631 13873 -94671 -344195 -15564 -19522 -197123 -289439 -209463 -18091 -19212 107375
18534 75866 -164795 65222 -131888 -295814 -72331 -238464 -227578 43199 -146213 49278 -79818
$$ packed form
18611a33787A79001a13507J6721m1941A11705a22066A61151g4620L2356B48099
18600b40889A28068a04540B07127A7133b22823b8290A8223L6586e1735j62016
18590b13751R4081A38434j9877n5549f240l5998J4845H0149L4125b6704j79612
18579b06316d2852j2726B05602b09360G1709b20629E0095j2808a01141I7268m0048
18568E7220b69138c9445A00155a27210D3822a58029b3974A15614D1542b06795
18557b73421P9348G4624c13914N9619a04900M6058n3267H9032c14243E2757J43874
18546A96631A3873i4671k49524a5564l958j77601r2316P9976a8091j121A07375
18534G5866a64795F5222a31888j63926g2331j66133J0886D3199a46213D9278g9818
$$ plain form
18522 -162744 -18557 -183140 -49585 58207 -51782 -196216 100481 -229154 -65623 -179840
18512 -179840 37821 273509 54194 -20394 -95390 -70500 59627 -15735 49440 140576 -28058
18500 150429 -454526 -129771 -144841 201902 -19433 -184921 -180311 -363254 184768 -158055
18489 -157624 91359 100349 -323832 -28623 -127039 -82580 117584 -59351 67335 -212853 269594
18477 55601 -81352 -235064 4823 -84714 -2718 131781 46627 -185859 207923 231212 -179469
18465 921 -48855 -97851 138732 57581 -51850 -118155 270636 -175702 152308 -188939 -241755
18454 -241755 89983 194867 9723 -79602 -35700 -132705 -49065 46027 -57938 -328421 -208145
18443 -208145 -13117 -177215 104255 197779 -173891 -38725 -128211 -30243 9488 -271059 -208196
$$ packed form
18522a62744a8557j64583d9585E8207e1782j44434A00481b29154f5623j14217
18512a79840C7821K35688E4194b0394p4996K4890E9627a5735D9440R1136b8058
18500A50429d54526a29771j5070B01902a9433j65488M610j82943A84768a58055
18489a57624I1359Q990c23832b8623r8416M4459A17584e9351F7335b12853B69594
18477E5601h1352j53712D823h4714b718A31781D6627a85859B07923K3289a79469
18465I21d8855m8996A38732E7581e1850o6305B70636a75702A52308a88939n2816
18454b41755H9983J04884I723g9602c5700r7005d9065D6027e7938k70483J20276
18443b08145a3117j64098A04255R3524a73891c8725q9486c0243I488b71059O2863
$$ plain form
18432 -208196 136483 -9682 17724 -161 65244 -383753 -180207 -70719 -243828 77768 -529974
18420 -285306 111711 -180300 6732 -178473 254806 -215243 164163 204809 182615 -300860
18409 -23928 -31958 195821 -122754 66581 18666 -262355 -174550 229268 -148272 -263484 -141700
18398 -141700 -71445 -43660 -368773 130609 -216335 174784 -223317 -175205 195573 -76305
18387 -188278 13491 5955 193995 148293 -154059 25117 53907 54598 -21740 -133414 -7732 -111295
18375 -111295 -11910 -132227 165844 7555 -252473 -220180 211546 9261 -294287 -25690 -51978
18364 -51978 30657 -182028 -72199 167778 -58861 -160004 22579 133345 -52957 -61681 -113530
18353 -113530 -202389 417130 -3590 20246 20974 -68745 236861 -64968 157278 -143033 -144498
$$ packed form
18432b08196A36483i682A7724a61F5244c83753a80207g0719j73109G7768e29974
18420b85306A11711a80300F732a78473B54806b15243A64163M0646k2194c00860
18409b3928q030A95821a22754F6581A8666b62355Q7805B29268a48272j15212J21784
18398a41700P0255K7785l25113A30609b16335A74784b23317M8112A95573g6305
18387a88278A3491E955J88040m5702a54059B5117K8790O91b1740j11674g732j03563
18375a11295a1910j20317A65844G555b52473L2293B11546I261b94287b5690k6288
18364e1978C0657a82028g2199A67778e8861j01143B2579J10766e2957q724n1849
18353a13530q8859D17130c590B0246P28f8745B36861f4968A57278a43033j465
$$ plain form
18342 -144498 -194896 1205 -233273 -141275 -104229 153518 162073 -64297 -21475 113589 174707
18331 174707 -110217 -106332 78217 -48346 -190711 -178412 -168935 274980 -173215 8546 16955
18320 16955 -104175 141730 -70225 194294 -713 43215 -53570 -254003 -164000 98415 66446
18309 66446 -321224 -111467 1145 38179 -45282 -106662 61409 -49423 -8632 -217094 -60627
18297 245821 -52045 -105312 -30810 64271 -118123 -80965 202710 -171703 -363031 -264309 -24429
18285 13850 -98244 -397553 27622 79115 -136187 -51725 -37125 -281665 186784 36087 112460
18274 112460 -175531 -40374 -165591 346343 191709 176408 -87892 -15411 -224471 -187274
18264 -187274 151641 -134981 -76156 8465 236542 25323 -301868 -219068 222567 -55234 -200760
$$ packed form
18342a44498n0398A205b33273R1998L7046A53518Q555f4297b1475A13589O1118
18331A74707a10217L885G8217d8346j42365J2299R477B74980a73215H546Q409
18320A6955a04175A41730g0225A94294g13D3215e3570k00433R0003I8415l1969
18309F6446c21224a11467A145L7034d5282o1380F1409d9423h632k08462f0627
18297B45821e2045n3267c0810F4271a18123L7158B02710a71703j91328R8722b4429
18285A3850i8244k99309B7622N1493a36187e1725J4600k44540A86784C6087P6373
18274A12460a75531d0374j25217C46343j54634j5301h7892a5411k09060L7197
18264a87274A51641a34981N8825H465K28077B5323c01868Q2800B22567e5234j45526
$$ plain form
18253 -200760 107814 -96299 244052 -313984 -101173 -99621 -82501 -47322 -102984 -107633 -155057
18242 -155057 14720 -247650 -130127 42182 105012 -246186 120530 324104 79255 -42052
18231 62232 -68403 -248690 8555 -325664 -149950 -39493 41127 113257 -97146 -316673 -129025
18219 -30353 92977 247763 -208286 -14575 230549 -102658 -165315 23804 -111573 -315783
18209 -315783 56187 18309 -137143 -4975 -147246 150127 6873 101093 -263235 -236933 -117784
18197 113153 -198911 -40315 121358 -216453 23900 184967 11657 -221400 -134856 223214
18186 -408545 -132299 145530 124908 219994 -216625 -308912 -72216 -234091 86873 123800 -317808
18174 61001 -343816 -43641 43381 -140235 258420 -1601 -513711 -77505 -33442 126336 65739
$$ packed form
18253b00760A07814i6299B44052c13984a01173J552J7120L5179n5662m649m7424
18242a55057A4720b47650J17523D2182O2830b46186A20530K03574G9255d2052
18231F2232f8403j80287H555c25664a49950c9493D1127P2130i7146k19527a29025
18219c0353I2977J54786b08286a4575B30549a02658o2657B3804a11573k04210
18209c15783E6187A8309a37143d975j42271A50127F873R4220b63235K6302a17784
18197A13153a98911d0315A21358b16453B3900J61067A1657b21400Q6544B23214
18186d08545a32299A45530k0622R5086b16625r2287g2216j61875H6873L6927c17808
18174F1001c43816d3641D3381a40235B58420a601n12110g7505c3442A26336o0597
$$ plain form
18163 65739 -338726 74946 -424298 34462 -350403 207013 -324352 -260450 -53353 42075 31985
18152 31985 128695 -32759 243744 51605 188523 -251324 -156704 -124248 -197588 -363563 4632
18140 43214 171983 -8806 240549 -204121 -80941 -7384 -243437 -233066 -12242 268107 -23763
18128 208447 102043 -110083 -162692 -189771 340547 -378622 -46793 315434 121810 -7418
18117 23610 80922 -8596 1054 56084 -207066 95135 -377778 22424 -133707 -28888 -219075
18106 -219075 -57984 483635 -280071 232108 -52629 -170897 63431 -207983 -65500 271401
18095 -181083 -192945 69644 -184662 -719 4275 40353 -157178 -18965 78265 -389365 -164192
18083 137642 -122182 -113986 -81073 -109079 26091 12253 227786 147857 -254193 94366 283259
$$ packed form
18163F5739c38726G4946d24298C4462c50403B07013c24352O3902e3353D2075j0090
18152C1985R6710c2759B43744E1605J36918b51324R4620L2456p3340j65975D632
18140D3214J28769h806B40549b04121h0941g384k36053J0371a2242B68107b3763
18128B08447A02043a10083n2609k7079C40547c78622d6793C15434A21810g418
18117B3610N7312h596A054N5030b07066I5135c77778B2424a33707b8888j90187
18106b19075e7984D83635b80071B32108e2629j18268F3431b07983f5500B71401
18095a81083j1862F9644a84662g19D275L6078a57178a8965G8265c89365a64192
18083A37642a22182Q196L2913k8006B6091A2253K15533p9929b54193I4366J88893
$$ plain form
18072 283259 -148790 -140763 229445 221671 -283491 129438 -384370 37421 150272 -137001
18061 -9530 297786 -102484 25960 328833 137669 -174886 43475 10679 -91985 196893 29590
18049 -183314 -269796 390169 -39263 -139933 70953 -137236 -393849 69474 -23390 -143496
18039 -143496 -353231 62789 -17014 98429 92864 29395 237882 215190 -173809 -117283 -116196
18028 -116196 -259578 -188758 158243 -46125 221221 -200866 -189969 36682 -216835 -318757
18018 -318757 -45359 200079 -343917 -96563 -94545 112071 -10619 -45875 -64415 257532 53019
18006 239878 -466044 9372 333044 134191 277469 -122229 142310 129811 -41822 43898
17995 185011 -162540 -173945 92351 -180000 -38906 -123591 -265561 -47725 228256 -6023 59332
$$ packed form
18072B83259a48790Q027B29445p774b83491A29438c84370C7421J12851a37001
18061i530B97786a02484B5960L02873A37669a74886D3475A0679i1985A96893B9590
18049a83314q6482C90169c9263j00670G0953a37236k56613F9474b3390j20106
18039a43496k09735F2789a7014I8429n565B9395K08487k2692a73809N6526J087
18028a16196j43382P0820A58243d6125B21221b00866J0897C6682b16835j01922
18018c18757d5359B00079c43917i6563K018A12071a0619l5256j8540B57532E3019
18006B39878d66044I372L23672A34191J43278a22229A42310j2499d1822D3898
17995A85011a62540j1405I2351a80000c8906q4685j41970d7725B28256f023E9332
$$ plain form
17983 124231 -187480 -132099 -240968 -207418 81316 210681 -28950 -110996 117148 68015 -161843
17971 -129799 -166439 308452 -99491 250840 80067 23252 -166527 -247856 185490 165644 -58245
17959 45269 -44712 -62852 -160926 -66514 27379 -173629 239855 83551 -272716 239196 -242858
17947 94546 151040 63533 217582 60156 58155 166542 7942 -10506 14116 138298 235067
17936 235067 -156530 27955 -14845 153455 210340 37487 120484 233823 -174352 32221 222414
17925 222414 -270606 -207100 128922 67917 51386 155432 4324 381628 -116402 -207634 -226669
17914 -226669 -25037 29806 129690 -14370 -275049 50264 -37708 337522 172269 116710 -200431
17902 255565 90671 -274778 27369 112287 25876 113068 -93442 -214574 3908 -203442 208362
$$ packed form
17983A24231a87480N5381j08869L3550H1316J29365b8950q2046A17148m9133a61843
17971a29799l6640C08452i9491B50840H0067B3252a66527q1329A85490j9846e8245
17959D5269d4712j8140r8074f6514B7379a73629B39855H3551b72716B39196b42858
17947I4546N6494F3533J54049F0156k001J08387G942a0506A4116J24182R6769
17936B35067a56530B7955a4845A53455N6885C7487Q2997J13339a74352C2221J90193
17925B22414b70606O3506A28922o1005j6531J04046D324L77304a16402r1232j9035
17914b26669b5037B9806R9884a4370k60679E0264c7708C37522j65253n5559b00431
17902B55565I0671b74778B7369Q4918B5876Q7192i3442j21132C908b03442B08362
$$ plain form
17890 -45664 -5149 305625 -108756 127038 62828 83656 -118205 24284 -8353 170947 391901
17879 391901 15999 -151591 363182 -244340 -17061 -31491 180098 101794 185279 194677 185342
17868 185342 -114822 49316 -67001 -2208 24044 178927 12802 60358 198584 16962 -25851
17856 98310 327785 -8364 55420 -250432 -1537 -176052 -55822 -244546 -48180 -81472 -165911
17845 -165911 314708 150816 165688 109431 -169808 42109 29548 -250599 108275 -55315
17834 -39802 155815 -171199 71805 -15434 -151448 155039 20314 74028 108777 15629 -474397
17822 150551 -45609 -59716 5337 -64138 -237708 174870 -51645 -93777 -95806 -159734 -302635
17811 -302635 292963 -29465 -156676 -265066 -315795 -8204 270446 -396309 -182907 -111238
$$ packed form
17890d5664e149C05625a08756A27038F2828K0828a18205B4284h353A70947K20954
17879C91901A5999a51591C63182b44340a7061j4430A80098p8304Q3485R398r335
17868A85342a14822D9316f7001b208B4044J54883A2802M7556J38226A6962b5851
17856I8310K29475h364E5420b50432a537j74515e5822j88724d8180l3292q4439
17845a65911C14708A50816J4872n6257a69808D2109j2561b50599A08275e5315
17834c9802A55815a71199G1805a5434j36014A55039B0314N3714L4749A5629d74397
17822A50551d5609j4107E337f4138j73570A74870e1645m2132k029o3928j42901
17811c02635B92963b9465j27211j08390n0729h204B70446c96309a82907P1669
$$ plain form
17801 -111238 292508 -6618 193480 -241294 89317 -81609 47200 110254 -138955 -161595 64852
17789 286993 -107778 -17448 -135814 21147 -180909 31483 244350 -126330 224415 366455
17779 366455 -230240 -12464 71975 -68705 -149279 -78358 89709 -55671 -150896 99449 13174
17767 -239313 -325118 111853 139345 -58100 -254013 -128245 123345 -31647 -256242 48049
17756 43708 -14074 -105149 142740 -68258 -17368 195149 266867 158140 48290 12221 -88437
17744 76118 -43789 -515229 -162518 -57162 -124025 -200075 340619 67700 -35504 -87621 81392
17732 4462 -29626 -123021 22386 274667 -295578 -243793 55510 58617 -98383 -70722 228292
17720 -119830 138406 -124762 214641 -77261 200631 161928 -33357 -109402 -37504 114750
$$ packed form
17801a11238B92508f618A93480b41294H9317h1609D7200O3054a38955k2640F4852
17789B86993a07778a7448j18366B1147a80909C1483K12867a26330B24415J42040
17779C66455b30240a2464G1975f8705q0574P0921H9709e5671r5225I9449A3174
17767b39313q5805A11853K7492e8100j95913J25768A23345c1647k24595D8049
17756D3708a4074r1075A42740f8258a7368A95149P1718j08727D8290A2221h8437
17744G6118d3789m71440a62518e7162o6863p6050C40619F7700c5504n2117H1392
17732D462b9626r3395B2386K52281b95578N1785E5510L107i8383K7661B28292
17720a19830A38406a24762B14641g7261B00631l8703c3357p6045c7504A14750
$$ plain form
17709 -90375 12697 -7574 -90369 184124 29535 266022 -104918 -215048 -108548 -73105 131508
17697 18875 -148709 70346 77957 215010 -57357 -26293 187266 112125 107302 132853 -297399
17685 139495 139469 99003 169222 -32699 45012 353573 50610 125594 74556 48250 -86646 -33343
17672 32042 85328 285687 27308 -5086 -58863 103960 406623 230887 -240781 33919 188521
17661 188521 -72999 101166 182923 -66734 -47922 103780 -43815 -83432 1162 147211 274527
17650 274527 10683 -30222 -12512 -250732 134515 61630 -3031 64710 -84205 205119 28838
17638 169198 75891 -114968 119690 180227 -74156 -20289 -131852 114333 374216 210088
17628 210088 48145 -94358 -283193 138359 91366 -162818 138938 303488 402015 -255033
$$ packed form
17709i0375A2697g574q2795A84124B9535K36487a04918j10130J06500L5443A31508
17697A8875a48709G0346P611J37053e7357b6293A87266p5141m823K5551b97399
17685A39495k6m0466P0219c2699D5012L08561E0610P4984n1038k6306h6646c3343
17672C2042N3286K00359B7308e086n3777A03960L02663j75736b40781C3919J54602
17661A88521g2999A01166Q1757f6734J8812A03780d3815l9617A162J46049J27316
17650B74527A0683c0222a2512k38220A34515F1630c031F4710h4205B05119B8838
17638A69198G5891a14968A19690O0537g4156b0289j11563A14333K59883j64128
17628B10088D8145i4358j88835A38359m6993a62818A38938J64550R8527b55033
$$ plain form
17617 -62148 164775 -154113 -167613 84799 -11422 245447 6172 157039 -31700 -260677 45095
17605 49256 104839 161272 312893 -369829 -389470 77041 6634 -60488 35125 -285335 -10512
17593 74110 -248358 31121 230539 78808 -19361 -65490 -120443 10235 189107 401888 -1981
17581 29802 -72213 -204720 123152 350459 41848 244648 207231 251296 126103 190496 -38248
17569 234666 -65549 154402 436478 125203 193205 -299072 428392 240550 -24542 -106625
17559 -106625 -400871 -196379 161100 277985 383713 200255 577596 324455 6582 -83061
17548 -143767 142459 163074 57738 -117294 335892 31971 -254665 -51456 -123655 -242815
17538 -242815 -30270 -17874 -321911 -66808 -94383 30392 -44354 102958 179278 100558 293955
$$ packed form
17617f2148A64775a54113j3500H4799a1422B45447F172J50867c1700k28977D5095
17605D9256N5583N6433J51621c69829j9641G7041F634f0488C5125b85335a0512
17593G4110b48358C1121J99418G8808a9361m6129n4953A0235J78872K12781a981
17581B9802g2213j32507A23152K27307D1848K02800l7417M4065j25193O4393c8248
17569B34666f5549A54402K82076A25203O8002b99072D28392j87842b4542q2083
17559a06625k94246a96379A61100J16885J05728j83458L77341k53141F582h3061
17548a43767A42459K0615E7738a17294C35892C1971b54665e1456p2199j19160
17538b42815c0270J2396l04037f6808k7575C0392d4354A02958P6320p8720J93397
$$ plain form
17527 293955 54333 12600 224846 128310 332656 69429 147957 -33065 -220299 77036 469400
17516 469400 318168 14397 232918 -120462 -308088 -59130 307298 -134129 -117754 -28732
17505 398247 258676 48494 8889 231654 45910 493516 68950 76025 358424 399154 235682
17494 235682 -3572 30315 140502 6095 284955 94947 -169205 130435 91485 470489 258051
17483 258051 -155831 326921 -66536 11417 204548 -40903 370356 214225 27219 88332
17473 88332 -226874 -86275 431817 276547 122371 -53096 270449 52604 -46661 156426
17462 14278 369433 139765 163526 165083 304235 418104 51337 190377 -205771 248783
17451 247246 472257 102410 103122 50235 302803 432954 47649 96983 -120162 73515 384840
$$ packed form
17527B93955E4333A2600K12246r6536K04346F9429P8528c3065j87234G7036L92364
17516D69400j51232A4397K18521a20462j87626e9130C07298a34129J6375b8732
17505C98247j39571D8494H889K22765D5910M47606F8950P075K82399M0730j63472
17494B35682c572C0315J10187F095K78860I4947a69205A30435l8950L79004k12438
17483B58051a55831C26921f6536A1417J93131d0903C70356j56131B7219O1113
17473H8332b26874h6275D31817j55270A22371e3096B70449E2604d6661A56426
17462A4278L55155A39765K3761J557J39152J13869E1337J39040b05771B48783
17451B47246K25011A02410P12E0235K52568J30151D7649M9334a20162G3515L11325
$$ plain form
17440 384840 303451 258736 310068 42735 376422 454823 35169 164917 39096 92978 518748
17429 518748 236613 35063 265745 127427 422893 227327 254354 179472 192386 163049
17419 163049 -19758 220238 183432 123905 32589 299105 142868 207765 436217 250782
17409 250782 79532 157287 164877 427813 -68955 256123 31125 257354 145856 246621 209068
17398 209068 158634 164182 92671 134395 39636 74459 108865 217974 133056 263093 399603
17387 399603 -14590 397102 277265 451519 81730 220800 -240171 327449 -127591 170732
17376 246217 560464 87519 159951 130380 332400 124089 124806 69213 582954 181321 456359
17365 456359 344886 -73015 -154124 5290 313757 77432 61813 -82938 11916 -52046 245240
$$ packed form
17440C84840q1389m4715N1332D2735L33687P8401C5169J29748C9096N3882M25770
17429E18748B36613C5063K30682A27427K95466j95566K7027p4882J2914k9337
17419A63049a9758B20238l6806n9527C2589K66516A42868O4897K28452j85435
17409B50782G9532P7755P590K62936f8955B56123C1125K26229j11498J00765l7553
17398B09068n0434N548p1511M1724C9636L4823L4406J09109q4918J30037J36510
17387C99603a4590C97102j19837J74254H1730J39070b40171C27449a27591A70732
17376B46217L14247H7519P2432k9571K02020A24089P17n5593N13741A81321K75038
17365D56359j11473g3015q1109E290L08467G7432j5619h2938A1916e2046B45240
$$ plain form
17353 421100 218760 127529 -46710 248907 304236 359275 -88459 297917 445102 161194
17342 457125 3532 448069 171724 -72713 359101 98034 296288 130221 86002 242718
17332 242718 115824 -101895 24258 233652 57785 124960 297257 26265 272948 193911
17322 193911 212990 119173 129810 131322 235799 108440 183148 383628 238632 30560 399736
17311 399736 317858 87811 -9726 194660 148860 500193 319829 224467 14272 -138296 226981
17299 172661 316780 133420 203452 131446 12002 49951 147247 159938 51525 -247372 128706
17287 130453 368862 326031 286462 5518 292865 116328 222550 250027 -63299 546793 78954
17275 107050 332999 111095 142821 415701 50626 200352 194238 276428 1845 -22547 139880
$$ packed form
17353D21100k02340r1231d6710B48907N5329N5039h8459B97917J47185A61194
17342D57125C532M44537A71724g2713C59101I8034J98254A30221m4219J56716
17332B42718A15824a01895B4258K09394E7785O7175J72297B6265K46683p9037
17322A93911J9079r3817J0637J512J04477A08440P4708K00480j44996C0560L69176
17311C99736q1878H7811i726A94660m5800L51333j80364r5362A4272a38296B26981
17299A72661J44119A33420P0032p2006A2002L7949R7296J2691E1525b47372A28706
17287A30453K38409m2831l9569E518K87347A16328J06222K7477f3299E46793G8954
17275A07050K25949A11095L1726K72880E0626J49726o114Q2190A845b2547A39880
$$ plain form
17263 194894 358352 111206 148569 113311 355957 84587 308856 -68708 432739 529154
17253 529154 -14713 273109 281281 289487 -142076 174890 302054 251919 383763 124067 123951
17242 123951 241854 205954 245935 187403 49860 492789 -32080 370835 371470 -128045 309937
17230 -9297 191263 207701 103563 239848 416901 344059 157697 196825 176188 125918 157508
17219 157508 184106 332571 304041 492766 324823 160970 323483 246443 48226 113348
17209 113348 119865 246787 105935 253606 148300 435447 471365 388076 93695 79395 309766
17198 309766 318477 305830 412853 323052 21327 170439 613249 55296 261054 335852 275689
17187 275689 285090 65643 398717 398391 190164 275571 223942 209601 173120 246141 449897
$$ packed form
17263A94894J63458A11206L7363l5258K42646H4587K24269f8708D32739R6415
17253E29154a4713B73109Q172Q206a42076A74890J27164n0135J31844A24067j16
17242A23951J17903l5900L9981n8532D9860M42929c2080C70835O35a28045C09937
17230i297A91263J6438A03563J36285J77053p2842A57697L9128k0637n0270L1590
17219A57508K6598J48465k8530J88725j67943A60970J62513p7040D8226O5122
17209A13348O517J26922A05935J47671j05306K87147L5918q3289I3695j4300K30371
17198C09766Q711j2647J07023q9801B1327J49112M42810E5296K05758P4798o0163
17187B75689R401F5643L33074l26A90164Q5407n1629j4341l6481P3021K03756
$$ plain form
17176 449897 338497 374711 385191 307313 -2488 399980 472913 435131 154840 351345 425272
17165 425272 376371 603360 467166 448867 404833 55206 17633 277019 565447 377415
17155 377415 243618 434357 407255 -46026 225842 500937 90611 70189 349345 507806
17145 507806 304961 373698 392771 529425 221212 139778 555830 371597 419437 112183
17134 35031 408923 462534 628644 389171 411674 617988 366859 217198 -36019 762866
17123 402685 253133 632992 98543 429285 302431 240835 570396 368372 391152 631754
17113 631754 110693 537400 372207 48507 523677 375658 372372 275867 324588 466159
17103 466159 404728 374591 209317 377152 368893 469273 452350 681730 522806 487766 590924
$$ packed form
17176D49897j11400L6214J0480p7878b488C99980P2933l7782A54840J96505P3927
17165D25272m8901K26989j36194j8299m4034E5206A7633K59386K88428j88032
17155C77415j33797J90739k7102d6026B25842K75095I0611k0422K79156J58461
17145E07806k02845O8737J9073J36654B21212q1434M16052j84233M7840A12183
17134C5031L73892N3611J66110k39473K2503K06314k51129j49661c6019G62866
17123D02685j49552L79859I8543L30742j26854o1596L29561k02024K2780K40602
17113F31754A10693M26707j65193D8507M75170j48019l286r6505M8721J41571
17103D66159o1431l0137j65274J67835q259J00380j6923K29380j58924l5040J03158
$$ plain form
17092 590924 414616 331828 627233 366868 506582 500800 537889 756264 208069 588409
17082 588409 719482 916381 535510 239613 619187 475451 236635 541571 300650 389582
17072 389582 659280 631648 531955 875146 490273 600632 632253 354522 726710 349410
17061 294552 1034522 650926 495243 621105 626942 222685 614224 482142 379349 588532
17051 588532 590995 456605 778347 905841 785531 356779 420076 449608 951407 784323
17041 784323 839157 759735 635330 446358 502099 695520 625572 698541 595373 654032 561291
17030 561291 819397 809724 718176 670412 904094 584980 659462 443630 698761 772629 858845
17019 858845 835296 906210 1021112 678001 370697 814467 840424 769986 1021092 539143
$$ packed form
17092E90924j76308q2788K95405k60365J39714n782L7089K18375B08069L80340
17082E88409J31073J96899l80871B39613L79574j43736B36635L04936k40921Q8932
17072C89582K69698k7632r9693L43191l84873J10359L1621k77731L72188C49410
17061B94552P39970l83596j55683J25862N837B22685L91539j32082j02793K09183
17051E88532K463j34390L21742J27494j20310C56779O3297K9532N01799j67084
17041G84323N4834p9422j24405j88972N5741J93421o9948P2969j03168N8659r2741
17030E61291K58106r673r1548m7764K33682l19114P4482k15832K55131P3868Q6216
17019H58845k3549P0914J14902l43111l07304M43770K5957p0438K51106m81949
$$ plain form
17009 539143 923167 948421 736048 757667 892347 842741 941180 771585 1315697 757542
16999 757542 973284 806433 832200 666230 1068358 653993 803459 1124890 1089686 951942
16989 951942 1134110 1163683 1220553 845549 726993 1158145 461489 803797 713457 541180
16979 541180 670551 1018131 687558 781435 1074087 872089 1018912 1289023 1155195 951243
16969 951243 1089185 1154202 1354292 1145186 1003745 1194648 913125 1106338 898841 1004825
16959 1004825 1266494 1127650 1091786 1228146 1259374 1135946 1370017 1110202 1160484 1067075
16949 1067075 1049224 1237096 1009084 1444818 1090216 1388509 906480 1449832 1287366 1350799
16939 1350799 1493948 1622374 1145441 1172369 1572856 1252708 1624617 1481053 1144652 1449534
$$ packed form
17009E39143L84024K5254k12373K1619J34680m9606R8439j69595N44112n58155
16999G57542K15742j66851K5767j65970M02128m14365J49466L21431l5204j37744
16989I51942J82168K9573N6870l75004j18556M31152D61489L42308r0340j72277
16979E41180J29371L47580l30573R3877K92652k01998J46823K70111j33828k03952
16969I51243J37942O5017K00090k09106j41441J90903k81523J93213k07497J05984
16959A004825K61669j38844l5864J36360L1228j23428K34071k59815N0282r3409
16949A067075j7851J87872k28012M35734l54602K98293m82029N43352j62466O3433
16939A350799J43149J28426m76933K6928M00487l20148L71909j43564l36401L04882
$$ plain form
16929 1449534 1809995 1684330 1585373 1333207 1330535 1318134 1424896 1322343 1707182 1629873
16919 1629873 1389727 1491868 1816594 1913299 1862165 1765225 1597460 2061252 1697018 1845432
16909 1845432 1903454 1514624 1579946 2135258 1804692 1899053 1731217 1930937 2099290 2022840
16899 2022840 2375357 2151650 2359211 2218889 2364633 2045352 2328434 1832021 2042146
16890 2042146 2242669 2166811 2103978 2133644 2105787 2459868 2311189 2359205 2434106 2414610 2475983
16879 2475983 2795727 2573586 2259068 2471923 2620387 3020966 2813492 2793837 2841006 3016350
16869 3016350 3156640 2883753 2877160 2957274 3012222 2962505 2860657 2984588 3276149 3535308
16859 3535308 3515555 2977157 3308430 3359491 3819629 3637616 3807345 3631177 3632180 3999277
$$ packed form
16929A449534L60461j25665r8957k52166k672j2401J06762j02553L84839p7309
16919A629873k40146J02141L24726R6705n1134r6940j67765M63792l64234J48414
16909A845432N8022l88830O5322N55312l30566R4361j67836J99720J68353p6450
16899B022840L52517k23707K07561j40322J45744l19281K83082m96413K10125
16890B042146K00523p5858o2833K9666k7857L54081j48679M8016P4901j9496O1373
16879B475983L19744k22141l14518K12855J48464M00579k07474j9655M7169J75344
16869C016350J40290k72887o593Q0114N4948m9717j01848J23931K91561K59159
16859C535308j9753n38398L31273N1061M60138j82013J69729j76168J003L67097
$$ plain form
16849 3999277 4015731 3746879 3944291 3614350 4152113 4221076 3907755 4409946 4453256 4484630
16839 4484630 4662653 4594442 4998859 4957846 4859150 4735962 5121516 4759608 5182533 5313939
16829 5313939 5452096 5244517 5541386 5659908 5627633 6022011 5905653 5758712 5873558 6291636
16819 6291636 6510242 6535712 6440665 7041053 6733199 6762540 7375026 7205510 7424496 7533656
16809 7533656 7846907 7943827 8388171 8313334 8323024 8354845 8960717 8800312 9597088 9307620
16799 9307620 9856185 9975025 10704011 10513615 10873540 10908570 11153510 11357514 11602070 11891662
16789 11891662 12295223 12759123 13035990 13364056 13769034 14022225 14577495 15109362 15260708
16780 15260708 16023041 16276567 16970402 17592115 17961071 18606437 19292983 19836123 20337538
$$ packed form
16849C999277J6454k68852J97412l29941N37763O8963l13321N02191M3310L1374
16839D484630J78023o8211M04417m1013r8696j23188L85554l61908M22925J31406
16829E313939J38157k07579K96869J18522l2275L94378j16358j46941J14846M18078
16819F291636K18606K5470r5047O00388l07854K9341O12486j69516K18986J09160
16809G533656L13251R6920M44344p4837R690L1821O05872j60405P96776k89468
16799I307620N48565J18840P28986j90396L59925L5030K44940K04004K44556K89592
16789A1891662M03561M63900K76867L28066M04978K53191N55270N31867J51346
16780A5260708P62333K53526O93835O21713L68956O45366O86546N43140N01415
$$ plain form
16771 20337538 21676285 21975979 22759917 23566416 24321457 25306950 26485930 27265604 28403966
16762 28403966 29347396 30359398 31662710 33005425 34301318 35835811 37345903 39145684
16754 39145684 40810389 42352242 44443084 46564319 48637132 51179509 53313992 56531256
16746 56531256 58821718 61994426 64899248 68655232 72090104 75858773 79940566 84047822
16738 84047822 88307180 93191498 97976129 103462613 108963390 114510499 120385014 126166017
16730 126166017 132295406 138150345 144313106 150047922 156031946 160976739 166142915 170119069
16722 170119069 173636241 176130383 178378349 179313252 179236428 178195803 176327937 173367003
16714 173367003 169815544 165784301 160709061 155228426 149760292 143756124 137487776 131277367
$$ packed form
16771B0337538J338747K99694P83938Q06499P55041R85493J178980P79674J138362
16762B8403966R43430J012002J303312J342715J295893J534493J510092J799781
16754C9145684J664705J541853K090842K121235K072813K542377K134483L217264
16746E6531256K290462L172708K904822L755984L434872L768669M081793M107256
16738H4047822M259358M884318M784631N486484N500777N547109N874515N781003
16730A26166017O129389N854939O162761N734816N984024M944793N166176L976154
16722A70119069L517172K494142K247966R34903p6824j040625j867866k960934
16714A73367003l551459m031243n075240n480635n468134o004168o268348o210409
$$ plain form
16706 131277367 125140895 119118298 113319004 107523879 102011696 96864790 91543766 86826804
16698 86826804 82094318 78074299 73989619 70251328 66539317 63567430 60058190 57223054
16690 57223054 54039147 51883085 49319036 47183141 44984623 42887187 41286187 39207508
16682 39207508 37205745 35863113 34338572 32976299 31311820 30232911 29092184 28109112
16674 28109112 26780118 25834625 24891268 23649741 22964253 22165229 21542249 20590403 20086596
16665 20086596 19444888 18655708 18196327 17532773 17010878 16819042 16110833 15325101 14888312
16656 14888312 14706453 14258236 13642239 13127419 13049594 12737115 12297787 12086021 11498121
16647 11498121 11150310 10667336 10936326 10460412 10086683 9889686 9603430 9344003 9574147
$$ packed form
16706A31277367o136472o022597n799294n795125n512183n146906n321024m716962
16698H6826804m732486m020019m084680l738291l712011k971887l509240k835136
16690E7223054l183907k156062k564049k135895k198518k097436j601000k078679
16682C9207508k001763j342632j524541j362273j664479j078909j140727r83072
16674B8109112j328994r45493r43357j241527o85488p99024o22980r51846n03807
16665B0086596o41708p89180m59381o63554n21895j91836p08209p85732m36789
16656A4888312j81859m48217o15997n14820p7825l12479m39328k11766n87900
16647A1498121l47811m82974K68990m75914l73729j96997k86256k59427K30144
$$ plain form
16638 9574147 9033830 8558965 8603584 8254389 8211092 7980623 7579371 7017468 7467447 7488707
16628 7488707 7009279 6954643 6752797 6597813 6262269 6394334 5955820 5919450 6378129 5972096
16618 5972096 5587401 5383479 5333495 5584894 4796024 5407879 5132387 5064192 4958507 4815878
16608 4815878 4949239 4440028 4619816 4576355 4517317 4170303 4339419 4110829 4270458 3878222
16598 3878222 3948728 3684826 3937932 4146610 3571113 3551233 3357357 3456617 3567166 3158929
16588 3158929 3419490 3579611 3180170 3046231 3321562 3299554 3159045 2913117 2804314 3025372
16578 3025372 2890235 3166216 3086958 3084723 2776490 2620245 2766957 2602793 2640592 2652502
16568 2652502 2492599 2693434 2621897 2659251 2225324 2632680 2412335 2181593 2229641 2114382
$$ packed form
16638I574147n40317m74865M4619l49195m3297k30469m01252n61903M49979K1260
16628G488707m79428n4636k01846j54984l35544J32065m38514l6370M58679m06033
16618E972096l84695k03922m9984K51399p88870O11855k75492o8195j05685j42629
16608D815878J33361n09211J79788m3461n9038l47014J69116k28590J59629l92236
16598C878222P0506k63902K53106K08678n75497j9880j93876R9260J10549m08237
16588C158929K60561J60121l99441j33939K75331k2008j40509k45928j08803K21058
16578C025372j35137K75981p9258k235l08233j56245J46712j64164L7799J1910
16568B652502j59903K00835p1537L7354m33927M07356k20345k30742M8048j15259
$$ plain form
16558 2114382 2351579 2124229 1968709 2126849 1975416 2066862 1897214 2014228 2135432 2106912
16548 2106912 1766898 1838051 1922019 2085559 1943788 2064117 1753588 2111085 1935581 1670675
16538 1670675 1692819 1686961 1864657 1752906 1549373 1730467 1466026 1263705 1646035 1571229
16528 1571229 1284017 1651917 1425351 1166072 1668317 1462808 1541022 1585973 1302154 1386464
16518 1386464 1062904 1364300 1107429 1439189 1506664 915299 1557744 1437523 1315791 1150924
16508 1150924 1251650 1697802 1117992 1140518 995301 1272161 1161798 1581786 1103435 1361100
16498 1361100 1258196 916651 1387423 1222602 1232048 1278188 1050513 1132677 1209337 852908
16488 852908 675854 1104150 980340 840036 925752 1069347 1068004 1208590 810102 892863
$$ packed form
16558B114382K37197k27350j55520J58140j51433R1446j69648J17014J21204k8520
16548B106912l40014P1153Q3968J63540j41771J20329l10529L57497j75504k64906
16538A670675K2144n858J77696j11751k03533J81094k64441k02321L82330p4806
16528A571229k87212L67900k26566k59279N02245k05509P8214M4951k83819Q4310
16518A386464l23560L01396k56871L31760O7475n91365O42445j20221j21732j64867
16508A150924J00726M46152n79810K2526j45217K76860j10363M19988m78351K57665
16498A361100j02904l41545M70772j64821R446M6140k27675Q2164P6660l56429
16488H52908j77054M28296j23810j40304Q5716J43595j343J40586l98488Q2761
$$ plain form
16478 892863 995466 908750 793083 902059 923560 1052839 938372 1404139 914978 525502
16468 525502 889745 981175 728042 638488 867683 924727 852830 779480 531914 633079
16458 633079 963615 835968 925738 731299 628949 681001 954311 167452 834209 651158
16448 651158 1048234 684274 484754 725780 1094051 965192 941608 475575 600665 690946
16438 690946 690421 772058 802155 449395 825535 654639 757631 758849 605325 760503 516785
16427 516785 430532 525329 462698 491459 474861 400444 660090 396488 347255 684785 266160
16415 502012 504800 472115 842231 508988 466928 278246 364019 429113 464133 303086 489987
16404 489987 705120 573694 783815 487458 166652 635905 643694 667179 565687 586492
$$ packed form
16478H92863J02603q6716j15667J08976K1501J29279j14467M65767m89161l89476
16468E25502L64243R1430k53133q9554K29195N7044p1897p3350k47566J01165
16458F33079L30536j27647Q9770j94439j02350N2052K73310A67452O66757j83051
16448F51158L97076l63960j99520K41026L68271j28859k3584m66033J25090R0281
16438F90946n25Q1637L0097l52760L76140j70896J02992J218j53524J55178k43718
16427E16785q6253R4797o2631K8761j6598p4417K59646k63602m9233L37530B66160
16415E02012K788l2685L70116l33243m2060j88682Q5773O5094L5020j61047J86901
16404D89987K15133j31426K10121k96357A66652M69253P789K3485j01492K0805
$$ plain form
16394 586492 704261 739894 581383 172203 345780 373618 336511 701280 373799 748460
16384 748460 143649 228435 598912 565579 371933 417115 588240 195820 279778 451310
16374 451310 644362 567393 395907 375467 470117 282192 248439 455497 488123 418907 357068
16363 357068 636740 524156 375806 277907 608273 376417 269961 247499 442425 549184
16353 549184 408157 520950 671590 333579 429681 133923 515934 344591 504944 468357
16343 468357 407342 664135 246576 334548 132962 115023 562522 115598 315973 -18352
16332 19690 574605 297087 209918 225370 155624 352959 309433 330931 220892 340218 349619
16321 349619 418823 366930 -3490 498828 -60502 387412 419788 399275 358966 462807 -84327
$$ packed form
16394E86492J17769L5633j58511A72203J73577K7838l7107L64769l27481L74661
16384G48460A43649Q4786L70477l3333j93646M5182J71125A95820Q3958J71532
16374D51310J93052p6969j71486k0440R4650j87925l3753K07058L2626o9216o1839
16363C57068K79672j12584j48350r7899L30366k31856j06456k2462J94926J06759
16353E49184j41027J12793J50640C33579R6102A33923L82011j71343J60353l6587
16343D68357o1015K56793B46576Q7972A32962j7939M47499A15598K00375a8352
16332A9690N54915k77518q7169J5452o9746J97335m3526K1498j10039J19326R401
16321C49619O9204n1893c490D98828f0502C87412L2376k0513m0309J03841h4327
$$ plain form
16309 349009 -6093 418731 176180 224784 164670 142393 -34451 158557 77598 -48636 -27449
16298 -27449 520782 113827 144453 405848 592945 -48455 216150 405156 107257 220330
16288 220330 255740 144740 210409 230478 122564 427130 455029 182683 268587 340611 246148
16277 246148 1658 397957 204272 616 15129 216284 225240 426452 288049 516882 210039
16265 480280 11319 171491 116651 8316 278932 -10704 310337 367577 204915 655 -272871
16253 68623 227863 303995 55013 242581 210747 313398 76487 13926 -176545 -35320 608723
16241 84617 77317 -178176 430990 240972 43243 -142170 405725 208468 36933 112840 -57406
16229 23384 -24853 151931 215107 26252 7403 51632 222164 -17625 118806 277413 25673
$$ packed form
16309C49009f093D18731A76180M8604o0114k2277c4451A58557G7598d8636K1187
16298b7449E20782A13827L0626K61395J87097d8455B16150J89006A07257J13073
16288B20330L5410j11000O5669K0069j07914L04566K7899A82683Q5904P2024r4463
16277B46148A658L96299j93685F16J4513K01155Q956K01212j38403K28833B10039
16265D80280A1319J60172n4840H316K70616a0704C10337N7240j62662F55b72871
16253F8623J59240P6132E5013J87568l1834J02651G6487A3926a76545c5320F08723
16241H4617p300a78176D30990j90018D3243a42170D05725j97257C6933P5907e7406
16229B3384b4853A51931O3176B6252G403M4229J70532a7625A18806J58607B5673
$$ plain form
16217 -272096 196175 219878 125977 263266 -14511 -242734 108179 146848 -276181 88227
16206 124791 309657 41036 452485 11367 -9676 131382 133249 -50850 370408 -14497 -9527
16195 -9527 46979 58488 180262 159953 124258 -32398 141867 -244224 142644 321136 31123
16183 74588 236006 -39700 185797 190345 45985 40299 46276 121517 121138 549409 40704 49387
16171 49387 213984 122722 105123 -357644 -167395 242751 131922 -179183 304926 -82858
16160 46367 -74302 217183 -159076 371644 -47599 76517 57860 -160724 74643 -122558 -34571
16148 91280 5695 -19865 96518 -159100 159282 187886 -75255 -107111 220749 -49604 191856
16136 371252 147066 146234 -32718 298495 -90112 -74291 108255 -24019 71220 -27381 -239073
$$ packed form
16217b72096A96175K3703r3901J37289a4511k28223A08179L8669b76181H8227
16206A24791J84866D1036M11449A1367i676A31382J867e0850C70408a4497M970
16195i527D6979J1509J21774k0309l5695c2398A41867b44224A42644J78492C1123
16183G4588J61418c9700A85797M548D5985n686N977P5241l79M28271D0704Q683
16171D9387J64597r1262j7599c57644a67395B42751j10829a79183C04926h2858
16160D6367g4302B17183a59076C71644d7599G6517j8657a60724G4643a22558c4571
16148I1280E695a9865I6518a59100A59282K8604g5255l1856B20749d9604A91856
16136C71252A47066q32c2718B98495i0112J5821A08255b4019G1220b7381k11692
$$ plain form
16125 -239073 245102 -156773 142265 6695 373547 -210022 137253 -58023 223057 223710 129203
16114 129203 210326 206555 -114022 108282 -328936 -23426 -60749 300976 43161 55706 35560
16103 35560 -116564 -53570 -5349 55311 19535 148596 164812 166282 22190 327702 -214896
16091 169840 -241364 -334467 -238341 -996 -179624 -64480 353841 -15369 -136719 -260949 -105762
16079 114762 -119509 -216500 17145 316365 198399 -27563 -3476 82650 -265586 -283106 112166
16067 -158406 135957 362763 248312 -19763 190012 -58472 377511 394738 65336 -418250
16056 147606 -82149 -300671 10403 156969 59823 124747 99280 354955 55925 -27843 -277285
16045 -277285 100525 96796 -184057 97882 -68175 81603 133116 254661 26760 102443 146936
$$ packed form
16125b39073B45102a56773A42265F695L66852b10022A37253e8023B23057O53r4507
16114A29203Q1123l771a14022A08282c28936b3426l7323C00976D3161J2545k0146
16103C5560a16564e3570e349E5311A9535J29061J6216J470B2190L05512b14896
16091A69840b41364r3103R6126i96j78628f4480C53841a5369j21350j24230a05762
16079A14762a19509r6991A7145K99220j17966b7563c476H2650b65586j7520A12166
16067a58406A35957K26806j14451a9763A90012e8472C77511J7227F5336d18250
16056A47606h2149k18522A0403J46566E9823O4924k5467K55675E5925b7843k49442
16045b77285A00525l729a84057I7882f8175H1603N1513J21545B6760P5683M4493
$$ plain form
16034 146936 -155066 149198 326912 42541 -128771 -24153 110976 66869 287619 -179104
16023 -54242 272209 59267 -382794 -72854 100719 302451 73779 -127380 -8514 -108441 39351
16011 78921 62914 -153023 -202302 48162 -264691 158043 262454 271337 160735 193895 -55544
15999 -75843 186491 150652 -35965 -221564 -160051 66917 76928 29065 -299551 -27802 75007
15987 289910 292019 -26228 205061 162966 -122935 55157 140610 291430 355124 -4917 213813
15975 -80393 -258454 124785 46299 -107645 -192562 36896 158933 -126401 -39510 -119040 26451
15963 219092 277693 488586 -202065 -274724 -77204 111087 -82043 -49399 65765 175594 272171
15952 272171 -46747 -312750 99590 -154351 -4193 140994 -158926 138928 14727 -85953 17254
$$ packed form
16034A46936a55066A49198J77714D2541a28771b4153A10976m4107K20750a79104
16023e4242B72209E9267c82794g2854A00719K01732G3779a27380h514r9927C9351
16011G8921j6007a53023m9279D8162b64691A58043J04411Q883j10602L3160e5544
15999g5843A86491l5839c5965j85599O1513F6917J0011B9065b99551b7802G5007
15987B89910K109b6228B05061m2095a22935E5157Q5453J50820O3694d917B13813
15975h0393j78061A24785D6299a07645q4917C6896J22037a26401c9510p9530B6451
15963B19092N8601K10893b02065p2659g7204A11087h2043L2644F5765J09829R6577
15952B72171d6747k66003I9590a54351d193A40994a58926A38928A4727h5953A7254
$$ plain form
15940 204633 73464 -4702 -1524 237737 -92926 262827 22110 237527 -182709 176597 28235
15928 -59312 316538 229818 -448444 164784 237250 264262 420 -97916 -35271 94620 100046 30979
15915 122715 -40832 -198052 -242323 -361 -143654 -114819 101144 -55990 -135576 131344 -25096
15903 -183623 -148746 261636 -18189 -31482 -246386 233851 -94554 -38615 448527 92527 -149588
15891 -171477 -49437 204870 78628 -432316 -107948 378617 221152 138783 -219869 -5019
15880 -124779 -352147 90722 126614 -184251 46707 127236 217484 -39883 -91546 -158618 -138608
15869 -138608 -448188 -55996 254309 4445 -298462 -126120 -81550 22461 -242481 -253662 -161985
15858 -161985 -246859 -120215 -112416 -442920 24373 33992 65855 30355 191502 -362913 -55267
$$ packed form
15940B04633G3464d702a524B37737i2926B62827B2110K15417a82709A76597B8235
15928e9312C16538q6720d48444A64784P2466K7012D20i7916c5271I4620N426C0979
15915A22715d0832j57220m4271c61j43293K8835A01144e5990p9586A31344b5096
15903a83623L4877B61636a8189j3293k14904B33851i4554c8615D48527I2527a49588
15891a71477d9437B04870G8628d32316a07948C78617j57465q2369b19869e019
15880a24779k27368I0722L5892a84251D6707Q0529R0248c9883n1663o7072K0010
15869a38608l09580e5996B54309D445b98462a26120M4570B2461b42481j1181R1677
15858a61985q4874a20215P799l30504B4373R619L1863C0355J61147c62913e5267
$$ plain form
15846 -94409 61157 87651 33140 290509 -123574 318045 221830 -88345 -194173 26014 -13316
15834 -232135 -19112 309145 -81188 -220912 138435 320320 65376 256650 62715 80097
15824 80097 49712 366597 -6293 234473 18465 104844 -113936 -5663 105240 53046 368095
15813 368095 1951 -167066 195074 27319 54487 -170892 -6831 17609 -132292 10270 -83546
15801 53083 352100 160738 117066 45268 -10668 59578 295511 -340723 -82358 57901 61249
15790 61249 128043 174012 22643 47330 -130751 243758 -267840 -147184 -58136 -100560 -78282
15779 -78282 147150 30536 -656912 146352 -150009 -154874 180052 -57749 -50443 -7069 131034
15767 -64634 -254922 -104153 -189561 291085 -199158 136686 307439 138961 143406 64333
$$ packed form
15846i4409F1157K6494C3140K57369a23574C18045r6215h8345j05828B6014a3316
15834b32135a9112C09145h1188j39724A38435J81885F5376J91274F2715J7382
15824H0097l0385L16885f293B34473A8465Q6379a13936e663A05240n2194L15049
15813C68095A951a67066A95074B7319K7168a70892f831A7609a32292A0270h3546
15801E3083K99017A60738m3672D5268a0668E9578K35933c40723h2358E7901L348
15790F1249O6794M5969B2643K4687a30751B43758b67840J20656e8136m2424K2278
15779g8282A47150C0536f56912A46352a50009m865A80052e7749P306g069A31034
15767f4634j90288a04153q5408B91085a99158A36686J70753A38961M445F4333
$$ plain form
15756 9429 53033 -231831 261995 -63066 -11233 -73990 -8195 -99041 -470799 -149493 -168028
15745 -168028 191891 -182378 292925 -31083 -87053 66550 -458305 -120271 56165 -50715
15734 106420 170328 129207 -138712 -101866 -378757 -180619 265855 -222323 -196156 143464
15723 -47170 -56995 -240857 -10659 -100656 155054 -85097 -81413 -263108 -164584 -39811 -217018
15712 -217018 100057 13645 192418 86953 43954 -280150 101150 209794 -46615 230336
15701 -140134 -311877 42049 -183224 -56014 -31031 -28703 -182072 -86621 -93995 -17503 -47757
15690 -47757 -145991 -5817 -230605 55130 84388 177500 -56227 -12331 -323636 -446373 -402910
15679 -402910 -92094 120366 572323 72227 28700 364520 78100 -167409 -81508 16609 404335
$$ packed form
15756I429M3604b31831B61995f3066a1233o2757h195r0846l71758a49493j8535
15745a68028A91891a82378B92925c1083n5970F6550d58305a20271E6165e0715
15734A06420O3908m1121a38712L6846k76891a80619B65855b22323K6167A43464
15723d7170r825j83862a0659q9997A55054h5097L684j81695R8524c9811j77207
15712b17018A00057A3645J78773H6953m2999b80150A01150J08644d6615B30336
15701a40134j71743D2049a83224e6014K4983K328j53369h6621p374a7503l0254
15690d7757r8234e817k24788E5130K9258R3112e6227a2331l11305j22737M3463
15679d02910i2094A20366M51957G2227B8700L35820G8100a67409h1508A6609L87726
$$ plain form
15668 404335 24147 49938 94137 137287 -240793 112634 -237894 21241 120872 -238990 50731
15656 -51818 -177256 -68724 -85624 175226 -257683 -181857 -83015 -123388 199543 -208275 212668
15644 -68969 -215158 -50997 -48314 2669 -94424 295630 18441 -280702 -142394 -527740 -137415
15632 -285449 125870 -68560 -56000 -141555 -62797 166578 219418 106695 -122232 -44567 -14432
15620 99757 223151 -131741 -208106 -47337 130703 -141814 92943 -120999 37866 -96622 -440015
15609 -440015 97642 27720 -119795 138586 55475 -136695 11090 70146 172536 66931 -20718
15597 -156752 74385 121721 61367 -83107 -151842 11708 -245101 271833 -264809 -211964 -274111
15586 -274111 217589 -10991 88750 55917 73019 52797 -62430 243117 30108 105391 -262385
$$ packed form
15668D04335B4147K5791M4199M3150b40793A12634b37894B1241R9631b38990E0731
15656e1818j25438f8724j6900A75226b57683P5826h3015m0373A99543b08275B12668
15644f8969j46189e0997K683B669i4424B95630A8441b80702J38308l85346a37415
15632b85449A25870f8560J2560q5555f2797A66578N2840A06695a22232d4567a4432
15620I9757J23394a31741p6365d7337A30703a41814I2943a20999C7866i6622l43393
15609d40015I7642B7720a19795A38586E5475a36695A1090N9056J02390F6931b0718
15597a56752G4385M7336o0354h3107o8735A1708b45101B71833b64809N2845o2147
15586b74111B17589a0991H8750l2833J7102k0222f2430B43117C0108P5283b62385
$$ plain form
15574 210932 -213606 -288235 -42038 92423 -173556 -124115 178957 -54612 12201 -586693 317168
15562 -100206 262023 17599 -5632 223280 -184744 -99298 94780 -189874 -40505 58591 -99742
15550 137809 92367 95369 389511 11495 -20159 -93076 -21854 10008 14604 -113640 129017
15538 230233 302785 -253387 -6565 -36358 109639 557050 -229701 209870 -420720 20283
15527 159026 -88473 110124 149862 -69943 346129 -119255 -19089 -112069 -23750 -62649 -160035
15516 -160035 325029 28806 45498 62231 222822 -58489 127989 214604 467011 35299 -164337
15504 269628 -285166 -229425 181253 63533 -72714 13803 110951 166129 73547 226459 -97629
15492 804 76681 -52587 136344 -86672 -50290 144994 -139008 -361611 -35043 20470 1628
$$ packed form
15574B10932b13606p4629d2038I2423a73556M9441A78957e4612A2201e86693C17168
15562a00206B62023A7599e632B23280a84744Q5446I4780a89874d0505E8591i9742
15550A37809m5442L002K94142A1495b0159p2917b1854A0008M596a13640A29017
15538B30233P2552b53387f565k9793A09639M47411b29701B09870d20720B0283
15527A59026h8473A10124L9738f9943C46129a19255a9089r2980b3750l8899r7386
15516a60035C25029B8806J6692J6733J60591e8489A27989Q6615K52407C5299a64337
15504B69628b85166N5741A81253F3533g2714A3803R7148N5178G3547J52912i7629
15492H04P5877e2587A36344h6672L6382A44994a39008k22603c5043B0470A628
$$ plain form
15480 -224349 240889 -78671 224586 253956 119753 201695 -38989 -225786 -42720 54562 -67211
15468 14938 52129 -293443 236857 110524 -403197 -12425 -93703 184506 -35428 6285 263387
15457 263387 149909 25045 87640 -52383 -78860 -59157 -142390 -271769 36350 10753 -162546
15445 -216119 211770 -209236 102967 147863 -47746 -101993 161296 100555 94078 -319743 129989
15433 69217 -61856 216140 -78891 54322 -75076 -101219 87383 157447 50881 -27440 391730
15421 -135990 -298950 73425 -3393 136629 225125 145165 116300 -19722 -78797 31413 107624
15410 107624 222137 9136 -378817 -20628 135453 -74033 40902 -106087 -65516 55624 200815
15399 200815 -443871 -62327 -165322 -191565 -20219 214363 -339895 -80318 145399 225648
$$ packed form
15480b24349B40889g8671B24586K9370A19753Q1942c8989j86797d2720E4562f7211
15468A4938L7191b93443B36857A10524d03197a2425q1278A84506c5428F285K57102
15457B63387j13478B5045O2595e2383k6477J9703q3233j29379C6350A0753a62546
15445b16119B11770b09236A02967M4896d7746n4247A61296o0741o477c19743A29989
15433F9217f1856B16140g8891E4322g5076k6143H7383P0064E0881b7440C91730
15421a35990j62960G3425c393A36629Q8496p9960k8865a9722n9075C1413P6211
15410A07624J14513I136c78817b0628A35453g4033D0902a06087M0571E5624J45191
15399B00815d43871f2327j02995k6243b0219B14363c39895h0318A45399Q0249
$$ plain form
15389 225648 33159 -129557 98887 127711 252445 34410 -247690 188047 -218480 -63910
15378 -58564 -109929 -224424 123964 135486 118664 -85492 -96192 58195 422508 120585 -229341
15366 17947 -207299 192171 95921 326791 133430 -330334 -104689 -137460 105411 -194482
15355 -152558 -115325 -16323 -31891 18070 -32979 272719 95590 -27387 137267 -104219 34024
15343 19799 -235650 65711 21988 231730 178009 -188497 -223267 89972 -50786 188814 51426
15331 193381 22849 36900 48046 232106 106820 124745 190147 302915 -73162 -38908 234724
15319 76962 76126 -53426 156118 -90718 -201874 87055 430599 246712 103625 305127 -54520
15307 -15087 17223 242278 289755 210397 -89398 -95245 297058 161201 162145 -123963 174367
$$ packed form
15389B25648C3159a29557I8887K8824J24734C4410b47690A88047b18480f3910
15378e8564n1365j14495A23964J1522j6822h5492j0700E8195L64313A20585b29341
15366A7947b07299A92171I5921K30870A33430c30334a04689l2771A05411a94482
15355a52558L7233a6323j5568A8070c2979B72719I5590b7387A37267a04219C4024
15343A9799b35650F5711B1988K09742n3721a88497l4770H9972e0786A88814E1426
15331A93381B2849J4051J1146J84060A06820J7925O5402J12768g3162L4254B34724
15319G6962q36e3426A56118i0718j11156H7055L43544j83887A03625K01502e4520
15307a5087A7223K25055M7477p9358h9398n847B97058j35857R44a23963A74367
$$ plain form
15295 -19884 240180 126786 -32104 -57958 69397 169318 -58096 -129463 199700 38864 49501
15284 49501 -13966 229013 130088 187666 420662 -7219 59854 -204271 -112676 94915 222221
15273 222221 271168 -181559 536361 124695 191929 133099 -66997 -225792 116520 404435
15263 404435 -457933 28459 209946 338645 298485 105960 24079 146632 254441 -68238
15252 161672 -35755 331302 170191 342921 360088 714777 1648555 2633937 1101671 2473156
15242 2473156 1768686 360019 422954 197873 197210 -71188 -90809 164775 297220 142012
15231 29456 236741 -2943 303746 -129057 81069 214928 -312299 164391 299044 166747
15221 166747 144838 -126948 166432 -133533 50181 -345146 127959 276053 -197 241249
$$ packed form
15295a9884B40180j13394c2104k5854F9397R9921e8096p1367A99700C8864J0637
15284D9501a3966B29013r8925N7578K32996g219E9854b04271R1595I4915J27306
15273B22221M8947a81559E36361A24695O7234n8830f6997j58795A16520K87915
15263D04435d57933B8459J81487J28699m0160A05960B4079J22553J07809f8238
15252A61672c5755C31302j61111J72730J7167L54689R33778R85382A101671J371485
15242B473156p04470C60019O2935A97873o63g1188j9621A64775J32445A42012
15231B9456K07285b943C03746a29057H1069J33859c12299A64391J34653j32297
15221A66747k1909a26948A66432a33533E0181c45146A27959J48094a97B41249
$$ plain form
15210 125033 239782 -9719 -78298 86689 56835 315178 320224 118637 -5652 -36886 294341
15198 29358 -146169 60834 73967 34262 -140088 170579 396088 175315 219895 207570 -145488
15186 26892 -15256 306603 155365 170577 306813 -173097 43552 130376 278871 -100904
15175 576702 149894 108325 -140370 145597 -268198 8281 -101561 28985 -145870 152316
15164 -170960 69944 236320 -244940 239534 413786 138611 247225 133354 156343 228490
15154 228490 75672 104531 -134524 124789 86401 433958 8508 30963 313035 9418 229343
15143 229343 -76170 115369 386077 -88320 223182 243270 271234 127108 -293562 136138
15132 125036 85976 167233 142816 145796 211283 -272523 -21689 -95809 317638 249851 80508
$$ packed form
15210A25033J14749i719o8579H6689k9854K58343N046A18637e652l1234B94341
15198B9358a46169F0834J3133C4262a40088A70579K25509A75315M4580j2325a45488
15186B6892a5256C06603j51238J5212J36236a73097D3552Q6824J48495a00904
15175E76702A49894m1569a40370A45597b68198H281a01561B8985a45870A52316
15164a70960F9944J66376b44940B39534J74252A38611J08614j13871K2989P2147
15154B28490G5672K8859a34524A24789l8388L47557H508K2455K82072I418K19925
15143B29343g6170A15369K70708h8320B23182K0088K7964A27108b93562A36138
15132A25036l9060Q1257k4417K980O5487b72523b1689p4120C17638o7787H0508
$$ plain form
15120 352108 170398 159941 357826 388794 -77433 250586 106109 -73184 -20854 91318 -170100
15108 111350 96726 322783 207824 22915 -263229 196038 -16046 -162519 5175 171754
15098 171754 319182 252744 -247523 -40873 412351 208826 262447 256692 94799 404651 267231
15087 267231 370279 229364 203554 360576 456139 406321 -45573 196574 205658 -257088 -1741
15075 211822 47311 379081 77350 -107139 175420 -131345 122245 352521 244261 117232
15064 -44098 -59820 274920 51488 239866 512393 32572 156954 209874 113677 485807 -126387
15052 500999 -71222 354863 303645 96858 190759 400478 355977 -2420 81164 63494 446172
15041 446172 153138 335987 143250 169524 -231334 125307 -24488 379022 138714 283982
$$ packed form
15120C52108A70398j0457J97885L0968g7433B50586A06109g3184b0854I1318a70100
15108A11350j4624K26057j14959B2915b63229A96038a6046j46473E175J66579
15098A71754J47428o6438b47523d0873D12351k03525N3621n755I4799L09852j37420
15087B67231J03048j40915k5810J57022R5563m9818d5573A96574R084b57088a741
15075B11822D7311L31770G7350a07139A75420a31345A22245K30276j08260A17232
15064d4098j5722B74920E1488J88378K72527C2572J24382N2920r6197L72130a26387
15052E00999g1222C54863n1218I6858R3901K09719m4501b420H1164j7670L82678
15041D46172A53138J82849A43250K6274b31334A25307b4488C79022A38714J45268
$$ plain form
15031 283982 148135 194898 223655 -31055 132092 104210 566706 68768 -22366 150340 151427
15020 151427 -257457 273319 127671 -146569 793213 -310814 336235 568022 574267 434554
15010 434554 91932 136278 159548 425971 252615 355605 184811 477260 379904 257239
15000 257239 201751 -102852 166923 394158 95017 429079 75438 396695 277223 -53541
14989 257618 233234 240269 104229 129706 339160 286913 312457 501332 480949 429972 371632
14978 371632 280180 194541 387484 421663 319862 197764 314926 252537 220024 303622 673827
14967 673827 187817 237565 439573 155845 251136 91857 112604 207645 53852 324923 286962
14956 286962 192145 101288 328277 284713 212247 -17562 416917 525032 274148 414255
$$ packed form
15031B83982j35847M6763K8757c1055A32092k7882M62496F8768b2366A50340J087
15020A51427b57457B73319A27671a46569G93213c10814C36235K31787O245j39713
15010D34554I1932M4346K3270K66423j73356J02990j70794K92449r7356j22665
15000B57239n5488a02852A66923K27235I5017L34062G5438L21257j19472e3541
14989B57618k4384P035A04229K5477K09454n2247K5544J88875k0383n0977n8340
14978C71632r1452q5639J92943L4179j01801j22098J17162o2389l2513Q3598L70205
14967F73827A87817M9748K02008A55845R5291I1857K0747R5041E3852K71071l7961
14956B86962r4817r0857K26989m3564p2466a7562D16917J08115k50884J40107
$$ plain form
14946 414255 -33751 327168 313045 377569 182707 505791 523123 186634 -117206 421644
14935 211969 427957 158110 560218 281137 163604 427749 256699 475090 543983 447314
14925 447314 330766 261505 653698 221953 323319 352796 183855 275967 534988 266132
14914 84853 283117 294756 495242 213533 693116 161826 312920 452187 108764 306813
14904 306813 266595 128653 444597 339638 408069 486732 726141 375233 394086 575902
14894 575902 199113 264272 308383 112625 718504 306217 272629 330063 683251 162003
14883 639150 428613 580643 527444 427647 64519 441513 388071 406914 364669 508217 704840
14872 704840 537949 459374 452971 262637 -58498 264877 521956 301317 390775 192919
$$ packed form
14946D14255c3751C27168j4123O4524A82707L23084J7332A86634a17206D21644
14935B11969K15988A58110M02108k79081j17533K64145j71050K18391O8893r6669
14925D47314j16548o9261L92193B21953J01366K9477j68941R2112K59021B66132
14914H4853J98264J1639K00486B13533M79583A61826J51094J39267A08764J98049
14904C06813m0218A28653L15944j04959O8431P8663K39409l50908J8853J81816
14894E75902A99113O5159M4111A12625O05879C06217l3588N7434L53188A62003
14883F39150k10537J52030n3199r9797F4519L76994n3442J8843m2245J43548J96623
14872G04840j66891p8575o403j90334e8498B64877K57079k20639Q9458A92919
$$ plain form
14861 492909 103863 276309 433573 295577 742655 347948 297092 26764 181674 472585
14851 472585 412196 374147 259004 393652 605569 732718 568125 418379 313728 434274
14841 434274 491531 690566 371119 569734 470194 342589 134233 659725 636883 490364
14831 490364 558921 617034 673507 490493 590970 387665 218136 560867 612600 288661
14820 358233 666248 336831 367708 430264 154328 332053 602037 635214 461198 902009
14810 902009 181604 472929 778752 492574 156533 173057 500356 450209 365649 330475
14800 330475 934110 663940 473129 587525 531841 554192 550156 618758 856603 740342
14790 740342 607608 427834 515003 812655 450231 413986 811471 301910 730069 395083
$$ packed form
14861D92909A03863J72446J57264j37996M47078C47948n0856B6764J54910K90911
14851D72585o0389l8049j15143J34648K11917J27149j64593j49746j04651J20546
14841D34274N7257J99035l19447J98615r9540j27605A34233N25492k2842j46519
14831D90364O8557N8113N6473j83014J00477k03305j69529L42731N1733B88661
14820C58233L08015l29417L0877O2556A54328J77725K69984L3177j74016M40811
14810I02009A81604K91325L05823k86178A56533J6524L27299n0147q4560l5174
14800C30475O03635k70170j90811J14396n5684K2351m036O8602K37845j16261
14790G40342j32734j79774Q7169K97652l62424l6245L97485C01910M28159l34986
$$ plain form
14780 395083 600152 675743 712158 902645 474402 820419 797493 760873 1031564 698309
14770 698309 1067730 453396 1096340 957783 710737 361350 939692 651416 566500 488545
14760 488545 871664 869803 708490 668175 854623 821056 756791 582797 860762 1017274
14750 1017274 760493 674321 580737 771693 940163 658172 676648 956085 545864 624293
14740 624293 808616 589283 652791 674596 832347 858843 1058411 1024348 1100833 747423
14730 747423 827552 839255 951120 734327 1077999 667936 646805 932395 752255 1040690
14720 1040690 1018181 850987 326529 642056 948586 1322027 786135 924867 672753 820282
14710 820282 685349 1044786 1028666 737739 771652 585598 1129465 903538 800931 984702
$$ packed form
14780C95083K05069P5591L6415J90487m28243L46017k2926l6620K70691l33255
14770F98309L69421D53396O42944j38557k47046l49387N78342k88276q4916p7955
14760D88545L83119j861j61313m0315J86448l3567o4265j73994K77965J56512
14750A017274k56781q6172r3584J90956J68470k81991J8476K79437m10221P8429
14740F24293J84323k19333O3508K1805J57751K6496J99568l4063P6485l53410
14730G47423Q0129J1703J11865k16793L43672m10063k1131K85590j80140K88435
14720A040690k2509j67194C26529L15527L06530L73441n35892J38732k52114J47529
14710H20282j34933L59437j6120k90927L3913j86054N43867k25927j02607J83771
$$ plain form
14700 984702 846342 1037596 658929 917434 903874 877677 1093195 1131263 1100791 1073255
14690 1073255 1325228 662501 1088125 1346825 887339 922134 667658 1043663 1119256 846016
14680 846016 949475 1384642 1333029 946580 1115214 1141202 1182121 1259677 1443008 925874
14670 925874 1150080 1156860 1431935 952802 1313362 1176920 1059169 1226467 1376110 1244618
14660 1244618 1283361 991081 1129102 1131728 1406253 1153088 941251 1298326 887437 1154598
14650 1154598 1140203 1007024 1308465 1197848 1456831 1254902 1622118 1316022 1468903 1512023
14640 1512023 1223203 1232239 1339099 1185845 1340088 1425821 1470080 1470058 1576522 1317596 1554545
14629 1554545 1490804 1346872 1537534 1181712 1594437 1667141 1757342 1437779 1408128 1606793
$$ packed form
14700I84702j38360J91254l78667K58505j3560k6197K15518L8068l0472k7536
14690A073255K51973F62501M25624K58700m59486L4795k54476L76005P5593k73240
14680H46016J03459M35167n1613l86449J68634K5988M0919P7556J83331n17134
14670I25874K24206O780K75075m79133L60560j36442j17751J67298J49643j31492
14660A244618L8743k92280J38021K626K74525k53165k11837L57075m10889K67161
14650A154598j4395j33179L01441j10617K58983k01929L67216l06096J52881M3120
14640A512023k88820R036J06860j53254J54243Q5733M4259k2J06464k58926K36949
14629A554545o3741j43932J90662l55822M12725P2704R0201l19563k9651J98665
$$ plain form
14619 1606793 1832527 1720384 1622711 1810885 1202489 1822578 1359998 1468360 1671681 1673933
14609 1673933 1987494 1274477 2013388 1560842 1747864 1974026 1774003 1572472 1767790
14600 1767790 1699247 1730288 1922538 1890281 1867590 1994981 1759094 1794164 1886081 1974178 1771043
14589 1771043 2226891 1997230 2180129 2127786 1909458 1972105 2127748 1905851 2195863 2250611
14579 2250611 2237293 2149230 1891520 2197923 2424451 2614560 2082045 2214573 2468835 2682017
14569 2682017 2195567 2454737 2469371 2798090 2689320 2559754 2761234 2573826 2878856 2806827
14559 2806827 2884871 3212710 2943471 3436757 3359477 3759328 3846666 4268594 4804980 5744217
14549 5744217 7798760 10908944 18225980 35755952 52544391 24658882 10084981 7190978
$$ packed form
14619A606793K25734j12143r7673J88174o08396O20089m62580J08362K03321K252
14609A673933L13561p13017P38911m52546J87022K26162k00023k01531J95318
14600A767790o8543L1041J92250l2257k2691J27391k35887L5070R1917Q8097k03135
14589A771043M55848k29661J82899n2343k18328O2647J55643k21897K90012N4748
14579B250611j3318q8063k57710L06403K26528J90109n32515J32528K54262K13182
14569B682017m86450K59170J4634L28719j08770j29566K01480j87408L05030p2029
14559B806827P8044L27839k69239M93286p7280L99851Q7338M21928N36386R39237
14549E744217K054543L110184P317036J7529972J6788439B4658882A0084981k894003
$$ plain form
14541 7190978 7994409 3912400 2447852 2299122 1897597 1957449 2317209 2284265 2497288
14532 2497288 2073829 1996587 2285243 2159089 2311757 2233030 2364659 2967958 2402765 2573976
14522 2573976 2463898 2831054 2688027 3018089 2756982 2691336 2735822 2818332 2769634 2786833
14512 2786833 2817633 3225628 2948838 2989349 2968446 3146726 3184540 3148525 3107726 3338373
14502 3338373 3409297 3346780 3347689 3220030 3744080 3487846 3434269 3882967 3604509 3787915
14492 3787915 3687739 3759201 3769551 3951504 3786296 3698641 3876935 3970857 3962235 4313901
14482 4313901 3991241 4142284 4574779 4174008 4187127 4024871 4449635 4304832 4669520 4699626
14472 4699626 4561300 4660548 4652368 4692917 4803755 4999326 5099248 5285507 5180540 5003386
$$ packed form
14541G190978Q03431C912400j464548j48730m01525N9852L59760l2944K13023
14532B497288m23459p7242K88656j26154J52668p8727J31629O03299n65193J71211
14522B573976j10078L67156j43027L30062k61107o5646M4486Q2510m8698J7199
14512B786833L0800M07995k76790M0511k0903J78280L7814l6015m0799K30647
14502C338373P0924o2517R09j27659N24050k56234n3577M48698k78458J83406
14492C787915j00176P1462J0350J81953j65208q7655J78294R3922q622L51666
14482D313901l22660J51043M32495m00771J3119j62256M24764j44803L64688L0106
14472D699626j38326R9248q180M0549J10838J95571R9922J86259j04967j77154
$$ plain form
14462 5003386 4830890 5176587 5067038 4832476 5205616 5205957 5358562 5391679 5327490 5519718
14452 5519718 5723711 5592641 5833375 5914851 5952823 6276458 5936569 5855202 6199714 6581035
14442 6581035 6276921 6301962 6620382 6610386 6933881 6398481 7090456 7064970 7274398 7181538
14432 7181538 7290208 7215678 7608047 7359386 7544399 7804658 7942412 8002299 7717662 8183380
14422 8183380 8191347 8424906 8474571 8671663 8630902 8831403 8749829 9061142 9056275 9549326 9384709
14411 9384709 9584942 9535863 9772654 10318132 10521938 10275390 10344869 10869887 10965759 10862951
14401 10862951 11143362 11217135 11658222 11687074 11718303 11937345 12349287 12593940 12616816 12940465
14391 12940465 13520616 13317500 13760852 13842306 14034786 14210525 14377870 14773271 14773051 15375776
$$ packed form
14462E003386j72496L45697j09549k34562L73140L41J52605L3117o4189J92228
14452E519718K03993j31070K40734Q1476L7972L23635l39889q1367L44512L81321
14442F581035l04114K5041L18420r996L23495n35400O91975k5486K09428r2860
14432G181538J08670p4530L92369k48661J85013K60259J37754N9887k84637M65718
14422H183380P967K33559M9665J97092m0761K00501q1574L11313m867M93051j64617
14411I384709K00233m9079K36791N45478K03806k46548O9479N25018R5872j02808
14401A0862951K80411P3773M41087K8852L1229K19042M11942K44653K2876L23649
14391A2940465N80151k03116M43352Q1454J92480J75739J67345L95401k20O02725
$$ plain form
14381 15375776 15307830 15796559 16065500 16423451 16652040 16960819 17623084 17819544 17951363
14372 17951363 18658608 18936319 19052970 19377539 19770596 20342440 20845623 20958630 21392543
14363 21392543 22356974 22647569 23060875 23776440 23810700 24806480 24962707 25815039 26131191
14354 26131191 26756263 27443018 28453634 29083033 29654698 30211059 30935550 31768083 32421240
14345 32421240 33358223 34307618 35186976 36119062 36863641 38476905 38972684 40139190 41417979
14336 41417979 42722646 43843276 45123060 46493079 47887018 48704928 50695420 52138623
14328 52138623 54104254 55812739 57585986 59354833 61570699 63325643 65501400 67814473
14320 67814473 70294282 72821713 75379720 78033569 81152600 84204981 87436301 90882648
$$ packed form
14381A5375776o7946M88729K68941L57951K28589L08779O62265J96460J31819
14372A7951363P07245K77711J16651L24569L93057N71844N03183J13007M33913
14363B1392543R64431K90595M13306P15565L4260R95780J56227Q52332L16152
14354B6131191O25072O86755J010616O29399N71665N56361P24491Q32533O53157
14345C2421240R36983R49395Q79358R32086P44579J613264M95779J166506J278789
14336D1417979J304667J120630J279784J370019J393939Q17910J990492J443203
14328E2138623J965631J708485J773247J768847K215866J754944K175757K313073
14320F7814473K479809K527431K558007K653849L119031L052381L231320L446347
$$ plain form
14312 90882648 94528140 97913072 101957390 106327832 111028038 115590121 120748089 125877468
14304 125877468 131377140 137217041 143697160 150378420 157270910 164510312 172536677 180773014
14296 180773014 189749129 198332020 207919584 218396421 229173605 240167644 251919417
14289 251919417 264155651 277140313 290687807 304080354 318197065 332558974 346749999
14282 346749999 361410885 375368901 389537879 403000961 415691258 427581932 437886213
14275 437886213 447126734 454521811 458722354 460418268 460663101 460344807 459661237 455659524
14267 455659524 450615185 444231704 434948023 424565683 412931504 399768284 385777870
14260 385777870 371487433 356180049 341280845 326392957 311983955 297226854 283213218
$$ packed form
14312I0882648L645492L384932M044318M370442M700206M562083N157968N129379
14304A25877468N499672N839901O480119O681260O892490P239402Q026365Q236337
14296A80773014Q976115Q582891R587564J0476837J0777184J0994039J1751773
14289B51919417J2236234J2984662J3547494J3392547J4116711J4361909J4191025
14282C46749999J4660886J3958016J4168978J3463082J2690297J1890674J0304281
14275D37886213R240521P395077M200543J695914K44833l18294o83570m001713
14267D55659524n044339o383481r283681j0382340j1634179j3163220j3990414
14260C85777870j4290437j5307384j4899204j4887888j4409002j4757101j4013636
$$ plain form
14253 283213218 269774699 258219106 246286216 234352820 223005274 212127718 201694175
14246 201694175 192480921 183174873 175041318 166806392 159254060 152096523 144980411 139013355
14238 139013355 133021648 127993140 122059649 116897682 111855562 107402905 103326809 99601823
14230 99601823 95715124 91882184 88332135 84929466 81618356 78944885 76079479 73348139
14222 73348139 70523941 68200164 66193545 63924268 61790262 59681974 57866826 56237865
14214 56237865 54654927 53287114 51802439 49856178 48276980 46840038 45449811 44766808
14206 44766808 43827614 42130295 40742400 39501960 38555465 37495243 36743711 36358079 34916859
14197 34916859 33937198 33039227 32170384 31323317 30853014 30031629 29377121 28712427 27773352
$$ packed form
14253B83213218j3438519j1555593j1932890j1933396j1347546j0877556j0433543
14246B01694175r213254r306048q133555q234926p552332p157537p116112n967056
14238A39013355n991707n028508n933491n161967n042120m452657m076096l724986
14230I9601823l886699l832940l550049l402669l311110k673471k865406k731340
14222G3348139k824198k323777k006619k269277k134006k108288j815148j628961
14214E6237865j582938j367813j484675j946261j579198j436942j390227o83003
14206D4766808r39194j697319j387895j240440r46495j060222p51532l85632j441220
14197C4916859r79661q97971q68843q47067m70303q21385o54508o64694r39075
$$ plain form
14188 27773352 26993162 26367462 26012903 25319849 24760468 24352068 23768935 22976232 22494227
14179 22494227 22528326 22068283 21534018 20648939 20630903 19913019 19735170 19107994 19024442 18950142
14169 18950142 18014899 17884675 17570628 17295141 17144813 16286277 16108067 16074515 15854020
14160 15854020 15478176 15121682 14659047 14439360 14714482 14049995 14220562 13818548 13542464
14151 13542464 12931807 13449458 12716364 12411661 12381611 12469090 11851172 11699041 11459116 11120043
14141 11120043 11396723 11056526 10832567 10863559 10607320 10280363 10334960 10008635 10113274 10023054
14131 10023054 9672299 9688711 9363587 9386921 9322771 9198858 8886193 8815204 8936201 8527779
14121 8527779 8694460 8430500 8350599 8088921 8365435 7805639 8005661 7776105 7777336 7854612
$$ packed form
14188B7773352p80190o25700l54559o93054n59381m08400n83133p92703m82005
14179B2494227L4099m60043n34265q85079j8036p17884j77849o27176q3552p4300
14169A8950142r35243j30224l14047k75487j50328q58536j78210l3552k20495
14160A5854020l75844l56494m62635k19687K75122o64487J70567m02014k76084
14151A3542464o10657N17651p33094l04703l0050Q7479o17918j52131k39925l39073
14141A1120043K76680l40197k23959L0992k56239l26957N4597l26325J04639r0220
14131A0023054l50755J6412l25124K3334o4150j23913l12665p0989J20997m08422
14121H527779J66681k63960p9901k61678K76514n59796K00022k29556J231P7276
$$ plain form
14111 7854612 7586996 7218400 7277743 7315221 7168282 6980569 7004972 6859805 6674495 6952448
14101 6952448 6735144 6632826 6745421 6498999 6228604 6651337 5896201 6429740 6222343
14092 6222343 5860231 5785072 5679214 5761610 5803452 5636869 5571699 5865031 5454577 5624353
14082 5624353 5610503 5235650 5067602 5359011 5258748 5387361 4839969 4669258 4822141 4821148
14072 4821148 4726650 4933688 5029712 4535743 4867172 4610962 4635310 4721433 4416585 4447594
14062 4447594 4721350 4236953 4194564 4258485 4265229 4013282 4152994 4096988 3869217 4241293
14052 4241293 4019444 4079424 3897806 3839720 3802059 3753217 3576258 3652610 3731170 3768070 3432094
14041 3432094 3300418 3667919 3856721 3309922 3403636 3275115 3486690 3397839 3426099 3333680
$$ packed form
14111G854612k67616l68596N9343L7478j46939j87713K4403j45167j85310K77953
14101F952448k17304j02318J12595k46422k70395M22733p55136N33539k07397
14092F222343l62112p5159j05858Q2396M1842j66583o5170K93332m10454J69776
14082E624353j3850l74853j68048K91409j00263J28613n47392j70711J52883r93
14072D821148r4498K07038R6024m93969L31429k56210K4348Q6123l04848L1009
14062D447594K73756m84397m2389O3921O744k51947J39712n6006k27771L72076
14052D241293k21849N9980j81618n8086l7661m8842j76959P6352P8560L6900l35976
14041C432094j31676L67501J88802n46799R3714j28521K11575q8851K8260r2419
$$ plain form
14031 3333680 3333555 3438766 2973047 3317932 3231862 3165965 3113157 3359976 2947243 2543628
14021 2543628 3046902 2691187 2775134 2883272 2793685 2572184 2908511 2982689 3007990 2819821
14011 2819821 2622737 2695476 2536707 2778395 2346660 2732280 2040789 2762566 2375099 2406839
14001 2406839 1930084 2562878 2518175 2419010 1908232 2370301 2429281 2115655 2412855 2248602
13991 2248602 2734827 2616397 3548062 5746472 11214948 26346923 52489955 31706865
13983 31706865 15721300 8960138 6365037 5480332 4426761 4133265 3434643 3455661 3171220
13974 3171220 3138010 3060959 2694160 2630954 2574833 2673895 2413659 2636066 2985541 2496994
13964 2496994 2469765 2280447 2423240 2366441 2526201 1952165 2116242 2050199 2255826 2219245
$$ packed form
14031C333680j25J05211m65719L44885q6070o5897n2808K46819m12733m03615
14021B543628N03274l55715Q3947J08138q9587k21501L36327P4178K5301j88169
14011B819821j97084P2739j58769K41688m31735L85620o91491P21777l87467L1740
14001B406839m76755O32794m4703r9165n10778M62069N8980l13626K97200j64253
13991B248602M86225j18430R31665K198410N468476J5131975K6143032k0783090
13983C1706865A5721300o761162k595101q84705j053571k93496o98622K1018k84441
13974C171220l3210p7051l66799o3206n6121R9062k60236K22407L49475m88547
13964B496994k7229j89318J42793n6799J59760n74036J64077o6043K05627l6581
$$ plain form
13954 2219245 2449430 2305635 2175507 2093409 2311978 2131786 1947921 2265151 1979568 2106761
13944 2106761 1553725 1680521 1874986 1863701 1636486 2196883 1682273 1629385 1803678 1949786
13934 1949786 1928062 1746275 1656452 1835379 1933146 1678221 1810714 1655307 1741819 1733994
13924 1733994 1652344 1458518 1869328 2087003 1707429 1904237 1641178 1628813 1629381 1871818
13914 1871818 1342764 1536577 1565922 1783474 1386758 1604947 1654901 1728295 1391316 1274191
13904 1274191 1693275 1582607 1555821 1837137 1241081 1303474 1397503 1196560 1161498 1384025
13894 1384025 1277063 1026092 1524089 1340460 1146353 1306663 1532090 1106797 1265142
13885 1265142 1302501 1607440 1412924 1340724 1666411 1129603 1062726 1267802 1031469 1058226
$$ packed form
13954B219245K30185j43795j30128q2098K18569j80192j83865L17230k85583J27193
13944B106761n53036J26796J94465j1285k27215N60397n14610n2888J74293J46108
13934A949786k1724j81787q9823J78927R7767k54925J32493j55407Q6512p825
13924A733994q1650j93826M10810K17675l79574J96808k63059j2365N68K42437
13914A871818n29054J93813K9345K17552l96716K18189M9954P3394l36979j17125
13904A274191M19084j10668k6786K81316n96056O2393R4029k00943l5062K22527
13894A384025j06962k50971M97997j83629j94107J60310K25427m25293J58345
13885A265142L7359L04939j94516p2200L25687n36808o6877K05076k36333K6757
$$ plain form
13875 1058226 1238580 1395766 927681 1361992 1370655 1005280 1291930 1081009 1344449 898327
13865 898327 1421074 1239213 906630 1081664 980323 1211900 1072563 1077930 1016558 1242982
13855 1242982 1284165 1058925 1069670 1134623 1408746 1185902 1144234 1402235 979327 1048757
13845 1048757 1030161 1194863 1037131 865564 929050 1280101 954659 1026741 1361033 1134492
13835 1134492 797463 1191861 863223 876710 828438 1244772 1136433 999782 543513 1004965
13825 1004965 820547 708961 957277 1134484 775475 1054673 1284108 960968 1479679
13816 1479679 900261 761162 1216357 920724 780311 766029 670647 1141430 865978 665960
13806 665960 760478 764521 1189611 988174 995390 933254 599434 965342 755885 924889 834235
$$ packed form
13875A058226J80354J57186m68085M34311Q663l65375K86650k10921K63440m46122
13865H98327N22747j81861l32583J75034j01341K31577j39337N367o1372K26424
13855A242982M1183k25240J0745O4953K74123k22844m1668K58001m22908O9430
13845A048757j8596J64702j57732j71567O3486L51051l25442P2082L34292k26541
13835A134492l37029L94398l28638J3487m8272M16334j08339j36651m56269M61452
13825A004965j84418j11586K48316J77207l59009K79198K29435l23140N18711
13816A479679n79418j39099M55195k95633j40413j4282r5382M70783k75452k00018
13806F65960R4518M043M25090k01437P216o2136l33820L65908k09457J69004r0654
$$ plain form
13795 834235 925631 796496 764339 728726 596821 1101694 967138 971658 828341 993438
13785 993438 929422 968894 797685 675841 891234 814412 858649 1198981 779027 690508
13775 690508 628538 794231 706835 716890 864841 991596 717778 835619 896873 974946
13765 974946 1193518 677348 863370 726907 811921 789543 594042 1137923 876910 548886
13755 548886 769553 529424 490679 941902 620457 594535 687305 877636 695901 625020
13745 625020 530357 654898 747621 1068294 557414 467747 687578 872607 848224 878727
13735 878727 562879 583633 592449 531779 315475 594312 756239 761292 841480 848772 635466
13724 635466 673826 740035 625902 553202 636209 600283 723760 355511 658642 760400
$$ packed form
13795H34235R1396j29135l2157l5613j31905N04873j34556M520j43317J65097
13785I93438o4016L9472j71209j21844K15393p6822M4237L40332m19954q8519
13775F90508o1970J65693q7396J0055J47951J26755k73818J17841O1254P8073
13765I74946K18572n16170J86022j36463Q5014k2378j95501N43881k61013l28024
13755E48886K20667k40129l8745M51223l21445k5922R2770J90331j81735p0881
13745F25020r4663J24541R2723L20673n10880q9667K19831J85029k4383L0503
13735H78727l15848K0754Q816o0670k16304K78837J61927N053Q0188P292k13306
13724F35466L8360O6209j14133p2700Q3007l5926J23477C55511L03131J01758
$$ plain form
13714 760400 618614 578056 578935 326780 416480 902036 583126 655850 847186 553746 485547
13703 485547 349794 694046 651048 747986 777829 323502 703742 185897 477009 428353
13693 428353 306475 344829 820299 554268 654865 800810 307297 407868 633427 297286
13682 609304 296781 727333 520508 699291 503869 537507 848650 386912 458782 699820
13672 699820 370626 452180 422844 628060 482023 433580 302043 426800 639725 488765
13662 488765 748005 609367 237848 100912 423168 771058 451126 302672 490743 443654
13652 443654 228339 279668 572047 455485 361816 659891 646190 456541 425266 456259
13642 456259 467982 661394 420817 -33868 402087 428679 265364 481542 342069 441361
$$ packed form
13714G60400j41786m0558Q79k52155Q9700M85556l18910P2724J91336k93440o8199
13703D85547j35753L44252m2998R6938K9843C23502L80240A85897K91112m8656
13693D28353j21878L8354M75470k66031J00597J45945C07297J00571K25559B97286
13682F09304B96781M30552k06825J78783j95422L3638L11143C86912P1870K41038
13672F99820l29194Q1554k9336K05216j46037m8443j31537J24757K12925j50960
13662D88765K59240j38638B37848A00912L22256L47890l19932j48454J88071m7089
13652D43654k15315N1329K92379j16562r3669K98075j3701j89649l1275L0993
13642D56259J1723J93412k40577c3868D02087K6592j63315K16178j39473R9292
$$ plain form
13632 441361 862661 637066 490129 533865 397109 252969 746801 332488 313997 381538
13622 381538 184780 385496 550479 512839 518180 331152 341313 380757 8763 785186 752145
13611 752145 390288 420509 676150 618397 691739 300519 601306 464785 508925 128023
13600 370143 715698 218956 313828 536771 176028 236573 499474 211358 659016 825650
13590 825650 373921 101569 256516 504202 477583 654551 442157 100868 468413 397560
13580 397560 560874 564630 418839 388358 504820 416963 440099 378064 503585 430519 167958
13568 728525 265416 163433 360919 136757 547443 215244 187021 333600 224541 392244
13558 392244 300667 296234 330746 143335 146248 531212 364821 282088 551685 486645 368744
$$ packed form
13632D41361M21300k25595j46937M3736j36756j44140M93832C32488j8491O7541
13622C81538A84780K00716J64983l7640N341j87028J0161L9444H763P76423l3041
13611G52145l61857L0221K55641n7753P3342C00519L00787j36521M4140A28023
13600C70143L45555B18956R4872K22943A76028O0545K62901B11358M47658J66634
13590H25650C73921A01569J54947K47686k6619J76968k12394A00868L67545p0853
13580C97560J63314L756j45791l0481J16462q7857K3136o2035J25521p3066A67958
13568G28525B65416j01983J97486A36757M10686B15244k8223J46579j09059J67703
13558C92244r1577m433L4512A43335K913L84964j66391q2733K69597o5040j17901
$$ plain form
13547 368744 261067 193859 252939 164319 224785 350335 504432 144293 238577 276050 469686
13536 469686 538915 162463 535010 218880 279523 -14457 313408 512467 280597 632633
13526 632633 324772 261658 434380 -44674 490378 436746 153054 341441 138288 173426
13516 173426 392163 557415 353475 386692 466722 380809 275876 68977 202807 210306 250476
13505 250476 87914 370002 228392 93651 477881 173928 130587 81836 631285 240532
13494 138507 278145 85388 236445 162434 473886 78314 -17276 150459 190831 503443
13484 503443 235860 396944 388439 245113 513301 284521 341061 439486 207292 107606
13474 107606 -73305 232299 359952 176584 237988 383633 335546 168517 188527 381635
$$ packed form
13547C68744j07677o7208N9080q8620O0466J25550J54097A44293R4284L7473J93636
13536D69686O9229A62463L72547B18880O0643a4457C13408J99059k31870L52036
13526F32633l07861o3114J72722d4674D90378n3632A53054J88387A38288L5138
13516A73426K18737J65252k03940L3217Q0030q5913j04933F8977J33830P499M0170
13505B50476H7914K82088j41610I3651L84230A73928m3341m8751N49449B40532
13494A38507J39638H5388J51057p4011L11452G8314a7276A50459M0372L12612
13484E03443B35860J61084q505j43326K68188k28780N6540R8425B07292r9686
13474A07606g3305B32299J27653A76584O1404J45645m8087j67029K0010J93108
$$ plain form
13464 381635 210674 113515 331486 133834 174081 284503 168337 109552 121208 460977
13454 460977 72953 159148 46551 333953 250733 514791 91692 40252 101915 72124 273659
13443 273659 79616 175553 167439 82570 149819 216182 177560 118873 242538 -105452 212169
13431 296376 424937 189229 104508 239964 361607 240807 359847 325448 99545 280417
13421 280417 201837 370 363434 53129 401075 467649 134798 58794 211699 370002 33052
13409 61209 302416 410558 147206 189235 337116 108207 96823 167976 246769 434098
13399 434098 140749 133267 24947 94133 328819 124912 460805 503358 529213 206142 167169
13388 167169 221515 358518 390429 236893 344356 63189 20656 126229 230789 205295
$$ packed form
13464C81635j70961r7159K17971A33834M0247J10422j16166n8785J1656L39769
13454D60977G2953Q6195D6551K87402q3220K64058I1692D0252O1663k9791K01535
13443B73659G9616R5937q114H2570O7249O6363l8622n8687J23665a05452B12169
13431B96376J28561A89229q4721J35456J21643j20800J19040l4399I9545J80872
13421B80417p8580C70L63064E3129L47946O6574A34798E8794J52905J58303C3052
13409F1209K41207J08142A47206M2029J47881A08207j1384P1153P8793J87329
13399D34098A40749p482B4947O9186K34686A24912L35893M2553K5855B06142l8973
13388A67169N4346J37003L1911j53536J07463F3189B0656J05573J04560k5494
$$ plain form
13378 205295 64506 51091 180745 253747 410793 624543 365714 265886 470950 131103
13367 122077 141701 301751 143923 497185 542813 28559 365311 503949 69825 146738
13357 146738 313845 122734 298909 317393 275467 118289 402625 310829 220155 338973
13347 338973 -85450 106530 341458 241307 49830 96521 517753 324676 157715 417239
13337 417239 474671 141604 349178 74835 161738 177925 -16204 177497 242695 -186748 132070
13325 64045 -87616 218499 306984 101093 -25269 125470 406899 647711 335092 115969
13314 -18249 474189 317770 -182261 189937 -3133 422518 181098 76023 23389 -109612
13303 -11658 158384 266218 159563 223281 284415 299861 313355 -2817 92469 58981 -70640
$$ packed form
13378B05295F4506j3415J29654P3002J57046K13750k58829r9828K05064A31103
13367A22077J9624J60050A43923L53262M5628B8559L36752J38638F9825P6913
13357A46738J67107A22734J76175J8484m1926A18289K84336r1796r0674J18818
13347C38973h5450A06530K34928j00151D9830M6691M21232j93077A57715K59524
13337D17239N7432A41604K07574G4835Q6903J6187a6204A77497O5198a86748A32070
13325F4045h7616B18499Q8485A01093b5269A25470K81429K40812l12619A15969
13314a8249D74189j56419a82261A89937c133D22518A81098G6023B3389a09612
13303a1658A58384J07834j06655O3718O1134J5446J3494b817I2469l3488g0640
$$ plain form
13291 85295 361669 96327 79316 184348 277372 -62589 36915 -81076 143187 194746 237568
13280 237568 445349 47641 98890 -38959 162171 -73782 204014 483074 342505 129460
13269 243177 118968 224946 451011 206872 55370 145124 -84080 -104209 74551 353888
13259 353888 -266339 5541 328959 240332 -214310 -22765 217693 -172510 322122 194806
13249 194806 -160834 213608 -127430 228554 353719 -127702 345782 523698 19504 331061
13239 331061 -51979 312838 8051 252746 240078 -62466 74807 249572 206657 282218 -52217
13227 32938 91434 63212 156146 193253 50058 122046 147051 -19442 -141830 54208 -36439
13215 -144547 394781 -15988 97693 126403 68237 177993 556155 -91587 490878 228596
$$ packed form
13291H5295K76374I6327j7011J05032R3024f2589C6915h1076A43187N1559M2822
13280B37568K07781D7641N1249c8959A62171g3782B04014K79060j40569A29460
13269B43177A18968J05978K26065B06872E5370Q9754h4080k0129G4551K79337
13259C53888b66339E541L23418q8627b14310b2765B17693a72510C22122j27316
13249A94806a60834B13608a27430B28554J25165a27702C45782J77916A9504L11557
13239C31061e1979C12838H051K44695j2668f2466G4807J74765m2915P5561e2217
13227C2938N8496k8222R2934L7107E0058P1988K5005a9442j22388E4208c6439
13215a44547C94781a5988I7693K8710n8166J09756L78162i1587D90878B28596
$$ plain form
13204 59203 26641 500494 -11922 366183 42052 117278 235372 105610 40381 162842 33342
13192 -86560 176190 271729 -121382 182091 -75826 154995 55362 392652 -90479 95233 -10503
13180 -214927 28945 -92527 346358 120701 111451 189629 283326 298498 -53611 162046 -4676
13168 35170 15154 270041 -59331 -36464 152038 156788 95473 -17907 33809 193323 528613
13157 528613 27244 175890 142707 304272 442046 464361 -7307 652 -242576 -18242 164663
13145 2799 -32387 -31028 217924 -7012 -61939 110937 139005 -432063 -156141 172872 79284
13133 -131425 -93665 -139654 372240 370123 138950 87631 -72638 124228 219386 -41270 -217470
13122 -217470 -334033 125971 182952 192967 215417 -170224 107350 141746 -107699 6535 -78858
$$ packed form
13204E9203B6641M73853a1922C66183D2052P5226J18094A05610D0381J22461C3342
13192h6560A76190R5539a21382A82091g5826A54995E5362L37290i0479I5233a0503
13180b14927B8945i2527C46358A20701r250P8178R3697J5172e3611A62046d676
13168C5170A5154K54887e9331K2867A52038M750o1315a7907C3809J59514L35290
13157E28613B7244J48646l3183J61565J37774K2315g307F52b42576a8242A64663
13145B799c2387J359B17924g012n4927A10937K8068d32063a56141A72872G9284
13133a31425L7760m5989C72240k117A38950n1319g2638A24228R5158d1270j76200
13122b17470j16563A25971N6981J0015K2450a70224A07350L4396a07699F535g8858
$$ plain form
13110 -241772 353601 -103990 3894 9165 25085 268122 76262 -5607 -17519 17398 46015
13099 46015 40529 243381 94250 -119727 62188 392129 -168849 281498 189249 128679 121164
13088 121164 -211702 114710 -59094 43234 -332301 258460 -91052 -283451 -43251 59864
13077 -281800 260221 -98096 166591 231860 48907 156159 18569 -43949 -63701 -20302 284727
13065 -324143 38643 85258 -32495 260186 27524 -16684 252135 -41352 -106492 200154 299804
13054 299804 33934 265454 -68868 -143049 240305 -151087 63985 148682 439880 136923
13043 183263 491312 -20219 141704 -74565 137272 -301821 86798 -14710 -40462 -205623
13033 -205623 -68216 175672 25089 -197212 -85415 354076 28035 346159 167600 46459
$$ packed form
13110b41772C53601a03990C894N271J5920K43037G6262e607j1912A7398K8617
13099D6015n486K02852I4250a19727F2188L29941a68849B81498r2249o0570p515
13088A21164b11702A14710e9094D3234c32301B58460i1052j92399d3251E9864
13077b81800B60221i8096A66591O5269D8907J07252A8569d3949j9752b0302B84727
13065c24143C8643M6615c2495B60186B7524a6684B52135d1352o5140B00154R9650
13054B99804C3934K31520f8868p4181B40305a51087F3985Q4697K91198A36923
13043A83263L08049b0219A41704g4565A37272c01821H6798a4710k5752j65161
13033b05623f8216A75672B5089a97212h5415C54076B8035L18124A67600D6459
$$ plain form
13022 207909 414568 47137 -89781 -91611 89703 100417 132753 194340 467248 -16617 -207705
13011 -207705 67465 -282213 622810 234516 -17050 -121515 91538 -59644 58002 -10892 131123
12999 166991 -2255 322767 -86915 438213 -41741 179216 196662 18445 305498 219484 -18090
12987 236606 -80349 250321 90645 45787 3691 -4480 -21043 291654 183251 24285 291837
12976 291837 -73714 192644 187147 227342 136181 -29866 179002 -129157 214576 -151943 -148713
12965 -148713 133003 134384 90407 -4250 -77212 204385 137036 370704 263719 258071 -94975
12953 20583 508063 37378 -281691 338761 -88591 -108393 21979 -251291 173155 12668 201784
12942 201784 -59969 56250 9364 116083 -265665 -32680 -19555 147195 138712 130885 -31242
$$ packed form
13022B07909K06659D7137h9781j830H9703J0714L2336O1587K72908a6617j91088
13011b07705F7465b82213F22810B34516a7050j04465I1538e9644E8002a0892A31123
12999A66991b255C22767h6915D38213d1741A79216J7446A8445K87053q6014a8090
12987B36606h0349B50321I0645m4858C691d480j6563B91654j08403B4285K67552
12976B91837g3714A92644n497M0195r1161b9866A79002a29157B14576a51943L230
12965a48713A33003J381m3977d250p2962B04385o7349K33668j06985n648i4975
12953B0583M87480C7378b81691C38761h8591j9802B1979b51291A73155A2668J89116
12942B01784e9969E6250I364J06719b65665c2680J3125A47195q483p827c1242
$$ plain form
12930 -117317 -16167 -223163 191757 32080 50973 353593 290086 148673 143395 161521 139275
12919 139275 -35284 -307654 -94388 26852 -87287 26599 -71167 122645 -244320 66564 164903
12908 164903 -23069 319426 -164368 137720 42503 -62422 -187913 -94448 140211 -139011
12897 -67674 241060 212692 201218 204666 14369 247331 -47316 264556 62832 149358 212176
12886 212176 198253 -122907 -119672 28984 -48304 -408546 -189782 -176761 293277 240175 -2947
12874 135577 210024 -192231 -53013 -130282 173807 -126909 234103 -39930 143153 440781
12864 440781 26466 222178 119228 165404 380050 -230365 81870 152635 277260 50215
12853 234353 -28914 26399 -223006 -268005 -191259 -96852 -156722 103209 -253631 36678 -1409
$$ packed form
12930a17317a6167k06996A91757C2080J8893L02620o3507j41413n278J8126k2246
12919A39275c5284k72370i4388B6852h7287B6599g1167A22645b44320F6564R8339
12908A64903b3069C19426a64368A37720D2503f2422j25491R3465A40211a39011
12897f7674B41060k8368j1474L448A4369K32962d7316B64556F2832Q6526O2818
12886B12176j3923a22907L235B8984d8304l60242a89782J3021B93277n3102b947
12874A35577P4447a92231e3013p7269A73807a26909B34103c9930A43153K97628
12864D40781B6466J95712j02950M6176K14646b30365H1870P0765J24625E0215
12853B34353b8914B6399b23006m4999P6746R4407n9870A03209b53631C6678a409
$$ plain form
12841 8385 93641 351066 -43616 164501 13325 235353 75037 -308938 84712 -108244 -101765
12830 -101765 383274 -230304 -320016 238870 -10543 358 141138 350049 78698 69760 51609
12819 51609 -69919 138761 15563 88281 -20923 -57170 89899 -619 390097 303425 263819 -158232
12806 176770 150100 334416 -138446 251271 227790 -119613 -163477 242364 -236134 -84677
12795 203394 213753 355657 24359 -186140 535890 123553 -84244 16126 -257502 53410
12784 145332 281120 136857 -168466 -351352 -127265 421024 10589 -147806 13084 -147740
12773 29296 -42447 145693 288382 317 -27398 149096 -11960 226494 206371 156078 112640
12762 112640 11848 70799 93248 -40920 -42411 107377 -74670 79132 -17208 128720 -39745
$$ packed form
12841H385Q5256K57425d3616A64501A3325K22028G5037c08938H4712a08244O479
12830a01765C83274b30304q9712B38870a0543C58J40780K08911G8698q938j8151
12819E1609f9919A38761A5563P2718b0923l6247H9899f19C90097q6672l9606a58232
12806A76770k6670J84316a38446B51271k3481a19613m3864B42364b36134h4677
12795B03394J0359J41904B4359a86140E35890A23553h4244A6126b57502E3410
12784A45332J35788A36857a68466j82886a27265D21024A0589a47806A3084a47740
12773B9296d2447A45693J42689C17b7398A49096a1960B26494k0123n0293m3438
12762A12640A1848N8951K2449d0920j491A07377g4670G9132a7208A28720c9745
$$ plain form
12750 166610 9487 129761 -20932 127933 -60655 56479 99680 9875 126083 111618 3346
12738 59277 -348731 -118846 151115 137517 -67573 340864 -152948 124901 -56029 308008
12727 72830 -40819 -7273 -410038 74161 -16416 81385 -39956 75128 -226274 312963 22763
12715 -22393 -221305 294809 -264671 68144 132607 127205 170325 112929 -233554 139731 -94658
12703 71799 -22656 113590 79582 -3876 114780 -8851 -78558 -17059 398754 104786 349673
12692 349673 -68059 -150552 299081 -58075 65155 -178792 108681 196793 2673 44377 42220
12681 42220 86783 126582 119161 -71493 -90771 -22369 -81358 139083 -152004 117112 98882
12670 98882 291613 112843 1086 26737 263890 -115333 71312 259457 -60405 131518 250771
$$ packed form
12750A66610I487J20274b0932A27933f0655E6479M3201I875J16208j4465C346
12738E9277c48731a18846A51115j3598f7573C40864a52948A24901e6029C08008
12727G2830d0819g273m02765G4161a6416H1385c9956G5128b26274C12963B2763
12715b2393j98912B94809b64671F8144O4463n402M3120n7396b33554A39731i4658
12703G1799b2656A13590l4008c876A14780h851o9707a7059C98754A04786K44887
12692C49673f8059q2493B99081e8075F5155a78792A08681Q8112B673M1704k157
12681D2220M4563L9799p421g1493j9278b2369n8989A39083a52004A17112j8230
12670I8882J92731A12843A086K5651K37153a15333G1312J88145f0405A31518J19253
$$ plain form
12659 250771 88413 34326 53961 419852 78660 422698 96027 314896 311533 172863 24215
12647 -209796 -137677 99119 20347 100188 -64678 27732 -222993 10486 151631 -263620 75642
12635 122064 -94881 -104940 253945 34108 310923 180247 399918 150158 589088 358561
12625 358561 63582 158045 248866 122217 69879 497701 64707 439875 44549 373266 457983
12614 457983 -147891 34287 -68350 198581 -138168 -49790 372569 231705 112702 22800
12603 117834 -168232 374297 -140193 -9927 114759 22491 -148229 48688 -14280 -74574 201431
12591 141630 113888 390706 -207228 156263 47495 -73053 -62156 80979 207152 -423979
12580 287759 -55759 -85155 8021 4915 150747 -86632 307068 -49229 168602 173976 -100385
$$ packed form
12659B50771H8413C4326J9635L65891G8660L44038I6027K18869l363j38670B4215
12647b09796P2119I9119B0347P9841f4678B7732b22993A0486J41145b63620G5642
12635A22064i4881j0059B53945C4108K76815j30676K19671A50158M38930k30527
12625C58561F3582R4463R0821A22217n2338M27822F4707L75168D4549L28717Q4717
12614D57983a47891C4287f8350A98581a38168d9790C72569j40864A12702B2800
12603A17834a68232C74297a40193i927A14759B2491a48229D8688a4280o0294B01431
12591A41630k7742K76818b07228A56263D7495g3053J0897H0979J26173d23979
12580B87759e5759k9396H021l106J45832h6632C07068d9229A68602N374a00385
$$ plain form
12568 203610 35403 254020 -4877 -164385 -322555 -207056 -226508 -216068 52274 263824 -144418
12556 -167973 -141670 20783 -78551 90021 122743 230653 -70830 61599 -137427 84375 18441
12544 -59523 -56367 232738 270393 451888 -47944 86068 -204044 206488 -185385 -221760 -95340
12532 205411 25343 -36969 321110 286956 35900 299912 90153 -93550 206704 50576 -27506
12520 -126095 138472 239031 276177 234038 55484 -39679 -121516 96418 82816 -222179 -278661
12509 -278661 110576 129 -55804 -38370 -1262 -78563 89119 118396 -25473 -3218 262401 -380474
12496 -302145 -46299 77003 61515 1452 -80984 -205048 267276 221968 258145 -19289 -86782
12485 -86782 156140 360455 223158 49274 135413 -172352 -260160 26837 -181555 -132255 28242
$$ packed form
12568B03610C5403K18617d877j59508j58170J15499j9452J0440E2274K11550a44418
12556a67973K6303B0783g8551I0021L2722J07910g0830F1599a37427H4375A8441
12544e9523L156B32738L7655J81495d7944H6068b04044B06488a85385l6375i5340
12532B05411B5343c6969C21110l4154C5900K64012I0153i3550B06704E0576b7506
12520a26095A38472J00559L7146m2139E5484c9679q1837I6418j3602b22179n6482
12509b78661A10576A29e5804J7434a262p7301H9119K9277b5473c218B62401c80474
12496c02145d6299G7003j5488A452h0984j24064B67276m5308L6177a9289o7493
12485h6782A56140K04315j37297D9274Q6139a72352q7808B6837a81555M9300B8242
$$ plain form
12473 -43938 92586 -71488 121297 212006 -90263 -140961 83695 -135522 -243627 -366313 16663
12461 -182510 -121817 194808 119295 -190842 -4053 257915 91316 -256414 -7739 -227705 -182478
12450 -182478 -103358 -159070 62932 -111594 270598 -323402 183178 -224977 -328260 -92829
12439 46276 -71323 -152244 39130 28693 270900 168218 188001 44652 -58819 294156 -684
12427 -167292 270127 37383 119805 50379 -176145 145490 -53768 -253432 -89094 92736 -68171
12415 83261 -9643 112293 343292 -125657 32004 -189678 20233 23442 135701 324221 -172264
12403 218117 116272 138132 128569 243276 117063 128786 92402 216365 88120 -180249 -311834
12392 -311834 -26287 78631 -162674 238890 -112640 48283 -8759 61974 182620 -134647 -411871
$$ packed form
12473d3938I2586g1488A21297R0709i0263n0698H3695a35522j08105j22686A6663
12461a82510O0693A94808p5513a90842d053B57915I1316b56414g739k19966M5227
12450a82478P9120n5712F2932a11594B70598c23402A83178b24977j03283i2829
12439D6276g1323q0921C9130j0437K42207j02682J9783D4652e8819B94156f84
12427a67292B70127C7383Q2422E0379a76145A45490e3768j99664h9094I2736f8171
12415H3261i643A12293K30999a25657C2004a89678B0233L209J12259J88520a72264
12403B18117j01845K1860r563J14707A17063J1723l6384J23963H8120a80249j31585
12392c11834b6287G8631a62674B38890a12640D8283h759F1974J20646a34647k77224
$$ plain form
12381 -411871 118521 273873 91659 90271 -209653 337406 106353 19344 228138 -45494
12370 -225105 -137642 159360 165488 -143697 6718 -125649 210797 9133 118251 -8843 38299
12358 -164382 51757 285376 -128095 197990 120139 42659 -129872 -1454 91046 -97877 33461
12346 -240882 77415 73553 298461 -34923 -296259 18327 -305030 54373 183645 -143807 -297959
12335 -297959 234844 -35359 -13480 556470 80015 -41238 220784 -8274 250391 91456 91408
12324 91408 -240508 196556 -139492 415853 -191608 -41392 23186 182130 57689 -298302
12313 9594 -56854 -12541 -95729 -150637 -298324 229477 -10978 174873 43167 13910 103013
12302 103013 147247 -116720 120319 45732 -28443 333635 -16735 -83252 139443 70625 -286745
$$ packed form
12381d11871A18521J55352I1659j388b09653C37406A06353A9344K08794d5494
12370b25105Q7463A59360O128a43697F718a25649B10797I133J09118h843C8299
12358a64382E1757K33619a28095A97990p7851D2659a29872a454I1046i7877C3461
12346b40882G7415l862K24908c4923k61336A8327c05030E4373J29272a43807j54152
12335b97959B34844c5359a3480E56470H0015d1238B20784h274B50391I1456m8
12324I1408b40508A96556a39492D15853a91608d1392B3186J58944E7689b98302
12313I594e6854a2541q3188n4908j47687B29477a0978A74873D3167A3910Q9103
12302A03013M4234a16720A20319D5732b8443C33635a6735o6517A39443o8818b86745
$$ plain form
12290 102200 124844 13533 346957 -2737 110998 196975 23851 237911 -34085 -162246 -315818
12279 -315818 77503 103609 178041 424128 101322 -201543 89582 -56500 331892 -150971
12268 -114055 -151581 73010 -202297 -169818 -26730 110201 46288 163995 -186825 -225779 -3217
12256 119546 89235 182945 377295 -119967 80142 120123 -94767 3244 -135394 -75244 -104465
12245 -104465 315750 1320 112088 158643 -6309 441652 41715 363928 -186198 175685 -6991
12233 157233 -54045 86939 327438 -139993 49163 -140322 356729 299470 148244 451240
12223 451240 126854 116680 217463 113099 225050 310468 182004 182279 -114139 200705
12212 -35380 -118427 278249 5920 242451 -247978 259342 346640 -215636 -31977 68312 208112
$$ packed form
12290A02200K2644A3533L33424b737A10998Q5977B3851K14060c4085j28161j53572
12279c15818G7503K6106P4432K46087A01322b01543H9582e6500C31892a50971
12268a14055l7526G3010b02297L2479b6730A10201D6288J17707a86825l8954c217
12256A19546l0311R3710J94350a19967H0142L9981i4767C244a35394O0150k9221
12245a04465C15750A320J10768M6555f309D41652D1715L22213a86198A75685f991
12233A57233e4045H6939K40499a39993D9163a40322C56729n7259A48244L02996
12223D51240A26854j0174J00783j04364J11951Q5418j28464K75a14139B00705
12212c5380q3047B78249E920K36531b47978B59342Q7298b15636c1977F8312J39800
$$ plain form
12201 208112 -230160 -69523 315042 273353 220167 -404034 368668 9902 11206 154920 -230817
12189 422650 -95905 118409 186574 -225899 247775 -2289 137001 243737 -105245 187775
12178 104525 240364 311238 -98650 308185 -103734 -54697 28707 355815 69384 303280
12168 303280 -64060 30653 190550 433907 374392 134506 252395 303747 -109995 318978
12157 86097 138338 382874 -189704 36258 177171 -289061 75869 116831 -18897 139050 -244978
12145 193566 61621 -130349 487882 127301 80969 -59006 279922 56302 354984 76209
12134 167393 117982 26097 -311367 -125015 -52768 -95828 138219 69393 163422 248552 436341
12123 436341 390533 -110163 365289 276659 244218 305997 -27139 58749 31329 90297 -433571
$$ packed form
12201B08112b30160f9523C15042m1689n3186d04034C68668I902J304J43714b30817
12189D22650i5905A18409O8165b25899B47775b289A37001J06736a05245A87775
12178A04525J35839P0874i8650C08185a03734M9037B8707L27108F9384K33896
12168C03280f4060C0653J59897K43357n9515A34506J17889N1352a09995C18978
12157H6097N2241K44536a89704C6258J40913b89061G5869M0962a8897A39050b44978
12145A93566F1621a30349D87882A27301m6332e9006B79922E6302K98682G6209
12134A67393m9411B6097c11367a25015e2768m3060A38219o8826R4029Q5130J87789
12123D36341m5808a10163C65289q8630l2441O1779b7139E8749k7420N8968d33571
$$ plain form
12111 -19671 217276 172551 -27541 166806 149797 225415 -79198 -234650 14552 -61140 22583
12099 216566 186193 141060 -66509 -245746 259971 -205425 10293 231331 -94757 203966
12088 -114579 -13995 -133641 148518 -42382 176229 301273 -56286 195352 44739 31373
12078 31373 -222741 -435866 -305903 -27156 -53651 3307 -200764 -422149 -58376 140766 101956
12067 101956 373418 -198133 -25943 52351 302121 161362 987183 2203715 573853 173203
12056 -362 -399356 103420 213821 -38802 185342 44474 -82635 -151295 -111041 138167 -48073
12044 112685 -249370 -145494 476140 213053 62054 382810 207627 -71993 -104835 107072
12033 -256084 97161 226233 -10427 93673 -51378 168164 68433 55320 99547 123289 30321
$$ packed form
12111a9671B17276m4725b7541A66806j7009P5618g9198j55452A4552f1140B2583
12099B16566l0373m5133f6509j79237B59971b05425A0293K21038i4757B03966
12088a14579a3995j19646A48518d2382A76229J25044e6286A95352D4739j3366
12078C1373b22741k13125J29963b7156k6495C307b00764k21385e8376A40766l8810
12067A01956K71462a98133b5943E2351K49770j40759Q25821J216532E73853A73203
12056c62l98994A03420J10401c8802A85342D4474h2635o8660M0254A38167d8073
12044A12685b49370J03876D76140B13053F2054L20756j75183g1993l2842A07072
12033b56084I7161J29072a0427I3673e1378A68164F8433j3113M4227K3742C0321
$$ plain form
12021 -187650 -61638 268423 62660 -63701 6331 133089 51780 -349124 -82032 -196368 -225002
12010 -225002 59191 -18004 -50014 11942 257389 -135136 -51108 -184308 147945 -24176 -259498
11999 -259498 -85034 -245789 4305 66190 -258015 -234715 8592 -325001 -307243 -125522 -20599
11987 -524271 108664 -79956 -85843 -19393 -364704 -71795 -180507 -232668 98848 -16759 108154
11975 -82000 115828 -38065 -233127 109302 -171358 321278 -23603 357692 117035 -334966
11964 -45666 -258914 -138224 164087 92436 -50962 458043 -334388 126874 122653 102329 -271145
11952 -12128 42666 -153557 -334216 -3646 -41277 2694 -44439 28905 -45981 196215 164779
11941 164779 -79748 161479 -137038 154901 -51755 35246 -24471 -152102 -234233 -9881 68065
$$ packed form
12021a87650f1638B68423F2660f3701F331J26758E1780c49124h2032j14336k8634
12010b25002E9191a8004l2010A1942K45447a35136e1108j33200A47945b4176k35322
11999b59498h5034j60755D305O1885b58015K3300H592c25001J7758a25522b0599
11987e24271A08664g9956n887a9393l45311g1795j08712n2161I8848a6759A08154
11975h2000A15828c8065j95062A09302a71358C21278b3603C57692A17035c34966
11964d5666k13248J20690A64087p1651e0962D58043c34388A26874m221k0324b71145
11952a2128D2666a53557j80659c646l7631B694d4439B8905d5981A96215l1436
11941A64779g9748A61479a37038A54901e1755C5246b4471j27631q2131i881F8065
$$ plain form
11929 186719 -152624 164087 95420 39022 93542 -273306 138372 -17164 -71770 248624
11918 51357 87271 16425 -186351 -275170 -221729 -34833 53168 145320 -38377 -204776 -267952
11907 -267952 -108877 -51047 -164326 -254206 56914 6523 -187330 2055 -228199 103865 178239
11896 178239 -233656 82739 192516 78446 -199975 89169 -276051 -43520 181703 222973
11886 222973 -69130 21758 47937 3406 -135947 286054 -135208 -212329 -221188 188615 246014
11875 246014 185108 -182024 -248303 -97542 -205206 117891 167829 152847 101373 10575 -381125
11863 -28107 114544 423460 -130848 -247432 -137744 -6927 -81566 -146110 -288078 -237563 -83412
11851 34891 121653 95234 -140821 -11091 -47546 122479 -269059 324185 -41299 172862 73649
$$ packed form
11929A86719a52624A64087o8667C9022N4520b73306A38372a7164n4606B48624
11918E1357L5914A6425a86351q8819N3441c4833E3168R2152c8377j66399o3176
11907b67952a08877e1047j13279q9880E6914F523a87330B055b28199A03865P4374
11896A78239b33656H2739J09777G8446a99975H9169b76051d3520A81703M1270
11886B22973f9130B1758K6179C406a35947B86054a35208p7121q859A88615N7399
11875B46014o0906a82024o6279i7542j07664A17891M9938j4982n1474A0575c81125
11863b8107A14544L08916a30848j16584J09688f927p4639o4544j41968N0515h3412
11851C4891Q6762k6419a40821a1091l6455A22479b69059C24185d1299A72862G3649
$$ plain form
11839 178367 -44768 -117613 38441 -303916 -72273 62262 -219109 -145937 -63648 -243779 4704
11827 -156397 48757 126687 -157581 -243679 -194069 273885 -6704 57920 -118193 -157407 54139
11815 -135451 373129 -2889 -272524 82067 12710 -199952 56904 -155119 31723 382749 -51245
11803 318120 286230 -162216 -50315 216251 240866 -160521 -50626 8412 109749 -105718 -12263
11791 -23205 -128345 58832 148898 48543 130561 -140830 -75868 40219 -72316 28671 14415
11780 14415 13675 -131923 188172 -32059 -181301 -96765 1034 -127946 87070 -28351 19290
11768 -299053 -132326 52782 214412 295877 294205 80259 50110 -68660 -36584 -162223 -72452
11756 -56359 -16601 50384 -289234 32167 134292 -113674 -180310 -142246 28319 -240817 -10283
$$ packed form
11839A78367d4768p2845C8441c03916g2273F2262b19109P3172f3648j80131D704
11827a56397D8757P7930a57581q6098M9610B73885f704E7920a18193l9214E4139
11815a35451C73129b889k69635H2067A2710a99952E6904a55119C1723L51026e1245
11803C18120l1890a62216e0315B16251K4615a60521e0626H412J01337a05718a2263
11791b3205j05140E8832R0066D8543Q2018a40830O4962D0219g2316B8671j4256
11780A4415p40a31923A88172c2059j49242Q4536A034a27946H7070b8351A9290
11768b99053a32326E2782J61630Q1465j672H0259l0149f8660L2076j25639g2452
11756e6359a6601E0384b89234C2167J02125a13674o6636L8064B8319b40817a0283
$$ plain form
11744 -60445 -113011 -258467 93409 120673 -40811 -314264 62407 -89914 -30304 297796 -54352
11732 265302 5695 -34146 11415 40758 -269707 -146947 199222 -89912 -76681 -134498 -46363
11720 6535 50052 76502 -447055 -168711 88295 -56840 338142 -271227 -203584 -185911 -327829
11709 -327829 210534 -188414 13662 -15182 13554 52955 117846 -156777 7008 -70353 184176
11697 56245 42605 56949 44250 -97149 -224766 -163396 -175699 -47236 38121 -127340 -52023
11685 -84722 76212 -115672 116561 204732 60009 245736 -50777 62269 233796 319444 22248
11673 7028 127784 -44308 206295 -186223 -126544 77637 -247905 152180 81154 95024 171136
11662 171136 -137095 -278989 -206706 -72768 169260 -142720 158040 -107908 191238 455050
$$ packed form
11744f0445n2566j45456I3409K7264d0811k73453F2407h9914c0304B97796e4352
11732B65302E695c4146A1415K9343b69707J22760A99222h9912J3231n7817d6363
11720F535M3517K6450d47055a68711H8295e6840C38142b71227O7643J7673j41918
11709c27829B10534a88414A3662a5182A3554L9401O4891a56777G008g0353A84176
11697E6245j3640J4344j2699i7149j27617O1370j2303d7236C8121a27340e2023
11685h4722G6212a15672A16561Q8171F0009J85727e0777F2269J71527Q5648B2248
11673G028J20756d4308B06295a86223N9679G7637b47905A52180p1026J3870P6112
11662A71136a37095j41894P2283g2768A69260a42720A58040a07908A91238K63812
$$ plain form
11652 455050 -274212 31620 -126999 96199 -182166 -172808 -7587 48480 -125773 20901 -284029
11640 -40652 91558 215279 176065 -46293 -45419 -32562 -87791 -111468 -45508 65047 16660 275235
11628 275235 13421 203465 202906 -97689 -15779 206536 -71615 -174012 49209 187787 -34688
11616 14009 -250742 -125709 -420936 -156828 -126512 301491 413663 -49983 -138639 -131681 -158262
11605 -158262 21400 77385 -72112 24123 -132811 -191276 94659 156837 257664 -200158 -612
11593 -385135 105780 -202612 -15900 -273719 -310257 258058 104646 -50060 -31603 190508
11582 297394 -92684 -153971 -19409 -197538 92041 43088 -131063 70415 223301 169105 201157
11571 201157 -100874 281495 73326 368249 44811 -5202 194327 -121833 -37299 -40428 -120358
$$ packed form
11652D55050b74212C1620a26999I6199a82166R358g587D8480a25773B0901b84029
11640d0652I1558J23721l9214d6293Q74J2857n5229k3677d5508F5047A6660K58575
11628B75235A3421J90044n59i7689a5779B06536g1615j02397D9209J38578c4688
11616A4009b50742J25033k95227a56828L0316C01491J12172d9983q8656O958k6581
11605a58262B1400N5985g2112B4123a32811n8465I4659O2178J00827b00158f12
11593c85135A05780b02612a5900k57819l6538B58058A04646e0060J8457A90508
11582B97394i2684o1287a9409j78129I2041D3088a31063G0415J52886n4196L2052
11571B01157a00874B81495G3326K94923D4811e202A94327a21833c7299l129p9930
$$ plain form
11560 -120358 -183151 27372 40863 510976 89486 -212321 -15030 7917 -59508 -23757 198857
11548 -25284 52126 196623 67847 -276839 167372 -98042 48340 62951 -104955 109577 170197
11537 170197 317354 98370 -31364 39907 -55081 -165629 -143949 -146024 -198717 -25919 216352
11525 9004 74808 -91792 -21880 -7887 266480 7446 157938 -130682 -274515 235174 -97094
11513 17651 296376 -309103 62676 -273688 67645 16144 -9799 160338 224776 -181349 103515
11501 38701 163621 -8989 374584 -92864 11111 183198 108758 91331 112563 108857 410707
11490 410707 88122 237715 152883 167670 58050 -208585 389249 -109437 292268 552099
11480 552099 267276 544780 143096 46090 125883 53878 -5806 -23665 -253309 256116 713
$$ packed form
11560a20358o2793B7372J3491M70113H9486b12321a5030G917e9508b3757A98857
11548b5284E2126J44497F7847b76839A67372i8042D8340J4611a04955A09577O0620
11537A70197J47157I8370c1364C9907e5081j10548K1680k075n2693b5919B16352
11525I004O5804i1792b1880g887B66480G446J50492a30682j43833B35174i7094
11513A7651K78725c09103F2676b73688F7645A6144i799A60338O4438a81349A03515
11501C8701J24920h989C74584i2864A1111J72087p4440j7427K1232l706L01850
11490D10707H8122J49593q4832J4787E8050b08585C89249a09437B92268K59831
11480E52099B67276K77504A43096D6090P9793E3878e806j7859k29644B56116G13
$$ plain form
11468 -96147 366469 -58112 139904 109589 96509 144365 85746 126692 97990 -26157 56066
11456 62117 180690 68607 -100350 -215396 123721 -109583 11144 140447 243675 119383
11445 -369358 540573 -21452 -107515 -48158 236165 61006 199947 84039 242171 85814 490048
11434 490048 119887 -98770 205296 -150080 -85389 -157815 168281 -174067 44471 64646
11424 64646 90666 -102459 -3713 124192 -146397 -265907 -47764 25536 -473 -243122 -211285
11413 -211285 -71856 140741 31190 -16138 160244 395043 -61585 -213640 -199060 -174811 -328430
11402 -328430 -62014 64952 -144380 284956 96122 237802 179770 200521 -112881 -115462 164297
11390 -180932 -29353 55557 5480 163390 -36039 -183520 -298224 3065 -31892 -250554 4343
$$ packed form
11468i6147C66469e8112A39904l0315j3080M7856n8619M0946k8702b6157E6066
11456F2117J18573F8607a00350j15046A23721a09583A1144J29303J03228A19383
11445c69358E40573b1452q6063d8158B36165F1006J38941H4039J58132H5814M04234
11434D90048A19887i8770B05296a50080O4691p2426A68281a74067D4471K0175
11424F4646K6020a02459c713A24192a46397j19510d7764B5536d73k42649L1837
11413b11285g1856A40741C1190a6138A60244K34799f1585j52055J4580K4249j53619
11402c28430f2014F4952a44380B84956I6122J41680n8032K0751a12881k581A64297
11390a80932b9353E5557E480J57910c6039j47481j14704C065c1892k18662D343
$$ plain form
11378 353736 5547 46322 527125 16694 -70274 -83385 137726 69900 -149167 -252708 -37877
11366 -319498 -320380 62237 200058 139020 24535 -154722 -24624 -245886 123034 -38694 -103329
11355 -103329 379011 -49082 -92179 88351 -51952 108279 -114036 -252694 -260511 -318010 183898
11343 -353491 72949 -116339 -133029 -25401 -136548 -101117 -164712 -20803 46702 -5752 -156988
11332 -156988 -72284 -87306 190033 -89741 48392 58548 -85117 -317042 -79751 51782 150368
11321 150368 -64867 -247974 -177575 150559 42501 98918 -105610 -90143 -68459 172342 237086
11310 237086 -144778 78825 74355 -203601 -134418 -160946 -369236 -231991 236786 169955 167083
11299 167083 -110109 -36289 -102407 -380031 95496 -159253 19332 22903 220952 206572 -1428
$$ packed form
11378C53736E547M0775M80803A6694g0274j3111A37726o7826a49167j03541c7877
11366c19498q82F2237J37821o1038B4535a54722b4624k21262A23034c8694o4635
11355a03329C79011d9082m3097H8351e1952A08279a14036j38658p817n7499A83898
11343c53491G2949a16339j6690b5401j11147L5431o3595b0803D6702e752j51236
11332a56988g2284j5022A90033h9741D8392J0156h5117k31925g9751E1782R8586
11321A50368f4867j83107P0399A50559D2501N6417a05610J5467K1684A72342O4744
11310B37086a44778G8825m470b03601O9183k6528k08290J37245B36786o6831k872
11299A67083a10109c6289o6118k77624I5496a59253A9332L571J98049j4380a428
$$ plain form
11287 -72019 124711 -114194 -94250 -93372 361908 63585 -131459 264217 -124421 216677 -95872
11275 -271791 170573 89839 147323 84955 199383 -132604 -177518 70017 41956 184495 -9962
11263 -112571 37253 -100700 -67725 -222927 -102275 306080 -127845 -157833 75221 36572
11252 34254 47773 216110 -59883 -172065 -233043 342933 -249377 -14720 -63429 -6783 -285403
11241 -285403 -78492 -368946 -238973 -185686 -209948 -63236 -284455 102935 -189121 80110
11230 -293805 -30279 82368 123549 136809 -234544 -43511 163652 233210 -228697 240202 -96579
11218 14599 98709 165655 -260431 -55143 -232665 -54758 57783 -184811 -130227 -85975 -81500
11207 -81500 304029 12068 -306020 -212805 -311883 -83001 -117093 -113655 -221385 -124615 337739
$$ packed form
11287g2019A24711a14194J9944Q78C61908F3585a31459B64217a24421B16677i5872
11275b71791A70573q0734N7484o2368J14428a32604m4914G0017k8061J42539i962
11263a12571C7253a00700L2975j55202a02275C06080a27845k9988G5221C6572
11252C4254J3519J68337e9883j12182o0978C42933b49377a4720m8709f783k78620
11241b85403g8492k90454J29973N3287k4262f3236k21219A02935a89121H0110
11230b93805c0279H2368M1181J3260b34544d3511A63652O9558b28697B40202i6579
11218A4599Q4110O6946b60431e5143j77522e4758E7783a84811N4584M4252M475
11207h1500C04029A2068c06020R3215r9078h3001l4092L438j07730R6770C37739
$$ plain form
11195 85871 -151881 109109 154130 -333599 -359066 -256007 -20403 -49717 -83551 -41611 180573
11183 291497 -219163 -14615 216733 -341284 184429 231060 89315 -289941 -25760 153223
11172 -70991 45009 -79670 210494 -129695 103162 -135009 6340 -154401 -71671 181764 21213
11160 187581 -208857 -358972 -169430 -202503 -28131 98015 -198287 -93777 -162208 52187 71026
11149 71026 -84579 -107272 -254048 -170058 199114 -170302 83555 304238 33658 -172031 35421
11137 94271 211859 156482 80239 -86076 -19512 73466 237880 -108881 240353 -86921 31414
11125 40611 159087 -57641 123812 214592 -137809 134252 6841 -33479 103619 -114333 8523
11113 225093 -74769 -279310 -219226 -100167 77114 -48377 325724 46022 260444 -140603
$$ packed form
11195H5871a51881A09109M5021c33599k5467J03059b0403k9314l3834d1611A80573
11183B91497b19163a4615B16733c41284A84429M6631H9315b89941b5760A53223
11172g0991D5009g9670B10494a29695A03162a35009F340a54401g1671A81764B1213
11160A87581b08857j50115a69430l3073b8131I8015a98287i3777o8431E2187J8839
11149G1026h4579k2693j46776Q3990A99114a70302H3555K20683C3658a72031C5421
11137I4271J17588n5377p6243h6076a9512G3466J64414a08881B40353h6921C1414
11125D0611J18476e7641A23812R0780a37809A34252F841c3479A03619a14333H523
11113B25093g4769k04541O0084a00167G7114d8377C25724D6022K14422a40603
$$ plain form
11102 -120166 -17081 -135333 222671 -35088 423770 276780 406008 89129 -45617 93499
11091 -110188 177454 165752 268463 -28721 171706 268170 339021 340259 -46520 126958 201528
11080 201528 72331 377698 254927 306882 276992 4692 238006 322300 194956 268308 191216
11069 191216 139343 344851 308520 108425 498696 113566 -3876 292905 449111 149101
11058 367846 851032 465584 568696 680541 851477 515289 841168 613591 412021 534179
11048 534179 711570 552773 723297 817643 494777 798104 842923 827664 613239 579379
11038 579379 657768 551105 507350 817055 542640 817594 575186 588172 599995 770155
11028 770155 779748 750672 833030 891594 345270 604383 824461 713377 895634 449843
$$ packed form
11102a20166a7081j18252B22671c5088D23770j46990J29228H9129d5617I3499
11091a10188A77454j1702J02711b8721A71706R6464P0851J238d6520A26958P4570
11080B01528G2331L05367j22771N1955k9890D692K33314Q4294j27344P3352p7092
11069A91216n1873K05508l6331A08425L90271A13566c876B92905J56206A49101
11058C67846M83186l85448J03112J11845J70936l36188L25879k27577k01570J22158
11048E34179J77391j58797J70524R4346l22866L03327M4819j5259k14425l3860
11038E79379P8389j06663m3755L09705k74415K74954k42408J2986J1823J70160
11028G70155R593k9076Q2358N8564C45270K59113K20078j11084J82257m45791
$$ plain form
11018 449843 670866 553550 164378 557105 527832 259449 576530 549419 659396 472567
11008 472567 499003 680719 528628 913424 600465 789927 552025 737365 664070 880038
10998 880038 528481 813182 596999 655063 858819 651333 261548 549696 691204 650265
10988 650265 436245 683756 937127 636002 912596 888994 1054107 775905 1155366 1386449
10978 1386449 1045427 1543019 1447732 1631840 1924109 2149791 2451575 2813925 2659489 2671545
10968 2671545 2532850 2330945 2255473 1650538 1252065 1300003 966597 1128859 988265 1255695
10958 1255695 1120367 904579 918826 930587 1005531 676340 866050 440685 555435 410095
10948 410095 302659 64533 174054 46963 443279 353664 323145 140250 190388 85492 301171
$$ packed form
11018D49843K21023j17316A64378L92727k9273B59449L17081k7111J09977j86829
11008D72567K6436J81716j52091L84796l12959J89462k37902J85340p3295K15968
10998H80038l51557K84701k16183N8064K03756k07486B61548K88148J41508m0939
10988F50265k14020K47511K53371l01125K76594k3602J65113k78202L79461K31083
10978A386449l41022M97592r5287J84108K92269K25682L01784L62350j54436J2056
10968B671545j38695k01905p5472o04935l98473M7938l33406J62262j40594K67430
10958A255695j35328k15788J4247J1761P4944l29191J89710m25365J14750j45340
10948D10095j07436F4533J09521D6963L96316q9615l0519A40250N0138H5492K15679
$$ plain form
10937 301171 110310 180916 -191766 40643 -254527 -149593 250944 -48448 -34272 102464
10926 113092 -9307 -50966 -241240 -43695 838 69151 -127893 39469 73158 50413 -10553 -269097
10914 -269097 43375 137105 -61706 -203919 -298736 -23261 -110624 105218 -292395 14275 -46879
10902 126702 253008 78072 119684 -161081 -74361 149403 -178990 127687 -375295 -389567
10892 -389567 3134 -267757 63624 -177699 -202503 47865 165211 38014 198036 -143813 -191073
10881 -191073 183348 -166562 -174434 13393 -35890 82813 -65496 18403 -75187 267002 159154
10870 159154 -102605 126329 80662 137879 -41360 90666 190867 -150936 -354557 -215083
10860 -215083 4495 -203790 -74759 -19719 -239240 -166008 -114631 -143923 262298 109766 240248
$$ packed form
10937C01171A10310P0606a91766D0643b54527J04934B50944d8448J4176A02464
10926A13092i307m1659j90274d3695H38O8313a27893C9469L3689k2745a0553k58544
10914b69097D3375R3730f1706j42213r4817b3261q7363A05218b92395A4275d6879
10902A26702J26306G8072M1612a61081g4361A49403a78990A27687c75295j4272
10892c89567C134b67757F3624a77699k4804D7865J17346C8014J60022a43813m7260
10881a91073A83348a66562p872A3393c5890H2813f5496A8403g5187B67002j07848
10870A59154a02605A26329m5667N7217d1360I0666J00201a50936k03621J39474
10860b15083D495b03790g4759a9719k19521P3232N1377k9292B62298A09766J30482
$$ plain form
10849 240248 -63879 -3169 -170213 81027 -129906 -500531 321736 72359 -85679 -211023 -132706
10838 -132706 -78581 200239 -51863 158179 -199450 -3839 -118907 108247 143167 43703 227136
10827 227136 -599305 132118 -105377 191885 130041 -369875 53877 -31897 -62309 98692
10816 -106606 118999 31792 137172 -118540 -475817 -337871 118698 71338 275888 -274281
10805 238743 178629 -181120 164357 30857 -169856 21694 -163770 -70547 209384 -270759
10794 -85984 -177828 -73888 -12832 -52393 97404 158492 -4517 71275 66454 -44314 -17337 601
10781 -95972 144093 -75728 -99433 218481 -103404 -191399 -67473 -287005 12021 -179414 -124962
10770 -124962 383612 55361 -201528 95740 -231315 -46367 -214692 343483 47316 64724
$$ packed form
10849B40248f3879c169j67044H1027a29906l70625C21736G2359h5679j25344P8317
10838a32706N4125B00239e1863A58179a99450c839j15068A08247L4920D3703J83433
10827B27136e99305A32118a05377A91885o1844c69875E3877c1897l0412I8692
10816a06606A18999C1792J05380a18540l57277J37946A18698m7360K04550b74281
10805B38743o0114a81120A64357C0857a69856B1694a63770g0547B09384b70759
10794h5984r1844g3888a2832l9561I7404O1088d517G1275m821d4314a7337F01
10781i5972A44093g5728k3705B18481a03404q7995f7473k19532A2021a79414N4452
10770a24962C83612E5361b01528I5740b31315d6367j68325C43483D7316J7408
$$ plain form
10760 64724 214925 -103941 -259774 -217550 132165 -183534 -361694 217210 -92606 108964
10749 -137597 -134385 236188 -634 -128997 255455 -157088 72387 -83622 5444 -142129 115193
10737 93542 -5455 129367 -7741 -86057 78343 -107353 46462 -140019 -164479 -87995 -43123
10725 98602 -160518 57687 308741 -258289 -169468 74261 -247874 -71217 362805 -176488
10714 110732 -48611 -116406 185397 -380193 112534 312859 125721 120376 -88424 31305 -429574
10702 -132854 60154 -27474 -260985 -308566 259484 -79061 9028 -219441 127532 -100929 -72551
10691 -72551 -36454 -78252 -224082 -257049 -165171 202709 -28241 -161335 49514 151454 89778
10680 89778 -188496 -18994 -291721 -21675 58238 -301541 -203932 -192107 -34261 227150 -334294
$$ packed form
10760F4724J50201a03941j55833M2224A32165a83534j78160B17210i2606A08964
10749a37597L212B36188f34j28363B55455a57088G2387h3622E444a42129A15193
10737I3542e455A29367g741p8316G8343a07353D6462a40019k4460P6484d3123
10725I8602a60518E7687K51054b58289Q8821G4261b47874g1217C62805a76488
10714A10732d8611o7795A85397c80193A12534K00325A25721n345h8424C1305d29574
10702a32854F0154b7474k33511m7581B59484g9061I028b19441A27532a00929K8378
10691g2551L6097m1798j45830l2967R1878B02709b8241j33094D9514J01940o1676
10680H9778a88496a8994k72727b1675E8238c01541R7609J1825c4261B27150c34294
$$ plain form
10668 46618 -36878 -89383 63553 -224043 -229915 -58676 -83457 54082 101986 122848 -95567 -390398
10656 -390398 -48855 107963 -266171 -44692 -129541 -112595 223018 -11143 -249159 -95265 -24123
10644 48657 -315035 127830 159068 32773 -213522 -97852 -58699 -39521 -163683 28362 -216350
10632 -151414 -245346 219283 -153816 -188698 -308879 182023 133903 135638 -31748 -196208 272079
10620 -168737 -290577 -102391 -166724 9590 -214348 188 -506614 50502 178592 -9377 -7449
10609 -7449 119081 99614 -315460 118616 -219896 -196387 -72160 -141653 1104 48542 -222178
10597 -101861 59799 -30996 -173597 -99211 -8439 -368676 -62043 68581 394786 -92812 -36916
10585 139435 -24455 -15453 165401 -73271 92533 216615 -41979 144081 -186898 239852 -98530
$$ packed form
10668D6618c6878n2505F3553b24043n872e8676k4781E4082M7904K0862i5567k94831
10656c90398d8855A07963b66171d4692q4849J6946B23018a1143k38016i5265b4123
10644D8657c15035A27830L1238C2773b13522i7852L9153J9178j24162B8362b16350
10632a51414r3932B19283a53816l4882j20181A82023m8120J735c1748j64460B72079
10620a68737j21840a02391o4333I590b14348A88e06614E0502J28090i377J928
10609g449A19081j9467c15460A18616b19896K3509g2160o9493A104M7438b22178
10597a01861E9799c0996j42601P4386h439l60237f2043F8581L26205i2812c6916
10585A39435b4455R002A65401g3271I2533J24082d1979A44081a86898B39852i8530
$$ plain form
10573 103524 -389725 -305797 -188537 -26265 144851 -53470 151047 -211972 -437670 -86978
10562 336812 171649 121238 106672 4143 -218826 -41826 -227703 250718 74612 -159811 27329
10550 36764 -20086 114289 163075 -140549 -160790 262856 240103 -447317 -325245 -141229
10539 -54439 -24586 -241637 31145 151180 -12993 190723 -361359 12848 -217779 -95093 -285805
10528 -285805 167019 -67780 -369351 -132764 15383 275445 -93283 -162590 -128843 -130515 46983
10516 -115598 -28935 -93614 -20316 -2457 31764 -115622 -139841 -177492 -31297 129289 -81301
10504 150972 79810 -93430 30268 106228 -260018 142196 5412 -159820 -83383 191412 -80407
10492 -7302 -42220 -393649 -138996 -24732 102542 117398 -124638 -45551 -169931 97395 -332322
$$ packed form
10573A03524c89725Q3928J17260b6265A44851e3470A51047b11972k25698h6978
10562C36812j65163n0411j4566D143b18826d1826j85877B50718G4612a59811B7329
10550C6764b0086A14289M8786a40549k0241B62856k2753d47317J22072a41229
10539e4439b4586k17051C1145J20035a2993A90723c61359A2848b17779i5093j90712
10528b85805A67019f7780l01571a32764A5383K60062i3283o9307L3747j672D6983
10516a15598b8935o4679b0316b457C1764a15622k4219l7651c1297A29289h1301
10504A50972p1162i3430C0268P5960b60018A42196E412a59820P6437A91412h0407
10492g302l4918l51429a38996b4732A02542J4856a24638d5551j24380I7395c32322
$$ plain form
10480 36106 -20085 -28722 262781 -228681 -607 153181 238356 231639 30961 91037 -870 -19407
10468 -19407 122572 -467068 -150466 316936 -104617 -87699 259564 469008 -59151 -119056
10458 -119056 -118595 -180864 -35545 -24090 68908 143904 106285 -165071 -77678 -192051 -203992
10447 -203992 -51497 -422113 153085 90718 80686 -119174 7253 308281 68808 -127522 -180569
10436 -180569 186598 -72196 -91801 98296 70352 187056 -46185 -262472 -52140 251249 -91458
10424 138067 76314 -70257 -70705 220097 137312 -258483 -22655 -59313 -224383 -104992 27729
10412 84881 -252775 137472 -112483 104712 -84161 -160002 -181696 -117978 154735 305977
10402 305977 -506572 -18189 -276189 -212623 222552 -334511 -185911 -61717 6200 70315 22587
$$ packed form
10480C6106b0085q637B62781b28681f07A53181Q5175o717C0961O0076h70j8537
10468a9407A22572d67068a50466C16936a04617J6918B59564K09444e9151n9905
10458a19056M61o2269c5545J1455F8908P4996l7619a65071g7678j14373j1941
10447b03992e1497l70616A53085o2367j0032a19174G253L01028F8808a27522n3047
10436a80569A86598g2196j9605I8296k7944J16704d6185k16287e2140B51249i1458
10424A38067o1753g0257m48B20097q2785b58483b2655l6658j65070a04992B7729
10412H4881b52775A37472a12483A04712h4161p5841k1694O3718A54735J51242
10402C05977e06572a8189k58000O3566B22552c34511J48600f1717F200O4115B2587
$$ plain form
10390 -115192 207708 322919 116378 200808 298982 -205100 54062 321785 2887 222380
10380 222380 6641 202331 202046 156979 261310 54197 416781 120683 150316 108113 318380
10369 318380 124185 -56705 183312 372265 353243 342377 143356 287602 388847 330466
10359 330466 283732 31722 -47035 70951 43803 434361 128657 143186 484087 613272 475298
10348 475298 153530 518956 850035 400869 312024 576173 18355 53353 240026 123988
10338 123988 361231 30600 -104806 141636 -143280 -69325 66470 -176197 -84028 135111
10327 104034 266844 -12560 266883 174433 23709 212053 -58262 -86663 252634 297812 274263
10316 274263 -5794 -122306 -257406 -89871 -61383 23296 272877 265145 194394 -363753 -191623
$$ packed form
10390a15192B07708J15211A16378Q4430R8174b05100E4062K67723B887K19493
10380B22380F641J95690k85m5067J04331E4197L62584A20683K9633m2203K10267
10369C18380A24185e6705A83312J88953j9022j0866A43356J44246J01245n8381
10359C30466m6734C1722d7035G0951k7148L90558A28657J4529L40901J29185j37974
10348D75298A53530L65426L31079D00869q8845K64149A8355L4998J86673j16038
10338A23988K37243C0600a04806A41636a43280f9325F6470a76197h4028A35111
10327A04034J62810a2560B66883r2450B3709J88344e8262k8401B52634M5178k3549
10316B74263e794j16512j35100h9871K8488B3296K49581p732p0751c63753J72130
$$ plain form
10305 -191623 236396 102499 69978 27815 -18371 -194385 143260 6914 200341 -274903
10294 -105939 149467 18818 20210 129313 -225813 192284 -171930 -65943 130748 54848
10283 -64385 -34348 335588 131233 248063 125973 218844 -206019 366636 163562 12352
10272 17879 -341657 -186486 -155568 -50274 -63635 -273399 -316035 76858 74002 137329 -225801
10260 -9376 210809 384878 161430 303212 -39857 161368 140851 -207579 99772 -27771 72426
10248 -126616 -141906 291762 66984 28984 149789 124669 -162860 -362992 -45694 -179124
10238 -179124 208261 -185132 125850 -59374 -85165 259750 -37184 -42665 -343693 -87258 -169575
10227 -169575 149527 -65237 -66365 90894 43032 1964 -265422 26788 -66009 193797 148784
$$ packed form
10305a91623B36396A02499l2521B7815a8371j76014A43260F914J93427b74903
10294a05939A49467A8818J392J09103b25813A92284a71930f5943A30748E4848
10283f4385L0037C35588A31233J16830j22090R2871b06019C66636A63562A2352
10272A7879c41657J55171L0918e0274j3361k09764m2636G6858k856O3327b25801
10260i376B10809J74069A61430J41782c9857A61368k0517b07579I9772b7771G2426
10248a26616j5290B91762F6984B8984J20805k5120a62860k00132d5694j33430
10238a79124B08261a85132A25850e9374k5791B59750c7184n481l01028h7258q2317
10227a69575A49527f5237j128I0894D3032A964b65422B6788f6009A93797m5013
$$ plain form
10216 148784 23026 -45499 -207484 -325931 -318689 -70415 -175991 162386 9324 -38126 157276
10204 -181440 -204853 -119212 -10766 -39950 -258723 -161188 186948 -4891 -191037 5058 63582
10193 63582 -75350 202991 -39520 -71553 96213 -39885 -54691 187044 -252454 -80676 87175
10181 -10935 -27139 -218923 -376563 215175 -103063 -16091 94483 -219082 -414490 -335554
10171 -335554 -97905 -6370 -211434 -36600 -168554 21731 269227 -109521 -116491 49159 301341
10160 301341 38757 -53285 -104098 -36338 -38506 -247329 -19894 3627 -480121 65970 -193162
10148 46671 -174559 -130610 152277 -25480 -113888 83193 174315 329598 -37357 -306695 -184776
10137 -184776 -254977 36907 -297752 425532 -19149 -246966 -90988 -88586 -270790 168178 -86843
$$ packed form
10216A48784B3026d5499j61985j18447P242g0415j05576A62386I324c8126A57276
10204a81440k3413Q5641a0766k9184k18773R7535A86948d891j86146E058N8524
10193F3582g5350B02991c9520l2033I6213c9885j4806A87044b52454h0676H7175
10181a0935j6204j91784j57640B15175a03063a6091I4483b19082j95408P8936
10171c35554i7905f370k05064c6600j31954B1731K47496a09521o970D9159K52182
10160C01341C8757e3285n0813c6338k168k08823a9894C627d80121F5970a93162
10148D6671a74559M3949A52277b5480q8408H3193R1122J55283c7357k69338J21919
10137a84776p0201C6907b97752D25532a9149k27817i0988K402j82204A68178h6843
$$ plain form
10125 88320 -171805 -7033 -247577 70590 -318361 -21091 -52887 134245 -127698 -179968 -19317
10113 -87658 -234566 204410 372636 -9140 -167916 -408362 13030 -82461 -149787 -151647 126801
10101 -240490 -115367 -2687 -221022 -137930 -124371 -67201 -205477 -16689 -115365 146201 -24725
10089 -106936 206000 20683 -369178 136342 278874 -42882 22500 -145110 -46980 34157
10078 -199512 -491142 175774 44115 -60157 7923 -130838 106027 -315703 -437677 -344799
10068 -344799 -236127 19322 -109375 176750 -201928 -451432 344737 -191642 -58862 -36781
10058 -36781 -70605 -147070 -74138 330881 -75562 -201603 -118593 171827 39685 -229398 -21730
10046 -102718 40691 -146054 447275 127837 -136841 -471976 -154898 -51675 -93821 -195310
$$ packed form
10125H8320a71805g033k40544G0590c18361b1091l1796A34245a27698n2270a9317
10113h7658j46908B04410J68226i140j58776k40446A3030h2461o7326j860A26801
10101b40490a15367b687k18335Q3092J3559N7170j38276a6689r8676A46201b4725
10089a06936B06000B0683c69178A36342J42532d2882B2500a45110d6980C4157
10078a99512k91630A75774D4115f0157G923a30838A06027c15703j21974R2878
10068c44799J08672A9322a09375A76750b01928k49504C44737a91642e8862K2081
10058c6781l3824p6465P2932C30881g5562j26041Q3010A71827C9685b29398b1730
10046a02718D0691a46054D47275A27837a36841l35135a54898e1675m2146j01489
$$ plain form
10036 -195310 -230666 176437 13446 -112636 29063 118506 119145 6151 19413 337054 122944
10024 180215 -206050 -185579 53965 59647 -209553 -361092 -161098 519 -196068 -146630 -91912
10013 -91912 -184405 -127265 -92664 70413 -185024 -176086 -159584 339416 -227007 -154146 -307225
10002 -307225 72676 2022 -143533 71648 28806 -276034 -281740 -65305 152919 65146 252527
9991 252527 -183012 -291907 -156020 -12849 66979 6727 -640746 55296 -172902 -304078 -241967
9980 -241967 -20951 133569 169888 -91720 154271 92871 -22197 24051 5757 -275076 -186462
9969 -186462 -224490 93801 -213955 67227 -151359 74439 -209590 33680 197236 78625 -203051
9957 105078 -219500 -49144 -42200 16747 -51322 2371 -136153 -275500 4850 -447697 -260094
$$ packed form
10036a95310l5356A76437A3446a12636B9063Q9443O39F151J3262L17641A22944
10024A80215b06050K0471E3965N682b09553j51539a61098E19a96068M9438N4718
10013i1912r2493N7140L4601G0413a85024Q938J6502C39416b27007P2861j53079
10002c07225G2676B022a43533G1648B8806b76034n706f5305A52919F5146J87381
9991B52527a83012j08895J35887a2849F6979F727f40746E5296a72902j31176O2111
9980b41967b0951A33569L6319i1720A54271o1400b2197B4051E757b75076Q8614
9969a86462l8028I3801b13955F7227a51359G4439b09590C3680J63556G8625b03051
9957A05078b19500d9144O944A6747e1322B371a36153j39347D850d47697J87603
$$ plain form
9946 -260094 -141860 -4877 -43988 120948 129024 -127140 -282282 -31185 -237693 -144312 119925
9934 -167566 180605 -90425 191375 -115132 1153 -98983 -30205 -112200 -59455 126386 -46225
9922 135706 -298378 -434383 -53767 -60091 -369247 255424 53995 -197135 18533 -103438 169820
9910 -161235 -132685 -94977 -519370 -90853 -14419 41118 -46336 -64543 -184745 135766 -313107
9898 316218 -204737 51435 525854 -188443 -89498 -440209 11694 -264188 10700 -55434 -25808
9886 -237227 -4262 -82750 -2455 74649 239610 -180713 -417034 -280006 -16817 17970 -153033
9874 -137011 -360934 13629 79733 -191619 -127048 -236933 -101121 -8831 207226 -65745 -192675
9863 -192675 -275077 7100 12231 20933 -167859 -256518 -336363 -111112 -673 136705 282712 -265080
$$ packed form
9946b60094J18234d877l9111A20948Q076a27140j55142c1185k06508R3381A19925
9934a67566A80605i0425A91375a15132A153i8983c0205q1995N2745A26386d6225
9922A35706b98378j36005e3767o324l09156B55424E3995a97135A8533a03438A69820
9910a61235K8550L7708m24393i0853a4419D1118d6336j8207j20202A35766c13107
9898C16218b04737E1435M74419a88443h9498l50711A1694b64188A0700e5434b5808
9886b37227d262p8488b455G4649J64961a80713k36321J37028a6817A7970a53033
9874a37011k23923A3629O6104a91619O4571j09885a01121h831B07226f5745j26930
9863a92675q2402G100N131Q702a67859q8659p9845a11112f73A36705J46007b65080
$$ plain form
9850 -240830 124628 8547 -1999 -235449 -215072 -136547 -91495 10409 -87160 -210509 259034
9838 40826 -167449 -58053 -39927 -28669 -41604 -157576 23064 158752 -9068 -31623 -118475
9827 -118475 46406 -180411 -32447 -271585 18696 115844 -101708 293439 132063 -187099
9816 -122523 -33993 -314672 -107757 -210989 126919 -57176 363085 -321021 -175339 -68928
9805 -62432 -271244 -180634 -388884 -19531 -19919 330751 81689 -413914 -119744 -176375 -96316
9794 -96316 -128738 -162426 -170833 79425 -145065 307420 11578 102501 144701 191123 -36303 124328
9781 131390 -138268 36806 -146569 -199309 42964 -340670 -47650 -5108 -116460 -41242 -110001
9770 -110001 -100069 -2974 -209041 -156118 -286728 -315687 -359476 -192460 119977 -312143 -226021
$$ packed form
9850b40830A24628H547a999k33450K0377P8525M5052A0409h7160j23349B59034
9838D0826a67449e8053J8126J1258j2935j15972B3064J35688i068k2555q6852
9827a18475D6406a80411c2447k39138A8696R7148a01708B93439A32063a87099
9816a22523c3993k80679a07757j03232A26919e7176C63085c21021J45682f8928
9805f2432k08812R0610k08250a9531l88C30751H1689d13914a19744n6631Q0059
9794i6316l2422l3688q407G9425a45065C07420A1578R0923M2200M6422c6303A24328
9781A31390a38268C6806a46569n2740D2964c40670d7650e108j11352d1242o8759
9770a10001R932b974k06067N2923j30610k8959m3789J67016A19977c12143Q6122
$$ plain form
9759 -226021 -62225 199514 -283834 157420 94067 134218 -17212 -56282 -85348 -94097 -256568
9748 -256568 -95807 144843 -130570 117204 32196 -202045 29764 -135983 -233218 -181080 59518
9736 8494 6818 102539 4023 75160 157076 -293036 362908 -107307 -139885 -87077 -41577 -284420
9724 -284420 -156657 -322723 -47701 -334979 134404 -74843 -23518 66941 -183712 97356 -44285
9712 58247 -116258 -344173 -96940 -96990 -32354 -65281 -300292 101926 -78854 -6623 162431 35707
9699 116802 -55543 -245144 -9104 -74418 -239576 179844 -97408 -45207 -161378 29229 -201714
9687 90000 49 -227799 161784 -71932 -133258 48984 -347994 14491 -18038 -100649 109327 -120145
9674 -59641 -221269 -193432 239421 -322597 -11238 -211602 305086 -55539 -37702 -52554 17132
$$ packed form
9759b26021f2225A99514b83834A57420o3353M0151a7212l9070k9066q749j62471
9748b56568i5807A44843a30570A17204C2196b02045B9764a35983r7235N2138E9518
9736H494j676R5721D023P1137Q1916b93036C62908a07307l2578N2808d1577k42843
9724b84420J27763j66066d7701k87278A34404g4843b3518F6941a83712I7356d4285
9712E8247a16258k27915i6940n0c2354l2927k35011A01926g8854f623A62431C5707
9699A16802e5543j89601i104o5314j65158A79844i7408d5207j16171B9229b01714
9687I0000D9b27799A61784g1932o1326D8984c47994A4491a8038q2611A09327a20145
9674e9641j61628K7837B39421c22597a1238k00364C05086e5539J7837j4852A7132
$$ plain form
9662 26882 -383307 8746 -86545 -83172 20016 -47703 100860 -244580 102598 -209275 76386
9650 43212 -140863 157347 -206319 -133342 -210962 221919 8644 -96650 17156 -113952 -5763
9638 -47876 -107056 -115906 -50817 123809 46808 -421586 39302 -260704 62096 -146714 -112386
9627 -112386 -347503 111338 -279763 -199405 -196997 76761 143585 150907 138426 -84832 -257565
9616 -257565 -659731 250802 -243035 -286184 137747 68255 33934 -306294 -152037 151423
9605 -26377 -25468 -219034 -227303 185796 69128 45951 -308599 -5572 -63903 -40136 -161835 -171254
9593 -171254 -384396 -357776 77946 -18895 -57507 -79678 -245499 -213909 128554 -133203 71794
9581 -56820 -408985 52888 -257398 119216 -362890 108485 -192686 -229553 -136899 -31463 -346323
$$ packed form
9662B6882c83307H746h6545L373B0016d7703A00860b44580A02598b09275G6386
9650D3212a40863A57347b06319P2977p7620B21919H644i6650A7156a13952e763
9638d7876n9180q850e0817A23809D6808d21586C9302b60704F2096a46714L4328
9627a12386k35117A11338b79763Q0358K408G6761O6824P322j2481h4832j72733
9616b57565m02166B50802b43035m3149A37747F8255C3934c06294a52037A51423
9605b6377R09j93566q269A85796F9128k3177c08599e572n8331K3767j21699r419
9593a71254k13142K6620G7946a8895l8612k2171j65821L1590A28554a33203G1794
9581e6820l52165E2888b57398A19216c62890A08485a92686l6867R2654c1463l14860
$$ plain form
9570 -346323 -49814 -146291 -303151 -504701 -187930 73141 210015 87227 75857 -65174 -77561
9559 -77561 42622 -280455 24331 137937 132555 214354 -106613 -414486 39753 -29656 -150567
9548 -150567 -183353 -100656 -396473 -141119 261271 -255029 -155283 -143854 -293508 -259563 -244616
9537 -244616 -307643 -22324 -315361 -215548 154185 -6996 -224281 -151678 -67165 -324978 4762
9525 -230299 -242925 -111553 36251 -20004 -205728 -329567 38048 -116723 282120 -188293
9514 -222758 93015 4287 -80132 -43770 -58018 -202551 -238569 71457 -93417 -127025 63469 -150731
9501 -133727 -196222 -266338 -284874 -148792 -88100 -317525 351773 7620 -98760 96987 -13777
9489 -137912 -44477 93262 -62205 309101 -43137 -225572 283733 -14842 32245 -22119 160145
$$ packed form
9570c46323d9814r6477j56860k01550a87930G3141J36874H7227j1370f5174j2387
9559g7561D2622b80455B4331J13606n382Q1799a06613l07873C9753b9656j20911
9548a50567l2786Q2697k95817a41119B61271b55029R9746J1429j49654L3945J4947
9537b44616o3027b2324k93037R9813A54185f996k17285P2603f7165k57813D762
9525b30299j2626a11553C6251b0004j85724j23839C8048a16723B82120a88293
9514b22758I3015D287h0132L6362j4248j44533l6018G1457i3417l3608F3469a50731
9501a33727o2495p0116j8536J36082O0692k29425C51773G620i8760I6987a3777
9489a37912d4477I3262f2205C09101d3137j82435B83733a4842C2245b2119A60145
$$ plain form
9477 -606615 -341144 -171956 -25492 -41046 -182498 -405895 -28165 -375348 -194659 160347
9466 -150780 -57487 -64187 -279317 128437 -201367 -34612 -94213 -216521 -116742 35935 74727
9455 74727 -248678 -26220 -146963 74578 58659 -166455 -392239 -340821 -163586 357930 -162802
9443 138837 -214165 -60983 -71526 -45626 71760 -311734 133242 218658 127897 113815 -147847
9431 285487 -207777 71139 38351 -115250 -209678 11615 72806 24452 -114511 29278 -37251
9419 -90666 94250 76121 -320880 26599 -358142 -167814 -269326 162990 119985 -329380 -174811
9408 -174811 -8251 211016 -121688 -179907 -11550 231653 209919 -67136 156174 -13528 99738
9396 52134 -115408 -271860 -175134 -221669 10278 -191531 -15918 -260140 -124545 111110 -29060
$$ packed form
9477f06615K65471J69188b5492j5554j41452k23397b8165l47183J80689A60347
9466a50780e7487o700k15130A28437b01367c4612n9601j22308R9779C5935L8792
9455G4727b48678b6220j20743G4578j5919a66455k25784N1418a63586C57930a62802
9443A38837b14165f0983j0543K5900G1760c11734A33242Q5416r0761j4082a47847
9431B85487b07777G1139l2788a15250r4428A1615O1191B4452a14511B9278c7251
9419i0666I4250j8129c20880B6599c58142a67814j01512A62990m3005c29380J54569
9408a74811h251B11016a21688n8219a1550B31653k1734f7136A56174a3528I9738
9396E2134a15408j56452R6726m6535A0278a91531a5918k44222a24545A11110b9060
$$ plain form
9384 157373 -55431 283542 -69382 -159733 -69108 169746 207972 -224714 201228 -10728 -50919
9373 -50919 -180302 -71542 -50041 4253 104971 -56254 -94656 275683 -89524 198450 -143637
9361 -382187 7394 -267223 244178 68238 -91052 60125 155731 -122890 -242297 261159 -64726
9349 -147590 28017 131693 -133602 99442 -66614 94093 -304537 -65698 -255551 -76892 26835
9337 -9855 232008 -30921 -231711 -478218 -169795 -132483 -323826 -334007 -166010 -100730 -34020
9325 135837 -41807 15057 117458 102228 77164 -98173 -204141 -15841 103255 -181775 5501
9313 -8847 -68065 -192888 154030 -146729 -187837 -301402 -231541 128520 -113255 -241853 -251745
9302 -251745 -230473 -123010 -289793 -97133 51984 20635 -97837 -35287 98650 -105893 48870
$$ packed form
9384A57373e5431B83542f9382r0351f9108A69746L8226b24714B01228a0728m0191
9373e0919j29383g1542K1501D253J00718e6254l8402B75683h9524A98450a43637
9361c82187G394b67223B44178F8238i1052F0125R5606a22890j19407B61159f4726
9349a47590B8017J03676a33602I9442f6614I4093c04537f5698j89853g6892B6835
9337i855B32008c0921k00790k46507a69795L7312j91343j0181a66010O5280c4020
9325A35837d1807A5057J02401j5230k5064i8173j05968a5841A03255a81775E501
9313h847n9218j24823A54030a46729m1108j13565O9861A28520a13255j28598r892
9302b51745K1272J07463j66783i7133E1984B0635i7837c5287I8650a05893D8870
$$ plain form
9290 -224080 -7801 -273822 97685 222557 -6491 9464 -246044 282959 -402352 4582 68246
9279 68246 10075 -183077 39165 -210602 -190421 -170563 11135 -136987 188760 -84088 -35553
9267 -154184 14380 10009 -252562 187042 -248124 56943 19706 -26660 -257968 -126521 -136246
9256 -136246 -105260 84853 77764 -57948 -216896 -146070 -239014 -23907 -226760 137400 -48177
9244 -206677 -14728 1085 -186858 -327019 29553 -120102 -75257 -169622 -166138 82065 39146
9232 -41938 -404949 12558 -395127 -74193 -84853 -37778 -25228 160704 -148122 -14910 17861
9220 -106935 -45696 -31465 -314351 -85807 -133776 53065 35056 254861 -171191 -219791 -113373
9209 -113373 10977 130084 160991 -26976 -330805 196069 -61064 -3615 42396 73708 278214
$$ packed form
9290b24080g801k66021I7685J24872f491I464b46044B82959d02352D582O3664
9279F8246A0075a83077C9165b10602K0181J9858A1135a36987A88760h4088c5553
9267a54184A4380m371b52562A87042b48124E6943A9706b6660k31308a26521r725
9256a36246L0986H4853p089e7948j58948P0826r2944b3907k02853A37400d8177
9244b06677a4728A085a86858j40161B9553a20102M4845r4365L484H2065C9146
9232d1938l63011A2558c95127g4193j0660c7778J2550A60704a48122a4910A7861
9220a06935d5696J4231k82886h5807m7969E3065j8009K19805a71191m8600J06418
9209a13373A0977J19107L0907b6976l03829A96069f1064c615D2396L1312K04506
$$ plain form
9198 278214 -189930 -209486 -67315 406197 39066 17853 133873 -458423 122030 -92123 2039
9186 -55946 -203929 128210 -327891 -220362 -69875 59283 -71060 31315 -29530 73501 8008
9174 -40947 43295 73857 -21652 77340 -82309 204973 -201248 79764 -386771 289906 58976
9162 221587 -22109 236 -140278 8981 -98515 120760 189835 -224683 -94835 144343 128427
9151 128427 290820 73593 -220711 -224117 9111 101839 89831 91659 -78161 -440520 51914 -137135
9138 -322885 -141121 -76290 -46815 20999 -109779 -224342 -316595 -290638 -472189 -506944 -218612
9126 -156375 -123967 -32530 -103088 85016 -301827 67684 -135078 227454 -326830 -3347 -571498
9115 -571498 -111626 -6003 -89370 -27901 -258279 153261 -34312 -498154 -240879 -292696 -52593
$$ packed form
9198B78214a89930j9556f7315D06197C9066A7853J16020d58423A22030i2123B039
9186e5946j47983A28210c27891J07529f9875E9283g1060C1315b9530G3501H008
9174d0947D3295L0562b1652G7340h2309B04973b01248G9764c86771B89906E8976
9162B21587b2109B36a40278H981i8515A20760O9075b24683i4835A44343j5916
9151A28427J62393G3593b20711l406I111R2728j2008J828g8161l62359E1914a37135
9138c22885a41121O4831K9475B0999a09779j14563r2253K5957j81551l4755b18612
9126a56375L2408c2530p0558H5016c01827F7684a35078B27454c26830c347n68151
9115e71498a11626f003q3367b7901k30378A53261c4312m63842b40879n1817e2593
$$ plain form
9103 26892 -6360 -309529 115848 176946 126670 -84960 208531 -355100 52418 -57222 -64434
9092 -64434 -47915 -193096 -97028 -72604 -3427 -34246 -64677 56014 219071 -181167 110624
9080 -7733 -70612 -62928 -377860 146045 57978 -80061 -160955 17518 -181156 -194518 70530 -198776
9067 188640 121541 6604 172216 93991 -245986 -139585 -57045 -342234 58238 -374112 -82919
9055 48746 -46855 -259709 -143834 -149360 -53416 -420317 240512 27628 132847 -25319 52120
9043 -52513 -136268 414200 257019 101495 124760 -502681 274538 7562 2318 -77735 -148372
9032 -148372 92939 -356140 -425205 229284 89057 -195271 -93348 5032 -38617 -121644 -151136
9021 -151136 -204796 67676 -146960 -113446 -58147 168419 -100665 -249056 -226595 66640 23574
$$ packed form
9103B6892f360l03169A15848O1098n0276h4960B08531c55100E2418e7222p212
9092f4434J6519j45181R6068K4424c427l0819l0431E6014J63057a81167A10624
9080g733o2879P684l14932A46045E7978h0061q0894A7518a81156j3362G0530a98776
9067A88640o7099F604J65612p8225b45986J06401e7045k85189E8238c74112h2919
9055D8746d6855k12854J15875n526e3416l66901B40512B7628J05219b5319E2120
9043e2513q3755D14200j57181A01495K3265e02681B74538G562B318g7735p0637
9032a48372I2939c56140o9065B29284H9057a95271i3348E032c8617q3027k9492
9021a51136n3660F7676a46960L3514N5299A68419a00665j48391K2461F6640B3574
$$ plain form
9009 -170629 -42802 -352487 -114467 233643 269911 -179936 -29853 59040 138405 87454 -50483
8997 -244678 368679 65460 43926 171287 -262515 -248142 -107287 42450 28479 130016 -43338
8985 93464 -117592 -101119 -77721 225057 -5874 -30833 211307 -260773 -282510 -105739 71052
8973 -85355 33835 50349 -277194 98025 166644 -84903 343772 152017 109981 267988 148906
8962 148906 91336 -219861 194714 349362 -327947 -388203 -268337 -199183 194356 -285402
8951 86608 192302 -22961 -12850 -28484 -226923 -71971 67254 131749 125967 30354 111829 219821
8939 219821 187401 -256398 -159640 -7686 151960 519747 194501 208939 205226 81965 -156644
8927 88355 342221 262982 401329 1065399 1573161 4982227 17980440 13070567 3449220
$$ packed form
9009a70629d2802l09685a14467B33643L6268a79936b9853E9040P9365n0951e0483
8997b44678C68679F5460k1534J27361b62515J4373a07287D2450j3971J01537d3338
8985I3464a17592J6473K3398B25057e874k4959B11307b60773k1737a05739G1052
8973h5355C3835J6514b77194I8025O8619h4903C43772A52017m2036J58007j19082
8962A48906n7570b19861A94714J54648c27947o0256J19866O9154A94356b85402
8951H6608J05694b2961J0111j5634j98439g1971F7254O4495n782C0354Q1475J07992
8939B19821l2420b56398R6758g686A51960L67787A94501J4438l713H1965a56644
8927H8355K53866p9239J38347O64070N07762L409066J2998213m909873C449220
$$ plain form
8917 1193691 586912 430299 159254 -26857 143244 -212817 172573 112149 229834 282496
8907 282496 582898 -134094 -116050 -254741 -120740 -338774 241443 318146 32256 169061
8897 169061 101783 -165932 -159071 2807 -126933 72673 -130919 -10431 118691 -132480 -131993
8886 -131993 -247236 40951 -47666 251865 72328 -140903 -232482 -152275 -66580 131896 -176858
8874 52700 -49939 -256099 201093 -120444 -65400 97055 -259521 305272 318678 -215776 -207873
$$ packed form
8917A193691E86912j56613A59254b6857A43244b12817A72573o0424J17685N2662
8907B82496L00402a34094J8044j38691a20740k18034B41443P6703C2256J36805
8897A69061o7278a65932O861B807a26933G2673a30919a0431A18691a32480M87
8886a31993j15243D0951d7666B51865G2328a40903r1579Q0207f6580A31896a76858
8874E2700d9939k06160B01093a20444N5044I7055b59521C05272J3406b15776P903
$$ [...]
##END NTUPLES=NMR SPECTRUM
##END=
