
##TITLE=UV1242_M9_1261-1207_5_7241481_N8xrDJecqT
##JCAMPDX= 6.0         $$ Bruker NMR JCAMP-DX V2.0
##DATA TYPE= NMR SPECTRUM
##DATA CLASS= NTUPLES
##ORIGIN= BRUKER
##OWNER= Administrator
$$ 1.72 TOPSPIN		Version 2.1
$$ 2013-01-31 09:18:44.749 -0500  Administrator@X
$$ Compression mode = diff/dup
##.OBSERVE FREQUENCY= 400.02188249412
##.OBSERVE NUCLEUS= ^1H
##.ACQUISITION MODE= SIMULTANEOUS (DQD)
##.ACQUISITION SCHEME= undefined
##.AVERAGES= 64
##.DIGITISER RES= 22
##SPECTROMETER/DATA SYSTEM= spect
##.PULSE SEQUENCE= noesygpps1d.comp
##.SOLVENT NAME= COFFEE_meoh
##.SHIFT REFERENCE= INTERNAL, COFFEE_meoh, 1, 14.96105
##AUDIT TRAIL= $$ (NUMBER, WHEN, WHO, WHERE, PROCESS, VERSION, WHAT)
$$ ##TITLE= Audit trail, TOPSPIN		Version 2.1
$$ ##JCAMPDX= 5.01
$$ ##ORIGIN= Bruker BioSpin GmbH
$$ ##OWNER= Administrator
$$ $$ E:\/data/COFFEE/nmr/UV1242_M9_1261-1207_5_7241481_N8xrDJecqT/22/pdata/1/auditp.txt
$$ ##AUDIT TRAIL=  $$ (NUMBER, WHEN, WHO, WHERE, PROCESS, VERSION, WHAT)
(   1,<2013-01-19 02:37:54.880 -0500>,<Administrator>,<X>,<go>,<TOPSPIN 2.1>,
      <created by zg
	started at 2013-01-19 02:26:24.443 -0500,
	POWCHK enabled, PULCHK disabled,
       configuration hash MD5:
       86 BA 57 50 F2 9D 5C 9B 26 00 A9 28 5F 66 2E 89
       data hash MD5: 64K
       FD 74 46 4F 60 FD E5 F6 5C 45 78 8D DD C6 23 93>)
(   2,<2013-01-19 02:37:57.927 -0500>,<Administrator>,<X>,<proc1d>,<TOPSPIN 2.1>,
      <Start of raw data processing
       efp LB = 0.3 FT_mod = 6 PKNL = 1 PHC0 = 0 PHC1 = 0 SI = 128K 
       data hash MD5: 128K
       7E F0 28 3E 39 E9 A7 6E 1B 88 FF 61 CA C6 6B 70>)
(   3,<2013-01-19 02:37:58.959 -0500>,<Administrator>,<X>,<proc1d>,<TOPSPIN 2.1>,
      <pk PHC0 = -80.9198 PHC1 = 0 
       data hash MD5: 128K
       03 FF E3 89 DF 7B 32 FB DC AB C2 84 96 A6 E6 38>)
(   4,<2013-01-19 02:37:59.662 -0500>,<Administrator>,<X>,<proc1d>,<TOPSPIN 2.1>,
      <abs ABSG = 1 
       data hash MD5: 128K
       C2 08 0D 56 84 D3 17 A3 94 C5 B5 0F 70 8B 14 D5>)
(   5,<2013-01-19 02:37:59.834 -0500>,<Administrator>,<X>,<proc1d>,<TOPSPIN 2.1>,
      <abs ABSG = 2 
       data hash MD5: 128K
       F4 92 16 47 E2 CA 32 7C D4 CC EB BD DE C9 1F DA>)
(   6,<2013-01-19 02:37:59.990 -0500>,<Administrator>,<X>,<proc1d>,<TOPSPIN 2.1>,
      <abs ABSG = 3 
       data hash MD5: 128K
       1B 61 14 22 4C 71 B3 1E 47 08 E8 A4 6E 9A D3 D3>)
(   7,<2013-01-19 02:38:00.177 -0500>,<Administrator>,<X>,<proc1d>,<TOPSPIN 2.1>,
      <abs ABSG = 4 
       data hash MD5: 128K
       F8 2F D2 47 62 A4 33 41 66 6B F4 E2 39 FF 6E B6>)
(   8,<2013-01-19 02:38:00.365 -0500>,<Administrator>,<X>,<proc1d>,<TOPSPIN 2.1>,
      <abs ABSG = 5 
       data hash MD5: 128K
       72 43 7D 60 24 20 5E 4C 46 A5 01 C8 FB B3 12 E5>)
(   9,<2013-01-19 02:38:06.865 -0500>,<Administrator>,<X>,<audit>,<TOPSPIN 2.1>,
      <user comment:
       ICON-NMR User ID: COFFEE
       data hash MD5: 128K
       72 43 7D 60 24 20 5E 4C 46 A5 01 C8 FB B3 12 E5>)
$$ ##END=
$$ 
$$ $$ hash MD5
$$ [...]
150 150 150 150 150 150 150 150
##$TP07= 0
##$TPNAME0= <>
##$TPNAME1= <>
##$TPNAME2= <>
##$TPNAME3= <>
##$TPNAME4= <>
##$TPNAME5= <>
##$TPNAME6= <>
##$TPNAME7= <>
##$TPOAL= (0..7)
0.5 0.5 0.5 0.5 0.5 0.5 0.5 0.5
##$TPOFFS= (0..7)
0 0 0 0 0 0 0 0
##$TUNHIN= 0
##$TUNHOUT= 0
##$TUNXOUT= 0
##$USERA1= <user>
##$USERA2= <user>
##$USERA3= <user>
##$USERA4= <user>
##$USERA5= <user>
##$V9= 5
##$VALIST= <valist>
##$VCLIST= <CCCCCCCCCCCCCCC>
##$VD= 0
##$VDLIST= <DDDDDDDDDDDDDDD>
##$VPLIST= <PPPPPPPPPPPPPPP>
##$VTLIST= <TTTTTTTTTTTTTTT>
##$WBST= 1024
##$WBSW= 4
##$XGAIN= (0..3)
0 0 0 0
##$XL= 0
##$YL= 0
##$YMAX_a= 6242843
##$YMIN_a= -13480205
##$ZGOPTNS= <>
##$ZL1= 120
##$ZL2= 120
##$ZL3= 120
##$ZL4= 120
##$ABSF1= 14.96105
##$ABSF2= -5.597132
##$ABSG= 5
##$ABSL= 3
##$ALPHA= 0
##$AQORDER= 0
##$ASSFAC= 0
##$ASSFACI= 0
##$ASSFACX= 0
##$ASSWID= 0
##$AUNMP= <proc_prof1d_extract.lims>
##$AXLEFT= 0
##$AXNAME= <>
##$AXNUC= <1H>
##$AXRIGHT= 0
##$AXTYPE= 0
##$AXUNIT= <>
##$AZFE= 0.1
##$AZFW= 0.1
##$BCFW= 0
##$BC_mod= 0
##$BYTORDP= 0
##$COROFFS= 0
##$CY= 15
##$DATMOD= 1
##$DC= 0
##$DFILT= <>
##$DTYPP= 0
##$F1P= 0
##$F2P= 0
##$FCOR= 0.5
##$FTSIZE= 131072
##$FT_mod= 6
##$GAMMA= 0
##$GB= 0
##$INTBC= 1
##$INTSCL= 1
##$ISEN= 128
##$LB= 0.3
##$LEV0= 0
##$LPBIN= 0
##$MAXI= 10000
##$MC2= 0
##$MEAN= 0
##$ME_mod= 0
##$MI= 0
##$NCOEF= 0
##$NC_proc= -2
##$NLEV= 6
##$NOISF1= 0
##$NOISF2= 0
##$NSP= 0
##$NTH_PI= 0
##$NZP= 0
##$OFFSET= 14.96105
##$PC= 1
##$PHC0= -80.9198
##$PHC1= 0
##$PH_mod= 1
##$PKNL= yes
##$PPARMOD= 0
##$PPDIAG= 0
##$PPIPTYP= 0
##$PPMPNUM= 2147483647
##$PPRESOL= 1
##$PSCAL= 4
##$PSIGN= 0
##$PYNMP= <proc.py>
##$REVERSE= no
##$SF= 400.020009615657
##$SI= 131072
##$SIGF1= 0
##$SIGF2= 0
##$SINO= 400
##$SIOLD= 131072
##$SPECTYP= <>
##$SREGLST= <1H.CDCl3>
##$SSB= 0
##$STSI= 131072
##$STSR= 0
##$SW_p= 8223.68421052631
##$SYMM= 0
##$S_DEV= 0
##$TDeff= 65536
##$TDoff= 0
##$TI= <>
##$TILT= no
##$TM1= 0
##$TM2= 0
##$TOPLEV= 0
##$USERP1= <user>
##$USERP2= <user>
##$USERP3= <user>
##$USERP4= <user>
##$USERP5= <user>
##$WDW= 1
##$XDIM= 131072
##$YMAX_p= 427426466
##$YMIN_p= -11296
##$CURPLOT= <Network HP LaserJet P1505>
##$CURPRIN= <$Network HP LaserJet P1505>
##$DFORMAT= <normdp>
##$LAYOUT= <+/1D_H.xwp>
##$LFORMAT= <normlp>
##$PFORMAT= <normpl>
##$SURQMSG= 1
$$ End of Bruker specific parameters
$$ ---------------------------------
##NTUPLES= NMR SPECTRUM
##VAR_NAME=  FREQUENCY,     SPECTRUM/REAL,   SPECTRUM/IMAG
##SYMBOL=    X,             R,               I
##VAR_TYPE=  INDEPENDENT,   DEPENDENT,       DEPENDENT
##VAR_FORM=  AFFN,          ASDF,            ASDF
##VAR_DIM=   131072,        131072,          131072
##UNITS=     HZ,            ARBITRARY UNITS, ARBITRARY UNITS
##FACTOR=    0.0627417313425164, 1,          1
##FIRST=     8223.62146879497, 1467,         -64074
##LAST=      0,             3153,            -63849
##MIN=       0,             -11296,          0
##MAX=       8223.62146879497, 427426466,    0
$$ Real data points
##PAGE= N=1
##DATA TABLE= (X++(R..R)), XYDATA
$$ [...]
67890 79915 79448 79319 79990 80967 81749 82579 83739 84656 84376 82812 80934 79700 79212 79036 78978 79233 79870 80501
67872 80501 80673 80450 80377 80865 81807 82900 83962 84720 84598 83237 81201 79711 79529 80362 81394 82117 82523
67855 82523 82786 83004 83157 83211 83253 83387 83428 82926 81783 80656 80256 80296 79689 77922 75746 74228 73576 73234 72779
67836 72779 72274 71929 71883 72317 73397 75039 76896 78647 80112 81141 81630 81750 82058 83149 85169 87693
67820 87693 90166 92409 94611 96829 98761 100086 100818 101145 101111 100728 100193 99617 98651 96767 93979 90931
67804 90931 88230 85993 84084 82463 81188 80297 79741 79302 78684 77929 77517 77600 77349 75758 73122 70965 70329
67787 70329 70799 71473 72079 72670 72981 72837 72701 73040 73475 73252 72346 71378 70619 69820 68950 68381 68238 68171 67968
67768 67968 67908 68346 69315 70607 71874 72682 72904 73121 74107 75821 77426 78424 79234 80349 81488 82029 81891
67751 81891 81543 81332 81285 81384 81580 81563 80945 79821 78884 78815 79621 80663 81298 81438 81443 81514 81403 80847 80095 79622 79356
67730 79356 78641 77115 75222 73597 72328 71189 70325 70117 70436 70554 69955 68856 67766 66849 65990 65268 65000
67713 65000 65307 65818 65890 65145 63842 62778 62699 63723 65300 66732 67620 67852 67438 66556 65611 64988 64739 64687
67695 64687 64826 65357 66265 67093 67265 66562 65186 63556 62207 61699 62317 63739 65201 66120 66525 66826 67232
67678 67232 67526 67430 67035 66703 66589 66487 66313 66438 67203 68224 68738 68688 68913 69903 70895 70800 69753 69070 69690
67659 69690 71254 72771 73586 73570 72993 72538 72949 74160 75139 74987 73944 72908 72318 72005 71882 72047 72225 71810
67641 71810 70686 69518 68921 68719 68351 67712 67185 66973 66806 66366 65745 65352 65468 66022 66784 67685 68837 70262
67623 70262 71720 72932 73852 74583 75122 75411 75624 76130 77089 78252 79252 79960 80490 81033 81746 82600 83253 83274
67605 83274 82671 81980 81697 81794 81939 81879 81342 79897 77506 75097 73898 74020 74166 73045 70742 68434 67103
67588 67103 66809 66893 66540 65362 63834 62943 63078 63493 63262 62481 61936 61800 61418 60428 59371 58951 59275 60112
67570 60112 61311 62621 63585 64005 64131 64088 63626 62854 62609 63457 64730 65258 64825 64176 63811 63543 63176 62830
67552 62830 62488 61923 61281 61113 61594 62221 62531 62679 63072 63818 64781 65772 66487 66601 66126 65398 64631 63848 63282
67533 63282 63307 63796 64097 63917 63721 63893 64013 63466 62422 61653 61553 61754 61604 60715 59187 57564 56421 55770
67515 55770 55132 54323 53856 54237 55223 56161 56738 57040 57178 57367 58068 59456 60887 61457 61069 60461 60210 60230 60229
67496 60229 60122 59870 59417 59003 59140 59976 60979 61501 61487 61403 61597 61976 62304 62571 63005 63737 64644 65543 66388
67477 66388 67094 67276 66546 65130 63834 63206 62973 62514 61601 60453 59352 58553 58368 58948 60022 61095 61847
67460 61847 62216 62296 62315 62486 62664 62461 61881 61544 61897 62534 62761 62546 62463 62847 63547 64313 64926 65051 64515 63689
67440 63689 63131 62872 62573 62294 62511 63289 64044 64324 64365 64642 65238 65834 66044 65621 64624 63544 62962 62961 63087 62917
67420 62917 62454 61992 61863 62240 62838 62892 61891 60363 59481 59777 60678 61345 61481 61141 60305 59005 57596 56533
67402 56533 55976 55744 55506 54987 54217 53650 53783 54606 55654 56554 57227 57649 57838 58083 58667 59296 59329 58717 58237
67383 58237 58557 59489 60382 60808 60642 59929 59085 58858 59619 60867 61732 61854 61574 61419 61590 61814 61569 60662 59574
67364 59574 59029 59180 59612 60040 60470 60637 60013 58728 57815 58032 58872 59266 58863 58103 57377 56754 56352 56364 56701
67345 56701 57055 57358 57836 58604 59511 60374 61086 61447 61128 59907 57979 56033 54909 54915 55492 55831 55803 55929 56544
67326 56544 57562 59093 61491 64431 66718 67563 67470 67291 67043 66416 65884 66242 67262 67846 67521 66847 66235
67309 66235 65246 63481 61455 60085 59725 60121 60991 62180 63443 64434 64952 65075 65065 65149 65317 65367 65221 65146 65502
67290 65502 66346 67449 68589 69625 70350 70573 70322 69863 69541 69708 70576 71911 73052 73470 73192 72516 71602
67273 71602 70633 70013 69925 69879 69244 68146 67391 67562 68594 70103 71639 72686 72967 72762 72506 72086 71099 69746
67255 69746 68878 68965 69591 70144 70497 70800 71098 71422 71879 72355 72505 72268 72051 72176 72483 72690 72753 72585 71832 70341
67235 70341 68584 67171 66099 64901 63527 62708 63329 65545 68520 71052 72522 73257 73893 74563 74970 75151
67219 75151 75695 77033 78847 80337 80809 80046 78516 77348 77509 78723 79609 79253 78137 77222 76663 76100 75714
67202 75714 76108 77187 78011 77927 77274 76705 76404 76269 76415 77052 78074 79177 80226 81208 81923 82081 81751 81449
67184 81449 81617 82173 82728 83110 83505 84064 84598 84835 84914 85413 86753 88625 90120 90523 89993 89366 89264 89446
67166 89446 89215 88412 87704 87828 88844 90336 91978 93502 94321 93854 92318 90770 90159 90632 91792 93191
67150 93191 94446 95269 95722 96137 96596 96808 96710 96700 96934 96886 96132 95289 95416 96630 97999 98855 99522 100536 101763
67131 101763 102714 103316 103875 104461 104802 104808 104814 105214 106022 106902 107516 107781 107888 108158 108854 109995 111195 111731 111034
67112 111034 109353 107863 107854 109688 112583 115344 117208 118080 118293 118310 118487 118891 119315 119538 119545 119505 119611 119954 120401
67093 120401 120637 120474 120202 120380 121188 122230 123174 124345 126283 128825 131027 132087 132037 131478 131017 131158 132287
67076 132287 134264 136228 137291 137573 138130 139744 142057 144031 145011 145118 144916 144994 145768 147300 149256 151216
67060 151216 153084 155024 157009 158666 159648 160028 160244 160720 161583 162646 163613 164339 164951 165708 166820 168419
67044 168419 170574 173122 175583 177506 178916 180197 181441 182268 182494 182732 183956 186466 189541 192120 193624
67029 193624 194165 194342 194927 196468 198855 201437 203786 206238 209354 212943 216083 218295 220296 223223 227297
67014 227297 231635 235277 238000 240113 241923 243653 245573 247910 250703 253892 257422 261087 264548 267766
67000 267766 271239 275403 279830 283468 285826 287645 290175 293957 298493 302981 307086 311020 315098 319358
66986 319358 323564 327469 331125 334970 339542 344930 350545 355678 360367 365417 371357 377656 383427 388687
66972 388687 394278 400536 406763 412351 417764 423805 430394 436842 443037 449576 456742 464116 471367 478766
66958 478766 486675 495036 503704 512775 522228 531586 540374 548757 557444 567086 577910 589664 601707
66945 601707 613415 624795 636480 648935 661997 675419 689409 704093 718786 732618 745873
66934 745873 759984 775917 793094 810338 827467 845351 864499 884182 903234 921439 939829
66923 939829 959576 980839 1002804 1024753 1046844 1069792 1093997 1119196 1144886 1170844 1197140
66912 1197140 1223875 1251086 1278865 1307366 1336643 1366581 1397066 1428122 1459817 1492122 1524963
66901 1524963 1558366 1592403 1627046 1662208 1697862 1733936 1770182 1806440 1843021 1880331 1918021
66890 1918021 1955013 1990749 2025889 2061229 2096276 2129734 2161269 2192018 2223166 2254766 2286153
66879 2286153 2316776 2346045 2372949 2396620 2417238 2435896 2453548 2470266 2485367 2498036 2508006
66868 2508006 2515845 2522319 2527252 2529316 2527303 2521345 2512518 2501568 2488546 2473498 2456821 2438842 2419482
66855 2419482 2398424 2375287 2349681 2321561 2291574 2260659 2229226 2197074 2164111 2130571 2096387
66844 2096387 2060992 2024181 1986783 1949980 1914138 1878684 1842991 1806956 1770793 1734662 1698680
66833 1698680 1663068 1628117 1593995 1560560 1527385 1494106 1460877 1428359 1397091 1366928 1337200
66822 1337200 1307384 1277540 1248202 1219936 1192894 1166651 1140592 1114619 1089371 1065589 1043350
66811 1043350 1022082 1001149 980167 958918 937424 916138 895728 876457 858007 840021 822517
66800 822517 805639 789261 773135 757234 741685 726502 711627 697131 683073 669220 655241
66789 655241 641202 627626 615035 603671 593622 584863 576989 569183 560682 551197 540909 530301
66777 530301 520030 510538 501508 492040 481743 471486 462657 455734 449902 444027 437574 430632 423495
66764 423495 416474 409809 403513 397418 391468 385778 380290 374627 368500 362085 355834 350056 344889 340518
66750 340518 337044 334131 331096 327444 323228 318793 314415 310253 306437 302963 299546 295863 291962 288272
66736 288272 285130 282418 279756 276889 273809 270620 267463 264443 261456 258204 254610 251093 248154 245716
66722 245716 243256 240623 238236 236295 234244 231400 227899 224631 222313 220872 219655 217999 215627 212694
66708 212694 209458 205969 202229 198632 195830 194039 192869 191983 191396 190826 189399 186662 183463 181104 179909
66693 179909 179256 178674 178063 177048 175158 172745 170799 169678 168781 167637 166437 165199 163313 160442 157168
66678 157168 154257 151891 150091 149169 149090 148980 148005 146395 144969 144005 143180 142269 141251 139980 138398 136834
66662 136834 135550 134236 132540 130799 129592 128821 128000 127280 127340 128184 128822 128395 127060 125607 124680 124569 125235
66645 125235 126192 126652 126072 124524 122575 120993 120428 121021 122257 123420 124119 124226 123580 122206 120582 119193
66629 119193 117923 116403 114837 113825 113385 112816 111645 110150 108782 107651 106810 106482 106655 106903 106929 106920 107030
66612 107030 106883 105997 104475 102930 101842 101254 100968 100814 100769 100885 101038 100833 100054 99165 98884 99210 99334 98733
66594 98733 97846 97349 97261 97249 97364 97786 98095 97572 96327 95390 95368 95541 94766 92973 91228 90413 90416 90686 91060 91646
66574 91646 92192 92141 91353 90364 89806 89829 90179 90532 90582 90106 89216 88313 87580 86742 85532 84119 82772 81434 80029
66555 80029 78980 78867 79651 80698 81593 82476 83579 84813 85911 86619 86745 86266 85438 84482 83260 81625 79996
66538 79996 79137 79291 79937 80473 80748 80903 81079 81402 81871 82149 81788 80781 79562 78497 77673 77187 77138 77307
66520 77307 77285 76996 76678 76342 75816 75342 75437 75992 76186 75630 74935 74779 75011 75172 75312 75639 75810 75297 74276
66501 74276 73528 73499 73914 74294 74477 74627 74989 75569 75958 75652 74652 73463 72388 71276 70143 69484 69527 69726
66483 69726 69526 69191 69268 69651 69895 70099 70665 71339 71365 70664 70055 70162 70770 71481 72364 73588 74938 76024 76655
66464 76655 76711 76018 74674 73257 72420 72389 72990 73941 74934 75693 76118 76282 76181 75705 74965 74365 74157 74172 74176 74288
66444 74288 74735 75358 75711 75667 75615 75968 76666 77269 77415 77047 76305 75400 74592 74079 73764 73236 72203 70894 69846
66425 69846 69284 68941 68555 68235 68191 68342 68515 68821 69457 70139 70142 69115 67631 66714 66902 67945 69324 70768
66407 70768 72205 73457 74302 74800 75228 75553 75293 74192 72826 72104 72164 72190 71435 70033 68651 67693 67162 67003
66389 67003 67200 67618 68099 68669 69441 70300 70883 70938 70595 70292 70523 71555 73215 74909 75946 75985 75241 74249
66371 74249 73347 72373 71020 69490 68484 68333 68455 68101 67370 66944 66972 66897 66436 65963 65720 65378 64756 64336 64542
66352 64542 65066 65463 65945 66937 68211 69149 69632 70000 70269 70066 69316 68462 67928 67803 68027 68445 68717 68578 68212
66333 68212 67960 67726 67116 66145 65362 65222 65736 66778 68319 70200 71996 73259 73779 73677 73436 73658 74458
66316 74458 75239 75422 75205 75163 75274 74998 74307 73923 74302 74915 74871 73926 72607 71624 71344 71636 72006 72039 71782 71552
66296 71552 71441 71316 71265 71608 72353 72994 72999 72299 71235 70286 69850 69965 70151 69828 68902 67733 66662 65984 66247
66277 66247 67858 70189 71723 71518 70178 69067 68855 69201 69547 69765 70056 70523 70954 70939 70289 69339 68759 69055
66259 69055 70320 72283 74383 75952 76673 76820 76754 76323 75154 73418 71775 70681 70263 70754 72301 74261
66243 74261 75489 75563 75067 74488 73608 72323 71203 70675 70382 69927 69600 69667 69610 68945 68286 68585 69658 70486 70785
66224 70785 71226 72069 72672 72638 72549 73113 74229 75373 76378 77345 78169 78623 78714 78583 78214 77518 76565 75504 74406
66205 74406 73382 72712 72653 73183 74050 75005 75870 76527 76921 77000 76642 75834 75006 74892 75842 77373 78561 78844 78366
66186 78366 77671 77225 77132 77131 76914 76513 76345 76762 77603 78304 78386 77812 76966 76385 76422 76947 77446 77590 77702 78406 79793
66165 79793 81238 82176 82782 83549 84416 84718 84026 82641 81171 79983 79203 78898 78940 78998 78988 79354 80471 81917
66147 81917 82755 82533 81653 80734 80022 79550 79459 79907 80825 81947 82961 83567 83603 83271 83056 83317 84003 84805 85428
66128 85428 85745 85872 86113 86630 87175 87378 87256 87173 87346 87778 88568 89796 91016 91513 91265 91061 91294 91324 90623
66109 90623 89951 90481 92001 92968 92447 91194 90482 90543 90673 90407 90000 89817 89806 89757 89824 90490 91945 93643 94672
66090 94672 94621 93905 93140 92409 91441 90360 89817 90253 91318 92240 92637 92728 92868 93151 93529 94088 94971 96076 97027
66071 97027 97509 97533 97307 97030 96894 97076 97552 98038 98378 98791 99393 99602 98627 96656 95040 94936 96096 97310
66053 97310 97784 97672 97509 97527 97581 97453 97167 97092 97603 98555 99324 99548 99584 99946 100565 101035 101410 102197 103528 104840
66033 104840 105585 105870 106139 106484 106666 106727 107189 108468 110263 111772 112541 112877 113303 113875 114287 114501 114844 115453
66015 115453 116031 116349 116601 117063 117731 118522 119537 120763 121788 122210 122205 122370 123136 124635 126938 129971 133295
65998 133295 136397 139209 142041 145016 148006 151110 154744 159053 163570 167699 171344 174776 177984 180415
65984 180415 181502 181334 180617 179899 179046 177685 175934 174220 172417 169826 166279 162641 159822 157735 155735
65969 155735 153615 151526 149291 146660 144013 141981 140359 138288 135599 133123 131418 130026 128447 127064
65955 127064 126445 126288 125884 125351 125651 127356 129952 132450 134286 135528 136623 138115 140360 143287 146500
65940 146500 149719 153001 156403 159507 161565 162329 162563 163364 164885 166127 166259 165795 165996 167334 169135 170697
65924 170697 172121 173781 175598 177253 178801 180610 182861 185454 188314 191494 194992 198698 202512 206392
65910 206392 210296 214170 217964 221577 224854 227687 230039 231831 232988 233653 234222 235002 235915 236573 236613 236013
65894 236013 235220 234900 235310 235838 235360 233096 229008 223519 217236 210979 205578 201311 197686 193955 189682
65879 189682 184809 179550 174436 170134 166879 164248 161689 159070 156509 154026 151722 149988 149041 148455 147645
65864 147645 146759 146527 147123 147734 147526 146653 145927 145753 145809 145699 145430 145142 144718 143978 143102 142500 142311 142323 142456
65845 142456 142946 143847 144677 144968 144978 145446 146659 148175 149443 150272 150598 150294 149490 148787 148814 149780 151628 154318
65827 154318 157679 161268 164746 168318 172431 177096 181813 186135 190111 194094 198329 202745 207028 210901
65813 210901 214340 217439 219961 221246 220753 218635 215636 212468 209407 206325 202945 199123 195048 191102
65799 191102 187494 184168 181165 178813 177336 176455 175616 174533 173307 172177 171356 170993 171060 171406 172072 173307
65783 173307 175050 176751 178159 180013 183428 188676 195105 202165 209897 218373 227339 236670 246502 256486
65769 256486 265326 271628 275014 275999 275039 272184 267527 261463 254371 246362 237513 228226 219278 211590 205811
65754 205811 202022 199924 199404 200751 204100 208948 214621 221083 228866 238243 248998 261064 274781 290154
65740 290154 306308 322083 336832 350190 361383 369473 374240 376200 375597 371999 365175 355852 345144
65727 345144 333550 320985 307556 293688 279512 264688 249144 233632 219232 206471 195179
65716 195179 185122 176464 169485 164022 159444 155245 151474 148448 146144 144175 142335 140803 139688 138770
65702 138770 137905 137381 137426 137644 137483 137070 137018 137367 137436 136905 136475 136976 138277 139610 140649 141714 142966 144036
65684 144036 144676 145346 146800 149227 152098 154873 157596 160656 164158 167869 171808 176554 182756 190540 199639
65669 199639 209872 221145 233214 246004 260086 276219 294189 312637 330278 346901 362942
65658 362942 378524 393298 406780 418340 427125 432577 435039 435583 435276 434778 434339 433849 433083 432285 432299
65643 432299 433673 435833 437528 437986 437171 435087 431405 425794 418014 407567 393846 376975 358195 339104
65629 339104 320654 302937 285625 268441 251433 235051 219925 206520 195101 185859 178716 173026
65617 173026 167879 162866 158285 154501 151434 148744 146202 143646 140928 138162 135795 134184 133222 132574 132073
65602 132073 131696 131342 130872 130291 129722 129281 129080 129175 129427 129600 129705 129991 130503 130995 131466 132411 134165 136307
65584 136307 138161 139741 141674 144294 147328 150564 154404 159510 166230 174532 184269 195305 207536 220874
65570 220874 235139 250014 265342 281424 298567 316215 332950 347637 360212 370925 379164 383716
65558 383716 384108 381047 375357 367123 356277 343460 329645 315082 299302 282242 264765 247908
65546 247908 232066 217336 204209 193341 184700 177453 170897 165222 161170 159075 158381 158034 157270 156116
65532 156116 155188 154991 155438 156083 156676 157292 157944 158332 158060 156936 155012 152534 149879 147319 144715 141647
65516 141647 138039 134460 131584 129537 128048 127079 126878 127343 127786 127639 127200 127378 128708 130848 133012 134672
65500 134672 135709 136095 135807 135089 134562 134788 135692 136607 136970 136906 137047 137886 139433 141445 143802 146556 149700
65483 149700 153044 156352 159546 162659 165636 168275 170425 172158 173551 174395 174318 173333 172059 171149 170513 169346
65467 169346 166972 163529 159727 156085 152543 148777 144757 140908 137816 135797 134730 134206 133841 133461 133077
65452 133077 132721 132340 131828 131190 130615 130333 130354 130436 130433 130600 131317 132493 133493 133889 134117 135078 137093 139547 141627
65433 141627 143170 144638 146503 148865 151512 154117 156383 158205 159670 160840 161616 161924 161789 161017 159054
65418 159054 155641 151586 148398 146957 146847 147136 147376 147586 147676 147404 146833 146367 146283 146465 146579 146353 145755 145133
65400 145133 145049 145708 146663 147434 148310 150080 152968 156363 159738 163259 167132 170807 173407 174666 174925 174368
65384 174368 172932 170996 169459 168831 168689 168375 167845 167447 167190 166768 166105 165319 164206 162415 160326 159144
65368 159144 159672 161384 163161 164685 166559 169196 172247 175224 178127 181167 184281 187351 190677 194873
65354 194873 200390 207363 215762 225307 235289 244797 253226 260353 265965 269752 271672 272112 271527 270091 267852
65339 267852 264998 261696 257817 253094 247558 241538 235195 228343 220908 213397 206619 200904 195804 190669
65325 190669 185455 180839 177542 175605 174424 173424 172595 172273 172515 172929 173159 173262 173369 173174 172163 170342
65309 170342 168315 166441 164269 161170 157293 153491 150421 148061 146127 144548 143427 142878 143094 144339 146636
65294 146636 149594 152673 155587 158364 161138 163867 166158 167340 166988 165427 163509 161817 160333 158937
65280 158937 157863 157388 157357 157369 157318 157392 157589 157498 156683 155156 153474 152364 152122 152318 152265 151880 151822 152631 153988
65261 153988 155114 155669 155894 156046 156178 156437 157142 158468 160353 162786 165802 168997 171330 171801 170315 167749
65245 167749 165167 163045 161205 159339 157428 155582 153699 151623 149654 148468 148256 148239 147450 145874 144431
65230 144431 143974 144669 146247 148277 150090 150994 150964 150766 151056 151523 151275 149989 148325 147155 146622 146116 145111
65213 145111 143827 142987 143032 143784 144862 146121 147482 148617 149150 149130 149001 149143 149680 150676 152099 153525 154221
65196 154221 153744 152315 150534 148943 147892 147513 147671 148109 148767 149775 151075 152316 153308 154320 155744 157611
65180 157611 159641 161573 163238 164431 165017 165128 165064 164958 164650 163972 163035 162203 161804 161876 162200 162549 162847 163074
65162 163074 163145 163015 162841 162917 163481 164672 166466 168517 170196 171102 171471 171856 172536 173529 175002 177168 179866
65145 179866 182841 186582 192227 200265 209778 219425 228877 238806 249702 261224 272616 283294 292974
65132 292974 301666 309665 317352 324855 332028 338709 344747 349742 353078 354502 354567 354267 354132 353793 352531
65117 352531 350103 346785 342609 337001 329457 320361 310715 301113 291438 281542 271723 262273 252982 243473
65103 243473 233814 224476 215865 208144 201367 195469 190150 185060 180101 175466 171428 168218 165981 164674
65089 164674 164080 164056 164650 165813 167077 167789 167733 167390 167508 168340 169305 169532 168812 167863 167446 167469 167372 167200 167610
65070 167610 168696 169590 169589 169020 168494 167916 167030 166450 167127 168818 170095 170108 169571 169617 170324 170933 171076 171169 171675
65051 171675 172528 173334 173819 173936 173708 173072 171931 170350 168679 167347 166476 165817 165117 164368 163604 162622 161140
65034 161140 159255 157491 156297 155558 154739 153501 152056 150832 149901 148935 147687 146323 145158 144271 143561 143060
65018 143060 142930 143190 143665 144264 145119 146334 147708 148910 149892 150977 152500 154458 156641 159006 161709 164754
65002 164754 167846 170752 173596 176559 179480 182078 184477 187049 189686 191638 192314 192003 191532 191410 191487 191348
64986 191348 190902 190625 191286 193305 196371 199867 203572 207589 211615 214803 216615 217369 217640 217492 216657 215080
64970 215080 212844 209835 205999 201800 197899 194453 191134 187797 184710 182109 179898 177843 175831 173932
64956 173932 172449 171742 171670 171369 170027 167868 165931 164901 164595 164591 164806 165240 165613 165626 165335 164986 164636 164144
64938 164144 163432 162599 161837 161318 161093 161061 161106 161230 161452 161671 161836 162133 162659 163005 162584 161462 160444 160139 160292
64919 160292 160285 160025 159953 160339 160951 161437 161713 161863 161898 161842 161976 162744 164302 166326 168410 170555 173030 175833
64901 175833 178686 181581 184982 189203 193975 198898 204076 209948 216670 224006 231641 239241 246397 252951
64887 252951 259250 265647 271946 277866 283886 290842 298526 305358 309781 311505 311098 308888 304794 298938
64873 298938 291904 284357 276726 269263 262254 256137 251437 248459 246975 246316 245813 245086 244023 242705 241305
64858 241305 239767 237626 234434 230391 226166 222085 217899 213391 208741 204095 199294 194340 189759 186076
64844 186076 183189 180656 178431 176946 176493 176822 177351 177641 177653 177631 177673 177500 176811 175827 175164 175142 175548 176097 176712
64825 176712 177195 177203 176866 177008 178329 180656 183366 186209 189244 192306 195123 197813 200662 203521 206073 208756
64809 208756 212723 218592 225658 232759 239573 246649 254329 262105 269040 274457 278006 279393 278462 275566
64795 275566 271562 267182 262549 257428 251808 245984 240232 234723 229761 225718 222612 220042 217665 215528
64781 215528 213868 212954 213161 214726 217157 219284 220349 220814 221770 223774 226649 230153 234231 238648 242931
64766 242931 246891 250923 255600 261194 267638 274686 281923 288747 294614 299412 303628 308153 313726 320400
64752 320400 327498 334138 339843 344744 349384 354289 359460 364213 367719 369698 370205 368734 364203 356303
64738 356303 346296 335850 325350 314158 302348 291225 281894 274166 267393 261797 258233 256833 256550
64725 256550 256138 255197 254140 253426 253059 252760 252482 252631 253754 256120 259719 264570 270666 277550 284283 290153
64709 290153 295277 300218 305088 309276 312048 313057 312229 309475 304791 298512 291205 283316 275046 266546
64695 266546 258036 249763 241987 235071 229418 225206 222251 220138 218408 216657 214685 212708 211230 210553
64681 210553 210538 210989 212063 214036 216838 220147 223899 228326 233479 239186 245596 253340 262739 273018 282668
64666 282668 290536 296362 300310 302317 302073 299506 295171 290146 285545 281905 278818 275226 270386 264810
64652 264810 260039 257181 255737 254262 252139 250201 249461 249911 251036 252936 256140 260560 265434 270337 275555
64637 275555 281358 287631 294397 302094 310986 320764 331001 341545 352248 362798 373045 382923 391641
64624 391641 397553 399459 397759 393745 388008 380026 369288 356383 342909 330470 319611 309618 299502
64611 299502 289251 279805 271877 265370 260091 256193 253483 251028 248201 245560 243945 243144 242300 241288
64597 241288 240738 240874 241275 241753 242575 243770 245052 246607 249083 252576 256370 260051 264185 269523 276131
64582 276131 283722 292248 301635 311312 320570 329226 337596 345975 354354 362393 369403 374647 377951 379836
64568 379836 380786 380575 378575 374533 368816 361955 354153 345115 334336 321774 308379 295753 285072
64555 285072 276407 269084 262467 256284 250521 245293 240739 236930 233872 231604 230148 229443 229525 230713 233256
64540 233256 236806 240591 244161 247577 250880 253764 255910 257175 257260 255649 252210 247590 242773 238491 235156
64525 235156 232944 231620 230578 229401 228176 227129 226310 225881 226191 227167 228013 228039 227516 227216 227409 227892 228784
64508 228784 230550 233214 236168 238940 241677 244704 248024 251498 255157 259127 263521 268632 274902 282412
64494 282412 290566 298559 306030 312975 319055 323402 325354 325225 324053 322501 320261 316764 312327 308232
64480 308232 305589 304447 304188 304416 305050 305762 305860 304846 302741 299756 295965 291537 287053 283269 280507 278442
64464 278442 276517 274545 272964 272568 273905 276820 280531 284175 287266 289709 291500 292606 293064 293015 292512
64449 292512 291413 289624 287468 285637 284730 284887 285880 287376 289061 290752 292662 295435 299665 305310 311817
64434 311817 318839 326640 335749 346396 358439 371698 386283 402723 421867 444665 471991 504641
64422 504641 543371 588734 641048 700891 769713 849562 941784 1045834 1159212 1278187 1398548
64411 1398548 1516312 1628567 1733884 1831635 1920650 1998546 2062305 2109342 2138055 2147798 2138847
64400 2138847 2112475 2070707 2015448 1947522 1866620 1772473 1666350 1551569 1432635 1313848
64390 1313848 1198449 1088652 986146 892417 808572 734880 670707 615085 567318 526925 493134
64379 493134 464757 440627 419998 402523 388025 376310 366937 359140 352219 346036 340774 336133 331184
64366 331184 325283 318803 312606 307015 301687 296285 290781 285113 279067 272696 266579 261423 257527 254726
64352 254726 252737 251406 250748 250840 251735 253491 256305 260424 265728 271477 276769 281213 284809 287145 287254
64337 287254 284739 280701 276868 273799 270549 266273 261515 257436 254320 251617 249238 247881 247912 248739 249736
64322 249736 251119 253327 255997 258320 260187 262215 264644 266958 268739 270284 272041 273920 275471 276393
64308 276393 276519 275661 273801 271281 268441 265204 261240 256447 251029 245251 239360 233661 228452 223925 220249
64293 220249 217627 216081 215318 215000 215051 215515 216217 216845 217380 218191 219629 221678 224115 226896 230224 234141
64277 234141 238188 241709 244684 248093 253140 260066 267882 275301 281715 287294 292387 296985 300613 302670
64263 302670 303051 302401 301563 300783 299787 298645 298079 298711 300350 302242 303636 303910 302570 299602 295548 290776
64247 290776 284914 277485 268883 260210 252218 244948 238424 233094 229361 227113 225947 225586 225870 226571 227479
64232 227479 228528 229650 230574 230957 230688 230068 229711 230178 231463 232808 233257 232536 231262 230219 229661 229425 229389
64215 229389 229473 229328 228538 227222 226038 225363 224789 223780 222522 221567 220787 219452 217567 216388 216997 218833
64199 218833 220409 221247 222192 223817 225463 226329 226799 228013 230457 233652 237179 241491 247582 256035 266449
64184 266449 277759 289205 300985 313702 327096 339702 349920 357074 361169 362073 359471 353428 344583
64171 344583 333910 322581 311823 302325 293741 285172 276198 267236 258947 251660 245319 239688 234591
64158 234591 230171 226888 225006 224159 223654 223135 222657 222274 221990 222108 223184 225496 228812 232702 236808 240809
64142 240809 244495 248000 251659 255487 258977 261532 262957 263495 263526 263219 262311 260274 256961 253023 249439
64127 249439 246648 244426 242592 241406 241139 241621 242441 243398 244568 246108 248191 251042 254872 259779 265685
64112 265685 272324 279431 287124 295979 306407 317900 329172 339056 347056 353103 357308 360094 362172
64099 362172 364005 365537 366763 368366 371454 376594 383334 390636 397596 403734 408832 412677 414959 415364
64085 415364 413746 410273 405372 399501 392888 385559 377669 369709 362131 354832 347351 339674 332421 326026
64071 326026 320155 314365 308987 304754 301683 299072 296704 295386 295906 297882 300076 301575 302308 302584 302628
64056 302628 302630 302911 303729 304941 306049 306796 307693 309731 313443 318414 323878 329627 336065 343557 352105 361609
64040 361609 372100 383628 396198 409728 423826 437671 450487 462050 472309 480590 485829 487712
64028 487712 486949 484157 479142 471780 463096 454743 447609 441517 436163 431702 428308 425726 423494 421225
64014 421225 418453 414545 409179 402837 396435 390427 384466 378071 371384 365022 359310 353983 348706 343523
64000 343523 338600 333927 329652 326462 325062 325205 325734 325747 325357 325178 325543 326464 328014 330277 333074 336124
63984 336124 339451 343390 348191 353779 359858 366099 372266 378326 384436 390773 397445 404588 412421 421057
63970 421057 430402 440291 450648 461445 472769 484977 498519 513353 528794 544288 560222 577675
63958 577675 597432 619618 644189 671327 701255 734188 770872 812932 862223 919882 986375
63947 986375 1062527 1150188 1251722 1369065 1503365 1655056 1823759 2008199 2206793 2418511
63937 2418511 2642788 2878346 3122316 3370650 3618923 3862257 4094818 4310195 4502681
63928 4502681 4668060 4803284 4905931 4974144 5006628 5002348 4960504 4881239 4766407 4619411
63918 4619411 4444462 4246308 4030547 3803430 3570681 3336408 3103434 2874645 2653597
63909 2653597 2443664 2246959 2064485 1897048 1745388 1609489 1488421 1381189 1287278 1206080
63899 1206080 1136314 1076516 1025833 983811 949597 921797 898927 879538 862079 845241 828480
63888 828480 811762 794819 777162 758754 740123 721723 703732 686584 671161 658284 648413 641895
63876 641895 638884 638788 640521 643801 649776 659817 673950 690998 710047 731235 755142 781903 811071
63863 811071 841991 874025 906491 938710 970309 1001485 1032663 1063703 1093583 1121061 1145363
63852 1145363 1165964 1182093 1193176 1199650 1202610 1202450 1198502 1190155 1177607 1161153 1140410 1114889
63840 1114889 1084976 1051802 1016374 979263 940871 901541 861585 821585 782457 744840 708652
63829 708652 673700 640494 609980 582529 557627 534510 512751 492288 473263 455845 439967
63818 439967 425243 411379 398511 386862 376280 366485 357608 349965 343354 337098 330925 325312 320726
63805 320726 316949 313475 310294 307807 306023 304260 301802 298623 295272 292145 289105 285769 281941 277738
63791 277738 273528 269855 267146 265281 263649 261863 260174 258890 257684 255933 253559 251066 248874 247133
63777 247133 246040 245620 245255 244228 242867 242343 242997 243671 243177 241761 240547 240082 240050 239979 239566 238638 237400
63760 237400 236488 236227 236133 235614 234857 234432 234330 234102 233723 233607 233833 234045 234135 234398 234952 235539 236053 236758 237862
63741 237862 239232 240652 242053 243488 245184 247563 250821 254461 257643 260021 261950 263873 265921 268123
63727 268123 270655 273725 277463 281921 286911 291926 296527 300789 305042 309222 312901 315961 318780 321628
63713 321628 324237 326126 327088 327196 326557 325225 323244 320660 317574 314216 310937 308138 306190 305267 305152
63698 305152 305379 305660 306033 306543 307127 307956 309532 312124 315418 318940 322544 326150 329406 332020 334137 335958
63682 335958 337287 337923 338172 338497 338916 339279 339793 340651 341357 341183 340209 339288 338987 339155 339498 339958 340511 341146
63664 341146 342056 343353 344596 345143 344920 344313 343442 342092 340298 338265 335744 332180 327573 322574 317713
63649 317713 313169 309199 306036 303344 300622 298231 297065 297032 296912 296179 295976 297601 300812 304358 307577
63634 307577 310680 313875 317047 320169 323431 327020 331102 335838 341112 346513 351923 357896 365160 373955
63620 373955 384020 394937 406257 417757 429860 443458 459015 476241 494873 515245 537712
63609 537712 562025 587846 615464 645367 677342 710542 744222 777848 810602 841302 868756
63598 868756 891844 909466 920954 926609 927496 924760 919393 912470 905128 898108 891429 884372 875638 863799
63584 863799 848027 828400 805416 779544 751553 722912 695213 669173 644645 621590 600554
63573 600554 582043 565918 551749 539523 529616 522118 516580 512618 510482 510587 512518 515051 517471
63560 517471 520457 525145 531552 538566 545483 552846 561539 571721 583055 595579 609908 626768 646701
63547 646701 670078 697233 728744 765650 808918 858128 910589 961838 1007117 1042732 1066777
63536 1066777 1079184 1081230 1075033 1063435 1049749 1036680 1025246 1015156 1006163 998356 991063 982445
63524 982445 970700 955057 935218 910598 880905 847028 810646 773236 735982 700103 666425
63513 666425 634759 604512 575892 549895 527055 506819 488244 470882 454885 440614 428281
63502 428281 417698 408297 399574 391470 384238 378058 372959 368907 365711 362984 360418 358002 355873 354147
63488 354147 352961 352325 351802 350803 349419 348519 348708 349658 350789 352064 353716 355776 358460 362422 367782 373245
63472 373245 377115 379076 380303 381877 383733 385071 385145 383604 380663 376986 373035 368710 364050 359937 357295
63457 357295 355739 353882 351089 348177 346262 345585 345709 346193 346758 347323 348262 350304 353895 358912 365106 372447
63441 372447 380925 390339 400517 411464 423247 436080 450703 468374 490296 517099 548699 584202
63429 584202 621729 658623 692108 719957 740888 754794 762721 766555 768708 771862 778256 788756
63417 788756 803003 821001 844100 873759 909654 949707 991671 1033772 1073969 1109669 1138642
63406 1138642 1159725 1172720 1178331 1178279 1174590 1168404 1160022 1150153 1140167 1130713 1120769 1108501 1092515
63393 1092515 1071947 1046181 1015278 980338 942864 903910 864198 824673 786439 750291 716625
63382 716625 685646 657367 631632 608441 588153 571177 557608 547238 539698 534527 531365 530139
63370 530139 530790 532959 536403 541648 549537 559956 571741 584194 598081 614685 634382 656641 681019
63357 681019 707615 736753 768717 803701 841731 882599 925757 969886 1012643 1051485 1084900
63346 1084900 1112368 1133116 1145947 1150797 1149637 1145060 1138497 1130332 1121018 1111133 1100680 1089154 1075991
63333 1075991 1060314 1040665 1015938 986437 953331 917398 879219 840284 802759 768005 736206
63322 736206 707512 682557 661644 644468 631096 622251 617777 615380 611699 604432 593035 577802
63310 577802 559122 537733 515087 493029 473038 455684 440734 427775 416684 407417 399572 392538
63298 392538 386103 380478 375670 371259 366982 363097 359812 356729 353289 349577 346275 343848 342086 340392
63284 340392 338277 335666 332951 330722 329213 328095 326974 325949 325388 325248 325001 324290 323315 322477 321943 321699
63268 321699 321764 322140 322766 323748 325427 327981 331027 333939 336441 338656 340596 342088 343354 345288 348661
63253 348661 353169 357629 361234 364319 367762 371873 376199 380291 384274 388551 393305 398575 404659 411979
63239 411979 420472 429484 438525 447921 458483 470695 484482 499623 516015 533521 551910 571053
63227 571053 590956 611533 632510 653495 673942 693200 711080 728454 746762 766787 788233
63216 788233 810564 833573 856860 879439 900525 920243 938857 955567 968809 977627 982109 982505
63204 982505 978599 970089 957062 939954 919449 896496 872093 847049 822254 798977 778333 760514
63192 760514 745102 732103 722017 714974 710622 709040 710917 716530 725316 736869 751580 769684 790389
63179 790389 812633 836205 861334 887629 914312 941262 968966 997405 1025729 1053177 1079650
63168 1079650 1105230 1129626 1152324 1172878 1190835 1205598 1216507 1222836 1223668 1218088 1205667 1186617
63156 1186617 1161463 1130876 1095820 1057511 1016984 974861 931706 888500 846573 807122 770837
63145 770837 737897 708169 681463 657715 636963 619062 603416 589136 575690 563437 553253
63134 553253 545481 539405 533994 528963 524742 521523 518890 516516 514741 514109 514573 515552 516617 517919 519976
63119 519976 523227 527663 532791 538031 543209 548516 554003 559398 564470 569230 573597 577247 580047 582333
63105 582333 584434 586162 587109 587259 587035 586898 587133 587762 588389 588333 587272 585602 583911 582356 580859 579579
63089 579579 578663 577746 576299 574424 572788 571822 571488 571824 573016 574747 576183 576967 577782 579460 581938 584628
63073 584628 587545 591350 596290 601769 607257 613042 619651 626903 634211 641757 650629 661521 673854 686655
63059 686655 699971 714907 732481 752964 776186 801866 829625 859275 891291 926540 965330
63048 965330 1007083 1051040 1096796 1144087 1192608 1242250 1292958 1344117 1394717 1444444 1493967
63037 1493967 1543664 1592787 1640568 1687524 1734813 1782636 1830146 1876606 1921636 1964320 2003003
63026 2003003 2036151 2062666 2081155 2089667 2086600 2071612 2045492 2009620 1965646 1915245 1859881 1801018
63014 1801018 1740534 1680509 1622555 1567689 1516847 1471096 1431291 1398045 1372050 1353911 1343556
63003 1343556 1340413 1344336 1355756 1374662 1400014 1430526 1465557 1504850 1547869 1593839 1642029 1691563
62991 1691563 1741400 1791079 1841155 1892241 1943754 1994236 2042757 2089266 2133443 2173906 2208865
62980 2208865 2237022 2257369 2268515 2268887 2257624 2234819 2200864 2156042 2101035 2037431 1967245 1892083
62968 1892083 1813172 1732131 1651158 1572197 1496317 1424150 1356522 1294196 1237224 1185049 1137244
62957 1137244 1093739 1054340 1018479 985529 955110 926896 900370 874908 850057 825753 802394
62946 802394 780528 760240 740922 721904 703185 685211 668125 651788 636534 623235 612299
62935 612299 603035 594366 585851 577735 570274 563430 557135 551556 547057 543934 541982 540221 537378 533034
62921 533034 528197 524421 522359 521394 520582 519557 518410 517046 515110 512553 509932 507910 506542 505274 503582
62906 503582 501423 499029 496625 494397 492460 490606 488362 485571 482744 480562 479224 478545 478478 479047 479930
62891 479930 480591 480864 480989 481097 481128 481239 481691 482186 481903 480594 479226 479014 480045 481325 482103 482694 483833
62874 483833 485560 487120 487942 488345 488978 489730 489719 488442 486413 484282 481882 478731 475165 472151 470069 468450
62858 468450 467005 466144 466153 466546 466660 466492 466524 467037 467901 468783 469315 469399 469489 470206 471483 472511 472798 472809 473159 473624
62838 473624 473433 472232 470286 467998 465704 463736 462153 460505 458373 456131 454760 454834 455932 457104 457727
62823 457727 457930 458323 459287 460494 461349 461944 463161 465612 468909 472343 475884 479964 484533 488968 492790
62808 492790 495967 498596 500873 503433 507118 512161 517960 523846 529753 535990 542670 549644 556792 564206
62794 564206 572068 580479 589376 598714 608812 620398 634123 650147 668404 689189 713135 740679
62782 740679 771865 806665 845225 887814 934819 986876 1044624 1108146 1176799 1249616 1325668
62771 1325668 1403962 1483266 1562162 1639070 1712039 1778682 1836543 1883501 1917935 1938835 1946046
62760 1946046 1940277 1922545 1893499 1853420 1802947 1743751 1678360 1609234 1537980 1465427 1392356
62749 1392356 1319980 1249673 1182416 1118600 1058294 1001613 948963 900936 857872 819405 784633
62738 784633 752827 723819 697668 674340 653909 636634 622371 610176 599037 588899 580430 573903
62726 573903 568926 565277 563204 562614 562639 562505 562448 563305 565567 569257 574335 580644 587696 595230 603933 614991
62710 614991 628799 644652 661860 680656 701846 726121 754044 786222 822926 863812 908538
62699 908538 957597 1012053 1072481 1138534 1209601 1285462 1366217 1451971 1542670 1637803 1735885
62688 1735885 1834380 1930306 2020759 2102809 2173462 2230309 2272063 2297982 2306926 2297594 2269871 2225436
62676 2225436 2166764 2095852 2014311 1924430 1829539 1733053 1637316 1543450 1452146 1364349 1281164
62665 1281164 1203337 1131128 1064675 1004185 949530 899895 854261 812311 774561 741396 712251
62654 712251 686016 662150 641046 623145 607908 593925 580073 566405 553751 542540 532277
62643 532277 522186 512159 502858 495030 488854 483856 479347 475046 471417 469266 468789 469114 468978 467750
62629 467750 465652 463161 460534 457836 455090 452338 449812 447992 447184 447018 446675 445718 444485 443641 443607 444412
62613 444412 445773 447234 448560 450108 452499 455836 459551 463217 467147 471990 478017 485093 493087 501994
62599 501994 511814 522645 534933 549375 566511 586453 609006 634005 661537 691828 724929 760629
62587 760629 798652 838574 879232 918533 954415 985925 1012927 1034834 1050323 1058415 1059209 1053282
62575 1053282 1040948 1022471 998587 970382 938922 905269 870515 835519 800846 767150 735189
62564 735189 705243 676976 650183 625251 602586 582146 563946 548418 535592 524427 513761
62553 513761 503707 495373 489344 485043 481464 477876 473936 469847 466423 464280 462844 460832 457941 455414
62539 455414 454648 455756 457859 460349 463336 467008 471024 474640 477305 479092 480571 482322 484643 487757
62525 487757 492023 497745 504955 513624 523944 536139 550191 566136 584512 606133 631491 660683
62513 660683 693801 730917 771724 815715 862773 913178 966819 1022760 1079617 1136029 1190620
62502 1190620 1241884 1288391 1328903 1362157 1386819 1401910 1407213 1403195 1390740 1371102 1345942 1317151
62490 1317151 1286574 1255833 1226326 1199279 1175761 1156635 1142515 1133886 1131271 1135025 1144933 1160240
62478 1160240 1180194 1204202 1231222 1259302 1286062 1309419 1327730 1339748 1344933 1343419 1335056 1318720
62466 1318720 1293277 1259136 1218242 1172565 1123176 1070801 1016510 961622 907429 855258 806375
62455 806375 761534 720883 684390 652087 623884 599472 578516 560669 545507 532887 523261 517128
62443 517128 514076 512885 512614 513141 514625 516966 519911 523221 526678 530346 534698 539827 544599 547470 548280
62428 548280 548282 548111 546711 542859 536839 529838 522430 514565 506540 498917 491713 484500 477189 469990 462753
62413 462753 455172 447672 441332 436754 433551 431062 429010 427305 425692 423885 421782 419386 416787 414227
62399 414227 411900 409684 407500 405913 405882 407655 410389 413184 416084 419579 423420 426628 428802 430782 433575
62384 433575 436960 439784 441622 443502 446694 451248 456298 461497 467402 474403 482041 489748 497723 506503
62370 506503 515962 525381 534458 543791 554255 566211 579543 594207 610549 629146 650463 674767
62358 674767 702299 733438 768668 808493 853516 904329 960969 1022390 1086774 1152375 1217688
62347 1217688 1280685 1338414 1387944 1427730 1457849 1478982 1491494 1495472 1491319 1479943 1462228 1438398
62335 1438398 1408100 1371319 1329166 1283633 1236670 1189585 1143164 1097905 1054163 1012507 974089
62324 974089 940211 911186 885852 862505 840151 818697 798130 777902 757156 735406 713033
62313 713033 691118 670665 651870 634236 617299 601040 585686 571526 559028 548717 540607 534030
62301 534030 528245 523060 518718 515417 513102 511496 510186 508941 508072 508149 509191 510564 511866 513461 515740
62286 515740 518317 520533 522499 524988 528319 531916 535081 537779 540461 543384 546312 548831 550825 552583
62272 552583 554479 556718 559581 563740 569775 577300 585102 592536 600425 610193 622463 637022 653987
62259 653987 674410 699587 730106 765716 805954 850829 900897 956639 1017755 1083116 1151243
62248 1151243 1220379 1288126 1351616 1408452 1457206 1496900 1526577 1545855 1555421 1556281 1548644 1531989
62236 1531989 1506037 1471198 1428282 1378356 1322903 1263718 1202556 1141076 1080901 1023410 969599
62225 969599 920297 876218 837451 803395 773703 748951 729733 715427 704564 696240 690436 687020
62213 687020 685295 684619 684775 685536 686516 687620 689040 690631 691845 692492 692979 693506 693514 692307 689864 686696 683213
62196 683213 679484 675358 670670 665539 660580 656516 653546 651444 650279 650485 652116 654619 657642 661506
62182 661506 666494 672206 678120 684419 691584 699312 706460 712159 716630 720789 725321 730299 735645 741854
62168 741854 750147 761850 777681 797773 822256 851473 885577 924277 967103 1013608 1062991 1113575
62156 1113575 1162795 1207756 1246069 1276619 1299715 1316256 1326631 1330557 1327849 1318883 1304182 1283927
62144 1283927 1258133 1227073 1191412 1152230 1111082 1069667 1029167 990137 953144 919193 889260
62133 889260 863683 842244 824542 810058 798122 788221 780174 773796 768611 764166 760415 757548 755682
62120 755682 754978 755773 758214 762000 766914 773398 782035 792430 803035 812172 819001 823502 825977 826768
62106 826768 826196 824525 822010 818977 815784 812618 809330 805431 800253 793435 785497 777765 771442 766746
62092 766746 763178 760494 759121 759626 762124 766278 771642 777920 785026 792991 801696 810765 819966 829752
62078 829752 841206 855340 872540 892589 914867 938469 962549 986886 1011906 1037796 1063792
62067 1063792 1088779 1112592 1136248 1160726 1185964 1211460 1237531 1265357 1295659 1327796 1360316
62056 1360316 1391984 1421932 1449115 1472246 1490446 1503619 1512018 1515576 1513763 1506043 1492360 1473132
62044 1473132 1448753 1419112 1383814 1342991 1297677 1249146 1198141 1145163 1091374 1038602 988233
62033 988233 940530 895281 852724 813485 777906 745922 717459 692489 670665 651280 633790
62022 633790 618108 604232 591757 580062 568912 558596 549276 540397 531061 521071 511300 502783 495604
62009 495604 489027 482666 477127 473313 471388 470684 470429 470429 471134 473257 477248 482930 489536 496129 501965 506590
61993 506590 509878 512135 514001 515986 518085 519842 520720 520349 518612 515629 511673 507056 502163 497593 493979
61978 493979 491542 489895 488433 486809 484996 483098 481248 479531 477835 475931 473902 472280 471515 471413 471390
61963 471390 471221 471142 471200 470878 469612 467461 465003 462690 460544 458466 456580 455134 454198 453681 453700 454743 457314
61946 457314 461423 466524 471965 477468 483303 490158 498776 509439 521715 534912 548903 564314 581672
61933 581672 600506 619559 637875 655439 672731 689962 706868 723003 737840 750654 760670
61922 760670 767589 771801 773845 773703 770854 765057 756927 747716 738682 730655 723883 718165 713376 710108
61908 710108 709539 712426 718361 726380 736097 747772 761288 775527 788937 800372 809285 815503 819055
61895 819055 819919 817630 811456 801263 788079 773446 758320 742861 727141 711578 696635 682533
61883 682533 669468 657756 647434 637895 628334 618520 608812 599360 589776 579894 570458 562524 556256
61870 556256 550894 545913 541658 538617 536718 535750 535962 537610 540295 543462 547399 552999 560588 569750 580361
61855 580361 592974 607875 624484 642207 661340 682615 706243 731908 759373 788511 818935
61844 818935 850118 881782 913670 944971 974487 1001318 1024888 1044217 1057778 1064587 1065221 1061347
61832 1061347 1054290 1044412 1031985 1018238 1005130 994173 985927 980690 979070 981402 986935 994261 1002500
61819 1002500 1011465 1020684 1028887 1034678 1037151 1035583 1029179 1017627 1001569 981990 959348 933693 905471
61806 905471 875792 846008 817218 789979 764195 739512 716044 694527 675513 658806 644021
61795 644021 631230 620477 611035 601948 593247 585856 580155 575304 570323 565344 561373 559016 557691 556054
61781 556054 553138 549198 545415 542638 540534 538176 535287 532454 530247 528641 527345 526159 524829 523055
61767 523055 520925 519000 517696 516848 516176 515852 516269 517398 518725 519815 520744 521965 523823 526104 528080
61752 528080 529174 529625 530253 531467 532830 533695 533909 533602 532607 530601 527746 524787 522442 520893 519857 518903
61736 518903 517745 516443 515350 514681 514202 513557 512801 512335 512333 512625 513181 514258 515912 517754 519501 521420 523849
61719 523849 526565 529095 531472 534151 537232 540344 543331 546404 549346 551201 551264 550002 548448 546966 545182
61704 545182 542897 540382 537765 534829 531599 528539 525861 523101 519719 515759 511588 507333 503032 499094
61690 499094 496056 493842 491699 488956 485617 482116 478735 475446 472180 468984 465864 462593 458914 455023
61676 455023 451654 449412 448043 446579 444250 441086 437721 434900 433135 432407 432051 431260 429895 428550 427695
61661 427695 427180 426765 426628 426968 427436 427533 427373 427545 428285 429232 429969 430437 430800 431251 431933 432796 433606 434441 436004
61642 436004 438995 443174 447551 451497 455122 458417 460658 461123 460014 458183 456127 453655 450483 446729
61628 446729 442799 439086 435868 433267 431154 429203 427146 424942 422657 420299 417866 415500 413429 411711
61614 411711 410140 408510 406949 405862 405462 405375 404766 402885 399546 395182 390478 385914 381559 377195 372603
61599 372603 367809 363236 359556 357155 355593 353836 351239 348141 345262 342736 340121 337218 334409 332154
61585 332154 330590 329682 329333 329135 328421 326866 324838 322955 321483 320332 319363 318464 317514 316508 315624 315021
61569 315021 314640 314233 313491 312288 311037 310621 311529 313118 314210 314371 314056 313613 312969 312410 312683 313908 315252
61552 315252 316205 317383 319408 321776 323613 324879 325946 326594 326506 326274 326790 327844 328432 328352 328454 329359 330966
61535 330966 333264 336522 340484 344334 347734 351010 354084 356112 356563 355825 354376 352230 349653 347558 346468
61520 346468 345717 344349 342358 340422 338817 337280 335685 334253 333210 332668 332712 333247 333914 334447 334939 335550
61504 335550 336151 336507 336571 336444 336202 335903 335474 334534 332745 330496 328755 328031 327916 327905 328093 328642 329124 328997
61486 328997 328432 328088 328335 329148 330537 332479 334548 336199 337451 338862 340757 342773 344246 344827 344765 344742
61470 344742 345353 346551 347708 348331 348503 348532 348540 348627 349058 349872 350606 350889 351059 351669 352560 353005 352731 352206 351904
61451 351904 351911 352379 353738 356035 358480 360099 360663 360659 360577 360652 361120 362182 363628 364928 365909 367063 368979 371721
61433 371721 375009 378696 382594 386014 388137 388959 389336 389926 390570 390984 391491 392532 393896 395062 396052 397350
61417 397350 399162 401376 404063 407331 410750 413640 415993 418443 421243 423902 425926 427214 427607 426796 425010
61402 425010 423072 421382 419451 416842 414004 411658 409911 408463 407207 406080 404786 403260 402087 401867
61388 401867 402386 402938 403175 403137 402668 401469 399733 398232 397649 398043 398921 399680 400074 400413 401185 402475 404013
61371 404013 405679 407417 408646 408597 407578 407108 408247 410446 412649 414720 416964 418973 420117 420859 422402
61356 422402 425124 428396 431891 436015 440883 445921 450843 456264 462903 470766 479359 488140 496499 503887
61342 503887 510335 516460 522707 528931 534791 540082 544619 548364 551799 555558 559455 562513 564165 564798
61328 564798 564753 563598 561015 557759 554939 552652 550142 547158 544410 542574 541522 540754 540167 540102 540885 542566
61312 542566 545030 548239 552374 557724 564343 571889 579975 588719 598771 610681 624284 638736 653075
61299 653075 666640 679006 689711 698238 704218 707479 707919 705596 701042 695200 688649 681054 671740 660840
61285 660840 649536 639001 629343 619853 610068 600316 591223 583004 575495 568759 563385 560015 558753 559186
61271 559186 560807 563137 565584 567729 569868 572771 576604 580493 583522 585815 588186 591077 594494 598834
61257 598834 604998 613434 623541 634263 644907 655128 664477 672392 678538 682964 685969 687934 689235
61244 689235 690128 690679 690765 690144 688621 686302 683661 681188 678965 676691 674124 671378 668751 666396 664263
61229 664263 662384 661216 661546 663836 667618 671842 675957 680432 686020 692756 699903 706666 712650 717820
61215 717820 722438 727009 732055 737907 744690 752172 759417 765041 768354 770050 771333 772608 773561 774253 775318
61200 775318 777109 779453 782481 786982 793535 801937 811912 823975 838967 856921 876798 897208 917024
61187 917024 935393 951627 965243 976052 984196 990192 994822 998812 1002452 1005494 1007333 1007456 1005867
61174 1005867 1003074 999508 995047 989287 982152 973894 964572 953934 941875 928631 914424 899318 883546
61161 883546 867592 851692 835605 819139 802529 785948 769062 751671 734691 719838 708141
61150 708141 699166 691908 686121 682473 681606 683338 686650 690051 691970 691237 687626 681944 675438 669057 663227
61135 663227 658056 653514 649564 646429 644688 644747 646278 648597 651642 656132 662576 670664 680015 691107
61121 691107 704902 721757 741192 762652 785950 810916 837077 863972 891572 920237 950326
61110 950326 981832 1014274 1046869 1078917 1109969 1139682 1167718 1193858 1217937 1239510 1257814
61099 1257814 1272316 1283051 1290141 1293150 1291255 1283942 1271423 1254535 1234376 1211711 1186485 1158247
61087 1158247 1127303 1094997 1062518 1029963 997118 964586 933353 903617 874956 847521 822118
61076 822118 799102 778071 758794 741554 726342 712563 699952 689140 680815 674813 670486 667478
61064 667478 665698 664857 664571 664700 665242 666059 667097 668794 671906 676866 683426 690956 699086 708106 718688
61049 718688 731128 744964 759537 774772 791251 809640 830354 853487 878659 905041 932017
61038 932017 959827 989118 1019949 1051730 1084173 1117724 1152847 1189298 1226428 1264012 1302593
61027 1302593 1342965 1385331 1429050 1473474 1518882 1566032 1614684 1663390 1711338 1759690 1810494
61016 1810494 1865035 1924184 1989617 2063381 2146557 2239463 2342957 2458616 2588438 2736099
61006 2736099 2908326 3113499 3359342 3654110 4010195 4444712 4977089 5629576 6431673
60997 6431673 7421962 8644787 10145670 11961252 14089052 16439961 18814556 20948709
60989 20948709 22617775 23726780 24323428 24545809 24567079 24567381 24702100 25037298 25489220 25839289
60979 25839289 25837924 25322841 24266934 22746413 20886133 18827128 16710820 14659164 12754892
60970 12754892 11039049 9524947 8211659 7089074 6140673 5348053 4693177 4156805 3717993
60961 3717993 3356927 3057343 2806129 2592654 2409312 2251167 2114033 1993694 1887134
60952 1887134 1793088 1710807 1639331 1578090 1526816 1484208 1447760 1415337 1385856 1358081 1330203
60941 1330203 1301375 1272563 1245006 1218742 1193395 1169396 1147395 1127088 1107694 1089243 1072518
60930 1072518 1057886 1044872 1032889 1021968 1012781 1006106 1002199 1000658 1001106 1003790 1008997 1016115 1024099
60917 1024099 1032888 1043424 1056140 1070361 1085525 1101956 1119844 1138349 1156445 1173934 1190884
60906 1190884 1206707 1220565 1232218 1241623 1248128 1250947 1250156 1246421 1239883 1230136 1217269 1202099 1185227
60893 1185227 1166486 1145588 1122875 1099173 1075247 1051529 1028163 1005129 982449 960332 939080
60882 939080 918883 899787 881737 864498 847680 831102 815025 799808 785365 771261 757406
60871 757406 744416 733116 723690 715415 707224 698488 689344 680328 671859 663997 656518 649155 641927 635362
60857 635362 630147 626345 623123 619486 615132 610295 604997 598918 592043 584980 578525 573155 568936 565570
60843 565570 562446 558950 554884 550400 545472 539706 532779 524854 516467 508152 500189 492552 485093 477893
60829 477893 471407 466101 462090 459258 457552 456882 456990 457777 459557 462511 465994 468944 470976 472659 474671
60814 474671 477147 479902 482799 485705 488418 490748 492527 493597 494090 494595 495620 496977 498125 498994 499924
60799 499924 500922 501631 501994 502204 501869 500123 496937 493644 491565 490509 489133 486490 482720 478415 473775
60784 473775 468567 462754 456977 452159 448503 445222 441582 437828 434531 431369 427407 422517 417582 413226
60770 413226 409302 405839 403544 402804 403033 403519 404238 405252 406077 406415 406934 408374 410296 411618 412251 413338
60754 413338 415806 419403 423297 427091 430922 434895 438760 442135 445000 447886 451450 455837 460574 464988
60740 464988 468455 470370 470392 468829 466318 463010 458549 452933 446749 440330 433347 425680 418103 411568 406203
60725 406203 401469 396906 392268 387373 382411 378101 374962 372625 370273 367542 364649 361990 359995 358957
60711 358957 358560 357893 356473 354845 353664 352628 351026 348945 347176 346142 345698 345822 346687 348044 349297
60696 349297 350288 351364 352578 353460 353740 353772 354079 354939 356554 359100 362382 365801 368900 371728 374624 377942
60680 377942 382054 387327 393861 401337 409062 416153 421987 426783 431556 437145 443435 449765 455781 461418
60666 461418 466345 470077 472578 474183 474945 474531 472720 469568 465214 460077 455060 450899 447333 443566 439567
60651 439567 436201 434047 432841 432205 432139 432477 432626 432260 431626 430756 429073 426294 423141 420443 417978 414893
60635 414893 410921 406526 402134 397963 394521 392359 391179 389854 387686 385208 383449 382777 382862 383477 384800
60620 384800 386836 388924 390169 390250 389596 388709 387678 386558 385936 386547 388299 390214 391583 392738 394319 396116
60604 396116 397188 397001 395920 394618 393551 393073 393405 394189 394556 394149 393745 394371 396022 397840 399429 401312
60588 401312 403961 407036 409868 412164 413873 414859 415286 415914 417330 419026 419878 419545 418869 418854 419803 421461
60572 421461 423446 425420 427414 430156 434521 440435 446980 453859 462083 472652 485152 498308 511489
60559 511489 524852 538152 550192 559610 565726 568520 568211 565032 559263 551483 542866 534970 528877 524643
60545 524643 521742 519763 518447 517562 517356 518755 522434 527909 534331 541994 552165 565368 580778 597478
60531 597478 615276 633771 651482 666774 679162 688884 695583 698327 696961 692679 687064 681037 674847
60518 674847 668514 661859 654501 646339 638072 630879 625439 621436 618146 615354 613488 612881 613168 613626 614045
60503 614045 615131 618059 623688 632143 642985 655839 671031 689624 712703 740601 772975 809544
60491 809544 850447 895688 944323 994312 1043135 1088579 1129120 1163787 1191675 1211567 1222154
60480 1222154 1222729 1213603 1195691 1169778 1136386 1096385 1051398 1003426 954202 905140 857657 813051
60468 813051 772052 734926 702072 673919 649974 628643 608671 590350 574601 561222 548962
60457 548962 537189 526406 516932 508202 499824 492351 486192 480554 474428 468135 462842 458817 455167 451316
60443 451316 447798 445347 444002 443473 443753 444842 446180 446912 446724 446143 445916 446155 446191 445331 443696 442099 441132
60426 441132 440720 440651 441032 441861 442553 442435 441585 440731 440412 440566 440830 440892 440708 440654 441281 442579 443735 444029 443742
60407 443742 443756 444534 445923 447625 449260 450307 450719 451380 453169 455655 457584 458594 459535 460954 462316 463115
60391 463115 463871 465412 467755 470325 472832 475385 478038 480713 483406 486058 488416 490326 492040 494026
60377 494026 496601 499859 503688 507692 511361 514502 517319 520011 522548 524866 526936 528593 529727 530711
60363 530711 532132 533955 535417 536000 536023 536038 536190 536541 537496 539441 542302 545936 550584 556446 563124 570105
60347 570105 577687 586806 597886 610221 622534 633765 643261 650538 655182 657014 656244 653287 648281
60334 648281 640925 631166 620017 609241 600002 592137 584892 577983 571639 566012 560993 556460 552271 548152
60320 548152 543868 539467 535197 531333 528219 526171 525047 524147 522965 521904 521974 523894 527777 533485 540882
60305 540882 549772 560055 572093 586740 604849 626722 651792 678539 704817 728589 748474 763571
60293 763571 772921 775489 770746 759162 742133 721517 699122 676398 654430 634168 616500 601986
60281 601986 590572 581637 574308 567772 561589 555864 550984 546983 543218 538838 533540 527757 522134 516944
60267 516944 511994 507062 502352 498450 495770 494181 493338 493176 493776 494766 495309 494840 493603 492320 491559 491482
60251 491482 491929 492561 493139 493750 494625 495691 496566 497056 497366 497731 498167 498690 499426 500283 500835 500755 500130 499206 498173
60232 498173 497401 497485 498717 500759 503104 505607 508298 511023 513677 516539 519932 523711 527445 530914 534052
60217 534052 536642 538593 540497 543342 547549 552651 558006 563486 569320 575637 582415 589641 597191 604671
60203 604671 611674 618250 624867 631725 638288 643808 648252 652327 656477 660296 663218 665373 667257 668825
60189 668825 669609 669621 669384 668989 667812 665409 662052 658121 653619 648688 643946 639736 635536 630739 625672
60174 625672 621200 617595 614448 611538 609126 607361 605974 604636 603237 601768 600226 598694 597292 596056
60160 596056 595057 594491 594414 594607 594953 595678 596847 597860 598025 597554 597475 598481 600203 601680 602303 602305 602587 604029
60142 604029 606718 609920 612949 615865 619004 622166 624804 626950 629398 632916 637728 643750 650796 658311
60128 658311 665350 671079 675158 677568 678396 677979 677038 676360 676322 676781 677399 678105 679235 681078 683252 684861
60112 684861 685564 686172 687724 690087 692005 692543 691993 691253 690751 690245 689270 687466 684611 680706 676049 671073
60096 671073 666137 661521 657557 654605 652851 652180 652330 653235 655132 658162 661898 665488 668347 670546 672474
60081 672474 674403 676466 678728 681029 682979 684325 685062 684989 683467 680011 674858 668559 661262 652875 643760
60066 643760 634706 626164 617977 609918 602094 594732 587946 581848 576576 572058 567914 563716 559212 554405
60052 554405 549631 545504 542439 540241 538479 537264 537276 538874 541575 544642 547994 552231 557789 564320 570973
60037 570973 577242 583312 589506 595532 600591 604183 606458 607679 607769 606676 604723 602190 598867 594515 589487
60022 589487 584299 578695 571799 563276 553831 544458 535741 528080 522051 517965 515280 512881 510060 507006
60008 507006 504242 501759 498931 495351 491454 488019 485180 482399 479444 476875 475288 474594 474375 474554 475243
59993 475243 476313 477635 479446 481918 484611 486981 489264 492192 495901 499758 503289 506609 509797 512419
59979 512419 513910 514087 513180 511687 510174 508762 506789 503481 499022 494446 490429 486769 483225 480199 478201
59964 478201 477128 476549 476370 476779 477733 478918 480148 481510 483088 484711 486014 486712 486865 486893 487243 488086 489403
59947 489403 491235 493642 496483 499455 502305 504881 507127 509175 511282 513419 515144 516134 516552 516577 515978
59932 515978 514675 513388 513007 513470 513927 513959 513908 514074 514407 515116 516740 519289 521913 523847 525216 526684 528823
59915 528823 532077 536703 542321 547927 552811 557197 561711 566493 571001 574277 575254 573374 569323 564792
59901 564792 561076 558166 555449 552812 550649 549128 548050 547350 547312 548313 550596 554228 559058 564810 571347
59886 571347 578681 586560 594254 601042 606820 612074 617341 622828 628491 634296 640324 646545 652499 657429
59872 657429 660888 662981 663800 662975 660209 655919 650748 644640 637151 628582 620016 612149 604839 597978 592005
59857 592005 587189 583132 579468 576542 574929 574711 575614 577535 580572 584892 590763 598346 607241 616761 626859
59842 626859 638089 650275 661791 670682 676195 678927 680142 681435 684393 689660 696366 702913 708173
59829 708173 711705 713311 712903 710535 706135 699475 690725 680651 669941 658814 647641 637382 628811
59816 628811 621721 615459 609788 604716 600017 595651 592197 590072 588637 586888 584656 582299 579547 575684
59802 575684 570881 566322 562846 560220 557868 555563 553269 551052 549305 548411 547968 547063 545525 544218 543783
59787 543783 543787 543580 543330 543559 544096 544190 543536 542538 541532 540253 538319 535947 533851 532509 531728 531051 530426 530206
59769 530206 530492 530815 530666 530136 529718 529562 529297 528611 527840 527809 529120 531559 534230 536367 538040 539867 542098
59752 542098 544355 546412 548761 552039 556181 560540 564642 568430 571939 575191 578398 581900 585813 589906
59738 589906 593814 597216 599927 602036 603837 605454 606691 607453 608101 609136 610702 612634 614772 616972 618987
59723 618987 620724 622452 624440 626521 628318 629755 631011 632094 632777 632905 632527 631870 631378 631492 632112 632525
59707 632525 632291 632002 632708 634694 637206 639272 640444 640887 641115 641567 642131 642164 641322 640225 640008 641355 644236
59690 644236 648237 652629 656313 658288 658297 656797 654497 652207 650725 650179 649626 647960 645226 642513 640511
59675 640511 638717 636176 632498 627968 623030 617858 612282 606121 599674 593687 588566 583861 578890 573621
59661 573621 568538 563983 560180 557644 556803 557229 557866 558083 558064 558281 559181 561286 564882 569460 573991 577788
59645 577788 580665 582401 582787 582164 581156 579743 577313 573756 569776 565930 562124 558372 555292 553384 552416
59630 552416 551945 551859 551982 551709 550618 549064 547645 546421 545117 543749 542504 541311 540069 539118 538869 539056
59614 539056 538860 537888 536590 535539 534634 533312 531462 529886 529697 531349 534379 537982 541523 544434 546130
59599 546130 546499 546214 546063 546050 545577 544370 542779 541264 540125 539617 539718 539817 539277 538392 538134 538834 539742 540053
59581 540053 539686 538875 537696 536359 535223 534129 532358 529765 527330 525866 524707 522419 518609 514368 511085
59566 511085 509374 509033 509399 509677 509375 508612 507927 507822 508591 510244 512322 514044 515027 515711 516746 518136 519381
59549 519381 520338 521477 523287 525773 528650 531809 535449 539867 545164 551199 557899 565622 575069 586862
59535 586862 601436 619166 639900 661936 681910 696385 703808 704926 701698 696161 690061 684792 681266
59522 681266 679856 680478 682645 685598 688651 691481 694010 696015 696975 696274 693461 688354 681007 671614 660472
59507 660472 648102 635353 623238 612551 603587 596116 589495 583021 576478 570353 565264 561192 557549
59494 557549 553985 550801 548571 547661 548059 549226 550093 549725 548274 546944 546779 547823 549612 552046 555379
59479 555379 559593 564268 569094 574368 580973 589830 601111 613890 626676 638332 648404 656768 663398
59466 663398 668319 671338 671935 670066 667052 664888 664418 664918 665742 667607 671736 678460 687315 697911 709892
59451 709892 722493 735050 747825 761535 776093 790489 803936 816453 828068 837899 844301 845811
59439 845811 841982 833573 821971 808299 793151 777163 761417 746870 733704 721697 710999 701975
59427 701975 694457 687821 681963 677655 675689 676101 678492 682869 689772 699605 712063 726435 742420 760421
59413 760421 780843 803402 827637 853954 883150 914240 943198 964582 974484 972001 958780 938156
59401 938156 914364 891328 871739 857552 850885 853078 862334 873225 879530 877645 867269 849757
59389 849757 826778 800353 773052 747377 724919 706154 690820 678352 668180 659919 653472 648930
59377 648930 646313 645428 645986 647796 650710 654374 658243 661958 665562 669182 672681 675873 678964 682476 686644
59362 686644 691104 695266 698920 702448 706523 711559 717334 723178 728716 734452 741475 750519 761411 773498
59348 773498 786470 800638 816408 833611 851497 869412 887356 905713 924462 942815 959616
59337 959616 973848 984731 991675 994436 993227 988423 980260 968990 955176 939499 922300 903642
59325 903642 883875 863874 844582 826544 809982 795011 781493 768972 757236 746910 738950 733351
59313 733351 728797 723956 718751 713898 709498 704818 699460 694015 689320 685657 682975 681344 680789 681228 683084
59298 683084 687481 695201 705797 718365 732645 748377 763700 775309 780581 779048 771810 760327
59286 760327 746062 730469 714676 699408 685377 673393 663890 656783 651979 649646 649835 652283 656822
59273 656822 663582 672679 684018 697425 712465 728174 743608 758751 774179 789658 803766 815167
59261 815167 823501 828740 830533 828708 823688 815849 805157 792142 778496 765837 754240 742762 731095
59248 731095 719947 710058 701650 694790 689615 686158 684320 684037 685218 687736 691673 697268 704351 712308
59234 712308 720845 730209 740184 749616 757601 764535 771138 776940 780668 781837 780987 778590 774644 769304
59220 769304 763004 755906 748010 739818 732139 725201 718672 712631 707767 704460 702319 700763 699426 697857
59206 697857 695491 692152 688123 683587 678554 673422 668935 665260 661662 657456 652904 648805 645513 642682
59192 642682 639854 637023 634676 633295 632764 632354 631483 630357 629712 630070 631543 634056 637351 640901 644297
59177 644297 647664 651365 655489 659973 664930 670363 675868 681300 687503 695582 705491 716145 726961 738501
59163 738501 751362 765189 779087 792387 804588 815034 823084 828390 830817 830361 827265 821904 814403
59150 814403 804692 792990 779848 765668 750601 735026 719638 704924 690962 677872 665993 655403
59138 655403 645745 636805 628852 622035 615793 609301 602417 595883 590606 586881 584265 582122 580313 579339
59124 579339 579696 581166 582911 584258 585275 586724 589620 594697 601952 610693 620163 630030 640171 650299
59110 650299 660190 670056 680196 690384 699982 708614 716414 723669 730488 736696 741781 745226 747170 748400
59096 748400 749325 749397 748130 746149 744371 742531 739609 735681 732221 730344 729636 729083 728268 727180 725554 723047
59080 723047 719670 715510 710354 704004 696766 689299 682095 675320 668987 663008 657153 651134 644886 638841
59066 638841 633801 630159 627184 623611 619264 615509 613572 612971 612289 610945 609248 607185 604358 601056 598168
59051 598168 595905 593614 591099 589079 588027 587513 587093 586980 587302 587493 587007 586031 584997 583852 582272 580218
59035 580218 577940 575790 574213 573486 573322 573241 573356 574203 575835 577942 580959 585988 593199 601346 609459 618157
59019 618157 628493 640218 652019 662945 672794 681405 688332 693149 695665 696056 695062 693691 692390 690923
59005 690923 689323 688434 689055 691067 693942 697687 702724 709150 716567 724427 732213 739627 746944 754807 763330
58990 763330 771755 779282 785755 791186 795164 797189 797175 795160 791010 784995 778303 772425 768176 765574 764322
58975 764322 764065 764598 766235 769676 775263 782782 792125 803452 816338 829675 843091 857738 874701
58962 874701 893078 910563 925705 938756 950499 961100 970093 976680 979875 978964 974051 965802 954620
58949 954620 940398 923116 903381 882341 861215 840823 821401 802934 785724 770377 757199
58938 757199 746003 736634 729170 723417 718711 714552 710986 708028 705265 702470 700007 698092 696108 693356
58924 693356 690157 687521 685906 684865 683738 682152 679969 677293 674568 672306 670731 669861 669746 670397 671763
58909 671763 674009 677473 682083 687205 692470 698373 705745 714985 726191 739537 754978 771884 789508
58896 789508 807607 826160 844757 862770 879951 896520 912850 929503 947337 967159 989317
58885 989317 1013734 1040061 1067533 1094993 1121288 1145311 1165675 1181009 1190982 1196474 1198271 1196031
58873 1196031 1188816 1176125 1158159 1135781 1110689 1084873 1059316 1033817 1008597 985293 965597
58862 965597 949557 935957 923725 912103 900191 887490 874588 862299 850358 837872 824708
58851 824708 811420 798092 784412 770860 758685 748479 739589 731113 722732 714417 706123 698094 690863
58838 690863 684568 678605 672219 665265 658311 652158 647227 643209 639429 635587 631924 628647 625766 623613
58824 623613 622798 623222 623887 624336 625594 628897 634023 639704 645256 650886 656762 662767 669000 675608 682114
58809 682114 687580 691438 693728 694746 694972 694929 694512 692894 689784 686241 683391 680820 677305 672685 667822
58794 667822 662887 656991 649719 641970 634972 629258 624793 621324 618431 615864 614073 613917 615732 619106
58780 619106 623441 628225 632915 637188 641247 645314 649014 651822 653838 655406 656143 655125 651967 647106
58766 647106 641163 634691 628329 622437 616703 610692 604567 598714 593097 587791 583710 581790 581671 582151 582740
58751 582740 583801 585388 587097 589021 591756 595363 599298 603421 608119 613364 618596 623691 629211 635512
58737 635512 642325 649263 656036 662299 668130 674492 682284 691008 699286 706654 713801 721104 728050 734210
58723 734210 739756 744822 749350 753743 758760 764572 770709 776970 783615 790774 798626 807890 818912 830306
58709 830306 839812 846681 851990 856486 859497 860221 858659 854704 847605 837031 823658 808068 790082
58696 790082 769741 748050 726161 704660 684110 665360 648678 633470 619460 607367 597786 590133
58684 590133 583328 576887 570835 565132 559737 554733 550058 545580 541583 538508 536096 533666 531455 530676
58670 530676 531822 533933 536138 539072 544050 551476 560775 571383 583158 596018 609543 622709 633994
58657 633994 642175 647059 649020 648090 644281 638540 632304 626120 619741 613508 608328 604066 599327 593387
58643 593387 587230 582133 578262 575174 572768 571155 570365 570553 571732 573158 574028 574937 577356 581328 585073
58628 585073 587384 589029 591062 593153 594525 595300 595821 595767 595116 595125 597138 601069 606109 612312 620373 630268
58612 630268 641151 652335 663591 674636 684913 693687 700014 703058 702855 700405 696778 692620 688544
58599 688544 685078 681898 677975 672903 667322 661764 656101 650535 646065 643372 642114 641866 642844 645181 648549
58584 648549 653172 660211 670249 682157 694185 705507 716182 726502 736995 748183 759589 769701
58572 769701 777599 783938 789906 796135 803116 811674 822336 835085 850269 868778 890720 914957 940567
58559 940567 967627 995851 1023649 1049431 1072725 1093122 1109224 1119730 1124682 1124771 1120390 1112378 1102700
58546 1102700 1093233 1084510 1076407 1069123 1062562 1055680 1047439 1037595 1025783 1010917 992579 972052 950943
58533 950943 929644 908128 887251 868071 850751 835269 822404 812873 806186 801372 798201 796766
58521 796766 796694 797711 800180 804129 808611 812842 816948 820661 822486 821370 818195 814453 810416 805790 801045
58506 801045 796733 792440 787799 783683 780989 779071 776778 774268 772399 770972 768980 766082 762675 759056
58492 759056 755484 752360 749474 746009 742183 739706 739587 740827 742452 745377 750725 757779 765436 774425
58478 774425 786063 799916 814711 830617 848411 867012 883893 897577 907956 914696 917169 915575
58466 915575 910499 901942 890367 878007 867272 858317 849860 841799 835344 831237 829671 831389 836918
58453 836918 845154 854526 865101 877745 891676 904657 915187 922767 926552 925776 921223 914545 906389
58440 906389 896796 886800 877756 869650 861958 855602 852024 850833 850464 850796 852980 857005 861622 866569 872836
58425 872836 880852 890256 901223 914092 927886 941020 953146 964403 973423 978316 979324 978307 975825
58412 975825 970946 963710 955419 946509 936374 925348 914739 904810 894748 884630 875400 867063 858993
58399 858993 851989 847804 846529 846459 846522 846909 847495 847776 848266 849849 851916 853170 853900 855169 856179 855013
58383 855013 851842 848780 846640 844480 842357 841762 843142 845608 849366 855772 864645 874080 883211 892688
58369 892688 902260 910631 918112 926745 937307 948654 960303 973013 986550 999714 1013028 1028411
58357 1028411 1045593 1061713 1075234 1087418 1099080 1108803 1115541 1120395 1124577 1127889 1130243 1132549 1135194
58344 1135194 1137660 1140185 1143695 1147762 1151117 1154512 1160449 1169601 1180176 1191276 1203999 1218599 1233562
58331 1233562 1248389 1264425 1281980 1299387 1315828 1332273 1348640 1362752 1373276 1381203 1387525 1391998
58319 1391998 1394979 1397861 1400860 1402909 1404366 1407199 1411907 1417093 1422472 1429315 1437529 1445581 1453887 1464833
58305 1464833 1478712 1493043 1506659 1520946 1536359 1551455 1566293 1583003 1601896 1620733 1638840
58294 1638840 1658083 1678778 1698790 1717850 1738543 1761594 1784443 1806007 1828514 1853027 1877633
58283 1877633 1901853 1928186 1957208 1985690 2012000 2038885 2068403 2098516 2127414 2156976 2189084
58272 2189084 2222526 2256266 2291886 2330163 2369186 2408394 2450478 2496831 2545225 2594440 2646825
58261 2646825 2703719 2762750 2822352 2884435 2949865 3015860 3080705 3146489 3214443 3282325 3349239
58250 3349239 3418215 3491182 3566283 3642891 3724077 3811400 3902772 3998194 4101628 4214225 4331971
58239 4331971 4453217 4581975 4720438 4865311 5015290 5174802 5346175 5525743 5712272
58230 5712272 5911407 6126850 6355255 6595251 6853184 7134082 7435365 7755717 8101469
58221 8101469 8477649 8881731 9313471 9781935 10295368 10853453 11457263 12117157 12842904
58212 12842904 13636584 14504183 15463737 16533521 17724519 19054720 20558534 22272444
58204 22272444 24226716 26464980 29058817 32091363 35643920 39815013 44738933 50577057
58196 50577057 57521247 65834783 75876589 88073273 102904114 120947050 142903886
58189 142903886 169512253 201362981 238612902 280459331 324444009 366170809 400108951
58182 400108951 421369978 427426466 418744359 398181853 369751836 337389664 304094704
58175 304094704 271638153 240831323 212034731 185491183 161371035 139737152 120582772
58168 120582772 103870076 89492519 77239249 66842469 58048987 50633451 44380585
58161 44380585 39095778 34624596 30839754 27619907 24858773 22481580 20432911 18656550
58153 18656550 17101040 15733405 14530536 13463815 12504794 11637899 10854729 10142338 9488102
58144 9488102 8889173 8345997 7852003 7398924 6985883 6613792 6276562 5966663 5683527
58135 5683527 5427617 5191561 4965893 4748956 4543251 4346773 4155900 3972524 3800537
58126 3800537 3638728 3484026 3338061 3203909 3079850 2962494 2852511 2751452 2656611 2564841
58116 2564841 2477815 2397946 2322856 2249479 2179790 2116660 2057676 1998944 1941590 1888669 1838833
58105 1838833 1788901 1739856 1694536 1651966 1609383 1567467 1528276 1490380 1451215 1411966 1375138
58094 1375138 1339533 1302593 1265545 1231357 1199628 1168315 1138475 1112535 1089706 1067728 1047358
58083 1047358 1030532 1015847 1000385 984379 969621 954985 938049 919718 902713 886834 870037
58072 870037 852945 837914 824723 811409 798316 787154 777001 765399 752720 741524 732266 723367
58060 723367 714809 707844 701735 694424 685960 677912 669985 660621 650356 641223 633323 625170 616827 609519
58046 609519 602778 595178 587351 581082 575952 570056 563555 558320 554401 549974 544577 539450 534895 530103
58032 530103 525390 521795 518601 513817 506922 498795 489517 478772 467877 458638 450556 441706 431998 423047
58018 423047 415354 408239 402085 397942 395180 392181 389031 387059 386035 384424 382069 380113 378564 376539
58004 376539 374592 374222 375228 376111 376858 378787 381775 384275 385986 388050 390634 392861 395098 398725 403440
57989 403440 407144 408739 408845 407778 405161 401685 398841 396610 393527 389265 385109 381684 378253 374431
57975 374431 370633 366736 362299 358114 355515 354080 352064 349210 347045 346277 345945 345425 345253 345694 346275 347020
57959 347020 348403 349975 350744 350933 351597 352550 352526 351334 349932 348404 345819 342195 338731 336027 333887 332769
57943 332769 333456 335325 336994 338688 341966 347102 352843 358850 366191 375186 384892 395027 406393 419013
57929 419013 431707 443688 454721 463736 469517 472859 475798 478469 479028 476945 473868 470679 466264 460034
57915 460034 453186 446363 438422 428921 419829 413196 408604 404273 399451 394528 389935 385959 382747 379703
57901 379703 375745 370544 364631 358213 351207 344454 339280 335572 331938 328042 325064 323541 322696 322394 323784
57886 323784 327177 331112 334432 337608 341147 344326 346551 348505 350876 353254 355175 357027 359042 360549
57872 360549 360993 360615 359536 357383 354404 351637 349429 347066 344406 342386 341345 340316 338669 337027 335853
57857 335853 334656 333362 332983 334034 335643 337035 338574 340551 342356 343702 345326 347546 349381 349925 349399
57842 349399 348126 345889 342997 340433 338094 334436 328946 323419 319580 316843 313726 310187 307173 304921
57828 304921 303074 301640 300666 299721 298715 298367 299008 299892 300520 301595 303773 306540 309258 312207 315600 318760
57812 318760 321365 324368 328457 332528 334857 334849 332645 328091 321440 314182 307851 302621 298106 294679 292859
57797 292859 292216 292069 292558 294008 295981 298009 300462 303568 306366 307828 308350 308947 309632 309733 309218 308548
57781 308548 307802 307070 307210 309021 312022 314988 317377 319459 321530 323806 326515 329354 331358 332056 332080 331973
57765 331973 331245 329388 326928 324497 321728 318069 313912 309880 305803 301532 298012 296384 296582 297900 300392
57750 300392 304622 310549 317600 325298 332973 339556 344565 348632 352192 354562 355186 354779 354060 352379 348898
57735 348898 344214 339388 334292 328426 322563 317816 313762 309248 304583 301064 298649 295985 292700 289890
57721 289890 288225 287147 286120 285172 283948 281659 278331 274973 272182 269676 267314 265427 263871 261849
57707 261849 259008 255796 252491 248831 244847 241168 238140 235402 232593 229865 227456 225365 223607 222302
57693 222302 221432 220931 220918 221333 221628 221393 221042 221228 221837 222269 222494 223078 224348 226297 229177 233447 239191
57676 239191 246211 254529 264366 275986 290231 308764 333119 363893 401562 447443 502632 565952
57664 565952 633334 698621 754317 792780 808801 801769 775003 733389 682144 626610 571276 518630
57652 518630 469817 426119 388765 357717 331921 310664 293570 279563 267248 256350 247581 241078
57640 241078 236074 232030 228877 226156 223138 219912 217274 215452 214055 213203 213474 214632 215654 216201 216875
57625 216875 217811 218227 217639 216406 214806 212701 210431 208893 208298 207812 206825 205683 204800 203954 202769 201150
57609 201150 199076 196798 195301 195547 197076 198371 198723 198706 198722 198350 197401 196293 194980 192777 189792 187288
57593 187288 185943 184904 183263 181339 179690 177935 175571 173109 171377 170248 169032 167612 166366 165360
57579 165360 164408 163621 163205 162877 161985 160132 157437 154491 152125 150730 149705 148198 146471 145679 146001 145990
57563 145990 144359 141588 139083 137479 136548 136190 136545 137406 138299 139153 140301 141870 143519 144793 145570 146240
57547 146240 147461 149412 151382 152531 153039 153885 155489 157271 158728 160124 161859 163871 166037 168405 170576
57532 170576 171525 170634 168438 165893 163428 161109 159161 157693 156335 154688 152903 151449 150618 150577 151512 153337
57516 153337 155553 157681 159552 161062 162155 163249 165134 168090 171593 175165 178992 183251 187381 190482
57502 190482 192194 192837 193029 193396 194199 194909 194565 192914 190820 189206 187993 186425 184121 181383 178724 176428
57486 176428 174477 172726 171216 170209 169740 169364 168809 168582 169227 170207 170471 170092 170306 171641 173021 173227 172409
57469 172409 171576 171318 171620 172333 173210 173923 174549 175650 177445 179332 180625 181330 181847 182301 182545 182461 181970 181089
57451 181089 180134 179424 178746 177585 175944 174293 172776 171280 170299 170662 172118 173289 173401 173055 172879 172568
57435 172568 171951 171834 172841 174300 175264 175867 176716 177571 177685 177000 176149 175647 175808 176892 178559 179671 179454
57418 179454 178449 177575 176807 175608 174120 172965 172306 172028 172468 173953 175916 177488 178787 180603 182919
57403 182919 184733 185442 185510 185521 185297 184289 182498 180713 179918 180370 181197 181233 180392 179762 180134 181103 182036 183201
57385 183201 185218 187948 190701 193144 195324 197150 198564 199908 201489 203106 204557 206137 208000 209510
57371 209510 209965 209538 208760 207602 205893 204184 203192 202737 202126 201269 200498 199697 198690 198199 199196 201299 202948
57354 202948 203293 202972 202967 203636 205059 207408 210566 213899 216603 218023 217903 216885 216406 217297 218695 219150 218504
57337 218504 217675 216943 215747 214193 213407 214000 215257 216270 216977 217635 218229 218853 219894 221260 222169 222268 222372
57320 222372 223491 225509 227373 228305 228457 228581 229333 230693 231938 232431 232427 232739 233695 234971 236439 238384 240659
57303 240659 242348 242762 242304 241898 241870 241815 241382 240812 240762 241701 243488 245529 247416 249257 251222 253093 254687
57286 254687 256391 258656 261117 262962 264261 266176 269521 273672 277323 279999 282446 285691 289949 294505
57272 294505 298513 301829 304868 307750 310100 311868 313748 316276 319023 321327 323437 326131 329417 332405
57258 332405 334394 335424 335870 336222 337164 339094 341486 343423 344784 346286 348426 351047 353897 356847 359589
57243 359589 361917 364367 367746 371884 375653 378389 380581 383033 386179 390426 396217 403290 410593 417414
57229 417414 424073 431146 438624 446249 454064 462130 470049 477246 483528 489245 495137 502051 510326 519353
57215 519353 528153 536409 544500 552667 560877 569503 579286 590393 602195 614191 626478 639105 651751
57202 651751 664286 676935 689552 701492 712609 723776 736000 749593 764503 780755 798146
57191 798146 816132 834511 853657 873721 894224 914874 936139 958431 981290 1003890 1025967
57180 1025967 1047737 1069363 1090958 1112752 1134793 1156848 1178891 1201253 1223912 1246147 1267359
57169 1267359 1287809 1308180 1328871 1350089 1372116 1395047 1418622 1442671 1467252 1492075 1516433
57158 1516433 1540130 1563904 1588450 1613604 1639036 1665132 1692520 1721192 1750826 1781595 1814059
57147 1814059 1848595 1885472 1925084 1967368 2011212 2055082 2098096 2140135 2181324 2222005 2262969
57136 2262969 2305034 2348525 2393552 2440559 2490078 2542144 2596454 2652963 2711971 2773930 2839473
57125 2839473 2909246 2983222 3060597 3140891 3224893 3314124 3409784 3512739 3624074 3744927 3876063
57114 3876063 4018280 4173067 4342370 4528081 4732463 4958803 5210999 5492855 5808726
57105 5808726 6164934 6570048 7034110 7568714 8188389 8911917 9762971 10770675 11970189
57096 11970189 13402521 15113551 17152778 19571369 22418712 25738055 29562329 33910107
57088 33910107 38781480 44155290 49988939 56219163 62761598 69510293 76339507 83105101
57080 83105101 89639529 95741117 101169564 105661235 108965664 110890077 111333658 110299234
57072 110299234 107880671 104234059 99546086 94011548 87824183 81176523 74261132 67268146
57064 67268146 60378445 53754149 47528655 41798815 36621805 32017539 27975048 24460603
57056 24460603 21426371 18818780 16584715 14674097 13040046 11639276 10433468 9390200
57048 9390200 8482750 7689717 6994643 6384604 5848023 5373846 4952678 4577698 4243722
57039 4243722 3945933 3680001 3442734 3231635 3043911 2876425 2726379 2591683 2471018
57030 2471018 2364066 2271363 2193486 2130704 2083702 2054290 2045129 2059049 2097868 2159156 2232095
57019 2232095 2297627 2335680 2334123 2291610 2213588 2107636 1982102 1846092 1708285 1575450
57009 1575450 1452079 1340559 1241237 1153181 1075585 1008191 950282 900125 855948 816937 782813
56998 782813 752980 726552 702804 681090 660640 641001 622479 605750 591145 578613 568233
56987 568233 560437 555834 555029 558509 566356 577791 590831 602354 608828 607613 598063 581564 560562
56974 560562 537480 514091 491406 469953 450243 432906 418341 406509 397262 390641 386603 384898
56962 384898 385669 389959 399074 413518 432956 456801 484026 512257 537695 556337 565252 563139 550460
56949 550460 529286 502529 472961 442961 414759 390185 369971 353797 341173 331959 326070 323272
56937 323272 323596 327622 336191 350031 369735 395795 428342 466613 508157 548263 580723 600154
56925 600154 604087 593026 569239 536174 498344 460122 423966 390288 359103 331027 306524 285226
56913 285226 266642 250889 238106 227647 218525 210405 203663 198616 195126 192819 191344 190511 190401 191177
56899 191177 192736 194739 197109 200135 203982 208492 213701 220129 228249 238050 249520 263217 279917
56886 279917 299898 322837 347933 373350 395628 410572 415450 410393 397691 380047 359648 338383
56874 338383 318103 300301 285768 274821 267736 264768 266001 271598 282162 298455 320822 349433
56862 349433 385210 429910 484745 548889 619037 689486 752351 799006 823156 823349 802661 766433
56850 766433 720633 671279 623579 580738 543872 513214 489130 472237 463367 463560 473599 493501
56838 493501 523068 563121 615696 682928 765921 864049 973673 1086382 1188978 1266693 1308202
56827 1308202 1309366 1273700 1209816 1127830 1036977 945026 858084 779877 711682 653764 606784
56816 606784 571342 546921 532528 528214 534836 552454 580309 618653 669236 733024 807681 887059
56804 887059 961993 1021570 1055750 1059042 1032393 981630 914547 839196 762957 691206 626450 569187
56792 569187 519474 477477 443236 416720 397940 386575 381792 383029 390730 405881 428987 459694
56780 459694 496722 537265 576495 608382 627558 630868 617991 591256 554678 512487 468059 423834
56768 423834 381662 342879 308265 278111 252269 230216 211497 196097 183950 174192 165539 157538
56756 157538 150689 145175 140266 135341 130757 127086 124148 121421 118886 116819 115085 113275 111330 109501
56742 109501 107898 106404 104844 103004 100834 98851 97831 97831 98053 98011 98146 98833 99485 99322 98463 97553 96825
56725 96825 96312 96489 97823 99904 101844 103377 104825 106177 107042 107467 108059 109216 110820 112666 114628 116384
56709 116384 117648 118768 120496 122985 125487 127230 128245 129085 130006 130698 130771 130296 129695 129102 128153 126719
56693 126719 125557 125572 126470 127020 126834 127029 128601 130971 132829 133826 134607 135679 137053 138653 140232 141154
56677 141154 141059 140609 140783 141632 142374 142506 142060 140971 139190 137386 136633 137211 138408 139646 141067 142855 144772
56660 144772 146767 149455 153564 159185 165790 172593 178796 184014 188831 194589 202142 210914 219413 226666
56646 226666 232989 239409 246473 253690 260113 265254 269159 271711 272434 271219 268733 265663 261951 257244
56632 257244 251779 246174 240524 234436 227957 221826 216519 211560 206146 200243 194733 190411 187017 183424
56618 183424 178888 173973 169954 167375 165614 163845 161884 159968 158320 157289 157296 158137 158794 158476 157456 156448
56602 156448 155615 154733 153890 153261 152557 151425 150265 149942 150777 152310 153906 155097 155596 155591 155824 156793 158099
56585 158099 159166 160293 162234 164929 167503 169451 170975 172162 172667 172455 172129 172229 172716 173371 174217 175345
56569 175345 176734 178450 180726 183739 187517 192074 197342 203089 209238 216204 224549 234404 245528 257677
56555 257677 270448 282908 293893 302678 309067 313117 315260 316425 317418 318221 318388 317873 316923 315414 313014
56540 313014 309923 306742 303635 300273 296561 292757 288855 284542 279883 275374 271132 266588 261244 255361
56526 255361 249701 244835 240769 237026 233136 229201 225777 223117 220941 219215 218473 218748 218803 217330 214580
56511 214580 211904 210001 208540 207289 206449 205822 204691 202846 200938 199561 198645 197925 197387 197030 196744 196577
56495 196577 196701 197011 197146 196861 196075 194770 193289 192395 192436 192798 192814 192775 193251 193916 194064 193939 194392 195428 196291
56476 196291 196874 197763 198856 199237 198692 198176 198429 199157 199932 200882 202106 203239 203998 204428 204498 204231 204221 204999
56458 204999 205862 205558 204282 203711 204683 206125 206782 206790 206841 206961 206921 206899 206980 206766 206201 206052 206903 208388 209911
56439 209911 211367 212634 213230 213159 213322 214392 215952 217301 218381 219298 219717 219462 219055 218942 218807 218297 217750
56422 217750 217512 217160 216195 214983 214300 214360 214877 215659 216588 217423 218106 218820 219410 219376 218800 218565 219125 219828 219980
56403 219980 219881 220143 220728 221375 222283 223537 224425 224178 222992 221682 220719 220176 220087 220113 219371 217337 214628 212361
56385 212361 211100 210873 211619 212958 214098 214797 216077 219240 224406 230569 236761 242548 247641 251690 254499
56370 254499 256202 257329 258692 260734 262906 264209 264433 264231 263990 263535 263105 263483 264713 265741 265878 265651
56354 265651 265614 265407 264818 264726 265978 268104 270075 271657 273129 274346 275091 275750 276734 277720 278296 278841 279922
56337 279922 281329 282575 283873 285849 288671 292134 296103 300202 303641 306071 308123 310512 313181 315861
56323 315861 318685 321616 324121 326098 328265 330876 333022 334079 334796 335949 336998 337298 337570 338666 339764
56308 339764 339484 338246 337838 338967 340784 342653 344878 347720 351064 355180 360618 367187 373956 380277 385985
56293 385985 390847 394741 398223 401943 405646 408634 411054 413841 417531 421942 426819 432020 437282 442527
56279 442527 448139 454353 460836 467497 474976 483557 492459 501216 510901 522708 535997 549175 561962
56266 561962 575365 589873 605250 621859 640682 662011 685381 710754 738641 769182 802340
56255 802340 838968 880655 928671 983921 1047455 1119775 1200058 1287361 1382337 1486537 1600385
56244 1600385 1723169 1854576 1994486 2141223 2291467 2441989 2590233 2733195 2867132
56235 2867132 2988511 3094124 3180372 3243750 3282258 3295434 3283375 3246971 3188826 3112392 3020130
56224 3020130 2913788 2796301 2671789 2543526 2413262 2282676 2154047 2029181 1908952
56215 1908952 1794216 1686131 1585374 1492051 1406407 1328561 1257604 1192176 1131991 1077671 1029055
56204 1029055 984778 943535 904804 868514 835121 805692 780656 758706 738173 719124 702746
56193 702746 689125 677233 666701 657781 649739 641204 632230 624282 618003 612645 607764 603798 600809
56180 600809 598299 596442 595901 596254 596226 595543 594967 594479 593252 591561 590851 591665 593207 595151 598033 601667
56164 601667 605089 608434 612961 618806 624575 629593 634772 640898 647869 655969 665864 676905 687463 697466
56150 697466 708606 721571 735278 749496 765965 785981 809012 834798 864839 900627 942305
56139 942305 990309 1046707 1113675 1191880 1280962 1379702 1484570 1589766 1689889 1781634 1862836
56128 1862836 1932217 1991168 2043698 2093029 2139295 2181009 2216726 2244405 2261500 2267523 2265155 2257610
56116 2257610 2246130 2230695 2210986 2185158 2149456 2100800 2038845 1964765 1879895 1786901 1690639
56105 1690639 1596095 1506321 1423157 1348467 1283396 1227617 1180392 1141361 1109683 1083861 1063133
56094 1063133 1047615 1036559 1028199 1021912 1018593 1018156 1018751 1019352 1021071 1024907 1030225 1036406 1043862 1052254
56080 1052254 1059863 1065932 1071686 1077989 1084143 1090008 1096988 1105703 1115035 1124616 1135746 1148545 1160912
56067 1160912 1171926 1183703 1198110 1214101 1230058 1246236 1263050 1279452 1295107 1311819 1330745
56056 1330745 1350463 1369630 1389177 1409884 1430324 1449337 1468125 1487745 1507056 1525286 1544099
56045 1544099 1564729 1585635 1605405 1625452 1647336 1669952 1691935 1714362 1738458 1763162 1787675
56034 1787675 1813818 1843031 1873508 1903264 1933616 1966774 2002473 2039891 2080281 2124516 2170469
56023 2170469 2215957 2261978 2310082 2359125 2407784 2457646 2510592 2565696 2621924 2681096 2744845
56012 2744845 2811441 2879104 2949571 3024925 3103933 3185235 3270964 3363319 3460650 3560919 3665813
56001 3665813 3777319 3893625 4012832 4137418 4270517 4411148 4557594 4711860 4876080
55992 4876080 5048434 5227734 5418089 5623709 5843203 6074648 6322014 6590515 6879891
55983 6879891 7188565 7520025 7878539 8263369 8674350 9118474 9603615 10130785 10700397
55974 10700397 11320792 12002254 12748583 13564118 14463621 15465742 16583247 17830711 19236043
55965 19236043 20834022 22656788 24744829 27161722 29986413 33300895 37202233 41820724
55957 41820724 47315945 53875126 61744748 71259769 82826901 96903625 114031700 134876349
55949 134876349 160174510 190582799 226426455 267227485 310990917 353712939 389856951
55942 389856951 413975322 422628621 415409261 394618092 364111250 328090387 290236626
55935 290236626 253250181 218777705 187640546 160151352 136327280 115987959 98826317
55928 98826317 84477402 72555162 62668382 54451608 47598187 41860254 37028517 32928505
55920 32928505 29427878 26426497 23837278 21585049 19616203 17893326 16380544 15043318
55912 15043318 13857745 12807722 11874367 11037488 10284566 9608555 8998818 8442899 7934763
55903 7934763 7472571 7050206 6659105 6296513 5963796 5658018 5372718 5105672 4858524
55894 4858524 4629718 4414750 4212569 4025191 3851518 3687670 3532903 3389498 3257294
55885 3257294 3133717 3018669 2914150 2819490 2731834 2650881 2578453 2513805 2453561 2395620 2338993
55874 2338993 2280861 2218299 2152362 2086384 2020981 1954593 1887785 1822708 1759212 1695783 1633688
55863 1633688 1576058 1523468 1474339 1428879 1388434 1351552 1314969 1278250 1243467 1210652 1177636
55852 1177636 1144247 1112618 1083201 1054249 1025450 998437 973380 948516 923419 899508 877015
55841 877015 854557 832052 811092 792093 773901 756397 740763 726962 713646 700702 689294
55830 689294 679408 670000 661495 655313 650858 645799 639444 633094 626938 619484 610390 601080 592068 582282
55816 582282 571521 561067 551387 541622 531825 523304 516220 509202 501929 495944 492343 490699 490647 492413
55802 492413 495388 498405 501968 508114 517422 528023 538045 547089 554816 560131 562519 562543 560439 555793
55788 555793 548910 540843 531788 521270 510183 500718 493689 487646 481023 473441 464546 453565 440849
55775 440849 428240 417254 408199 401462 398127 398905 403882 413457 427695 444210 458515 467237 469769
55762 469769 466632 458142 445373 430556 415394 400148 385076 371395 360033 350651 342686 336275
55750 336275 331410 327174 322554 317252 311246 304402 296871 289127 281418 273907 267268 262172 258347 255247
55736 255247 253442 253917 256036 257650 257339 255309 252219 248672 245771 244354 243375 240658 235639 229908 224923
55721 224923 220851 217799 216166 215164 212868 208654 204113 200873 199018 198404 199849 203920 209795 216311
55707 216311 223098 229893 235877 240450 243736 245693 245785 244026 241146 237185 231196 223066 214393 206810 200489
55692 200489 194963 190232 186359 183122 180790 180113 180845 181430 180960 180389 181097 183394 187117 192330 198462 203922
55676 203922 207714 210555 213495 216391 218575 219992 220662 220063 218199 216400 215799 215736 214824 212989 211315 210336
55660 210336 209682 209140 209051 209692 210964 212632 214502 216607 219441 223455 228074 231892 234200 235595 236736
55645 236736 237388 237108 235874 233518 229523 224074 218348 212990 207291 200695 194065 188384 183082 176905 169822
55630 169822 162906 156835 151641 147515 144708 142827 141204 139874 139347 139537 139636 138926 137201 134642 131886
55615 131886 129876 128955 128295 126799 124351 121773 119847 118868 118821 119378 119903 119819 118821 116724 113705 110804 109353
55598 109353 109458 109858 109748 109725 110246 110254 108546 105803 103938 103700 104052 103767 102640 101139 99789 99012 98891 99028
55580 99028 99114 99492 100643 102336 103894 105138 106464 108069 109733 111321 112978 114809 116784 118900 121094
55565 121094 123128 124821 126299 127735 129069 130226 131283 132129 132288 131471 130047 128589 127207 125661 123855
55550 123855 121911 119992 118300 116989 115910 114820 114008 114175 115479 117224 118851 120609 122860 125294 127417
55535 127417 129332 131466 133827 136008 137643 138527 138666 138418 138120 137293 134900 130782 126212 122509 119746
55520 119746 117310 115006 112892 110620 107819 104767 102005 99628 97584 96278 96227 97398 99451 102246 105575
55505 105575 108792 111338 113325 115080 116472 117194 117268 116744 115442 113464 111442 109616 107349 104270 101290
55490 101290 99586 99081 98825 98447 98277 98391 98501 98556 98583 98200 97175 96181 96033 96419 96400 95966 96014 96821 97633
55471 97633 97892 97862 97808 97501 96879 96488 96842 97803 98816 99293 98730 96995 94682 92702 91400 90502 89881 89814
55453 89814 90402 91319 92307 93424 94552 95085 94416 92603 90407 88686 87703 86970 85940 84877 84661 85559 86679
55436 86679 86967 86354 85508 84956 84871 85303 86034 86538 86634 86823 87553 88566 89459 90385 91559 92622 93199 93592 94166
55417 94166 94573 94483 94523 95488 96987 98037 98632 99557 100854 101792 102289 103038 104046 104323 103387 101941 100619 99091
55399 99091 96997 94857 93372 92453 91569 90615 89925 89695 89775 89839 89654 89332 89225 89279 88795 87471 86297 86546
55381 86546 87958 88968 88749 88035 87692 87620 87546 87876 89001 90418 91326 91713 92261 93517 95542 98022 100204
55364 100204 101024 99817 96942 93556 90835 89319 88708 88254 87641 87387 87982 88890 89067 88358 87593 87246 86962
55347 86962 86603 86819 87984 89300 89646 88927 88045 87861 88554 89680 90505 90550 90086 89772 89680 89171 88021 87063
55329 87063 87272 88589 90076 90953 91143 91058 91210 91776 92348 92376 91999 91992 92690 93454 93541 93048 92578 92393 92397 92616 93150
55308 93150 93809 94258 94429 94476 94480 94445 94405 94260 93715 92681 91578 90970 91063 91698 92606 93428 93819 93893 94319 95534
55288 95534 97017 97748 97345 96362 95465 94743 93922 92944 92080 91581 91427 91385 91196 90705 89965 89316 89214 89792 90581
55269 90581 90873 90402 89504 88654 88153 88250 89062 90192 90878 90865 90740 91114 91890 92727 93694 94928 96072 96698 96932
55250 96932 97035 96782 96027 95469 95860 96723 96846 95961 94878 94021 92973 91626 90565 89991 89339 88431 87984 88416
55232 88416 89074 89279 89280 89493 89563 88970 88022 87496 87729 88616 90006 91551 92688 93353 94160 95262 95730 94835 93370
55213 93370 92714 92985 93187 92917 92839 93390 94065 94262 94097 93997 94051 94117 94169 94261 94418 94742 95348 96029 96300 95963 95411
55192 95411 95129 95014 94459 93104 91330 89934 89427 89734 90525 91530 92485 93085 93250 93268 93365 93358 93064 92778 92864
55173 92864 93053 92744 91959 91342 91197 91237 91395 92119 93549 95059 96049 96637 97209 97826 98500 99541 101102 102734
55155 102734 103905 104669 105415 106260 107074 107768 108159 107803 106465 104616 103063 102203 101834 101554 101109 100533 100066
55138 100066 99781 99274 98083 96427 95057 94299 93792 93280 93044 93324 93986 95000 96567 98414 99696 100032
55122 100032 99913 99654 98803 97281 96233 96725 98127 98831 98229 97084 96246 95958 96275 97230 98530 99813 101211
55105 101211 103078 105241 107139 108583 109795 110832 111618 112394 113433 114391 114650 114253 113791 113444 112880 112186
55089 112186 112062 112832 113860 114300 114003 113467 113234 113519 114090 114389 114043 113317 112799 112647 112497 112169 112136 113117 115286
55070 115286 117896 119691 119945 119160 118478 118313 118077 117377 116757 116734 116780 116034 114527 112963 111671 110646 110208
55053 110208 110610 111226 111159 110593 110558 111362 112230 112630 112882 113224 113213 112495 111377 110233 108994 107661 106730 106683 107474
55034 107474 108712 109888 110309 109494 107933 106818 106744 107245 107841 108701 109832 110456 109972 109003 108686 109164 109494
55017 109494 108914 107615 106341 105715 105966 106853 107788 108275 108300 108193 108221 108427 108718 108916 108837 108486 108083 107870 107993
54998 107993 108629 109973 111947 114086 115839 116885 117165 116835 116195 115548 115085 115024 115614 116696 117452 117124 115967
54981 115967 115018 114910 115421 116216 117369 118870 120186 120727 120508 120026 119793 120125 121019 121920 121954 120694 118583
54964 118583 116473 115047 114765 115833 117874 119979 121506 122617 123797 125101 126214 126976 127456 127691 127681 127528
54948 127528 127259 126638 125456 123956 122674 121898 121530 121419 121566 121950 122376 122664 122863 123167 123575 123769 123557 123408
54930 123408 124236 126395 129078 131042 131807 131913 132206 133276 135423 138558 142140 145742 149765 155054 161673
54915 161673 168589 174756 179965 184357 187715 189690 190301 189710 187781 184337 179622 174125 168183 162216 157064
54900 157064 153432 150936 148241 144397 139780 135580 132631 130927 130047 129664 129559 129409 128912 128175 127730 127987
54884 127987 128804 129756 130685 131814 133487 135967 139381 143646 148593 154315 161045 168461 175551 181615 186925
54869 186925 191786 195409 196681 195795 193946 191447 187344 181276 174519 168557 163536 158901 154740 151523
54855 151523 149077 146787 144524 142542 140615 138137 135100 132308 130472 129477 128579 127071 124911 122975 122416
54840 122416 123400 124627 124611 123243 121656 120770 120466 120109 119340 118285 117419 117275 117985 119048 119777 119930 119702
54823 119702 119245 118585 117934 117724 118193 119086 119783 119726 118879 117827 117244 117219 117417 117898 119145 121076 122669 123156
54805 123156 123072 123473 124496 125456 126095 126882 128057 129142 129565 129240 128360 127119 125781 124668 123916 123455 123204
54788 123204 122995 122462 121456 120457 120092 120323 120671 121163 122342 124248 126105 127363 128432 129970 131950 133913
54772 133913 135756 137731 139885 142045 144314 147113 150650 154706 159111 164187 170449 177914 185836 193210
54758 193210 199443 204455 208287 210844 212028 211779 209837 205823 199836 192741 185573 178795 172474 166914
54744 166914 162550 159270 156359 153299 150267 147740 145933 144744 143905 143002 141701 140246 139501 140180 142047
54729 142047 144114 145579 146436 147190 148238 149672 151584 154271 157964 162479 167388 172561 178234 184433 190593
54714 190593 195892 199740 201746 201578 199245 195365 190741 185679 179995 173662 167172 161255 156434 152760
54700 152760 149815 147071 144449 142429 141391 141068 140875 140571 140298 140164 140142 140175 140031 139301 137995 136858 136548
54683 136548 136712 136516 135863 135351 135122 134671 133887 133339 133161 132514 130763 128554 127051 126497 126181 125540 124711 124089
54665 124089 123862 124013 124434 124992 125638 126399 127165 127639 127590 127045 126205 125456 125407 126414 127956 128960 129022 128809 129088
54646 129088 129881 130917 132204 133543 134092 133257 131729 130827 130991 131655 132384 133251 134092 134374 134032 133598 133204
54629 133204 132195 130228 128083 126839 126723 127304 128360 129884 131512 132646 133053 132849 132104 131011 130318 130790
54613 130790 132174 133349 133720 133879 134543 135394 135505 134588 133253 132172 131454 130892 130402 130122 130330 131282 132850
54596 132850 134347 135002 134689 133951 133282 132729 132331 132537 133792 135847 137834 138994 139189 138720 137932 137030 136097
54579 136097 135156 134255 133471 132841 132354 132077 132176 132689 133344 133723 133636 133201 132627 132041 131530 131186 131013 130883 130684
54560 130684 130526 130744 131591 132903 134090 134581 134311 133737 133453 133816 134841 136207 137371 137928 137943 137747 137420
54543 137420 136801 136127 136190 137426 139166 140325 140774 141509 143343 145871 147951 148876 148823 148392 148080 148124 148517 149053
54525 149053 149480 149707 149822 149903 149879 149637 149188 148634 148017 147303 146516 145700 144724 143341 141627 140205 139746 140231
54507 140231 140898 140913 139987 138466 137070 136461 136722 137249 137402 137194 137014 136819 136195 135261 134836 135442 136644 137761
54489 137761 138684 139573 140202 140233 139875 139734 140094 140741 141364 141826 142178 142658 143415 144037 143864 143097 143004 144419 146525
54470 146525 147887 148268 148544 149127 149561 149630 149810 150405 151085 151547 151901 152161 152080 151776 151782 152170 152311 151896 151561 152034
54450 152034 153198 154442 155390 155791 155201 153421 150981 148673 146795 145246 144070 143479 143473 143774 144069 144117 143838
54433 143838 143488 143461 143767 144047 144225 144689 145564 146324 146550 146647 147268 148365 149341 149918 150327 150801 151313 151764 152088
54414 152088 152260 152471 153109 154230 155278 155703 155726 156127 157355 159148 160840 161791 161732 161027 160513 160716 161399 162041
54396 162041 162525 162995 163346 163319 163002 162818 163046 163605 164229 164594 164472 164008 163643 163522 163278 162697 162222 162317 162685
54377 162685 162667 162188 161743 161659 161995 162961 164699 166666 167931 168231 168159 168224 168271 167969 167328 166537 165743 165220 165356
54358 165356 166309 167927 170047 172509 174873 176652 177962 179511 181838 184933 188609 192694 196748 200239
54344 200239 203211 206128 208738 209810 208579 205925 203365 201256 198773 195489 192078 189300 187019 184636
54330 184636 181984 179307 176649 173844 171141 169315 168858 169297 169665 169529 169227 169090 168935 168513 168024 167736 167410
54313 167410 166620 165570 165028 165388 166227 166889 167085 166795 166038 165034 164262 164052 164208 164169 163448 161897 159844 158038
54295 158038 157167 157245 157703 158124 158530 158889 158844 158195 157293 156584 156115 155819 155958 156805 158142 159531 160946 162620
54277 162620 164332 165362 165334 164736 164375 164537 164861 164939 164889 165236 166246 167499 168346 168727 169162 169842 170243 170016
54259 170016 169755 170288 171459 172279 172227 171739 171345 170992 170428 169653 168718 167604 166603 166296 166677 166803 165931 164677
54241 164677 164378 165451 167030 168160 168671 168775 168482 167766 166898 166279 166140 166575 167527 168565 169004 168563 167608
54224 167608 166562 165412 164145 163227 163149 163720 164351 164934 165882 167335 168843 169880 170244 169921 169064 168211 167981
54207 167981 168327 168537 168235 167921 168228 169073 169930 170525 170832 170719 170159 169614 169622 170083 170395 170222 169682 168866 167731
54188 167731 166507 165673 165340 165066 164512 163889 163557 163530 163661 164031 164768 165622 166106 166051 165827 165931 166511 167322 168007
54169 168007 168355 168295 167776 166775 165509 164494 164239 164798 165711 166366 166399 165847 165063 164496 164415 164816 165573 166504 167212
54150 167212 167116 165984 164329 162940 162069 161402 160838 160830 161687 162891 163512 163245 162750 162954 164205 166135 168108
54133 168108 169615 170368 170276 169517 168563 167950 167974 168652 169853 171289 172414 172694 172114 171201 170442 169981 169974 170817 172626
54114 172626 174745 176245 176797 176711 176346 175921 175835 176581 178208 180177 181800 182624 182530 181925 181658 182288 183425 184236
54096 184236 184533 184733 184857 184383 183311 182554 182815 183707 184440 184816 184962 184677 183813 182993 183116 184222 185464 186246
54078 186246 186786 187505 188423 189374 190447 191928 193983 196492 199138 201698 204404 207845 212342 217564 223047
54063 223047 228906 235674 243479 251711 259467 265943 270410 272204 270968 266830 260457 253076 246188 240710
54049 240710 236348 232155 227766 223732 220694 218696 217455 216821 216699 216864 217203 217964 219557 222261 226203
54034 226203 231293 236951 242196 246445 250128 254234 259282 264901 270315 274968 278740 281792 284314 286296
54020 286296 287612 288430 289333 290829 292785 294596 295796 296205 295556 293462 289972 285847 281934 278397 274781
54005 274781 270757 266520 262449 258615 254773 250805 247046 244145 242477 241664 240835 239469 237882 236741 236178
53990 236178 235667 234768 233630 232719 232347 232691 233938 236034 238452 240668 242853 245692 249370 253121 256020
53975 256020 257896 259109 259620 258793 256269 252622 248792 245041 240882 236098 231427 227927 225842 224513 223357
53960 223357 222474 222146 222190 222210 222218 222470 222794 222629 221902 221400 221900 223228 224558 225499 226489 228080 230244 232652
53942 232652 235425 239183 244254 250128 255966 261484 267025 272811 278574 284018 289224 294295 298992 303137
53928 303137 307094 311270 315278 318160 319610 320501 322114 325198 329860 335937 343313 352201 363233 376926
53914 376926 393057 411104 431324 454531 480168 505175 525552 538932 545181 544967 538790 527478
53902 527478 512768 496734 480893 466056 452718 441211 431564 423466 416412 409880 403468 396935 390155
53889 390155 383097 375891 368761 361709 354401 346599 338594 330988 324064 317610 311316 305090 299004 293282
53875 293282 288402 284899 282831 281560 280184 278093 275128 271457 267463 263603 260131 256992 254061 251398
53861 251398 249147 247205 245180 242749 240027 237518 235665 234447 233437 232223 230761 229308 228149 227392
53847 227392 226887 226242 225029 223177 221162 219658 218969 218854 218904 218929 218936 218900 218723 218445 218303 218400 218351 217501 215687
53828 215687 213641 212487 212848 214518 216843 219151 220947 222014 222432 222321 221645 220467 219272 218633 218567 218638
53812 218638 218677 218930 219503 220264 221457 223742 227271 231310 235204 239109 243256 247072 249857 252006 254754
53797 254754 258849 264119 270133 276477 282488 287485 291467 294961 298160 300792 302855 304751 306553 307824
53783 307824 308449 308998 309934 310997 311668 311698 310829 308591 304897 300486 296234 292227 287894 282854 277239 271452
53767 271452 266013 261549 258493 256701 255504 254159 252273 249986 247840 246211 244825 243135 241139 239362
53753 239362 237876 236020 233492 231129 229955 229752 229310 228028 226641 226274 227184 228577 229388 229153 228358 227957
53737 227957 228420 229319 229955 230147 230134 229991 229623 229251 229446 230595 232573 234873 236754 237443 236765 235639 235465
53720 235465 236797 238948 240972 242625 244133 245484 246406 246887 247361 248385 250323 253151 256351 259133 261079
53705 261079 262519 264100 266032 267998 269712 271254 272869 274812 277441 281118 285723 290564 295054 299312
53691 299312 303772 308369 312474 315584 317617 318529 318190 316852 315252 313891 312566 310986 309466 308418 307462
53676 307462 305824 303598 301836 301209 301215 301097 300897 301094 301634 301944 301708 301074 300184 298985 297540 296102 294798
53659 294798 293631 292870 293007 294082 295351 295909 295560 294781 293954 292956 291642 290381 289777 289906 290225 290302 290332 290692
53641 290692 291329 291927 292486 293308 294512 296002 297777 299795 301616 302787 303673 305181 307484 309728 311377
53626 311377 313094 315684 318816 321636 324240 327586 332019 336708 340638 343513 345618 347454 349692 352900
53612 352900 356990 361301 365400 369399 373436 377382 381257 385460 390289 395576 401070 406809 412816 418754
53598 418754 424297 429566 434848 440044 444704 448537 451640 454337 456926 459412 461282 461755 460512 458047
53584 458047 455072 451778 447936 443550 438988 434496 429914 424939 419519 414038 409250 405841 403753 402107
53570 402107 400112 397955 396316 395108 393348 390541 387647 386135 386332 387185 387523 387096 386344 385734 385578 386182
53554 386182 387706 389873 392009 393484 394117 394234 394440 395252 396819 398977 401565 404524 407666 410615 413272
53539 413272 416213 420163 424999 429701 433562 437136 441641 447547 454187 460754 467296 474556 483134 493059
53525 493059 504001 515597 527566 539763 552259 565349 579339 594292 609925 625685 641030
53514 641030 655792 670515 686385 704604 725574 748740 773312 799052 826157 854451 883124
53503 883124 911452 939476 967613 995740 1023035 1048724 1072715 1095426 1117307 1138696 1159823
53492 1159823 1180703 1201080 1220742 1239887 1259058 1278725 1299014 1319715 1340358 1360417 1379757
53481 1379757 1398894 1418451 1438230 1457225 1474820 1491607 1508469 1525040 1539817 1551858 1561691
53470 1561691 1570121 1576750 1580334 1580214 1576706 1570194 1560668 1548354 1534155 1519088 1503590 1487574 1470834
53457 1470834 1453198 1434620 1415343 1395674 1375466 1354241 1332069 1309848 1288293 1266995 1244974
53446 1244974 1221965 1198716 1176146 1154636 1134081 1114265 1095249 1077658 1062410 1049848 1039350
53435 1039350 1030180 1022466 1016810 1013156 1010727 1009060 1008397 1008894 1010120 1011733 1014100 1017912 1023497 1030890
53421 1030890 1040200 1051416 1064078 1077621 1092002 1107679 1124993 1143872 1164176 1186038 1209726
53410 1209726 1235304 1262594 1291449 1321985 1354481 1389067 1425573 1463656 1503045 1543689 1585858
53399 1585858 1630028 1676512 1725098 1775317 1827098 1880820 1936628 1994170 2053271 2114258 2177065
53388 2177065 2240465 2302952 2364164 2424665 2484499 2542832 2599032 2653185 2705286 2754774 2801239
53377 2801239 2844833 2885479 2922339 2954536 2981855 3004250 3021268 3032537 3038309 3038813 3033524 3021711
53365 3021711 3003300 2978456 2946717 2907534 2861630 2810973 2757304 2701323 2643321 2583803 2523272
53354 2523272 2462045 2400673 2340151 2281449 2225129 2171491 2120678 2072477 2026353 1981813 1938370
53343 1938370 1895069 1850599 1804303 1756923 1710131 1665430 1623548 1584556 1548254 1514491 1483173
53332 1483173 1454012 1426487 1400411 1376389 1355255 1336946 1320364 1304426 1288819 1273563 1258409
53321 1258409 1243050 1227643 1212728 1198785 1186078 1174690 1164427 1154880 1145879 1137762 1131022 1125898
53309 1125898 1122589 1121563 1123235 1127377 1133166 1139797 1146845 1154227 1162197 1171441 1182815 1196816 1213364
53296 1213364 1232120 1252821 1275372 1299762 1325978 1353913 1383321 1413903 1445390 1477486 1509794
53285 1509794 1541896 1573352 1603616 1632108 1658467 1682576 1704197 1722863 1738302 1750685 1760111
53274 1760111 1766103 1768065 1766064 1760691 1752266 1740819 1726858 1711423 1695003 1676934 1656290 1633015
53262 1633015 1607762 1581015 1552965 1524021 1494773 1465352 1435350 1404557 1373355 1342200 1311079
53251 1311079 1279757 1248384 1217516 1187630 1158833 1130971 1103739 1076684 1049324 1021468 993425
53240 993425 965774 938894 912694 886838 861183 835958 811554 788311 766578 746804 729324
53229 729324 714019 700365 687863 676317 665750 656182 647472 639180 630546 620929 610335 599331
53217 599331 588236 576652 564013 550426 536668 523366 510480 497618 484668 472003 460247
53206 460247 449944 441399 434622 429235 424363 418888 412218 404892 398054 392124 386315 379734 372589 365840
53192 365840 359977 354749 349981 345851 342158 338071 333085 327798 323235 319678 316645 313778 311249 309308
53178 309308 307901 306805 305831 304785 303523 302124 300833 299764 298824 297983 297442 297324 297260 296446 294302 291148
53162 291148 288134 286252 285408 284618 283163 281251 279461 277924 276409 274942 273811 273061 272451 271971 271964 272544
53146 272544 273213 273355 272892 272258 271852 271740 271820 272070 272551 273251 273981 274480 274683 274863 275393 276321 277259 277718 277549
53127 277549 277063 276807 277176 278168 279473 280803 282014 282867 282943 282136 281168 281223 282903 285748 288820 291484 293540
53110 293540 294940 295698 295928 295684 294800 293108 290766 288174 285602 283105 280771 278815 277364 276306 275427
53095 275427 274558 273566 272358 270978 269551 268028 266166 263941 261875 260680 260563 261047 261465 261449 261024 260566
53079 260566 260755 262128 264403 266467 267410 267360 266979 266414 265333 263917 263044 263263 264136 264947 265546 266001 265923 264798
53061 264798 262824 260782 259127 257757 256627 255968 255770 255628 255338 255238 255639 256305 256853 257454 258726 260965
53045 260965 263655 265765 266525 266083 265349 265029 264808 263832 262034 260470 260081 260571 260966 260955 261052 261548 261958 261694
53027 261694 260798 259711 258601 257341 256029 255139 255049 255593 256207 256444 256264 255901 255586 255411 255392 255576 256145 257325
53009 257325 259068 260864 262100 262708 263234 264094 265003 265426 265342 265157 265014 264720 264334 264279 264702 265280 265880 266916
52991 266916 268645 270506 271658 271911 271703 271445 271400 271969 273346 274893 275502 274834 273744 273237 273436 273878 274442
52974 274442 275547 277540 280257 283148 285614 287274 288165 288722 289424 290460 291788 293425 295430 297594 299383
52959 299383 300378 300728 300983 301457 301845 301579 300458 298807 297018 295160 293145 291113 289380 288004 286601 284672
52943 284672 282092 279253 276829 275344 274781 274529 273859 272548 270993 269659 268563 267432 266239 265307 264890
52928 264890 264883 265083 265512 266269 267144 267682 267653 267233 266657 265975 265293 264950 265155 265564 265581 265064 264402 263896 263424 262816
52908 262816 262224 261977 262269 263107 264317 265434 265867 265432 264480 263403 262307 261366 261066 261607 262330 262303 261406 260406
52890 260406 260046 260515 261676 263212 264420 264537 263602 262581 262317 262702 263103 263213 263117 262900 262642 262585 262858 263173
52872 263173 263167 262945 262867 262947 263004 263425 265206 268918 273915 278816 282602 285102 286681 287734 288330 288154 286894
52855 286894 284867 283106 282445 282595 282394 281065 278981 277033 275478 273616 270527 265985 260723 255970 252651
52840 252651 250822 249790 248865 247963 247377 247093 246671 245857 244979 244516 244563 244974 245807 247183 248818 250153 251025
52823 251025 251793 252606 252955 252286 250820 249408 248654 248448 248317 248006 247747 248097 249465 251623 253824 255571 257172
52806 257172 259245 261809 264209 265838 266538 266316 265237 263736 262475 261477 259833 256843 253216 250524 249500
52791 249500 249409 249210 248717 248322 248066 247541 246587 245581 244956 244736 244656 244556 244509 244678 245178 246055 247297 248818 250415
52772 250415 251784 252692 253157 253352 253318 252896 252056 251100 250339 249684 248870 248023 247692 248157 248978 249463 249445 249394 249810
52753 249810 250663 251424 251577 251110 250546 250447 250865 251369 251623 251759 252071 252548 252907 253030 253159 253719 255110 257510
52735 257510 260601 263500 265336 266110 266802 268405 270973 273739 276044 277981 280134 282873 285917 288459 289721
52720 289721 289542 288513 287468 286758 286022 284709 282751 280638 278860 277387 275837 274082 272482 271341 270306
52705 270306 268615 266057 263401 261657 261072 261167 261616 262584 264049 265366 266018 266499 267790 269941 271886 272870
52689 272870 273483 274770 276750 278420 278991 278475 277234 275642 274325 273938 274381 274745 274448 273982 274095 274640 274738
52672 274738 273844 272169 270242 268580 267617 267370 267215 266519 265510 264965 265017 264957 264364 263759 263738 264041 264056 263902 264395
52653 264395 266080 268802 272183 275987 279936 283514 286187 287658 287864 286923 285187 283202 281507 280435 279972
52638 279972 279736 279198 278141 276857 275765 274984 274524 274742 276110 278435 280702 281997 282393 282663 283274 283985
52622 283985 284380 284434 284326 283926 282840 281015 279085 277831 277421 277416 277508 277920 278857 279902 280350 280073 279617 279451
52604 279451 279472 279421 279378 279534 279744 279712 279524 279634 280286 281259 282257 283269 284399 285526 286321 286555 286246 285579 284781
52585 284781 284046 283507 283248 283363 283941 284995 286429 288096 289763 291052 291628 291591 291522 291955 292818 293546 293700 293332
52567 293332 292812 292477 292440 292507 292215 291153 289397 287567 286341 285916 285901 285676 284916 283916 283395 283777 284624 285000
52549 285000 284428 283294 282263 281624 281326 281344 281663 282047 282176 281950 281486 280898 280330 280037 280122 280236 279909 279169 278544
52530 278544 278407 278657 279109 279812 280783 281756 282444 282892 283324 283769 284068 284166 284145 283991 283565 282943 282644 283335 285231
52511 285231 287850 290477 292893 295514 298758 302477 306143 309373 311983 313682 314136 313384 311901 310145 308255
52496 308255 306222 304029 301592 298844 296048 293730 292188 291302 290883 290845 290899 290539 289656 288868 288879 289758 291104
52479 291104 292621 294177 295557 296624 297533 298390 298863 298598 297953 297823 298734 300451 302405 304125 305367 306333
52463 306333 307786 310413 313912 317176 319513 321266 323073 324994 326614 327566 327559 326284 323708 320329 316785
52448 316785 313343 310020 306963 304340 301968 299441 296677 294062 292055 290838 290322 290253 290278 290080 289524 288650
52432 288650 287597 286616 286042 286038 286402 286730 286747 286406 285776 285059 284639 284852 285660 286708 287734 288721 289638 290250 290382
52413 290382 290268 290406 291077 292172 293656 296057 300218 306494 314382 323128 332518 342809 353970 365282
52399 365282 375700 384295 390334 393333 393261 390476 385300 377917 368894 359472 350943 343867 338134 333583
52385 333583 330169 327695 325851 324563 323950 323912 324067 324187 324414 325057 326380 328572 331583 334977 338265 341453
52369 341453 344956 348997 353469 358326 363556 368559 372256 374221 375229 376189 376925 376624 375206 373548 372441
52354 372441 371983 372034 372578 373403 373977 373989 373719 373659 374053 374962 376375 377972 379192 379949 380982 383048 385932 388726
52336 388726 391060 393644 397557 403232 410121 417146 423559 429665 436670 445525 456020 467366 479535
52323 479535 493385 509383 526780 544442 562018 579794 597704 615080 631368 646682 661656
52312 661656 676998 693156 710099 727453 745039 763131 781911 800844 819099 836498 853548
52301 853548 870507 886985 902654 917761 932605 946951 960327 972445 982823 990471 994697 996068
52289 996068 995863 994530 991356 985821 978674 971288 964414 957925 951478 944964 938519 932474 927326 923520
52275 923520 921258 920592 921497 923705 926727 930367 935042 941289 949054 957792 967147 977094 987497 998021
52261 998021 1008601 1019496 1030697 1041742 1052520 1063825 1076559 1090534 1104661 1118348 1132154
52250 1132154 1146810 1162022 1176655 1189830 1201418 1211436 1219431 1224721 1227149 1227395 1226513 1225108 1222940
52237 1222940 1219361 1214194 1208170 1202354 1197180 1192221 1186932 1181340 1175782 1170202 1164125 1157402 1150623 1144602
52223 1144602 1139622 1135398 1131643 1128444 1126099 1124861 1124823 1125879 1127632 1129475 1130998 1132389 1134385 1137689
52209 1137689 1142332 1147614 1152764 1157693 1162952 1168972 1175531 1182116 1188612 1195318 1202371 1209435 1216073 1222274
52195 1222274 1228591 1235783 1244179 1253140 1261341 1267976 1273663 1279678 1286248 1292179 1296435 1299435 1302215 1304728
52181 1304728 1305778 1304534 1301320 1296738 1290702 1282774 1273055 1262278 1251209 1240229 1229445 1218985 1209229
52168 1209229 1200832 1194287 1189337 1185089 1180969 1177442 1175515 1175640 1177329 1179673 1181962 1183865 1185421 1186949
52154 1186949 1188694 1190500 1191936 1192708 1192652 1191407 1188639 1184868 1181618 1180206 1180505 1181309 1181880 1182566 1183773 1184951
52138 1184951 1185107 1184009 1182307 1180510 1178465 1176003 1173623 1172150 1172013 1173147 1175458 1179067 1184316 1191875
52124 1191875 1202671 1217195 1234803 1254103 1274213 1295382 1318304 1343117 1369246 1395936 1422684
52113 1422684 1449207 1475164 1499962 1522896 1543641 1562454 1579705 1595317 1609076 1621394 1633183
52102 1633183 1644858 1656023 1666431 1676667 1687381 1698291 1708501 1717530 1725373 1731779 1736138 1738089
52090 1738089 1737559 1734106 1726816 1715200 1699876 1682201 1663494 1644718 1626536 1609355 1593459 1579179
52078 1579179 1566819 1556412 1547804 1540981 1535997 1532617 1530475 1529743 1531253 1535683 1542896 1552206 1562934
52065 1562934 1574485 1586281 1598031 1609909 1622180 1634784 1647485 1660188 1672860 1685332 1697428
52054 1697428 1709060 1719975 1729647 1737755 1744551 1750340 1754759 1756926 1756186 1752353 1745445 1735644 1723555
52041 1723555 1710007 1695537 1680278 1664324 1647832 1630846 1613426 1595971 1579000 1562628 1546727
52030 1546727 1531618 1517975 1505877 1494487 1483020 1471509 1460266 1449101 1437631 1425948 1414301
52019 1414301 1402449 1390017 1377448 1365805 1355493 1345827 1336076 1326368 1317195 1308537 1299947 1291163 1282105
52006 1282105 1272403 1261423 1248779 1234493 1218656 1201262 1182352 1162045 1140362 1117344 1093441
51995 1093441 1069500 1046266 1024071 1003121 983742 966098 949854 934379 919214 904178 889198
51984 889198 874347 859936 846190 832784 819052 804722 790117 775451 760251 743878 726510
51973 726510 709233 693141 678634 665681 654366 644897 637285 631421 627550 626338 628244 632935 639463
51960 639463 646955 655007 663473 672101 680378 687594 692982 695954 696274 693976 689185 682204 673793 665110
51946 665110 657202 650693 646040 643782 644175 646824 651178 657479 666716 679330 694251 709608 724300
51933 724300 738490 752524 765836 777190 785747 791428 794205 793436 788252 778500 765104 749512 732953
51920 732953 716107 699128 681859 664235 646714 630223 615665 603555 594141 587551 583642 582067
51908 582067 582885 586955 595347 608343 625316 645450 668142 692507 716879 739101 757257 770072
51896 770072 776837 777171 770953 758470 740646 718877 694479 668387 641567 615444 591420 569998
51884 569998 550872 533995 520103 509987 503697 500755 500777 503465 508269 514566 522113 531037 541417
51871 541417 553072 565557 578026 589235 598063 604031 607085 606991 603423 596704 588021 578640 569124 559524
51857 559524 550134 541755 535284 531221 529617 530259 532666 535943 538891 540563 540785 540053 538858 537149 534501
51842 534501 530689 526036 521171 516435 511527 505896 499516 493145 487619 483116 479416 476733 475717 476547
51828 476547 478511 480722 482884 485063 487003 488081 487827 486273 483863 481157 478458 475661 472661 469923
51814 469923 468257 467942 468493 469492 471116 473574 476534 479520 482362 484751 485812 484824 482044 478236 473796
51799 473796 469015 464775 461951 460287 458901 457864 458197 460039 461882 462144 460666 458190 455189 451929 449060
51784 449060 447269 446550 446419 446612 447081 447524 447474 446798 445745 444643 443816 443595 444093 445137 446713 449193 452836
51767 452836 457428 462817 469469 477937 488056 499174 510853 522602 533068 540361 543502 543005 539869
51754 539869 534633 527636 519572 511124 502390 493277 484379 476926 471665 468094 464980 461531 457988 455234
51740 455234 453975 454277 455747 458077 461354 465842 471571 478319 485985 494710 504291 513552 520707 524648
51726 524648 525740 525273 524395 523817 524096 525526 527641 529318 529562 527979 524570 519575 513722 508161 503807
51711 503807 500853 498969 497514 495486 491864 486566 480785 475998 472912 471699 472756 476402 481893 487458
51697 487458 491564 493882 495005 495652 496275 497072 498073 499222 500402 501341 501749 501730 501752 501783 500698 497170 491165
51680 491165 484058 477227 471168 466105 462688 461510 462286 464080 466196 468410 470492 472018 472810 473261 474128
51665 474128 476146 479829 485369 492514 500574 508651 515862 521400 524508 524646 521867 517093 511864 507579
51651 507579 504890 503820 504458 507381 513265 522088 532683 543091 551406 556412 557545 554503 547283 536767
51637 536767 524912 513794 504229 495449 486260 476424 466937 459069 453200 448519 443827 438729 434007 430777
51623 430777 429408 429351 429853 430453 430797 430429 429085 427080 425180 424015 423586 423251 422236 420357 418289 416969
51607 416969 416692 416989 417364 417886 418933 420586 422549 424521 426429 428380 430588 433352 436998 441831 448236
51592 448236 456661 467241 479364 491657 502487 510511 514978 515759 513255 508220 501599 494413 487631
51579 487631 482029 478151 476416 477182 480672 486943 496043 508065 522881 539860 558040 576761 596156
51566 596156 617028 640213 665831 692949 720048 746198 772110 799950 831903 868850 910450
51555 910450 956224 1006007 1059038 1112832 1163272 1205978 1237749 1257118 1264085 1259420 1243946 1218272
51543 1218272 1183220 1140398 1092044 1040215 986384 931912 878610 828504 783058 742714 707123
51532 707123 675705 648107 624193 603613 585502 569008 554141 541700 532092 524570 517894 511425
51520 511425 505211 499354 493797 488546 483614 478915 474694 471832 470989 471448 471598 470806 470091 470642 472275 473909
51504 473909 475060 476232 477999 480254 482317 483406 483061 481411 479033 476339 473234 469562 465662 462146
51490 462146 459307 457077 455439 454466 454028 453811 453625 453329 452502 450678 447977 445076 442350 439447 435965 432184
51474 432184 428736 425722 422541 418616 414016 409334 405105 401358 397700 393855 390119 387100 384977 383280
51460 383280 381591 380186 379610 379833 380289 380682 381194 381863 382345 382588 383210 384806 387277 390301 394110 399220
51444 399220 405624 412995 421628 432528 446367 462853 481074 499739 516865 530103 538108 541394
51432 541394 541506 539781 537227 534793 532818 530280 525471 517588 507327 496027 484766 474233 464807
51419 464807 456504 449172 442821 437518 433053 429134 425889 423725 422733 422702 423653 425762 428718 431859 435122
51404 435122 439200 444400 449985 455067 459672 464431 469647 475164 480775 486160 490698 494074 497059 501080
51390 501080 506886 513959 521382 528946 537314 547354 559616 574444 592449 614704 642346 676127
51378 676127 716410 763429 817189 877281 943251 1014969 1091790 1170959 1247423 1315711 1371839
51367 1371839 1413390 1438759 1447241 1439462 1416858 1380784 1332702 1275008 1210831 1142866 1072986 1002979
51355 1002979 934953 870790 811716 758582 711988 671800 636998 606507 579992 557585 539037
51344 539037 523476 509925 497867 487316 478412 471006 464653 459070 454419 450882 448102 445347 442179
51331 442179 438617 434696 430346 425834 421836 418697 415894 412585 408631 404768 401817 399819 398023 395685
51317 395685 392949 390907 390633 392106 394208 395779 396579 397237 398561 400959 404241 407741 410708 412769 414075
51302 414075 415097 416393 418447 421443 425059 428626 431503 433213 433345 431696 428533 424391 419483 413618
51288 413618 406898 400161 394440 390138 386988 384695 383301 383036 384090 386550 390337 395140 400546 406238
51274 406238 411933 417125 421188 423924 425829 427557 429098 429820 429459 428812 429068 430602 432854 435336 438126
51259 438126 441085 443249 443644 442460 440783 439336 438076 436830 435521 433729 430879 427213 423873 421568
51245 421568 419752 417560 414982 412511 410232 408126 406961 407782 410385 413125 414580 414829 414792 414819 414375 412834
51229 412834 410132 406770 403475 400802 398804 397110 395434 393886 392661 391601 390298 388635 387038 386122
51215 386122 386158 386860 387651 388158 388513 389183 390512 392548 395257 398699 402840 407383 412048 416966 422549 428844
51199 428844 435219 440834 445396 449269 452827 455790 457393 457204 455674 453668 451535 448886 445393 441556
51185 441556 438375 436373 435243 434456 433866 433519 433182 432437 431184 429876 429160 429366 430221 430990 431015 430244 429163
51168 429163 428153 427147 426071 425319 425412 426320 427560 428915 430675 433130 436220 439686 443142 445940 447468
51153 447468 447781 447517 446963 445638 443070 439579 435986 432942 430878 430134 430592 431529 432381 433380 434861 436229
51137 436229 436436 435398 434136 433332 432480 430747 428122 425269 422661 420287 418039 416056 414692 414256 414633
51122 414633 415187 415298 415115 415491 417108 419863 423198 426673 430066 433245 436202 439114 442182 445455 448820
51107 448820 452004 454687 456851 458995 461703 465080 468922 473263 478180 483052 486734 488772 489859 490727
51093 490727 491135 490430 488655 486502 484394 482190 479701 477041 474433 472031 469943 468222 466850 465867 465331
51078 465331 465075 464763 464406 464473 465185 465965 466007 465208 464228 463872 464762 467251 471074 475228 478838 482241 486741
51061 486741 493274 501771 511914 523925 538240 554614 571807 588155 602475 614655 625482 635922
51049 635922 646613 658151 671433 687202 705231 724329 743197 760887 776385 788234 795000 796095
51037 796095 792098 784400 774597 763973 753332 743061 733036 722316 709361 693168 674308 654499
51025 654499 635197 616937 599990 585008 572654 563000 555732 550843 548773 549889 553904 559823 566426
51012 566426 573037 579918 587785 596825 606374 615613 624432 633438 643271 654050 665458 677236 689562
50999 689562 702839 716939 730792 743089 753573 763310 773472 784060 794053 802631 809931 816598
50987 816598 822887 828340 832230 834251 834841 834945 835463 836886 839366 842998 847984 854488 862348 870972 879658
50972 879658 888175 897000 906986 918937 933619 951922 974655 1002053 1033705 1069007 1107658 1149838
50960 1149838 1196126 1247140 1302879 1362324 1423872 1486187 1548418 1609700 1668914 1725148 1778053
50949 1778053 1827494 1873116 1914502 1951561 1984430 2013269 2038534 2061383 2083465 2106181 2130177
50938 2130177 2155344 2180867 2205238 2226662 2243831 2256365 2264451 2268214 2267601 2262715 2253884 2241153
50926 2241153 2223846 2200886 2171637 2136208 2094859 2047397 1993552 1933868 1869833 1803057 1734613
50915 1734613 1665357 1596555 1529795 1466314 1406663 1351029 1299674 1252955 1211000 1173511 1139918
50904 1139918 1109730 1082682 1058523 1036726 1016592 997573 979419 962094 945812 931113 918527
50893 918527 907925 898506 889603 881334 874243 868568 864255 861440 860308 860327 860219 859082 857366 856334 856690
50878 856690 858069 859879 862167 865418 869786 874946 880724 887497 895813 905836 917341 930098 943997
50865 943997 958845 974296 990124 1006558 1024378 1044664 1068223 1095045 1124409 1155798 1189769
50854 1189769 1227744 1270996 1320052 1374975 1435872 1503009 1576788 1657804 1746605 1843161 1946750
50843 1946750 2056678 2172938 2295892 2425344 2560146 2698495 2838170 2976463 3110312
50834 3110312 3236847 3353817 3459474 3552326 3631189 3695486 3745406 3781933 3806795 3822307 3831127
50823 3831127 3836139 3840517 3847597 3860270 3880290 3908113 3943259 3984500 4029529 4074651 4115111 4145878
50811 4145878 4162293 4160514 4138018 4093933 4028596 3942567 3836288 3710864 3568844 3413907 3249950
50800 3249950 3080843 2910806 2744225 2584752 2434712 2295474 2168020 2053027 1950748
50791 1950748 1861126 1783866 1718238 1663088 1617330 1580270 1551227 1529080 1512473 1500225 1491184
50780 1491184 1483913 1477118 1470464 1464437 1459208 1453986 1447690 1439880 1430704 1420159 1407908 1393831 1378410
50767 1378410 1362372 1346004 1328821 1309872 1288466 1264863 1240326 1216367 1193857 1172761 1152590
50756 1152590 1132938 1113800 1095766 1079941 1067288 1057867 1051007 1046352 1044282 1045020 1047881 1052033 1057725
50743 1057725 1065966 1077136 1090828 1107183 1127300 1151799 1179916 1210929 1245851 1286625 1333903
50732 1333903 1386687 1444014 1505724 1571277 1639041 1707529 1776669 1847002 1918143 1988858 2058337
50721 2058337 2126478 2192895 2256461 2316085 2371253 2421295 2464450 2498275 2521087 2532839 2534670
50710 2534670 2527970 2514164 2495298 2474347 2454574 2438522 2427697 2423080 2425508 2435370 2452114 2474277
50698 2474277 2499952 2527054 2553267 2575897 2591936 2598311 2592189 2571269 2534092 2480588 2412541 2333301
50686 2333301 2246562 2155300 2061952 1969304 1880551 1798243 1723537 1656618 1597592 1546818 1504818
50675 1504818 1472146 1449146 1435540 1430383 1432552 1441150 1455484 1475003 1499308 1527696 1558478 1589277
50663 1589277 1618429 1645734 1671445 1695043 1715619 1733152 1748700 1763398 1777751 1791766 1805193
50652 1805193 1817733 1829518 1841398 1854180 1867746 1881584 1896209 1913259 1933967 1958287 1985949
50641 1985949 2017724 2054983 2098298 2146984 2199782 2255484 2313034 2371591 2430588 2489401 2546902
50630 2546902 2601590 2652388 2699304 2743411 2786334 2829680 2874399 2919813 2962449 2995782 3012019
50619 3012019 3005531 2975526 2925806 2862262 2790837 2717221 2646959 2584563 2532404 2490907 2459812
50608 2459812 2438893 2427491 2423962 2425918 2430923 2436721 2440868 2440415 2432203 2413710 2383768 2342630 2291436
50595 2291436 2231663 2164884 2092783 2017225 1940266 1864004 1790186 1719881 1653643 1592013 1535686
50584 1535686 1485113 1440138 1400133 1364386 1332254 1303239 1277140 1253991 1233537 1214839 1196809
50573 1196809 1179332 1163605 1151122 1142340 1136492 1132674 1130887 1131942 1136496 1144355 1154692 1166727 1180115
50560 1180115 1194908 1211385 1229888 1250628 1273568 1298637 1326028 1356134 1389067 1424270 1460647
50549 1460647 1497083 1532889 1567887 1602071 1635122 1666234 1694558 1719953 1743394 1766749 1792098
50538 1792098 1820958 1853808 1890374 1930578 1975261 2025851 2083400 2148193 2220297 2300083 2388097
50527 2388097 2484723 2590203 2704786 2828502 2960846 3100821 3247121 3398014 3551099 3703485
50517 3703485 3852286 3994805 4128170 4249020 4353764 4439227 4503076 4543732 4560135 4551816
50507 4551816 4519218 4463693 4387015 4291131 4178715 4053856 3921756 3787603 3656034 3531603
50497 3531603 3418941 3321806 3242187 3180905 3138984 3117925 3118514 3139761 3178915 3231888 3293331
50486 3293331 3356754 3415193 3462022 3491323 3498132 3479032 3432770 3360262 3264128 3148337 3017902
50475 3017902 2878139 2733689 2588193 2444817 2306739 2176769 2056543 1946371 1845954
50466 1845954 1755066 1673484 1600595 1535464 1477334 1425793 1380378 1340372 1305324 1275519 1251453
50455 1251453 1232851 1218692 1208289 1201886 1199850 1201703 1206340 1212800 1220236 1227438 1233332 1238162 1243407
50442 1243407 1250150 1258042 1266243 1274729 1284009 1293973 1303867 1313277 1322359 1331021 1338640 1344880 1350270 1355656
50428 1355656 1361418 1367509 1373970 1381158 1389652 1400101 1412876 1427702 1443934 1461376 1480579 1502211
50416 1502211 1526549 1553854 1584767 1619879 1659186 1702448 1749930 1802354 1860195 1923354 1991380
50405 1991380 2063561 2138813 2215740 2292741 2367941 2439371 2505677 2566426 2621174 2668354 2705611
50394 2705611 2731117 2743981 2743437 2728462 2698552 2654361 2597344 2529244 2452257 2369267 2283446 2197820
50382 2197820 2115330 2038868 1970713 1912105 1863699 1826311 1800851 1787657 1786227 1795518 1814072 1839696
50370 1839696 1869222 1898873 1925023 1944757 1955880 1956556 1945263 1921374 1885703 1840114 1786536 1726522
50358 1726522 1661715 1594319 1526794 1461234 1399023 1340734 1286175 1234843 1186567 1141554 1099755
50347 1099755 1060736 1024496 991990 964308 941501 922683 907157 894938 886214 880848 878591 879465
50335 879465 883644 891152 901802 915371 931730 950812 972314 995205 1017486 1036660 1050604 1058192
50323 1058192 1059450 1055467 1048145 1039617 1031532 1024665 1019073 1014542 1011039 1008859 1008243 1008832 1009679 1010033 1009914
50308 1009914 1009748 1009699 1009738 1010102 1011058 1012243 1012858 1012806 1013117 1014846 1017835 1021029 1023839 1026828 1031066 1037105 1044635
50291 1044635 1052844 1061035 1069080 1077379 1086339 1095999 1106398 1118233 1132575 1149393 1166351 1179496
50279 1179496 1185546 1183747 1175790 1164329 1151712 1139706 1129642 1122350 1117985 1116230 1116744 1119345 1123724
50266 1123724 1129177 1134770 1139788 1143898 1146873 1148308 1147821 1145548 1142277 1138953 1136084 1133658 1131482 1129394
50252 1129394 1127167 1124468 1121109 1117328 1113762 1111198 1110332 1111723 1115847 1123119 1133846 1148184 1166171
50239 1166171 1187823 1213046 1241396 1271997 1303837 1336108 1368223 1399578 1429521 1457584 1483604
50228 1483604 1507625 1529790 1550292 1569141 1585737 1598591 1605656 1605137 1596215 1579075 1554313 1522506
50216 1522506 1484589 1442541 1399266 1357456 1318773 1284189 1254619 1230663 1211804 1196348 1182197
50205 1182197 1167400 1150187 1129191 1104055 1075670 1045671 1015747 987207 960768 936629 914962
50194 914962 896214 880550 867155 854742 842916 832411 823722 816108 808361 800129 791947 784307 777225
50181 777225 770657 764807 759939 756070 752851 749635 745828 741353 736736 732642 729435 727118 725359 723547
50167 723547 721271 718942 717493 717240 717428 717273 716995 717408 718812 720845 723199 725965 729383 733666 739044
50152 739044 745676 753543 762612 772850 783785 794390 803712 811410 817373 821220 822696 822227 820521 817828
50138 817828 814161 810083 806631 804564 804232 806076 810635 818084 828359 841751 858794 879530 903510
50125 903510 930633 961458 996562 1036071 1079882 1127686 1178568 1231029 1283754 1336055 1387595
50114 1387595 1438245 1488454 1539205 1591122 1643812 1696109 1746559 1793459 1834803 1868552 1892779
50103 1892779 1905548 1905157 1890898 1863510 1824748 1776705 1721521 1661346 1598343 1534766 1472879 1414339
50091 1414339 1359749 1309273 1263661 1224046 1190733 1162846 1139369 1119789 1103468 1089276 1076482
50080 1076482 1065535 1057288 1051783 1048281 1046179 1045379 1045975 1048059 1051582 1056056 1060641 1064880 1068996 1073053
50066 1073053 1076277 1077772 1077555 1076210 1073769 1069707 1063948 1057143 1049810 1041826 1032957 1023437 1013865 1004870
50052 1004870 996909 990032 983791 977750 972181 967878 965172 963538 962302 961479 961757 963950 968543 975467
50038 975467 984166 994037 1004943 1017103 1030496 1044666 1059189 1074001 1089099 1104183 1118849 1132914
50026 1132914 1146297 1158667 1169434 1178065 1184356 1188401 1190428 1190601 1188980 1185724 1181305 1176331 1171010
50013 1171010 1164922 1157492 1148709 1139319 1130299 1122234 1115278 1109717 1106485 1106912 1111921 1121594 1135583 1153749
49999 1153749 1176167 1202629 1232479 1264971 1299576 1335776 1372817 1409817 1446023 1480832 1513625
49988 1513625 1543678 1570135 1591820 1607044 1613749 1610043 1594744 1567647 1529515 1481951 1427172 1367756
49976 1367756 1306442 1245991 1188891 1136831 1090339 1049002 1012129 979228 950014 924280 901833
49965 901833 882394 865484 850638 837801 827216 818736 811528 804843 798865 794447 792169 792090 794242
49952 794242 798795 805652 814386 824744 836806 850520 865377 880603 895242 908010 917741 924334
49940 924334 928792 931955 933617 933185 930667 926377 920023 910728 897837 881286 861479 839404 816685
49927 816685 794763 773958 753917 734905 717970 703699 691569 680910 671938 665311 661134 658885
49915 658885 658094 658539 659907 661790 664090 667017 670551 674199 677463 680467 684006 689060 696286 705819 717425
49900 717425 730830 746019 763227 782573 803602 825095 845365 862842 876611 886540 892974 896291
49888 896291 896692 894304 889283 881705 871424 858255 842376 824477 805510 786376 767776 750028
49876 750028 732852 715681 698514 682328 668282 656630 646786 638352 631561 626624 623120 620366 618096
49863 618096 616560 616141 617113 619559 623310 628170 634367 642627 653568 667134 682752 699864 718090
49850 718090 736970 755736 773346 788797 801619 812139 821026 828523 834288 837888 839007 837162 831852
49837 831852 823259 812293 799633 785210 769076 752301 736432 722358 710197 699975 691809 685661
49825 685661 681472 679359 679135 679934 681065 683107 687335 694063 702425 711965 723488 737848 754537 772046
49811 772046 789123 805120 819502 831791 841996 850603 858016 864219 868945 871877 872627 870772 866115
49798 866115 858924 849926 839996 829673 818888 807289 794871 782158 769701 757526 745297 732954
49786 732954 721004 710118 700607 692418 685582 680398 677016 675011 673618 672337 671082 669857 668728 668177
49772 668177 669037 671779 676187 681924 688990 697352 706584 716364 726923 738340 749612 759134 766162 771293
49758 771293 775519 779357 782877 785924 787982 788204 785788 780169 770959 758220 742920 726648 710677
49745 710677 695578 681753 669758 659833 651578 644474 638476 633793 630331 627654 625368 623348 621670
49732 621670 620477 619877 619945 620893 623074 626525 630550 634191 637248 640535 645037 651135 658719 667754 678496
49717 678496 691327 706416 723345 740989 758024 773477 786591 796405 802136 803998 803081 800216 795480
49704 795480 788901 780956 771983 761754 750178 738071 726726 716925 708730 701910 696093 690766 685579
49691 685579 680603 676027 671853 668249 665909 665573 667255 670324 674243 678878 684213 690244 697220 705629
49677 705629 715769 727504 740573 755082 771631 790778 812131 833949 853937 870561 883409
49666 883409 892384 897174 897897 895796 892742 890194 888932 889494 892204 896606 901160 903639 901859 894434 881312
49651 881312 863680 843189 821241 799016 777728 758428 741585 727135 714900 704760 696566 690150
49639 690150 685389 682154 680278 679676 680248 681565 682914 683810 684124 683574 681597 678082 673813 669665 665599
49624 665599 660935 655348 649121 642686 636526 631309 627445 624477 621545 618497 616083 615011 615325 616645
49610 616645 618390 619698 619821 619024 618621 619745 622276 625179 627583 629295 630572 631754 633001 634203 635129
49595 635129 635698 635989 636079 636110 636443 637443 639052 640873 642672 644475 646213 647690 648965 650309 651692 652853
49579 652853 654074 656302 660038 664528 668563 671783 674706 677739 680822 684010 687767 692492 698258 705252
49565 705252 714019 724905 737473 750842 764415 777862 790439 800865 808161 812341 814044 813648 810981
49552 810981 805819 798403 789602 780773 773325 768018 764568 762205 760553 759711 759577 759700 759911 760548 761717
49537 761717 762859 763495 763948 764803 766029 767276 768835 771604 776206 782746 791330 802101 814687 828447
49523 828447 843556 861228 882349 906256 931134 955140 976793 994814 1008393 1017607 1023217 1026082
49511 1026082 1027050 1027199 1027712 1029428 1032748 1037921 1044985 1053208 1060753 1065148 1064286 1057189 1044145 1026246
49497 1026246 1004828 981274 957145 934100 913398 895479 880159 867179 856394 847536 840008 833147
49485 833147 826663 820846 816265 813210 811369 810105 809074 808516 808860 810139 811880 813557 814985 816250 817451
49470 817451 818685 820201 822318 825086 828264 831798 836085 841466 847539 853355 858315 862503 866086 868851
49456 868851 870594 871560 872112 872120 871047 868468 864221 858286 850983 843196 835966 829728 824164 818683 812833
49441 812833 806495 800132 794746 791076 788855 787269 786057 785622 786182 787544 789896 794046 800471 808719 818259
49426 818259 829417 842952 859067 877408 897765 920262 945098 972504 1002456 1033499 1061943
49415 1061943 1083179 1094321 1095445 1088506 1075873 1060086 1044051 1030438 1020855 1015913 1015904 1020941 1030527
49402 1030527 1043425 1058076 1073059 1087370 1100662 1113271 1125710 1138047 1149908 1160998 1171297
49391 1171297 1180760 1189175 1196382 1202258 1206337 1207852 1206435 1202461 1196390 1188097 1177274 1164215 1149677
49378 1149677 1134136 1117821 1101469 1086352 1073356 1062587 1054116 1048548 1046457 1047636 1051269 1056470
49366 1056470 1062329 1067932 1072908 1077668 1082520 1086758 1089197 1089486 1088255 1085952 1082199 1076501 1069109 1060877
49352 1060877 1052580 1044655 1037432 1031333 1026731 1023584 1021259 1019038 1016926 1015667 1015660 1016228 1016459 1016405 1016731 1017287
49336 1017287 1016854 1014514 1010564 1005851 1000856 995795 991035 986845 983054 979470 976404 974383 973507 973441 973915
49321 973915 974964 976781 979635 983745 988989 994832 1000760 1006678 1012745 1019043 1025561 1032282 1038998 1045310
49307 1045310 1051213 1057464 1064998 1074018 1084052 1094799 1106522 1119548 1133799 1149088 1165691 1184272
49295 1184272 1205104 1227233 1248333 1265504 1276472 1280368 1277738 1270110 1259513 1247859 1236188 1224376
49283 1224376 1211742 1197955 1183321 1168381 1153561 1139285 1126124 1114557 1104632 1095978 1088256 1081597
49271 1081597 1076534 1073507 1072450 1072942 1074678 1077725 1082359 1088827 1097154 1106831 1116509 1124320 1128921 1130342
49257 1130342 1129751 1128561 1128021 1129558 1134922 1145461 1161292 1181498 1205136 1231547 1259345 1285443 1305779
49244 1305779 1317244 1318742 1310594 1293711 1269711 1241213 1211107 1181385 1152944 1126345 1102272 1081301
49232 1081301 1063774 1050054 1040558 1035337 1033799 1034964 1037939 1042244 1047868 1054927 1063108 1071697 1080362
49219 1080362 1089560 1099690 1110128 1119727 1128170 1136144 1144244 1152444 1160772 1169676 1179368 1189373 1199149
49206 1199149 1208726 1218507 1228882 1240310 1253218 1267505 1282619 1298441 1315443 1333564 1351538 1368032
49194 1368032 1382929 1396790 1409515 1420472 1429743 1438249 1446477 1453837 1459642 1464215 1468594 1473483 1478867
49181 1478867 1484570 1490920 1498795 1509059 1522035 1537633 1556016 1577982 1604647 1636942 1675594 1721399
49169 1721399 1775123 1836831 1904875 1975079 2040954 2095504 2133802 2154525 2159568 2152678 2138303 2120758
49157 2120758 2103411 2088262 2076120 2066937 2059985 2054246 2049106 2044526 2040456 2036446 2032177 2028045 2024866
49144 2024866 2023189 2023180 2024954 2028682 2034436 2042099 2051265 2061195 2071247 2081585 2093136 2106616 2121878
49131 2121878 2138352 2155650 2173518 2191637 2209857 2228267 2246785 2265146 2283604 2303034 2323907
49120 2323907 2345682 2367744 2390352 2414084 2438906 2464531 2491281 2519884 2550886 2585015 2623695
49109 2623695 2668312 2719536 2778581 2848912 2935102 3039012 3157118 3281607 3404306 3521094
49099 3521094 3634134 3749183 3868035 3982102 4074396 4129425 4142169 4118687 4069755 4004146
49089 4004146 3925834 3835047 3731294 3616149 3493964 3370603 3251888 3142801 3046721 2964534
49079 2964534 2894956 2836359 2788051 2749571 2719506 2695744 2676560 2660758 2647016 2633913 2620706
49068 2620706 2607570 2594928 2582938 2571684 2561484 2552675 2545197 2538584 2532392 2526510 2520988 2515674 2510248
49055 2510248 2504663 2499246 2494209 2489358 2484574 2480308 2477120 2474872 2472791 2470338 2467662 2465356 2464165 2464821
49041 2464821 2467641 2472326 2478617 2486979 2498044 2511478 2526077 2541033 2556335 2571736 2586035 2597835
49029 2597835 2606574 2612561 2616472 2619101 2621110 2622633 2623295 2622754 2620934 2617786 2613343 2608115 2602890 2598009
49015 2598009 2593403 2589500 2587368 2587622 2589732 2592752 2596231 2600134 2604437 2609243 2614837 2621197 2627894 2634743
49001 2634743 2642021 2649698 2657013 2663265 2668532 2673148 2677048 2680156 2682853 2685355 2687063 2687240 2686019 2684085
48987 2684085 2681605 2678172 2673653 2668449 2662983 2657565 2652695 2648993 2646702 2645570 2645175 2645047 2644704 2643953 2643084
48972 2643084 2642408 2641739 2640627 2638886 2636555 2633577 2629969 2626159 2622678 2619652 2616917 2614486 2612578 2611422
48958 2611422 2611440 2613373 2617740 2624261 2632237 2641304 2651377 2662180 2673523 2685979 2700601 2717783 2736862
48945 2736862 2756926 2777587 2798852 2820692 2842973 2865629 2888688 2912274 2936635 2962160 2989463
48934 2989463 3019508 3053353 3091437 3133279 3178139 3225812 3276489 3330040 3385837 3443200 3501666
48923 3501666 3560907 3620816 3681804 3744707 3810221 3878399 3948605 4019853 4091194 4161828 4230838
48912 4230838 4297154 4360278 4420954 4480386 4538576 4594108 4645901 4694478 4740932 4785322 4826867
48901 4826867 4865301 4901189 4935115 4967261 4997628 5026025 5051975 5075189 5095964 5114556 5130512
48890 5130512 5143258 5153102 5160870 5166752 5170209 5170746 5167956 5161030 5149268 5133062 5113495 5091020 5065512
48877 5065512 5037532 5008340 4978413 4947067 4913858 4879087 4842314 4801547 4754925 4702588 4646097
48866 4646097 4586696 4525023 4461961 4398627 4335536 4272608 4210112 4149051 4090518 4034966 3982114
48855 3982114 3931421 3882743 3836665 3793909 3754364 3717127 3681745 3648827 3619089 3592393 3568322
48844 3568322 3547218 3529892 3516522 3506544 3499493 3495256 3493562 3493966 3496483 3501650 3509723 3520275 3532810
48831 3532810 3547361 3564163 3583053 3603537 3625253 3648001 3671346 3694591 3717368 3740113 3763717
48820 3763717 3788666 3814733 3841540 3869096 3897430 3925970 3953775 3980429 4006225 4031422 4055904
48809 4055904 4079766 4103593 4127678 4151507 4174663 4197912 4222575 4248978 4276315 4304113 4333017
48798 4333017 4363765 4396000 4428580 4460612 4491684 4521389 4549282 4575239 4599410 4621726 4641851
$$ [...]
##END NTUPLES=NMR SPECTRUM
##END=
