
##TITLE=UV1244_M9_1261-1207_20_7241261_aUttAETxPP
##JCAMPDX= 6.0         $$ Bruker NMR JCAMP-DX V2.0
##DATA TYPE= NMR SPECTRUM
##DATA CLASS= NTUPLES
##ORIGIN= BRUKER
##OWNER= Administrator
$$ 1.72 TOPSPIN		Version 2.1
$$ 2013-01-19 03:50:17.696 -0500  Administrator@X
$$ Compression mode = diff/dup
##.OBSERVE FREQUENCY= 400.02188249412
##.OBSERVE NUCLEUS= ^1H
##.ACQUISITION MODE= SIMULTANEOUS (DQD)
##.ACQUISITION SCHEME= undefined
##.AVERAGES= 64
##.DIGITISER RES= 22
##SPECTROMETER/DATA SYSTEM= spect
##.PULSE SEQUENCE= noesygpps1d.comp
##.SOLVENT NAME= COFFEE_meoh
##.SHIFT REFERENCE= INTERNAL, COFFEE_meoh, 1, 14.96084
##AUDIT TRAIL= $$ (NUMBER, WHEN, WHO, WHERE, PROCESS, VERSION, WHAT)
$$ ##TITLE= Audit trail, TOPSPIN		Version 2.1
$$ ##JCAMPDX= 5.01
$$ ##ORIGIN= Bruker BioSpin GmbH
$$ ##OWNER= Administrator
$$ $$ E:\/data/COFFEE/nmr/UV1244_M9_1261-1207_20_7241261_aUttAETxPP/22/pdata/1/auditp.txt
$$ ##AUDIT TRAIL=  $$ (NUMBER, WHEN, WHO, WHERE, PROCESS, VERSION, WHAT)
(   1,<2013-01-19 03:50:11.884 -0500>,<Administrator>,<X>,<go>,<TOPSPIN 2.1>,
      <created by zg
	started at 2013-01-19 03:38:42.181 -0500,
	POWCHK enabled, PULCHK disabled,
       configuration hash MD5:
       86 BA 57 50 F2 9D 5C 9B 26 00 A9 28 5F 66 2E 89
       data hash MD5: 64K
       3B DD D3 DE ED B1 A5 9B 5F 1A 35 04 BA 22 C2 6E>)
(   2,<2013-01-19 03:50:14.978 -0500>,<Administrator>,<X>,<proc1d>,<TOPSPIN 2.1>,
      <Start of raw data processing
       efp LB = 0.3 FT_mod = 6 PKNL = 1 PHC0 = 0 PHC1 = 0 SI = 128K 
       data hash MD5: 128K
       E2 3B DC C1 AA 07 52 A7 05 61 85 C2 6D E8 3B B3>)
(   3,<2013-01-19 03:50:16.025 -0500>,<Administrator>,<X>,<proc1d>,<TOPSPIN 2.1>,
      <pk PHC0 = -81.34277 PHC1 = 0 
       data hash MD5: 128K
       68 90 C9 CF 22 38 76 0A C8 08 35 4A E0 AF 2D 06>)
(   4,<2013-01-19 03:50:16.665 -0500>,<Administrator>,<X>,<proc1d>,<TOPSPIN 2.1>,
      <abs ABSG = 1 
       data hash MD5: 128K
       14 E9 C2 61 25 EC A3 98 92 AE D5 B2 44 AA 9A 0A>)
(   5,<2013-01-19 03:50:16.806 -0500>,<Administrator>,<X>,<proc1d>,<TOPSPIN 2.1>,
      <abs ABSG = 2 
       data hash MD5: 128K
       DE 60 9D 33 D5 9F 4F 84 5F 1D F1 21 65 B0 40 5B>)
(   6,<2013-01-19 03:50:16.978 -0500>,<Administrator>,<X>,<proc1d>,<TOPSPIN 2.1>,
      <abs ABSG = 3 
       data hash MD5: 128K
       CA 40 5B 01 B1 7A E0 B2 E0 15 22 0A 4D EA 02 D6>)
(   7,<2013-01-19 03:50:17.181 -0500>,<Administrator>,<X>,<proc1d>,<TOPSPIN 2.1>,
      <abs ABSG = 4 
       data hash MD5: 128K
       74 5D DB DB 56 B3 4D 9E EE 96 75 B9 9F 37 B1 CF>)
(   8,<2013-01-19 03:50:17.368 -0500>,<Administrator>,<X>,<proc1d>,<TOPSPIN 2.1>,
      <abs ABSG = 5 
       data hash MD5: 128K
       51 2B 1E D3 2C 8D 79 AC FC 30 A6 39 67 7A 6C CD>)
$$ ##END=
$$ 
$$ $$ hash MD5
$$ $$ 0D A5 AF D7 A8 9F 71 11 D6 3D 6E DF 3C FE 1F 70
##$RELAX= 
##$RELAX= 
##$RELAX= 
##$RELAX= 
##$RELAX= 
##$RELAX= 
##$RELAX= 
##$RELAX= 
$$ Bruker specific parameters
$$ --------------------------
##$DU= <E:\>
##$EXPNO= 22
$$ [...]
##$TP07= 0
##$TPNAME0= <>
##$TPNAME1= <>
##$TPNAME2= <>
##$TPNAME3= <>
##$TPNAME4= <>
##$TPNAME5= <>
##$TPNAME6= <>
##$TPNAME7= <>
##$TPOAL= (0..7)
0.5 0.5 0.5 0.5 0.5 0.5 0.5 0.5
##$TPOFFS= (0..7)
0 0 0 0 0 0 0 0
##$TUNHIN= 0
##$TUNHOUT= 0
##$TUNXOUT= 0
##$USERA1= <user>
##$USERA2= <user>
##$USERA3= <user>
##$USERA4= <user>
##$USERA5= <user>
##$V9= 5
##$VALIST= <valist>
##$VCLIST= <CCCCCCCCCCCCCCC>
##$VD= 0
##$VDLIST= <DDDDDDDDDDDDDDD>
##$VPLIST= <PPPPPPPPPPPPPPP>
##$VTLIST= <TTTTTTTTTTTTTTT>
##$WBST= 1024
##$WBSW= 4
##$XGAIN= (0..3)
0 0 0 0
##$XL= 0
##$YL= 0
##$YMAX_a= 7263550
##$YMIN_a= -15192045
##$ZGOPTNS= <>
##$ZL1= 120
##$ZL2= 120
##$ZL3= 120
##$ZL4= 120
##$ABSF1= 14.96084
##$ABSF2= -5.597342
##$ABSG= 5
##$ABSL= 3
##$ALPHA= 0
##$AQORDER= 0
##$ASSFAC= 0
##$ASSFACI= 0
##$ASSFACX= 0
##$ASSWID= 0
##$AUNMP= <proc_prof1d_extract.lims>
##$AXLEFT= 0
##$AXNAME= <>
##$AXNUC= <1H>
##$AXRIGHT= 0
##$AXTYPE= 0
##$AXUNIT= <>
##$AZFE= 0.1
##$AZFW= 0.1
##$BCFW= 0
##$BC_mod= 0
##$BYTORDP= 0
##$COROFFS= 0
##$CY= 15
##$DATMOD= 1
##$DC= 0
##$DFILT= <>
##$DTYPP= 0
##$F1P= 0
##$F2P= 0
##$FCOR= 0.5
##$FTSIZE= 131072
##$FT_mod= 6
##$GAMMA= 0
##$GB= 0
##$INTBC= 1
##$INTSCL= 1
##$ISEN= 128
##$LB= 0.3
##$LEV0= 0
##$LPBIN= 0
##$MAXI= 10000
##$MC2= 0
##$MEAN= 0
##$ME_mod= 0
##$MI= 0
##$NCOEF= 0
##$NC_proc= -2
##$NLEV= 6
##$NOISF1= 0
##$NOISF2= 0
##$NSP= 0
##$NTH_PI= 0
##$NZP= 0
##$OFFSET= 14.96084
##$PC= 1
##$PHC0= -81.34277
##$PHC1= 0
##$PH_mod= 1
##$PKNL= yes
##$PPARMOD= 0
##$PPDIAG= 0
##$PPIPTYP= 0
##$PPMPNUM= 2147483647
##$PPRESOL= 1
##$PSCAL= 4
##$PSIGN= 0
##$PYNMP= <proc.py>
##$REVERSE= no
##$SF= 400.020009701436
##$SI= 131072
##$SIGF1= 0
##$SIGF2= 0
##$SINO= 400
##$SIOLD= 131072
##$SPECTYP= <>
##$SREGLST= <1H.CDCl3>
##$SSB= 0
##$STSI= 131072
##$STSR= 0
##$SW_p= 8223.68421052631
##$SYMM= 0
##$S_DEV= 0
##$TDeff= 65536
##$TDoff= 0
##$TI= <>
##$TILT= no
##$TM1= 0
##$TM2= 0
##$TOPLEV= 0
##$USERP1= <user>
##$USERP2= <user>
##$USERP3= <user>
##$USERP4= <user>
##$USERP5= <user>
##$WDW= 1
##$XDIM= 131072
##$YMAX_p= 339483892
##$YMIN_p= -10962
##$CURPLOT= <Network HP LaserJet P1505>
##$CURPRIN= <$Network HP LaserJet P1505>
##$DFORMAT= <normdp>
##$LAYOUT= <+/1D_H.xwp>
##$LFORMAT= <normlp>
##$PFORMAT= <normpl>
##$SURQMSG= 1
$$ End of Bruker specific parameters
$$ ---------------------------------
##NTUPLES= NMR SPECTRUM
##VAR_NAME=  FREQUENCY,     SPECTRUM/REAL,   SPECTRUM/IMAG
##SYMBOL=    X,             R,               I
##VAR_TYPE=  INDEPENDENT,   DEPENDENT,       DEPENDENT
##VAR_FORM=  AFFN,          ASDF,            ASDF
##VAR_DIM=   131072,        131072,          131072
##UNITS=     HZ,            ARBITRARY UNITS, ARBITRARY UNITS
##FACTOR=    0.0627417313425164, 1,          1
##FIRST=     8223.62146879497, -815,         -69451
##LAST=      0,             1390,            -69818
##MIN=       0,             -10962,          0
##MAX=       8223.62146879497, 339483892,    0
$$ Real data points
##PAGE= N=1
##DATA TABLE= (X++(R..R)), XYDATA
$$ [...]
61331E71869K863L000K456J335J69o66j318k115k919l091k282j029j73J58O06
$$ 571869 574732 577732 580188 581523 581692 581026 579708 577593 574674 571583 569301 568272 568099 568257 568863
61316E68863J540K474K784K625K678L187L772M161M644N576O816P949Q865R793
$$ 568863 570403 572877 575661 578286 580964 584151 587923 592084 596728 602304 609120 617069 625934 635727
61302F35727J0794J1451J1258J0188Q788P600O596N314L491J337p75k637m089
$$ 635727 646521 657972 669230 679418 688206 695806 702402 707716 711207 712544 711769 709132 705043
61289G05043m949n292n541n964o308o260o079o166o211n447l828k406k085k551
$$ 705043 700094 694802 689261 683297 676989 670729 664650 658484 652273 646826 642998 640592 638507 635956
61275F35956k765k195j068K13J360K062K176K079K326K882L150K909K662K836
$$ 635956 633191 630996 629928 630141 631501 633563 635739 637818 640144 643026 646176 649085 651747 654583
61261F54583L083K926K723L343M927O546P289P162O745O330N796N053M198L297
$$ 654583 657666 660592 663315 666658 671585 678131 685420 692582 699327 705657 711453 716506 720704 724001
61247G24001K388J588R38J58j002k250k995l191l443m087m611m358l465k668k326
$$ 724001 726389 727977 728915 729073 728071 725821 722826 719635 716192 712105 707494 703136 699671 697003 694677
61232F94677k118j628q28O0Q52J401J653J836K333L231M140M662M866N163N779
$$ 694677 692559 690931 690103 690163 691015 692416 694069 695905 698238 701469 705609 710271 715137 720300 726079
61217G26079O575P259P678P889Q032Q178Q212P886P103O124N408N136N011M652
$$ 726079 732654 739913 747591 755480 763512 771690 779902 787788 794891 801015 806423 811559 816570 821222
61203H21222M121L880M146M535M545M292M463N527P160Q629R537J0117J0867J1973
$$ 821222 825343 829223 833369 837904 842449 846741 851204 856731 863891 872520 882057 892174 903041 915014
61189I15014J3138J3899J4073J3781J3058J1670R559P285N573M518L653K729J976
$$ 915014 928152 942051 956124 969905 982963 994633 1004192 1011477 1017050 1021568 1025221 1027950 1029926
61176A029926J407N22r45k456l331l660m086m962o177p654r388j1051j2172j2734
$$ 1029926 1031333 1031855 1030910 1028454 1025123 1021463 1017377 1012415 1006238 998584 989196 978145 965973 953239
61162I53239j3161j3644j3936j3967j4116j4679j5351j5618j5330j4654j3648
$$ 953239 940078 926434 912498 898531 884415 869736 854385 838767 823437 808783 795135
61151G95135j2230j0440q493o584m831l410k495k060j865j702j629j865k542l572
$$ 795135 782905 772465 763972 757388 752557 749147 746652 744592 742727 741025 739396 737531 734989 731417
61137G31417m699n580n809n131l770k423j576r05L24K241M152N515O709Q426J0657
$$ 731417 726718 721138 715329 710198 706428 704005 702429 701524 701848 704089 708241 713756 720465 728891 739548
61122G39548J2760J4428J6033J7954J9944K1442K2303K3007K4131K5740K7356
$$ 739548 752308 766736 782769 800723 820667 842109 864412 887419 911550 937290 964646
61111I64646K8494K9077K9275K9104K8519K7740K6983K5915K3914K1079J8382
$$ 964646 993140 1022217 1051492 1080596 1109115 1136855 1163838 1189753 1213667 1234746 1253128
61100A253128J6461J4726J2183Q707M962J347k291o104r945j3646j7139k0234
$$ 1253128 1269589 1284315 1296498 1305205 1310167 1311514 1309223 1303119 1293174 1279528 1262389 1242155
61088A242155k2700k4464k5542k5959k5961k5979k6017k5460k3959k2107k0663
$$ 1242155 1219455 1194991 1169449 1143490 1117529 1091550 1065533 1040073 1016114 994007 973344
61077I73344j9567j8336j7063j6078j5059j3423j1496j0145r267p779n312k873
$$ 973344 953777 935441 918378 902300 887241 873818 862322 852177 842910 835131 829819 826946
61065H26946j432p79k46L23Q29J472K448L582M683N806O926P925R095J0947J3238
$$ 826946 825514 824735 824489 824812 825641 827113 829561 833143 837826 843632 850558 858483 867578 878525 891763
61050H91763J4962J5696J6228J7304J8563J9330J9794K0661K2137K3997K6165
$$ 891763 906725 922421 938649 955953 974516 993846 1013640 1034301 1056438 1080435 1106600
61039A106600K8533L0582L1937L3018L4580L6775L9222M1672M4064M6127M7585
$$ 1106600 1135133 1165715 1197652 1230670 1265250 1302025 1341247 1382919 1426983 1473110 1520695
61028A520695M8616M9677N0970N2408N3905N5457N7147N9277O2156O5672O9596
$$ 1520695 1569311 1618988 1669958 1722366 1776271 1831728 1888875 1948152 2010308 2075980 2145576
61017B145576P4408Q1047Q9521R8684J07959J18484J31900J48755J68999J93436
$$ 2145576 2219984 2301031 2390552 2489236 2597195 2715679 2847579 2996334 3165333 3358769
61007C358769K23904K62490L11325L72636M48406N40382O50412P79209R24538
$$ 3358769 3582673 3845163 4156488 4529124 4977530 5517912 6168324 6947533 7872071
60998G872071J082803J252364J429073J592380J699761J707126J602090J413559
$$ 7872071 8954874 10207238 11636311 13228691 14928452 16635578 18237668 19651227
60990A9651227J184103R37995O83731M42281K54449J47537R9637M9420n5378k24478
$$ 19651227 20835330 21773325 22457056 22899337 23153786 23301323 23400960 23450380 23395002 23170524
60980B3170524m38169o79835r43502j213492j451795j614468j678282j649204
$$ 23170524 22732355 22052520 21109018 19895526 18443731 16829263 15150981 13501777
60972A3501777j550447j408444j247105j085786r36552q03664o87066n85901m99158
$$ 13501777 11951330 10542886 9295781 8209995 7273443 6469779 5782713 5196812 4697654
60963D697654m25355l63082l11158k68041k32167k02919j79910j61234j44045
$$ 4697654 4272299 3909217 3598059 3330018 3097851 2894932 2715022 2553788 2409743
60954B409743j27375j12823j01675r2799q4250p5673o7995o1739n6781n3071n0518
$$ 2409743 2282368 2169545 2067870 1975071 1890821 1815148 1747153 1685414 1628633 1575562 1525044
60943A525044m8517m6431m4244m2213m0361l8754l7691l7107l6311l4836l2921
$$ 1525044 1476527 1430096 1385852 1343639 1303278 1264524 1226833 1189726 1153415 1118579 1085658
60932A085658l0832k8426k5900k4060k3217k2555k1329j9883j8713j7409j5518
$$ 1085658 1054826 1026400 1000500 976440 953223 930668 909339 889456 870743 853334 837816
60921H37816j3737j3064j3196j2945j1911j0678r680q876q424q511q557p694o148
$$ 837816 824079 811015 797819 784874 772963 762285 752605 743729 735305 726794 718237 710543 704395
60908G04395n132n149n315m706l532k502j754r45JQ42J499K129K777L216L216
$$ 704395 699263 694114 688799 684093 680561 678059 676305 675360 675361 676203 677702 679831 682608 685824 689040
60893F89040K870K608K801L366L882M085M018L715L227L063M032O155Q202Q912
$$ 689040 691910 694518 697319 700685 704567 708652 712670 716385 719612 722675 726707 732862 741064 749976
60879G49976Q438Q009Q437R595J1062J2574J3733J4142J4042J4293J5429J7083
$$ 749976 758414 766423 774860 784455 795517 808091 821824 835966 850008 864301 879730 896813
60867H96813J8576J9709K0687K1615K2357K2768K2813K2498K1806K0673J8931
$$ 896813 915389 935098 955785 977400 999757 1022525 1045338 1067836 1089642 1110315 1129246
60856A129246J6433J3322J0146P467N214K607j022n298r035j1638j3835j6601
$$ 1129246 1145679 1159001 1169147 1176614 1181828 1184435 1183413 1178115 1169080 1157442 1143607 1127006
60844A127006j9711k2002k2966k3274k3739k4482k5332k6264k7017k6992k6056
$$ 1127006 1107295 1085293 1062327 1039053 1015314 990832 965500 939236 912219 885227 859171
60833H59171k4914k4239k3776k2775k0919j8489j6136j4651j4406j4629j3976
$$ 859171 834257 810018 786242 763467 742548 724059 707923 693272 678866 664237 650261
60822F50261j2184j0417r487q739p411o073n611n622n133m369m311m804m647l448
$$ 650261 638077 627660 618173 609434 602023 595950 590339 584717 579584 575215 570904 566100 561453 558005
60808E58005k087j187m67K00K99k67p36n29N7N66R98J334J302R40O60M62p9q23
$$ 558005 555918 554731 554264 554464 554763 554496 553760 553231 553288 553854 554852 556186 557488 558428 559088 559550 559471 558648
60790E58648r95m39l1l19p48p72q32j401j962j832j471j885l112m212m576m443
$$ 558648 557653 557214 557183 556864 556116 555344 554512 553111 551149 549317 547846 545961 542849 538637 534061 529618
60774E29618m244m131m191m454m661m443l813l140k753k773l158l584l543k929
$$ 529618 525374 521243 517052 512598 507937 503494 499681 496541 493788 491015 487857 484273 480730 477801
60760D77801k358k476l064l262k667j810j458j695j811j092L20J433J453O88J19
$$ 477801 475443 472967 469903 466641 463974 462164 460706 459011 457200 456108 456428 457861 459314 460002 460121
60745D60121K12O66J143J639J936J605Q42N48J097J683J522R79Q21R13N97l8l42
$$ 460121 460333 460999 462142 463781 465717 467322 468164 468712 469809 471492 473014 473993 474814 475727 476324 476286 475944
60728D75944l58q19j871k709k796k610k855l519m069m157l828l335l061l302l940
$$ 475944 475586 474767 472896 470187 467391 464781 461926 458407 454338 450181 446353 443018 439957 436655 432715
60713D32715m508m709m596m219l536k727k219k161k214k079j920j972k005j534
$$ 432715 428207 423498 418902 414683 411147 408420 406201 404040 401826 399747 397827 395855 393850 392316
60699C92316n16N09R88Q59M99L06M09O84R30J020R13O50L31Q3K2K76R36J887K775
$$ 392316 391800 392309 393297 394156 394655 394961 395370 396054 396984 398004 398917 399567 399898 399981 400003 400279 401215 403102 405877
60680D05877L326L648L941M041L611K846K505K972L790M317M502M585M487L940
$$ 405877 409203 412851 416792 420833 424444 427290 429795 432767 436557 440874 445376 449961 454448 458388
60666D58388L081K341J967J994K449L155L552L265K653K283K100J738J396J593
$$ 458388 461469 463810 465777 467771 470220 473375 476927 480192 482845 485128 487228 488966 490362 491955
60652D91955K112K089J337O75P08J034J075R11P52K64r30k456l613m280m793n170
$$ 491955 494067 496156 497493 498168 498876 499910 500985 501896 502648 502912 501982 499526 495913 491633 486840 481670
60636D81670n085m496l755l168k879l051l618l998l586k569j717j337r30j05P20
$$ 481670 476585 472089 468334 465166 462287 459236 455618 451620 448034 445465 443748 442411 441481 441376 442096
60621D42096Q55L02k31j83K74N91N26K80L0l69r66j252o69M06Q45K39m28j23P72
$$ 442096 442951 443253 443022 442839 443113 443704 444230 444510 444540 444171 443205 441953 441284 441690 442535 442774 442346 442223 442995
60602D42995J086O59M73J073J816K006J843J775J704J449J365J765K099J549K42
$$ 442995 444081 444740 445213 446286 448102 450108 451951 453726 455430 456879 458244 460009 462108 463657 463899
60587D63899q56j121p35p9O74J265J375J099R04R10P52L69L94J352K934M372N352
$$ 463899 463043 461922 461187 461108 461782 463047 464422 465521 466425 467335 468087 468456 468850 470202 473136 477508 482860
60570D82860O125P022Q201R696J1344J2708J3385J3354J2829J1917J0634R149
$$ 482860 488985 496007 504208 513904 525248 537956 551341 564695 577524 589441 600075 609224
60558F09224P628N942L797J196j455l701n281o149o406o233n670m567k893j000
$$ 609224 616852 622794 626591 627787 626332 622631 617350 611201 604795 598562 592892 588325 585432 584432
60544E84432P23K321M034N748P134Q288R716J1550J3328J4707J5894J6983J7350
$$ 584432 585155 587476 591510 597258 604392 612680 622396 633946 647274 661981 677875 694858 712208
60531G12208J6283J3944J1209Q636O068L226K58k396m289n152n165n121n826p096
$$ 712208 728491 742435 753644 762280 768348 771574 771832 769436 765147 759995 754830 749709 743883 736787
60517G36787p725o779m689k758j820j639j502q91L01J811L124L873M315N199P024
$$ 736787 729062 722283 717594 714836 713016 711377 709875 708984 709285 711096 714220 718093 722408 727607 734631
60502G34631R587J2371J5141J8006K1072K4321K7741L1386L5193L8903M2124M4378
$$ 734631 744218 756589 771730 789736 810808 835129 862870 894256 929449 968352 1010476 1054854
60490A054854M5216M4390M1979L8128L2778K5793J7388Q228r99r998j8761k7063
$$ 1054854 1100070 1144460 1186439 1224567 1257345 1283138 1300526 1308754 1307755 1297757 1278996 1251933
60478A251933l4223l9529m2908m5027m6497m7037m5812m2684l8736l5257l2492
$$ 1251933 1217710 1178181 1135273 1090246 1043749 996712 950900 908216 869480 834223 801731
60467H01731k9843k7045k4509k2526k0728j8652j6397j4421j2926j1753j0712
$$ 801731 771888 744843 720334 697808 677080 658428 642031 627610 614684 602931 592219
60456E92219r723q741p734o729n804n054m609m488m476m315l984l614l143k444
$$ 592219 582496 573755 566021 559292 553488 548434 543825 539337 534861 530546 526562 522948 519805 517361
60442E17361j702j322j352j428j342j268j243r48k33M87P17L79l46j282k069k195
$$ 517361 515659 514337 512985 511557 510215 508947 507704 506756 506523 507010 507727 508106 507760 506478 504409 502214
60426E02214j625r99q73j084j245j307j245p25K54Q80M70m58p76j54Q56J841K727
$$ 502214 500589 499590 498717 497633 496388 495081 493836 493111 493365 494245 494715 494257 493481 493327 494183 496024 498751
60409D98751L168K698J604Q08P13Q53P23L07l05j015j367q31L17J111J128Q89
$$ 498751 501919 504617 506221 507029 507742 508595 509318 509625 509320 508305 506938 506107 506424 507535 508663 509552
60393E09552R24J125J289J542J868J979J958K346L153L506K821J706J185J499
$$ 509552 510476 511601 512890 514432 516300 518279 520237 522583 525736 529242 532063 533769 534954 536453
60379E36453K185K768K882K255J186O00J060K001K472K199J529Q04L58O05J489
$$ 536453 538638 541406 544288 546543 547729 548329 549389 551390 553862 556061 557590 558394 558752 559357 560846
60364E60846K190K018J360J090J376J687J736J750J975K459L145L734L705L052
$$ 560846 563036 565054 566414 567504 568880 570567 572303 574053 576028 578487 581632 585366 589071 592123
60350E92123K730L669N543P145P813P876P765P436O731N659M233K465N94j059
$$ 592123 594853 598522 604065 611210 619023 626899 634664 642100 648831 654490 658723 661188 661782 660723
60336F60723k459l698m619n007n063n169n326n222m783m196l585l089k997l292
$$ 660723 658264 654566 649947 644940 639877 634708 629382 624160 619377 615181 611596 608507 605510 602218
60322F02218l331k689j972k025k568k493j520m99K0N23J519K693L535M143M884
$$ 602218 598887 596198 594226 592201 589633 587140 585620 585121 585141 585664 587183 589876 593411 597554 602438
60307F02438N841P040Q769J1212J4054J6710J8678J9646J9661J9219J8588J7008
$$ 602438 608279 615319 624088 635300 649354 666064 684742 704388 724049 743268 761856 778864
60295G78864J3420Q068K527k203o605j1136j4927j6949j7641j8176j8578j7827
$$ 778864 792284 800352 802879 800676 794071 782935 768008 751059 733418 715242 696664 678837
60283F78837j5640j2971j0711q931p565o812o480n860m747l888l852m030l476
$$ 678837 663197 650226 639515 630584 623019 616207 609727 603867 599120 595232 591380 587350 583874
60270E83874k326j611j800k291k384k124j943j911j741j349j027j094j558k072
$$ 583874 581548 579937 578137 575846 573462 571338 569395 567484 565743 564394 563367 562273 560715 558643
60256E58643k149j470j96J029J548J233M96j51m30l15N6L33J90l27p81p83l47
$$ 558643 556494 555024 554828 555857 557405 558638 559134 558983 558553 558238 558294 558627 558817 558490 557709 556926 556579
60239E56579K34O29N90J01m44m74J03P59J027J082J372J975K644L238L684L727
$$ 556579 556813 557442 558032 558133 557689 557215 557318 558077 559104 560186 561558 563533 566177 569415 573099 576826
60223E76826L219K551K323K585K814K653K308K134K249K581L025L399L559L609
$$ 576826 580045 582596 584919 587504 590318 592971 595279 597413 599662 602243 605268 608667 612226 615835
60209F15835L800M199M632M971N142N000M455L817L605L997M616M953M788M299
$$ 615835 619635 623834 628466 633437 638579 643579 648034 651851 655456 659453 664069 669022 673810 678109
60195F78109L920L961M119L643K294Q73L32N81P64M77mn80j503k604l177k983
$$ 678109 682029 685990 690109 693752 696046 696919 697251 697832 698596 699073 699069 698489 696986 694382 691205 688222
60179F88222k687k970l715m349m478l953k922k088k249l157l442k282n81R8n87
$$ 688222 685535 682565 678850 674501 670023 666070 663148 661060 658811 655654 652212 649930 649349 649447 648860
60164F48860j585j879j453r27p91j057j332j161m51M90J343J961K164J801J187
$$ 648860 647275 645396 643943 643016 642225 641168 639836 638675 638224 638714 640057 642018 644182 645983 647170
60149F47170R58J257J539J478J563K296L357M096M444M743N004M965M741M698
$$ 647170 648128 649385 650924 652402 653965 656261 659618 663714 668158 672901 677905 682870 687611 692309
60135F92309M814M700M224L683L392L423L650L694L087J830N72j70o77j416k105
$$ 692309 697123 701823 706047 709730 713122 716545 720195 723889 726976 728806 729378 729208 728531 727115 725010
60120G25010k037j170j88M54R05J315J523J463J329J239J147J140J294J275O18
$$ 725010 722973 721803 721615 722069 722974 724289 725812 727275 728604 729843 730990 732130 733424 734699 735317
60105G35317n02j327j532j576j926k406k647k693k797k958k975k729k176j361
$$ 735317 734815 733488 731956 730380 728454 726048 723401 720708 717911 714953 711978 709249 707073 705712
60091G05712n82k23k12M3R36K211L453M582N508N702M772L293K366K249K006Q27
$$ 705712 705130 704907 704695 704738 705674 707885 711338 715920 721428 727130 731902 735195 737561 739810 741816 742643
60075G42643q16j842k109k622m023n606o273o084o165p140q357q821q335p317
$$ 742643 741827 739985 737876 735254 731231 725625 719352 713268 707103 699963 691606 682785 674450 667133
60061F67133o118n036m568n028n971o518o250n393m290l110k087j510j427j614
$$ 667133 661015 655979 651411 646383 640412 633894 627644 622251 617961 614851 612764 611254 609827 608213
60047F08213j828j812j242m5J351K487L429M351M859M467L589L171L269K987K076
$$ 608213 606385 604573 603331 603286 604637 607124 610553 614904 619763 624230 627819 630990 634259 637246 639322
60032F39322J529J990K487J740M9j164j402j572k443l682m690n527o516p431p706
$$ 639322 640851 642841 645328 647068 647117 645953 644551 642979 640536 636854 632164 626637 620121 612690 604984
60017F04984p221o473o017n928n795n093l719k250j494j657k098k039j423q54
$$ 604984 597763 591290 585273 579345 573550 568457 564738 562488 560994 559337 557239 555200 553777 552923
60003E52923p94j035j038n77j1J12l30q15p02N6Q19J050R47J104J674K211K380
$$ 552923 552129 551094 550056 549479 549468 549580 549250 548435 547733 547789 548608 549658 550605 551709 553383 555594 557974
59986E57974K395K554K702K541K290K507L220L688L220J965O92l2k24k66n36j165
$$ 557974 560369 562923 565625 568166 570456 572963 576183 579871 583091 585056 585748 585716 585492 585226 584690 583525
59970E83525j909k322k174j689j259r97p16k28M39J083J425J329J037J053J566
$$ 583525 581616 579294 577120 575431 574172 573175 572459 572231 572670 573753 575178 576507 577544 578597 580163
59955E80163K099K033J420R46J058J441J504J117O26L19J85J68L40P34J069R60
$$ 580163 582262 584295 585715 586661 587719 589160 590664 591781 592407 592726 592911 593079 593419 594153 595222 596182
59939E96182L52l35o86p71j045j755k622l178l240k971k552j975j125l3R69J398
$$ 596182 596534 596199 595513 594742 593697 591942 589320 586142 582902 579931 577379 575404 574279 574246 575215 576613
59923E76613J030K21l31j67O22J613K451K992L318L680M285N001N414N269M754
$$ 576613 577643 577864 577533 577366 577988 579601 582052 585044 588362 592042 596327 601328 606742 612011 616765
59908F16765M320M257M507M736M555L850K929K208J791J471J058M69l77j381k009
$$ 616765 621085 625342 629849 634585 639140 642990 645919 648127 649918 651389 652447 652916 652539 651158 649149
59893F49149j732q04j10p6k20M3O71J377K214L310M354M831M609M021L516L463
$$ 649149 647417 646613 646503 646427 646207 646250 646921 648298 650512 653822 658176 663007 667616 671637 675153 678616
59877F78616L883M211L799K881K468K889L194K522J301K41j066l294n624o332
$$ 678616 682499 686710 690509 693390 695858 698747 701941 704463 705764 706005 704939 701645 696021 689689
59863F89689n129l582k925k732k178j432j064r24n67r5J99O38J782L461M977O091
$$ 689689 684560 680978 678053 675321 673143 671711 670647 669723 669156 669061 669260 669898 671680 675141 680118 686209
59847F86209P206Q500R540R851R422Q478P105N381L677K525K094J937J440M72
$$ 686209 693415 701915 711455 721306 730728 739206 746311 751692 755369 757894 759988 761925 763365 763837
59833G63837m79q80p17m72p65k030m180o340p301o699n476m823m871m958m853
$$ 763837 763358 762478 761761 761289 760524 758494 754314 747974 740673 733974 728498 723675 718804 713846 708993
59818G08993m975n414n606n176m390l544k534j366n22l71o54r20j105j296j290
$$ 708993 704018 698604 692998 687822 683432 679888 677354 675988 675466 675095 674441 673521 672416 671120 669830
59803F69830r26n75q16j666k523k892k864k901l299l928m371m295l725k993k532
$$ 669830 668904 668329 667513 665847 663324 660432 657568 654667 651368 647440 643069 638774 635049 632056 629524
59788F29524k682l456m297m354l403k267j867k056j975j378q67p78o84l13j76
$$ 629524 626842 623386 619089 614735 611332 609065 607198 605142 603167 601789 600922 600144 599460 599147 598971
59773E98971p44j505j500n74M21N73j80j085j291o50K13P03R51J414J982K102
$$ 598971 598227 596722 595222 594648 595069 595642 595462 594377 593086 592436 592649 593352 594303 595717 597699 599801
59757E99801J738J509J741K115K437L014L876M394M157L641L431L312K805K179
$$ 599801 601539 603048 604789 606904 609341 612355 616231 620625 624782 628423 631854 635166 637971 640150
59743F40150K159K878L688L940L546K817K218K098K431K849L056L028K727K109
$$ 640150 642309 645187 648875 652815 656361 659178 661396 663494 665925 668774 671830 674858 677585 679694
59729F79694J500J382J578J326N16J12Q30K017K613K564K525K617K483K194K134
$$ 679694 681194 682576 684154 685480 685996 686108 686938 688955 691568 694132 696657 699274 701757 703951 706085
59714G06085K070J348P8p47n23K30O68N69K60Mk20n24q36q03j48Q01J342J328
$$ 706085 708155 709503 709581 708834 708311 708541 709209 709778 710038 710042 709822 709298 708462 707659 707511 708312 709654 710982
59696G10982J414K000K544K466K175K324K567K039Q14j64n76j023j799k393k496
$$ 710982 712396 714396 716940 719406 721581 723905 726472 728511 729325 729161 728585 727562 725763 723370 720874
59681G20874k414k207j359J18J144P82n75j877k726l353l776l766l526l714m655
$$ 720874 718460 716253 714894 715012 716156 716938 716363 714486 711760 708407 704631 700865 697339 693625 688970
59666F88970n909o606o130m595k873j938j918k005j504p13l71n20m18M19J545
$$ 688970 683061 676455 670325 665730 662857 660919 659001 656996 655492 654779 654408 653888 653470 653889 655434
59651F55434K130J937J500J399J597J640J306Q19M27O6l91p94r49r77j138j399
$$ 655434 657564 659501 661001 662400 663997 665637 666943 667762 668189 668255 667864 667070 666121 665144 664006 662607
59635F62607j536j529j530j402q11K14J120J400J073M86m7l39l64l65o33j162
$$ 662607 661071 659542 658012 656610 655799 656013 657133 658533 659606 660092 660045 659706 659342 658977 658344 657182
59619F57182j669k020k326k519k272j557r70j109j790k228j915j031M6J219K490
$$ 657182 655513 653493 651167 648648 646376 644819 643849 642740 640950 638722 636807 635776 635822 637041 639531
59604F39531L531L820L259K312J460P52J51l4L86Q19M19o61j231o04N43J253J467
$$ 639531 643062 646882 650141 652453 653913 654665 654816 654782 655168 655987 656406 655745 654514 653910 654453 655706 657173
59587F57173J487R59n66k407l197k612j713j428j527j382r67o51n83p65j323k198
$$ 657173 658660 659619 659053 656646 653449 650837 649124 647696 646169 644787 643820 643169 642586 641821 640498 638300
59571F38300k841k643j608l79L19J74n25j100j045m87Q4M88R41J437J523R55K38
$$ 638300 635459 632816 631208 630829 631148 631322 630797 629697 628652 628165 628249 628737 629678 631115 632638 633593 633831
59554F33831J11O37J128J042P27J107K588M452N475N114L854K605K119K881M889
$$ 633831 633942 634579 635707 636749 637476 638583 641171 645623 651098 656212 660066 662671 664790 667671 672560
59539F72560P284Q952R904J1339J3735J5630J5209J2582R380O522L605M27k223
$$ 672560 679844 688796 698700 710039 723774 739404 754613 767195 776575 783097 786702 787129 784906
59526G84906l619l833l110j436P99K608L424L656L852L915L518K682J517k4j764
$$ 784906 781287 777454 774344 772908 773707 776315 779739 783395 787247 791162 794680 797362 798879 798855 797091
59511G97091l251m400n576o732p292p242p470q393r066q459o975n837n446n231
$$ 797091 793840 789440 783864 777132 769840 762598 755128 746735 737669 729210 722235 716398 710952 705721
59497G05721m762m149l505k765k013j387p86q2N50R65J359J813J928J471J037
$$ 705721 700959 696810 693305 690540 688527 687140 686354 686272 686822 687787 689146 690959 692887 694358 695395
59482F95395J358K247K971L478M428O108P971R286R675R079P811O640O178O062
$$ 695395 696753 699000 701971 705449 709877 715985 723956 733242 742917 751996 759807 766447 772625 778687
59468G78687N356L792K129J176J005J238J639K175K823L527M238M967N927P389
$$ 778687 784043 787835 789964 791140 792145 793383 795022 797197 800020 803547 807785 812752 818679 826068
59454H26068R127J0335J0622J0763J1796J3518J4703J4686J3915J2790J0983Q336
$$ 826068 835195 845530 856152 866915 878711 892229 906932 921618 935533 948323 959306 967642
59442I67642N480K867r8m055q233j1039j2009j2234j2662j2879j2078j0581r478
$$ 967642 973122 975989 975891 971836 963603 952564 940555 928321 915659 902780 890702 880121 870643
59429H70643r112q715p671o344n335m519l290j382J066L908O839R266J1020J2951
$$ 870643 861531 852816 845145 838801 833466 828947 825657 824275 825341 829249 836088 845354 856374 869325
59415H69325J5910J9315K1798K3226K4704K6172K5541K1261J4597Q093K564k798
$$ 869325 885235 904550 926348 949574 974278 1000450 1025991 1047252 1061849 1069942 1072506 1069708
59403A069708q017j1779j3265j2923j1124p694l448p10j204m209p767j1030j4403
$$ 1069708 1061691 1049912 1036647 1023724 1012600 1004906 1001458 1000748 999544 995335 987568 976538 962135
59390I62135j7935k0768k2201k2302k1361j9435j6658j3496j0437p793n850m789
$$ 962135 944200 923432 901231 878929 857568 838133 821475 807979 797542 789749 783899 779110
59378G79110m256l405j726L02J725K156K063K068K245K306K259K512L254M024
$$ 779110 774854 771449 769723 770025 771750 773906 775969 778037 780282 782588 784847 787359 790613 794637
59364G94637M227L934L885M601N731O444O331N796N567O029P032Q245R506J0770
$$ 794637 798864 802798 806683 811284 817015 823459 829790 835586 841153 847182 854214 862459 871965 882735
59350H82735J1930J2878J3749J4811J5995J6812J6920J6552J6152J5694J4783
$$ 882735 894665 907543 921292 936103 952098 968910 985830 1002382 1018534 1034228 1049011
59339A049011J3322J1687J0189Q651O706M253J484j421m484p779j1143j4014j5725
$$ 1049011 1062333 1074020 1084209 1092860 1099566 1103819 1105303 1103882 1099398 1091619 1080476 1066462 1050737
59326A050737j6149j5935j5847j5939j5709j4967j4104j3316j2224j0551q795
$$ 1050737 1034588 1018653 1002806 986867 971158 956191 942087 928771 916547 905996 897201
59315H97201p692p148o382n072l769k964k328j236K35J358J697J632J933L085
$$ 897201 889509 882361 875979 870907 867138 864174 861846 860610 860845 862203 863900 865532 867465 870550
59301H70550M947O840Q052Q552R071J0121J1040J0613Q603N949L221k11m848r655
$$ 870550 875497 882337 890389 898941 908012 918133 929173 939786 948389 954338 957559 957348 952500 942845
59287I42845j2922j4141j4088j3310j1678r439p526o342n128l144p73J136K427
$$ 942845 929923 915782 901694 888384 876706 867267 859741 853399 848271 845127 844354 845490 847917
59274H47917L518M557N476O525Q028R695J0849J1316J1597J2005J2133J1331R441
$$ 847917 851435 855992 861468 867993 876021 885716 896565 907881 919478 931483 943616 954947 964388
59261I64388O933M410K116j02k375m495o238p810r549j1170j1919j1630j0996
$$ 964388 971321 975731 977847 977745 975370 970875 964637 956827 947278 936108 924189 912559 901563
59248I01563j0512r752q235o363m818l556k175q99k19K55J533L725N659O351O124
$$ 901563 891051 881299 873064 866701 861883 858327 856152 855253 855034 855289 856822 860547 866206 872557 878681
59233H78681N869N853N738N354M819M149L194J980P71k39j129k103l246m415n359
$$ 878681 884550 890403 896141 901495 906314 910463 913657 915637 916408 916169 915040 912937 909691 905276 899917
59218H99917n922o131o074n780n268m628l942l226k503j832j258q58p65r29q81
$$ 899917 893995 887864 881790 876010 870742 866114 862172 858946 856443 854611 853353 852495 851730 850801 849920
59203H49920j54R38J509J256Q70R12Q61k9j397k043j430j94P88J199J057M31m16
$$ 849920 849766 850704 852213 853469 854339 855251 856112 856083 854686 852643 851213 851019 851807 853006 854063 854494 854078
59186H54078j044j218j036o10O2Q38J419J719J921K097K070J794J554J676K231
$$ 854078 853034 851816 850780 850170 850232 851070 852489 854208 856129 858226 860296 862090 863644 865320 867551
59171H67551L100M168N343O512P553Q323Q778R177R927J0948J1484J0834R244
$$ 867551 870651 874819 880162 886674 894227 902550 911328 920505 930432 941380 952864 963698 972942
59158I72942P658O698O117N267L750J656n57k447l981n480p049q292q818q780
$$ 972942 980600 987298 993415 998682 1002432 1004088 1003531 1001084 997103 991623 984574 976282 967464 958684
59144I58684q635q614q712q882q939q545p679o812o342o172o151o399o748o447
$$ 958684 950049 941435 932723 923841 914902 906357 898678 891866 885524 879352 873201 866802 860054 853607
59130H53607n116l525k640k318j816j147q78q59k80R60K120K958M123N956P766
$$ 853607 848491 844966 842326 840008 838192 837045 836167 835308 835028 835988 838108 841066 845189 851145 858911
59115H58911Q771Q945Q691Q295Q059Q244Q615Q608Q137P655P263O501N253M090
$$ 858911 867682 876627 885318 893613 901672 909916 918531 927139 935276 942931 950194 956695 961948 966038
59101I66038L404K894K246J631J156M77n65j487j748j438j033r08j165j578j563
$$ 966038 969442 972336 974582 976213 977369 977846 977281 975794 974046 972608 971575 970667 969502 967924 966361
59086I66361q54j84n90j964l079l218k925k928l281l862m760n736o151n950n793
$$ 966361 965507 965323 964733 962769 959690 956472 953547 950619 947338 943476 938716 932980 926829 920879 915086
59071I15086n873n546m667m127m384m571l990l405l758m493m465l759l247k873
$$ 915086 909213 903667 899000 894873 890489 885918 881928 878523 874765 870272 865807 862048 858801 855928
59057H55928j833k66P35P74O12P84Q60L58m60j074j310j232r25n89m52m80n07
$$ 855928 854095 853829 854564 855338 855950 856734 857594 857952 857492 856418 855108 853876 852951 852362 851910 851430 850923
59040H50923n16n15l16Q0K31j38n27k78M37R38J095J389K005K632L073L447L840
$$ 850923 850407 849892 849576 849656 849887 849749 849222 848944 849381 850319 851414 852803 854808 857440 860513 863960 867800
59023H67800M285N035O202P304P799P936Q334Q903Q876P934O517N065L698K643
$$ 867800 872085 877120 883322 890626 898425 906361 914695 923598 932474 940408 946925 951990 955688 958331
59009I58331K137J870J280N49M65J163J824J948K082K898M226N465O376O994P280
$$ 958331 960468 962338 963618 964167 964632 965795 967619 969567 971649 974547 978773 984238 990614 997608 1004888
58994A004888P319P465P839Q015P549O572N495M506L611K820K018J017n8p79j091
$$ 1004888 1012207 1019672 1027511 1035526 1043075 1049647 1055142 1059648 1063259 1066079 1068097 1069114 1069056 1068277 1067186
58979A067186j538k435l219l143k250j115J17J863M202O528Q220R356J0471J1779
$$ 1067186 1065648 1063213 1059994 1056851 1054601 1053486 1053603 1055466 1059668 1066196 1074416 1083772 1094243 1106022
58965A106022J2901J3348J3142J2748J2450J1961J0899R410Q024O880N501L427
$$ 1106022 1118923 1132271 1145413 1158161 1170611 1182572 1193471 1202881 1210905 1217785 1223286 1226713
58953A226713P17k339n612q883j1558j3117j3820j4486j5503j6343j6265j5238
$$ 1226713 1227430 1225091 1219479 1210596 1199038 1185921 1172101 1157615 1142112 1125769 1109504 1094266
58941A094266j3903j2715j1454r732p730o111n234m723m002l061k406k325k481
$$ 1094266 1080363 1067648 1056194 1046462 1038732 1032621 1027387 1022664 1018662 1015601 1013195 1010870 1008389
58928A008389k387k012j728j706j700j470j167j093j180j025m66K26P34R89R35
$$ 1008389 1006002 1003990 1002262 1000556 998856 997386 996219 995126 993946 992921 992455 992681 993415 994404 995339
58913I95339N54L06J029K773M247M261L452L601N269P167Q199Q889J0157J1668
$$ 995339 995893 996199 997228 1000001 1004248 1008509 1011961 1015562 1020831 1027998 1036197 1045086 1055243 1066911
58899A066911J2508J2823J3566J4822J5573J5283J4700J4696J5103J5242J5135
$$ 1066911 1079419 1092242 1105808 1120630 1136203 1151486 1166186 1180882 1195985 1211227 1226362
58888A226362J5472J6646J8364K0236K2191K4048K5023K4241K1681J8298J4947
$$ 1226362 1241834 1258480 1276844 1297080 1319271 1343319 1368342 1392583 1414264 1432562 1447509
58877A447509J1566P707L470n43m093p509j1037j4420j7226j9161k0073k0073
$$ 1447509 1459075 1466782 1470252 1469709 1465616 1458107 1447070 1432650 1415424 1396263 1376190 1356117
58865A356117j9611j8982j7873j6058j4292j3593j3635j3030j1472j0400j0929
$$ 1356117 1336506 1317524 1299651 1283593 1269301 1255708 1242073 1229043 1217571 1207171 1196242
58854A196242j2238j2825j2438j1757j0992r949q984q697q904q878q400p775p080
$$ 1196242 1184004 1171179 1158741 1146984 1135992 1126043 1117059 1108362 1099458 1090580 1082180 1074405 1067325
58841A067325o218n495n247n202m944m713m857m960m426l672l561l916l799l153
$$ 1067325 1061107 1055612 1050365 1045163 1040219 1035506 1030649 1025689 1021263 1017591 1014030 1010114 1006315 1003162
58827A003162k826k895k326o49J155J978J853J478J346J817L156M903N926N673
$$ 1003162 1000336 997441 995115 994466 995621 997599 999452 1000930 1002276 1004093 1007249 1012152 1018078 1023751
58813A023751M839M384M461M692M787M443L278J512J29k46k77r69k180k767k167
$$ 1023751 1028590 1032974 1037435 1042127 1046914 1051357 1054635 1056147 1056276 1056030 1055753 1054784 1052604 1049837 1047670
58798A047670j145q70j635k758l461l603l497l314k962k499k219k137j833j081
$$ 1047670 1046525 1045655 1044020 1041262 1037801 1034198 1030701 1027387 1024425 1021926 1019707 1017570 1015737 1014656
58784A014656k35M00J091K027K737K836K893L582M378M180L019J955J310L37j150
$$ 1014656 1014421 1014821 1015912 1017939 1020676 1023512 1026405 1029987 1034365 1038545 1041564 1043519 1044829 1045166 1044016
58769A044016k183k224k086k570l150k964k291k052k295k172j214R5R49R64L51
$$ 1044016 1041833 1039609 1037523 1034953 1031803 1028839 1026548 1024496 1022201 1020029 1018815 1018910 1019859 1020823 1021174
58754A021174k02L8J207K665L652L915L668L296L246L793M640N154N168N167N524
$$ 1021174 1020972 1021010 1022217 1024882 1028534 1032449 1036117 1039413 1042659 1046452 1051092 1056246 1061414 1066581 1072105
58739A072105N992O225O321O559O977P497Q070Q465Q213P166N869N164N466O472
$$ 1072105 1078097 1084322 1090643 1097202 1104179 1111676 1119746 1128211 1136424 1143590 1149459 1154623 1160089 1166561
58725A166561P306P139O008M919M665M834M624M307M883O328P437P585P503P877
$$ 1166561 1173867 1181006 1187014 1191933 1196598 1201432 1206056 1210363 1215246 1221574 1229011 1236596 1244099 1251976
58711A251976Q297Q197P761P199O084M260K494J328L8k229n001p208q793j0452
$$ 1251976 1260273 1268470 1276231 1283430 1289514 1293774 1296268 1297596 1297634 1295405 1290404 1283196 1274403 1263951
58697A263951j2264j3744j4885j5984j6608j5956j4263j2665j1616j0510r073
$$ 1263951 1251687 1237943 1223058 1207074 1190466 1174510 1160247 1147582 1135966 1125456 1116383
58686A116383p965p577p252o333n235m747m791m563l685k567j798j550j502j128
$$ 1116383 1108418 1100841 1093589 1087256 1082021 1077274 1072483 1067920 1064235 1061668 1059870 1058320 1056818 1055690
58672A055690j17J181J984J956J765K387L943N615O724P525Q632R966J0666J0080
$$ 1055690 1055573 1056754 1058738 1060694 1062459 1064846 1068789 1074404 1081128 1088653 1097285 1107251 1117917 1127997
58658A127997Q499O698N028L220J059j128k710l347l191k662k165j942j998k145
$$ 1127997 1136496 1143194 1148222 1151442 1152501 1151373 1148663 1145316 1142125 1139463 1137298 1135356 1133358 1131213
58644A131213k106j758j325j178j359j428r91j77P15J822L381M885N378M809M246
$$ 1131213 1129107 1127349 1126024 1124846 1123487 1122059 1121068 1120891 1121606 1123428 1126809 1131694 1137072 1141881 1146127
58629A146127M414M769M643M421M697M929M109K460J294J282J840K260K511K823
$$ 1146127 1150541 1155310 1159953 1164374 1169071 1174000 1178109 1180569 1181863 1183145 1184985 1187245 1189756 1192579
58615A192579L308M140N391O612P239P358P392P149O096M541L527L403L389K790
$$ 1192579 1195887 1200027 1205418 1212030 1219269 1226627 1234019 1241168 1247264 1251805 1255332 1258735 1262124 1264914
58601A264914J729N25q06k111k935l085k767k057r64M3M02L90P82J613K242K740
$$ 1264914 1266643 1267168 1266362 1264251 1261316 1258231 1255464 1253407 1252443 1252486 1252888 1253278 1254060 1255673 1257915 1260655
58585A260655L961O029P981R150R823J0188R954R442R726J0990J1934J1521J0229
$$ 1260655 1264616 1270645 1278626 1287776 1297599 1307787 1317741 1327183 1336909 1347899 1359833 1371354 1381583
58572A381583Q949P836P001P126Q334R520R862J0138J1522J3843J6029J7614J8813
$$ 1381583 1390532 1398368 1405369 1412495 1420829 1430349 1440211 1450349 1461871 1475714 1491743 1509357 1528170
58559A528170J9685K0144K0247J9818J8372J6036J3767J1931R581N965J907j201
$$ 1528170 1547855 1567999 1588246 1608064 1626436 1642472 1656239 1668170 1677751 1683716 1685623 1684422
58547A684422l001l863l903l359l157l964n222o153p054q592j0491j1975j2919
$$ 1684422 1681421 1677558 1673655 1670296 1667139 1663175 1657953 1651800 1644746 1636154 1625663 1613688 1600769
58534A600769j3605j3887j3635j3289j2982j1884r519o956n466m611l068p69J218
$$ 1600769 1587164 1573277 1559642 1546353 1533371 1521487 1511968 1505012 1499546 1494935 1491867 1491098 1492316
58521A492316K462L413M166M430M492M888N271M835L759L037K891K578J740P88
$$ 1492316 1494778 1498191 1502357 1506787 1511279 1516167 1521438 1526273 1530032 1533069 1535960 1538538 1540278 1541066
58507A541066p2j171k561l717m125l616k323r10l68q72j323q86l03n95j247j048
$$ 1541066 1540994 1539823 1537262 1533545 1529420 1525804 1523481 1522571 1522203 1521331 1520008 1519122 1518819 1518224 1516977 1515929
58491A515929j27M08M34P65J369J403J090J802L867N869O669O857P547Q882J0353
$$ 1515929 1515802 1516210 1516644 1517409 1518778 1520181 1521271 1523073 1526940 1532809 1539478 1546335 1553882 1562764 1573117
58476A573117J1659J2583J2756J2156J1321J0554R454P559N038K475L25j193k041
$$ 1573117 1584776 1597359 1610115 1622271 1633592 1644146 1653600 1661159 1666197 1668672 1668997 1667804 1665763
58463A665763k374k442k412k322k049j252K42J963L256M371O196Q646J0331J0426
$$ 1665763 1663389 1660947 1658535 1656213 1654164 1652912 1653154 1655117 1658373 1662744 1668940 1677586 1687917 1698343
58449A698343R811R537R222P965N936L863J734o60k654l377l070k479j656m30
$$ 1698343 1708154 1717691 1726913 1734878 1740814 1744677 1746411 1745751 1743097 1739720 1736650 1734171 1732515 1732085
58435A732085N91Q82J148K284L783M603M995N947P388Q461R130R956J0698J0767
$$ 1732085 1732676 1733558 1734706 1736990 1740773 1745376 1750371 1756318 1763706 1772167 1781297 1791253 1801951 1812718
58421A812718J0654J1213J1897J1378R666P895O308M220J863M09M3l57j412k615
$$ 1812718 1823372 1834585 1846482 1857860 1867526 1875421 1881729 1885949 1887812 1888221 1888264 1887907 1886495 1883880
58407A883880l524m230m685m769m935n471n475l962j593J74J169K195L212L627
$$ 1883880 1880356 1876126 1871441 1866672 1861737 1856266 1850791 1846829 1845236 1845410 1846579 1848774 1851986 1855613
58393A855613L905M872N926N903N343N639O396O098N148N525P334Q402P780O973
$$ 1855613 1859518 1864390 1870316 1876219 1881562 1887201 1893597 1899695 1904843 1910368 1917702 1926104 1933884 1940857
58379A940857P117P492P574Q163R406R944R200Q497Q861R508R565R580J0262J1190
$$ 1940857 1947974 1955466 1963040 1971203 1980609 1990553 1999753 2008250 2017111 2026619 2036184 2045764 2056026 2067216
58365B067216J1837J2488J3337J3893J4002J4281J5020J5776J6325J6787J6800
$$ 2067216 2079053 2091541 2104878 2118771 2132773 2147054 2162074 2177850 2194175 2210962 2227762
58354B227762J5905J4706J4126J3761J2671J1357J0937J0816R638Q110Q189R566
$$ 2227762 2243667 2258373 2272499 2286260 2298931 2310288 2321225 2332041 2341679 2349789 2357978 2367544
58342B367544J0092R689J0541J2940J4411J3997J3993J6042J8570J9729K0027
$$ 2367544 2377636 2387325 2397866 2410806 2425217 2439214 2453207 2469249 2487819 2507548 2527575
58331B527575K0372K0247J9533J9624K0936K1641K0618J9336J9120J8890J7436
$$ 2527575 2547947 2568194 2587727 2607351 2628287 2649928 2670546 2689882 2709002 2727892 2745328
58320B745328J5738J5037J4658J3650J2792J3083J3949J4524J5184J6301J7218
$$ 2745328 2761066 2776103 2790761 2804411 2817203 2830286 2844235 2858759 2873943 2890244 2907462
58309B907462J7730J8839K0770K2179K2464K2848K4022K4946K5076K5485K6491
$$ 2907462 2925192 2944031 2964801 2986980 3009444 3032292 3056314 3081260 3106336 3131821 3158312
58298C158312K6753K6042K6275K8247L0038L0301L0426L1617L2661L2627L3054
$$ 3158312 3185065 3211107 3237382 3265629 3295667 3325968 3356394 3388011 3420672 3453299 3486353
58287C486353L5132L7247L7698L7590L8658M0410M1614M2550M3721M4397M4406
$$ 3486353 3521485 3558732 3596430 3634020 3672678 3713088 3754702 3797252 3840973 3885370 3929776
58276C929776M5176M7173M8661M8810M9503N2103N5118N7064N8998O2039O5154
$$ 3929776 3974952 4022125 4070786 4119596 4169099 4221202 4276320 4333384 4392382 4454421 4519575
58265D519575O7556P0522P4687P8302Q0358Q2463Q5589Q8156Q9479R1630R5515
$$ 4519575 4587131 4657653 4732340 4810642 4891000 4973463 5059052 5147208 5236687 5328317 5423832
58254E423832R8689R9663J00669J03466J06326J08058J10963J16543J22317J26376
$$ 5423832 5522521 5622184 5722853 5826319 5932645 6040703 6151666 6268209 6390526 6516902
58244F516902J30975J38090J45580J51556J58275J67624J77120J84565J92399
$$ 6516902 6647877 6785967 6931547 7083103 7241378 7409002 7586122 7770687 7963086
58235G963086K03010K14283K24318K35860K51148K67146K81101K95969L14935
$$ 7963086 8166096 8380379 8604697 8840557 9091705 9358851 9639952 9935921 10250856
58226A0250856L35622L55460L77575M05085M34902M63776M95147N33040N74744
$$ 10250856 10586478 10941938 11319513 11724598 12159500 12623276 13118423 13651463 14226207
58217A4226207O17015O63903P20399P84012Q51055R25586J013350J113000J222685
$$ 14226207 14843222 15507125 16227524 17011536 17862591 18788177 19801527 20914527 22137212
58208B2137212J349163J500526J676694J877821K115161K402428K744591L148490
$$ 22137212 23486375 24986901 26663595 28541416 30656577 33059005 35803596 38952086
58200C8952086L636961M238929M973827N859420O924207Q196895R697487J1455119
$$ 38952086 42589047 46827976 51801803 57661223 64585430 72782325 82479812 93934931
58192I3934931J3509912J5862979J8438999K1123293K3783443K6154448K7692682
$$ 93934931 107444843 123307822 141746821 162870114 186653557 212808005 240500687
58185B40500687K7660018K5472185K1006661J4610240O911157j309890r166281
$$ 240500687 268160705 293632890 314639551 329249791 336160948 334851058 325684777
58178C25684777j5796115k0600805k3409492k4443594k4151132k3031044k1492538
$$ 325684777 309888662 289287857 265878365 241434771 217283639 194252595 172760057
58171A72760057j9774574j7966861j6107472j4253296j2470351j0802687r279035
$$ 172760057 152985483 135018622 118911150 104657854 92187503 81384816 72105781
58164G2105781p929613o772623n796125m971983m279522l703161l219897k806872
$$ 72105781 64176168 57403545 51607420 46635437 42355915 38652754 35432857 32625985
58156C2625985k455108k162517j919409j712571j537158j392574j271565j164189
$$ 32625985 30170877 28008360 26088951 24376380 22839222 21446648 20175083 19010894
58148A9010894j068232r85787r13377q44700p79462p20770o66970o14181n63948
$$ 19010894 17942662 16956875 16043498 15198798 14419336 13698566 13031596 12417415 11853467
58139A1853467n20623m83740m50009m20142l96815l78231l60287l43070l29122
$$ 11853467 11332844 10849104 10399095 9978953 9582138 9203907 8843620 8500550 8171428
58130H171428l17346l04418k90325k77082k63884k48699k32729k18398k04892
$$ 8171428 7854082 7549664 7259339 6982257 6718373 6469674 6236945 6018547 5813655
58121E813655j90353j76359j65447j56310j46209j36054j28376j22257j15042
$$ 5813655 5623302 5446943 5281496 5125186 4978977 4842923 4714547 4592290 4477248
58112D477248j07307j01384r6607r0684q4298p9791p6576p2260o7145o3357o0609
$$ 4477248 4369941 4268557 4171950 4081266 3996968 3917177 3840601 3768341 3701196 3637839 3577230
58101C577230n6963n2826n0153m8605m6271m3374m1572m0491l8493l5948l4317
$$ 3577230 3520267 3467441 3417288 3368683 3322412 3279038 3237466 3196975 3158482 3122534 3088217
58090C088217l2972l0359k7298k5645k4758k2816k0530j9895k0250j9370j7659
$$ 3088217 3055245 3024886 2997588 2971943 2947185 2924369 2903839 2883944 2863694 2844324 2826665
58079B826665j7424j8493j8396j6671j5346j5184j4832j3769j2995j2690j2027
$$ 2826665 2809241 2790748 2772352 2755681 2740335 2725151 2710319 2696550 2683555 2670865 2658838
58068B658838j1275j1342j1483j0277q499q071q546p732n659m650n269n492m373
$$ 2658838 2647563 2636221 2624738 2614461 2605962 2597891 2589345 2581613 2575954 2571304 2566035 2560543 2556170
58055B556170l493l947m604m400l987m104m211l693k868k180j643j430j759k100
$$ 2556170 2552677 2548730 2544126 2539726 2535739 2531635 2527424 2523731 2520863 2518683 2517040 2515610 2513851 2511751
58041B511751j760j191j347k030k273k029k006k186k003j638j719k097k314k701
$$ 2511751 2509991 2508800 2507453 2505423 2503150 2501121 2499115 2496929 2494926 2493288 2491569 2489472 2487158 2484457
58027B484457l612m360m375m509n469o009m698k524j536j677j336l23J95K08P80
$$ 2484457 2480845 2476485 2472110 2467601 2462132 2456123 2451425 2448901 2447365 2445688 2444352 2444029 2444224 2444432 2445212
58012B445212J703J710R89J057K097K745K612K806L644M070L654L304L539L891
$$ 2445212 2446915 2448625 2449614 2450671 2452768 2455513 2458125 2460931 2464575 2468645 2472299 2475603 2479142 2483033
57998B483033M189M838N608N782N601N991O881P367P377P573P772P216O214N789
$$ 2483033 2487222 2492060 2497668 2503450 2509051 2515042 2521923 2529290 2536667 2544240 2552012 2559228 2565442 2571231
57984B571231N859N537M906M691M506L480K289K430L633M176L674L371L651L585
$$ 2571231 2577090 2582627 2587533 2592224 2596730 2600210 2602499 2604929 2608562 2612738 2616412 2619783 2623434 2627019
57970B627019L036K950L391L457L343M253N983O858O355N614N149M433M002N252
$$ 2627019 2630055 2633005 2636396 2639853 2643196 2647449 2653432 2660290 2666645 2672259 2677408 2681841 2685843 2691095
57956B691095P553Q240O467M600M632N600N861N678O015O620O904P215P859Q265
$$ 2691095 2698648 2706888 2713355 2717955 2722587 2728187 2734048 2739726 2745741 2752361 2759265 2766480 2774339 2782604
57942B782604Q251Q747J0180J1494J1887J2083J2869J3766J4150J4410J4910J5139
$$ 2782604 2790855 2799602 2809782 2821276 2833163 2845246 2858115 2871881 2886031 2900441 2915351 2930490
57930B930490J4801J4434J4068J2740J0335Q337P685P285N890M013K616J289p58
$$ 2930490 2945291 2959725 2973793 2986533 2996868 3005205 3012890 3020175 3026065 3030078 3032694 3033983 3033225
57917C033225k936m037l956l389k613j683j022p31o8J377K816L526L974M746N371
$$ 3033225 3030289 3026252 3022296 3018907 3016294 3014611 3013589 3012858 3012790 3014167 3016983 3020509 3024483 3029229 3034600
57902C034600N352N320N880O298N710M850N098O378P417P670P637P607P381P155
$$ 3034600 3039952 3045272 3051152 3057450 3063160 3068010 3073108 3079486 3086903 3094573 3102210 3109817 3117198 3124353
57888C124353P436Q151Q737R093R568J0102J0152R557Q788Q323Q183Q034P468
$$ 3124353 3131789 3139940 3148677 3157770 3167338 3177440 3187592 3197149 3205937 3214260 3222443 3230477 3237945
57875C237945O361N163M509M448M372L930L408L073K855K848L338M049M274L999
$$ 3237945 3244306 3249469 3253978 3258426 3262798 3266728 3270136 3273209 3276064 3278912 3282250 3286299 3290573 3294572
57861C294572M066M808N503N685N981O957Q124Q826R288R912J0377J0215R708
$$ 3294572 3298638 3303446 3308949 3314634 3320615 3327572 3335696 3344522 3353810 3363722 3374099 3384314 3394022
57848C394022R350R080Q694Q416Q333Q020P380P138P711Q271P858O799O149O269
$$ 3394022 3403372 3412452 3421146 3429562 3437895 3445915 3453295 3460433 3468144 3476415 3484273 3491072 3497221 3503490
57834C503490O766P344P910Q248Q355Q645R233R549R299R170R839J0918J1698
$$ 3503490 3510256 3517600 3525510 3533758 3542113 3550758 3559991 3569540 3578839 3588009 3597848 3608766 3620464
57821C620464J2249J2897J3239J2764J2013J2064J3041J4071J4484J4272J3526
$$ 3620464 3632713 3645610 3658849 3671613 3683626 3695690 3708731 3722802 3737286 3751558 3765084
57810C765084J2331J1135J0512J0453J0357R640Q110O066M305L630L971M425M494
$$ 3765084 3777415 3788550 3799062 3809515 3819872 3829512 3837622 3843688 3847993 3851623 3855594 3860019 3864513
57797C864513M624N177N670N642N535N927O567O921P109P530Q132Q791R770J1069
$$ 3864513 3869137 3874314 3879984 3885626 3891161 3897088 3903655 3910576 3917685 3925215 3933347 3942138 3951908 3962977
57783C962977J1972J2110J2261J3063J3737J3246J2186J2113J3338J4719J5493
$$ 3962977 3974949 3987059 3999320 4012383 4026120 4039366 4051552 4063665 4077003 4091722 4107215
57772D107215J5903J6114J5836J5222J4936J4968J4525J3405J2501J2415J2481
$$ 4107215 4123118 4139232 4155068 4170290 4185226 4200194 4214719 4228124 4240625 4253040 4265521
57761D265521J1791J0510R494Q980Q374P250O071N771O683Q071Q876Q900Q937
$$ 4265521 4277312 4287822 4297316 4306296 4314670 4321920 4327991 4333762 4340445 4348516 4357392 4366292 4375229
57748D375229R642J0723J1505J1884J2215J2642J3051J3504J4157J4753J4728
$$ 4375229 4384871 4395594 4407099 4418983 4431198 4443840 4456891 4470395 4484552 4499305 4514033
57737D514033J3828J2395J1050J0260J0084J0218J0399J0773J1493J2130J2057
$$ 4514033 4527861 4540256 4551306 4561566 4571650 4581868 4592267 4603040 4614533 4626663 4638720
57726D638720J1488J1338J1875J2394J2458J2544J2900J2847J2042J1416J1855
$$ 4638720 4650208 4661546 4673421 4685815 4698273 4710817 4723717 4736564 4748606 4760022 4771877
57715D771877J2693J2735J2152J2060J2572J2614J1668J0473R908J0068J0658
$$ 4771877 4784570 4797305 4809457 4821517 4834089 4846703 4858371 4868844 4878752 4888820 4899478
57704D899478J1444J2163J2594J2910J3412J3967J4209J4211J4371J4728J4900
$$ 4899478 4910922 4923085 4935679 4948589 4962001 4975968 4990177 5004388 5018759 5033487 5048387
57693E048387J4703J4287J3815J3462J3485J3877J4185J4218J4505J5397J6201
$$ 5048387 5063090 5077377 5091192 5104654 5118139 5132016 5146201 5160419 5174924 5190321 5206522
57682E206522J6076J5458J5636J7041J8934K0762K2841K5585K8827L2252L5880
$$ 5206522 5222598 5238056 5253692 5270733 5289667 5310429 5333270 5358855 5387682 5419934 5455814
57671E455814L9929M4569M9775N5007N9137O1131O0598N7289N0490L9800K6224
$$ 5455814 5495743 5540312 5590087 5645094 5704231 5765362 5825960 5883249 5933739 5973539 5999763
57660E999763J1801j786j3504k2324k7350k8683k7337k4222j9908j5185j0908
$$ 5999763 6011564 6009778 5996274 5973950 5946600 5917917 5890580 5866358 5846450 5831265 5820357
57649E820357p183l524Q9L089N291P096Q649R661J0181J0723J1392J1781J1945
$$ 5820357 5813174 5809650 5809739 5812828 5818119 5825215 5833864 5843525 5853706 5864429 5875821 5887602 5899547
57636E899547J2591J3916J5133J5601J5683J5947J6168J5820J5050J4527J4536
$$ 5899547 5912138 5926054 5941187 5956788 5972471 5988418 6004586 6020406 6035456 6049983 6064519
57625F064519J4777J4907J4914J4935J4971J4881J4603J4403J4703J5518J6306
$$ 6064519 6079296 6094203 6109117 6124052 6139023 6153904 6168507 6182910 6197613 6213131 6229437
57614F229437J6618J6619J6679J6769J6720J6661J6721J6590J6049J5573J5712
$$ 6229437 6246055 6262674 6279353 6296122 6312842 6329503 6346224 6362814 6378863 6394436 6410148
57603F410148J6198J6535J7072J8395J9824J9849J8295J6828J6778J7475J7368
$$ 6410148 6426346 6442881 6459953 6478348 6498172 6518021 6536316 6553144 6569922 6587397 6604765
57592F604765J6074J4626J4191J5065J6572J7564J7371J6529J6241J6907J7760
$$ 6604765 6620839 6635465 6649656 6664721 6681293 6698857 6716228 6732757 6748998 6765905 6783665
57581F783665J8035J7911J7948J8246J8525J8666J8691J8538J8199J7849J7604
$$ 6783665 6801700 6819611 6837559 6855805 6874330 6892996 6911687 6930225 6948424 6966273 6983877
57570F983877J7410J7263J7267J7387J7435J7365J7274J7187J7250J7887J9203
$$ 6983877 7001287 7018550 7035817 7053204 7070639 7088004 7105278 7122465 7139715 7157602 7176805
57559G176805K0375K0416J9556J9028J9414K0117K0609K1140K1770K1828K1017
$$ 7176805 7197180 7217596 7237152 7256180 7275594 7295711 7316320 7337460 7359230 7381058 7402075
57548G402075K0302K0737K1962K2702K2391K1560K0862K0528K0568K0836K0852
$$ 7402075 7422377 7443114 7465076 7487778 7510169 7531729 7552591 7573119 7593687 7614523 7635375
57537G635375K0212J9294J9057J9948K1387K2453K2813K2737K2409K1576K0078
$$ 7635375 7655587 7674881 7693938 7713886 7735273 7757726 7780539 7803276 7825685 7847261 7867339
57526G867339J8478J7766J8301J9340J9872J9699J9395J9429J9793K0340K0970
$$ 7867339 7885817 7903583 7921884 7941224 7961096 7980795 8000190 8019619 8039412 8059752 8080722
57515H080722K1491K1698K1626K1496K1422K1491K1849K2390K2595K2181K1666
$$ 8080722 8102213 8123911 8145537 8167033 8188455 8209946 8231795 8254185 8276780 8298961 8320627
57504H320627K1691K2025K1957K1533K1516K2122K2628K2481K2011K1748K1662
$$ 8320627 8342318 8364343 8386300 8407833 8429349 8451471 8474099 8496580 8518591 8540339 8562001
57493H562001K1467K1148K0880K0729K0697K0761K0802K0731K0685K0805K0939
$$ 8562001 8583468 8604616 8625496 8646225 8666922 8687683 8708485 8729216 8749901 8770706 8791645
57482H791645K0972K1151K1599K1789K1190K0218J9748J9871J9944J9698J9464
$$ 8791645 8812617 8833768 8855367 8877156 8898346 8918564 8938312 8958183 8978127 8997825 9017289
57471I017289J9445J9637K0266K1291K1774K0951J9757J9877K1222K1951K1236
$$ 9017289 9036734 9056371 9076637 9097928 9119702 9140653 9160410 9180287 9201509 9223460 9244696
57460I244696K0361K0592K1474K2020K2168K2160K1768K1104K1059K1925K2645
$$ 9244696 9265057 9285649 9307123 9329143 9351311 9373471 9395239 9416343 9437402 9459327 9481972
57449I481972K2361K1673K1413K1221K0538J9950K0274K1056K1298K1108K1337
$$ 9481972 9504333 9526006 9547419 9568640 9589178 9609128 9629402 9650458 9671756 9692864 9714201
57438I714201K2112K2829K3227K3386K3169K2622K2453K3088K3797K3753K3376
$$ 9714201 9736313 9759142 9782369 9805755 9828924 9851546 9873999 9897087 9920884 9944637 9968013
57427I968013K3498K3840K3559K2802K2430K2607K2915K3413K4241K4595K3713
$$ 9968013 9991511 10015351 10038910 10061712 10084142 10106749 10129664 10153077 10177318 10201913 10225626
57416A0225626K2543K2787K4301K5142K4390K3279K3135K3619K3720K3211K2418
$$ 10225626 10248169 10270956 10295257 10320399 10344789 10368068 10391203 10414822 10438542 10461753 10484171
57405A0484171K1562K0963K1048K1627K1924K1761K1843K2453K2754K2084K1086
$$ 10484171 10505733 10526696 10547744 10569371 10591295 10613056 10634899 10657352 10680106 10702190 10723276
57394A0723276K0778K1112K1215K0722K0152K0105K0589K1059K0962K0321J9811
$$ 10723276 10744054 10765166 10786381 10807103 10827255 10847360 10867949 10889008 10909970 10930291 10950102
57383A0950102J9943K0281J9959J8925J8039J7867J8058J8083J7895J7583J6997
$$ 10950102 10970045 10990326 11010285 11029210 11047249 11065116 11083174 11101257 11119152 11136735 11153732
57372A1153732J6196J5647J5616J5685J5369J4809J4530J4800J5481J6264J6809
$$ 11153732 11169928 11185575 11201191 11216876 11232245 11247054 11261584 11276384 11291865 11308129 11324938
57361A1324938J6926J6808J6836J7046J7131J7014J7025J7375J7856J8211J8429
$$ 11324938 11341864 11358672 11375508 11392554 11409685 11426699 11443724 11461099 11478955 11497166 11515595
57350A1515595J8496J8292J7894J7617J7550J7456J7289J7345J7693J7881J7517
$$ 11515595 11534091 11552383 11570277 11587894 11605444 11622900 11640189 11657534 11675227 11693108 11710625
57339A1710625J6845J6392J6276J6122J5555J4615J3760J3408J3454J3369J3017
$$ 11710625 11727470 11743862 11760138 11776260 11791815 11806430 11820190 11833598 11847052 11860421 11873438
57328A1873438J3001J3782J4791J5105J4783J4662J4954J4957J4398J3961J4087
$$ 11873438 11886439 11900221 11915012 11930117 11944900 11959562 11974516 11989473 12003871 12017832 12031919
57317A2031919J4090J3216J1870J1052J1066J1433J1768J2013J2062J1824J1581
$$ 12031919 12046009 12059225 12071095 12082147 12093213 12104646 12116414 12128427 12140489 12152313 12163894
57306A2163894J1715J2151J2445J2442J2431J2672J3059J3240J2912J2139J1469
$$ 12163894 12175609 12187760 12200205 12212647 12225078 12237750 12250809 12264049 12276961 12289100 12300569
57295A2300569J1481J2042J2317J1914J1570J2242J3741J4914J5140J5033J5473
$$ 12300569 12312050 12324092 12336409 12348323 12359893 12372135 12385876 12400790 12415930 12430963 12446436
57284A2446436J6475J7357J7712J7755J7769J7622J7123J6541J6409J6772J6982
$$ 12446436 12462911 12480268 12497980 12515735 12533504 12551126 12568249 12584790 12601199 12617971 12634953
57273A2634953J6557J5877J5692J6093J6491J6474J6198J5925J5705J5687J6213
$$ 12634953 12651510 12667387 12683079 12699172 12715663 12732137 12748335 12764260 12779965 12795652 12811865
57262A2811865J7213J7971J7871J7067J6129J5278J4385J3460J2666J1934J1001
$$ 12811865 12829078 12847049 12864920 12881987 12898116 12913394 12927779 12941239 12953905 12965839 12976840
57251A2976840R888R037Q846R280R954J0509J0861J1197J1750J2599J3666J4817
$$ 12976840 12986728 12995765 13004611 13013891 13023845 13034354 13045215 13056412 13068162 13080761 13094427 13109244
57239A3109244J5889J6643J6968J7008J6907J6460J5389J3954J2814J2098J1101
$$ 13109244 13125133 13141776 13158744 13175752 13192659 13209119 13224508 13238462 13251276 13263374 13274475
57228A3274475R187O699M469K731R58j311l915o404q583j0608j2793j5327j7994
$$ 13274475 13283662 13290361 13294830 13297561 13298519 13297208 13293293 13286889 13278306 13267698 13254905 13239578 13221584
57215A3221584k0201k1530k2311k3356k5036k6865k8186k9005k9899l1204l2613
$$ 13221584 13201383 13179853 13157542 13134186 13109150 13082285 13054099 13025094 12995195 12963991 12931378
57204A2931378l3614l4008l3877l3307l2442l1678l1571l2384l3902l5636l7151
$$ 12931378 12897764 12863756 12829879 12796572 12764130 12732452 12700881 12668497 12634595 12598959 12561808
57193A2561808l8228l8885l9242l9326l9135l8983l9513m0949m2535m3228m2951
$$ 12561808 12523580 12484695 12445453 12406127 12366992 12328009 12288496 12247547 12205012 12161784 12118833
57182A2118833m2657m3169m4549m6693m9725n3459n7169o0477o3819o7588p1359
$$ 12118833 12076176 12033007 11988458 11941765 11892040 11838581 11781412 11720935 11657116 11589528 11518169
57171A1518169p4662p7920q1728q5751q9279r2564r6418j00611j03800j05179
$$ 11518169 11443507 11365587 11283859 11198108 11108829 11016265 10919847 10819236 10715436 10610257
57161A0610257j05189j04347j02442r9271r5243r0665q5184p8555p1447o4787
$$ 10610257 10505068 10400721 10298279 10199008 10103765 10013100 9927916 9849361 9777914 9713127
57151I713127n8773n3124m8092m4674m3968m6571n2405o0847p1182q3035r6077
$$ 9713127 9654354 9601230 9553138 9508464 9464496 9417925 9365520 9304673 9233491 9150456 9054379
57140I054379j09238j20724j29085j33922j35371j33379j27923j19572j09504
$$ 9054379 8945141 8824417 8695332 8561410 8426039 8292660 8164737 8045165 7935661
57131G935661r9220r0342q4206q1147q0295q0198p9421p6668p1066o2790n2975
$$ 7935661 7836441 7746099 7661893 7580746 7500451 7420253 7340832 7264164 7193098 7130308 7077333
57120G077333m2754l2865k4303j8464j5797j4761j2783p934O14J3091K9202M8140
$$ 7077333 7034579 7001714 6977411 6958947 6943150 6928389 6915606 6907672 6908286 6921377 6950579 6998719
57108F998719O9609R4804J25737J63717K09089K62362L24886L98658M86462N92423
$$ 6998719 7068328 7163132 7288869 7452586 7661675 7924037 8248923 8647581 9134043 9726466
57098I726466P21726Q79563J070883J300931J574661J894579K258983K662085
$$ 9726466 10448192 11327755 12398638 13699569 15274230 17168809 19427792 22089877
57090B2089877L094725L544170L993587M422627M809472N133923N380412N537892
$$ 22089877 25184602 28728772 32722359 37144986 41954458 47088381 52468793 58006685
57082E8006685N594123N528610N314527M933385M389842L708603K913263K009793
$$ 58006685 63600808 69129418 74443945 79377330 83767172 87475775 90389038 92398831
57074I2398831R95085j16292j274384k401885l418524m262029m897155n316345
$$ 92398831 93393916 93277624 92003240 89601355 86182831 81920802 77023647 71707302
57066G1707302n535278n582863n488996n277878m970217m588607m159098l708468
$$ 71707302 66172024 60589161 55100165 49822287 44852070 40263463 36104365 32395897
57058C2395897l260941k836210k448196k104470j807069j554106j341136j162163
$$ 32395897 29134956 26298746 23850550 21746080 19939011 18384905 17043769 15881606
57050A5881606j010914q82010p71542o77214n98214n34109m83088m41533m05824
$$ 15881606 14870692 13988682 13217140 12539926 11941712 11407603 10924515 10482982 10077158
57041A0077158l74340l47133l23955l03412k83973k65043k46759k29312k12901
$$ 10077158 9702818 9355685 9031730 8728318 8444345 8179302 7932543 7703231 7490330
57032G490330j97987j85070j74148j64650j55984j47835j39814j31261j22290
$$ 7490330 7292343 7107273 6933125 6768475 6612491 6464656 6324842 6193581 6071291
57023F071291j15151j13595j19880j32688j48764j66197j84904k04009k20379
$$ 6071291 5956140 5842545 5722665 5589977 5441213 5275016 5090112 4886103 4665724
57014D665724k30664k33871k31176k24058k13662k01351j88602j76255j64460
$$ 4665724 4435060 4201189 3970013 3745955 3532293 3330942 3142340 2966085 2801625
57005B801625j53380j43290j34094j25318j16657j08149j00014r2628q6395q1209
$$ 2801625 2648245 2504955 2370861 2245543 2128886 2020737 1920723 1828095 1741700 1660491
56995A660491p6238p0742o4916n9463n4597m9970m5334m0742l6232l1824k7718
$$ 1660491 1584253 1513511 1448595 1389132 1334535 1284565 1239231 1198489 1162257 1130433 1102715
56984A102715k4048k0591j7215j4400j2800j2520j3371j5489j8940k2785k5472
$$ 1102715 1078667 1058076 1040861 1026461 1013661 1001141 987770 972281 953341 930556 905084
56973I05084k6249k5605k4266k2502k0564j8949j7688j5930j2864q837n145k749
$$ 905084 878835 853230 828964 806462 785898 766949 749261 733331 720467 711630 706485 703736
56961G03736j478m02J173L223N313P207Q801R447P916L520k825r175j4098j7399
$$ 703736 702258 701856 703029 706252 711565 718772 727573 737020 744936 748456 745631 736456 722358 704959
56947G04959j9478k0626k0911k0354j8920j6704j4139j1791r705p237l705Q08
$$ 704959 685481 664855 643944 623590 604670 587966 573827 562036 552331 545094 541389 542197
56935E42197N435R218J1880J3897J5810J7499J8207J7204J4169R085K286n316
$$ 542197 547632 556850 568730 582627 598437 615936 634143 651347 665516 674601 676887 671571
56923F71571j2550j8725k3626k6774k7446k5816k3337k1340j9757j7778j5299
$$ 671571 659021 640296 616670 589896 562450 536634 513297 491957 472200 454422 439123
56912D39123j2997j1367j0402r886r353q177o320m727m173m156l650k593j668
$$ 439123 426126 414759 404357 394471 385118 376941 370621 365894 361721 357565 353915 351322 349654
56899C49654r79m5J036J638J888K828M982P713J0250J2475J4480J6196J7801J9618
$$ 349654 348675 348630 349666 351304 353192 356020 361002 368715 378965 391440 405920 422116 439917 459535
56885D59535K1281K1719K0403J7846J4510J0031M173k085p177j0326j1761j1904
$$ 459535 480816 502535 522938 540784 555294 565325 569498 567413 560236 549910 538149 526245
56873E26245j0969r206p018m679k089J068M974R395J3889J8398K3322K8699L3711
$$ 526245 515276 506070 499052 494373 492284 493352 498326 507721 521610 540008 563330 592029 625740
56860F25740L7454L9906M1362M1181L7975L1050K0964Q729m547j7126k6790l2189
$$ 625740 663194 703100 744462 785643 823618 854668 875632 884361 879814 862688 835898 803709
56848H03709l3537l1873k8179k3294j7825j1756m770K890J0512J8039K6154L5035
$$ 803709 770172 738299 710120 686826 669001 657245 652475 655365 665877 683916 710070 745105
56836G45105M3946N2359O0355O7242P0801O8805O0700M7192K9170P971j3930l3747
$$ 745105 789051 841410 901765 969007 1039808 1108613 1169313 1216505 1245675 1253646 1239716 1205969
56824A205969m9704o0900o6546o6432o1854n4921m6940l8193k9117k0596j2893
$$ 1205969 1156265 1095365 1028819 962387 900533 845612 798672 760479 731362 710766 697873
56813F97873n231L141J2034K0794K9135L6968M3622M7635M7447M2279L2489J9188
$$ 697873 692642 695783 707817 728611 757746 794714 838336 885971 933418 975697 1008186 1027374
56801A027374L699j2562k7925m0710m9869n5148n6598n4362m9150m2413l5581
$$ 1027374 1031073 1018511 990586 949876 900007 844859 788261 733899 684749 642336 606755
56790F06755k9223k3198j7265j1345n524j21M533Q686J3123J8072K2315K3921
$$ 606755 577532 554334 537069 525724 520200 520079 524612 533298 546421 564493 586808 610729
56778F10729K1838J6537R254R83p771j6616k4811l1260l5066l6107l4968l2403
$$ 610729 632567 649104 658358 659341 651570 634954 610143 578883 543817 507710 472742 440339
56766D40339k9119k5875k3209k0964j8556j5856j3417j1654j0373r253q303p524
$$ 440339 411220 385345 362136 341172 322616 306760 293343 281689 271316 262063 253760 246236
56754B46236o641n571m719m460m622m766m649m185l341k340j625j338j195j022
$$ 246236 239595 234024 229305 224845 220223 215457 210808 206623 203282 200942 199317 197979 196784 195762
56740A95762j034j352j708j853j808j525q89k16j46p30j267j381j580k322l093
$$ 195762 194728 193376 191668 189815 188007 186482 185593 185377 185231 184501 183234 181853 180273 177951 174858
56725A74858k985j828k53R36J283R72Q40J486K309K256J581J673K804L393K318
$$ 174858 171873 170045 169792 170728 172011 172983 173823 175309 177618 179874 181455 183128 185932 189325 191643
56710A91643O79J59P36J265J418J561J462O60k62l05K39J10r73j977k228k099
$$ 191643 192322 192481 193217 194482 195900 197461 198923 199583 199321 199016 199255 199365 198392 196415 194187 192088
56694A92088j980j717j371j432j991k488k566k338j771o76N41R92M88k55o79r47
$$ 192088 190108 188391 187020 185588 183597 181109 178543 176205 174434 173758 174299 175291 175779 175524 174845 173898
56678A73898j223j276j095j117j435j461q23LL53K42J41K30K49l9m64n40K4Q25
$$ 173898 172675 171399 170304 169187 167752 166291 165468 165471 165824 166066 166207 166437 166686 166647 166183 165643 165667 166492
56660A66492J030L76m60q07q70j142j431j187m89J05M96J002J569J838J902K184
$$ 166492 167522 167898 167438 166631 165761 164619 163188 162001 161512 161617 162113 163115 164684 166522 168424 170608
56644A70608K624K812K865L268L945M304M282M390M730M825M537M219L871L081
$$ 170608 173232 176044 178909 182177 186122 190426 194708 199098 203828 208653 213190 217409 221280 224361
56630B24361K012J457J598J614R46Q2l68n74r41j304j234p11r4J94k41j432k687
$$ 224361 226373 227830 229428 231042 231988 232070 231702 231128 230187 228883 227649 226938 226844 227038 226797 225365 222678
56613B22678l074k527j867j640j570j362j231j326j321j038p97q38q99p85o99
$$ 222678 219604 217077 215210 213570 212000 210638 209407 208081 206760 205722 204925 204087 203188 202403 201704
56598B01704o83l40M28J009Q66K90p2j7L09Q21J366J543J139N37L38O45J014R98
$$ 201704 201021 200681 201109 202118 202984 203274 203202 203185 203494 204315 205681 207224 208363 208900 209238 209883 210897 211895
56580B11895N99K81M99J096J371R98N68P29J253J469J398J512J704J448R88J277
$$ 211895 212494 212775 213274 214370 215741 216739 217307 218036 219289 220758 222156 223668 225372 226820 227808 229085
56564B29085K643M385N852P031P927Q307Q307Q417Q595Q319P625P116O710N519
$$ 229085 231728 236113 241965 248996 256923 265230 273537 281954 290549 298868 306493 313609 320319 325838
56550C25838L448J743J349J633J492Q44L46K06O5m86j599l005l957l962l625l920
$$ 325838 329286 331029 332378 334011 335503 336347 336693 336899 336964 336478 334879 331874 327917 323955 320330 316410
56534C16410m623m630l921l790m686n303m613l369k650k222j552j219j937k978
$$ 316410 311787 307157 303236 299446 294760 289457 284844 281475 278825 276603 275051 273832 271895 268917
56520B68917l020k002r92o39q09j213j466j079k80j37j044j834j484p71j003j897
$$ 268917 265897 263895 262903 262264 261455 260242 258776 257697 257417 257280 256236 254402 252918 252147 251144 249247
56504B49247k172j651j179r13k83N45O88M0n66p61r84j412j706j811j881j526
$$ 249247 247075 245424 244245 243332 243049 243594 244282 244322 243756 242995 242011 240599 238893 237082 235201 233675
56488B33675k97J112J471Q64N92J062J207L72n24m50K65O54N23L98N72Q65R75
$$ 233675 233378 234490 235961 236825 237417 238479 239686 240058 239534 239084 239349 240003 240526 240924 241496 242361 243336
56471B43336P47L86M99J416K449K463J270j87j095j449j402q22J38Q69J126J352
$$ 243336 244083 244469 244968 246384 248833 251296 252566 252379 251284 249835 248433 247611 247749 248618 249744 251096
56455B51096J773J836J146K52n3J51J85j40l04J10Q67J404J421J093Q05P09N78
$$ 251096 252869 254705 255851 256103 256050 256201 256386 256246 255942 256052 256919 258323 259744 260837 261642 262351 262929
56438B62929K29o2J66R24J720K116K016J429M03o91j198p97J49R92J414J491J332
$$ 262929 263158 263096 263262 264186 265906 268022 270038 271467 271870 271179 269981 269184 269333 270325 271739 273230 274562
56421B74562R07K87j52PO35R84M85m91j031p35nO47R88P70j74j329j740j209n74
$$ 274562 275469 275756 275604 275611 276246 277230 277715 277224 276193 275458 275453 276100 277088 277858 277684 276355 274615 273406 272832
56402B72832m11k00O36J664K135K138K188K227J895J359J070R91Q83J007J682
$$ 272832 272421 272221 272857 274521 276656 278794 280982 283209 285104 286463 287533 288524 289407 290414 292096
56387B92096K465K712K623K832L179K962K250J931K367K924K940K311J150k75
$$ 292096 294561 297273 299896 302728 305907 308869 311119 313050 315417 318341 321281 323592 324742 324467
56373C24467j155p26N69J305P87k16p03o14l89j03L81Q61R86Q57J034J876L019
$$ 324467 323312 322586 323155 324460 325247 325031 324328 323714 323325 323222 323603 324464 325450 326307 327341 329217 332236
56356C32236L565K922J520M85M88J211K011K598K796K334J371P10Q54J320J447
$$ 332236 335801 338723 340243 340728 341216 342427 344438 347036 349832 352166 353537 354247 355101 356421 357868
56341C57868J368J455J469J106Q83J440K337K581K051J434R93M91Q3K12O87R10
$$ 357868 359236 360691 362160 363266 364149 365589 367926 370507 372558 373992 374985 375476 375559 375771 376458 377368
56325C77368R46J375K202K870L200L359L063K043J056J173K077K450K079K083
$$ 377368 378314 379689 381891 384761 387961 391320 394383 396426 397482 398655 400732 403182 405261 407344
56311D07344K831L182K416J489J553K397L106L424L600L701L827M367N315N944
$$ 407344 410175 413357 415773 417262 418815 421212 424318 427742 431342 435043 438870 443237 448552 454496
56297D54496N760N244N022M841M066K787J837J842K679L779M644N161N500N783
$$ 454496 460256 465500 470522 475363 479429 482216 484053 485895 488574 492353 496997 502158 507658 513441
56283E13441N955O082O443P044P520P865Q672J0042J0949J0587R800J0009J1272
$$ 513441 519396 525478 531921 538965 546485 554350 563022 573064 584013 594600 604400 614409 625681
56270F25681J2518J3337J4133J4832J4976J5073J6252J8496K0658K2453K4837
$$ 625681 638199 651536 665669 680501 695477 710550 726802 745298 765956 788409 813246
56259H13246K8079L1087L3235L5494L8966M3506M8465N3695N9194O4764P0714
$$ 813246 841325 872412 905647 941141 980107 1023613 1072078 1125773 1184967 1249731 1320445
56248A320445P7839Q6044R3860J00044J04736J08595J11666J13626J14236J12950
$$ 1320445 1398284 1484328 1578188 1678232 1782968 1891563 2003229 2116855 2231091 2344041
56238B344041J08934J02027R2920Q1985O8854N3482L6678J9187J231j6637l3353
$$ 2344041 2452975 2555002 2647922 2729907 2798761 2852243 2888921 2908108 2909339 2892702 2859349
56227B859349m8425o2115p4148q3477q9900r4623r8482j00785j00690r8584r5335
$$ 2859349 2810924 2748809 2674661 2591184 2501284 2406661 2308179 2207394 2106704 2008120 1912785
56216A912785r1264q6586q1841p7097p1772o6015o1010n7194n3340m8494m3509
$$ 1912785 1821521 1734935 1653094 1575997 1504225 1438210 1377200 1320006 1266666 1218172 1174663
56205A174663l9624l6591l3502l0412k7861k5579k3032k0525j8551j6653j4200
$$ 1174663 1135039 1098448 1064946 1034534 1006673 981094 958062 937537 918986 902333 888133
56194H88133j1736j0300r761r047p765o571o030n988o023n802n118m075l151k663
$$ 888133 876397 866097 856336 847289 839524 832953 826923 820935 814912 809110 803992 799917 796766 794103
56180G94103k433k117j463k04J619L105L197K168J501J944K692K846K656K757
$$ 794103 791670 789553 788090 787886 789505 792610 795807 797975 799476 801420 804112 806958 809614 812371
56166H12371L227L907M768N532N841O134P176Q531Q904Q274Q147R135J0151J0630
$$ 812371 815598 819505 824273 829805 835646 841780 848956 857487 866391 874665 882812 891947 902098 912728
56152I12728J1634J3755J5766J6730J7681J9786K2460K4815K7545L1557L6168
$$ 912728 924362 938117 953883 970613 988294 1008080 1030540 1055355 1082900 1114457 1150625
56141A150625M0429M5094N1373N8707O5615P1894P7997Q2991Q5010Q3476P9393
$$ 1150625 1191054 1236148 1287521 1346228 1411843 1483737 1561734 1644725 1729735 1813211 1892604
56130A892604P3790O7342O0904N5004M9138M2833L6831L1998K7681K2500J6273
$$ 1892604 1966394 2033736 2094640 2149644 2198782 2241615 2278446 2310444 2338125 2360625 2376898
56119B376898R851L589k776r167j5339k1590k8198l4699m0673m6667n3234n9636
$$ 2376898 2386749 2390338 2387562 2378395 2363056 2341466 2313268 2278569 2237896 2191229 2137995 2078359
56107B078359o4414o6698o6234o3023n7787n1933m6209m0293l4291k9220k5217
$$ 2078359 2013945 1947247 1881013 1817990 1760203 1708270 1662061 1621768 1587477 1558257 1533040
56096A533040k0886j5620j0931q034n741k427J322L878N142O125P016P452P843
$$ 1533040 1512154 1496534 1485603 1477569 1471828 1469401 1470723 1474601 1479743 1485868 1492884 1500336 1508179
56083A508179Q737R699J0230J0806J1721J2168J1844J2094J3806J5658J6109J5734
$$ 1508179 1516916 1526615 1536845 1547651 1559372 1571540 1583384 1595478 1609284 1624942 1641051 1656785
56071A656785J5818J6198J6391J7279J9568K1919K2751K2620K2833K3210K3257
$$ 1656785 1672603 1688801 1705192 1722471 1742039 1763958 1786709 1809329 1832162 1855372 1878629
56060A878629K3978K6181K8424K8969K8413K8204K8110K7515K7503K9041L0680
$$ 1878629 1902607 1928788 1957212 1986181 2014594 2042798 2070908 2098423 2125926 2154967 2185647
56049B185647L0749L0271L0954L1983L1760L1170L1952L3312L3492L3305L4724
$$ 2185647 2216396 2246667 2277621 2309604 2341364 2372534 2404486 2437798 2471290 2504595 2539319
56038B539319L7194L8732L9617M1590M4364M6332M7742M9884N2112N3015N3611
$$ 2539319 2576513 2615245 2654862 2696452 2740816 2787148 2834890 2884774 2936886 2989901 3043512
56027C043512N5969N9628O2554O4633O7046O9426P0932P2720P5980P9147Q0503
$$ 3043512 3099481 3159109 3221663 3286296 3353342 3422768 3493700 3566420 3642400 3721547 3802050
56016C802050Q1755Q5279Q9742R2673R5244J00014J05835J09895J13076J18234
$$ 3802050 3883805 3969084 4058826 4151499 4246743 4346757 4452592 4562487 4675563 4793797
56006D793797J24755J30001J34648J41246J48950J55121J60705J68441J77264
$$ 4793797 4918552 5048553 5183201 5324447 5473397 5628518 5789223 5957664 6134928
55997F134928J84321J90931K00508K12086K22281K32134K45255K60760K75052
$$ 6134928 6319249 6510180 6710688 6922774 7145055 7377189 7622444 7883204 8158256
55988H158256K89151L07017L28028L48726L70457L97156M27128M55687M84646
$$ 8158256 8447407 8754424 9082452 9431178 9801635 10198791 10625919 11081606 11566252
55979A1566252N20107N62051O05638O51697P05782P67837Q33443R04620R88558
$$ 11566252 12086359 12648410 13254048 13905745 14611527 15379364 16212807 17117427 18105985
55970A8105985J086476J195287J319165J467236J641232J839196K070282K351461
$$ 18105985 19192461 20387748 21706913 23174149 24815381 26654577 28724859 31076320
55962C1076320K691438L094743L580997M182296M922347N816648O890810Q177442
$$ 31076320 33767758 36862501 40443498 44625794 49548141 55364789 62255599 70433041
55954G0433041R699542J1481223J3561605J5953616J8588284K1339214K4074382
$$ 70433041 80132583 91613806 105175411 121129027 139717311 161056525 185130907
55947A85130907K6569306K8316637K8532100K6505366K2000406J5323569P105601
$$ 185130907 211700213 240016850 268548950 295054316 317054722 332378291 339483892
55940C39483892j852349j0574520j8009402k3358205k6364505k7280250k6597998
$$ 339483892 337631543 327057023 309047621 285689416 259324911 232044661 205446663
55933B05446663k4836573k2472195j9902640j7393160j5070459j2981091j1140482
$$ 205446663 180610090 158137895 138235255 120842095 105771636 92790545 81650063
55926H1650063r539256q149999o951963n937078n089835m381030l785767l290705
$$ 81650063 72110807 63960808 57008845 51071767 45981932 41600902 37815135 34524430
55918C4524430k880320k532811k234155j982093j772209j592740j436038j302648
$$ 34524430 31644110 29111299 26877144 24895051 23122842 21530102 20094064 18791416
55910A8791416j190452j090889r99157r17893q47655p83250p22127o67426o20034
$$ 18791416 17600964 16510075 15510918 14593025 13745370 12962120 12239993 11572567 10952533
55901A0952533n76012n34079m97604m67033m38146m09754l85554l66394l48165
$$ 10952533 10376521 9842442 9344838 8877805 8439659 8029905 7644351 7277957 6929792
55892F929792l29286l13043l00298k86868k70523k54101k39390k24074k07063
$$ 6929792 6600506 6287463 5987165 5700297 5429774 5175673 4936283 4712209 4505146
55883D505146j91014j77276j63760j49923j38539j30553j23350j16037j11317
$$ 4505146 4314132 4136856 3973096 3823173 3684634 3554081 3430731 3314694 3203377
55874C203377j10116j09387j07275j05718j05809j05233j02383r8812r5551r1075
$$ 3203377 3093261 2983874 2876599 2770881 2665072 2559839 2457456 2358644 2263093 2172018
55864B172018q4911p9179p4764o9807o3709n8807n6224n3891n0443m7374m5584
$$ 2172018 2087107 2007928 1933164 1863357 1799648 1740841 1684617 1630726 1580283 1532909 1487325
55853A487325m3427m0100l7517l6824l6335l4730l3211l2694l1946l0239k8913
$$ 1487325 1443898 1403798 1366281 1329457 1293122 1258392 1225181 1192487 1160541 1130302 1101389
55842A101389k8567k7637k5409k3618k3333k2988k1251j9267j8314j7623j6191
$$ 1101389 1072822 1045185 1019776 996158 972825 949837 928586 909319 891005 873382 857191
55831H57191j4644j3704j2869j1835j1343j1512j1313j0518j0110j0174r669q813
$$ 857191 842547 828843 815974 804139 792796 781284 769971 759453 749343 739169 729500 720687
55819G20687r221j0970j2130j1892j1538j1631j0981r307q098p865p219n670m581
$$ 720687 711466 700496 688366 676474 664936 653305 642324 633017 624919 617054 609835 604165 599584
55806E99584m353l506j684o82j165j204N49K769M048M966O085O391N292L912K938
$$ 599584 595231 591725 590041 589359 588194 586990 587539 590308 594356 599322 605407 611798 617090 621002 623940
55791F23940J376j215l498m675n706p034p504o813o599p641q513q382q604r949
$$ 623940 625316 624101 620603 615928 610222 603188 595684 588871 582272 574631 566118 557736 549132 539183
55777E39183j0823j0019q739q052o748l712j68K443M633O898P755N951K786L0
$$ 539183 528360 518341 509602 501550 494802 491090 490922 493365 497998 504896 512651 518602 521388 521418
55763E21418k649o202r839j2269j3656j4425j3874j1922j0456j0802j1466j0568
$$ 521418 518769 512567 502728 490459 476803 462378 448504 436582 426126 415324 403858 393290
55751C93290q864q112q028p282o180n851n853n017l832l643m103l658k114p89
$$ 393290 384426 376314 368286 361004 354824 348973 343120 338103 334271 330628 326525 322867 320753 319964
55737C19964m41p19j288k016k477k446k422k687k691k270k374l489m626m934m967
$$ 319964 319523 318804 317516 315500 313023 310577 308155 305468 302777 300507 298133 294644 290018 285084 280117
55722B80117n190m772l307k123k250k606j934r50p14m38J014K826L677M149N343
$$ 280117 274927 270155 266848 264725 262475 259869 257935 256985 256271 255833 256847 259673 263350 267499 272842
55707B72842O241N027K288L30j77n44j472k353k970l782m609m862m948n674o604
$$ 272842 279083 284110 286398 286728 286551 286007 284535 282182 279212 275430 270821 265959 261011 255337 248733
55692B48733o627n822n092m445l330k196j846j718o61R48J764J790K157K945L200
$$ 248733 242106 236284 231192 226747 223417 221221 219375 217657 216996 217944 219708 221498 223655 226600 229800
55677B29800L003L353M098L913K516J020l9j155k185k229j442j131j619j735r21
$$ 229800 232803 236156 240254 244167 246683 247703 247664 246509 244324 242095 240653 239522 237903 236168 235247
55662B35247j80k83o08m18MK02L49O11P46P96J230K001K412K240K005J891J420
$$ 235247 235067 234784 234176 233758 233762 233964 234313 234924 235670 236466 237696 239697 242109 244349 246354 248245 249665
55645B49665N10k08m74q41j680k587l118l329l374l379l793n021o488p038o414
$$ 249665 250175 249967 249493 248652 246972 244385 241267 237938 234564 231185 227392 222371 215883 208845 202431
55630B02431n541n117m819m142l206k381j848j716j964k151j762r77m24k69k03
$$ 202431 196890 191773 186954 182812 179606 177225 175377 173661 171697 169546 167784 166807 166383 166114 165911
55615A65911k58p64j552k003k008k069k360k411j887j040l55j98o74j330j354
$$ 165911 165653 164889 163337 161334 159326 157257 154897 152486 150599 149559 149204 149006 148332 147002 145648
55600A45648o73l79j220k191j812l31O42N22K08K05j66j215j974j499j72R33J213
$$ 145648 144975 144596 143376 141185 139373 139042 139684 140206 140414 140619 140453 139238 137264 135765 135593 136526 137739
55583A37739P02j69n91N0J239J668Q74j55l05L99J236J803K188K591L203M061
$$ 137739 138441 138272 137681 137731 138970 140638 141512 141357 141052 141451 142687 144490 146678 149269 152472 156533
55567A56533M787M829M073K924J752P28J9l66q63j845k933l427l370l414l742
$$ 156533 161320 166149 170222 173146 174898 175626 175645 175279 174416 172571 169638 166211 162841 159427 155685
55552A55685l896l672l386l182k844k467k466k768k675j772m50O81J296J270P33
$$ 155685 151789 148117 144731 141549 138705 136238 133772 131004 128329 126557 126107 126788 128084 129354 130087
55537A30087K88N10J166J503J315J071R86P89M76M56P63Q27K82o34j656k738l596
$$ 130087 130375 130885 132051 133554 134869 135940 136926 137715 138191 138647 139410 140237 140519 139885 138229 135491 131895
55520A31895l726l171k621k485k444k169j892j962k377k982l644l999l546k283
$$ 131895 128169 124998 122377 119892 117448 115279 113387 111425 109048 106066 102422 98423 94877 92594
55506I2594q71Q7N80Q37R03P57N81O39J041J641K069J995J528J139J035R66R03
$$ 92594 91723 91810 92390 93227 94130 94887 95468 96107 97148 98789 100858 102853 104381 105520 106555 107521 108424
55489A08424J321K331L115K897K000J170M13o31j588j746j248q35o47l65k95j050
$$ 108424 109745 112076 115191 118088 120088 121258 121671 121040 119452 117706 116458 115623 114976 114611 114316 113266
55473A13266k197k504j757j080j205j487j125k58N47J112J404J254P10J58k60
$$ 113266 111069 108565 106808 105728 104523 103036 101911 101653 102200 103312 104716 105970 106680 106838 106578
55458A06578p09j075r80n29k60k97k49l6jr8J06N02M42o2k38J80N00K92L5J05
$$ 106578 105869 104794 103814 103285 103025 102728 102479 102443 102442 102344 102450 102952 103394 103332 103094 103274 103774 104066 104101 104206
55438A04206J17k06l71J3N01N62L84L66M35M08M56P03Q80P71N88N06M54N39J061
$$ 104206 104323 104117 103746 103759 104260 104822 105206 105572 106007 106415 106871 107574 108454 109225 109813 110319 110773 111312 112373
55419A12373J774J965J558J358J761K106J821J347J275J345J034M87O4m47j303
$$ 112373 114147 116112 117670 119028 120789 122895 124716 126063 127338 128683 129717 130204 130268 129821 128518
55404A28518j916j473k57M65j28j580k765k964k354j719j601j715j409p11m08
$$ 128518 126602 125129 124872 125337 125209 123629 120864 117900 115546 113827 112226 110511 109102 108391 107983
55389A07983j020k085k713k429j284L36J751K295J882J031K91j14j15J73L35J16
$$ 107983 106963 104878 102165 99736 98452 98788 100539 102834 104716 105747 106038 105924 105809 105982 106317 106433
55373A06433p4K30N94K41n19n39L80J077P44kl42l99n44n11L1O95R28P25K90l80
$$ 106433 106359 106589 107183 107424 106905 106366 106746 107823 108567 108565 108223 107824 107280 106769 106800 107495 108423 109148 109438 109058
55353A09058j044j091m75m4l67q66p96k89J71N70R01O62k82j011p34m8p0p95j300
$$ 109058 108014 106923 106448 106404 106037 105171 104375 104086 104257 104827 105728 106390 106108 105097 104363 104315 104245 103450 102150
55334A02150j211q58l41N04J290J317O64J75K12K00l79j179j449r06QN44K58n58
$$ 102150 100939 100081 99740 100244 101534 102851 103515 103690 103902 104102 103723 102544 101095 100189 100197 100741 100999 100441
55316A00441j125r62k70N18J170J459J073J44n69m92R6O03R32J250J405J093M57
$$ 100441 99316 98354 98084 98602 99772 101231 102304 102448 101879 101387 101483 102086 103018 104268 105673 106766 107223
55299A07223j6q8O9J70K1l13m35rO54Q37M13K3O3J79M6m7J20J75j22k91Q0N31
$$ 107223 107207 107119 107188 107358 107379 107066 106631 106622 107276 108113 108526 108549 108612 108791 108837 108790 108910 109085 108963 108672 108752 109283
55277A09283M40k2k64j75L2L34O41M73l54j145j162o15k53l00m66n74n18n7O61
$$ 109283 109723 109701 109437 109262 109294 109628 110269 110742 110388 109243 108081 107466 107213 106913 106447 105873 105355 105298 105959
55258A05959Q69K33m21k55K44Q1o01q28m03m4o8n5J97M25O44J092J397Q82j43
$$ 105959 106828 107061 106640 106385 106629 106710 106109 105281 104878 104834 104766 104711 104908 105333 105977 107069 108466 109348 109205
55239A09205m86K12Q44M02o82j310j143o51k32O4K38K91L59N27N75K04m97j056
$$ 109205 108719 108931 109775 110177 109495 108185 107042 106391 106159 106223 106461 106752 107111 107638 108213 108417 107920 106864
55221A06864j117p82l81RN41J076J032J77p18o26L94J242J246Q31N78M51L17M04
$$ 106864 105747 104965 104584 104593 105134 106210 107242 107419 106701 106075 106469 107711 108957 109788 110366 110817 111134 111538
55203A11538O71N46r9l96L20J366J560P57k70r77j338j343j084r24r43n89L47
$$ 111538 112209 112755 112656 112260 112580 113946 115506 116263 115993 115016 113678 112335 111251 110327 109384 108795 109142
55186A09142R66L83q66j540j380j106j011p52l05k6J48N02P08K10n63n91J62O83
$$ 109142 110108 110491 109625 108085 106705 105599 104588 103836 103531 103505 103653 104155 104863 105073 104510 103919 104081 104764
55168A04764N64N05R59J312R87L77J37K53L03J38o0n0L37R52J170N06o22j279
$$ 104764 105328 105833 106792 108104 109091 109468 109605 109858 110161 110299 110239 110189 110526 111478 112648 113154 112532 111253
55150A11253j113n31O2N18N77J24l07r5M49M54j26m61j75K40L81L31M2o28j099
$$ 111253 110140 109609 109671 110189 110766 110890 110583 110488 110937 111391 111265 110804 110629 110869 111250 111581 111623 110995 109896
55131A09896m67R52J717J245N71O35R93Q76M26Q5k94q29r53l12L99L55k07n82
$$ 109896 109429 110381 112098 113343 113914 114549 115542 116418 116844 116929 116635 115806 114853 114541 114940 115295 115088 114506
55113A14506p16q56o89J05R08Q61K76K76J069J610J122J01m78l44j5pk93l81J3
$$ 114506 113790 112934 112245 112350 113258 114119 114395 114671 115740 117350 118472 118573 118095 117751 117736 117729 117436 117055 117068
55094A17068N07M08k62o38j63N77P01L36L42R54J438J142K86m59o49k20N98J264
$$ 117068 117575 117983 117721 117083 116920 117497 118198 118534 118876 119830 121268 122410 122696 122237 121588 121368 121966 123230
55076A23230J180L12o15p86j53N16M62k26p32m23L50O33Nr15j276r52m41p3K53
$$ 123230 124410 124722 124107 123321 123168 123684 124146 123920 123188 122765 123115 123748 123753 122838 121562 120610 120169 120096 120349
55057A20349N22M14j69p15o16N9O34O22J81k47m09k79L1K01q8n89m87N26J512
$$ 120349 120871 121285 121116 120401 119785 119844 120478 121100 121281 121034 120625 120346 120377 120578 120490 119901 119414 119940 121452
55038A21452J291Mj093j339j236j212r16j81L10Q6j83K96J133J371Q75K14m24
$$ 121452 122743 122747 121654 120315 119079 117867 116951 116770 117080 117166 116983 117279 118412 119783 120658 120872 120448
55021A20448j109j369o28O37J270R67N68P41J262J618J456N31r41j926j516k59
$$ 120448 119339 117970 117342 117979 119249 120216 120784 121525 122787 124405 125861 126392 125451 123525 122009 121750
55005A21750M55K74M3R8j92r08j051k10N34L20n1N63J741K129J476P88P38R23
$$ 121750 122205 122479 122522 122620 122428 121520 120469 120259 120793 121113 121062 121625 123366 125495 126971 127759 128497 129420
54987A29420P92M28K22L04M21J73n88j431j645j113n03l60m03j08M09O39N14M66
$$ 129420 130212 130640 130862 131166 131587 131760 131172 129741 128096 126983 126480 126120 125717 125609 126018 126657 127171 127637
54969A27637O84Q31N55m8n67p13n86n21o35o15j14P16J381J584J370Q43J65k79
$$ 127637 128321 129152 129707 129659 129092 128379 127793 127272 126637 126022 125908 126624 128005 129589 130959 131802 131967 131688
54951A31688k53m6n5j28Om4p56j498j053M87J531J141K18m8K05K91L95J079J951
$$ 131688 131435 131389 131334 131206 131212 131168 130412 128914 127861 128348 129879 131020 131238 131190 131395 131686 132081 133160 135111
54932A35111K030J197L17M0K63P09J296J879K231K380K616L153M033N162O170
$$ 135111 137141 138338 138655 138695 138958 139667 140963 142842 145073 147453 150069 153222 157255 162417 168587
54917A68587O494N954N050M301L661K834J933J263P37r4j468l161m632n358n212
$$ 168587 175081 181035 186085 190386 194047 196881 198814 200077 200814 200720 199252 196091 191459 186101 180889
54902A80889m674m342m161l659k940k703l033l047k282j613j974k868l009k074
$$ 180889 176215 171873 167712 164053 161113 158410 155377 152330 150048 148435 146461 143593 140584 138510
54888A38510q87j16L37P46J084J259J301J326J602K464L777M811N075M930M906
$$ 138510 137623 137507 137844 138590 139674 140933 142234 143560 145162 147626 151403 156214 161289 166219 171125
54873A71125M856M442L964L950M138L727K518J039l93j937l494m509m734m611
$$ 171125 175981 180423 184387 188337 192475 196202 198720 199759 199366 197429 193935 189426 184692 180081
54859A80081m640m731m461l636k518j653j446j732j885j584j257j404j829j974
$$ 180081 175441 170710 166249 162613 160095 158442 156996 155264 153379 151795 150538 149134 147305 145331
54845A45331j832j921k401k784k541j631l72Q06J429J179J56j149k149k372j654
$$ 145331 143499 141578 139177 136393 133852 132221 131849 132655 134084 135263 135419 134270 132121 129749 128095
54830A28095m06N46P15L85N2k59p51j229j225o34J45O97R10R47J064J343J505
$$ 128095 127689 128235 128950 129335 129387 129128 128377 127148 125923 125289 125434 126131 127041 127988 129052 130395 131900
54813A31900J192N75K43M28P54R55J151J211O25n21j176o57L91J009J212J429
$$ 131900 133092 133667 133910 134338 135092 136047 137198 138409 139034 138513 137337 136680 137071 138080 139292 140721
54797A40721J361M92o98j265j179j150j310j193r07j045j425j123L0J103J478
$$ 140721 142082 142574 141876 140611 139432 138282 136972 135779 134872 133827 132402 131279 131309 132412 133890
54782A33890J570J807J869J449R11O51N22L75N92J467K633L461L748L644L352
$$ 133890 135460 137267 139136 140585 141496 142147 142669 143044 143636 145103 147736 151197 154945 158589 161941
54767A61941L178L456M152M880N504O227O937P057O311N149M056K943J552Pj433
$$ 161941 165119 168575 172727 177607 183111 189338 196275 203332 209643 214792 218848 221791 223343 223350 221917
54752B21917k808m175n212n577n437n285n340n436n358n023m424l617k789k118
$$ 221917 219109 214934 209722 204145 198708 193423 188083 182647 177289 172266 167842 164225 161436 159318
54738A59318j607j088l59N55J229J081kj339k051j797p81O67K114K943K848K379
$$ 159318 157711 156623 156264 156819 158048 159129 159127 157788 155737 153940 153159 153826 155940 158883 161731 164110
54722A64110K429L184M031M488M622M549M152L479K834K261J427K42q88j688k423
$$ 164110 166539 169723 173754 178242 182864 187413 191565 195044 197878 200139 201566 201808 200920 199232 196809
54707A96809l352m153m292l766l116k863l075l400l387k953k467k252k062j433
$$ 196809 193457 189304 185012 181246 178130 175267 172192 168792 165405 162452 159985 157733 155671 154238
54693A54238n24j14n94j382j591j003j60L29K64j90q08j461k032k290k075j599
$$ 154238 153714 153600 153006 151624 150033 149030 148870 149199 149463 149273 148465 147004 144972 142682 140607 139008
54677A39008j264j038m44N38J020K81j064j672j137k97Q4J66L98P26P93N11R9
$$ 139008 137744 136706 136262 136800 137820 138101 137037 135365 134228 133931 134015 134181 134579 135305 136098 136609 136708
54660A36708j83j84M4K35J84Qj19l13o25o72j33N17M86j51m89r3N15P95Q70Q78
$$ 136708 136525 136341 136385 136620 136804 136812 136693 136380 135755 135083 134950 135467 135953 135802 135313 135220 135735 136530 137400 138278
54640A38278N07l24r18n92L21Q71O60J21k65m78o81p58m39K18O83M95j17l83K6
$$ 138278 138785 138461 137543 136951 137272 138143 138803 138924 138659 138181 137500 136742 136303 136521 137204 137699 137582 137199 137225
54621A37225N38M77J8j44J41L42J07l02m92m47l88m84p04q33o30j88J46L68Q45
$$ 137225 137763 138240 138258 138114 138255 138597 138704 138402 137910 137463 137075 136591 135887 135054 134424 134236 134382 134750 135595
54602A35595J439J251n2j336j377o04l26n95k43J050K123K080J346N99r8o40n08
$$ 135595 137034 138285 138233 136897 135520 134916 134590 133995 133752 134802 136925 139005 140351 140950 140852 140212 139704
54585A39704K42O93L95R9M26P66L26n16q41n70l23l44m08m45n02m02k3L29K94
$$ 139704 139946 140639 141034 141133 141559 142325 142651 142135 141294 140724 140401 140057 139649 139204 138702 138300 138277 138606 138900
54566A38900k9l69o46o95j73P92J396J187P41P47R74Q66N83O43R15Q55M62J91
$$ 138900 138871 138502 137856 137161 136988 137780 139176 140363 141104 141851 142825 143691 144274 144917 145832 146687 147149 147340
54548A47340Q6j91n08k73O55J659K130K064J713J186N17r3l94k75J22N19O93N59
$$ 147340 147426 147235 146727 146454 147109 148768 150898 152962 154675 155861 156378 156285 155891 155616 155738 156257 156950 157509
54530A57509J26n02r04n04O29J438R86l33j359j720j852j677o30Q22J166K9j028
$$ 157509 157635 157133 156229 155725 156354 157792 158778 158445 157086 155366 153514 151837 151207 152029 153195 153224 152196
54513A52196p48L9L0l58J09J161J331K75q28j175j232j500j615j151l92K06O56
$$ 152196 151448 151487 151517 151159 151268 152429 153760 154035 153207 152032 150800 149300 147685 146534 146142 146348 147004
54496A47004J101J317R57J28o54r35p77o67q49q53p1J187J836J454P57L80M9m48
$$ 147004 148105 149422 150379 150507 149853 148918 148141 147474 146625 145772 145701 146888 148724 150178 150935 151315 151364 150916
54478A50916m86K87R17M43m44l17Q13J627J516J102P90K62l61l02N01R43L40m72
$$ 150916 150430 150717 151634 152077 151633 151316 152129 153756 155272 156374 157164 157426 157065 156763 157264 158207 158547 158075
54460A58075l43N57J088O80o2k21L85J020Q47o1p54o60l64o33j182j205q05q17
$$ 158075 157732 158289 159377 160057 159995 159774 160159 161179 162026 161965 161211 160551 160187 159554 158372 157167 156362 155545
54442A55545j312j399p33j19k04n00k75K96M86P7m95p32m10L78J209J652J720
$$ 155545 154233 152834 152101 151982 151778 151278 151003 151299 151785 151862 151367 150635 150225 150603 151812 153464 155184
54425A55184J732J721J440R77P40P48N22n5m88n72q35j579k104j549j67R02R81
$$ 155184 156916 158637 160077 161054 161794 162542 163064 163009 162521 161949 161114 159535 157431 155882 155715 156617 157598
54408A57598M69J65M08R02J107P28Pm92l95J96Q76J294J345J214J212J432J632
$$ 157598 158067 158232 158640 159542 160649 161377 161384 160892 160497 160693 161569 162863 164208 165422 166634 168066 169698
54391A69698J568J286R35N17M7k89m40o40q86p09O4O71L22n94j012o75k30L7M85
$$ 169698 171266 172552 173487 174004 174051 173762 173322 172682 171796 171087 171151 171822 172144 171550 170538 169863 169633 169670 170155
54372A70155J057J113O21M85J096J521Q17n31j306j115n38o6L24P46J159J517
$$ 170155 171212 172325 172946 173431 174527 176048 176865 176334 175028 173913 173375 173309 173633 174379 175538 177055
54356A77055J709J493P76j25p97j040p53J61J412K227K132J580J414J822K266
$$ 177055 178764 180257 181033 180908 180111 179071 178318 178479 179891 182118 184250 185830 187244 189066 191332
54341A91332K288J966J616J453J490J578J414P69l23j612k796l538l554k904k078
$$ 191332 193620 195586 197202 198655 200145 201723 203137 203906 203583 201971 199175 195637 192083 189179 187101
54326A87101j561j377j209r01o46p52j249j801j971j618j012n13k09KJ10J3k85
$$ 187101 185540 184163 182954 182053 181407 180655 179406 177605 175634 174016 173004 172491 172282 172284 172394 172407 172122
54309A72122o68j049j285j095l85M13O53J49o74j250j289q43k61M8Q1K54P16R53
$$ 172122 171454 170405 169120 168025 167640 168053 168706 168855 168181 166931 165642 164799 164538 164586 164667 164921 165637 166590
54291A66590N99K42O47J402J271k1j255j292m09L68N78M34J67j41l05j58J61L77
$$ 166590 167189 167431 168078 169480 170751 170730 169475 168183 167774 168142 168720 169154 169321 169180 168875 168717 168878 169255
54273A69255M37N08O89R13J001Q23N09M32P41J006O99n1n71n15j46J63K92K37
$$ 169255 169692 170200 170889 171802 172803 173626 174135 174567 175308 176314 177013 176962 176391 175876 175730 175893 176185 176422
54255A76422J12K35P34J172J056O30M27L05k50r40r03k16K9n22q41k50L82L0q80
$$ 176422 176534 176769 177503 178675 179731 180361 180788 181093 180843 179903 179000 178784 178813 178291 177450 177200 177582 177612 176732
54236A76732j225q91o30p45r23j118j561k044j987j225j69P43J239J111M79QK79
$$ 176732 175507 174616 173986 173241 172318 171200 169639 167595 165608 164383 164214 164957 166196 167307 167786 167794 168073
54219A68073J029J480J293P54K48m1k4J83J98j75o26p55n86l27M3N25Q42Q67Q96
$$ 168073 169102 170582 171875 172629 172877 172836 172812 172995 173193 173018 172392 171637 171051 170724 170767 171292 172134 173001 173897
54200A73897J074R59K86l00m0P20Q86J05q77j274r95l60K36L87p5p95j266j389
$$ 173897 174971 175930 176216 175916 175876 176596 177482 177587 176710 175436 174441 174081 174317 174704 174629 173834 172568 171179
54182A71179j277p87J71J087J325J015P73O80K92m08r11j045j160j275r32j72
$$ 171179 169902 169115 169286 170373 171698 172713 173486 174166 174458 174050 173139 172094 170934 169659 168727 168555
54166A68555J76l61j132j222o38j09j00m20o10l01N63J562K017J613O86j92p33
$$ 168555 168731 168370 167238 166016 165378 165269 165169 164749 164139 163838 164401 165963 167980 169593 170279 170087 169354
54149A69354r40q65n55n1O27J327J636J260N11N4N7L8l26o66n11j2K81J94R7L70
$$ 169354 168414 167549 166994 166943 167570 168897 170533 171793 172304 172358 172415 172453 172127 171461 170950 170938 171219 171413 171510 171880
54129A71880R60J507J677J403Q27O3q95j906k431j890l75J217J949J666R81N99
$$ 171880 172840 174347 176024 177427 178254 178317 177422 175516 173085 171195 170820 172037 173986 175652 176633 177232
54113A77232P13R30P33O9m99l60M26J133J104L63n08r98j018p98n81m18k21Q9
$$ 177232 177945 178875 179608 179677 179178 178818 179244 180377 181481 181844 181336 180338 179320 178522 177941 177523 177302 177391
54095A77391N19R89J275J050L01l77k74M84Q78J92j025j583j012M5P22Q10P96
$$ 177391 177910 178899 180174 181224 181525 181148 180874 181358 182236 182428 181403 179820 178808 178853 179575 180385 181181
54078A81181J269K265L093L007K103J225Q47M96k89r95q06J25Q44R34Q61R92J086
$$ 181181 182450 184715 187808 190815 192918 194143 194990 195486 195197 194202 193396 193521 194365 195299 196160 197152 198238
54061A98238R22P46Q05J019J407K278L512M213L652K354J750K746M905O966Q005
$$ 198238 199160 199906 200711 201730 203137 205415 208927 213140 216792 219146 220896 223642 228547 235513 243518
54046B43518Q060P833P792P698P092O035M979M008K721R79p18j778k072j718p53
$$ 243518 251578 259411 267203 274901 281993 288028 293007 297015 299736 300715 299997 298219 296147 294429 293676
54031B93676O01J700J987J579J007N81L24L62P89J233J031P7q61j026n74l24o76
$$ 293676 294277 295977 297964 299543 300550 301131 301455 301817 302606 303839 304870 304947 304086 303060 302486 302162 301486
54014C01486j226j525j760k349l101l360k912k298k015j958j898k082k793l669
$$ 301486 300260 298735 296975 294626 291525 288165 285253 282955 280940 278982 277084 275002 272209 268540
54000B68540m047l841l594l623l715l613l356k954k269j397p80p04r59j176j160
$$ 268540 264493 260652 257058 253435 249720 246107 242751 239797 237528 236131 235351 234647 233688 232512 231352
53985B31352q05j03N56N26k68j053j123p95r03j563k005j638p58l0K76K49q3o69
$$ 231352 230547 230444 231000 231526 231258 230205 229082 228287 227384 225821 223816 222178 221420 221390 221666 221915 221832 221163
53967B21163j068o97M13J456J701J258P07K80j86n49k89O59J500J416N85k0L29
$$ 221163 220095 219398 219811 221267 222968 224226 224933 225213 225027 224478 224189 224848 226348 227764 228349 228329 228658
53950B28658J511K849L669L695L180K602K154J740J576K275L945N619O211N807
$$ 228658 230169 233018 236687 240382 243562 246164 248318 250058 251634 253909 257854 263473 269684 275491
53936B75491N370N405N650N967O635P493P623O394M341K611J803J696J686J258
$$ 275491 280861 286266 291916 297883 304518 312011 319634 326028 330369 332980 334783 336479 338165 339423
53922C39423L43m42k19J115K618L372L485L631L947M026L895M261N521O968P408
$$ 339423 339766 339324 339105 340220 342838 346210 349695 353326 357273 361299 365194 369455 374976 381944 389352
53907C89352O448M885L811L523L486L178K725K607L026L767M577N376O158O884
$$ 389352 395800 400685 404496 408019 411505 414683 417408 420015 423041 426808 431385 436761 442919 449803
53893D49803P554Q153Q491Q235P087M909J759j981n697r010j1993j4679j6603
$$ 449803 457357 465510 474001 482236 489323 494232 495991 494010 488313 479303 467310 452631 436028
53880D36028j7283j6960j6330j5525j4018j1683r315p779p096o675o150n575n147
$$ 436028 418745 401785 385455 369930 355912 344229 334914 327135 320039 313364 307214 301639 296492
53867B96492m991n064n054m584l717k961k634k578k643k988l535l576k531q97
$$ 296492 291501 286437 281383 276799 273082 270121 267487 264909 262266 259278 255743 252167 249636 248739
53853B48739J60R0o16j277j719k062k243k120j769j407j094p47l27J01N45J025
$$ 248739 248899 248989 248373 247096 245377 243315 241072 238952 237183 235776 234682 233935 233608 233709 234254 235279
53837B35279J358J176L62o00j024q06n16o52j040j206j024p12l37K06Q54J353
$$ 235279 236637 237813 238175 237575 236551 235745 235229 234577 233537 232331 231307 230595 230258 230464 231318 232671
53821B32671J562J522J219O46N1k50k10M1N26J228J730J620J227J373K294L328
$$ 232671 234233 235755 236974 237620 237671 237421 237211 237252 237778 239006 240736 242356 243583 244956 247250 250578
53805B50578L884M044M085M022L942M097M272L725K316J214J646L286M535M338
$$ 250578 254462 258506 262591 266613 270555 274652 278924 282649 284965 286179 287825 291111 295646 299984
53791B99984L130K031J696J993K357K293J770J188Q67O71L11j92o62j185j957
$$ 299984 303114 305145 306841 308834 311191 313484 315254 316442 317309 317980 318291 318099 317437 316252 314295
53776C14295k792l195l023k766l015l785m506m631m206l745l514l188k457j757
$$ 314295 311503 308308 305285 302519 299504 295719 291213 286582 282376 278631 275117 271929 269472 267715
53762B67715j861k741l434l238k567k179k119j924j510j257j329j420j203o59
$$ 267715 265854 263113 259679 256441 253874 251695 249576 247652 246142 244885 243556 242136 240933 240274
53748B40274p5J25l04j037j389j117p39p13p33l01M11Q43R30J046J259J290J112
$$ 240274 240199 240324 240020 238983 237594 236477 235738 235025 234292 233991 234402 235245 236175 237221 238480 239770 240882
53731B40882R45P32K58k25j64M55J090J532K065K632K601J777Q83O05O89N41K11
$$ 240882 241827 242559 242817 242592 242428 242883 243973 245505 247570 250202 252803 254580 255463 256068 256757 257298 257509
53714B57509J74M86Q54J284K004K852L329L282L019K674K007J061M83Q18J736
$$ 257509 257683 258169 259023 260307 262311 265163 268492 271774 274793 277467 279474 280535 281018 281836 283572
53699B83572K357K244J781J597J926K542L089L282L010K444K023K113K594K818
$$ 283572 285929 288173 289954 291551 293477 296019 299108 302390 305400 307844 309867 311980 314574 317392
53685C17392K195Q22n45j197j109q15o98o58n43n99j129j870k144j735j132q03
$$ 317392 319587 320409 319864 318667 317558 316743 316045 315387 314844 314245 313116 311246 309102 307367 306235 305432
53669C05432o29l67j37k0L50J219J991J818Q02q7k93j99l26p02j133j500j541
$$ 305432 304803 304436 304299 304279 304629 305848 307839 309657 310459 310372 310079 309880 309554 308852 307719 306219 304678
53652C04678j004j89K97M48Q07J342J278M54j90j8L23J16j20M31J388J750J515
$$ 304678 303674 303485 303782 304230 305037 306379 307657 308111 307921 307903 308226 308342 308222 308653 310041 311791 313306
53635C13306J499J789J622P90Kj80R3O58J573K545K975K811K644K732K774K765
$$ 313306 314805 316594 318216 319006 319008 318828 318921 319579 321152 323697 326672 329483 332127 334859 337633 340398
53619C40398L176M005M532M416M245M492M724M362L590K970K678K642K952L548
$$ 340398 343574 347579 352111 356527 360772 365264 369988 374350 377940 380910 383588 386230 389182 392730
53605C92730L961L854L458L080K606J948J553J824K377K406J577L20n71m06Q45
$$ 392730 396691 400545 404003 407083 409689 411637 413190 415014 417391 419797 421374 421694 421123 420717 421562
53590D21562K192K371J402O95J152J885J619O57L21Q95J331R25J30m78j028j809
$$ 421562 423754 426125 427527 428222 429374 431259 432878 433535 433856 434751 436082 437007 437137 436659 435631 433822
53574D33822k698l492m151m456m068l245k793l013l260k959k385j944j382l65
$$ 433822 431124 427632 423481 419025 414957 411712 408919 405906 402646 399687 397302 395358 393976 393611
53560C93611N95O71n5n98k91O38J636K360K522J930R44M58J030K266L331L793
$$ 393611 394206 394877 394822 394224 393933 394571 396207 398567 401089 403019 403963 404421 405451 407717 411048 414841
53544D14841L772L501L131K841K817L114L687M503N444O235O665O833O948P056
$$ 414841 418613 422114 425245 428086 430903 434017 437704 442207 447651 453886 460551 467384 474332 481388
53530D81388P223P890R480J1594J3143J3602J3644J4153J4978J5259J4784J4364
$$ 481388 488611 496501 505981 517575 530718 544320 557964 572117 587095 602354 617138 631502
53518F31502J4770J5867J7007J7842J8511J9251K0141K1053K1785K2314K2922
$$ 631502 646272 662139 679146 696988 715499 734750 754891 775944 797729 820043 842965
53507H42965K3797K4600K4776K4408K4135K4176K3987K3260K2624K2693K2885
$$ 842965 866762 891362 916138 940546 964681 988857 1012844 1036104 1058728 1081421 1104306
53496A104306K2048K0175J8582J8246J8709J8902J8515J8056J7925J8001J8021
$$ 1104306 1126354 1146529 1165111 1183357 1202066 1220968 1239483 1257539 1275464 1293465 1311486
53485A311486J7949J7921J7979J8007J7826J7400J6862J6252J5327J3794J1744
$$ 1311486 1329435 1347356 1365335 1383342 1401168 1418568 1435430 1451682 1467009 1480803 1492547
53474A492547R578P452N148K588J24j970l889n894p777r206j0408j1914j3650
$$ 1492547 1502125 1509577 1514725 1517313 1517437 1515467 1511578 1505684 1497907 1488701 1478293 1466379 1452729
53461A452729j4841j5087j4999j5476j6643j7974j9107k0061k0686k0643k0003
$$ 1452729 1437888 1422801 1407802 1392326 1375683 1357709 1338602 1318541 1297855 1277212 1257209
53450A257209j9395j9210j9100j8659j8225j8345j8629j7904j5811j3519j2375
$$ 1257209 1237814 1218604 1199504 1180845 1162620 1144275 1125646 1107742 1091931 1078412 1066037
53439A066037j2233j1745j0059p662n492l840k381q37O46J743K382K950M039N802
$$ 1066037 1053804 1042059 1032000 1024338 1018846 1015006 1012625 1011788 1012434 1014177 1016559 1019509 1023548 1029350
53425A029350P693R061R952J0903J2101J3317J4658J6611J9013K0722K0981K0550
$$ 1029350 1037043 1046104 1056056 1066959 1079060 1092377 1107035 1123646 1142659 1163381 1184362 1204912
53413A204912K0881K2539K5072K7928L0653L2528L3195L3629L5356L8504M1532
$$ 1204912 1225793 1248332 1273404 1301332 1331985 1364513 1397708 1431337 1466693 1505197 1546729
53402A546729M3263M4225M5504M7171M8623M9727N0796N1861N2705N3341N3814
$$ 1546729 1589992 1634217 1679721 1726892 1775515 1825242 1876038 1927899 1980604 2033945 2087759
53391B087759N3887N3550N3389N3727N3800N2655N0549M8566M6950M4892M1927
$$ 2087759 2141646 2195196 2248585 2302312 2356112 2408767 2459316 2507882 2554832 2599724 2641651
53380B641651L8582L5395L2234K8812K5112K1057J6489J1788P618L782q43o703
$$ 2641651 2680233 2715628 2747862 2776674 2801786 2822843 2839332 2851120 2858738 2862520 2861677 2854974
53368B854974j2813j8188k3229k8796l4630l9692m3682m7089m9952n1647n2078
$$ 2854974 2842161 2823973 2800744 2771948 2737318 2697626 2653944 2606855 2556903 2505256 2453178
53357B453178n2106n2465n2902n2809n2142n1308n0467m9375m7808m5897m4099
$$ 2453178 2401072 2348607 2295705 2242896 2190754 2139446 2088979 2039604 1991796 1945899 1901800
53346A901800m2902m2470m2497m2507m2262m1733m0764l9112l6904l4692l2815
$$ 1901800 1858898 1816428 1773931 1731424 1689162 1647429 1606665 1567553 1530649 1495957 1463142
53335A463142l0897k8392k5532k3277k2145k1444k0123j8225j6806j6368j6059
$$ 1463142 1432245 1403853 1378321 1355044 1332899 1311455 1291332 1273107 1256301 1239933 1223874
53324A223874j4946j3501j2894j3149j2986j1650r904q834q415p866o810n410
$$ 1223874 1208928 1195427 1182533 1169384 1156398 1144748 1134844 1126010 1117595 1109729 1102919 1097509
53312A097509l747j775K86K063L516M919O476Q222J0075J1715J2678J2942J3201
$$ 1097509 1093762 1091987 1092273 1094336 1097852 1102771 1109247 1117469 1127544 1139259 1151937 1164879 1178080
53299A178080J4190J5963J8071K0141K1933K3240K4186K5277K6649K7660K7696
$$ 1178080 1192270 1208233 1226304 1246445 1268378 1291618 1315804 1341081 1367730 1395390 1423086
53288A423086K7052K6420K5837K4805K3177K1197J8887J6188J3549J1553R931
$$ 1423086 1450138 1476558 1502395 1527200 1550377 1571574 1590461 1606649 1620198 1631751 1641682
53277A641682P829N026K148m71l331o844j0480j3261j4774j5529j6553j8573k1200
$$ 1641682 1649511 1654537 1656685 1656214 1652883 1646039 1635559 1622298 1607524 1591995 1575442 1556869 1535669
53264A535669k3151k3696k3666k4395k5943k7271k7925k8417k8934k8913k8255
$$ 1535669 1512518 1488822 1465156 1440761 1414818 1387547 1359622 1331205 1302271 1273358 1245103
53253A245103k7820k8127k8493k8156k7421k6998k6920k6803k6594k6356k5880
$$ 1245103 1217283 1189156 1160663 1132507 1105086 1078088 1051168 1024365 997771 971415 945535
53242I45535k5120k4498k4137k3455k2190k1119k0875k0661j9269j6993j5250
$$ 945535 920415 895917 871780 848325 826135 805016 784141 763480 744211 727218 711968
53231G11968j4465j3595j1950j0303r682r993j0453j0783j1247j1884j2340j2388
$$ 711968 697503 683908 671958 661655 651973 641980 631527 620744 609497 597613 585273 572885
53219E72885j2219j2109j2113j2047j1716j1057j0182r354q936r148r745j0034
$$ 572885 560666 548557 536444 524397 512681 501624 491442 482088 473152 464004 454259 444225
53207D44225r556q677q113p857p160n848m926n336o514o994o178m849m049m084
$$ 444225 434669 425992 417879 410022 402862 397014 392088 386752 380238 373244 367066 362217 358168 354084
53193C54084m675n317n397m561l247k367k295k560k697k814l044l049k580k120
$$ 354084 349409 344092 338695 334134 330887 328520 326225 323665 320968 318154 315110 312061 309481 307361
53179C07361k264k750k735j994j196r01q64o65m01l79m59l23j29l17q07j022q24
$$ 307361 305097 302347 299612 297618 296422 295521 294657 293992 293591 293212 292753 292430 292301 291984 291177 290155 289331
53162B89331p82j249j730j623j128r25j190j566j752j617j001n8M33j36j184j591
$$ 289331 288549 287300 285570 283947 282819 281894 280704 279138 277386 275769 274768 274710 275143 275007 273823 272232
53146B72232j292j272j861k128j450n56l35m72j82L06J30o69j044l50R32J931
$$ 272232 270940 269668 267807 265679 264229 263673 263338 262866 262684 262990 263120 262451 261407 261057 261989 263920
53130B63920K168J576M12p08j155q65l09O9J34l9j34K97J213J757J211J61m4R19
$$ 263920 266088 267664 268076 267368 266213 265348 265039 265108 265242 265203 265069 265366 266579 268336 269547 269708 269664 270583
53112B70583J902J784Q32R2N1L07K86j71q56j438j743j839j797j441o04L76P63
$$ 270583 272485 274269 275101 275193 275244 275551 275837 275666 274810 273372 271629 269790 267993 266552 265948 266324 267087
53095B67087K85n30j005j064j053j087r76o24k11O3J77J62l6m01o39l94K42N87
$$ 267087 267372 266842 265837 264773 263720 262633 261657 261033 260822 260885 261062 261224 261188 260787 260148 259754 259996 260583
53077B60583O7r98j654j422p82l53n7M65J042J157Q13N33M99L24k17p68r27p58
$$ 260583 260650 259652 257998 256576 255794 255441 255384 255849 256891 258048 258861 259394 259893 260217 260000 259232 258305 257547
53059B57547m99k25J0K6k20n46q87j372j806j590n67M78P21M03M07Q81J041M33
$$ 257547 257048 256823 256833 256859 256639 256093 255206 253834 252028 250438 249871 250349 251070 251473 251880 252761 253802 254235
53041B54235l28m34J8K66p1o51j009j031q38o03n39p74j055r21l32J60J06k61
$$ 254235 253907 253473 253491 253757 253686 253035 252026 250995 250157 249554 249015 248241 247186 246265 245933 246093 246199 245938
53023B45938m45m56o20q29n80J91Q62J006R93J303J668J505R42P55J241J716J421
$$ 245938 245493 245037 244417 243588 243008 243199 244061 245067 246060 247363 249031 250536 251478 252233 253474 255190 256611
53006B56611N33o3J41P19Q67L46l13m90k01j5k90p62r08n64l9K77K69J73L01O22
$$ 256611 257144 257081 257222 257941 258808 259154 258841 258351 258150 258135 257845 257083 256175 255611 255572 255849 256118 256291 256592 257214
52986B57214O87J68n79p64l9J105J879J814R70o2l77M51J632J847R14K5L0L06
$$ 257214 257901 258069 257490 256726 256687 257792 259671 261485 262455 262393 262016 262467 264099 265946 266860 266885 266915 267221
52968B67221L3k99K96J487J921J165K44J18O96J427J914J697M57j105j600p21
$$ 267221 267254 266955 267251 268738 270659 271824 272068 272186 272882 274309 276223 277920 278377 277272 275672 274951
52952B74951J14l78j616k080j334k41M66P72P08J23p50j236j063o57m84n12o12
$$ 274951 275065 274687 273071 270991 269657 269416 269882 270654 271362 271485 270735 269499 268436 267779 267295 266783 266171
52935B66171q65j218j274q45l41k60m59m53k43l36q76j306j133o97q15j754k864
$$ 266171 265306 264088 262814 261969 261628 261368 260909 260456 260213 259877 259001 257695 256562 255865 255050 253296 250432
52918B50432l216k408q49O53J473J603J458J295R41K72l21l16J34L07j56p99j008
$$ 250432 247216 244808 243959 244612 246085 247688 249146 250441 251382 251654 251333 251017 251151 251458 251302 250503 249495
52901B49495p37l12J14N73R59J047P47J42n39q27k29J119K254K184R22n72j299
$$ 249495 248758 248446 248560 249133 250092 251139 251886 252028 251489 250662 250433 251552 253806 255990 256912 256340 255041
52884B55041r93j92J75m41j559k054j445m40J09K62N32Q29P62N78R43J736K059
$$ 255041 254048 253856 254031 253590 252031 249977 248532 248092 248201 248463 248995 249824 250586 251164 252107 253843 255902
52867B55902J559R24Q19J077J289J449J599J407P55J52O3P8n47j765k723k822
$$ 255902 257461 258385 259204 260281 261570 263019 264618 266025 266780 266932 266995 267073 266526 264761 262038 259216
52851B59216k296j706j344j300j703k520l216l007j698j46M47k29j274j686j470
$$ 259216 256920 255214 253870 252570 250867 248347 245131 242124 240426 240280 240727 240498 239224 237538 236068
52836B36068j324j477j367n06P63J566J343K96q15j187n67N77J435J447O22m96
$$ 236068 234744 233267 231900 231394 232157 233723 235066 235362 234547 233360 232793 233370 234805 236252 236874 236378
52820B36378j113p55J79Q18Q77R70J506J909J537Q59Q30J427J804J738J807K110
$$ 236378 235265 234510 234689 235507 236384 237354 238860 240769 242306 243165 243995 245422 247226 248964 250771 252881
52804B52881J947J087L11J66P7o78j861k746l114l156k882k319j877j890k092
$$ 252881 254828 255915 256226 256392 256469 255791 253930 251184 248070 244914 242032 239713 237836 235946 233854
52789B33854k016j608r99j60P67J183Q12L34N44J138J158N27K17P93J539J483
$$ 233854 231838 230230 229231 229071 229838 231021 231833 232167 232711 233849 235007 235534 235751 236544 238083 239566
52773B39566P40K38M03O35J97p79j495j529j263j160j102p62k54J04M10R19J347
$$ 239566 240306 240544 240947 241582 241779 241000 239505 237976 236713 235553 234451 233689 233435 233539 233949 234868 236215
52756B36215J193O95O28J012R64Q7q69j173j071r70n13O75J930K217J583J072
$$ 236215 237408 238103 238731 239743 240707 240794 239925 238752 237681 236711 236198 236873 238803 241020 242603 243675
52740B43675J310J906K166J841J205P77R00J285J262P45M77Q87J304R84L21K57
$$ 243675 244985 246891 249057 250898 252103 252880 253780 255065 256327 257072 257549 258436 259740 260724 261045 261302
52724B61302Q35J293J265R89M75m92j522j753j096m68n65j094j440j422j166q00
$$ 261302 262137 263430 264695 265684 266159 265667 264145 262392 261296 260828 260263 259169 257729 256307 255141 254341
52708B54341n73o84q26m15M66R58N14l82r52r99p53l28J68M27K66K1J42N95R88
$$ 254341 253768 253084 252258 251843 252309 253267 253781 253399 252447 251448 250695 250367 250535 250962 251228 251249 251391 251986 252974
52689B52974J139J162J125R40O38M84O75J002J017N73J26K39Q15J095O46k7j75
$$ 252974 254113 255275 256400 257340 257978 258462 259137 260139 261156 261729 261855 262094 262909 264004 264650 264623 264448
52672B64448J45K08l61j168j644j561r75j19N41N71N0m66n33j60L65P22P00M86
$$ 264448 264593 264801 264440 263272 261628 260067 259092 258973 259514 260085 260135 259669 259136 258976 259341 260063 260763 261249
52654B61249O96J666K807L111K342J199L27k01m12j87K26J37p12j606j720j132
$$ 261249 261945 263611 266418 269529 271871 273070 273397 273196 272784 272597 272823 272960 272248 270642 268922 267790
52638B67790n94n52q18r93q27k66M99J100J295J181R94Q40P00N19J80l73r04j047
$$ 267790 267196 266644 265826 264833 264006 263740 264239 265339 266634 267815 268809 269649 270349 270868 271048 270675 269771 268724
52620B68724q32p14q92r60m94K84P90Q21O54N60N17M21L07K79L97O15P87Q07P15
$$ 268724 267892 267178 266286 265326 264832 265116 265906 266727 267381 267941 268458 268879 269186 269465 269862 270477 271264 272071 272786
52601B72786N60J88n97j519j855j184N9R63R99L97j97k43L06J034J494J620J587
$$ 272786 273346 273534 272937 271418 269563 268379 268438 269401 270400 270797 270600 270357 270663 271697 273191 274811 276398
52584B76398J366P95Q9k07L2K73J39L0N02J341J754J359M78m38j170j540j317
$$ 276398 277764 278559 278648 278441 278473 278746 278885 278915 279417 280758 282512 283871 284349 283911 282741 281201 279884
52567B79884n52K98O89M05k86p60n37J04K43n67j518j461m49L01J02l71k34L09
$$ 279884 279332 279630 280319 280724 280438 279678 279141 279245 279488 278921 277403 275942 275493 275794 275896 275525 275291 275600
52549B75600M52N8l26m43n73q02q13n41m14o42p95m48J57N00N09M88N20M15J43
$$ 275600 276052 276110 275784 275341 274768 273966 273153 272612 272198 271556 270761 270313 270470 270970 271479 271967 272487 272902 273045
52530B73045q2j33m3K21P29J254J335Q12P9l33k57N6K57K18R3R7K04K14J98N54
$$ 273045 272963 272830 272787 273008 273737 274991 276326 277138 277217 276884 276627 276683 276940 277158 277251 277348 277552 277766 277964 278518
52510B78518J369K090K213K043K179K475K259J528J025R79O02o69k146k699k129
$$ 278518 279887 281977 284190 286233 288412 290887 293146 294674 295699 296678 297280 296611 294465 291766 289637
52495B89637j176m94k28k94n26o52n29l13j76q9j03m28r85j263j069q37q24n11
$$ 289637 288461 287967 287739 287445 286919 286267 285738 285425 285249 285160 285057 284629 283644 282381 281312 280475 279651 279140
52477B79140N06J615J926J546J284J369J391J273J357J544J351R37J118K116L104
$$ 279140 279646 281261 283187 284733 286017 287386 288777 290050 291407 292951 294302 295239 296357 298473 301577
52462C01577L246K566J578P42M98R76J453Q58p78k137k286j817j765k176k429
$$ 301577 304823 307389 308967 309709 310207 311183 312636 313494 312716 310579 308293 306476 304711 302535 300106
52447C00106k415k503k625k260j269j27O83J064J082P70K35l68r67j518j894k015
$$ 300106 297691 295188 292563 290303 289034 288907 289590 290654 291736 292506 292741 292373 291406 289888 287994 285979
52431B85979j992j890j464m32R85K024K031J112N3l66j07K48L04K79M77P00O52
$$ 285979 283987 282097 280633 280201 281186 283210 285241 286353 286406 286040 285933 286181 286485 286764 287241 287941 288593
52414B88593O67J323K444L202L370L700M755O048O776O837O632O387O183O220
$$ 288593 289260 290583 293027 296229 299599 303299 308054 314102 320878 327715 334347 340734 346917 353137
52400C53137O416O069M574K245p7k047l875n559o639o755o022m845l736l115k924
$$ 353137 359553 365622 370196 372441 372364 370317 366442 360883 354244 347489 341467 336622 332886 329771 326847
52385C26847k475j277J65Q21M53j37k03J33M07N96R98J678K381K870L105L169
$$ 326847 324372 323095 323260 324081 324534 324397 324194 324327 324734 325330 326328 328006 330387 333257 336362 339531
52369C39531L243L511L880L929L329K297J386R10P57O56M98K80K1j75j20J97M71
$$ 339531 342774 346285 350165 354094 357423 359720 361106 362016 362773 363429 363927 364207 364228 364053 363933 364130 364601
52352C64601M32K45L55Q59J365J580J663J850J945J679J409J894L309M847N582
$$ 364601 365033 365278 365633 366492 367857 369437 371100 372950 374895 376574 377983 379877 383186 388033 393615
52337C93615N464N174N194N364N408N546O253P537Q741R278R294R361R729J0278
$$ 393615 399079 404253 409447 414811 420219 425765 432018 439555 448296 457574 466868 476229 485958 496236
52323D96236J1135J2691J4825J6598J7123J6425J5166J3968J3280J3451J4315
$$ 496236 507371 520062 534887 551485 568608 585033 600199 614167 627447 640898 655213
52312F55213J5063J5098J4713J4471J4270J3692J2933J2567J2592J2544J2382
$$ 655213 670276 685374 700087 714558 728828 742520 755453 768020 780612 793156 805538
52301H05538J2353J2160J1219R841R057R065Q843P658N999M547L116J263p79k399
$$ 805538 817891 830051 841270 851111 860168 869233 878076 885734 891733 896280 899396 900659 899880 897481
52287H97481l345l684l571l470l979m922n205m101k168m15Q39J766K399K815L429
$$ 897481 894136 890452 886881 883411 879432 874510 869305 865204 863036 862621 863460 865226 867625 870440 873869
52272H73869M418N315N775O158O818P330P266P126P696Q833R764J0182J0262R987
$$ 873869 878287 883602 889377 895535 902353 909683 916949 924075 931771 940604 950368 960550 970812 980799
52258I80799R398R129R732J0643J0838J0373J0233J0769J1297J1243J0702R660
$$ 980799 990197 999326 1009058 1019701 1030539 1040912 1051145 1061914 1073211 1084454 1095156 1104816
52246A104816P804N352L161J602J76j381k447k476j922j634j887k478l222l839
$$ 1104816 1112620 1117972 1121133 1122735 1122911 1121530 1119083 1116607 1114685 1113051 1111164 1108686 1105464 1101625
52232A101625l820l066k279k140k425k432k081j847j797j399m81K61J14o41j011
$$ 1101625 1097805 1094739 1092460 1090320 1087895 1085463 1083382 1081535 1079738 1078339 1077858 1078119 1078233 1077592 1076581
52217A076581m87M93J278J844K611L695M721N366N673N797N799N834O106O449
$$ 1076581 1076094 1076587 1077865 1079709 1082320 1086015 1090736 1096102 1101775 1107572 1113371 1119205 1125311 1131760
52203A131760O323N578M869M864N359N668N622N658N963O190O080N876N920O105
$$ 1131760 1138083 1143661 1148530 1153394 1158753 1164421 1170043 1175701 1181664 1187854 1193934 1199810 1205730 1211835
52189A211835N978N238M051K959K371K085J476L12q93j657k282l440n127o656
$$ 1211835 1217813 1223051 1227102 1230061 1232432 1234517 1235993 1236305 1235412 1233755 1231473 1228033 1222906 1216250
52175A216250p547q031q485q908r042q695p879o763n602m461l163j694m66J52
$$ 1216250 1208703 1200672 1192187 1183279 1174237 1165542 1157663 1150900 1145298 1140837 1137674 1135980 1135514 1135666
52161A135666M27R19J618K013J968J970K280K384J702N22k48k38j11o40j552j700
$$ 1135666 1136093 1137012 1138630 1140643 1142611 1144581 1146861 1149245 1150947 1151469 1151221 1150983 1150872 1150232 1148680 1146980
52145A146980n85P88J069L40p4M00P67N6j158j696j522j545j979j974r04R10K898
$$ 1146980 1146395 1147183 1148252 1148592 1148518 1148918 1149685 1149741 1148583 1146887 1145365 1143820 1141841 1139867 1138963 1139873 1142771
52128A142771M872O782Q482R987J1511J3078J4592J6235J8260K0274K1421K1399
$$ 1142771 1147643 1154425 1162907 1172894 1184405 1197483 1212075 1228310 1246570 1266844 1288265 1309664
52116A309664K0823K0396K0221K0072J9754J8999J7559J5716J4201J3309J2534
$$ 1309664 1330487 1350883 1371104 1391176 1410930 1429929 1447488 1463204 1477405 1490714 1503248
52105A503248J1295R669Q082O766N845N515N720N912N509M547L513K700J948Q98
$$ 1503248 1514543 1524212 1532294 1539060 1544905 1550420 1556140 1562052 1567561 1572108 1575621 1578321 1580269 1581167
52091A581167o53k623m671o447p814q874r809j0742j1547j1712j0653q521o398
$$ 1581167 1580514 1577891 1573220 1566773 1558959 1550085 1540276 1529534 1517987 1506275 1495622 1487101 1480703
52078A480703n263m865m160k705j063K09J387L071N237P118P969P885P816Q580
$$ 1480703 1475440 1470575 1466415 1463710 1462647 1462856 1464243 1467314 1472551 1479669 1487638 1495523 1503339 1511919
52064A511919R852J0496J0041R284Q992Q704P579N921M879M827N011M707L802
$$ 1511919 1521771 1532267 1542308 1551592 1560584 1569288 1576867 1582788 1587667 1592494 1597505 1602212 1606014
52051A606014K293K61j649k759l476m856o896q429r068r915j1764j3760j4732
$$ 1606014 1608307 1608568 1606919 1604160 1600684 1595828 1588932 1580503 1571435 1561520 1549756 1535996 1521264
52038A521264j4878j5091j5325j4820j3499j2136j1262j0708j0217r795r528r487
$$ 1521264 1506386 1491295 1475970 1461150 1447651 1435515 1424253 1413545 1403328 1393533 1384005 1374518
52026A374518r710r961r784r164q752q956r199q764p972p795q433r023q892q443
$$ 1374518 1364808 1354847 1345063 1335899 1327147 1318191 1308992 1300228 1292256 1284461 1276028 1267005 1258113 1249670
52012A249670q553r470j0550j1000j0765j0603j1268j2645j3979j4905j5826j7178
$$ 1249670 1241117 1231647 1221097 1210097 1199332 1188729 1177461 1164816 1150837 1135932 1120106 1102928
52000A102928j8755k0026k0785k1162k1262k1063k0450j9221j7337j5319j3999
$$ 1102928 1084173 1064147 1043362 1022200 1000938 979875 959425 940204 922867 907548 893549
51989H93549j3670j3796j3746j3385j2874j2304j1805j1539j1402j1147j0970
$$ 893549 879879 866083 852337 838952 826078 813774 801969 790430 779028 767881 756911
51978G56911j1385j2312j2963j2931j2684j2570j2090j0791r168p980p138n998
$$ 756911 745526 733214 720251 707320 694636 682066 669976 659185 650017 642037 634899 628901
51966F28901m352k419k63K022L941N058N590N926N885N151M106L435L096K437
$$ 628901 624549 622130 621867 623889 627830 632888 638478 644404 650289 655440 659546 662981 666077 668514
51952F68514J170m35k203m126n854o763o601n532l697j267J189L063M473O028
$$ 668514 669684 669249 667046 662920 657066 650303 643702 638170 634473 633206 634395 637458 641931 647959
51938F47959P880R544J0637J1237J1460J1207J0367Q935O862M203J265j731m899
$$ 647959 655839 665383 676020 687257 698717 709924 720291 729226 736088 740291 741556 739825 734926
51925G34926q189j0908j2393j2960j3527j4388j4996j4896j4188j3107j1796j0572
$$ 734926 726737 715829 703436 690476 676949 662561 647565 632669 618481 605374 593578 583006
51913E83006r744r112q178o847n398l829j942o6J184J946L163N317P756R729J1354
$$ 583006 573262 564150 555972 549125 543727 539898 537956 537890 539074 541020 544183 549500 557256 566985 578339
51898E78339J3153J5126J6813J7929J8413J8076J6577J3729R601M479j175o766
$$ 578339 591492 606618 623431 641360 659773 677849 694426 708155 717756 722235 721060 714294
51886G14294j1705j5506j7846j8740j8481j7251j5028j2153r571p917o635m665
$$ 714294 702589 687083 669237 650497 632016 614765 599737 587584 578013 570096 563461 558796
51874E58796j858R84L290N117O308O297N048L395J982N51j351l549n598p316q499
$$ 558796 556938 557922 561212 566329 572637 578934 583982 587377 589359 589910 588559 585010 579412 572096 563597
51859E63597q674p732o385n447m932m315l322k045p36J64J75m42o32J16Q10J75
$$ 563597 554923 547191 540806 535359 530427 526112 522790 520745 520009 520173 520348 519906 519274 519390 520200 520375
51843E20375j578l058l556l568l540l283k866l041m049m881m519l299k269j610
$$ 520375 518797 515739 512183 508615 505075 501792 498926 495885 491836 486955 482436 479137 476868 475258
51829D75258o89N68J364J257P56L97l2q66j764k173k194k340k646k654k167j448
$$ 475258 474569 475137 476501 477758 478514 478911 478879 478013 476249 474076 471882 469542 466896 464242 462075 460627
51813D60627o57L04J320J971K081J923J759J571J379J287J071K17j298k733l404
$$ 460627 459970 460274 461594 463565 465646 467569 469328 470899 472278 473565 474636 474853 473555 470822 467418
51798D67418l414l219k899k331j728j489j673k035k421k794k990k823k304j480
$$ 467418 464004 460785 457886 455555 453827 452338 450665 448630 446209 443415 440425 437602 435298 433818
51784D33818l55Q04J336Q65j26p83q02n44m78q23j525k120j896n86J283L066M684
$$ 433818 433463 434267 435603 436468 436342 435559 434757 434213 433735 432912 431387 429267 427371 426785 428068 431134 435818
51767D35818O203P183P168O609O528P231P988P979P052N522L718J787m04l041
$$ 435818 442021 449204 456372 462981 469509 476740 484728 492707 499759 505281 508999 510786 510382 507341
51753E07341n765p613q037p656p387p204o551n573m992m805m170k631o00J402
$$ 507341 501576 493963 485926 478270 470883 463679 457128 451555 446563 441758 437588 434957 434357 435759
51739D35759L146M294M601M704N642P374Q694Q942Q739Q648Q178O778M850L084
$$ 435759 438905 443199 447800 452504 458146 465520 474214 483156 491895 500543 508721 515499 520349 523433
51725E23433J577L18k88k33m61j697l291m129m170m125m147l940l744m047m489
$$ 523433 525010 525328 525040 524807 524346 522649 519358 515229 511059 506934 502787 498847 495103 491056 486567
51710D86567m235l413l040l357l335k239o65M33R90J463J934K247K502K750K577
$$ 486567 482332 478919 475879 472522 469187 466948 466283 466716 467706 469169 471103 473350 475852 478602 481179
51695D81179J697P01M73R17J057M71j16K6N40N62j83j401l029n078o828p096n668
$$ 481179 482876 483577 484050 484967 486024 486495 486379 486405 486945 487507 487324 485923 482894 477816 470988 463892 458224
51678D58224l762k610k105j359j16J110J933K448K781K960L219L815M524M877
$$ 458224 454462 451852 449747 448388 448272 449382 451315 453763 456544 459504 462723 466538 471062 475939
51664D75939M850M801M773M462L889L390K879J749j99k372m068m919m571k713
$$ 475939 480789 485590 490363 494825 498714 502104 504983 506732 506533 504161 500093 495174 490603 487890
51650D87890J67K781M287N022N554N649M764K979P60j743m501p017q679r450r640
$$ 487890 488057 490838 495125 500147 505701 511350 516114 519093 519853 518110 513609 506592 497913 488463 478823
51635D78823r279q325p273o770o612n933m352k444r11J11Q30J337J586J534J102
$$ 478823 469544 461219 453946 447176 440564 434631 430279 427835 426924 427035 427865 429202 430788 432322 433424
51620D33424K86o89j532k223k884l334l159k393j655j495j756j849j427o34J74
$$ 433424 433710 433021 431489 429266 426382 423048 419889 417496 415841 414346 412590 410741 409314 408680 408854
51605D08854P62J080J199J220J254J444J959K900M171N542O781P768Q494Q962
$$ 408854 409616 410696 411895 413115 414369 415813 417772 420672 424843 430385 437166 444934 453428 462390
51591D62390R103Q831Q148P098N542L301O69j442k302k110j575q68L57K040L484
$$ 462390 471493 480324 488472 495570 501112 504413 505082 503640 501338 499228 497653 496785 497142 499182 502666
51576E02666M344N139O495Q386J0481J2731J5045J6917J7993J8769K0015K1678
$$ 502666 507010 512149 518644 527030 537511 550242 565287 582204 600197 618966 638981 660659
51564F60659K2949K3479K3899K4996K6845K9009L1319L4060L7367M0529M2162
$$ 660659 683608 707087 730986 755982 782827 811836 843155 877215 914582 955111 997273
51553I97273M1251L8008L3361K7620K0123J0479l08j0487j9123k6505l3177l9006
$$ 997273 1038524 1076532 1109893 1137513 1157636 1168115 1167807 1157320 1138197 1111692 1078515 1039509
51541A039509m3277m5404m5482m4294m2685m0766l7978l4056k9677k5779k2537
$$ 1039509 996232 950828 905346 861052 818367 777601 739623 705567 675890 650111 627574
51530F27574j9524j6601j4073j2066j0367q970q126p682o992n846m991n196o076
$$ 627574 608050 591449 577376 565310 554943 545973 537847 530165 523173 517327 512336 507140 501064
51517E01064o447n715m445l491l048k817k682k802l172l468l443l209l077l283
$$ 501064 494617 488902 484457 480966 477918 475101 472419 469617 466445 462977 459534 456325 453248 449965
51503D49965l829m350m105k639n72P72Q66O50J197K272K890K871K871L056K823
$$ 449965 446136 441786 437681 435042 434470 435242 436108 436758 437955 440227 443117 445988 448859 451915 454738
51488D54738K013J333J184J035L86l84q53j340k196k927k940k717l237m470n381
$$ 454738 456751 458084 459268 460303 460689 460305 459452 458112 455916 452989 450049 447332 444095 439625 434244
51473D34244n342m798m415m336m410m501m373l777k874k286k419k981l289k939
$$ 434244 428902 424104 419689 415353 410943 406442 402069 398292 395418 393132 390713 387732 384443 381504
51459C81504k149j499j306j213n71O09J491J475J059J213K151L258M090M818N671
$$ 381504 379355 377856 376550 375337 374766 375375 376866 378341 379400 380613 382764 386022 390112 394930 400601
51444D00601O565P494Q858J0961J3335J4856J4645J2812J0315P960N800L674J994
$$ 400601 407166 414660 423518 434479 447814 462670 477315 490127 500442 508402 514202 517876 519870
51431E19870J343J241K68k146m786o180o450o797p611q151p940p357o774o061
$$ 519870 521213 522454 522722 520576 515790 509610 503160 496363 488752 480601 472661 465304 458530 452469
51417D52469n313n103n502n523m187j820L30J505J970K311K708K960K886K507
$$ 452469 447156 442053 436551 431028 426841 425021 425351 426856 428826 431137 433845 436805 439691 442198
51403D42198K011J665J688K134K830L529M082M511M924N429O224P493R076J0395
$$ 442198 444209 445874 447562 449696 452526 456055 460137 464648 469572 475001 481225 488718 497794 508189
51389E08189J1072J1517J2475J4108J5995J8016K0562K3763K7231L0895L5316
$$ 508189 519261 530778 543253 557361 573356 591372 611934 635697 662928 693823 729139
51378G29139M0694M6180N0792N4423N7280N8870N8331N5483N0683M3896L4765
$$ 729139 769833 816013 866805 921228 978508 1037378 1095709 1151192 1201875 1245771 1280536
51367A280536K3530J1152j448j3687k4994l4873m3222n0019n4774n7004n7094
$$ 1280536 1304066 1315218 1313770 1300083 1275089 1240216 1196994 1146975 1092201 1035197 978103
51356I78103n6020n4210n1431m7708m3567l9289l4718k9967k5629k2070j9062
$$ 978103 922083 867873 816442 768734 725167 685878 651160 621193 595564 573494 554432
51345E54432j6306j3803j1625r892q958q994r322q883p557o244n569n156m503
$$ 554432 538126 524323 512698 502806 493848 484854 475532 466649 459092 452848 447279 442123 437620
51332D37620l720l069k491k014j979k377k549k093j582j814k761l675l978l565
$$ 437620 433900 430831 428340 426326 424347 421970 419421 417328 415746 413932 411171 407496 403518 399953
51318C99953k645j708j376j758k184j906r29J67Q95J052O04k38r58j174r53n04
$$ 399953 397308 395600 394224 392466 390282 388376 387447 387614 388509 389561 390165 389927 388969 387795 386842 386338
51302C86338K03J218K222K783K839K612K201J581Q90M17K98M13O04Q06R74J020
$$ 386338 386541 387759 389981 392764 395603 398215 400416 401997 402887 403304 403602 404015 404619 405425 406399 407419
51286D07419P87J99m84p13j79P39J370J476J335J078N51j63n51l62n0j98p50j104
$$ 407419 408206 408405 407921 407208 407029 407768 409138 410614 411949 413027 413578 413415 412864 412502 412452 412254 411504 410400
51268D10400q55j63N00Q02Q13Q35R64R19M93Qo7J81J91l27j122j864k416k594
$$ 410400 409545 409382 409882 410684 411497 412332 413296 414215 414708 414716 414649 414830 415021 414694 413572 411708 409292 406698
51250D06698k221j534j048r15q49p74r42j289j257o02J76N42O04P04P82N50O3
$$ 406698 404477 402943 401895 400980 400131 399357 398415 397126 395869 395267 395443 395985 396589 397293 398075 398625 398688
51233C98688l39m07r9M86J086J426J536J638J646J205L32m34p79r78j280j431
$$ 398688 398349 397942 397843 398329 399415 400841 402377 404015 405661 406866 407198 406764 405985 405007 403727 402296
51217D02296j184q02o44n72k12M01Q63Q86N37J70J63N18P51N63N81J689L584M778
$$ 402296 401112 400310 399666 399094 398882 399283 400146 401032 401569 401739 401902 402420 403171 403734 404315 406004 409588 414366
51199D14366M406L254K498K262J984J598J456J568J661J698J730J523R21K65r7
$$ 414366 418772 422026 424524 426786 428770 430368 431824 433392 435053 436751 438481 440004 440925 441190 441093
51184D41093l87p83q05o2P40N44n55j504j888k250k739k612j560n32n44j266j603
$$ 441093 440706 439923 439118 439056 439796 440340 439785 438281 436393 434143 431404 428792 427232 426700 426156 424890 423287
51167D23287j287j097j548k117j995j107n2P49J367J889K099J899J661J778K016
$$ 423287 422000 420903 419355 417238 415243 414136 414084 414833 416200 418089 420188 422087 423748 425526 427542
51152D27542J835J232O84K75m13j378j849j354n74n42j316k005j915j198m80k30
$$ 427542 429377 430609 431293 431568 431155 429777 427928 426574 426000 425458 424142 422137 420222 419024 418544 418314
51136D18314m39o27k91M63R95R52O29L83J67J0L11J133J685J218J30m90k13M39
$$ 418314 417875 417248 416957 417420 418415 419367 419996 420379 420546 420556 420867 422000 423685 424903 425033 424543 424330 424769
51118D24769Q92J070J158J382J916K575K704J955R34N59R00J303J487J755K150
$$ 424769 425661 426731 427889 429271 431187 433762 436466 438421 439355 439914 440814 442117 443604 445359 447509
51103D47509K191J683J157J180J700K285K642K698K479K096J698J312Q98N20K42
$$ 447509 449700 451383 452540 453720 455420 457705 460347 463045 465524 467620 469318 470630 471528 472048 472290
51088D72290n0m61q59j142j554k280k847k532j374l33k10p88j137n86O79J763
$$ 472290 472240 471779 470920 469778 468224 465944 463097 460565 459191 458858 458648 457860 456723 456137 456816 458579
51072D58579J854J075M36P56J882L150M259N198N707N562N277N813P420R344J0729
$$ 458579 460433 461508 461944 462700 464582 467732 471991 477189 482896 488458 493735 499548 506968 516312 527041
51057E27041J1303J1095J0166Q804P558O823O700P334Q873J0931J2606J3292J3154
$$ 527041 538344 549439 559605 568409 575967 582790 589490 596824 605697 616628 629234 642526 655680
51044F55680J2604J1680J0253Q512O868N495M138K407J52k363m632o379p832r406
$$ 655680 668284 679964 690217 698729 705597 711092 715230 717637 717789 715426 710794 704415 696583 687177
51030F87177j1146j2705j3698j3903j3318j2303j1466j0997j0278q633o314m194
$$ 687177 676031 663326 649628 635725 622407 610104 598638 587641 577363 568730 562416 558222
51018E58222k566r55Q67K367L130L585M386N425O101O326O718P705Q911R650R833
$$ 558222 555656 554701 555568 557935 561065 564650 569036 574461 580562 586888 593606 601311 610222 619872 629705
51003F29705R989J0484J1045J1273J1285J1467J1764J1834J1809J2202J2840J2703
$$ 629705 639694 650178 661223 672496 683781 695248 707012 718846 730655 742857 755697 768400
50991G68400J1308R562Q601Q279P669O591N748N523N555N475N284M959M468M225
$$ 768400 779708 789270 797871 806150 813819 820410 826158 831681 837236 842711 847995 852954 857422 861647
50977H61647M708N563N888N593N638O682Q169R344J0525J2765J6502K1025K5193
$$ 861647 866355 871918 877806 883399 889037 895719 903888 913232 923757 936522 953024 974049 999242
50964I99242K8477L1282L4315L7619M0466M2370M3846M5581M7234M7747M6781
$$ 999242 1027719 1059001 1093316 1130935 1171401 1213771 1257617 1303198 1350432 1398179 1444960
50953A444960M5081M3413M1820M0079L8125L5881L3261L0556K8284K6579K5265
$$ 1444960 1490041 1533454 1575274 1615353 1653478 1689359 1722620 1753176 1781460 1808039 1833304
50942A833304K4471K4448K4772K4582K3714K2722K1613J9537J6077J1871P552
$$ 1833304 1857775 1882223 1906995 1931577 1955291 1978013 1999626 2019163 2035240 2047111 2054663
50931B054663L059j608n958j0059j4926k1004k7131l2018l6006m0244m4746m8428
$$ 2054663 2057722 2056114 2050156 2040097 2025171 2004167 1977036 1945018 1909012 1868768 1824022 1775594
50919A775594n0763n2164n2963n3126n2890n2609n1856m9714m6159m2356l9247
$$ 1775594 1724831 1672667 1619704 1566578 1513688 1461079 1409223 1359509 1313350 1270994 1231747
50908A231747l6623l3826l0719k7617k4819k2507k0718j9154j7445j5699j4378
$$ 1231747 1195124 1161298 1130579 1102962 1078143 1055636 1034918 1015764 998319 982620 968242
50897I68242j3493j2501j1227j0253r946r638q398o343m518l541l020k345j521
$$ 968242 954749 942248 931021 920768 910822 901184 892786 886443 881925 878384 875364 873019 871498
50884H71498q77l84K59J037J630K002K570L566M655N399N864O386O994P430P734
$$ 871498 870621 870237 870496 871533 873163 875165 877735 881301 885956 891355 897219 903605 910599 918029 925763
50869I25763Q314R397J0739J1957J2964J3953J5222J6964J9048K1034K2701K4485
$$ 925763 934077 943474 954213 966170 979134 993087 1008309 1025273 1044321 1065355 1088056 1112541
50857A112541K7060L0528L4402L8325M2335M6509N0812N5461O0872O7032P3408
$$ 1112541 1139601 1170129 1204531 1242856 1285191 1331700 1382512 1437973 1498845 1565877 1639285
50846A639285P9572Q5449R0783R5056R8207J00854J03374J05170J05303J03475
$$ 1639285 1718857 1804306 1895089 1990145 2088352 2189206 2292580 2397750 2503053 2606528
50836B606528R9970R5031Q8764Q1375P3071O3988N4639M6058L9045L3486K8823
$$ 2606528 2706498 2801529 2890293 2971668 3044739 3108727 3163366 3209424 3248469 3281955 3310778
50825C310778K5039K2754K2476K4162K7315L1162L4774L7358L8421L7601L4550
$$ 3310778 3335817 3358571 3381047 3405209 3432524 3463686 3498460 3535818 3574239 3611840 3646390
50814C646390K9118K1329J0986k273j8271l5944n3922p1124q6683r9924j10865
$$ 3646390 3675508 3696837 3707823 3705550 3687279 3651335 3597413 3526289 3439606 3339682 3228817
50803C228817j20043j27368j31685j32132j29383j24778j18761j11078j02105
$$ 3228817 3108774 2981406 2849721 2717589 2588206 2463428 2344667 2233589 2131484
50794B131484r2875q3808p4497o4894n5744m7619m0327l3673k7999k3507j9653
$$ 2131484 2038609 1954801 1880304 1815410 1759666 1712047 1671720 1638047 1610048 1586541 1566888
50783A566888j5801j2125r381q006p781q193q786r290r658j0034j0547j1208j2040
$$ 1566888 1551087 1538962 1529581 1521575 1513794 1505601 1496815 1487525 1477867 1467833 1457286 1446078 1434038
50770A434038j3148j4532j5946j7064j7794j8406j9265k0375k1228k1299k0720
$$ 1434038 1420890 1406358 1390412 1373348 1355554 1337148 1317883 1297508 1276280 1254981 1234261
50759A234261k0103j9694j9025j7634j5735j3855j2186j0645r189p623n490k661
$$ 1234261 1214158 1194464 1175439 1157805 1142070 1128215 1116029 1105384 1096195 1088572 1083082 1080421
50747A080421K16K509M536P064J0035J2657J4661J6665J9232K2294K5693K9506
$$ 1080421 1080637 1083146 1087682 1094746 1104781 1117438 1132099 1148764 1167996 1190290 1215983 1245489
50735A245489L3586L7446M0914M4313M7689N0494N2423N3974N5669N7196N7806
$$ 1245489 1279075 1316521 1357435 1401748 1449437 1499931 1552354 1606328 1661997 1719193 1776999
50724A776999N7219N5641N3287N0411M7479M4708M1509L6985L0947K4121J7384
$$ 1776999 1834218 1889859 1943146 1993557 2041036 2085744 2127253 2164238 2195185 2219306 2236690
50713B236690J1249N928J441k349n425p176o739l894N69N528J0348J4920J9156
$$ 2236690 2247939 2253867 2255308 2252959 2247534 2240358 2233619 2229725 2230294 2235822 2246170 2261090 2280246
50700B280246K2624K4611K4334K1332J5837Q685O65q096j7920k8758l9734m9623
$$ 2280246 2302870 2327481 2351815 2373147 2388984 2397669 2398334 2390238 2372318 2343560 2303826 2254203
50688B254203n7635o3639o7717o9759o9542o7035o2549n6649m9977m3038l6081
$$ 2254203 2196568 2132929 2065212 1995453 1925911 1858876 1796327 1739678 1689701 1646663 1610582
50677A610582k9187k2460j5966r558k987L630R651J4446J8043K0952K3417K5064
$$ 1610582 1581395 1558935 1542969 1533411 1530424 1534054 1543705 1558151 1576194 1597146 1620563 1645627
50665A645627K5384K4402K2747K1198K0146J9452J8639J7285J5380J3394J2017
$$ 1645627 1671011 1695413 1718160 1739358 1759504 1778956 1797595 1814880 1830260 1843654 1855671
50654A855671J1634J2018J2589J2991J3325J3840J4666J5973J8086K1029K4193
$$ 1855671 1867305 1879323 1891912 1904903 1918228 1932068 1946734 1962707 1980793 2001822 2026015
50643B026015K6916K9331L2171L5682L9263M2255M4653M6701M8274M8986M8626
$$ 2026015 2052931 2082262 2114433 2150115 2189378 2231633 2276286 2322987 2371261 2420247 2468873
50632B468873M7236M5015M2305L9453L6554L3639L0970K8514K5094J8959R728
$$ 2468873 2516109 2561124 2603429 2642882 2679436 2713075 2744045 2772559 2797653 2816612 2826340
50621B826340j053j1823k2628l3905m4353n1334n3244n0574m4843l7553l0125
$$ 2826340 2825287 2813464 2790836 2756931 2712578 2661244 2608000 2557426 2512583 2475030 2444905
50610B444905k3594j7952j2611p778m592l701m641p043j1411j8044k5985l3860
$$ 2444905 2421311 2403359 2390748 2382970 2378378 2374677 2370036 2362993 2351582 2333538 2307553 2273693
50598B273693m1265m8480n5227o0659o4364o6595o7450o6614o4088o0583n6762
$$ 2273693 2232428 2183948 2128721 2068062 2003698 1937103 1869653 1803039 1738951 1678368 1621606
50587A621606n2555m7602m2205l7304l3470l0222k6624k2462j8526j5621j3623
$$ 1621606 1569051 1521449 1479244 1441940 1408470 1378248 1351624 1329162 1310636 1295015 1281392
50576A281392j1798r760p691n747l846k131j029o01k10Q13K413M090N630P222
$$ 1281392 1269594 1259834 1252143 1246396 1242550 1240419 1239390 1238789 1238579 1239392 1241805 1245895 1251525 1258747
50562A258747Q990J0846J2730J4680J6800J9287K2405K5991K9187L1115L1866
$$ 1258747 1267737 1278583 1291313 1305993 1322793 1342080 1364485 1390476 1419663 1450778 1482644
50551A482644L2414L3422L4520L4945L4508L3572L2364L0872K9400K8610K8844
$$ 1482644 1515058 1548480 1583000 1617945 1652453 1686025 1718389 1749261 1778661 1807271 1836115
50540A836115K9804L1261L3690L7689M2938M8327N3274N8333O4280P1021P7823
$$ 1836115 1865919 1897180 1930870 1968559 2011497 2059824 2113098 2171431 2235711 2306732 2384555
50529B384555Q4326R0833R7691J04808J11816J18308J23815J27774J29715J29428
$$ 2384555 2468881 2559714 2657405 2762213 2874029 2992337 3116152 3243926 3373641 3503069
50519C503069J26862J21903J14335J04063R1383P6902O1080M3911K5303N702j3966
$$ 3503069 3629931 3751834 3866169 3970232 4061615 4138517 4199597 4243508 4268811 4274513 4260547
50508D260547l3012n1137o7833q2071r2993j00515j04841j05730j02688r5695
$$ 4260547 4227535 4176398 4108565 4026494 3933501 3832986 3728145 3622415 3519727 3424032
50498C424032q5316p2308n7580m2261k7240j2731J167J3619K3329K9604L2441
$$ 3424032 3338716 3266408 3208828 3166567 3139327 3126596 3127763 3141382 3164711 3194315 3226756
50487C226756L1492K5732J4561j160j9480l8503n6968p4098q9309j01928j11156
$$ 3226756 3258248 3283980 3298541 3297381 3277901 3239398 3182430 3108332 3019023 2917095 2805939
50476B805939j16413j17935j16768j14071j10467j06074j00898r5053q8712q2001
$$ 2805939 2689526 2571591 2454823 2340752 2230285 2124211 2023313 1928260 1839548 1757547
50466A757547p4942o7601o0273n3409m7104m1031l5053k9668k5430k2130j9076
$$ 1757547 1682605 1615004 1554731 1501322 1454218 1413187 1378134 1348466 1323036 1300906 1281830
50455A281830j5957j2940j0081p235m601k604j150M35K571M995P278R253J0751
$$ 1281830 1265873 1252933 1242852 1235617 1231016 1228412 1227262 1227697 1230268 1235263 1242541 1251794 1262545
50442A262545J1541J1724J1703J1540J0847R586Q345P477O524M987L256K211K161
$$ 1262545 1274086 1285810 1297513 1309053 1319900 1329486 1337831 1345308 1351832 1356819 1360075 1362286 1364447
50429A364447K714L496M530N909P499R049J0445J1850J3679J6231J9375K2751
$$ 1364447 1367161 1370657 1375187 1381096 1388595 1397644 1408089 1419939 1433618 1449849 1469224 1491975
50417A491975K6309L0312L4724L9076M3085M7088N1529N6263O0607O3875O5765
$$ 1491975 1518284 1548596 1583320 1622396 1665481 1712569 1764098 1820361 1880968 1944843 2010608
50406B010608O6451O6440O5966O4518O1362N6632N1342M6034M0001L2219K2629
$$ 2010608 2077059 2143499 2209465 2273983 2335345 2391977 2443319 2489353 2529354 2561573 2584202
50395B584202J1955P37j0908k2715l4084m4401n3198o0159o5211o8505o9955o9045
$$ 2584202 2596157 2596894 2585986 2563271 2529187 2484786 2431588 2371429 2306218 2237713 2167758 2098713
50383B098713o5392n9377n1863m3519l4686k5739j7110r056j693M740R864J3286
$$ 2098713 2033321 1973944 1922081 1878562 1843876 1818137 1801027 1791971 1790278 1795018 1804882 1818168
50371A818168J4577J3386R758M217k717j0844j9842k8855l6823m3130m7658n0525
$$ 1818168 1832745 1846131 1855889 1860106 1857389 1846545 1826703 1797848 1761025 1717895 1670237 1619712
50359A619712n2071n2825n3022n2381n0615m7970m4942m1816l8813l6321l4460
$$ 1619712 1567641 1514816 1461794 1409413 1358798 1310828 1265886 1224070 1185257 1148936 1114476
50348A114476l2727l0575k8113k5690k3131k0067j6787j4002j1817r732p609n876
$$ 1114476 1081749 1051174 1023061 997371 974240 954173 937386 923384 911567 901835 894226 888350
50336H88350m610l282j573K31J957L872N923P364P783P974R033J0925J2661J3778
$$ 888350 883740 880458 878885 879116 881073 884945 890868 898232 906015 913989 923022 933947 946608 960386
50322I60386J4879J6491J8032J8249J6483J3151R146N059J062k630n518p192p777
$$ 960386 975265 991756 1009788 1028037 1044520 1057671 1066817 1071876 1072938 1070308 1064790 1057598 1049821
50309A049821p787p554p045o250n428m797m171l195j847m98N31J285K008K802
$$ 1049821 1042034 1034480 1027435 1021185 1015757 1010960 1006789 1003594 1001747 1001249 1001780 1003065 1005073 1007875
50295A007875L542M003M044L742L432L549M304N483O601P343P765Q123Q557Q973
$$ 1007875 1011417 1015420 1019464 1023206 1026638 1030187 1034491 1039974 1046575 1053918 1061683 1069806 1078363 1087336
50281A087336R101Q581P066M526J422j493l656m962n585n722n471m787l583j980
$$ 1087336 1096437 1105018 1112084 1116610 1118032 1116539 1112883 1107921 1102336 1096614 1091143 1086356 1082773 1080793
50267A080793m50M54N57J04o07j353j837j734j161o93p55j101j230j032p80o20
$$ 1080793 1080343 1080797 1081354 1081458 1080851 1079498 1077661 1075927 1074766 1074073 1073318 1072217 1070987 1069955 1069175 1068555
50251A068555m47k79l36o32p47k28Q84K159L285M325N465O763Q216R894J1841
$$ 1068555 1068108 1067829 1067493 1066861 1066114 1065886 1066770 1068929 1072214 1076539 1082004 1088767 1096983 1106877 1118718
50236A118718J3891J5828J7609J9167K0153K0313K0089K0230K0585J9992J7891
$$ 1118718 1132609 1148437 1166046 1185213 1205366 1225679 1245768 1265998 1286583 1306575 1324466
50225A324466J5385J3956J3552J2831J1121R104P513O127M309J774j555n733j0392
$$ 1324466 1339851 1353807 1367359 1380190 1391311 1400415 1407928 1414055 1418364 1420138 1418583 1412850 1402458
50212A402458j4870j9002k3193k7330l0358l1451l0975k9679k7594k4425k0531
$$ 1402458 1387588 1368586 1345393 1318063 1287705 1256254 1225279 1195600 1168006 1143581 1123050
50201A123050j6742j3580j1364j0621j1501j3072j4170j4834j6051j8094k0013
$$ 1123050 1106308 1092728 1081364 1070743 1059242 1046170 1032000 1017166 1001115 983021 963008
50190I63008k0922k0849k0107j8677j6698j4908j3930j3458j2781j1738j0751
$$ 963008 942086 921237 901130 882453 865755 850847 836917 823459 810678 798940 788189
50179G88189r993r133p914o611n678n167m741m189l720l579l580l269k510j633
$$ 788189 778196 769063 761149 754538 748860 743693 738952 734763 731043 727464 723884 720615 718105 716472
50165G16472r10k31N32J149J292J068R65J339K162L173M109M811N359O002O835
$$ 716472 715562 715331 715863 717012 718304 719372 720337 721676 723838 727011 731120 735931 741290 747292 754127
50150G54127P584P863P554O839N961N008L852K312N32q88j445j407j512j925k000
$$ 754127 761711 769574 777128 783967 789928 794936 798788 801100 801632 800744 799299 797892 796380 794455 792455
50135G92455j227J24J579L116M830O433P663Q776J0130J1511J2432J2967J3735
$$ 792455 791228 791352 792931 796047 800877 807310 814973 823749 833879 845390 857822 870789 884524
50122H84524J5226J7481K0298K3316K6140K8755L1631L5062L8607M1578M3770
$$ 884524 899750 917231 937529 960845 986985 1015740 1047371 1082433 1121040 1162618 1206388
50111A206388M5372M6441M6956M7021M6602M5401M3492M1613M0215L8666L6103
$$ 1206388 1251760 1298201 1345157 1392178 1438780 1484181 1527673 1569286 1609501 1648167 1684270
50100A684270L2601K8633K3786J7120Q648n90r874j9188k8111l5494m0618m3812
$$ 1684270 1716871 1745504 1769290 1786410 1795058 1794468 1784594 1765406 1737295 1701801 1661183 1617371
50088A617371m5580m5862m4598m2285l9463l6201l2500k8723k5237k2000j8877
$$ 1617371 1571791 1525929 1481331 1439046 1399583 1363382 1330882 1302159 1276922 1254922 1236045
50077A236045j5985j3517j1586j0338r785r498q986q450q478q920q903q135p390
$$ 1236045 1220060 1206543 1194957 1184619 1174834 1165336 1156350 1147900 1139422 1130502 1121599 1113464 1106074
50064A106074p267p358p264p582r013j0952j1927j1292r801q625q315q622q769
$$ 1106074 1098807 1091449 1084185 1076603 1067590 1056638 1044711 1033419 1023618 1014993 1006678 998056 989287
50051I89287q030o410m681l463k534j418k40N75J231K459M424O392P621Q198Q713
$$ 989287 981257 974847 970166 966703 964169 962751 962511 963086 964317 966776 971200 977592 985213 993411 1002124
50036A002124R479J0325J0927J1094J0821J0245R573Q953Q372P690O804N718M438
$$ 1002124 1011603 1021928 1032855 1043949 1054770 1065015 1074588 1083541 1091913 1099603 1106407 1112125 1116563
50023A116563K843R38q62j963k339k718l722n151o485p805r512j1255j1968j1228
$$ 1116563 1119406 1120344 1119482 1117519 1115180 1112462 1108740 1103589 1097104 1089299 1079787 1068532 1056564 1045336
50009A045336r902r057q700q096o873n247l382j069J879N308Q969J2824J6960
$$ 1045336 1035434 1026377 1017677 1009581 1002708 997461 994079 993010 994889 1000197 1009166 1021990 1038950
49996A038950K1207K5082K8195L0639L2713L4210L4392L2886L0253K7316K4286
$$ 1038950 1060157 1085239 1113434 1144073 1176786 1210996 1245388 1278274 1308527 1335843 1360129
49985A360129K1083J8096J5819J3879J1280P674L617o10n519j1448j7829k3956
$$ 1360129 1381212 1399308 1415127 1429006 1440286 1447960 1451577 1450967 1445448 1434000 1416171 1392215
49973A392215k9755l5303m0047m3147m4302m3794m2017l9381l6323l3029k9395
$$ 1392215 1362460 1327157 1287110 1243963 1199661 1155867 1113850 1074469 1038146 1005117 975722
49962I75722k5576k2172j9459j6914j4030j1173q943p083m740j751J140L403N305
$$ 975722 950146 927974 908515 891601 877571 866398 857455 850372 845632 843881 845021 848424 853729
49949H53729P186Q742R476R472R239Q928Q113O458M272K134J24k164m782p004
$$ 853729 860915 869657 879133 888605 897844 906772 914885 921343 925615 927749 927873 925709 920927 913923
49935I13923q164q653r604j1621j4276j6771j8616j9553j9437j8501j7287j6076
$$ 913923 905759 897106 887502 875881 861605 844834 826218 806665 787228 768727 751440 735364
49923G35364j4698j3022j1284r697q127o368m441k471o74M43M60j84l32N82J919
$$ 735364 720666 707644 696360 686663 678536 672168 667727 665256 664582 665025 665485 665301 664969 665551 667470
49908F67470K937L864N318P133Q568R450J0366J1742J3303J4508J5084J5042J4526
$$ 667470 670407 674271 679589 686722 695290 704740 715106 726848 740151 754659 769743 784785 799311
49895G99311J3732J2771J1568R948P827N300K680L58j653l977p159j0686j3337
$$ 799311 813043 825814 837382 847330 855157 860457 863137 863495 861842 857865 850706 840020 826683
49882H26683j4670j5428j6235j6657j6158j5218j4664j4395j3668j2339j0939
$$ 826683 812013 796585 780350 763693 747535 732317 717653 703258 689590 677251 666312
49871F66312r680q263o668n370m563l877k998k077j258k99J068K691M180N348
$$ 666312 656632 648369 641701 636331 631768 627891 624893 622816 621558 621259 622327 625018 629198 634546
$$ [...]
##END NTUPLES=NMR SPECTRUM
##END=
