
##TITLE=UV1244_M9_1261-1207_20_7241261_aUttAETxPP
##JCAMPDX= 6.0         $$ Bruker NMR JCAMP-DX V2.0
##DATA TYPE= NMR SPECTRUM
##DATA CLASS= NTUPLES
##ORIGIN= BRUKER
##OWNER= Administrator
$$ 1.72 TOPSPIN		Version 2.1
$$ 2013-01-25 03:21:13.170 -0500  Administrator@X
$$ Compression mode = diff/dup
##.OBSERVE FREQUENCY= 400.02188249412
##.OBSERVE NUCLEUS= ^1H
##.ACQUISITION MODE= SIMULTANEOUS (DQD)
##.ACQUISITION SCHEME= undefined
##.AVERAGES= 64
##.DIGITISER RES= 22
##SPECTROMETER/DATA SYSTEM= spect
##.PULSE SEQUENCE= noesygpps1d.comp
##.SOLVENT NAME= COFFEE_meoh
##.SHIFT REFERENCE= INTERNAL, COFFEE_meoh, 1, 14.96101
##AUDIT TRAIL= $$ (NUMBER, WHEN, WHO, WHERE, PROCESS, VERSION, WHAT)
$$ ##TITLE= Audit trail, TOPSPIN		Version 2.1
$$ ##JCAMPDX= 5.01
$$ ##ORIGIN= Bruker BioSpin GmbH
$$ ##OWNER= Administrator
$$ $$ E:\/data/COFFEE/nmr/UV1244_M9_1261-1207_20_7241261_aUttAETxPP/32/pdata/1/auditp.txt
$$ ##AUDIT TRAIL=  $$ (NUMBER, WHEN, WHO, WHERE, PROCESS, VERSION, WHAT)
(   1,<2013-01-25 03:21:07.420 -0500>,<Administrator>,<X>,<go>,<TOPSPIN 2.1>,
      <created by zg
	started at 2013-01-25 03:09:37.764 -0500,
	POWCHK enabled, PULCHK disabled,
       configuration hash MD5:
       86 BA 57 50 F2 9D 5C 9B 26 00 A9 28 5F 66 2E 89
       data hash MD5: 64K
       6A 37 29 0B 8F AC E6 D8 06 F1 42 45 CC A6 4D 61>)
(   2,<2013-01-25 03:21:10.420 -0500>,<Administrator>,<X>,<proc1d>,<TOPSPIN 2.1>,
      <Start of raw data processing
       efp LB = 0.3 FT_mod = 6 PKNL = 1 PHC0 = 0 PHC1 = 0 SI = 128K 
       data hash MD5: 128K
       3F A6 4C BA 5B 38 8F AF 81 B8 2E A4 D7 10 DF FE>)
(   3,<2013-01-25 03:21:11.451 -0500>,<Administrator>,<X>,<proc1d>,<TOPSPIN 2.1>,
      <pk PHC0 = -78.86536 PHC1 = 0 
       data hash MD5: 128K
       DE 80 5C BA DD A6 DA D5 B5 D1 12 49 60 A4 EC 58>)
(   4,<2013-01-25 03:21:12.139 -0500>,<Administrator>,<X>,<proc1d>,<TOPSPIN 2.1>,
      <abs ABSG = 1 
       data hash MD5: 128K
       3E 5D 96 A9 59 86 F8 98 26 7E 5F 41 04 7C 0E 49>)
(   5,<2013-01-25 03:21:12.311 -0500>,<Administrator>,<X>,<proc1d>,<TOPSPIN 2.1>,
      <abs ABSG = 2 
       data hash MD5: 128K
       4A D4 4A 7B E9 88 CE 00 D5 42 91 E2 F5 5A 87 99>)
(   6,<2013-01-25 03:21:12.498 -0500>,<Administrator>,<X>,<proc1d>,<TOPSPIN 2.1>,
      <abs ABSG = 3 
       data hash MD5: 128K
       FF 33 23 4A 61 FF C4 A6 87 7B EF 70 0E 64 51 51>)
(   7,<2013-01-25 03:21:12.670 -0500>,<Administrator>,<X>,<proc1d>,<TOPSPIN 2.1>,
      <abs ABSG = 4 
       data hash MD5: 128K
       34 F6 3C A0 15 A8 27 2B 72 24 E3 AE 1F 0D 98 A7>)
(   8,<2013-01-25 03:21:12.842 -0500>,<Administrator>,<X>,<proc1d>,<TOPSPIN 2.1>,
      <abs ABSG = 5 
       data hash MD5: 128K
       FC A2 DF C5 2D DD 26 36 16 99 37 5F DC C1 82 04>)
$$ ##END=
$$ 
$$ $$ hash MD5
$$ $$ 00 65 FC 8E 23 11 AC C6 3A 74 13 1A A3 89 41 77
##$RELAX= 
##$RELAX= 
##$RELAX= 
##$RELAX= 
##$RELAX= 
##$RELAX= 
##$RELAX= 
##$RELAX= 
$$ Bruker specific parameters
$$ --------------------------
##$DU= <E:\>
##$EXPNO= 32
$$ [...]
##$TP07= 0
##$TPNAME0= <>
##$TPNAME1= <>
##$TPNAME2= <>
##$TPNAME3= <>
##$TPNAME4= <>
##$TPNAME5= <>
##$TPNAME6= <>
##$TPNAME7= <>
##$TPOAL= (0..7)
0.5 0.5 0.5 0.5 0.5 0.5 0.5 0.5
##$TPOFFS= (0..7)
0 0 0 0 0 0 0 0
##$TUNHIN= 0
##$TUNHOUT= 0
##$TUNXOUT= 0
##$USERA1= <user>
##$USERA2= <user>
##$USERA3= <user>
##$USERA4= <user>
##$USERA5= <user>
##$V9= 5
##$VALIST= <valist>
##$VCLIST= <CCCCCCCCCCCCCCC>
##$VD= 0
##$VDLIST= <DDDDDDDDDDDDDDD>
##$VPLIST= <PPPPPPPPPPPPPPP>
##$VTLIST= <TTTTTTTTTTTTTTT>
##$WBST= 1024
##$WBSW= 4
##$XGAIN= (0..3)
0 0 0 0
##$XL= 0
##$YL= 0
##$YMAX_a= 6470622
##$YMIN_a= -13609448
##$ZGOPTNS= <>
##$ZL1= 120
##$ZL2= 120
##$ZL3= 120
##$ZL4= 120
##$ABSF1= 14.96101
##$ABSF2= -5.597172
##$ABSG= 5
##$ABSL= 3
##$ALPHA= 0
##$AQORDER= 0
##$ASSFAC= 0
##$ASSFACI= 0
##$ASSFACX= 0
##$ASSWID= 0
##$AUNMP= <proc_prof1d_extract.lims>
##$AXLEFT= 0
##$AXNAME= <>
##$AXNUC= <1H>
##$AXRIGHT= 0
##$AXTYPE= 0
##$AXUNIT= <>
##$AZFE= 0.1
##$AZFW= 0.1
##$BCFW= 0
##$BC_mod= 0
##$BYTORDP= 0
##$COROFFS= 0
##$CY= 15
##$DATMOD= 1
##$DC= 0
##$DFILT= <>
##$DTYPP= 0
##$F1P= 0
##$F2P= 0
##$FCOR= 0.5
##$FTSIZE= 131072
##$FT_mod= 6
##$GAMMA= 0
##$GB= 0
##$INTBC= 1
##$INTSCL= 1
##$ISEN= 128
##$LB= 0.3
##$LEV0= 0
##$LPBIN= 0
##$MAXI= 10000
##$MC2= 0
##$MEAN= 0
##$ME_mod= 0
##$MI= 0
##$NCOEF= 0
##$NC_proc= -2
##$NLEV= 6
##$NOISF1= 0
##$NOISF2= 0
##$NSP= 0
##$NTH_PI= 0
##$NZP= 0
##$OFFSET= 14.96101
##$PC= 1
##$PHC0= -78.86536
##$PHC1= 0
##$PH_mod= 1
##$PKNL= yes
##$PPARMOD= 0
##$PPDIAG= 0
##$PPIPTYP= 0
##$PPMPNUM= 2147483647
##$PPRESOL= 1
##$PSCAL= 4
##$PSIGN= 0
##$PYNMP= <proc.py>
##$REVERSE= no
##$SF= 400.020009630852
##$SI= 131072
##$SIGF1= 0
##$SIGF2= 0
##$SINO= 400
##$SIOLD= 131072
##$SPECTYP= <>
##$SREGLST= <1H.CDCl3>
##$SSB= 0
##$STSI= 131072
##$STSR= 0
##$SW_p= 8223.68421052631
##$SYMM= 0
##$S_DEV= 0
##$TDeff= 65536
##$TDoff= 0
##$TI= <>
##$TILT= no
##$TM1= 0
##$TM2= 0
##$TOPLEV= 0
##$USERP1= <user>
##$USERP2= <user>
##$USERP3= <user>
##$USERP4= <user>
##$USERP5= <user>
##$WDW= 1
##$XDIM= 131072
##$YMAX_p= 456990531
##$YMIN_p= -11960
##$CURPLOT= <Network HP LaserJet P1505>
##$CURPRIN= <$Network HP LaserJet P1505>
##$DFORMAT= <normdp>
##$LAYOUT= <+/1D_H.xwp>
##$LFORMAT= <normlp>
##$PFORMAT= <normpl>
##$SURQMSG= 1
$$ End of Bruker specific parameters
$$ ---------------------------------
##NTUPLES= NMR SPECTRUM
##VAR_NAME=  FREQUENCY,     SPECTRUM/REAL,   SPECTRUM/IMAG
##SYMBOL=    X,             R,               I
##VAR_TYPE=  INDEPENDENT,   DEPENDENT,       DEPENDENT
##VAR_FORM=  AFFN,          ASDF,            ASDF
##VAR_DIM=   131072,        131072,          131072
##UNITS=     HZ,            ARBITRARY UNITS, ARBITRARY UNITS
##FACTOR=    0.0627417313425164, 1,          1
##FIRST=     8223.62146879497, -1966,        -65852
##LAST=      0,             387,             -66617
##MIN=       0,             -11960,          0
##MAX=       8223.62146879497, 456990531,    0
$$ Real data points
##PAGE= N=1
##DATA TABLE= (X++(R..R)), XYDATA
$$ [...]
61593C57924j701j799k252k356k284k630l014k572j591j171j436j502j170j159
61579C31287j651j980j850j608j260n13J92j8r44j443j102n71j73M45J117J018
61563C20946J23m96k62J46P6j72k07l27q13j223r71l3J152K029K112J421P14O63
61545C24878R47R00O66P94J053Q76O93J393K583K883K095J554K021K775L139L429
61529C52679L749L287J652k31j385j961k480k843k855k823k924k743k073j468
61515C37581j333j274q91m95m18l77j16L9j35j86K27N92L06l96r03j177j530j840
61497C27674j647r14j85j7l94p34m58K46M99p2o27k18P55J136P32L41K63O5j54
61478C26291L32J366J741J076O14J467L053M079M046L137J558j80j110r00l89
$$ y = [357924, 356223, 354424, 352172, 349816, 347532, 344902, 341888, 339316, 337725, 336554, 335118, 333616, 332446, 331287, 329636, 327656, 325806, 324198, 322938, 322425, 322617, 322599, 321655, 320212, 319110, 318539, 318366, 318811, 319928, 320946, 321069, 320573, 320311, 320457, 320533, 320361, 320154, 319827, 319014, 317791, 316820, 316787, 317939, 319968, 322080, 323501, 324215, 324878, 325825, 326725, 327391, 328185, 329238, 330114, 330807, 332200, 334783, 337666, 339761, 341315, 343336, 346111, 349250, 352679, 356428, 359715, 361367, 361136, 359751, 357790, 355310, 352467, 349612, 346789, 343865, 341122, 339049, 337581, 336248, 334974, 334083, 333588, 333170, 332793, 332677, 332716, 332581, 332395, 332622, 333214, 333520, 333124, 332221, 331044, 329514, 327674, 326027, 325113, 324928, 324911, 324517, 323783, 323325, 323571, 324070, 323998, 323371, 323153, 323908, 325044, 325776, 326117, 326380, 326445, 326291, 326623, 327989, 329730, 330806, 331420, 332887, 335940, 340019, 344065, 347202, 348760, 348580, 347470, 346570, 346181]
61463C46181l82n37k22K96L37%p0K86P08J032J342J531J384R87N94K80L0n2R1
61444C53816L22N09N86M06l8k03N67K073L386M109M735N539N917N316M091K985
61428C94116K249J712J287R39O11M27O70J269J779J996K140K356K500K515K503
61413D19069K433K279K250K236J403p14k971l718l034k508k790k890k222j697
61399D07126k106k834l008k713k286j555n77p0j82M4J079J885J470M69Q6L80O98
61382C97906J006J559J941J674J228J365J857K008J876J932J931J275K59j34L64
61367D18047J104J612K006K375K477K184J663J115P58Q96J576K374K902L298L901
61352D48288M675N341N793O115O519P366Q770J0067J0276R317Q051O994N829M508
$$ y = [346181, 345799, 345262, 345040, 345336, 345673, 345673, 345603, 345889, 346597, 347629, 348971, 350502, 351886, 352873, 353467, 353747, 353777, 353725, 353816, 354138, 354647, 355233, 355639, 355601, 355398, 355965, 358038, 361424, 365533, 370268, 375807, 381724, 387040, 391131, 394116, 396365, 398077, 399364, 400303, 400914, 401341, 402011, 403280, 405059, 407055, 409195, 411551, 414051, 416566, 419069, 421502, 423781, 426031, 428267, 429670, 428956, 425985, 422267, 419233, 416725, 413935, 411045, 408823, 407126, 405020, 402186, 399178, 396465, 394179, 392624, 392047, 391977, 391795, 391839, 392918, 394803, 396273, 396742, 396828, 397208, 397906, 398912, 400471, 402412, 404086, 405314, 406679, 408536, 410544, 412420, 414352, 416283, 417558, 417817, 417683, 418047, 419151, 420763, 422769, 425144, 427621, 429805, 431468, 432583, 433341, 434237, 435813, 438187, 441089, 444387, 448288, 452963, 458304, 464097, 470212, 476731, 484097, 492867, 502934, 513210, 522527, 530578, 537572, 543401, 547909]
61338E47909L764L980M463M477M220M079L757K898J823Q62l54k136l895m878n150
61323E65819n103m596l348j723l62N23Q89O15Q6K93J574K877L199L056L659N165
61307E72623O680P694Q577R916J1972J4523J6727J7549J6778J5133J3038J0063
61295G21273O099K139p91k815m558o035p011p769q699r607j0082j0022r363q033
61281F44726o601o013o129n634m056k581k067j619k85J191J658J480J673K091
61267F17834K025J742J876K018J539J128J856L367M586N707P671J0092J1522J1608
61253F84571J1317J0983R851P654N203L165J445o6j261k348l619m693n054n106
61239G12042n669o604p055o819o395n849m867l679k867k345j661r93o85j54J415
$$ y = [547909, 551673, 555653, 560116, 564593, 568813, 572892, 576649, 579547, 581370, 582232, 581878, 579742, 575847, 570969, 565819, 560716, 556120, 552772, 551049, 550687, 551210, 552099, 552714, 552800, 553093, 554667, 557544, 560743, 563799, 567458, 572623, 579303, 586997, 595574, 605490, 617462, 631985, 648712, 666261, 683039, 698172, 711210, 721273, 727372, 729511, 728720, 725905, 721347, 715312, 708301, 700532, 691833, 682226, 672144, 662122, 652759, 644726, 638125, 632112, 625983, 620349, 616293, 613712, 611645, 610026, 609741, 610932, 612590, 614070, 615743, 617834, 619859, 621601, 623477, 625495, 627034, 628162, 630018, 633385, 637971, 643678, 651349, 661441, 672963, 684571, 695888, 706871, 716722, 724376, 729579, 732744, 734189, 734123, 732862, 730514, 726895, 722202, 717148, 712042, 706373, 699769, 692714, 685895, 679500, 673651, 668784, 665105, 662238, 659893, 658232, 657239, 656554, 656400, 657815]
61224F57815L505M857N409O323Q029R633J0359J0328R859R127Q604Q745R268R660
61210G71521J0137J0938J1038R079N634K965K286K547K224J213N17J052K991N652
61196H39794P919R385J0855J3144J5886J8329K0515K2518K3244K1535J7905J3826
61184A034855R848N956L085K221K397J727K84j61N81M48j842n098p689r464j0857
61169A026291j1751j2144j2636j3495j4273j4841j5633j6606j7172j7445j8204
61158H62091j9329j9755j9278j8859j8727j7785j5494j2752j0307p776m962k665
61146F94402j292l7J591K573J752n88l299n691p539q641q971q710p676n594l027
61131F39253j105k8J119K856M696O334Q173J0368J2460J4345J6456J8764K0752
$$ y = [657815, 661320, 666177, 671586, 677909, 685938, 695571, 705930, 716258, 726117, 735244, 743848, 752593, 761861, 771521, 781658, 792596, 803634, 812713, 818347, 821312, 823598, 826145, 828369, 829582, 830099, 831151, 834142, 839794, 847713, 857098, 867953, 881097, 896983, 915312, 935827, 958345, 981589, 1003124, 1021029, 1034855, 1044703, 1050659, 1053744, 1055965, 1058362, 1060089, 1060373, 1060212, 1060793, 1061241, 1059399, 1054301, 1046612, 1037148, 1026291, 1014540, 1002396, 989760, 976265, 961992, 947151, 931518, 914912, 897740, 880295, 862091, 842762, 823007, 803729, 784870, 766143, 748358, 732864, 720112, 709805, 702029, 697067, 694402, 693110, 693073, 694664, 697237, 698989, 698401, 695102, 689411, 681872, 673231, 664260, 655550, 647874, 642280, 639253, 638148, 638120, 639239, 642095, 646791, 653125, 661298, 671666, 684126, 698471, 714927, 733691, 754443]
61118G54443K2619K5151K8126L0292L1287L2178L3636L4930L5253L4832L4182
61107A096929L3453L2782L2121L0570K7257K2998J9541J7047J4001R797N375R94
61095A342865m437j1029j6997k1116k4245k7428l0235l2091l3503l4823l5291
61084A071670l4474l3223l2169l0722k8560k6603k5440k4250k2269j9980j7927
61073G76053j5763j3346j1345r940q328o306m746l853k736j355q80j360j188J76
61059F95083J240J328J902L690N095N120N404P361R667J0750J1645J3891J6574
61046G88750J7920J8332J9457K1563K3923K6365K8572K9414K8941K9214L1270
61035A063721L3162L3133L2585L3511L5138L5843L6351L8139M0489M2121M3996
$$ y = [754443, 777062, 802213, 830339, 860631, 891918, 924096, 957732, 992662, 1027915, 1062747, 1096929, 1130382, 1163164, 1195285, 1225855, 1253112, 1276110, 1295651, 1312698, 1326699, 1336496, 1341871, 1342865, 1338428, 1327399, 1310402, 1289286, 1265041, 1237613, 1207378, 1175287, 1141784, 1106961, 1071670, 1037196, 1003973, 971804, 941082, 912522, 885919, 860479, 836229, 813960, 793980, 776053, 760290, 746944, 735599, 725659, 717331, 711025, 706279, 702426, 699690, 698335, 697455, 696095, 694907, 695083, 696323, 697651, 699553, 703243, 708338, 713458, 718862, 726223, 735890, 746640, 758285, 772176, 788750, 806670, 825002, 844459, 866022, 889945, 916310, 944882, 974296, 1003237, 1032451, 1063721, 1096883, 1130016, 1162601, 1196112, 1231250, 1267093, 1303444, 1341583, 1382072, 1424193, 1468189]
61024A468189M7469N1264N3303N3810N3788N2509M9814M8764N2224N8883O6314
61013B056331P5650Q8815J03454J15600J25579J36340J48457J62602J84536K20413
61003C417777K68993L26061L94707M82325N89990P17195Q76783J090960J372141
60994I536932J725779K167991K692120L176007L353960K970016K019124Q21562
60986B8463491j83311p27724q04804n27192M718O53865J144669J141202M97554
60977B9662468n86759j695887k485556k852743k882057k702541k411928k079762
60969A1965235j757325j469963j219650j003672q23637o77921n58101m57309l75134
60960C622523l11800k63528k26018j97425j75729j57304j40144j24997j12016
$$ y = [1468189, 1515658, 1566922, 1620225, 1674035, 1727823, 1780332, 1830146, 1878910, 1931134, 1990017, 2056331, 2131981, 2220796, 2324250, 2439850, 2565429, 2701769, 2850226, 3012828, 3197364, 3417777, 3686770, 4012831, 4407538, 4889863, 5479853, 6197048, 7073831, 8164791, 9536932, 11262711, 13430702, 16122822, 19298829, 22652789, 25622805, 27641929, 28463491, 28280180, 27552456, 26747652, 26220460, 26225178, 26879043, 28023712, 29164914, 29662468, 29075709, 27379822, 24894266, 22041523, 19159466, 16456925, 14044997, 11965235, 10207910, 8737947, 7518297, 6514625, 5690988, 5013067, 4454966, 3997657, 3622523, 3310723, 3047195, 2821177, 2623752, 2448023, 2290719, 2150575, 2025578, 1913562]
60951A913562r9456q6796p5680o6536n7499m8148m1256l9026m0040m1568m2641
60940A274916m3287m2799m0622l7532l4588l1972k9719k8243k7303k5872k3758
60929I09221k2007k1026j9783j7625j5378j3872j2791j1805j1431j1824j2052
60918G39627j1457j0608j0053r377q268p342o926o301m995l707k969k102n68P39
60904F55693Q52M40P78J752K224J921J664J942K422K765K989L084K961K731K576
60889F86794K551K925M224O443Q632R929J0517J1008J1361J1253J1071J1600J2926
60876H01234J4449J5839J7167J8243J8621J8393J8285J8794J9752K0814K1856
60865A003447K2718K3046K2666K1844K0998K0196J9086J7236J4546J1352P990
$$ y = [1913562, 1814106, 1727310, 1651630, 1585094, 1527595, 1479447, 1438191, 1399165, 1359125, 1317557, 1274916, 1231629, 1188830, 1148208, 1110676, 1076088, 1044116, 1014397, 986154, 958851, 932979, 909221, 887214, 866188, 846405, 828780, 813402, 799530, 786739, 774934, 763503, 751679, 739627, 728170, 717562, 707509, 698132, 689864, 682522, 675596, 669295, 664300, 660593, 657624, 655522, 654954, 655693, 656545, 656985, 657763, 659515, 661739, 663660, 665324, 667266, 669688, 672453, 675442, 678526, 681487, 684218, 686794, 689345, 692270, 696494, 702937, 711569, 721498, 732015, 743023, 754384, 765637, 776708, 788308, 801234, 815683, 831522, 848689, 866932, 885553, 903946, 922231, 941025, 960777, 981591, 1003447, 1026165, 1049211, 1071877, 1093721, 1114719, 1134915, 1154001, 1171237, 1185783, 1197135, 1205125]
60854A205125M300k08n584j1131j6017j9872k2634k4233k4767k4691k4443k4183
60842A011662k4131k4761k6218k7827k8720k8759k8364k7704k6566k4956k3285
60831G20371k1869k0689j9542j8169j6308j3996j1706r832q317p055o353o391
60819E60144o553o076n136m512m275l759k910k538k874k932j927n24R2j82n25
60804E15513m64j78K27Q74J636K195K575L023L338K917J628J71o35o47m20o14
60788E31139j395k223k387j867j447j703k242k365k146k203k721l389m154n193
60774D95704o145o264n566n044n353n946n936n263m476l831l116k149j074l10
60760D35231l64j341k476k553j183O60J656J451P18K70M30R03J071O79L39R52
$$ y = [1205125, 1209425, 1209217, 1203633, 1192502, 1176485, 1156613, 1133979, 1109746, 1084979, 1060288, 1035845, 1011662, 987531, 962770, 936552, 908725, 880005, 851246, 822882, 795178, 768612, 743656, 720371, 698502, 677813, 658271, 640102, 623794, 609798, 598092, 588260, 579943, 572888, 566535, 560144, 553591, 547515, 542379, 537867, 533592, 529833, 526923, 524385, 521511, 518579, 516652, 516128, 516220, 516038, 515513, 515049, 514871, 515098, 515972, 517608, 519803, 522378, 525401, 528739, 531656, 533284, 533455, 532820, 532173, 531753, 531139, 529744, 527521, 525134, 523267, 521820, 520117, 517875, 515510, 513364, 511161, 508440, 505051, 500897, 495704, 489559, 483295, 477729, 472685, 467332, 461386, 455450, 450187, 445711, 441880, 438764, 436615, 435541, 435231, 434867, 433526, 431050, 428497, 427314, 427974, 429630, 431081, 431799, 432069, 432499, 433402, 434473, 435152, 435491, 436443]
60744D36443K433L669L954L779L747L507K486J050k6p69j669k486k417j475p05
60729D51521q16j432j954k388l004l782m514n087n351n183m778m515m318l696
60715D00703k662k029k412l328l823l687l519l735l962l579k524j376p75q43j156
60700C61293j178p20m1L88K64k41n85l75J59M15J69j52m8M78J073J503J729J773
60682C65904J719J789K148K779L624M615N497N885N702N292M904M466M051M081
60668D22456M691N332N484N360N346N146M151K455Q31j86n82l92L71J265J573
60653D63301J161O93P94J309J574J210N16J76N31J075Q69m51k344m150n709o936
60637D53619p403o927o134n697n364m498l232k342k059j882j497j142j006r18
$$ y = [436443, 438876, 442545, 446499, 450278, 454025, 457532, 460018, 461068, 461042, 460273, 458604, 456118, 453701, 452226, 451521, 450705, 449273, 447319, 444931, 441927, 438145, 433631, 428544, 423193, 418010, 413232, 408717, 404399, 400703, 398041, 396012, 393600, 390272, 386449, 382762, 379243, 375508, 371546, 367967, 365443, 364067, 363292, 362449, 361293, 360115, 359395, 359354, 359742, 360006, 359765, 359180, 358805, 358964, 359379, 359548, 359396, 359348, 359826, 360899, 362402, 364131, 365904, 367623, 369412, 371560, 374339, 377963, 382578, 388075, 393960, 399662, 404954, 409858, 414324, 418375, 422456, 427147, 432479, 437963, 443323, 448669, 453815, 457966, 460421, 461252, 461066, 460484, 460092, 460463, 461728, 463301, 464462, 465155, 465949, 467258, 468832, 470042, 470558, 470734, 471265, 472340, 473209, 472758, 470414, 466264, 460555, 453619, 446216, 439289, 433155, 427458, 422094, 417596, 414364, 412022, 409963, 408081, 406584, 405442, 404436, 403518]
60623D03518p27m68j66L6k50j053j514p48Q51J977K038J565J028K56p61j382j122
60606D03078l20L55O19N41L30K91N53P51N04J11J64N12M78R5K18J163K159K508
60588D14110K410K295K105J750J498J472J332R69Q30J139J406J274J165J541K072
60573D37368K207K060K102K390K811L700N470P764R751J1263J3039J5674J8685
60560E34284K0797K0997J9230J6205J2590Q485L746j418o335j0254j2591j3057
60548E92679j1961j0196q446o554m159j683P5J158K439M368O569Q759J1190J3888
60534E98126J6397J8570K0794K2994K4142K3250K0341J6036J0834N219j14m628
60522G71961q117j0292j0762r780q394p510p232p285p393p035n679l617j866q54
$$ y = [403518, 402791, 402323, 402157, 402193, 401943, 400890, 399376, 398628, 399479, 401456, 403494, 405059, 406087, 406343, 405582, 404200, 403078, 402758, 403113, 403732, 404273, 404603, 404894, 405447, 406198, 406702, 406813, 406977, 407489, 407967, 408062, 408280, 409443, 411602, 414110, 416520, 418815, 420920, 422670, 424168, 425640, 426972, 427941, 428771, 429910, 431316, 432590, 433755, 435296, 437368, 439575, 441635, 443737, 446127, 448938, 452638, 458108, 465872, 475623, 486886, 499925, 515599, 534284, 555081, 576078, 595308, 611513, 624103, 632588, 636334, 634916, 628581, 618327, 605736, 592679, 580718, 570522, 562076, 555522, 551363, 549680, 549755, 550913, 553352, 557720, 564289, 573048, 584238, 598126, 614523, 633093, 653887, 676881, 701023, 724273, 744614, 760650, 771484, 776703, 776589, 771961, 763844, 753552, 742790, 733010, 724616, 717106, 709874, 702589, 695196, 688161, 682482, 678865, 676999, 676145]
60508F76145K0J169K122K526K876L617M416N103O482R305J3149J7241K1730K7214
60494G93115L3519L9992M6491N3090N9115O3450O5531O5180O1829N4988M5333
60483A381633L4278K2406R250n262j9965l3285m4317n2914n9205o3286o5128o4694
60471A039511o2317n8681n4230m8943m3020l7373l2857k9323k5970k2438j9003
60460F05356j5966j3453j1665j0678j0048r132p856o760o320o481o764o622n876
60447D87735n017m743m977m754l456j720p03q02j502k094k123j500o72l30n79
60432D52763p64m42K3K20L75O99P37J24n92o81l21k06m87q55j187j331p89M58
60414D47744J307Q35k16l91L93R75R41J032J587J974J872J796J898J464K32p98
$$ y = [676145, 676165, 677334, 679456, 681982, 684858, 688475, 692891, 697994, 704476, 713781, 726930, 744171, 765901, 793115, 826634, 866626, 913117, 966207, 1025322, 1088772, 1154303, 1219483, 1281312, 1336300, 1381633, 1415911, 1438317, 1447567, 1442305, 1422340, 1389055, 1344738, 1291824, 1232619, 1169333, 1104205, 1039511, 977194, 918513, 864283, 815340, 772320, 734947, 702090, 672767, 646797, 624359, 605356, 589390, 575937, 564272, 553594, 543546, 534414, 526558, 519798, 513478, 506997, 500233, 493611, 487735, 482718, 477975, 472998, 468244, 464788, 463068, 462365, 461563, 460061, 457967, 455844, 454344, 453672, 453342, 452763, 451999, 451557, 451580, 451800, 452175, 452874, 453611, 453735, 453143, 452462, 452141, 451935, 451448, 450593, 449406, 448075, 447286, 447744, 449051, 449886, 449670, 449279, 449672, 450647, 451588, 452620, 454207, 456181, 458053, 459849, 461747, 463211, 463443, 462645]
60398D62645o95Q2M66L20L85J108K197L165L741L837L529L070K625K078J354P71
60382D90678Q04J481K282K714K747K613K283J522N15K0N04J402J789J608J541
60367E14503J692J396N50J54Q66J864J955J266Q54J132J566J693J606J474J366
60352E33937J535K254L379M502N491O445P438Q646J0343J2176J2964J1921R691
60339F30722P383M997J750k303o030q563r913j0244r574q332p321o811o334n621
60325E63806m991m610m043k961j789j216j436k093k728l022k833k184j262l89
60311E28249R7K31O93K204M546O736Q369J0102J2416J4937J7616K1563K7410L3465
60297F88634L6879L6412L2967K7561K0173J0594n98j2165k2425k9480l2306l1727
$$ y = [462645, 461950, 462032, 462498, 462818, 463203, 464311, 466508, 469673, 473414, 477251, 480780, 483850, 486475, 488553, 489907, 490678, 491482, 492963, 495245, 497959, 500706, 503319, 505602, 507124, 507639, 507659, 508163, 509565, 511354, 512962, 514503, 516195, 517591, 518141, 518295, 519161, 521025, 522980, 524246, 525100, 526232, 527798, 529491, 531097, 532571, 533937, 535472, 537726, 541105, 545607, 551098, 557543, 564981, 573627, 583970, 596146, 609110, 621031, 630722, 638105, 643102, 644852, 642549, 636519, 627956, 618043, 607799, 598225, 589893, 582572, 575761, 569427, 563806, 558815, 554205, 550162, 547201, 545412, 544196, 542760, 540667, 537939, 534917, 532084, 529900, 528638, 528249, 528346, 528577, 529270, 531474, 536020, 542756, 551125, 561227, 573643, 588580, 606196, 627759, 655169, 688634, 725513, 761925, 794892, 822453, 842626, 853220, 852622, 840457, 818032, 788552, 756246, 724519]
60285G24519k9514k6529k2658j8349j4815j2531j0733q812p186o337n962n598
60273E55495n249m987m613m106l763l622l405l219l491l985l785k672j588j322
60259E05688j462j227n73L0L25K56j61n33k54N47Q65J53p71p50K58J320J744J602
60241E07057J323J241J379J358P24m02j323j635j652j678j320KK155M313N710
60226E17252O065N471M286L057K247J964J963J944J810J710J807K075K410K933
60212E56994L775M555M676M340M626O005P456P695O826N933N544N385N249N085
60198F34144M452K973J316P23J541K916L885L973K948J007r21j966k419l119m028
60183F47425m438m306m231m259m075m126n057o028n400l300j753j785k172j726
$$ y = [724519, 695005, 668476, 645818, 627469, 612654, 600123, 589390, 580578, 573392, 567055, 561093, 555495, 550246, 545259, 540646, 536540, 532777, 529155, 525750, 522531, 519040, 515055, 511270, 508598, 507010, 505688, 504226, 502999, 502426, 502456, 502781, 503037, 502876, 502343, 502089, 502636, 503501, 503654, 502883, 502133, 502391, 503711, 505455, 507057, 508380, 509621, 511000, 512358, 513082, 512680, 511357, 509722, 508070, 506392, 505072, 505074, 507229, 511542, 517252, 523317, 528788, 533074, 536131, 538378, 540342, 542305, 544249, 546059, 547769, 549576, 551651, 554061, 556994, 560769, 565324, 570000, 574340, 578966, 584971, 592427, 600122, 606948, 612881, 618425, 623810, 629059, 634144, 638596, 641569, 642885, 643608, 645149, 648065, 651950, 655923, 658871, 659878, 658957, 656991, 654572, 651453, 647425, 642987, 638681, 634450, 630191, 626116, 621990, 616933, 610905, 605505, 602205, 600452, 598667, 596495, 594769]
60169E94769j034r43r46l99N8l10q21m47L81M65k36o65k62N73J256J438R47J41
60151E93965r9N18J157J064P53J147K169L066L619M098M438M504M757N693O757
60136F37606O837N862N055N464O815P925P866O676N152L936K757R26j462l410
60122F98005m307m475m223l193j279N55J244Q64K69m7m7K34N78M93K6J3Q33J463
60104F87006P17j020k288k519k485k960l852m699n264n444n154m420l301j786
60090F42531j10J167J815K471L890N799P058O948N936N108N104N593N608M486
60076G03404K503M57j309l078n042o929q394r258r386q913q527q743q977q272
60062F19536o908o088n922n269l983l609m898o252n943m672m273m843m934l947
$$ y = [594769, 593735, 592792, 591846, 591447, 591505, 591195, 590374, 589927, 590308, 590773, 590537, 589872, 589610, 590183, 591439, 592877, 593824, 593965, 593866, 594384, 595541, 596605, 597358, 598505, 600674, 603740, 607359, 611457, 615895, 620399, 625156, 630849, 637606, 644443, 650305, 655360, 660824, 667639, 675564, 683430, 690106, 695258, 699194, 701951, 702877, 701415, 698005, 693698, 689223, 685000, 681807, 680528, 681083, 682327, 683191, 683460, 683413, 683366, 683600, 684178, 684671, 684697, 684710, 685543, 687006, 687723, 686703, 684415, 681896, 679411, 676451, 672599, 667900, 662636, 657192, 652038, 647618, 644317, 642531, 642421, 643588, 645403, 647874, 651764, 657563, 664621, 671569, 677505, 682613, 687717, 693310, 698918, 703404, 705907, 706364, 705055, 701977, 696935, 690006, 681612, 672354, 662968, 654055, 645528, 636785, 627808, 619536, 612628, 606540, 600618, 595349, 591366, 587757, 582859, 576607, 570664, 565992, 561719, 556876, 551942, 547995]
60048E47995k665j595l91J063K318L182L820M076L739L397L937N131N771N310
60034E85088M421L771L165K121N91j153k728l587l418k746k629l589n244o941
60020E67122q307r190r500r286q706p980p388p052o544n275l476k170j780j497
60006D78971o13L53O35N22O51O77j32j356j770j076j94K10L94P07R94J094J176
59989D81243J435K000L013M303N164N118M655M497M415L624K132P50j44r50j939
59974E19316k847l417l592l249k439j795j881k234j879p60K92R20J561K294K484
59959E02774J974J709K498L821M441L904K895K339K422K469J779N12l84k87L87
59944E33253Q25P59M03j70j016j987k864l593m033l938l541l559m070m094k973
$$ y = [547995, 545330, 543735, 543344, 544407, 546725, 549907, 553727, 557803, 561542, 564939, 568876, 574007, 579778, 585088, 589509, 593280, 596445, 598566, 599157, 598004, 595276, 591689, 588271, 585525, 582896, 579307, 574063, 567122, 558815, 549625, 540125, 530839, 522133, 514153, 506765, 499713, 493169, 487894, 484418, 482248, 480468, 478971, 478358, 478711, 479346, 479868, 480519, 481196, 481064, 479708, 477938, 476862, 476668, 476878, 477272, 477979, 478973, 480067, 481243, 482678, 484678, 487691, 491994, 497158, 502276, 506931, 511428, 515843, 519467, 521599, 522349, 522205, 521255, 519316, 516469, 513052, 509460, 506211, 503772, 501977, 500096, 497862, 495983, 495223, 495515, 496435, 497996, 500290, 502774, 504748, 506457, 508955, 512776, 517217, 521121, 524016, 526355, 528777, 531246, 533025, 533537, 533153, 532866, 533253, 534078, 534837, 535240, 535070, 534054, 532067, 529203, 525610, 521577, 517639, 514098, 510539, 506469, 502375, 499402]
59929D99402j479o90m32P5O80O81K99M41J199J822K093K459K908K953K719K890
59913E18020L411L496L123L323M738O766Q437R212Q766P031M643K571J016m79
59899E84074j854k483k350k214k312k038j112j02N81J212J896K188K017K041K638
59884E82182L372L842M223M553M433L912L855M749N871O288O018N621N138M066
59870F48123K086n82l334n482o720p341p690p525o523n243m683m816m510l110
59856E82650j231K23J024J328J297J370K093L363M511N372O438P805Q963R970
59842F35176J1610J3779J4723J2804Q393L341p42l030l100j069K087M987O544
59829G05503O089L439p06m855p848r540j0281j0283r921r856j0326j0685j0265
$$ y = [499402, 497923, 497233, 496801, 496876, 497556, 498237, 498536, 498977, 500176, 501998, 504091, 506550, 509458, 512411, 515130, 518020, 521431, 524927, 528050, 531373, 536111, 542877, 551314, 560526, 569292, 576323, 580966, 583537, 584553, 584074, 582220, 579737, 577387, 575173, 572861, 570823, 569711, 569609, 570190, 571402, 573298, 575486, 577503, 579544, 582182, 585554, 589396, 593619, 598172, 602605, 606517, 610372, 615121, 620992, 627280, 633298, 638919, 644057, 648123, 650209, 649627, 646293, 640811, 634091, 626750, 619060, 611535, 605012, 599769, 595086, 590270, 585760, 582650, 581419, 581642, 582666, 583994, 585291, 586661, 588754, 592117, 596628, 602000, 608438, 616243, 625206, 635176, 646786, 660565, 675288, 688092, 696485, 699826, 699084, 696054, 692954, 691885, 693972, 698959, 705503, 711592, 715031, 714325, 709470, 701622, 692082, 681801, 671518, 661597, 651741, 641415, 630730, 620465]
59816F20465r246q197p223o048m598l013j385M3P73N29k42p43m78M68J477J651
59800E84233M51j676l685m990n708n961n604m887m522m780n093m878m210l387
59786E25303k511j802j702k210k657k566k241k163k258k133j642r36l69m17j175
59771D98521j787j155N58J842J621M72l47l25K47R82J583J822J843K049K417K463
59755E12806K186K316L209M110M129L421K836K870L390L961M062L410K491K242
59741E57439K879L574L646L384L201K752J640M28P5O66J400J719J738J707J659
59726E87907J615J731K078K504K718K567K195J917J673R88k16j036n85O13J087
59711F07756L22o68p87l4J002J903K290J763M81p30j252j118n21L73J005P37n2
$$ y = [620465, 611219, 603022, 595799, 589751, 585153, 582140, 580755, 580798, 581571, 582100, 581858, 581115, 580637, 581105, 582582, 584233, 584684, 583008, 579323, 574333, 568625, 562664, 557060, 552173, 547651, 542871, 537778, 532900, 528690, 525303, 522792, 520990, 519288, 517078, 514421, 511855, 509614, 507451, 505193, 503060, 501418, 500482, 500113, 499696, 498521, 496734, 495579, 496137, 497979, 499600, 500072, 499725, 499400, 499647, 500629, 502212, 504034, 505877, 507926, 510343, 512806, 514992, 517308, 520517, 524627, 528756, 532177, 535013, 537883, 541273, 545234, 549296, 552706, 555197, 557439, 560318, 563892, 567538, 570922, 574123, 576875, 578515, 578943, 579018, 579684, 581084, 582803, 584541, 586248, 587907, 589522, 591253, 593331, 595835, 598553, 601120, 603315, 605232, 606905, 607893, 607677, 606641, 606056, 606669, 607756, 608078, 607410, 606623, 606589, 607591, 609494, 611784, 613547, 614028, 613298, 612046, 610928, 610407, 610780, 611785, 612522, 612470]
59694F12470q2J180K859L995M556M619L664J458j057k650k993k468j449m03Q0
59679F23779n3j64l6m07j804l597m838n379n494n201m687m612n212n743n612n306
59663E65634n386n338m405k926j784j093m26J23K06J72O74J606K352K808L268
59648E55485L566L325K807K515K115P87j341l057l565l315l173l396l653l477
59634E45623k577j091L15R33P38L59L64O51N67m11j885k574j607K13J134N67k67
59617E41052j81L96K84p94k190l388m168m092k783o78J180K186K595K943L392
59602E35754L619L161K025R04N10O30L88n08j420j780j726j505j041m02k6j15
59586E38468l61n60p94r12p05o55j516k862l227k134q33n14r89j662k528l406
$$ y = [612470, 612388, 613568, 616427, 620422, 624978, 629597, 633261, 634719, 633662, 631012, 628019, 625551, 624102, 623699, 623779, 623726, 623562, 623526, 623119, 621315, 617718, 612880, 607501, 602007, 596806, 592119, 587507, 582295, 576552, 570940, 565634, 560248, 554910, 550505, 547579, 545795, 544702, 544276, 544399, 544605, 544777, 545451, 547057, 549409, 552217, 555485, 559051, 562376, 565183, 567698, 569813, 570600, 569259, 566202, 562637, 559322, 556149, 552753, 549100, 545623, 543046, 541955, 542270, 543203, 543941, 544300, 544664, 545315, 545882, 545471, 543586, 541012, 539405, 539618, 540752, 541319, 541052, 540871, 541267, 541551, 540757, 538567, 535179, 531011, 526919, 524136, 523458, 524638, 526824, 529419, 532362, 535754, 539373, 542534, 544559, 545463, 545973, 546603, 546991, 546483, 545063, 543283, 541557, 540052, 539011, 538609, 538583, 538468, 538107, 537547, 536753, 535841, 535136, 534481, 532965, 530103, 526876, 524742, 523909, 523395, 522406, 520744, 518216, 514810]
59570E14810l508k707k057k146k074j074P4L99L71P95J254J017N92Q00J117N30
59554E08193n17o28M78J789K598K994L042K699K318K327K631L043L695M392M501
59539E43555M313N359Q325J2015J5663K0510K6821L0780K7453J6696L721o209
59527G09002j1479j2701j0567o162j457K013M087N167N387M916M066K771Q73j144
59513F94772k717m319o797r679j1498j1842j1697j1721j1485j0639r497q277o922
59500E77682n874n692n882n357m181l485l529l295k262j162n72j38L59M89K52
59485E37353M08J193J807J779J742K388L565M874O224P365P878Q031Q781J0421
59471F03809J2037J2503J1335Q540M716J320l26n65q63j647j872q92P10K484M769
$$ y = [514810, 511302, 508595, 506538, 504392, 502318, 501244, 501318, 501717, 502088, 502883, 504137, 505154, 505746, 506546, 507663, 508193, 507676, 507048, 507526, 509315, 511913, 514907, 517949, 520648, 522966, 525293, 527924, 530967, 534662, 539054, 543555, 547868, 553227, 561552, 573567, 589230, 609740, 636561, 667341, 694794, 711490, 715211, 709002, 697523, 684822, 674255, 668093, 666636, 668649, 672736, 677903, 683290, 688206, 692272, 695043, 695916, 694772, 692055, 687736, 680939, 671260, 659762, 647920, 636223, 624502, 613017, 602378, 592881, 584604, 577682, 571808, 566116, 560234, 554877, 550696, 547211, 543682, 540387, 538125, 536963, 536391, 536253, 536612, 537101, 537353, 537761, 538954, 540761, 542540, 544282, 546670, 550235, 555109, 561333, 568698, 576576, 584607, 593388, 603809, 615846, 628349, 639684, 648224, 652940, 654260, 653934, 653369, 652506, 650859, 648987, 648095, 648805, 651289, 656058]
59456F56058P410R260R843J0262J1519J3006J3568J3250J2949J3042J3240J3354
59444G96761J3295J2571J0392O230K43o604j2795j7111j9317j9629j8019j4769
59432G31248j1281r156q563q556q732r275r604q572o148l417p75K384O001R049
59418F64603J1262J3499J6030J8079J9501K1071K2760K4016K6248L1931L9295
59407I08295M0708K9670Q495j3457k8364l4611l4276k9693k2869j5132n862O214
59395H09118J8766K4774J8222Q01j8666l1737l6292l5340l2086k7651k2568j8016
59383F49325j4736j1982q713n251k781j581p59M60J990L313L952L638K690K012
59369F21577K078K428K743L658N461O874O664N833O295P803Q264P121O240O959
$$ y = [656058, 663468, 672728, 682571, 692833, 704352, 717358, 730926, 744176, 757125, 770167, 783407, 796761, 810056, 822627, 833019, 839249, 839492, 832888, 820093, 802982, 783665, 764036, 746017, 731248, 719967, 710811, 702248, 693692, 684960, 675685, 666081, 657509, 651361, 647944, 647169, 649553, 655554, 664603, 675865, 689364, 705394, 723473, 742974, 764045, 786805, 810821, 837069, 869000, 908295, 949003, 978673, 987168, 973711, 945347, 910736, 876460, 846767, 823898, 808766, 802904, 809118, 827884, 852658, 870880, 871681, 853015, 821278, 784986, 749646, 717560, 689909, 667341, 649325, 634589, 622607, 613894, 608643, 605862, 604281, 603522, 603982, 605972, 609285, 613237, 616875, 619565, 621577, 623655, 626083, 628826, 632484, 637945, 644819, 651483, 657316, 663611, 671414, 679678, 686799, 693039, 699998]
59355F99998Q392R363J0103J1038J1673J1790J2394J4186J6336J7800J8693J9393
59343H61159J9549J9003J8544J8535J7899J5581J2098Q442M533Pm425p817j0498
59330I72610j3417j6534j9063k0789k1950k2292k1476k0042j8851j7804j6162
59319G64230j3879j1665r924q562p590p035o438n303m007l477l880m241l523j718
59305F72988J77J132J078R45J486K422L181M148O182R120J2073J5224J9619K4494
59291G74269K6348K1904J1398j730j3507k1240k4110k3384k1471j9732j7511j3889
59279F77345r480n684k939p01J458L693O196Q848J1055J2600J4098J5878J7135
59266G49502J6972J5643J3928J1939R360O312L139k09l819p319j0361j2996j5037
$$ y = [699998, 708390, 717753, 727856, 738894, 750567, 762357, 774751, 788937, 805273, 823073, 841766, 861159, 880708, 899711, 918255, 936790, 954689, 970270, 982368, 990810, 995343, 995350, 990925, 983108, 972610, 959193, 942659, 923596, 902807, 880857, 858565, 837089, 817047, 798196, 780392, 764230, 750351, 738686, 728762, 720200, 712610, 705575, 699137, 693834, 689827, 686350, 682470, 678229, 674706, 672988, 673165, 674297, 675375, 676320, 677806, 680228, 683409, 687557, 693739, 702859, 714932, 730156, 749775, 774269, 800617, 822521, 833919, 832189, 818682, 797442, 773332, 749948, 728477, 708745, 691234, 677345, 667865, 662181, 659242, 658541, 659999, 663692, 669888, 678736, 689791, 702391, 716489, 732367, 749502, 766474, 782117, 796045, 807984, 817344, 823656, 826795, 826586, 822767, 815448, 805087, 792091, 777054]
59253G77054j5834j5304j4400j3820j3097j1653r868q255o482m253k216r72J08
59240F61008J890L969N336N980O743P996R462J0854J1768J1464R673P171M740
59227G58054K236n23k794l939m702o180q134r487r981j0132j0015r341q357p470
59213F69235o312m352k174q83m87l6P63J259J208J227J801K626L082K717J360
59198F71034o37k306k897k687k501k664k932l095l100k839k320j783j332q54m30
59183F38657k58K6R89K149K279J378J024K037L197L268K907L293M166M674N157
59168F74943O461Q318R902J1290J2943J4387J4900J4794J4605J3706J1287Q036
59156H15572N241K760l85l923o588q156r470j0647j0974j0513j0215j0338j0265
$$ y = [777054, 761220, 745916, 731516, 717696, 704599, 692946, 683078, 674823, 668341, 664088, 661872, 660900, 661008, 662898, 666867, 672203, 678183, 684926, 692922, 702384, 713238, 725006, 736470, 746143, 753314, 758054, 760290, 759767, 756973, 753034, 748332, 742152, 734018, 724531, 714550, 704418, 694403, 685062, 676705, 669235, 662923, 658571, 656397, 655514, 655027, 654991, 655754, 657013, 658221, 659448, 661249, 663875, 666957, 669674, 671034, 670397, 668091, 665194, 662507, 660006, 657342, 654410, 651315, 648215, 645376, 643056, 641273, 639941, 639087, 638657, 638399, 638425, 639414, 641563, 643842, 645220, 646244, 648281, 651478, 654746, 657653, 660946, 665112, 669786, 674943, 681404, 689722, 699624, 710914, 723857, 738244, 753144, 767938, 782543, 796249, 807536, 815572, 820813, 823573, 823188, 819265, 812677, 804521, 795051, 784404, 773430, 762917, 752702, 742364, 732099]
59143G32099r884r782j0048j0209j0341j0841j1177j0296q429p030o759o783o322
59130F14198n683n378n259m803l582j352J547M001N137N383N732O307O658P060
59116F29966Q269J0146J1598J2004J1690J1128J0569J0297J0381J0284R459Q072
59104G53863O546M883L235K340K430K424J372o2p37q87j452k311k668k633k833
59089G63510k985k415j525j185j209r82j003k093l635m465n023o614q871j0070
59075G11435r863r559r692r364q186o947o046n091m219m088m349l915k928k616
59061F24572l040k971k197j967k661l034k454j963k330k800k627k264k123j637
59047E90504n33K65j2p29q03j08O33O93k07j629k468k130j393j238j226l25J114
$$ y = [732099, 722215, 712433, 702385, 692176, 681835, 670994, 659817, 649521, 641092, 634062, 627303, 620520, 614198, 608515, 603137, 597878, 593075, 589493, 588141, 589688, 593689, 598826, 604209, 609941, 616248, 622906, 629966, 638235, 648381, 659979, 671983, 683673, 694801, 705370, 715667, 726048, 736332, 745791, 753863, 760409, 765292, 768527, 770867, 773297, 775721, 777093, 777031, 776294, 775407, 773955, 771644, 768976, 766343, 763510, 760525, 758110, 756585, 755400, 754191, 753209, 752206, 750113, 746478, 742013, 736990, 730376, 721505, 711435, 701572, 692013, 682321, 672957, 664771, 657824, 651778, 646687, 642468, 638380, 634031, 630116, 627188, 624572, 621532, 618561, 616364, 614397, 611736, 608702, 606248, 604285, 601955, 599155, 596528, 594264, 592141, 590504, 589971, 590236, 590224, 589495, 588692, 588584, 589217, 589910, 589703, 588074, 585606, 583476, 582083, 580845, 579619, 579294, 580408]
59030E80408J898K095K766L747L784L002L138M916P155Q903J0528J2097J2652
59017F57089J1809J0523R525Q517P339O299M972K439p37k627k568j921j638j052
59003G07969K86J564K468M015O545Q708R493R636R888R567Q132O581O038O144
58989G97034N996N461M548K863O05j208k436m282p069r069q790p022n402m145
58975G67084k565o18J381L626O230Q534R994J0996J2068J3145J4290J6029J8179
58962H78373J9511J9321J8254J6943J5065J2434R684P020L577j129o320j1170
58950I81563j5614j9302k1272k1553k1544k1914k1648k0048j8021j6379j4537
58939G69731j2098j0114r331q770p386n773m799l925k439j066p90j165j305j460
$$ y = [580408, 582306, 584401, 587167, 590914, 594698, 597700, 600838, 605754, 612909, 621812, 632340, 644437, 657089, 668898, 679421, 688946, 697463, 704802, 711101, 716073, 718512, 717775, 715148, 712580, 710659, 709021, 707969, 708255, 709819, 712287, 716302, 722847, 731555, 741048, 750684, 760572, 770139, 778271, 784852, 790890, 797034, 803030, 808491, 813039, 815902, 816507, 815299, 812863, 808581, 801512, 792443, 783653, 776631, 771229, 767084, 764519, 763901, 765282, 768908, 775138, 783672, 793666, 804662, 816730, 829875, 844165, 860194, 878373, 897884, 917205, 935459, 952402, 967467, 979901, 989585, 996605, 1000182, 999053, 992733, 981563, 965949, 946647, 925375, 903822, 882278, 860364, 838716, 818668, 800647, 784268, 769731, 757633, 747519, 738188, 729418, 722032, 716259, 711460, 707535, 705096, 704030, 703240, 702075, 700770, 699310]
58925F99310k141k718k378j575j196j139r42q50j022p81J43O86R3o02j42J014
58909F85760J732K161L117M359N105N619O808Q745J0846J2945J5063J6727J7552
58896G96539J7875J7953J7300J5818J4643J4898J6386J8399K0826K3599K6077
58885A000313K7937K9661L1170L1158K8780K4816K0276J5160R521M297j74n018
58873A217897j0925j6777k1411k5207k8570l0406k9788k7700k5448k2752j9160
58862I59753j5853j4122j3256j1991j0887j1148j2176j2489j2230j2645j3683
58851H19273j4188j3918j3495j2846j1492r957r135q778q125p442p334p255o348
58838F88960n157m841n326n762o115o652o710n743m775m982n516m696k768j435
$$ y = [699310, 697169, 694451, 692073, 690498, 689302, 688163, 687221, 686371, 685349, 684568, 684711, 685397, 685490, 684888, 684746, 685760, 687492, 689653, 692770, 697129, 702234, 707853, 714661, 723406, 734252, 747197, 762260, 778987, 796539, 814414, 832367, 849667, 865485, 880128, 895026, 911412, 929811, 950637, 974236, 1000313, 1028250, 1057911, 1089081, 1120239, 1149019, 1173835, 1194111, 1209271, 1218792, 1223089, 1222915, 1217897, 1206972, 1190195, 1168784, 1143577, 1115007, 1084601, 1054813, 1027113, 1001665, 978913, 959753, 943900, 929778, 916522, 904531, 893644, 882496, 870320, 857831, 845601, 832956, 819273, 805085, 791167, 777672, 764826, 753334, 743377, 734242, 725464, 717339, 709897, 702563, 695308, 688960, 683803, 678962, 673636, 667874, 661759, 655107, 648397, 642654, 637879, 632897, 627381, 622685, 619917, 618482]
58824F18482j132o73N95K137L512M712N440N493N532O164O708O275N361M995M965
58809F78566M411L476K770K004Q02k6L09Q44J52j421k593l372m515n568n580n133
58793F65126n542o532o755o148n716n428m482l270k907l027k170j72J750L075
58779F17802M189M792M238L316L538M586M512K641L72j110k181l537n044o168
58765F31946o413n417l654k587l029l932l995l523l261k572o65J339J806J227
58751E97270J358K332K917K987L385L868L519K901L408M796N588N686O244P228
58737F53487P472O980O862P140O902O465O955P994Q147P540P571Q142P776O426
58723G55859N607N579N009L688L042L599M345M937O197Q113R561J0275J0847J0778
$$ y = [618482, 617350, 616677, 617272, 619409, 622921, 627633, 633073, 638566, 644098, 650262, 656970, 663245, 668606, 673601, 678566, 682977, 686453, 689223, 691227, 692029, 692003, 692312, 693156, 693308, 691887, 689294, 685922, 681407, 675839, 670259, 665126, 659584, 653052, 646297, 640149, 634433, 629005, 624523, 621253, 618346, 615319, 613149, 612977, 614727, 617802, 621991, 626783, 631021, 634337, 637875, 642461, 646973, 649614, 649986, 648876, 646695, 643158, 638114, 631946, 625533, 620116, 616462, 613875, 610846, 606914, 602919, 599396, 596135, 593563, 592898, 594237, 596043, 597270, 598628, 600960, 603877, 606864, 610249, 614117, 617636, 620537, 623945, 628741, 634329, 640015, 646259, 653487, 660959, 667939, 674801, 681941, 688843, 695308, 702263, 710257, 718404, 725944, 733515, 741657, 749433, 755859, 761466, 767045, 772054, 775742, 778784, 782383, 786728, 791665, 797862, 805975, 815536, 825811, 836658, 847436]
58709H47436Q933O068M262L605K082r15l765n800q475j2477j6298j8703k0283
58696G85670k1626k2134k1572k0759j9893j8217j5960j4484j3828j2347r534o988
58684E88328n830n314m831n062o172o914o471n437m252k567q10k34p50o71O48
58669E33661J991K680L633N264O625P507R245J2298J5000J5732J4503J1670P151
58656F46960J855k125l923m801n886o731o834o723o665o139n284n078n473n158
58642E77995l811k665k270j726o29L44J271L173N688O970O561O060O175N620L862
58627F12618K367J978J490J66o75j8J085J538K039L430M976N752O173O969P986
58612F57874Q953R926J0375R403P401N717M354K057j011l054l586m158n443o191
$$ y = [847436, 856369, 862437, 866699, 870304, 872386, 871471, 867706, 861906, 853431, 840954, 824656, 805953, 785670, 764044, 741910, 720338, 699579, 679686, 661469, 645509, 631025, 617197, 604850, 595316, 588328, 582498, 577184, 572353, 567291, 561119, 554205, 547734, 542297, 538045, 535478, 534668, 534434, 533684, 533013, 533661, 535652, 538332, 541965, 547229, 553854, 561361, 570606, 582904, 597904, 613636, 628139, 639809, 646960, 648815, 646690, 642767, 637966, 632080, 625349, 618515, 611792, 605127, 598988, 593704, 588626, 583153, 577995, 574184, 571519, 569249, 567523, 566894, 567238, 568509, 571682, 577370, 584340, 590901, 596961, 603136, 608756, 612618, 614985, 616963, 618453, 618619, 617944, 617926, 619011, 620549, 622588, 626018, 630994, 636746, 642919, 649888, 657874, 666827, 676753, 687128, 696531, 703932, 709649, 714003, 716060, 715049, 711995, 708409, 704251, 698808, 692617]
58598F92617n837n580n932n760m691m025m227m051l040k294j841M7L729P147R034
58583F65296J0451J2003J2509J1699J1362J2169J2235J0436Q382P433O544M880
58571G85399L806M339N171N241N793Q020J0966J3616J6677K0536K3794K5560K6876
58558I55794K8229K8135K5823K2645J9191J3882O404l71m082n866p623q976r152
58545A064033r167r763r649q163p220q343j0212j1419j3108j6416j9738k1051
58533I19784k0819k0332j9297j7263j5132j3280j0541o833m108k854p86K939N612
58520G97090N522N073O462P785O723M808M289L855J427j505k393k184l330n292
58506H28330n896n406n461n604m559l362l700m581m088l028l467n047n940o084
$$ y = [692617, 686780, 681200, 675268, 669508, 664817, 660792, 656565, 652514, 649474, 647180, 645339, 645386, 649115, 656262, 665296, 675747, 687750, 700259, 711958, 723320, 735489, 747724, 758160, 766542, 773975, 780519, 785399, 789205, 793544, 798715, 803956, 809749, 817769, 828735, 842351, 859028, 879564, 903358, 928918, 955794, 984023, 1012158, 1037981, 1060626, 1079817, 1093699, 1100103, 1099732, 1095650, 1089784, 1082161, 1073185, 1064033, 1054866, 1045103, 1035454, 1027291, 1020071, 1011728, 1001516, 990097, 976989, 960573, 940835, 919784, 898965, 878633, 859336, 842073, 826941, 813661, 803120, 796287, 792179, 789325, 788539, 791478, 797090, 802612, 807685, 814147, 821932, 828655, 833463, 837752, 841607, 843034, 841529, 839136, 836952, 833622, 828330, 822434, 817028, 811567, 805963, 801404, 798042, 794342, 789761, 785673, 782645, 779178, 774131, 768191, 762107]
58492G62107o449o416m941k928j699o16J196K651K822L231N188P146P568Q080
58478G76940J0581J3540J4612J4642J5544J6359J5032J2074Q943M943p04n875
58466H96631q325r389j1221j2647j1583r237p817o273k702J199K618K677M482
58453H28413P777J0059J1371J3279J4578J2726Q471M651J505k563o755q852r293
58440H85367j0048j0571r046o419m910l845j242J814K783K379L159M696M773M133
58426H63023N384Q213J0229J1513J3751J5968J5810J3935J2539J0773O488J259
58414I88885j429k046l977p432r601j0129j1233j2873j2856j1431j0931j1206
58402H83741j0048p669o149n132k741R6R38N51J548L360L554K930L972N415M031
$$ y = [762107, 755658, 749242, 744301, 741373, 739674, 739058, 740254, 742905, 745727, 748958, 754146, 761292, 768860, 776940, 787521, 801061, 815673, 830315, 845859, 862218, 877250, 889324, 898267, 903210, 902506, 896631, 888306, 878917, 867696, 855049, 843466, 834229, 826412, 820139, 817437, 818636, 821254, 823931, 828413, 836190, 846249, 857620, 870899, 885477, 898203, 906674, 911325, 912830, 910267, 903512, 894660, 885367, 875319, 864748, 855702, 849283, 844373, 840528, 839286, 841100, 843883, 846262, 849421, 854117, 858890, 863023, 868407, 876620, 886849, 898362, 912113, 928081, 943891, 957826, 970365, 981138, 987626, 988885, 987456, 985410, 981433, 974001, 964400, 954271, 943038, 930165, 917309, 905878, 894947, 883741, 873693, 866024, 859875, 854743, 852002, 852098, 853036, 853587, 855135, 858495, 862049, 864979, 868951, 874366, 878397]
58387H78397R29K68K270L373K823L212M740M825L459L303M405M240K935L060M408
58372I26647M384L283L808N664O144N519O309P841P367N941P082J0178J1452J0929
58358A022548J2053J4743J5443J3849J3049J3037J0740O467L818L132J581m26
58346A130034L11L142M166L356M149O294O315M878O164R958J1995J2125J4253
58333A217140J8123J9272J7550J7441J9421J9306J6764J5921J6780J4782R850
58322A402350P065P232N758K128J283L975M971K871K443N134O455N154N793R647
58308A472259J2034J1323J1668J4372J5455J4305J5498J9536K1052J8772J7857
58297A644131J9809J9745J6461J5258J7739J8758J6648J6505K0039K2215K1290
$$ y = [878397, 879326, 879594, 881864, 885237, 888060, 891272, 896012, 900837, 904296, 907599, 912004, 916244, 919179, 922239, 926647, 931031, 934314, 938122, 943786, 949930, 955449, 961758, 969599, 976966, 982907, 989989, 1000167, 1011619, 1022548, 1034601, 1049344, 1064787, 1078636, 1091685, 1104722, 1115462, 1121929, 1125747, 1128879, 1130460, 1130034, 1130345, 1133487, 1137653, 1141009, 1145158, 1151452, 1157767, 1162645, 1168809, 1178767, 1190762, 1202887, 1217140, 1235263, 1254535, 1272085, 1289526, 1308947, 1328253, 1345017, 1360938, 1377718, 1392500, 1402350, 1409415, 1416647, 1422405, 1424533, 1425816, 1429791, 1434762, 1437633, 1440076, 1445210, 1451665, 1456819, 1462612, 1472259, 1484293, 1495616, 1507284, 1521656, 1537111, 1551416, 1566914, 1586450, 1607502, 1626274, 1644131, 1663940, 1683685, 1700146, 1715404, 1733143, 1751901, 1768549, 1785054, 1805093, 1827308, 1848598]
58286A848598K1969K5382K6405K4316K5314L0814L4202L3011L3160L7095L9162
58275B179428L7046L6391L9466M0699L8177L8014M2631M6126M5918M7191N1434
58264B642521N2912N0997N3132O0760O5602O4753O5778P1618P4778P2158P1036
58253C346045P4383P5116P1211P1223P8218Q3715Q4275Q7992R7703J04591J05646
58242D280118J10168J21335J29474J31457J37888J52540J64325J68783J77019
58233E573107J93638K07145K12813K22881K42789K60166K69537K84246L11001
58224G777323L36964L55610L80008M16288M50722M78018N14304N66343O17687
58215A1893267O61954P18094P94868Q74429R50248J044676J167924J299327J432451
$$ y = [1848598, 1870567, 1895949, 1922354, 1946670, 1971984, 2002798, 2037000, 2070011, 2103171, 2140266, 2179428, 2216474, 2252865, 2292331, 2333030, 2371207, 2409221, 2451852, 2497978, 2543896, 2591087, 2642521, 2695433, 2746430, 2799562, 2860322, 2925924, 2990677, 3056455, 3128073, 3202851, 3275009, 3346045, 3420428, 3495544, 3566755, 3637978, 3716196, 3799911, 3884186, 3972178, 4069881, 4174472, 4280118, 4390286, 4511621, 4641095, 4772552, 4910440, 5062980, 5227305, 5396088, 5573107, 5766745, 5973890, 6186703, 6409584, 6652373, 6912539, 7182076, 7466322, 7777323, 8114287, 8469897, 8849905, 9266193, 9716915, 10194933, 10709237, 11275580, 11893267, 12555221, 13273315, 14068183, 14942612, 15892860, 16937536, 18105460, 19404787, 20837238]
58206B0837238J596371J807318K045602K308123K633722L046877L532450M099311
58198D1907012M806794N693463O753665Q027522R633759J1674279J4212981J7398154
58190A20107629K1468120K6566207L2689472L9746409M7066608N2362814N1701202
58183C91708461M1785164K3073268M23638j9827436l3577879m0153480m0929770
58176C22501966l7801181l2793633k7932465k4537236k2633385k1356193j9917450
58169A35530423j8094605j6028860j3907522j1879023j0055104q476550p123660
58162D9965099n979678n040896m277196l640428l108617k678656k326916k019402
58154B0893310j749804j529323j350133j192903j057347r52440q68612p89624
$$ y = [20837238, 22433609, 24240927, 26286529, 28594652, 31228374, 34275251, 37807701, 41907012, 46713806, 52407269, 59160934, 67188456, 76822215, 88496494, 102709475, 120107629, 141575749, 168141956, 200831428, 240577837, 287644445, 340007259, 391708461, 433493625, 456566893, 456990531, 437163095, 403585216, 363431736, 322501966, 284700785, 251907152, 223974687, 199437451, 176804066, 155447873, 135530423, 117435818, 101406958, 87499436, 75620413, 65565309, 57088759, 49965099, 43985421, 38944525, 34667329, 31026901, 27918284, 25239628, 22912712, 20893310, 19143506, 17614183, 16264050, 15071147, 14013800, 13061360, 12192748, 11403124]
58146A1403124p19361o68389o26676n77075n23605m80347m44137m03414l62439
58137F597681l32115l07172k76105k44158k24369k14810k05325j97394j97089
58128D399144j97492j88115j73702j64996j59101j47059j32529j24731j20501
58119B990918j11116r9788r5147r4068q7696p8352p4320p3707o8979o2004n9629
58108B086112n9708n5857n0823n1159n3804n1511m6508m5583m6813m4121l9838
58097A540387l9872m1419l8256l3292l3209l5443l3030k7803k6306k6934k3618
58086A181205j8234j6964j8224j6253j3129j5076k0118k1335j9479k0622k3925
58075I77846k3473j9950j9214k1063k0289j7172j6446j7505j5798j2392j2196
$$ y = [11403124, 10683763, 10015374, 9388698, 8811623, 8288018, 7807671, 7363534, 6960120, 6597681, 6265566, 5958394, 5682289, 5438131, 5213762, 4998952, 4793627, 4596233, 4399144, 4201652, 4013537, 3839835, 3674839, 3515738, 3368679, 3236150, 3111419, 2990918, 2879802, 2780014, 2684867, 2590799, 2503103, 2424751, 2350431, 2276724, 2207745, 2145741, 2086112, 2026404, 1970547, 1919724, 1868565, 1814761, 1763250, 1716742, 1671159, 1624346, 1580225, 1540387, 1500515, 1459096, 1420840, 1387548, 1354339, 1318896, 1285866, 1258063, 1231757, 1204823, 1181205, 1162971, 1146007, 1127783, 1111530, 1098401, 1083325, 1063207, 1041872, 1022393, 1001771, 977846, 954373, 934423, 915209, 894146, 873857, 856685, 840239, 822734, 806936, 794544, 782348]
58064G82348j4198j3125r324p636q000o428l807m474p456q143p219r076j2713
58051F70749j3146j0668r948j0970r560n940m349m905m047k168k891n513o046
58038E80598m902n821q188q109o175o319p994p238m684m719p327q454p832q851
58024D83985j1092j0646p644o184o922o735n387n521o497n201k597k469m149l622
58010C99319j300j397l851m209j654N9j44M20J850J265p36k51K713L916K403J766
57994D00169L153L602K140J269J427J36k418l015j423r43k174k197p37j056l682
57979C94251n197m450m266n714o253m915l996m300l722j823q63j289r38L78L46
57964C47249j155j631q02r35j981j383P57J511N67N82J674J026j375k196q17l90
$$ y = [782348, 768150, 755025, 745701, 738065, 730065, 723637, 719830, 715356, 707900, 699757, 692538, 683462, 670749, 657603, 646935, 636987, 626017, 616457, 610517, 606168, 601263, 597216, 595048, 592157, 586644, 580598, 575696, 569875, 561687, 553578, 547403, 541084, 533090, 525852, 521168, 516449, 509122, 500668, 492836, 483985, 472893, 462247, 454603, 448419, 441497, 434762, 429375, 423854, 417357, 412156, 409559, 407090, 402941, 399319, 398019, 396622, 392771, 388562, 386908, 386967, 386823, 387243, 389093, 390358, 389622, 389371, 392084, 396000, 398403, 400169, 403322, 406924, 409064, 410333, 411760, 411896, 409478, 406463, 405040, 404097, 401923, 399726, 398989, 397933, 394251, 389054, 384604, 380338, 374624, 368371, 363456, 359460, 355160, 351438, 349615, 348752, 347463, 346525, 346903, 347249, 346094, 344463, 343661, 342726, 340745, 339362, 340119, 341630, 342197, 342779, 344453, 345479, 344104, 341908, 341091, 340701]
57948C40701j840k278o49N24L84J418M290O162N846N725P010P802P464Q166J0503
57933D01228J2130J2169J2540J3583J2980J0322Q101O937M485L85k533l406m853
57920D84068p850r930j0162j0972j3204j4102j2334j0460j0286j0091q568p279
57908C58830p145o552m859l850l989l276j385p39j936k426j424j449l251l873
57894C12676j880J31M40R84K895L897K855K405M097N252L762J992K588M139M273
57879C50506L614L421K569J22k099k573k980n125p589q262p649p191o680n737
57865C04347n408o052o090m821l900m239m217k787j378q60K29K470L811L239K940
57850B77284M479N956N377L885L190K704J633J052J493J278m68j893j724j528
$$ y = [340701, 338861, 336583, 335934, 336458, 336842, 338260, 342550, 348712, 354558, 360283, 367293, 375095, 382559, 390725, 401228, 413358, 425527, 438067, 451650, 464630, 474952, 483053, 489990, 494475, 494860, 492327, 488921, 484068, 476218, 466288, 456126, 445154, 431950, 417848, 405514, 395054, 384768, 374677, 366109, 358830, 351685, 345133, 340274, 336424, 332435, 329159, 327774, 327035, 325099, 322673, 321249, 319800, 316549, 312676, 310796, 310927, 311367, 312351, 315246, 319143, 321998, 324403, 328500, 333752, 337514, 339506, 342094, 346233, 350506, 354120, 357541, 360110, 360232, 358133, 355560, 352580, 347455, 339866, 331604, 323955, 316764, 310084, 304347, 298939, 292887, 286797, 281976, 278076, 273837, 269620, 266833, 265455, 264595, 264824, 267294, 271105, 274344, 277284, 281763, 287719, 293096, 296981, 300171, 302875, 304508, 305560, 307053, 308331, 307863, 305970, 304246, 302718]
57836C02718k510l133k290j685k506k907j519l69j326k619j871J3J061J715L078
57821B85850M092L596K941L640M533M011K985K935L150K642K632M289N979N463
57807C38738L076L05k686n812p564p252o720p397p891o738n183m656m117k530
57793B73573j502k504l837l411k255k238k529j500j58k65r45m01P01P46M96J670
57777B55641L601M476M534N097N714N194M281M427N060M750L898L632L411K255
57763C15971J076J044J025o75l245m658m823m901m750l631k285j850j839j471
57749B84988j571k847l830l017j587j487k298k513k365k773l062k355j722k250
57735B51311k634j400J27L5o94m7J220R37n50j149o65m88n95O2R36P42Q8L71R10
$$ y = [302718, 300208, 297075, 294785, 293100, 290594, 287687, 286168, 285799, 284473, 281854, 279983, 279996, 281057, 282772, 285850, 289942, 293538, 296479, 300119, 304652, 308663, 311648, 314583, 317733, 320375, 323007, 327296, 333275, 338738, 341814, 342119, 339433, 333621, 326057, 318805, 312085, 304688, 296797, 290059, 284876, 280220, 276103, 273573, 272071, 269567, 265730, 262319, 260064, 257826, 255297, 253797, 253639, 253374, 252429, 252028, 252729, 253475, 253971, 255641, 259242, 263718, 268252, 273349, 279063, 284257, 288538, 292965, 298025, 302775, 306673, 310305, 313716, 315971, 317047, 318091, 319116, 318441, 315196, 310538, 305715, 300814, 296064, 292433, 290148, 288298, 286459, 284988, 283417, 280570, 276740, 273723, 272136, 270649, 268351, 265838, 263473, 260700, 257638, 255283, 253561, 251311, 248677, 247277, 247404, 247439, 246745, 246698, 247918, 248855, 248305, 247156, 246491, 246003, 245408, 245470, 246406, 247148, 247236, 247607, 248517]
57716B48517O3j594k176j768j933k681k754k256k298k665k461k300l201m195l649
57701B12649k137j397j415j191j211k300l136k024r6L47l01j5R21N42r21j287
57685A97028k05O64R32J704K675K373J294J617L714N828P398R732J3245J6855
57671B64854K0400K5156L1755L9917N0266O3810P8994R0900R3367Q1237N2782
57660H93438J3009k6622n5340p0264p5036p3223o6393n6957m8195m1039l4247
57649C59131k7789k2973j9420j5414j1314r205q990q156n834l870l405l513l580
57636B15668m035m236k706l8J312P12M5L64O72M49M97P68J67r73j036j41j66j354
57618B05969j832j096r51k165l146k848k292k270k125j724k060l036l060j762
$$ y = [248517, 248580, 246986, 244810, 243042, 241109, 238428, 235674, 233418, 231120, 228455, 225994, 223694, 220493, 216298, 212649, 210512, 209115, 207700, 206509, 205298, 202998, 199862, 197838, 197742, 198089, 197788, 197773, 198694, 199236, 198315, 197028, 196823, 197487, 198419, 200123, 202798, 205171, 206465, 208082, 211796, 217624, 225022, 234754, 247999, 264854, 285254, 310410, 342165, 382082, 432348, 496158, 575152, 666052, 759419, 840656, 893438, 906447, 879825, 824485, 754221, 679185, 605962, 539569, 482612, 434417, 393378, 359131, 331342, 308369, 288949, 273535, 262221, 253016, 244026, 235870, 230036, 226166, 222761, 219248, 215668, 211633, 207397, 204691, 204653, 205965, 206677, 206722, 207086, 207758, 208207, 208704, 209472, 209639, 208666, 207630, 207489, 207323, 205969, 204137, 203041, 202090, 199925, 196779, 193931, 191639, 189369, 187244, 185520, 183460, 180424, 177364, 175602]
57604A75602p17o99n79K67Q32N92M30P44Q01N52Q73J499J049m78j565j843k403
57587A74957l184k799j427r63j720j885r38p01j973l072k789k095j848j424p54
57572A47385j032k259k643j635r98j745k561k462k403k917k720j155L19N06K09
57557A23889L46M65L02N73J153P22o77j130J9J060R88J060J943K114P31n27k65
57540A32766M01K78L64J699L140L272K663K297J636J20j169j271j134j899k910
57525A40253l053k596k219j665p58k13j76M00J714K322J632J171K006K866K429
57510A44113J534J402J465P89J8P5M19J92j89q9J30J67N61J208Q07r22k319k377
57492A46984k330l214l857l018j590q91n04L24Q52K76n12m81k96q64j482j127
$$ y = [175602, 174885, 174186, 173607, 173874, 174706, 175298, 175728, 176472, 177273, 177825, 178698, 180197, 181246, 180768, 179203, 177360, 174957, 171773, 168974, 167547, 166584, 164864, 162979, 162041, 161340, 159367, 156295, 153506, 151411, 149563, 148139, 147385, 146353, 144094, 141451, 139816, 138818, 137073, 134512, 132050, 129647, 126730, 124010, 122855, 123174, 123680, 123889, 124235, 124700, 125002, 125575, 126728, 127450, 126773, 125643, 125662, 126722, 127710, 128770, 130713, 132827, 133558, 133031, 132766, 133167, 133445, 133809, 135508, 138648, 141920, 144583, 146880, 148516, 148636, 147467, 146196, 145062, 143163, 140253, 137200, 134604, 132385, 130720, 129962, 129749, 129573, 129973, 131687, 134009, 135641, 136812, 138818, 141684, 144113, 145647, 147049, 148514, 149303, 149321, 149396, 149815, 150007, 149818, 149729, 149859, 150026, 150587, 151795, 152602, 151680, 149361, 146984, 144654, 141440, 137583, 134565, 132975, 132084, 131580, 131904, 132756, 133032, 132520, 132039, 131743, 130879, 129397, 128270]
57476A28270k55K81O90J149Q44m25j326j202j393k710l547k410n74p1o42q03m81
57459A15395m25l02N10J347J374J146J277R05p11k349k553j832j330p30N55J583
57443A13860J370Q89J383J967J178k58n50K63P98Q30J078J250N78l33k90L76L98
57426A24787k12l61K11Q47J252J370O90p83j748j295n30q39j582j280j87K42k81
57409A20301p98p90l73N23J689K054J074j27l80k25o72j277j087m42j63N0P35
57392A20092J275J021P70J406K138J810R17N80O62O23J069K509L715L324K073
57377A43984J534J615J278O51M30J91o52j243o61J27j93q98n61K92J71o50q31
57360A44584n01p02j024k74J117J637J145N54j93j573k581j814J1J002J007J343
$$ y = [128270, 128015, 128296, 128986, 130135, 130979, 130554, 129228, 128026, 126633, 123923, 120376, 117966, 117392, 117321, 116679, 115876, 115395, 114970, 114668, 115178, 116525, 117899, 119045, 120322, 121227, 120516, 118167, 115614, 113782, 112452, 111722, 112277, 113860, 115230, 116119, 117502, 119469, 120647, 120389, 119839, 120102, 120900, 121730, 122808, 124058, 124636, 124303, 124013, 124389, 124787, 124575, 124214, 124425, 125272, 126524, 127894, 128584, 127801, 126053, 124758, 124228, 123389, 121807, 120527, 120340, 120582, 120301, 119503, 118713, 118340, 118863, 120552, 122606, 123680, 123553, 123173, 122948, 122276, 120999, 119912, 119470, 119307, 119357, 120092, 121367, 122388, 123158, 124564, 126702, 128512, 129429, 130009, 130671, 131294, 132363, 134872, 138587, 141911, 143984, 145518, 147133, 148411, 149062, 149492, 149683, 149031, 147788, 147127, 147254, 147061, 146163, 145602, 145894, 146065, 145415, 144584, 144083, 143381, 142357, 142083, 143200, 144837, 145982, 146536, 146343, 144770, 142189, 140375, 140386, 141388, 142395, 143738]
57344A43738K110K262J924K180K761K362J074K06q5p25j416q30Q22J638P27p93
57328A57955j589j299k3J655K338J156p65j689j519j201p20M23J519J589J227
57313A59057J487J674N55j025j189j17M56L43Q77K123K702K383K331K830L049
57298A77536K961L208L258K048L54Q6J304K288K484K966L925M212L639L366L773
57283B17408L981L730L726M115M465N109O536P780P486O194N373M783L269J537
57269B85492J345K289K319J281R70J678J777Q93N02R93J050L65J39N31L83j14
57253C01893O14K462L420L028L025M007M357L368K553K903L496L736M330N226
57239C48418N285M710N150O610P166O497O600Q001Q504P107N967O822Q342Q909
$$ y = [143738, 145848, 148110, 150034, 152214, 154975, 157337, 158411, 158617, 158532, 157807, 156391, 155561, 156383, 158021, 158748, 157955, 156366, 155067, 155044, 156699, 159037, 160193, 159428, 157739, 156220, 155019, 154299, 154722, 156241, 157830, 159057, 160544, 162218, 162773, 161748, 160559, 160442, 160898, 161241, 162118, 164241, 166943, 169326, 171657, 174487, 177536, 180497, 183705, 186963, 189011, 189365, 189451, 190755, 193043, 195527, 198493, 202418, 206630, 210269, 213635, 217408, 221389, 225119, 228845, 232960, 237425, 242534, 249070, 256850, 264336, 270530, 275903, 280686, 283955, 285492, 286837, 289126, 291445, 292726, 293696, 295374, 297151, 298044, 298546, 299539, 300589, 300954, 301093, 301624, 302007, 301893, 302507, 304969, 308389, 311417, 314442, 318449, 322806, 326174, 328727, 331630, 335126, 338862, 343192, 348418, 353703, 358413, 363563, 370173, 377339, 383836, 390436, 398437, 406941, 414048, 420015, 426837, 435179, 444088]
57225D44088R202J0123J0716J0269J0188J1609J3266J3692J3749J4861J6511J7399
57213E95673J7600J7819J7887J7559J7440J7799J7842J7357J7490J8691J9539
57202G92696J8883J7477J6402J5515J4623J4447J5181J5776J5805J6253J7420
57191I70478J8006J7459J7170J8024J8789J8400J7845J8276J9130J9688K0552
57180A173817K1990K2748K2190K1732K2443K3050K2277K1322K1951K3639K4714
57169A421873K5037K5493K5965K5802K5373K5413K5688K5755K6125K7262K8528
57158A708314K9285K9970L0864L1173L0542L0164L0968L2073L2369L2318L2784
57147B050824L3435L3705L4056L4918L5624L5723L6016L7001L7805L7861L8096
$$ y = [444088, 453290, 463413, 474129, 484398, 494586, 506195, 519461, 533153, 546902, 561763, 578274, 595673, 613273, 631092, 648979, 666538, 683978, 701777, 719619, 736976, 754466, 773157, 792696, 811579, 829056, 845458, 860973, 875596, 890043, 905224, 921000, 936805, 953058, 970478, 988484, 1005943, 1023113, 1041137, 1059926, 1078326, 1096171, 1114447, 1133577, 1153265, 1173817, 1195807, 1218555, 1240745, 1262477, 1284920, 1307970, 1330247, 1351569, 1373520, 1397159, 1421873, 1446910, 1472403, 1498368, 1524170, 1549543, 1574956, 1600644, 1626399, 1652524, 1679786, 1708314, 1737599, 1767569, 1798433, 1829606, 1860148, 1890312, 1921280, 1953353, 1985722, 2018040, 2050824, 2084259, 2117964, 2152020, 2186938, 2222562, 2258285, 2294301, 2331302, 2369107, 2406968, 2445064]
57136B445064L9088L9721L9196L8695L9441M0596M0881M0769M1313M2179M2665
57125B889608M3378M5164M7596N0080N3261N7704O2544O7026P1957P8044Q4379
57114C550741R0360R7516J07487J19639J32778J47743J66137J87860K12152K39952
57104E052365K73057L12171L58148M14188M84572N72324O80425Q14226R80099
57095I941575J182407J424163J709338K041142K417716K831501L271689L723751
57087B8543282M166313M571811M911371N156978N279245N248297N041945M653641
57079F7572883M091066L367846K499704J510578M41004o52690j709899k677586
57071G4442906l513715m185752m672722m970321n090737n055470m889415m620681
$$ y = [2445064, 2484152, 2523873, 2563069, 2601764, 2641205, 2681801, 2722682, 2763451, 2804764, 2846943, 2889608, 2932986, 2978150, 3025746, 3075826, 3129087, 3186791, 3249335, 3316361, 3388318, 3466362, 3550741, 3641101, 3738617, 3846104, 3965743, 4098521, 4246264, 4412401, 4600261, 4812413, 5052365, 5325422, 5637593, 5995741, 6409929, 6894501, 7466825, 8147250, 8961476, 9941575, 11123982, 12548145, 14257483, 16298625, 18716341, 21547842, 24819531, 28543282, 32709595, 37281406, 42192777, 47349755, 52629000, 57877297, 62919242, 67572883, 71663949, 75031795, 77531499, 79042077, 79483081, 78830391, 77120492, 74442906, 70929191, 66743439, 62070717, 57100396, 52009659, 46954189, 42064774, 37444093]
57063C7444093m280554l898968l500168l103334k724464k374937k059797j780018
57055A3721853j535549j324934j144194r88916q56598p45207o50990n69947n00215
57046E405303m40915l89915l44818l04998k70552k40572k14248j92085j73959
57037B833241j57616j41442j26816j15250j05081r3962q2679p3115o4215n3629
57027A819436m1800l0344j7742j019J9884M4676P7703J21564J63101J74037J33568
57016B463064M9535m6370j23067j67832j84586j82637j69557j50566j29683j09851
57006A248450r2622p8403o7079n8268n1107m4510l8161l2786k8911k5877k2796
56995G07930j9967j8334j7916j7691j6797j4976j2203q728n226k121R72M552Q399
$$ y = [37444093, 33163539, 29264571, 25764403, 22661069, 19936605, 17561668, 15501871, 13721853, 12186304, 10861370, 9717176, 8728260, 7871662, 7126455, 6475465, 5905518, 5405303, 4964388, 4574473, 4229655, 3924657, 3654105, 3413533, 3199285, 3007200, 2833241, 2675625, 2534183, 2407367, 2292117, 2187036, 2093074, 2010395, 1937280, 1873065, 1819436, 1777636, 1747292, 1729550, 1728531, 1748415, 1793091, 1870794, 1992358, 2155459, 2329496, 2463064, 2512599, 2466229, 2343162, 2175330, 1990744, 1808107, 1638550, 1487984, 1358301, 1248450, 1155828, 1077425, 1010346, 952078, 900971, 856461, 818300, 785514, 756603, 730726, 707930, 687963, 669629, 651713, 634022, 617225, 602249, 590046, 581318, 576092, 573971, 574943, 579495, 587894]
56982E87894J1796J3793J2750P082k488j2510j9819k4025k6141k6282k4330k1426
56970D76294j8886j6467j3473j0556q627o919m142o91K249N056R050J4199J9474
56957D46561K4770L0062L3095L0490K1425Q441n241j7407k6283l0648l0987k8983
56945D55295k5715k1560j7393j4181j1580q594n322k492L46M322R279J4103J8837
56932C95345K4642L1667L8317M2294M1035L2194J5891l696k0921l2837l9585m1762
56920D82584l9772l5246l0581k6770k3287j9920j6956j4084j1006q716q126q043
56908B40077o689m680m023m628m458l009j837j525q03P74J836J639J361K210L971
56893B20216O006Q084R914J1407J3466J7048K1544K5594K8973L1624L1495K6018
$$ y = [587894, 599690, 613483, 626233, 633315, 630827, 618317, 598498, 574473, 548332, 522050, 497720, 476294, 457408, 440941, 427468, 416912, 408285, 401366, 397224, 396533, 398782, 403838, 412888, 427087, 446561, 471331, 501393, 534488, 564978, 586403, 594844, 589603, 572196, 545913, 515265, 484278, 455295, 429580, 408020, 390627, 376446, 364866, 356272, 350950, 348458, 348804, 353126, 362405, 376508, 395345, 419987, 451654, 489971, 532265, 573300, 605494, 621385, 617689, 596768, 563931, 524346, 482584, 442812, 407566, 376985, 350215, 326928, 307008, 290052, 275968, 264962, 256246, 248120, 240077, 233388, 228708, 224685, 220057, 215599, 212590, 210753, 209228, 208425, 209199, 211035, 212674, 214035, 216245, 220216, 226222, 234306, 244220, 255627, 269093, 286141, 307685, 333279, 362252, 393876, 425371, 451389]
56881D51389J5835M624m862j2318j7608j9838j9281j7662j5657j2324p591l113
56869C41594J35L058O524J0110J3574J7826K3653L0965L9820N0502O1841P0463
56857F70065P2233O3891M4448J6962j1399l3471m6604n2204n1979m7019l9510
56846E85413l2038k4981j7154r040k529K554Q676J7025K6572L7036M9753O4966
56834G06253Q1083R6956J11310J18849J10747Q1991L7055j2752n5971q5193r8477
56823A091851r9265r3409q4646p3597o0931m8797l8330k8412j8224q867j071O576
56811E42878J5724K6340L7922N0839O4896P7605Q4634Q1180O3567L2236o005m0926
56799A030890o5358p8022q0877p6520o8310n9586n1294m2400l3230k5801k0371
$$ y = [451389, 467224, 471848, 466986, 454668, 437060, 417222, 397941, 380279, 364622, 352298, 344707, 341594, 341729, 344787, 351311, 361421, 374995, 392821, 416474, 447439, 487259, 537761, 599602, 670065, 742298, 806189, 850637, 867599, 856200, 822729, 776125, 723921, 671942, 624923, 585413, 553375, 528394, 511240, 502200, 499671, 502225, 510901, 527926, 554498, 591534, 641287, 706253, 787336, 884292, 995602, 1114451, 1225198, 1307189, 1344244, 1331492, 1275521, 1190328, 1091851, 992586, 899177, 814531, 740934, 680003, 631206, 592876, 564464, 546240, 537373, 536302, 542878, 558602, 584942, 622864, 673703, 738599, 816204, 900838, 982018, 1045585, 1077821, 1071816, 1030890, 965532, 887510, 806633, 730113, 661803, 602217, 550923, 508523, 475293, 449492, 429121]
56788D29121j4721p888j562L452R038J6492K4343L1158L7522M3000M3653L5453
56776F49061J8822j844k1610l6708m5097m7518m6777m4620m0634l4871k9269k5210
56764B93725k1833j8232j5208j3464j2074j0309q951q339p225n060l357l214l431
56751A63028k649j482r94r81j135j921k963k617o12J003Q80J72J3l42j374j785
56735A46241r28k75p18q15L62J186L10q66p53j93l39k97P56J391M59m73K25J274
56717A46547Q68ON31J700J646P57N81P69J3j097r92N9O14O64J114J597J113R5
56699A56585k98j67k51l29J0J40k67q1J308K317J458j86q63r17j445j764p94M26
56681A54882J94r57j212m10K92O78J192J343N86j44K38R76P71Ok06j5J7N01J909
$$ y = [429121, 414400, 406512, 404950, 408402, 417440, 433932, 458275, 489433, 526955, 569955, 613608, 649061, 667883, 666039, 644429, 607721, 562624, 515106, 468329, 423709, 383075, 348204, 318935, 293725, 271892, 253660, 238452, 224988, 212914, 202605, 193654, 185315, 178090, 173030, 169673, 166459, 163028, 160379, 158897, 157903, 156922, 155787, 153866, 150903, 148286, 147674, 148677, 149557, 149729, 149742, 149400, 148026, 146241, 145313, 145038, 144320, 143505, 143867, 145053, 145363, 144497, 143744, 143551, 143212, 142915, 143671, 145062, 145521, 145048, 145273, 146547, 147415, 147421, 147952, 149652, 151298, 152055, 152636, 153405, 153418, 152321, 151329, 151388, 152002, 152666, 153780, 155377, 156490, 156585, 156287, 156120, 155869, 155540, 155550, 155690, 155423, 155342, 156650, 158967, 160425, 160239, 159376, 158459, 157014, 155250, 154456, 154882, 155076, 154119, 152907, 152497, 152789, 153467, 154659, 156002, 156588, 156444, 156682, 157658, 158429, 158435, 158229, 158214, 158231, 158732, 160641]
56662A60641K965K444J366J343J964J816R58L46O8j7Q19K663L913L606L201L996
56646A92092M760M084L144L499M115L341K115K121K413J080j067j648n45M34O73
56631B20611P58L35j050k109j599q60j708l022k568j039r93k587l796m093m565
56616A91715m910l746j647o77r68p91R9J86q11j478j285j087j046n39L0l81j391
56599A71273j797j709j947j886m25J539K119J362Q26Q48P02O64J339J749P80k85
56583A75152M57K066K044M19n47k11M1j54K17J052J232J077J835K987K938K105
56567A92710K400L826M512M047L879M482M912N211O496Q695J0589J1896J2884
56554B76539J2479R509N352K592J562Q70M99J325K327J690J31k47J27r18l014
$$ y = [160641, 163606, 166050, 167416, 168759, 170723, 172539, 173497, 173843, 173911, 173894, 174713, 177376, 181289, 184895, 188096, 192092, 196852, 200936, 204080, 207579, 211694, 215035, 217150, 219271, 221684, 222764, 221697, 220049, 219504, 219938, 220611, 221369, 221704, 220654, 218545, 216946, 216086, 214378, 211356, 208788, 207749, 206756, 204169, 200373, 196280, 191715, 186805, 183059, 181412, 180735, 179767, 178976, 179075, 179261, 178450, 176972, 175687, 174600, 173554, 173015, 173045, 172664, 171273, 169476, 167767, 165820, 163934, 163509, 165048, 167167, 168529, 169355, 170203, 170905, 171569, 172908, 174657, 175437, 175152, 175609, 177675, 179719, 180138, 179591, 179380, 179421, 179267, 179484, 180536, 181768, 182845, 184680, 187667, 190605, 192710, 195110, 198936, 203448, 207495, 211374, 215856, 220768, 225979, 232475, 241170, 251759, 263655, 276539, 289018, 298527, 303879, 306471, 308033, 308903, 309402, 310727, 313054, 314744, 314875, 314628, 314755, 313837, 310823]
56539C10823l639k581k213l169l566k922l008m256m835m108l647m103m193l528
56525B61055l299l562k823r95J41Pj86j90j048k303k125p68p24k707m562m838
56509B31073m439m071l111j792j528k217k063p58l7m45m95L73Q38M23K93P23N81
56492B13348r3J12J056R67k51o22L32P61l1m46J93L62p11j662j521j006n44M38
56474B10682J542J425L18n7N91R87J110K074L150K345K50l42R27J383K6r93n11
56457B24907j23o47m65J078K078J366L58K19J47l78n16k60q16j936j878o72k41
56440B22221p48l39R64R39m56n32J304K330J426Q76J717J585p00k515j808l32
56424B25932j37l49J81L82m59p80K41P54m46j573j058j77l30n42J91P79L64O0
$$ y = [310823, 307184, 304603, 302390, 299221, 295655, 292733, 289725, 285469, 280634, 276526, 272879, 268776, 264583, 261055, 257756, 254194, 251371, 250376, 250517, 250524, 250338, 250148, 249100, 246797, 244672, 243904, 243180, 240473, 235911, 231073, 226634, 222563, 219452, 217660, 216132, 213915, 211852, 211094, 211057, 210612, 210117, 210490, 211328, 211751, 212044, 212767, 213348, 213255, 213367, 214423, 215390, 215139, 214517, 214849, 215610, 215579, 215133, 215326, 215688, 214977, 213315, 211794, 210788, 210244, 210682, 212224, 213649, 213967, 213910, 214501, 215488, 216598, 218672, 221822, 224167, 224417, 224075, 225002, 226385, 226411, 225418, 224907, 224784, 224137, 223672, 224750, 226828, 228194, 228552, 228771, 228918, 228540, 228024, 227764, 226948, 225012, 223134, 222462, 222221, 221473, 221134, 222098, 223037, 222581, 222049, 223353, 225683, 227109, 227985, 229702, 231287, 230587, 228072, 226264, 225932, 225795, 225446, 225627, 226009, 225550, 224770, 225011, 225765, 225319, 223746, 222688, 222511, 222181, 221639, 221830, 222609, 222973, 223033]
56406B23033N67O36k25l91Q16J571Q28J81P09J014K39MJ320K590K586K540L335
56389B41353L575K383J262J298J401R44J155K198K149O16K0J447K644K096J592
56374B66133K624L626L158K420K374J616n27k060j718j153j520j275M63J716J168
56359B77045N07R69J003k97r79J32J144P89P64J947K113J30j426o50M40p8n64
56342B82989N48J468O12j33R80K298K223K356L833M387K498Q31J818L365K715
56327C12788J134R89J527J371J822L798M808K966Q15J165K365J722L75N49J110
56312C39304K16n87P85K710K747J974K423K965J974J148K416L889L209K141L360
56297C70674N376N252L758L380L669K987K444L596M695L648K288L245N082N065
$$ y = [223033, 223600, 224236, 224011, 223620, 224436, 226007, 226835, 227016, 227725, 228739, 228978, 228982, 230302, 232892, 235478, 238018, 241353, 244928, 247311, 248573, 249871, 251272, 252216, 253371, 255569, 257718, 258334, 258354, 259801, 262445, 264541, 266133, 268757, 272383, 275541, 277961, 280335, 281951, 281424, 279364, 277646, 276493, 274973, 273698, 274161, 275877, 277045, 277552, 278521, 279524, 279227, 278248, 278380, 279524, 280313, 281077, 283024, 285137, 285267, 283841, 283191, 283631, 283553, 282989, 283537, 285005, 285617, 285484, 286464, 288762, 290985, 293341, 297174, 301561, 304059, 304890, 306708, 310073, 312788, 313922, 314911, 316438, 317809, 319631, 323429, 328237, 331203, 332018, 333183, 335548, 337270, 337645, 338194, 339304, 339520, 338933, 339718, 342428, 345175, 347149, 349572, 352537, 354511, 355659, 358075, 361964, 365173, 367314, 370674, 376050, 381302, 385060, 388440, 392109, 395096, 397540, 401136, 405831, 409479, 411767, 415012, 420094, 425159]
56283D25159M274N254O982O950O027O571P773P551O957Q140J0000J0350J0272
56270E22260J1832J3666J3427J2483J3539J5759J6790J7407J9581K2123K2980
56259G01847K3616K6543L0684L3877L7468M3675N0862N6449O2054P0579Q0678
56248A218332Q9383R7833J08893J21240J31423J39740J48441J56111J59511J59200
56238B530107J57753J54042J44827J30393J13104R2187O5678L5894P289j9633
56228C411641m6748p2451r3184j09222j23154j34124j39414j40373j40763j40457
56218B271751j36543j29549j22807j16748j09373j01231r4370q7687p8872o9576
56208A224995o3086n8507n2837m6957m3590m1177l6222l0042k6729k5842k3651
$$ y = [425159, 429433, 434687, 441669, 448619, 454646, 461217, 468990, 476541, 483498, 491638, 501638, 511988, 522260, 534092, 547758, 561185, 573668, 587207, 602966, 619756, 637163, 656744, 678867, 701847, 725463, 752006, 782690, 816567, 854035, 897710, 948572, 1005021, 1067075, 1137654, 1218332, 1307715, 1405548, 1514441, 1635681, 1767104, 1906844, 2055285, 2211396, 2370907, 2530107, 2687860, 2841902, 2986729, 3117122, 3230226, 3322413, 3388091, 3423985, 3431274, 3411641, 3364893, 3292442, 3199258, 3090036, 2966882, 2832758, 2693344, 2552971, 2412208, 2271751, 2135208, 2005659, 1882852, 1766104, 1656731, 1555500, 1461130, 1373443, 1294571, 1224995, 1161909, 1103402, 1050565, 1003608, 960018, 918841, 882619, 852577, 825848, 800006, 776355]
56197G76355k0216j8549j8008j5429j1759j0760j1926j1364q930p833p995o501
56185F27085l908l406m447l844k290l025m957m158j360q19k425k196q2J65j425
56170E88908j042J485K477J633K214M179M225K678L163N462N863M538N325Q208
56156F39316R247Q024P940R167Q684P138Q278J1608J3135J3207J5842K0469K2559
56143G94614K2508K5552L2460L8751M3702N1773O4030P6360Q7172R8681J09390
56132A444993J13388J08686R8913Q6129O9758N3184M2954L9994L9079L7477L6274
56121B170829L3163K3112P437o213j4102j8758k1036j9161j6548k1019l4276n0421
56109B033007o5773q1311r4698r9833r6326r0399q4755p6277o4867n5034m7366
$$ y = [776355, 756139, 737590, 719582, 704153, 692394, 681634, 669708, 658344, 649414, 641581, 633586, 627085, 623177, 619771, 615324, 611480, 609190, 606165, 601208, 597050, 595690, 594871, 592446, 590250, 590168, 590333, 588908, 587866, 589351, 591828, 593461, 595675, 599854, 604079, 606757, 609920, 615382, 621245, 625783, 631108, 639316, 648563, 656587, 664527, 673694, 682378, 689516, 697794, 709402, 722537, 735744, 751586, 772055, 794614, 817122, 842674, 875134, 913885, 957587, 1009360, 1073390, 1149750, 1236922, 1335603, 1444993, 1558381, 1667067, 1765980, 1852109, 1921867, 1975051, 2018005, 2057999, 2097078, 2134555, 2170829, 2203992, 2227104, 2234541, 2228328, 2214226, 2195468, 2174432, 2155271, 2138723, 2117704, 2083428, 2033007, 1967234, 1885923, 1791225, 1691392, 1595066, 1504667, 1419912, 1343635, 1278768, 1223734, 1176368]
56098A176368l7861k7084k0436j7996j3990p622m340m871l535Q58L004J821K441
56085A046757N563N739K354J409M161N062L145M026Q226R323O336N991R820J1201
56071A129113Q371P920J1857J3712J1361J1198J5429J7678J5594J5405J9490K1772
56059A298900J9933J9704K2716K2744J8468J6929J9860J9906J5074J3137J6715
56048A504086J8104J4344J3101J7793K1127J9555J9820K4909K7874K6004K6525
56037A733242L1868L4060L0321K9004L3473L5667L2527L2603L9067M2775L9850
56026B114457L9365M5466M9124M6143M5740N2252N6163N2717N1508N7798O2568
56015B673301O1056O2398P0643P5452P2363P2507Q1218Q7379Q5530Q7226R8220
$$ y = [1176368, 1138507, 1111423, 1090987, 1072991, 1059001, 1051379, 1047039, 1042168, 1038633, 1039491, 1042495, 1044316, 1046757, 1052320, 1058059, 1060413, 1061822, 1065983, 1071045, 1074190, 1078216, 1086442, 1095765, 1102101, 1108092, 1117912, 1129113, 1137484, 1145404, 1157261, 1170973, 1182334, 1193532, 1208961, 1226639, 1242233, 1257638, 1277128, 1298900, 1318833, 1338537, 1361253, 1383997, 1402465, 1419394, 1439254, 1459160, 1474234, 1487371, 1504086, 1522190, 1536534, 1549635, 1567428, 1588555, 1608110, 1627930, 1652839, 1680713, 1706717, 1733242, 1765110, 1799170, 1829491, 1858495, 1891968, 1927635, 1960162, 1992765, 2031832, 2074607, 2114457, 2153822, 2199288, 2248412, 2294555, 2340295, 2392547, 2448710, 2501427, 2552935, 2610733, 2673301, 2734357, 2796755, 2867398, 2942850, 3015213, 3087720, 3168938, 3256317, 3341847, 3429073, 3527293]
56004C527293J06239J04616J05723J17007J26558J27091J30879J45383J57896
55995D648685J60586J66327J82908J96708J99612K06206K25703K43734K51346
55986F481815K64167K92153L19246L34782L55241L91853M27813M51996M82840
55977I801906N33146N84820O25671O75722P48575Q24348Q91417R74796J090652
55968A6751053J215700J337079J486297J685682J911395K151722K447834K831383
55960C1818145L282233L799563M449042N283569O293627P501747R022374J0960092
55952H2410392J3357772J6332541K0129111K4925653L0732348L7507486M4835993
55945B70231296N0879104N1939404M4268359K7258119M830102j6763951l2716318
$$ y = [3527293, 3633532, 3738148, 3843871, 3960878, 4087436, 4214527, 4345406, 4490789, 4648685, 4809271, 4975598, 5158506, 5355214, 5554826, 5761032, 5986735, 6230469, 6481815, 6745982, 7038135, 7357381, 7692163, 8047404, 8439257, 8867070, 9319066, 9801906, 10335052, 10919872, 11545543, 12221265, 12969840, 13794188, 14685605, 15660401, 16751053, 17966753, 19303832, 20790129, 22475811, 24387206, 26538928, 28986762, 31818145, 35100378, 38899941, 43348983, 48632552, 54926179, 62427926, 71450300, 82410392, 95768164, 112100705, 132229816, 157155469, 187887817, 225395303, 270231296, 321110400, 373049804, 417318163, 444576282, 449406384, 432642433, 399926115]
55938C99926115m1593289m4488198m3255833l9573758l4787959k9837709k5193172
55931A41196197k1025859j7433330j4455475j2013614r988051q324649o996267
55924E0958952n925503n026945m277563l677751l186962k757474k389771k097967
55916B1619016j856770j632747j433427j277910j150092j024643r09968q23925
55908A1509534p53831o79206o09163n60642n22770m77232m32069m02793l80632
55899F691196l50283l19476l01440k86952k62074k35673k22043k13442j96104
55890D303709j76952j68663j63975j50006j33367j26646j23806j12504r7801r0875
55880B959114q6500p3778n7614m8691m3596l5128l0626l9622n4078o0854o3464
$$ y = [399926115, 358332826, 313844628, 270588795, 231015037, 196227078, 166389369, 141196197, 120170338, 102737008, 88281533, 76267919, 66279868, 57955219, 50958952, 45033449, 40006504, 35728941, 32051190, 28864228, 26106754, 23716983, 21619016, 19762246, 18129499, 16696072, 15418162, 14268070, 13243427, 12333459, 11509534, 10755703, 10076497, 9467334, 8906692, 8383922, 7906690, 7474621, 7071828, 6691196, 6340913, 6021437, 5719997, 5433045, 5170971, 4935298, 4713255, 4499813, 4303709, 4126757, 3958094, 3794119, 3644113, 3510746, 3384100, 3260294, 3147790, 3049989, 2959114, 2872614, 2798836, 2741222, 2692531, 2648935, 2613807, 2583181, 2543559, 2489481, 2428627, 2365163]
55869B365163p2111q2389q3647p9237p9105q0559p4956o5710o1670o0007n2945
55858A572827m4403m2999m5283m2334l6481l5595l7079l3280k6832k5397k6941
55847A176203k4838k1807k4256k8499k6942k2477k2683k5197k2836j8021j8057
55836I20590k0937j9579j5647j5695j7957j6203j2588j3499j6566j4621r090o971
55824G41237p994o945n200p773j2210j2334r918j1023j4049j3036r603r838j2306
55811F09008j0884o858o459q698p326k892j451k845j435K817M793M532O705J0798
55797E89805J1820R832R105Q965N107j073m007l886n778r828j1485j0606j1154
55784E76817j2549j0353n150k285l152m723o710j1003j5149j4703j1157r407q641
$$ y = [2365163, 2293052, 2210663, 2127016, 2047779, 1968674, 1888115, 1813159, 1747449, 1685779, 1625772, 1572827, 1528424, 1485425, 1440142, 1397808, 1361327, 1325732, 1288653, 1255373, 1228541, 1203144, 1176203, 1151365, 1129558, 1105302, 1076803, 1049861, 1027384, 1004701, 979504, 956668, 938647, 920590, 899653, 880074, 864427, 848732, 830775, 814572, 801984, 788485, 771919, 757298, 748208, 741237, 733243, 726298, 721098, 713325, 701115, 688781, 678863, 667840, 653791, 640755, 631152, 621314, 609008, 598124, 591266, 584807, 576109, 568783, 565891, 564440, 561595, 560160, 562977, 567770, 572302, 579007, 589805, 601625, 611457, 620562, 629527, 634634, 633561, 629554, 625668, 619890, 610062, 598577, 587971, 576817, 564268, 553915, 548765, 546480, 543328, 538605, 531895, 520892, 505743, 491040, 479883, 470476, 461835]
55771D61835m151L194Q191J0913J5766K1301K0419J1379K04q565j5505k0337k0644
55758D84000j7648j5929j6170j4835j1464r480r447q414o324o315q209q416o642
55745C44707o218p468p264n406m921n762m701j821o54j474r10J301J624o22k134
55730B98277j840k267m011m747m290m940o350n758l664l457n046m850k536j690
55716B42831l114l439j404K86M68J377L822N662O204P146Q293P205L924J359L46
55701B80966j089l257m444n052p179r844r823p411o158o620n781l143j771k528
55687B06866k699j360q16j639j288J047K967L387M049N521O132N690N874O334
55673B40065M773J480p06j268k331l909l761k169j868k798k097J68O96r07j149
$$ y = [461835, 457684, 460878, 469069, 479982, 495748, 517049, 537468, 548847, 549051, 540486, 524981, 504644, 484000, 466352, 450423, 434253, 419418, 407954, 398474, 389027, 380613, 374289, 367974, 359765, 351349, 344707, 338489, 331021, 323757, 318351, 313430, 307668, 302967, 301146, 300492, 299018, 298108, 299409, 301033, 300411, 298277, 296437, 294170, 290159, 285412, 281122, 276182, 269832, 264074, 260410, 256953, 251907, 247057, 244521, 242831, 239717, 236278, 234874, 235160, 235628, 237005, 240827, 246489, 252693, 259839, 268132, 275337, 279261, 280620, 280966, 279877, 276620, 272176, 267124, 259945, 250101, 240278, 232867, 226709, 220089, 214308, 211165, 209394, 206866, 204167, 202807, 201991, 200352, 199064, 200111, 203078, 206465, 210514, 216035, 222167, 227857, 233731, 240065, 244838, 246318, 245612, 244344, 242013, 238104, 234343, 232174, 230306, 227508, 225411, 225579, 226275, 225368, 224219]
55658B24219J122K875K548K274L087L073J924K234M500N602M096K422K105J292
55644B63373j088l137l781m502n648n284l384k921n013p044p258p100p450o781
55630A92982m797l746m268l987j991o72j358k133j795j916l142l439k052j265
55616A56421k253l024k384k141l283l814k543j395j778k185j504j187k013k221
55602A24696r03O4l81m91P06J314K41n32L41R67k25j568j272m35n51q43m48m44
55584A20236j377j522J02J603J323N06P68J365J108O02O06M52j94k35O45J093
55568A27081P79J226K644K914J264p6L53R42L35j13P48J490Q18p4q0l28j622k457
55550A35844j739r64j447j962j220k28q2J25J106J593Q63M31J223J639N89k17
$$ y = [224219, 225341, 228216, 230764, 233038, 236125, 239198, 241122, 243356, 247856, 253458, 257554, 259976, 262081, 263373, 262285, 259148, 255367, 250865, 245217, 239933, 236549, 233628, 228615, 221571, 214313, 207213, 199763, 192982, 188185, 184439, 180171, 176184, 174193, 173521, 172163, 170030, 168235, 166319, 163177, 159738, 157686, 156421, 154168, 151144, 148760, 146619, 143336, 139522, 136979, 135584, 133806, 131621, 130117, 128930, 126917, 124696, 123793, 123857, 123476, 122985, 123691, 125005, 125246, 124714, 125055, 126022, 125797, 124229, 122957, 122522, 121971, 121128, 120680, 120236, 118859, 117337, 117439, 119042, 120365, 120871, 121639, 123004, 124112, 124714, 125320, 125772, 125578, 125343, 125988, 127081, 127860, 129086, 131730, 134644, 135908, 135832, 136185, 137127, 137462, 137349, 138097, 139587, 140405, 140331, 140251, 139923, 138301, 135844, 134105, 133141, 131694, 129732, 128512, 128284, 128202, 128327, 129433, 131026, 131889, 132320, 133543, 135182, 135771, 135554]
55534A35554O65J695J103j0J36R20R14M40K53l03j657k491k047j807k831l608
55518A26926k719j399j250j528r78l15o01j102r73j132k282l086k407j370j170
55503A04614r13J96Q11j61j322j244j025j888k462j082J216K576L330M458M975
55488A12079L650J692R47Q94N4j070j106m94m73o26N2R21Q73M96P62Q85j89j497
55470A17850j605j184j592k250j812p93n45p36k79K92j74j077j019k98j61m29
55454A04188j04M73K50m43n17j09j19m66n75o68r76o71O68J705J219J21k14k73
55436A03489j047j736j033L79Q84N50N53Q91P76M77P20R57K38r47j437j246j014
55419A01454n76L28J010J110J694L276M214L020R52J21K92j08j022j186o46m65
$$ y = [135554, 136219, 137914, 139017, 139007, 139143, 140063, 140977, 141417, 141670, 141367, 139710, 137219, 135172, 133365, 130534, 126926, 124207, 122808, 121558, 120030, 119052, 118737, 118136, 117034, 116061, 114929, 112647, 109561, 107154, 105784, 104614, 103701, 103897, 104708, 104547, 103225, 101981, 100956, 99068, 96606, 95524, 96740, 99316, 102646, 107104, 112079, 115729, 117421, 118368, 119262, 119316, 118246, 117140, 116646, 116173, 115547, 115599, 116520, 117393, 117889, 118651, 119536, 119347, 117850, 116245, 115061, 113469, 111219, 109407, 108614, 108069, 107333, 107054, 107346, 107172, 106095, 105076, 104778, 104617, 104188, 104084, 104557, 104807, 104364, 103847, 103738, 103619, 103153, 102578, 101910, 100934, 100263, 100931, 102636, 103855, 103976, 103762, 103489, 102442, 100706, 99673, 100052, 100936, 101486, 102039, 102930, 103706, 104183, 104903, 105860, 106098, 105151, 103714, 102468, 101454, 100878, 101206, 102216, 103326, 105020, 108296, 112510, 115530, 116482, 116603, 116895, 116787, 115765, 114579, 113933, 113468]
55403A13468o61o06p17j680k716k697k147k147k177j177J31K41n46p41j13M92
55387I6207J055J980K510J691K67m44p69j681k511j953o55l42q34m39J018J870
55371I6970J321K77m16q02r07o68n84r26q27M07J769J958J426J329J340N17n51
55354A01633n97O5K73K97J115K090J715K74n33k74P8K56P27R29j33j750k088r22
55336A03155K56O83Q51P65j43j363j577p13M8L00O64J146J024L48j23l73r06j291
55318A02751o53O24J266R79M28k38j139j473m05J234J903J570J224Q52j59j156
55302A07608r42mJ32n31o70j05J21p1K78J096J252O21J75Q3l21q25o06m6k69r52
55282A06024p18M38J185J184J233J242L46r79j259n55l97j061j279p84p41j269
$$ y = [113468, 112807, 112201, 111484, 109804, 107088, 104391, 102244, 100097, 97920, 96743, 96874, 97115, 96569, 95828, 95715, 96207, 97262, 99242, 101752, 103443, 103710, 103266, 102497, 100816, 98305, 96352, 95697, 95355, 94521, 94082, 95100, 96970, 98291, 98568, 98152, 97350, 96443, 95775, 95191, 94265, 93438, 93845, 95614, 97572, 98998, 100327, 101667, 102184, 101633, 101036, 101101, 101374, 101671, 102786, 104876, 106591, 106865, 106332, 106058, 106136, 106392, 107119, 108048, 107915, 106165, 104077, 103155, 103411, 104094, 104945, 105710, 105567, 104204, 102627, 101914, 101962, 102262, 102926, 104072, 105096, 105444, 105321, 104948, 104042, 102751, 102098, 102722, 103988, 104967, 105395, 105157, 104018, 102545, 102140, 103374, 105277, 106847, 108071, 108923, 108764, 107608, 106666, 106662, 106794, 106263, 105593, 105488, 105609, 105538, 105816, 106912, 108164, 108785, 108960, 109043, 108722, 107897, 107291, 107245, 106976, 106024, 105306, 105744, 106929, 108113, 109346, 110588, 110934, 109955, 108696, 108141, 107744, 106683, 105404, 104620, 103879, 102610]
55266A02610j005L29J223Q63J97o3m18r54q26o8J07m65m19O97J433Q51M8K40R23
55247A05303R86L61l11o05k39P23J359O97o69j164m59K33K20j1k49q81j533j217
55229A02544j44L59N4N7O16O37j43m92R7M70n8n32j49M09L81J82L26M55K17m7
55209A05239j19k55l11J64O65J46j042j230L5J234J173M52ok36m16k71M9r0n10
55190A04671k98M06L87m83q50j55N20N21O15J107R58j74q73j68Q61R64O63R64
55172A09636J496J291M13l91q19q37l56J93m8r70j284l70Q29J322J270J016L45
55155A12736n48p11M0N58J35m31l72j63k78j31P23J468J201K09p84j587k007j587
55137A08471o26k26n05j65J283K315J626K06j84N06J015P56J40m32p45n37J3K06
$$ y = [102610, 101605, 101934, 103157, 104020, 104217, 104154, 103736, 102782, 101956, 101888, 101995, 101530, 101111, 101808, 103241, 104092, 104140, 104380, 105303, 106289, 106650, 106339, 105734, 105495, 106218, 107577, 108274, 107605, 106441, 105982, 106215, 106435, 106424, 106175, 105294, 103761, 102544, 102400, 102759, 102813, 102870, 103486, 104123, 103980, 103488, 103585, 104055, 103997, 103465, 103316, 103725, 104106, 104288, 104614, 105069, 105286, 105239, 105120, 104865, 104554, 104718, 105383, 105529, 104487, 103257, 103292, 104526, 105699, 106151, 106145, 105909, 105493, 105222, 105271, 105181, 104671, 104373, 104779, 105166, 104683, 103833, 103678, 104198, 104719, 105334, 106441, 107399, 107225, 106352, 106184, 107045, 108009, 108672, 109636, 111132, 112423, 112836, 112445, 111626, 110789, 110433, 110626, 110578, 109608, 108324, 107954, 108783, 110105, 111375, 112391, 112736, 112188, 111477, 111517, 112075, 112210, 111779, 111407, 111244, 110966, 110835, 111558, 113026, 114227, 114436, 113652, 112065, 110058, 108471, 107845, 107619, 107114, 106949, 108232, 110547, 112173, 112379, 112195, 112701, 113716, 114472, 114612, 114180, 113435, 112898, 112911, 113117]
55119A13117j06j23N42J056P04ll32n12r86j374j082k71N55J216J575J368P97
55102A16141M28J56o38j611j510k22P58O23M51J194K044J911J139M87k48j310
55086A19793j863j170P2Q62J357K010K303J722J022J070J306P30k71n69j84r3
55070A28097n73j017j140j177j082n74J57N88N89M15K50K02L12K43m53j448j780
55053A21609j203m95p2N51J414J549N37n37o43k41k29m86m45k30k34l70n83j176
55035A18716j930j876p08N52J094J301J451Q90m73j247n23N92P61M57O89Q82p7
55018A20551j600k070j262m04j62j26j3Mm0m2l14r21j033N3J652K558K520J974
55000A21325J021j37n19M68J789K003J282Q68J062J099O40N0n56j269j656j221
$$ y = [113117, 113011, 112888, 113430, 114486, 115190, 115187, 114855, 114343, 113357, 111983, 110901, 110630, 111185, 112401, 113976, 115344, 116141, 116569, 116725, 116087, 114476, 112966, 112744, 113502, 114125, 114576, 115770, 117814, 119725, 120864, 121351, 121103, 119793, 117930, 116760, 116832, 117694, 119051, 121061, 123364, 125086, 126108, 127178, 128484, 129214, 128943, 128374, 128190, 128097, 127524, 126507, 125367, 124190, 123108, 122534, 122691, 123279, 123868, 124283, 124533, 124735, 125047, 125290, 124837, 123389, 121609, 120406, 119911, 119839, 120390, 121804, 123353, 123890, 123353, 122710, 122469, 122240, 121754, 121309, 121079, 120845, 120475, 119892, 118716, 116786, 114910, 114202, 114754, 115848, 117149, 118600, 119490, 119017, 117770, 117247, 117839, 118600, 119057, 119746, 120628, 120551, 118951, 116881, 115619, 115215, 115053, 114927, 114914, 114918, 114878, 114836, 114522, 113601, 112568, 112621, 114273, 116831, 119351, 121325, 122346, 122209, 121690, 122158, 123947, 125950, 127232, 128100, 129162, 130261, 130901, 130951, 130395, 129126, 127470, 126249]
54984A26249l68J68M31Q80J268J032L97P7J45K18L34O56Q45O43N67R33R30j23
54966A35282j247j041J45P38L22o4J68N10O46R82J614J956J629R09J39n18p95
54949A41375n55k27l44q28j285j638j850j522n21M57P79P24P49N50j71q09o99
54932A34185k84k93m43p7O03J069J576K468L132L002K911L922N430O079N992O412
54916A75684P445Q013P741P184O212M093J173j273k999m961p218q461q093p146
54902A77394o530n830m561l350k947l081l006k495j728q14J9L96K38j06l63m17
54886A42819k2R69K077K606K520K353K325K299K417L065M290N888P727R303R501
54871B00137P806N307L461K192L96k086m272n610o432o892o809o535o665o885
$$ y = [126249, 125881, 126049, 126480, 127360, 128628, 129660, 130057, 130134, 130279, 130497, 130831, 131487, 132332, 132975, 133542, 134475, 135405, 135282, 134035, 132994, 133139, 133877, 134199, 134135, 134303, 134813, 135459, 136441, 138055, 140011, 141640, 142549, 142688, 142170, 141375, 140820, 140593, 140249, 139421, 138136, 136498, 134648, 133126, 132605, 133062, 133841, 134565, 135314, 135864, 135693, 134884, 134185, 133901, 133608, 133165, 133088, 133691, 134760, 136336, 138804, 141936, 144938, 147849, 151771, 157201, 163280, 169272, 175684, 183129, 191142, 198883, 206067, 212279, 216372, 217545, 216272, 213273, 208312, 201094, 192633, 184540, 177394, 170864, 165034, 160473, 157123, 154176, 151095, 148089, 145594, 143866, 143052, 143071, 143467, 143705, 143599, 143236, 142819, 142797, 143766, 145843, 148449, 150969, 153322, 155647, 157946, 160363, 163428, 167718, 173606, 181333, 190636, 200137, 207943, 213250, 216711, 218903, 219299, 217213, 212941, 207331, 200899, 194007, 187198, 180663, 173998, 167113]
54857A67113o300m960l803l077k171j125q31j458j974j741j364j516j946k106
54843A32741j851j183j98M52P0q99j186m63K93M28M01N45K93o55j400r58L41J307
54825A28078J257M46m63r26q15m90l54l40k20j39k88l28J43O95N81j2j62L53Q94
54806A27910J145J432J712J398M50l38m85l55k82m0N08J037J341J562J612J125
54790A39732J55p66j425j967k109j269K95J460J689J659K069K584K444J550N17
54775A46618M6L77J065J305R15P93J796L528M929N712O369P059P572Q106Q937
54760B05127R433Q545O325L864J785j45k063l866n872q273j0010r680p622n701
54746A81847m859m452m042m086m410l810k017m75k86p09o06j23Q0J09L70P09Q87
$$ y = [167113, 160813, 155853, 152050, 148973, 146802, 145677, 144846, 143388, 141414, 139673, 138309, 136793, 134847, 132741, 130890, 129707, 129509, 129961, 130031, 129132, 127946, 127483, 127776, 128204, 128605, 129150, 129443, 128788, 127388, 126430, 126771, 128078, 129335, 129781, 129318, 128392, 127577, 127087, 126733, 126393, 126173, 126034, 125746, 125418, 125561, 126256, 126837, 126825, 126663, 127016, 127910, 129055, 130487, 132199, 133597, 134047, 133709, 133224, 132869, 132587, 132547, 133055, 134092, 135433, 136995, 138607, 139732, 139887, 139121, 137696, 135729, 133620, 132351, 132646, 134106, 135795, 137454, 139523, 142107, 144551, 146101, 146618, 146664, 147041, 148106, 149411, 150326, 151119, 152915, 156443, 161372, 167084, 173453, 180512, 188084, 196190, 205127, 214560, 223105, 229430, 233294, 235079, 234934, 232871, 229005, 223133, 214860, 204850, 195170, 187548, 181847, 176988, 172536, 168494, 164408, 159998, 156188, 154171, 153696, 153410, 152701, 152095, 151972, 152052, 152161, 152531, 153240, 154127]
54729A54127J101J327J101N55O32J602K485K798L564N562P700Q448Q047P805P765
54714B14619O578L616q9l118n119o620p998q857q462o743m732l582l323l127k675
54699A60368k344k134j527n73l9j44k48j68o09j725k462k128j472j410j625j400
54683A40360r28p78p60l85J25K09n3j51L5K88N04N74K26m43q74q78r66j307j231
54664A33567l60N41O22J80j5P9O6L1K58M94L26n8k43k39j72J53O75O81j75j016
54644A35395p77L25J202J389J185O97j50q88p95J8O23N35K39L02N60M74n8n04
54626A39772l28L33P18L59k34k76J27J57l25m76J83R49R92M97J59J51J54l3m27
54607A42452j007j470j318n64J09K66K28L67N19N30O89J130J320P71k63j161j601
$$ y = [154127, 155228, 156555, 157656, 158211, 158843, 160445, 162930, 165728, 169292, 174854, 182554, 191002, 199049, 206854, 214619, 221197, 224813, 224724, 221606, 216487, 209867, 201869, 193012, 184550, 177807, 173075, 169493, 166170, 163043, 160368, 158024, 155890, 154363, 153790, 153751, 153607, 153359, 153191, 152582, 150857, 148395, 146267, 144795, 143385, 141760, 140360, 139432, 138654, 137894, 137509, 137634, 137843, 137790, 137639, 137674, 137962, 138466, 139040, 139266, 138823, 137949, 137071, 136105, 134798, 133567, 133207, 133748, 134370, 134550, 134535, 134614, 134680, 134711, 134969, 135463, 135789, 135731, 135488, 135249, 135077, 135230, 135905, 136586, 136411, 135395, 134618, 134943, 136145, 137534, 138719, 139416, 139266, 138378, 137583, 137601, 138224, 138759, 138998, 139300, 139860, 140334, 140276, 139772, 139444, 139777, 140495, 140854, 140620, 140344, 140471, 140628, 140303, 139827, 140010, 140959, 141951, 142448, 142607, 142758, 142912, 142879, 142452, 141445, 139975, 138657, 138093, 138202, 138468, 138696, 139063, 139582, 140112, 140801, 141931, 143251, 144022, 143759, 142598, 140997]
54590A40997j445o76K10M11j12m33LN93N77P1m15p41q37m26K92M78j82q61q40
54571A36664n33n31m49K97J212J280L89o13r56m17P37J686J538N21qO28J443J325
54553A44213O29K69J17m18r64p54j51k08r19j144k94J029J994K328K095J572J312
54536A50706J658K206K327J994J613J349J106Q32L18p71k177k949k656j965j431
54521A52160o29O19J250M42p88r48k99k42r58j366j119q96q06j48R83J399O18
54504A49272l47m64Q9O27R22J003Q00M42K66K93J99q2l01m20n78n47j9O64Q15
54485A52634L86r7m58r50j403j273o12j06m2N0N71J360K042K279J728N70j81L25
54467A56823J471J877J262O16N00L64k39q65j056j070j253j428j353j095o59J22
$$ y = [140997, 139552, 138876, 139086, 139497, 139385, 138952, 138955, 139548, 140125, 140196, 139781, 139040, 138203, 137777, 138069, 138547, 138365, 137504, 136664, 136131, 135600, 135151, 135448, 136660, 137940, 138329, 137716, 136760, 136343, 137080, 138766, 140304, 140825, 140817, 141445, 142888, 144213, 144842, 145111, 145228, 144810, 143846, 143092, 142941, 142733, 141814, 140670, 140376, 141405, 143399, 145727, 147822, 149394, 150706, 152364, 154570, 156897, 158891, 160504, 161853, 162959, 163791, 164109, 163338, 161161, 158212, 155556, 153591, 152160, 151531, 152150, 153400, 153842, 153054, 152106, 151807, 151565, 150607, 149241, 148122, 147226, 146420, 146272, 147255, 148654, 149272, 148925, 148461, 148550, 149177, 150099, 151102, 151902, 152344, 152610, 152903, 153102, 153020, 152719, 152299, 151721, 151174, 151155, 151819, 152634, 153020, 152923, 152465, 151515, 150112, 148839, 148227, 148121, 148079, 148129, 148700, 150060, 152102, 154381, 156109, 156679, 156498, 156823, 158294, 160171, 161433, 162049, 162549, 162913, 162674, 161809, 160753, 159683, 158430, 157002, 155649, 154554, 153895, 154017]
54451A54017R64J143M90k20k83J09L36J88j22l44l02pJ87o2m81m07K63Q47P63
54432A57079J49n13q95q09j74O79J076O39l25j097j090k12J006J821K030K093
54416A61457K255K053J119Kn13m98m99n09j95J68Km95n95k86k69o69q01l34K31
54397A61624N25Q23J396K022K384K326J728P45Q0K15N57K27m18k59O53R95K58
54380A75881m41j77L84K05n79j159j318j309j067m30K86N96M97L48L34M28N90
54363A73069P18O84N85N79M95J07k10J65J023J429J099P67Q77R00M50J51O03J295
54345A84786J394J052J059J621K280K853L585M443M863M321K824Q49r63k138k628
54330B10201k761k854l066l496m047m263l753k821k170j901j474p87n16j041j674
$$ y = [154017, 154981, 156124, 156614, 156394, 156111, 156220, 156556, 156744, 156622, 156278, 155976, 155969, 156156, 156094, 155613, 155206, 155469, 156316, 157079, 157228, 156715, 155820, 155011, 154837, 155516, 156592, 157231, 156906, 155809, 154719, 154507, 155513, 157334, 159364, 161457, 163712, 165765, 166884, 166886, 166373, 165875, 165376, 164867, 164672, 164840, 164842, 164347, 163752, 163466, 163197, 162528, 161727, 161393, 161624, 162149, 162972, 164368, 166390, 168774, 171100, 172828, 173573, 173653, 173868, 174425, 174652, 174234, 173975, 174628, 175623, 175881, 175440, 175263, 175647, 175852, 175273, 174114, 172796, 171487, 170420, 169990, 170276, 170872, 171369, 171717, 172051, 172479, 173069, 173787, 174471, 175056, 175635, 176130, 176237, 176027, 176192, 177215, 178644, 179743, 180510, 181387, 182287, 182737, 182888, 183491, 184786, 186180, 187232, 188291, 189912, 192192, 195045, 198630, 203073, 207936, 212257, 215081, 215930, 214967, 212829, 210201, 207440, 204586, 201520, 198024, 193977, 189714, 185961, 183140, 180970, 179069, 177595, 176808, 176292, 175251, 173577]
54315A73577j556p97k29k67n81o26k16K91K38o80j862k228j437k65L54K94qk37
54297A63765l70m22l68j82J69O21R18R17Q59R40Q50K51l99l14M17Q72O99N33P99
54278A70555J009P20L23L04L57k3n78o12L9Q92J398J256M70m84q48l60L68N79
54260A75365K15j99k59M1M45O28M92L72O34J072J100N93L0k38k94j63K56O58N04
54241A81252p8l52k22m97j461k088j485k65L06lm33n23m46l36j00J13k5m15n90
54222A72352l42M8K17N4l30o42n55j19J84l4n54q79q52p71r14j177j119l87P76
54203A64956J573J470Q87O15P83Q90P70P64R33Q64M25m2m35r74j441j251n83m15
54185A69789r79j233n28K35k6q45r39l4J053J717J899J438J93j194j598o35Q90
$$ y = [173577, 172021, 171224, 170995, 170728, 170147, 169521, 169305, 169596, 169834, 169154, 167292, 165064, 163627, 163362, 163716, 164010, 164002, 163765, 163395, 162973, 162605, 162423, 162592, 163213, 164131, 165048, 165907, 166847, 167697, 167948, 167549, 167235, 167652, 168524, 169223, 169756, 170555, 171564, 172284, 172607, 172911, 173268, 173245, 172667, 172055, 172094, 172986, 174384, 175640, 176110, 175626, 174778, 174418, 174786, 175365, 175580, 175381, 175122, 175163, 175608, 176236, 176728, 177100, 177734, 178806, 179906, 180499, 180529, 180291, 179997, 179834, 180090, 180748, 181252, 181174, 180822, 180600, 180103, 178642, 176554, 175069, 174804, 175110, 175107, 174674, 174151, 173705, 173369, 173269, 173382, 173357, 172942, 172352, 172010, 172058, 172275, 172329, 171999, 171357, 170802, 170683, 170867, 170833, 170279, 169400, 168548, 167777, 166863, 165686, 164567, 164180, 164956, 166529, 167999, 168886, 169501, 170284, 171174, 171944, 172708, 173641, 174505, 174930, 174888, 174453, 173479, 172038, 170787, 170204, 169789, 168810, 167577, 167049, 167284, 167258, 166413, 165474, 165440, 166493, 168210, 170109, 171547, 171740, 170546, 168948, 168313, 169203]
54168A69203J772J320k46j868k394j723q69n74l48N08J517J614P19j74m20k90
54152A67747j57L3K58J60m48j174j470j163m67K64P61R79R70O74P4m20k29N82
54134A66974J241J305J194J290J240P16K14K68M44O7m67k72M17M49l41p20J12
54117A74131J352J890J887K171K661K420J186n6l83j73n19j613k407k018r33l18
54101A79278m33m98n9L31J00l89l97J51P47J102J294J235O66l38j232j483j035
54084A79040l36L7q1j47N28J795K660K448J631J131J162J216R08M48K79N52R04
54067A94175P46k9o67l16Q14J605J461R60Q39J088J416J860K436K775K785L063
54051B15011M038N155N680N883O702Q581J1178J3858J5789J5888J3479Q966L466
$$ y = [169203, 170975, 172295, 172049, 170181, 167787, 166064, 165195, 164621, 164273, 164781, 166298, 167912, 168631, 168457, 168037, 167747, 167590, 167623, 167881, 168041, 167593, 166419, 164949, 163786, 163319, 163583, 164344, 165323, 166293, 166967, 167041, 166621, 166392, 166974, 168215, 169520, 170714, 172004, 173244, 173960, 174174, 174442, 174886, 174953, 174486, 174214, 174631, 175080, 174739, 174019, 174131, 175483, 177373, 179260, 181431, 184092, 186512, 187698, 187642, 187259, 187086, 186567, 184954, 182547, 180529, 179596, 179278, 178845, 178347, 178288, 178619, 178719, 178330, 177933, 178084, 178831, 179933, 181227, 182462, 183128, 182790, 181558, 180075, 179040, 178704, 178741, 178660, 178513, 179041, 180836, 183496, 185944, 187575, 188706, 189868, 191084, 191992, 192440, 192719, 193271, 194175, 194921, 194892, 194225, 193909, 194723, 196328, 197789, 198749, 199588, 200676, 202092, 203952, 206388, 209163, 211948, 215011, 219049, 224204, 229884, 235767, 242469, 251050, 262228, 276086, 291875, 307763, 321242, 330208, 333674]
54038C33674j981o449q981r142p493n022k397j51J079J328J693L024M518M651
54024C08351L222J577Q67J032J459J762J732J283O72L40M07N48K86p83k636m414
54008C15705m980m327l784m195m783m645m402n015n786n239l604k658l060l573
53994B55654l270k779k765k672j871q90o23j111j821k431k684k164r82n9q1o58
53978B28793j026j073j107j116q69l70K40R05J345J001k10j446j776j176l86J2
53962B21741Po3K15R85J782J895J212M48K03K54J28l1L17J260K299K990L314L463
53944B42419L520L466L367L460M001M936N854O436O885P607Q609R512J0013R959
53930C30044R039P016M315J855J54r70j722j890j324l26P23J759K741L373L479
$$ y = [333674, 331693, 325244, 316263, 307121, 299628, 294606, 292209, 292058, 293137, 294465, 296158, 299182, 303700, 308351, 311573, 313150, 314017, 315049, 316508, 318270, 320002, 321285, 321957, 322297, 322704, 323252, 323538, 322755, 320119, 315705, 310725, 306398, 302614, 298419, 293636, 288991, 284589, 279574, 273788, 268549, 264945, 262287, 259227, 255654, 252384, 249605, 246840, 244168, 242297, 241407, 240784, 239673, 237852, 235421, 232737, 230573, 229591, 229532, 229451, 228793, 227767, 226694, 225587, 224471, 223602, 223232, 223472, 224377, 225722, 226723, 226513, 225067, 223291, 222115, 221729, 221741, 221748, 221685, 221900, 222885, 224667, 226562, 227774, 228222, 228425, 228679, 228807, 228776, 229093, 230353, 232652, 235642, 238956, 242419, 245939, 249405, 252772, 256232, 260233, 265169, 271023, 277459, 284344, 291951, 300560, 310072, 320085, 330044, 339083, 346099, 350414, 352269, 352423, 351453, 349731, 347841, 346517, 346191, 346914, 348673, 351414, 354787, 358266]
53915C58266L472L986N144O430P284P640P883Q296Q626Q312P219N965N216M888
53901D48627M347L314K173J512J690K867M952P523J0206J3203J6957K0952K3056
53888E61379K0505J1965r37j4066k3381k7657k8674k8618k7829k5427k1474j7401
53876C78385j4463j2642j1229r732q065o444n353n087n269n210m799m519m548
53863B81025m461l955l321l007l108l438l692l503k773j968j664j789j770j422
53849B41154j125j154j304j279j015n64j29j12o18j054p95j37R0k95p49r74j096
53832B28844r50j94P68R52K17m26j99N03R80J153J209J052O28K60K21M06O67R89
53814B37080J150Q64M41O21J511K391K790L044L461L749L656L469L446L468L540
$$ y = [358266, 361738, 365724, 370868, 377298, 384582, 392222, 400105, 408401, 417027, 425339, 432558, 438523, 443739, 448627, 452974, 456288, 458461, 459973, 461663, 464530, 469482, 477005, 487211, 500414, 517371, 538323, 561379, 581884, 593849, 592912, 578846, 555465, 527808, 499134, 470516, 442687, 417260, 395786, 378385, 363922, 351280, 340051, 330319, 322254, 315810, 310457, 305370, 300101, 294891, 290092, 285573, 281025, 276564, 272609, 269288, 266281, 263173, 259735, 256043, 252540, 249767, 247799, 246135, 244346, 242576, 241154, 240029, 238875, 237571, 236292, 235277, 234713, 234584, 234472, 233854, 232800, 232005, 231868, 231958, 231663, 230914, 229940, 228844, 227894, 227700, 228468, 229420, 229637, 229211, 229012, 229515, 230495, 231648, 232857, 233909, 234537, 234797, 235018, 235424, 236091, 237080, 238230, 239094, 239535, 240156, 241667, 244058, 246848, 249892, 253353, 257102, 260758, 264227, 267673, 271141, 274681]
53799B74681L986M675M892M401L954M176M670M745M378L905L449L174L463M191
53785C32740M452L664K375J457R48L20o90k014l505m763n266n163n314o049o560
53770C06632o140n231m625m326l983l781l973m152l826l312l140l088k632j973
53756B52450j668j636j377r92j051j621k153k245j896j241n53k43k63j0O31P87
53740B36919q0j023p90K89P82K28m25l69J66O28P46M46n6m0R56K174K341J365
53722B44257M58M86J058J380J218Q30N81Q06J493K003J777J214J168J659J857
53707B62245J397Q37P09R74J560K558L628M063L800L555L691L703L247K823K894
53692C01684L088K885K548K612K890K662J768P79K55J94K70K03j43p24j287j450
$$ y = [274681, 278667, 283342, 288234, 292635, 296589, 300765, 305435, 310180, 314558, 318463, 321912, 325086, 328549, 332740, 337192, 340856, 343231, 344688, 345636, 345956, 345266, 343252, 339747, 334984, 329718, 324555, 319241, 313192, 306632, 300492, 295261, 290636, 286310, 282327, 278546, 274573, 270421, 266595, 263283, 260143, 257055, 254423, 252450, 250782, 249146, 247769, 246777, 245726, 244105, 241952, 239707, 237811, 236570, 236017, 235774, 235511, 235501, 236132, 236919, 236839, 235816, 235026, 235315, 236097, 236325, 235900, 235531, 235697, 236325, 237071, 237517, 237461, 237421, 238377, 240551, 242892, 244257, 244715, 245201, 246259, 247639, 248857, 249687, 250268, 251074, 252567, 254570, 256347, 257561, 258729, 260388, 262245, 263642, 264479, 265188, 266162, 267722, 270280, 273908, 277971, 281771, 285326, 289017, 292720, 295967, 298790, 301684, 304772, 307657, 310205, 312817, 315707, 318369, 320137, 320916, 321171, 321365, 321635, 321838, 321695, 320971, 319684, 318234]
53676C18234r84r7N59M09l68q96o27n8q0q35j687k127k155j879j382r69q78p17
53658C03463J03J179J179m47k435k989j804k56L44R7L8O54J267J009J29j95N84
53641C01920J538J459M48l46k76K22O21J003J560K045K099J748J325J129J296
53626C17791J699J961J885J803K102K548K651K541K754L187L119K533K400L292
53612C52266M502N117N227N337N246M479L355K749K882L206L444L912M605M782
53598D11109L867K316J141Q36J116J464J539J180M51k39l47K32J018J499J625
53583D28807J647J688J817K277L082L512K696Q60p18j304j610k559l875m633m750
53568D26937m948n451n736n526n094m461l214j470j56J03k13l28j85j70k88j61
$$ y = [318234, 317250, 317153, 317712, 318121, 317753, 316857, 316230, 316172, 316092, 315257, 313570, 311443, 309288, 307409, 306027, 305058, 304180, 303463, 303566, 304745, 305924, 305477, 303042, 300053, 298249, 297993, 298337, 298434, 298472, 299126, 300393, 301402, 301531, 301336, 301920, 303458, 304917, 305365, 305019, 304743, 304965, 305586, 306589, 308149, 310194, 312293, 314041, 315366, 316495, 317791, 319490, 321451, 323336, 325139, 327241, 329789, 332440, 334981, 337735, 340922, 344041, 346574, 348974, 352266, 356768, 361885, 367112, 372449, 377695, 382174, 385529, 388278, 391160, 394366, 397810, 401722, 406327, 411109, 414976, 417292, 418433, 419269, 420385, 421849, 423388, 424568, 425019, 424780, 424433, 424665, 425683, 427182, 428807, 430454, 432142, 433959, 436236, 439318, 442830, 445526, 446386, 445668, 444364, 442754, 440195, 436320, 431687, 426937, 421989, 416538, 410802, 405276, 400182, 395721, 392507, 391037, 390881, 390984, 390771, 390443, 390258, 390088, 389800, 389639]
53552C89639L45R74J392J361R13N69J025K282L372L293K103P85K80Q54K131L459
53536D14777M400N109O002O949P279O832O503P229Q782J0111J0630J0602J0452
53523E15657J0467J1060J2582J4554J5810J5754J5183J5312J6333J7414J8072
53512F78198J8842K0325K2080K3096K3266K3747K5506K7992K9748L0120K9731
53501I52651K9332K8833K7766K6202K4727K3747K3164K2668K2070K1380K0784
53490A223324K0464K0334K0125J9826J9804K0218K0591K0310J9473J8776J8594
53479A441839J8663J8746J9097J9902K0549J9989J7797J4490J0876P420M434K287
53467A616089R41n02l162p183j1509j4988j7335j8829j9537j9284j8232j7076
$$ y = [389639, 389984, 390958, 392350, 393711, 394624, 395193, 396218, 398500, 401872, 405165, 407268, 408053, 408333, 409187, 411318, 414777, 419177, 424286, 430288, 437237, 444516, 451348, 457851, 465080, 473862, 483973, 494603, 505205, 515657, 526124, 537184, 549766, 564320, 580130, 595884, 611067, 626379, 642712, 660126, 678198, 697040, 717365, 739445, 762541, 785807, 809554, 835060, 863052, 892800, 922920, 952651, 981983, 1010816, 1038582, 1064784, 1089511, 1113258, 1136422, 1159090, 1181160, 1202540, 1223324, 1243788, 1264122, 1284247, 1304073, 1323877, 1344095, 1364686, 1384996, 1404469, 1423245, 1441839, 1460502, 1479248, 1498345, 1518247, 1538796, 1558785, 1576582, 1591072, 1601948, 1609368, 1613802, 1616089, 1617030, 1616528, 1613366, 1606183, 1594674, 1579686, 1562351, 1543522, 1523985, 1504701, 1486469, 1469393]
53455A469393j6541j6942j8159j9857k1640k3205k4417k5208k5422k4883k3645
53444A229474k2111k0908k0515k0799k0938k0071j8077j5503j2758r828o912m732
53432A036322l765l569l265k462j280J74J792L301M556N835P340Q674R557J0664
53418A073874J2862J5756J7970J8978J9696K1018K2746K4375K6066K8104L0146
53407A311591L1779L3311L5183L7020L8170L8961M0456M2902M5342M7072M8703
53396A750490N1162N4236N6811N8381N9504O0746O1910O2660O3261O4081O4650
53385B407892O4008O2029N9717N7939N6451N4489N1777M8590M5167M1586L7880
53374B987525L3854K9072K3516J7917J2940Q328L358k155q017j4501k2138l0678
$$ y = [1469393, 1452852, 1435910, 1417751, 1397894, 1376254, 1353049, 1328632, 1303424, 1278002, 1253119, 1229474, 1207363, 1186455, 1165940, 1145141, 1124203, 1104132, 1086055, 1070552, 1057794, 1047966, 1041054, 1036322, 1032557, 1028988, 1025723, 1023261, 1021981, 1022155, 1023947, 1027248, 1031804, 1037639, 1044979, 1053653, 1063210, 1073874, 1086736, 1102492, 1120462, 1139440, 1159136, 1180154, 1202900, 1227275, 1253341, 1281445, 1311591, 1343370, 1376681, 1411864, 1448884, 1487054, 1526015, 1566471, 1609373, 1654715, 1701787, 1750490, 1801652, 1855888, 1912699, 1971080, 2030584, 2091330, 2153240, 2215900, 2279161, 2343242, 2407892, 2471900, 2533929, 2593646, 2651585, 2708036, 2762525, 2814302, 2862892, 2908059, 2949645, 2987525, 3021379, 3050451, 3073967, 3091884, 3104824, 3113152, 3116510, 3114355, 3106338, 3091837, 3069699, 3039021]
53362C039021l9001m6208n2151n6814n9953o1576o2261o2663o3103o3575o3717
53351B407999o2760o0180n6518n2963n0111m7755m5914m5170m5725m6898m7860
53340A846145m8205m7586m5689m2990m0687l9237l7790l5556l3024l0993k9162
53329A415226k6603k3217j9795j7003j5120j4471j5121j6261j6768j6408j5830
53318A218629j5335j4511j3107j1546j0260r141p915o590n257l762j874M33K991
53305A122755N480P456Q644R309J0077J1247J2553J3754J5152J7232J9927K2556
53293A276142K4559K6137K7929L0147L2267L3637L4139L3988L3171L1604K9699
53282A613419K8139K6909K5208K2638J9855J7546J5261J1991P694L350l55l708
$$ y = [3039021, 3000020, 2953812, 2901661, 2844847, 2784894, 2723318, 2661057, 2598394, 2535291, 2471716, 2407999, 2345239, 2285059, 2228541, 2175578, 2125467, 2077712, 2031798, 1986628, 1940903, 1894005, 1846145, 1797940, 1750354, 1704665, 1661675, 1620988, 1581751, 1543961, 1508405, 1475381, 1444388, 1415226, 1388623, 1365406, 1345611, 1328608, 1313488, 1299017, 1283896, 1267635, 1250867, 1234459, 1218629, 1203294, 1188783, 1175676, 1164130, 1153870, 1144729, 1136814, 1130224, 1124967, 1121205, 1119331, 1119764, 1122755, 1128235, 1135691, 1144335, 1153644, 1163721, 1174968, 1187521, 1201275, 1216427, 1233659, 1253586, 1276142, 1300701, 1326838, 1354767, 1384914, 1417181, 1450818, 1484957, 1518945, 1552116, 1583720, 1613419, 1641558, 1668467, 1693675, 1716313, 1736168, 1753714, 1768975, 1780966, 1788660, 1792010, 1791655, 1787947]
53270A787947p035r942j1934j3394j5249j7775k0325k2375k4294k6651k9060l0354
53258A559559l0105k9364k9494l0644l1859l2450l2654l2921l3198l3067l2208
53247A211595l0610k8658k7173k6863k7567k8345k8475k8030k7409k6764k6118
53236I05583k5521k4833k3710k2154k0689j9699j8852j7559j5729j3753j1959
53225F91125j0389r049q177q198r347j1175j2629j3020j2814j2908j3322j3331
53213E56766j2800j2472j2706j2866j2423j1746j1283j0665r410p795o426n470
53201D30704m957n251o347p326p393p037p221p776p658o608n545n202n268n061
53187C42054m458l921m008m792n469m814k566q4R86N08l38p00p33p79q76j098
$$ y = [1787947, 1780912, 1770970, 1759036, 1745642, 1730393, 1712618, 1692293, 1669918, 1645624, 1618973, 1589913, 1559559, 1529454, 1500090, 1470596, 1439952, 1408093, 1375643, 1342989, 1310068, 1276870, 1243803, 1211595, 1180985, 1152327, 1125154, 1098291, 1070724, 1042379, 1013904, 985874, 958465, 931701, 905583, 880062, 855229, 831519, 809365, 788676, 768977, 750125, 732566, 716837, 703084, 691125, 680736, 671687, 663510, 655312, 645965, 634790, 622161, 609141, 596327, 583419, 570097, 556766, 543966, 531494, 518788, 505922, 493499, 481753, 470470, 459805, 450395, 442600, 436174, 430704, 425747, 420496, 414149, 406823, 399430, 392393, 385172, 377396, 369738, 363130, 357585, 352383, 347115, 342054, 337596, 333675, 329667, 324875, 319406, 314592, 312026, 311942, 312928, 313436, 313098, 312398, 311665, 310886, 310010, 308912]
53171C08912j617k213k416k240k142k194j909j059o5N76P01K81o41j640k119k017
53155B88198j809j667j188j69Q06R28N8j121j759j620j263j313j528j066J00P69
53139B76356J32q85q67M5N46K97K25O81P86O0o23m35R0Oo10j010r90r04q69o25
53119B71406qR58K123K976K807J577K76j23K80P03P71O40L95r6p70j322j578j633
53101B79382j648j698j701j465r79o42q08j075o96K40O51p6j174j537j104o10
53085B65060m16l71m81r49j613j948j646p70M86J729K293J839R70O62J069J393
53069B67307R87J22m71l76L10J139J524J091M2r44j285r45l53j16o11j588k237
53052B63596j962j065l41m6L02J008J582J337L03q33j508j669j483j040m31J62
$$ y = [308912, 307295, 305082, 302666, 300426, 298284, 296090, 294181, 293122, 293057, 293633, 294334, 294615, 293974, 292334, 290215, 288198, 286389, 284722, 283534, 283365, 284171, 285099, 285157, 284036, 282277, 280657, 279394, 278081, 276553, 275487, 275587, 276356, 276488, 275603, 274736, 274781, 275327, 275624, 275849, 276530, 277316, 277376, 276753, 276318, 276408, 276414, 275804, 274794, 273804, 272900, 272031, 271406, 271398, 272356, 274479, 277455, 280262, 281839, 282115, 281992, 282272, 282975, 283746, 284386, 284781, 284685, 283915, 282593, 281015, 279382, 277734, 276036, 274335, 272870, 271891, 271249, 270441, 269366, 268670, 268910, 269561, 269485, 268311, 266774, 265670, 265060, 264644, 264273, 263792, 262843, 261230, 259282, 257636, 256866, 257352, 259081, 261374, 263213, 264183, 264845, 265914, 267307, 268294, 268416, 267945, 267569, 267879, 269018, 270542, 271633, 271675, 270731, 269446, 268501, 268148, 268032, 267421, 265833, 263596, 261634, 260569, 260228, 260182, 260484, 261492, 263074, 264411, 264714, 263881, 262373, 260704, 259221, 258181, 257750, 257912]
53036B57912N95P72N38j64r33j077m73M4l28j191j351m48N74Q41O48P10R29P43
53018B58341K75K62Q57J346J235Q55O96P07N97L77K17P2k49q50j595k064j712
53001B59367m81P77J030K85l94l20Q8J50p8j60p0q2j63j8L74O77O53M48M62R65
52981B63510J771K262K003J292P55N02K27RK88Q94R65K67k29L60J577K326K232
52964B81011J630P59j80o07j56N21M55k13l95L31J106J007J30q14j384j492j155
52947B80554n72j66j98m39m38n8L58K99m46j459j973j655j003p36j002j430j734
52930B67902j868j750j382j175j555k208k280j532p63p41j151j063j57R58J534
52915B52769J490J310J412J720J808J389O01k02q05j219j504j655j634j397r35
$$ y = [257912, 258507, 259279, 259817, 259653, 258720, 257643, 257170, 257214, 256886, 255695, 254344, 253896, 254470, 255311, 255959, 256669, 257598, 258341, 258616, 258878, 259735, 261081, 262316, 263171, 263867, 264574, 265171, 265548, 265765, 265837, 265588, 264738, 263143, 261079, 259367, 258886, 259663, 260693, 260978, 260584, 260264, 260352, 260502, 260424, 260264, 260194, 260112, 259949, 259931, 260305, 260982, 261635, 262083, 262545, 263510, 265281, 267543, 269546, 270838, 271593, 272095, 272322, 272331, 272619, 273513, 274478, 274745, 274516, 274876, 276453, 278779, 281011, 282641, 283400, 283220, 282613, 282457, 282978, 283433, 283220, 282825, 283156, 284262, 285269, 285399, 284585, 283201, 281709, 280554, 279982, 279816, 279618, 279179, 278741, 278683, 279041, 279340, 278894, 277435, 275462, 273807, 272804, 272068, 271066, 269636, 267902, 266034, 264284, 262902, 261727, 260172, 257964, 255684, 254152, 253389, 252648, 251497, 250434, 250277, 251235, 252769, 254259, 255569, 256981, 258701, 260509, 261898, 262499, 262297, 261492, 260273, 258769, 257114, 255480, 254083, 253148]
52900B53148l87k0L4l4M3K41L07J28j27j68K45J189K397L234L165K318J381Q70
52882B67964O38J79o80j505j685j124m62m56j115j665j463o82P4O33J334K329
52866B62314L133L085K111R70N94J146J812J678P61j28m89o11q48r94p97o85j373
52849B71679k894m451n130m580l169j799j304j657j995j783j508j801k251j961
52835B35396j008l55l08p4Q34J686J652J152J211J906K275J727P85K27N8k37p66
52818B46161j025p06k26j81m66m13J42N20K02k28K99J994M022N487N939N042K609
52801B69172o46l068l513k574j852k085k591k465j801j423j764k417k694k366
52787B37913j716j092n85j39K37M40M36L60M25O39P03L81LK90J362K294K126J087
$$ y = [253148, 252761, 252741, 252775, 252741, 252784, 253025, 253332, 253460, 253333, 253165, 253410, 254599, 256996, 260230, 263395, 265713, 267094, 267964, 268602, 268781, 268101, 266596, 264911, 263787, 263325, 262869, 261754, 260089, 258626, 257944, 258018, 258651, 259985, 262314, 265447, 268532, 270643, 271613, 272207, 273353, 275165, 276843, 277604, 277476, 276987, 276376, 275528, 274534, 273737, 273052, 271679, 268785, 264334, 259204, 254624, 251455, 249656, 248352, 246695, 244700, 242917, 241409, 239608, 237357, 235396, 234388, 234033, 233725, 233651, 234485, 236171, 237823, 238975, 240186, 242092, 244367, 246094, 246879, 247106, 247164, 246927, 246161, 245136, 244430, 244204, 244023, 243557, 243144, 243286, 243806, 244008, 243780, 244079, 246073, 250095, 255582, 261521, 266563, 269172, 268526, 265458, 261945, 259371, 257519, 255434, 252843, 250378, 248577, 247154, 245390, 242973, 240279, 237913, 236197, 235105, 234520, 234381, 234618, 235058, 235494, 235854, 236279, 236918, 237621, 238002, 238005, 238295, 239657, 241951, 244077, 245164]
52769B45164K04r6k09j86N31J825K395J377k78r98o02j90l95q36j059r92m89N18
52751B45684J371J153j9r89j082o90k74K75R42J215J015J100J919K753K652J698
52735B58723O73L2j72J57R21J474J284P16N86J090J774K281K509K210J146k89
52719B75115j227j240p64m84o31r21r92q69r97j632k191j780n57J01o66j878j936
52702B56451p73J51j06r79j508j466j039k31P49J156N03o28j137o82J26O96J083
52685B52366J563K051K241K060J726J427J231J209J331J232M35q72j688j249p0
52670B64993N66J83m65o18m79n65p35m88Q0L67J67q9K1M78J005J249Q89O3l94
52651B66228L10J894L259L786L709L206J890l31k544l615l344k355j255l89j12
$$ y = [245164, 245368, 245272, 245063, 244877, 245408, 247233, 249628, 251005, 250727, 249729, 249127, 248937, 248542, 247706, 246647, 245655, 245166, 245684, 247055, 248208, 248189, 247200, 246118, 245428, 245154, 245429, 246371, 247586, 248601, 249701, 251620, 254373, 257025, 258723, 259396, 259428, 259256, 259413, 260334, 261808, 263092, 263808, 264394, 265484, 267258, 269539, 272048, 274258, 275404, 275115, 273888, 272648, 271884, 271400, 270769, 269848, 268856, 267987, 266990, 265358, 263167, 261387, 260830, 260931, 260265, 258387, 256451, 255678, 255829, 255723, 254744, 253236, 251770, 250731, 250500, 251249, 252405, 252908, 252280, 251143, 250461, 250587, 251283, 252366, 253929, 255980, 258221, 260281, 262007, 263434, 264665, 265874, 267205, 268437, 268872, 268000, 266312, 265063, 264993, 265559, 265742, 265277, 264659, 264180, 263615, 262880, 262392, 262472, 262839, 263006, 262917, 262938, 263416, 264421, 265670, 266559, 266622, 266228, 266538, 268432, 271691, 275477, 279186, 282392, 284282, 283951, 281407, 277792, 274448, 272093, 270838, 270449, 270337]
52636B70337n46j182j294q43l80q7M72J431K148K068J650J792K549K982K313P54
52620B84164q87k036k533k429j927j398j106r34n76jM78O33O17P38J033J187R17
52603B75940L94J95O20J169R84o6j099j260p56m01l99j96N05J233J453J260J033
52586B80609Q40M95L7k65k17J89Q15J401J744J920K127K171J594M27n58p25k99
52569B92305J02K86L83K28m80j549k304k256j534p06m18r31j719j828j016j96
52553B78367k51q60j110r06q65r97n93M88J375J355P45K15JO1L69O23K84n56r96
52534B76749n10K48M55L33O14J206J275N37l02m88j9N88Q70P27M63N05Q66R86
52516B85103M97j20j16M95J050J234J332J537J679J792K250L068L610L369K526
$$ y = [270337, 269791, 268609, 267315, 266472, 266092, 266005, 266477, 267908, 270056, 272124, 273774, 275566, 278115, 281097, 283410, 284164, 283277, 281241, 278708, 276279, 274352, 272954, 271848, 270914, 270338, 270337, 270815, 271448, 272065, 272803, 273836, 275023, 275940, 276334, 276529, 277149, 278318, 279302, 279236, 278137, 276877, 276121, 275720, 275321, 275125, 275630, 276863, 278316, 279576, 280609, 281449, 281944, 281981, 281716, 281499, 281688, 282503, 283904, 285648, 287568, 289695, 291866, 293460, 293887, 293329, 292604, 292305, 292407, 292693, 293076, 293304, 292824, 291275, 288971, 286715, 285181, 284475, 284057, 283126, 281407, 279579, 278563, 278367, 278116, 277256, 276146, 275240, 274375, 273378, 272785, 273273, 274648, 276003, 276748, 276963, 276964, 277025, 277394, 278017, 278301, 277745, 276749, 276239, 276487, 276942, 277275, 277889, 279095, 280370, 280907, 280605, 280117, 280098, 280686, 281556, 282283, 282746, 283251, 284117, 285103, 285600, 285480, 285364, 285859, 286909, 288143, 289475, 291012, 292691, 294483, 296733, 299801, 303411, 306780, 309306]
52501C09306J402j23k134l944m590l945k874k247k175k260k145j688r11l5N91
52486B82228P62N88L44K41L35N78Q42J039J267J701K273K561K212J369N57J62
52470B99059K27O75J421K147K306J706R11O53R42J116R04Q44J415K154K183J398
52454C20061N53R4m68j716l271m161m032l515l231k971k210j130o04j053j834
52439B90512j975j320n40k34l68o26q36q76n56N8M40Q9p57j270r25K7R70J505
52421B83318J561J175N41N5K7K92M06K94M43J213K188K566K184J770K096L260
52405C03389M986P172R735J2175J3856J4610J4509J3118R719M482j185n795q876
52392C91895j0576j0898r934q415p217o393n336l859k466j510p22J59Q29Q62L64
$$ y = [309306, 310708, 310585, 308451, 304507, 299917, 295972, 293098, 290851, 288676, 286416, 284271, 282583, 281672, 281637, 282228, 282990, 283578, 283922, 284163, 284498, 285076, 285918, 286957, 288224, 289925, 292198, 294759, 296971, 298340, 298897, 299059, 299286, 299961, 301382, 303529, 305835, 307541, 308452, 309105, 310047, 311163, 312067, 312911, 314326, 316480, 318663, 320061, 320614, 320708, 320240, 318524, 315253, 311092, 307060, 303545, 300314, 297343, 295133, 294003, 293399, 292346, 290512, 288537, 287217, 286677, 286443, 286075, 285449, 284613, 283737, 283181, 283239, 283679, 283768, 283011, 281741, 280816, 280843, 281813, 283318, 284879, 286054, 286595, 286650, 286677, 286969, 287375, 287669, 288112, 289325, 291513, 294079, 296263, 298033, 300129, 303389, 308375, 315547, 325282, 337457, 351313, 365923, 380432, 393550, 403269, 407751, 406566, 400771, 391895, 381319, 370421, 360487, 352072, 344855, 338462, 333126, 329267, 326801, 325291, 324569, 324728, 325557, 326419, 326783]
52377C26783q2J7P55J879K992L758M063L939L501L090L212L934M481L970K554
52362C68846J276P55N10j29j055j675j708j296o38K5L60L03L13Q25J644K208K288
52345C72852K052J640J116P65R63J692K508L052L361L671M163M865N580N969N951
52330D20200N946O498P669R072J0450J1853J3270J4390J4938J5009J4945J4936
52318E59176J4890J4629J4165J3746J3641J3880J4341J5031J5980J6871J7155
52307G23505J6782J6437J6728J7325J7362J6561J5571J5221J5712J6514J6802
52296I04520J6100J4706J3370J2379J1126Q871N630K088j078l431m689n002n066
52283I69524n374n576n090m121l393l070k720k193j662r18M53K064K901K733K449
$$ y = [326783, 326701, 326718, 327473, 329352, 332344, 336102, 340165, 344104, 347605, 350695, 353907, 357841, 362322, 366292, 368846, 370122, 370877, 371387, 371258, 370203, 368528, 366820, 365524, 364886, 364911, 365271, 365574, 365887, 366712, 368356, 370564, 372852, 374904, 376544, 377660, 378425, 379388, 381080, 383588, 386640, 390001, 393672, 397835, 402700, 408280, 414249, 420200, 426146, 432644, 440313, 449385, 459835, 471688, 484958, 499348, 514286, 529295, 544240, 559176, 574066, 588695, 602860, 616606, 630247, 644127, 658468, 673499, 689479, 706350, 723505, 740287, 756724, 773452, 790777, 808139, 824700, 840271, 855492, 871204, 887718, 904520, 920620, 935326, 948696, 961075, 972201, 981072, 986702, 988790, 987712, 984281, 979592, 974590, 969524, 964150, 958574, 953484, 949363, 945970, 942900, 940180, 937987, 936325, 935407, 935860, 937924, 940825, 943558, 946007]
52268I46007K751L457M471O302Q970J1338J2354J2257J1810J1129J0165R614J0243
52255A060868J1695J2994J3946J5025J6162J6698J6456J5856J4930J3245J0866
52244A218741Q520O551M550K292L02q84j379j585j692j853k293k989l596l956
52230A220729m260m546m565m284m063m024l791l221k892l354m195m346l232j289
52216A168667N61J726K233K496K876L516M450N600O618P119P312P907Q925R173
52202A239179P723N542M580N293O276O480O533P314Q380Q774Q554Q482Q724Q804
52188A340638Q592Q392Q099P127N199K692J19k259m345o153p831r410j0652j1375
52174A328833j1696j1610j0760r126p601p174p693q064p591o507n286m063k778
$$ y = [946007, 948758, 952215, 956686, 962988, 971958, 983296, 995650, 1007907, 1019717, 1030846, 1041011, 1050625, 1060868, 1072563, 1085557, 1099503, 1114528, 1130690, 1147388, 1163844, 1179700, 1194630, 1207875, 1218741, 1227261, 1233812, 1238362, 1240654, 1240956, 1240072, 1238693, 1237108, 1235416, 1233563, 1231270, 1228281, 1224685, 1220729, 1216469, 1211923, 1207358, 1203074, 1199011, 1194987, 1191196, 1187975, 1185083, 1181729, 1177534, 1173188, 1169956, 1168667, 1169228, 1170954, 1173187, 1175683, 1178559, 1182075, 1186525, 1192125, 1198743, 1205862, 1213174, 1221081, 1230006, 1239179, 1246902, 1252444, 1257024, 1262317, 1268593, 1275073, 1281606, 1288920, 1297300, 1306074, 1314628, 1323110, 1331834, 1340638, 1349230, 1357622, 1365721, 1372848, 1378047, 1380739, 1380858, 1378599, 1374254, 1368101, 1360270, 1350860, 1340208, 1328833, 1317137, 1305527, 1294767, 1285641, 1278040, 1270866, 1263173, 1255109, 1247518, 1241011, 1235725, 1231662, 1228884]
52161A228884j308N53K745M568N208M649L545K243N97j173k256k186j434p41l35
52146A243559k9L61R77J831K544K600K032J316M49j182l567n491n883n206m686
52131A229625m565l963k346k11J781L629N640P870J0216J2703J5288J7703J9763
52118A313133K1632K3483K5010K5605K5038K3789K2638K1917K1232J9961J7978
52107A561416J5809J4001J2640J1615J1167J1731J3202J4738J5524J5462J4963
52096A712268J4261J3254J1908J0406Q725O354K731j980o809j0808j3835j6365
52084A730110j8578j9882j9476j7300j4251j1435r323p660o066m591l575l029
52072A594944k415j169P15K803M854O972R104J0774J1600J1837J2070J2458J2635
$$ y = [1228884, 1227576, 1228129, 1230874, 1235442, 1240650, 1245299, 1248844, 1251087, 1251684, 1250511, 1248255, 1246069, 1244635, 1243894, 1243559, 1243530, 1243891, 1244868, 1246699, 1249243, 1251843, 1253875, 1255191, 1255640, 1254458, 1250891, 1245400, 1239517, 1234311, 1229625, 1225060, 1221097, 1218751, 1218540, 1220321, 1223950, 1229590, 1237460, 1247676, 1260379, 1275667, 1293370, 1313133, 1334765, 1358248, 1383258, 1408863, 1433901, 1457690, 1480328, 1502245, 1523477, 1543438, 1561416, 1577225, 1591226, 1603866, 1615481, 1626648, 1638379, 1651581, 1666319, 1681843, 1697305, 1712268, 1726529, 1739783, 1751691, 1762097, 1770822, 1777176, 1779907, 1777927, 1771118, 1760310, 1746475, 1730110, 1711532, 1691650, 1672174, 1654874, 1640623, 1629188, 1619865, 1612205, 1606139, 1601548, 1597973, 1594944, 1592529, 1591360, 1592075, 1594878, 1599732, 1606704, 1615808, 1626582, 1638182, 1650019, 1662089, 1674547, 1687182]
52059A687182J2301J1598J0821J0120R614R472R614R548Q796P477O063M646K761
52046A800013N3l176o361r315j2153j4701j6449j7152j7106j6673j5872j4729
52034A656379j3646j3012j2624j2010j1246j0898j1060j1058j0462r841j0044
52023A530478j1001j1835j2044j1970j2103j2359j2276j1617j0578r613r121r091
52011A396870r014q450p699p552q318r447j0396j1429j3214j5936j9168k2448
51999A253799k5490k7936k9384k9734k9191k7935k6072k3859k1675j9698j8000
51988I74825j6895j6757j7366j7864j7582j6614j5445j4400j3707j3682j4372
51977H00141j5288j5890j6194j6538j6878j6668j5498j3476j1072q709o447l893
$$ y = [1687182, 1699483, 1711081, 1721902, 1732022, 1741636, 1751108, 1760722, 1770270, 1779066, 1786543, 1792606, 1797252, 1800013, 1800066, 1796890, 1790529, 1781214, 1769061, 1754360, 1737911, 1720759, 1703653, 1686980, 1671108, 1656379, 1642733, 1629721, 1617097, 1605087, 1593841, 1582943, 1571883, 1560825, 1550363, 1540522, 1530478, 1519477, 1507642, 1495598, 1483628, 1471525, 1459166, 1446890, 1435273, 1424695, 1415082, 1405961, 1396870, 1387856, 1379406, 1371707, 1364155, 1355837, 1346390, 1335994, 1324565, 1311351, 1295415, 1276247, 1253799, 1228309, 1200373, 1170989, 1141255, 1112064, 1084129, 1058057, 1034198, 1012523, 992825, 974825, 957930, 941173, 923807, 905943, 888361, 871747, 856302, 841902, 828195, 814513, 800141, 784853, 768963, 752769, 736231, 719353, 702685, 687187, 673711, 662639, 653930, 647483, 643590]
51965F43590o50K935N713O912P085P469Q502R533R854R268P639M652M81l910p498
51950G11575r905j1104j0963r583p653n897m343k532k46K416N399Q605J1646J4110
51936F91525J5962J7213J7423J6180J3954J1752R815P366L828l69m475q300j1898
51923G79976j4939j7063j8517j9786k0704k0573j9227j7412j5897j4635j3079
51912E88144j1068r054p464o202m866l243j475L20K332M811P669J0518J3067J5327
51898E98816J7358J9048K0247K0923K1006K0288J8633J6171J2953Q507K103o325
51886G69728j5563k3576k8597k9933k8084k4328k0097j6348j3145r819n677p88
51874E53773L984P774J0532J2745J4399J4550J2234P668K207k804o890j0071j2170
$$ y = [643590, 642940, 645875, 651588, 658500, 665585, 673054, 681556, 691089, 700943, 710211, 717850, 722502, 722983, 719073, 711575, 701670, 690566, 679603, 670020, 662367, 656470, 652127, 649595, 649349, 651765, 657164, 665769, 677415, 691525, 707487, 724700, 742123, 758303, 772257, 784009, 793824, 801190, 805018, 804649, 800174, 791874, 779976, 765037, 747974, 729457, 709671, 688967, 668394, 649167, 631755, 615858, 601223, 588144, 577076, 568022, 560558, 554356, 549490, 546247, 544772, 545092, 547424, 552235, 559904, 570422, 583489, 598816, 616174, 635222, 655469, 676392, 697398, 717686, 736319, 752490, 765443, 773950, 776053, 769728, 754165, 730589, 701992, 672059, 643975, 619647, 599550, 583202, 570057, 560238, 554561, 553773, 557757, 565531, 576063, 588808, 603207, 617757, 629991, 637659, 639866, 637062, 630172, 620101, 607931]
51861F07931j2902j2516j1812j1296j0511q622n584k409j69R89J619K066K197
51848E38981J927J458Q12l63k111l734m503m702n310o652p843p830o564m873l431
51833D85262k314j292k49P74J710K517L206L703L713K871J179q43k629l959m825
51818D88824n091m653l675k400q59Q61K314L176L854M931N993N812L936J420n31
51803E03912j969l589n304o317o351n911n323m286k616p99M88R70P33K8o69r13
51787D62084q54j071j615j706q33L32O43j77j411k334k750k718k302j752j368
51772D42168j073l97R32K679M446O108P690R117J0219J0906J1148J0843R815P957
51758E32558N357K246j145m664q032j0587j1609j1059r839q974q636q194p167
$$ y = [607931, 595029, 582513, 570701, 559405, 548894, 540272, 534688, 532279, 532110, 533099, 534718, 536784, 538981, 540908, 542366, 543178, 542815, 540704, 536970, 532467, 527765, 522455, 515803, 507960, 500130, 493566, 488693, 485262, 482948, 481656, 481407, 482181, 483891, 486408, 489614, 493317, 497030, 499901, 501080, 500237, 497608, 493649, 488824, 483733, 479080, 475405, 473005, 472146, 473007, 475321, 478497, 482351, 487282, 493275, 499087, 503023, 504443, 503912, 501943, 498354, 493050, 486733, 480382, 474471, 469148, 464862, 462246, 461447, 461935, 462905, 463638, 463666, 462997, 462084, 461230, 460159, 458544, 456838, 456005, 456337, 456980, 456803, 455392, 453058, 450308, 447590, 445288, 443536, 442168, 441095, 440698, 441630, 444309, 448755, 454863, 462553, 471670, 481889, 492795, 503943, 514786, 524601, 532558, 537915, 540161, 539016, 534352, 526320, 515733, 504124, 493065, 483226, 474252, 465616, 457422, 450255]
51745D50255n715m252k987j954j100j39J405L693O215Q206R350R995J0748J1919
51731D95639J3147J3438J1792Q161L736R1j992k642k091k82K407M548M401J528
51717E51881k665o166p929q147p349n765l595j462k46m82j961l887n361n850n209
51702D85807l351k17L655O767P516N596K306o55k414k970k621j641j63J875M284
51687E03774N946N329K140j987n157p012q295r122q828p249n077k825m49J814
51673D63002L234L578L434L129K205N37q51q28O33K985O085R746J2772J3614J1857
51658E35132Q238L444k076p217j0366j0919r753p839n169j513K675O746J0626
51645E12009J4108J5808J3881Q041K32o940j2015j4881j5944j5662j4594j3272
$$ y = [450255, 444540, 440288, 437301, 435347, 434247, 434108, 435513, 439206, 445421, 453627, 462977, 472972, 483720, 495639, 508786, 522224, 534016, 542177, 545913, 546004, 544012, 541370, 539279, 538997, 541404, 545952, 550353, 551881, 549216, 543050, 535121, 526974, 519625, 513860, 510265, 508803, 508557, 508075, 506114, 502227, 496866, 491016, 485807, 482456, 482239, 485894, 492661, 500177, 505773, 508079, 507424, 505010, 502040, 499419, 497778, 497615, 499490, 503774, 509720, 515049, 517189, 515202, 510045, 503033, 494738, 485616, 476788, 469539, 464462, 461637, 461188, 463002, 466236, 469814, 473248, 476377, 478582, 479119, 478268, 477440, 478073, 481058, 487143, 496889, 509661, 523275, 535132, 543370, 546814, 544738, 537521, 527155, 516236, 506483, 498644, 493475, 491962, 494637, 501383, 512009, 526117, 541925, 555806, 563847, 564079, 557139, 545124, 530243, 514299, 498637, 484043, 470771]
51633D70771j1814r927p441m713k377p78K26R68J641K217K592K648K285J480L93
51618D48171o83j520k146k776l513m088m069l385k539k142k250k400k246j909
51604D12505j569j013K7J306K126K163J898K174L398N314P424R489J1607J3885
51590D70734J6077J7414J6869J3683Q024J282m436p545q003p131o273n655m488
51577E00552k058J490N384Q981J2233J5312J7925J9222J8775J7601J7717K0223
51565F53357K3983K6535K6390K4208K2032K1778K4492L0242L8147M6641N4251
51554I92056O0201O3953O4269N9358M8410L2818J5476j135j6030k9169m0422m9436
51542A200349n6097o0648o3277o3835o2097n8132n2436m5842l9312l3562k8744
$$ y = [470771, 458957, 449030, 441589, 436876, 434499, 433721, 433947, 434915, 436556, 438773, 441365, 444013, 446298, 447778, 448171, 447488, 445968, 443822, 441046, 437533, 433445, 429376, 425991, 423452, 421310, 419060, 416660, 414414, 412505, 410936, 409923, 409950, 411256, 413382, 415545, 417443, 419617, 423015, 428329, 435753, 445242, 456849, 470734, 486811, 504225, 521094, 534777, 542801, 544083, 539647, 532102, 524099, 516968, 510695, 505040, 500552, 498494, 499984, 505368, 514349, 526582, 541894, 559819, 579041, 597816, 615417, 633134, 653357, 677340, 703875, 730265, 754473, 776505, 798283, 822775, 853017, 891164, 937805, 992056, 1052257, 1116210, 1180479, 1239837, 1288247, 1321065, 1336541, 1335406, 1319376, 1290207, 1249785, 1200349, 1144252, 1083604, 1020327, 956492, 894395, 836263, 783827, 737985, 698673, 665111, 636367]
51531F36367k4533k0614j7006j3890j1348r335p777o567n523m522l655l101k900
51518E05596k951l176l566m029m339m342m101l753l334k859k566k782l490m169
51504D56139m311l965l522l087k422j487n55L08J368K596L397L440L328L833M770
51489D59830N254M886M038L031J787L82q28j692k399k963l292l795n057o632p121
51474D45429o004m551m180m608m588l876l453l921m747n061m505l297k075j684
51460C88879k450l618m110l718l014k214r92N54J720K219K665L556M431M537L989
51445C92434L767M788P153J0181J3012J5423J7857K0280K1253J9010J3667P565
51433E46390L087Q42K89J051K622L444J653l035q867j3662j6399j7215j6506j4482
$$ y = [636367, 611834, 591220, 574214, 560324, 548976, 539641, 531864, 525297, 519774, 515252, 511597, 508496, 505596, 502645, 499469, 495903, 491874, 487535, 483193, 479092, 475339, 472005, 469146, 466580, 463798, 460308, 456139, 451828, 447863, 444341, 441254, 438832, 437345, 436790, 437098, 438466, 441062, 444459, 447899, 451227, 455060, 459830, 465084, 469970, 474008, 477039, 478826, 479208, 478380, 476688, 474289, 471326, 468034, 464239, 459182, 452550, 445429, 439425, 434874, 430694, 426086, 421498, 417622, 414169, 410248, 405501, 400440, 395935, 392638, 390563, 388879, 386429, 382811, 378701, 374983, 371969, 369755, 368763, 369317, 371037, 373256, 375921, 379477, 383908, 388445, 392434, 396201, 400989, 408142, 418323, 431335, 446758, 464615, 484895, 506148, 525158, 538825, 546390, 549477, 550319, 550608, 551659, 554281, 557725, 559378, 556343, 547476, 533814, 517415, 500200, 483694, 469212]
51419D69212j1420q023n313l967l686l495k804j939j413j101n50K28Q40J229J748
51404D29546K504L157L439L501L545L504L299L208L711M939O406P405P745Q041
51390D93950R013J0510J1674J2158J2660J3922J5779J7825K0536K4841L0703L7113
51378G10684M3530N0421N7999O5430P1902P7628Q2685Q5236Q2082P1462N4838
51367A453897L5625J6603j345j8434l4646m9228o1152o9758p5020p7354p7365
51356A041823p5598p2314o7420o0874n3260m5703l8973l2863k6761k0785j5918
51345E31354j2900j1348j0274r233q541q402q339p703o515n384m763m584m554
51332D28814m384l701k241l83Q77Q43j53j302k289l271m122m330l786l078k805
$$ y = [469212, 457792, 449769, 444456, 440489, 436803, 433308, 430504, 428565, 427152, 426051, 425501, 425729, 426569, 427798, 429546, 432050, 435207, 438646, 442147, 445692, 449196, 452495, 455703, 459414, 464353, 470759, 478164, 485909, 493950, 502963, 513473, 525147, 537305, 549965, 563887, 579666, 597491, 618027, 642868, 673571, 710684, 754214, 804635, 862634, 928064, 999966, 1077594, 1160279, 1245515, 1327597, 1399059, 1453897, 1489522, 1506125, 1504780, 1486346, 1451700, 1402472, 1341320, 1271562, 1196542, 1119188, 1041823, 966225, 893911, 826491, 765617, 712357, 666654, 627681, 594818, 568057, 547272, 531354, 518454, 507106, 496832, 487599, 479058, 470656, 462317, 454614, 448099, 442715, 437952, 433368, 428814, 424430, 420729, 418488, 418105, 418982, 419825, 419672, 418370, 416081, 412810, 408688, 404358, 400572, 397494, 394689]
51317C94689k939l080k984k526j559k39P59Q63L44J38Q68K271L496L772K896J448
51301C98217M50N17J319K043K310K250J898J043k29j320j652j144k8J322K319
51286D09315K417J826J448J660J651O03q49j170J36J961L090L368L109K213N62
51271D31340j263k410k717k625k293j492k89P99J506K096K674K760J896M47o76
51256D29753r72p74p52j280k243l214l737l547k713j601o86l09n32j148j798k103
51240D02344j782q83M0K75k95r48q94k06L74M54L94O78J327K057K635K800K278
51223D10648J140r2r95j633k230k653k613k152j588j118p85o32n70k67M39J225
51207C96124J721K046K494K909L002L055L594M411M745M511M456M806M705L543
$$ y = [394689, 391750, 388670, 385686, 383160, 381601, 381362, 382121, 382984, 383328, 383466, 384334, 386605, 390101, 393873, 396769, 398217, 398667, 399184, 400503, 402546, 404856, 407106, 409004, 410047, 409818, 408498, 406846, 405702, 405674, 406996, 409315, 411732, 413558, 415006, 416666, 418317, 418920, 418071, 416901, 417037, 418998, 422088, 425456, 428565, 430778, 431340, 430077, 427667, 424950, 422325, 420032, 418540, 418251, 419050, 420556, 422652, 425326, 428086, 429982, 430429, 429753, 428781, 428007, 427255, 425975, 423732, 420518, 416781, 413234, 410521, 408920, 408234, 407925, 407393, 406245, 404447, 402344, 400562, 399679, 399719, 399994, 399699, 398751, 397857, 397651, 398025, 398479, 398873, 399551, 400878, 402935, 405570, 408370, 410648, 411788, 411696, 410701, 409068, 406838, 404185, 401572, 399420, 397832, 396714, 395929, 395297, 394727, 394460, 394899, 396124, 397845, 399891, 402385, 405294, 408296, 411351, 414945, 419356, 424101, 428612, 433068, 437874, 442579, 446122]
51193D46122K081J425J517J462R98O40N89M70J58m5k12q49j891k452k085j586
51177D46342j939k937l582l443k924k398j856j437j546k160k576k213j341o39
51163D15351k61K44J127J977K310K320K638L379L839L413K535K129K222J776J67
51148D45166j776k801k869k985l542l723k881j642j105j380j648j446j139j062
51134D15167q20J57J651K701K606J699R22P85Q91O19L5j88J98N45J77n92q19k27
51116D25507N05Q15J068J844K880L311K823K003J519J481J734K248K878L124K645
51101D56385J851J512J833K340K686K978L244L145K588K103K044J790M90j544
51087D83445k919k849k085j855k373k855k671j982j308r05n65O4J028J785J712
$$ y = [446122, 448203, 449628, 451145, 452607, 453605, 454245, 454834, 455304, 455462, 455417, 455205, 454356, 452465, 450013, 447928, 446342, 444403, 441466, 437884, 434441, 431517, 429119, 427263, 425826, 424280, 422120, 419544, 417331, 415990, 415351, 415090, 415334, 416461, 418438, 420748, 423068, 425706, 429085, 432924, 436337, 438872, 441001, 443223, 444999, 445166, 443390, 440589, 437720, 434735, 431193, 427470, 424589, 422947, 421842, 420462, 418814, 417368, 416229, 415167, 414347, 414504, 416155, 418856, 421462, 423161, 424083, 424868, 425759, 426378, 426413, 426225, 426423, 426968, 427145, 426553, 425734, 425507, 426012, 426827, 427895, 429739, 432619, 435930, 438753, 440756, 442275, 443756, 445490, 447738, 450616, 453740, 456385, 458236, 459748, 461581, 463921, 466607, 469585, 472829, 475974, 478562, 480665, 482709, 484499, 484989, 483445, 480526, 477677, 475592, 473737, 471364, 468509, 465838, 463856, 462548, 461643, 461078, 461142, 462170, 463955, 465667]
51072D65667R36M13Q54J839K407K276K015K087K364K640L147M189N652P255R185
51057E12926J2048J5867J9185J9629J5933R532L762J214K153N555J0649J6522
51045F44975K1079K2138J9964J7356J6406J6089J3868Q890K599l183p401r278
51033G63502q324n529l598m997r857j6108k1337k4165k4397k2618j9790j6746
51021E86036j3779j0742p543m372j542P35K380L459M237N069O100P092P680P745
51007E92555P507P304P422Q127R515J1239J2543J2973J2936J3256J4146J4962
50995G24485J5021J4317J3237J2025J0836J0013R792R813R297P863N900M186L334
50982H50119L481M223M873N128N500O713Q643J0158J0167Q610O413M816M854P020
$$ y = [465667, 466603, 467016, 467870, 469709, 472116, 474392, 476407, 478494, 480858, 483498, 486645, 490834, 496486, 503741, 512926, 524974, 540841, 560026, 579655, 595588, 605120, 608882, 610096, 612249, 617804, 628453, 644975, 666054, 688192, 708156, 725512, 741918, 758007, 771875, 780765, 783364, 780181, 772780, 763502, 755178, 749649, 746051, 741054, 731197, 715089, 693752, 669587, 645190, 622572, 602782, 586036, 572257, 561515, 553972, 549600, 548058, 548793, 551173, 554632, 558869, 563938, 570038, 577130, 584810, 592555, 600062, 607366, 614788, 622915, 632430, 643669, 656212, 669185, 682121, 695377, 709523, 724485, 739506, 753823, 767060, 779085, 789921, 799934, 809726, 819539, 828836, 836699, 842599, 846785, 850119, 853600, 857823, 862696, 867824, 873324, 880037, 888680, 898838, 909005, 917615, 924028, 928844, 933698, 940718]
50968I40718J1002J5830K0600K5059K9409L3745L7929M1871M5684M9482N3179
50957A304508N6534N9240O1020O1694O1169N9437N6583N2862M8596M3963L9047
50946A904653L4215L0213K7613K6265K5599K5570K6983L0500L5232L8574L7888
50935B243305L2570K4532J6555J0246N419J077l534q649j4224k0070k6050l2273
50923B228904l9017m6219n3351n9962o6077p1672p5986p7857p6911p4000p0323
50912A517529o6399o2037n7054n1652m6254m1248l6901l3224k9945k6801k3954
50901A042060k1900k0756j9879j8445j6381j4410j3136j2383j1590j0531r334
50890H73315p959o188m167k503j594j108m06O88J827K674L190L399L224K741K424
$$ y = [940718, 951720, 967550, 988150, 1013209, 1042618, 1076363, 1114292, 1156163, 1201847, 1251329, 1304508, 1361042, 1420282, 1481302, 1542996, 1604165, 1663602, 1720185, 1773047, 1821643, 1865606, 1904653, 1938868, 1969081, 1996694, 2022959, 2048558, 2074128, 2101111, 2131611, 2166843, 2205417, 2243305, 2275875, 2300407, 2316962, 2327208, 2332627, 2333704, 2330170, 2321521, 2307297, 2287227, 2261177, 2228904, 2189887, 2143668, 2090317, 2030355, 1964278, 1892606, 1816620, 1738763, 1661852, 1587852, 1517529, 1451130, 1389093, 1332039, 1280387, 1234133, 1192885, 1155984, 1122760, 1092815, 1066014, 1042060, 1020160, 999404, 979525, 961080, 944699, 930289, 917153, 904770, 893180, 882649, 873315, 865356, 859168, 855001, 852498, 850904, 849796, 849390, 850078, 851905, 854579, 857769, 861168, 864392, 867133, 869557]
50875H69557K936M548O716Q369Q793Q351Q193R135J0891J2570J3687J4449J5211
50862I93406J6130J7403J9409K2290K5636K8889L1938L5117L8708M2794M7523
50851A319243N3149N9640O6548P3512Q0734Q8631R7037J05106J12136J18231J23932
50840B297899J29367J34031J37278J38640J37626J33556J25894J14734J00890
50831C449915Q5651P0397N6155M3262L1615K1435J3669R391Q964J2004J7941K6333
50819C846732L6601M7811N8655O7345P1626O9472O0145M4447K3953K54k5127n0752
50807D251162p5707r9814j22973j44368j62531j76124j84402j87158j84635j77605
50797B735845j67181j54408j40089j24961j09818r5390q2215p0501n9950m9870
$$ y = [869557, 872493, 877041, 883757, 892126, 900919, 909270, 917463, 926598, 937489, 950059, 963746, 978195, 993406, 1009536, 1026939, 1046348, 1068638, 1094274, 1123163, 1155101, 1190218, 1228926, 1271720, 1319243, 1372392, 1432032, 1498580, 1572092, 1652826, 1741457, 1838494, 1943600, 2055736, 2173967, 2297899, 2427266, 2561297, 2698575, 2837215, 2974841, 3108397, 3234291, 3349025, 3449915, 3535566, 3605963, 3662118, 3705380, 3736995, 3758430, 3772099, 3781490, 3790454, 3802458, 3820399, 3846732, 3883333, 3931144, 3989799, 4057144, 4128770, 4198242, 4258387, 4302834, 4326787, 4327041, 4301914, 4251162, 4175455, 4075641, 3952668, 3808300, 3645769, 3469645, 3285243, 3098085, 2913450, 2735845, 2568664, 2414256, 2274167, 2149206, 2039388, 1943998, 1861783, 1791282, 1731332, 1681462]
50787A681462l9821l0230k2151j6204j2009q705n880l757k695k709l534m904o646
50774A522217q490j0021j0990j1676j2737j4511j6629j8419j9610k0454k1355
50763A357325k2604k4311k6210k7611k7899k7149k5901k4339k2122j9128j5930
50752A094121j3210j1072r125p012m513j491J934N286Q159J0633J2998J5386J7882
50739A119976K0742K4063K7548L1107L5407M1103M7640N3602N8314O2301O6004
50728A587807O8950P0696P1788P2925P3610P2656O9884O6457O3444O0750N7699
50717B336666N3811M8572M1066L0697J8220N481n867j5000k1375k4243k3106j8396
50705B426526j1242k673O694J6215K5055L2571L8609M3050M5123M3551L7393K6591
$$ y = [1681462, 1641641, 1611411, 1589260, 1573056, 1561047, 1552342, 1546462, 1542705, 1540010, 1537301, 1533767, 1528863, 1522217, 1513727, 1503706, 1492716, 1481040, 1468303, 1453792, 1437163, 1418744, 1399134, 1378680, 1357325, 1334721, 1310410, 1284200, 1256589, 1228690, 1201541, 1175640, 1151301, 1129179, 1110051, 1094121, 1080911, 1069839, 1060714, 1053702, 1049189, 1047698, 1049632, 1054918, 1063077, 1073710, 1086708, 1102094, 1119976, 1140718, 1164781, 1192329, 1223436, 1258843, 1299946, 1347586, 1401188, 1459502, 1521803, 1587807, 1656757, 1727453, 1799241, 1872166, 1945776, 2018432, 2088316, 2154773, 2218217, 2278967, 2336666, 2390477, 2439049, 2480115, 2510812, 2529032, 2534513, 2528646, 2513646, 2492271, 2468028, 2444922, 2426526, 2415284, 2412611, 2419305, 2435520, 2460575, 2493146, 2531755, 2574805, 2619928, 2663479, 2700872, 2727463]
50693B727463J1780o102k5921m6271o5562q2151r4450j01401j03144j01008r6507
50682B016726r0334q2570p3630o4357n5219m6005l6602k7562j9372j1549l095
50671A506431O155J5234K3116K9575L4713L8214L9524L8568L5928L2344K8373
50660A828175K4375K0519J6773J3251J0524R289R598J0653J1489J1687J1359J0702
50648A988394R825Q944Q513R080J1007J4315J8798K4204L0220L6285M1812M6742
50636B248139N1567N6406O0310O1998O1157N8500N4741N0313M5950M2645M0856
50625B832582M0804M3506M9426N4697N0515K9601n898m4384p3487q8140r0640
50614B798582q5399p5503o3023m9877l7378k5731j4709m575L830R637J2448J2290
$$ y = [2727463, 2739243, 2733141, 2707220, 2660949, 2595387, 2513236, 2418786, 2317385, 2214241, 2113233, 2016726, 1926392, 1843822, 1770192, 1705835, 1650616, 1604611, 1568009, 1540447, 1521075, 1509526, 1506431, 1512586, 1527820, 1550936, 1580511, 1615224, 1653438, 1692962, 1731530, 1767458, 1799802, 1828175, 1852550, 1873069, 1889842, 1903093, 1913617, 1922906, 1932504, 1943157, 1954646, 1966333, 1977692, 1988394, 1998219, 2007163, 2015676, 2024756, 2035763, 2050078, 2068876, 2093080, 2123300, 2159585, 2201397, 2248139, 2299706, 2356112, 2416422, 2478420, 2539577, 2598077, 2652818, 2703131, 2749081, 2791726, 2832582, 2873386, 2916892, 2966318, 3021015, 3071530, 3101131, 3095233, 3050849, 2977362, 2889222, 2798582, 2713183, 2637680, 2574657, 2524780, 2487402, 2461671, 2446962, 2442387, 2446217, 2455854, 2468302, 2480592]
50602B480592R155K659p418k0230l3936m6989n8852o9227p7202q1899q3531q3068
50590A930054q1080p7594p2927o7779o2408n6495n0015m3540l7474l1655k6071
50579A323016k1315j7878j5432j3348j1550j0317r485q440o793m694k476l99J329
50566A202218K679M026N839Q109J0288J1982J3372J4870J6635J8704K1306K4683
50554A354711K8676L2858L7021M1164M4870M7162M7327M5591M2664L8880L4342
50543A795266K9741K6198K4132K2965K2381K3218K6471L1787L7700M3303M8951
50532B132113N5258O2091O8850P5369Q2196R0137R9625J10341J21333J31638J40704
50521C169655J48109J53115J55067J54056J50557J44390J34604J20703J03268
$$ y = [2480592, 2489747, 2492406, 2484988, 2464758, 2430822, 2383833, 2324981, 2255754, 2178552, 2096653, 2013122, 1930054, 1848974, 1771380, 1698453, 1630674, 1568266, 1511771, 1461756, 1418216, 1380742, 1349087, 1323016, 1301701, 1283823, 1268391, 1255043, 1243493, 1233176, 1223691, 1215251, 1208458, 1203764, 1201288, 1200889, 1202218, 1204897, 1208923, 1214762, 1222871, 1233159, 1245141, 1258513, 1273383, 1290018, 1308722, 1330028, 1354711, 1383387, 1416245, 1453266, 1494430, 1539300, 1586462, 1633789, 1679380, 1722044, 1760924, 1795266, 1825007, 1851205, 1875337, 1898302, 1920683, 1943901, 1970372, 2002159, 2039859, 2083162, 2132113, 2187371, 2249462, 2318312, 2393681, 2475877, 2566014, 2665639, 2775980, 2897313, 3028951, 3169655, 3317764, 3470879, 3625946, 3780002, 3930559, 4074949, 4209553, 4330256, 4433524]
50512D433524Q3173O0742L6228J0570j5013l9971o4294q7466j08093j24675j36424
50501D048301j43195j44921j41331j32257j18212j00505q0513n8891l5830j2073
50491C080573J0919L1998N0720O6209P6210P8169P1018N5355L2335L463k8634
50480C528335o0392q8821j12344j30215j41986j47956j49366j47507j43011j36322
50470B270415j28216j19345j09771r9494q9051p9057o9655o0992n3768m8442m4159
50459A368465l9358l3433k7167k1497j6661j2551r128o160l253m44J771L284M692
50446A208560O510Q577J0653J2949J5631J8267K0334K1796K2586K1923J9006J4209
50434A401001Q950M420J083p96r86J30J561K605L323M010M777N830P509R667J1604
$$ y = [4433524, 4516697, 4577439, 4613667, 4624237, 4609224, 4569253, 4504959, 4417493, 4309400, 4184725, 4048301, 3905106, 3760185, 3618854, 3486597, 3368385, 3267880, 3187367, 3128476, 3092646, 3080573, 3091492, 3123490, 3174210, 3240419, 3316629, 3394798, 3465816, 3521171, 3553506, 3556969, 3528335, 3467943, 3379122, 3266778, 3136563, 2994577, 2846621, 2697255, 2549748, 2406737, 2270415, 2142199, 2022854, 1913083, 1813589, 1724538, 1645481, 1575826, 1514834, 1461066, 1412624, 1368465, 1329107, 1295674, 1268507, 1247010, 1230349, 1217798, 1208670, 1202510, 1199257, 1198813, 1200584, 1203868, 1208560, 1215070, 1223647, 1234300, 1247249, 1262880, 1281147, 1301481, 1323277, 1345863, 1367786, 1386792, 1401001, 1409951, 1414371, 1415454, 1414658, 1413672, 1413802, 1415363, 1417968, 1421291, 1425301, 1430078, 1435908, 1443417, 1453084, 1464688]
50419A464688J3096J5011J8342K3031K8266L3604L9124M4762N0247N5701O1534
50408A847406O7580P2920P6740P8936P9723P9185P7430P4635P0569O4661N6992
50397B646777M8789M1139L3394K3618J0739m446k0519l6905n3436o8994q1553
50386B538603q9718r3675r4378r2294q7338p9629o9790n8475m6074l3033k0140
50375A774059q136K820J3017K2420L0135L4738L5165L1245K3480J2479j123j6235
50363A954064l1154m4110n4109o1086o5334o7008o6267o3660o0089n6269n2434
50352A332544m8610m5164m2749m1572m0833l9270l6303l2398k8224k3936j9596
50341I33889j5827j3277j1558r440o398l319j329l21P66K546M580O126P026P757
$$ y = [1464688, 1477784, 1492795, 1511137, 1534168, 1562434, 1596038, 1635162, 1679924, 1730171, 1785872, 1847406, 1914986, 1987906, 2064646, 2143582, 2223305, 2302490, 2379920, 2454555, 2525124, 2589785, 2646777, 2695566, 2736705, 2770099, 2793717, 2804456, 2800010, 2779491, 2742586, 2689150, 2620156, 2538603, 2448885, 2355210, 2260832, 2168538, 2081200, 2001571, 1931781, 1873306, 1827232, 1794199, 1774059, 1765923, 1768743, 1781760, 1804180, 1834315, 1869053, 1904218, 1935463, 1958943, 1971422, 1970299, 1954064, 1922910, 1878800, 1824691, 1763605, 1698271, 1631263, 1564996, 1501336, 1441247, 1384978, 1332544, 1283934, 1238770, 1196021, 1154449, 1113616, 1074346, 1038043, 1005645, 977421, 953485, 933889, 918062, 904785, 893227, 883787, 877389, 874070, 872741, 872420, 873186, 875732, 880312, 886438, 893464, 901221]
50327I01221Q858J0478J2314J4015J5682J7916K1264K5539K9569L1454K9287K2418
50315A140015J2398K325n289r969j2555j3544j2829j0729q291o284m501k474m02
50302A067871J014J428J127O20K66K63O76J441K427L523M575N327N534N184M530
50287A105806L911L536L515M186O338J0611J6168K0048J8744J1206L22r108j4024
50274A181259j4764j3380j1122q048m378j093J169K937M885O501O636N307L949
50261A159858L602L689L081J729M89k53r19j744k395k691l134m229n658o541o422
50246A138462n674m935m355l514k021M2K421N210Q656J2455J5758J8119K0102
50233A200726K2582K5758K9140L2159L4315L5066L4153L2024K9472K6824K3884
$$ y = [901221, 910079, 920557, 932871, 946886, 962568, 980484, 1001748, 1027287, 1056856, 1088310, 1117597, 1140015, 1152413, 1154738, 1149449, 1139480, 1126925, 1113381, 1100552, 1089823, 1081532, 1075248, 1070747, 1068273, 1067871, 1068885, 1070313, 1071440, 1072060, 1072326, 1072589, 1073265, 1074706, 1077133, 1080656, 1085231, 1090558, 1096092, 1101276, 1105806, 1109717, 1113253, 1116768, 1120954, 1127292, 1137903, 1154071, 1174119, 1192863, 1204069, 1204391, 1195283, 1181259, 1166495, 1153115, 1141993, 1133945, 1129567, 1128474, 1129643, 1132580, 1137465, 1143966, 1150602, 1155909, 1159858, 1163460, 1167149, 1170230, 1171959, 1172448, 1172195, 1171276, 1169532, 1167137, 1164446, 1161312, 1157083, 1151425, 1144884, 1138462, 1132788, 1127853, 1123498, 1119984, 1117963, 1118005, 1120426, 1125636, 1134292, 1146747, 1162505, 1180624, 1200726, 1223308, 1249066, 1278206, 1310365, 1344680, 1379746, 1413899, 1445923, 1475395, 1502219, 1526103]
50222A526103K0579J7286J4569J2911J2558J3151J3490J2021P688K99r538k0488
50210A620629l0901l9659m6494n1189n2970n1354m7097m1460l4947k7602k0161
50199A176795j3736q728n348n010r316j7239k4947k9314l0428k9951k8502k5883
50187I48393k2693j9996j7842j5492j2957j1082j0201r708r014q134p292o589
50175G97393o035n437m451l185k384k486k929l027k983l192l173k281j039n35
50161G54256p11n59O1K63o1K26J629L019L341L236M036N921Q035R766J0897J0934
50145H14289R401O756M121K043J47j891l725m893n426n584n285m161k083O22L460
50130H07791O160Q676J0872J2312J2587J1888J1176J1599J3605J6609J9603K2169
$$ y = [1526103, 1546682, 1563968, 1578537, 1591448, 1604006, 1617157, 1630647, 1642668, 1650356, 1650655, 1641117, 1620629, 1589728, 1550069, 1503575, 1452386, 1399416, 1348062, 1300965, 1259505, 1224558, 1196956, 1176795, 1163059, 1154331, 1148983, 1143973, 1134657, 1117418, 1092471, 1063157, 1032729, 1002778, 974276, 948393, 925700, 905704, 887862, 872370, 859413, 848331, 838130, 828422, 819408, 811274, 803982, 797393, 791358, 785921, 781470, 778285, 775901, 773415, 770486, 767459, 764476, 761284, 758111, 755830, 754791, 754256, 753545, 752986, 753047, 753310, 753249, 753475, 755104, 758123, 761464, 764700, 768736, 774657, 782692, 792458, 803355, 814289, 823690, 830446, 834567, 836610, 836757, 834866, 831141, 826248, 820822, 815238, 809953, 805792, 803709, 804331, 807791, 813951, 822627, 833499, 845811, 858398, 870286, 881462, 893061, 906666, 923275, 942878, 965047]
50118I65047K4859K8520L3401L9107M5293N1834N8132O2827O4713O3793O1117
50107A498643N7820N4721N2569N1940N2810N4506N6155N6885N5671N1341M2863
50096B085924K9722J2446o840k5068m0162n2176o2016o9505p3631p4309p2582
50085A651803o9031o3336n5802m8040m1290l5114k8640k2357j7602j4764j3039
50074A242788j1747j0856j0245r375p925o175m542l209k251j720j520j551k015
50061A169657l247n145p085q487r217r424r344r327r787j0891j2282j3189j2824
50048A049408j0969q302n936m436l388k146o61P94K371M523P154R452J0763J1268
50034A059895J1673J2543J4021J5823J7294J7806J7303J6323J5272J3877J1586
$$ y = [965047, 989906, 1018426, 1051827, 1090934, 1136227, 1188061, 1246193, 1309020, 1373733, 1437526, 1498643, 1556463, 1611184, 1663753, 1715693, 1768503, 1823009, 1879164, 1936049, 1991720, 2043061, 2085924, 2115646, 2128092, 2121252, 2096184, 2056022, 2003846, 1941830, 1872325, 1798694, 1724385, 1651803, 1582772, 1519436, 1463634, 1415594, 1374304, 1339190, 1310550, 1288193, 1270591, 1255827, 1242788, 1231041, 1220185, 1209940, 1200565, 1192640, 1186465, 1181923, 1178714, 1176463, 1174743, 1173223, 1171672, 1169657, 1166410, 1161265, 1154180, 1145693, 1136476, 1127052, 1117708, 1108381, 1098594, 1087703, 1075421, 1062232, 1049408, 1038439, 1030137, 1024201, 1019765, 1016377, 1014231, 1013570, 1014364, 1016735, 1021258, 1028412, 1037864, 1048627, 1059895, 1071568, 1084111, 1098132, 1113955, 1131249, 1149055, 1166358, 1182681, 1197953, 1211830, 1223416]
50023A223416Q360M829J726o40k406l831n040n989o671p388q704j0959j3756j5998
50009A156949j6633j5524j3574j1908j0926j0238r339q025o020k651K610R387
49997A064108J6612K3586L0432L7330M3633M8064M9651M8309M4714L9916L4982
49986A481337L0579K6719K3115J9778J7116J5388J4289J3110J1007O987P5r956
49974A649544k2104l4662m6200n5659o1913o4061o2406n8547n3958m8955m3380
49963A097699l7768l3089k9552k6434k3084j9493j5752j1655p194k995J82K280
49951H93145M014O266R443J3095J6039J7058J5729J2547Q382M114O59j276j822
49938I97393j987k744m357o685r766j3652j7986k2142k5550k7607k7695k5840
$$ y = [1223416, 1231776, 1236605, 1238331, 1237691, 1235285, 1231454, 1226414, 1220425, 1213754, 1206366, 1197662, 1186703, 1172947, 1156949, 1140316, 1124792, 1111218, 1099310, 1088384, 1078146, 1068807, 1060782, 1054762, 1052111, 1054721, 1064108, 1080720, 1104306, 1134738, 1172068, 1215701, 1263765, 1313416, 1361725, 1406439, 1446355, 1481337, 1511916, 1538635, 1561750, 1581528, 1598644, 1614032, 1628321, 1641431, 1652438, 1659425, 1659500, 1649544, 1627440, 1592778, 1546578, 1490919, 1429006, 1364945, 1302539, 1243992, 1190034, 1141079, 1097699, 1059931, 1026842, 997290, 970856, 947772, 928279, 912527, 900872, 893678, 890683, 890865, 893145, 897159, 903425, 912868, 925963, 942002, 959060, 974789, 987336, 995718, 999832, 1000491, 999215, 997393, 995406, 992662, 988305, 981620, 971854, 958202, 940216, 918074, 892524, 864917, 837222, 811382]
49926H11382k3088k0644j8676j6453j3637j0813q678p215n903m397k671q35Q79
49913F79251K107K527K118J254O17Q71K179M061N992P974J0194J2303J3697J4535
$$ y = [811382, 788294, 767650, 748974, 732521, 718884, 708071, 699393, 692178, 686275, 681878, 679207, 678372, 679251, 681358, 683885, 686003, 687257, 687874, 688745, 690924, 694985, 700977, 708951, 719145, 731448, 745145, 759680]
$$ [...]
##END NTUPLES=NMR SPECTRUM
##END=
