
##TITLE=UV1245_M9_1261-1207_30_7241217_HEbQtKXUtJ
##JCAMPDX= 6.0         $$ Bruker NMR JCAMP-DX V2.0
##DATA TYPE= NMR SPECTRUM
##DATA CLASS= NTUPLES
##ORIGIN= BRUKER
##OWNER= Administrator
$$ 1.72 TOPSPIN		Version 2.1
$$ 2013-01-19 04:13:37.198 -0500  Administrator@X
$$ Compression mode = diff/dup
##.OBSERVE FREQUENCY= 400.02188249412
##.OBSERVE NUCLEUS= ^1H
##.ACQUISITION MODE= SIMULTANEOUS (DQD)
##.ACQUISITION SCHEME= undefined
##.AVERAGES= 8
##.DIGITISER RES= 22
##SPECTROMETER/DATA SYSTEM= spect
##.PULSE SEQUENCE= zg30
##.SOLVENT NAME= COFFEE_meoh
##.SHIFT REFERENCE= INTERNAL, COFFEE_meoh, 1, 14.98509
##AUDIT TRAIL= $$ (NUMBER, WHEN, WHO, WHERE, PROCESS, VERSION, WHAT)
$$ ##TITLE= Audit trail, TOPSPIN		Version 2.1
$$ ##JCAMPDX= 5.01
$$ ##ORIGIN= Bruker BioSpin GmbH
$$ ##OWNER= Administrator
$$ $$ E:\/data/COFFEE/nmr/UV1245_M9_1261-1207_30_7241217_HEbQtKXUtJ/20/pdata/1/auditp.txt
$$ ##AUDIT TRAIL=  $$ (NUMBER, WHEN, WHO, WHERE, PROCESS, VERSION, WHAT)
(   1,<2013-01-19 04:13:29.120 -0500>,<Administrator>,<X>,<go>,<TOPSPIN 2.1>,
      <created by zg
	started at 2013-01-19 04:12:22.790 -0500,
	POWCHK enabled, PULCHK disabled,
       configuration hash MD5:
       86 BA 57 50 F2 9D 5C 9B 26 00 A9 28 5F 66 2E 89
       data hash MD5: 64K
       45 C3 A3 90 21 8D 11 26 49 AD 9C CD 76 C7 42 34>)
(   2,<2013-01-19 04:13:32.167 -0500>,<Administrator>,<X>,<proc1d>,<TOPSPIN 2.1>,
      <Start of raw data processing
       efp LB = 0 FT_mod = 6 PKNL = 1 PHC0 = 0 PHC1 = 0 SI = 32K 
       data hash MD5: 32K
       DB 06 3A EB 6F 46 61 B7 42 97 82 92 FC 1E B5 0E>)
(   3,<2013-01-19 04:13:32.636 -0500>,<Administrator>,<X>,<proc1d>,<TOPSPIN 2.1>,
      <pk PHC0 = 97.69043 PHC1 = 0 
       data hash MD5: 32K
       A4 CA 92 64 F2 EA 66 45 DC A3 C4 96 78 5C 1B 1F>)
(   4,<2013-01-19 04:13:32.870 -0500>,<Administrator>,<X>,<proc1d>,<TOPSPIN 2.1>,
      <abs ABSG = 1 
       data hash MD5: 32K
       AB 63 41 23 C1 03 D6 72 4D 0A 4B FF D5 A9 C1 13>)
(   5,<2013-01-19 04:13:33.026 -0500>,<Administrator>,<X>,<proc1d>,<TOPSPIN 2.1>,
      <abs ABSG = 2 
       data hash MD5: 32K
       BA 82 0D 6F FC DD BF F2 AB 61 9E EC 92 87 45 57>)
(   6,<2013-01-19 04:13:33.167 -0500>,<Administrator>,<X>,<proc1d>,<TOPSPIN 2.1>,
      <abs ABSG = 3 
       data hash MD5: 32K
       11 C0 53 94 69 36 60 9D AD 72 B9 DD 85 39 47 2B>)
(   7,<2013-01-19 04:13:33.308 -0500>,<Administrator>,<X>,<proc1d>,<TOPSPIN 2.1>,
      <abs ABSG = 4 
       data hash MD5: 32K
       94 D8 F5 27 08 6A C7 6E E2 E3 5B D3 E0 4E 81 4C>)
(   8,<2013-01-19 04:13:33.464 -0500>,<Administrator>,<X>,<proc1d>,<TOPSPIN 2.1>,
      <abs ABSG = 5 
       data hash MD5: 32K
       23 60 0B 6B B0 29 85 EA E5 36 7F 9F C7 55 C1 E3>)
$$ ##END=
$$ 
$$ $$ hash MD5
$$ $$ B2 A2 58 7B 43 74 9B 46 12 95 38 C4 38 46 1E F4
##$RELAX= 
##$RELAX= 
##$RELAX= 
##$RELAX= 
##$RELAX= 
##$RELAX= 
##$RELAX= 
$$ Bruker specific parameters
$$ --------------------------
##$DU= <E:\>
##$EXPNO= 20
$$ [...]
150 150 150 150 150 150 150 150
##$TP07= 0
##$TPNAME0= <>
##$TPNAME1= <>
##$TPNAME2= <>
##$TPNAME3= <>
##$TPNAME4= <>
##$TPNAME5= <>
##$TPNAME6= <>
##$TPNAME7= <>
##$TPOAL= (0..7)
0.5 0.5 0.5 0.5 0.5 0.5 0.5 0.5
##$TPOFFS= (0..7)
0 0 0 0 0 0 0 0
##$TUNHIN= 0
##$TUNHOUT= 0
##$TUNXOUT= 0
##$USERA1= <user>
##$USERA2= <user>
##$USERA3= <user>
##$USERA4= <user>
##$USERA5= <user>
##$V9= 5
##$VALIST= <valist>
##$VCLIST= <CCCCCCCCCCCCCCC>
##$VD= 0
##$VDLIST= <DDDDDDDDDDDDDDD>
##$VPLIST= <PPPPPPPPPPPPPPP>
##$VTLIST= <TTTTTTTTTTTTTTT>
##$WBST= 1024
##$WBSW= 4
##$XGAIN= (0..3)
0 0 0 0
##$XL= 0
##$YL= 0
##$YMAX_a= 643923
##$YMIN_a= -547564
##$ZGOPTNS= <>
##$ZL1= 120
##$ZL2= 120
##$ZL3= 120
##$ZL4= 120
##$ABSF1= 14.98509
##$ABSF2= -5.573092
##$ABSG= 5
##$ABSL= 3
##$ALPHA= 0
##$AQORDER= 0
##$ASSFAC= 0
##$ASSFACI= 0
##$ASSFACX= 0
##$ASSWID= 0
##$AUNMP= <proc_prof1d_extract_pilot.lims>
##$AXLEFT= 0
##$AXNAME= <>
##$AXNUC= <1H>
##$AXRIGHT= 0
##$AXTYPE= 0
##$AXUNIT= <>
##$AZFE= 0.1
##$AZFW= 0.1
##$BCFW= 0
##$BC_mod= 0
##$BYTORDP= 0
##$COROFFS= 0
##$CY= 15
##$DATMOD= 1
##$DC= 0
##$DFILT= <>
##$DTYPP= 0
##$F1P= 0
##$F2P= 0
##$FCOR= 0.5
##$FTSIZE= 32768
##$FT_mod= 6
##$GAMMA= 0
##$GB= 0
##$INTBC= 1
##$INTSCL= 1
##$ISEN= 128
##$LB= 0
##$LEV0= 0
##$LPBIN= 0
##$MAXI= 10000
##$MC2= 0
##$MEAN= 0
##$ME_mod= 0
##$MI= 0
##$NCOEF= 0
##$NC_proc= -8
##$NLEV= 6
##$NOISF1= 0
##$NOISF2= 0
##$NSP= 0
##$NTH_PI= 0
##$NZP= 0
##$OFFSET= 14.98509
##$PC= 1
##$PHC0= 97.69043
##$PHC1= 0
##$PH_mod= 1
##$PKNL= yes
##$PPARMOD= 0
##$PPDIAG= 0
##$PPIPTYP= 0
##$PPMPNUM= 2147483647
##$PPRESOL= 1
##$PSCAL= 4
##$PSIGN= 0
##$PYNMP= <proc.py>
##$REVERSE= no
##$SF= 400.02
##$SI= 32768
##$SIGF1= 0
##$SIGF2= 0
##$SINO= 400
##$SIOLD= 32768
##$SPECTYP= <>
##$SREGLST= <1H.CDCl3>
##$SSB= 0
##$STSI= 32768
##$STSR= 0
##$SW_p= 8223.68421052631
##$SYMM= 0
##$S_DEV= 0
##$TDeff= 65536
##$TDoff= 0
##$TI= <>
##$TILT= no
##$TM1= 0
##$TM2= 0
##$TOPLEV= 0
##$USERP1= <user>
##$USERP2= <user>
##$USERP3= <user>
##$USERP4= <user>
##$USERP5= <user>
##$WDW= 1
##$XDIM= 32768
##$YMAX_p= 443423114
##$YMIN_p= -799574
##$CURPLOT= <Network HP LaserJet P1505>
##$CURPRIN= <$Network HP LaserJet P1505>
##$DFORMAT= <normdp>
##$LAYOUT= <+/1D_H.xwp>
##$LFORMAT= <normlp>
##$PFORMAT= <normpl>
##$SURQMSG= 1
$$ End of Bruker specific parameters
$$ ---------------------------------
##NTUPLES= NMR SPECTRUM
##VAR_NAME=  FREQUENCY,     SPECTRUM/REAL,   SPECTRUM/IMAG
##SYMBOL=    X,             R,               I
##VAR_TYPE=  INDEPENDENT,   DEPENDENT,       DEPENDENT
##VAR_FORM=  AFFN,          ASDF,            ASDF
##VAR_DIM=   32768,         32768,           32768
##UNITS=     HZ,            ARBITRARY UNITS, ARBITRARY UNITS
##FACTOR=    0.250966925370066, 1,           1
##FIRST=     8223.43324360094, -111033,      -126602
##LAST=      0,             -184280,         -150190
##MIN=       0,             -799574,         0
##MAX=       8223.43324360094, 443423114,    0
$$ Real data points
##PAGE= N=1
##DATA TABLE= (X++(R..R)), XYDATA
$$ [...]
$$ plain form
19568 212013 219809 -102016 168255 -101942 -28644 -42768 -297817 68083 -153673 349413
19557 -314414 48454 34895 -117121 -36019 -31560 304680 -71132 220355 182846 -42524 -217080
19546 -217080 -32306 -86705 -359453 -77781 -71124 163426 -105907 96513 86161 80569 181210
19535 181210 -165000 -150076 -59762 -123030 -108684 -56619 -168713 63460 -75992 -159868 18622
19523 -171676 133294 10729 -194261 -201210 -418442 73002 -72773 206156 -145363 -157543 -93087
19512 -93087 36489 288458 -76407 -232999 -113688 -187205 -478469 -14137 -212800 -177259 -225168
19501 -225168 -158938 118548 395802 -44226 -202047 2907 1047 118983 -174945 77610 -183030
19489 164641 -5224 393844 -116597 -281317 -35049 99552 -360672 -106714 235545 -177960
$$ packed form
19568B12013P796a02016A68255a01942b8644j4124k55049F8083a53673C49413
19557c14414D8454j3559a17121c6019M459C04680g1132B20355l7509d2524j74556
19546b17080c2306n4399k72748g7781O657A63426a05907I6513j0352n592J00641
19535A81210a65000J4924e9762o3268J4346N2065j12094F3460g5992q3876A8622
19523a71676A33294A0729a94261o949k17232G3002g2773B06156a45363j2180O4456
19512i3087C6489K51969g6407j56592a13688p3517k91264a4137j98663L5541m7909
19501b25168O6230A18548K77254d4226j57821B907A047J17936a74945G7610a83030
19489A64641e224C93844a16597j64720c5049I9552c60672a06714B35545a77960
$$ plain form
19478 42062 188974 1744 -530837 -190924 -66185 246218 -196594 -159231 226417 -171872
19467 -123837 -233562 -126329 -209822 145688 -157591 -144189 -28931 134710 53612 86134
19457 86134 108653 168318 -111193 5074 -367666 72995 -62980 -343798 132757 -378093 19289
19445 52916 44707 -205939 121042 -223461 83779 205537 179467 -22242 -95924 318564 -76121
19433 -49072 -73363 135207 -12258 42811 44984 -208630 127799 -10453 -66933 283301 -471707
19421 -205336 -30519 -424014 146562 -85587 52065 -82558 -211570 131436 -547 -349134 -126730
19409 56980 -26132 -143507 -208142 -32072 37194 -265845 -206971 -226120 138895 202466 -175130
19397 -84324 177649 50603 -276033 66674 26265 116987 461635 -64349 -2790 -409765 309565
$$ packed form
19478D2062J46912A744e30837a90924f6185B46218a96594L7363B26417a71872
19467a23837j09725J07233q3493A45688a57591J3402b8931A34710E3612L2522
19457H6134K2519N9665a11193E074c67666G2995f2980k80818A32757c78093A9289
19445E2916q209b05939A21042b23461H3779J21758k6070b2242p3682C18564g6121
19433d9072k4291A35207a2258D2811K173b08630A27799a0453n6480B83301d71707
19421b05336c0519l93495A46562h5587E2065h2558j29012A31436e47l48587a26730
19409E6980b6132j17375o4635c2072C7194b65845N8874j9149A38895O3571a75130
19397h4324A77649E0603b76033F6674B6265R0722L44648f4349b790m06975C09565
$$ plain form
19385 223270 -70217 -159230 233204 73581 -362949 -27511 -113019 -88666 -21232 22700 -173066
19373 -423630 -91959 -231454 -134977 364112 291832 -65207 242157 131931 -228631 -229989 -162650
19362 -162650 67783 -408911 -221869 33555 -68902 48694 -29834 -90157 -82679 -397396 -114908
19350 -161466 8882 -117418 -281098 184578 -124215 -380732 -39673 -99588 -68120 391157
19339 402744 -149932 -76271 -79164 -33036 -69154 -168279 59139 207220 -265437 205567 127265
19328 127265 -277401 -320262 -73981 48665 -166024 68502 -30263 115400 -85732 -38058 -208869
19317 -208869 -157588 -98884 -240874 163955 -148345 -7444 -20958 -51957 -234666 -47708 -91501
19306 -91501 162135 -167902 -35614 -188878 -329724 -314549 -131004 81128 113090 54664 -43337
$$ packed form
19385B23270g0217q9013B33204G3581c62949b7511q5508K4353b1232B2700a73066
19373d23630i1959j39495R6477C64112p2280f5207B42157j10226b28631j358O7339
19362a62650F7783d08911J87042C3555f8902D8694b9834o0323P478l14717a14908
19350a61466H882a17418j63680A84578a24215k56517c9673n9915L1468C91157
19339D02744a49932P3661k893c3036l6118r9125E9139J48081b65437B05567p8302
19328A27265b77401m2861g3981D8665a66024F8502c0263A15400h5732c8058j70811
19317b08869N1281N8704j41990A63955a48345g444j3514l0999j82709d7708m3793
19306i1501A62135a67902c5614j53264j40846J5175a31004H1128L1962E4664d3337
$$ plain form
19294 -111104 -190785 -131372 298940 45243 102372 -96835 -5595 -234514 36515 -197305 -43739
19282 135593 -85732 99298 56061 119176 289790 111895 -60692 -25818 -210967 -247179 21088
19270 59004 -498143 60151 116915 45964 11639 -71570 -28750 286330 -265218 -77067 -559303
19259 -559303 -66314 -61168 80978 -257303 -232945 -21208 149764 -236499 176440 -179385 -286185
19248 -286185 -356753 106304 -131712 124178 263185 -276042 -339004 -52199 -234448 -467332
19238 -467332 -36693 95735 92205 6323 51676 -107183 -101744 -140242 241190 -353052 -51067
19226 40511 101378 193048 -73022 -98865 -111669 -260176 -17956 196646 -229103 15906 -92230
19214 -339883 -95351 59359 -45549 36461 -210103 67936 201506 -32810 -292413 -80182 -158959
$$ packed form
19294a11104p9681N9413B98940D5243N7129i6835e595k28919C6515a97305d3739
19282A35593h5732I9298m3237O3115J70614A11895f0692b5818j85149l6212B1088
19270E9004d98143F0151N6764D5964A1639g1570b8750B86330b65218g7067m82236
19259e59303f6314N146H0978b57303K4358b1208A49764b36499A76440a79385j06800
19248b86185p0568A06304a31712A24178J39007b76042o2962e2199j82249k32884
19238d67332c6693I5735l530F323M5353a07183N439l8498B41190c53052e1067
19226D0511O0867R1670g3022k5843j2804j48507a7956A96646b29103A5906i2230
19214c39883i5351E9359d5549C6461b10103F7936J33570c2810k59603h0182p8777
$$ plain form
19203 -158959 75669 142339 -176319 -94449 27866 -374542 421497 90326 -209980 -197120 -111670
19192 -111670 -126138 156519 -32354 -233097 -120608 -165096 -242689 -430066 -39441 247045
19181 -101836 -2020 -1545 -83765 126660 14740 -310559 163986 -486234 -53775 -168598 52571
19169 -54213 58582 -325766 66578 22410 -295940 127049 -221161 -127534 -113671 19161 -245443
19157 -154940 -91617 64936 -238193 105209 -268085 12163 -255993 159992 235812 -235333
19146 6619 -361436 -88374 77645 85491 -141886 -20781 137622 -6674 -60205 12341 -51527 -6314
19133 56934 -73943 -146720 -4355 -214476 -279002 133218 -249507 110643 -2441 -203006 197221
19121 146861 -56672 -51046 -282802 -264711 -199695 -24842 -255507 -154872 17259 -118046 -265038
$$ packed form
19203a58959G5669O6670a76319Q1870B7866c74542D21497I0326b09980J2860Q5450
19192a11670j4468A56519c2354k00743J12489m4488p7593j87377c9441B47045
19181a01836b020M75q2220A26660A4740c10559A63986d86234e3775j14823E2571
19169e4213E8582c25766F6578B2410b95940A27049b21161R3627J3863A9161b45443
19157a54940O3323F4936b38193A05209b68085A2163b55993A59992P5820b35333
19146F619c61436h8374G7645P846a41886b0781A37622f674n3531A2341e1527f314
19133E6934g3943p2777d355k10121o4526A33218b49507A10643b441k00565A97221
19121A46861e6672N626k31756J8091O5016b4842k30665J00635A7259a18046j46992
$$ plain form
19110 -265038 -183851 -301997 -60073 186890 -174783 190151 -64507 90807 108775 -174655
19099 223598 55030 -36901 -308623 124070 -176542 -14238 -317329 15541 190250 287438
19089 287438 -75544 -75289 91808 -151507 -139507 -206727 -169744 -36957 71593 86390 204517
19078 204517 44389 66334 -259566 8378 9359 14375 324058 154526 -13241 -100028 -120075 -38574
19065 -205644 -112209 -456043 -214690 -152544 108602 -23845 -154059 -43067 -153882 108282
19054 112037 -148294 -66353 122453 -19730 109865 -230120 -149268 -181382 -222288 -185296 42364
19042 -251569 -26703 -88679 147651 -83998 2174 -381819 239043 -39438 -101462 -27512 64532
19030 -219841 -153469 223334 -193533 -233736 5758 99063 -104568 11186 -334466 -75163 -233982
$$ packed form
19110b65038Q1187j18146f0073A86890a74783A90151f4507I0807J7968a74655
19099B23598E5030c6901k71722A24070a76542a4238l03091A5541J74709R7188
19089B87438g5544K55I1808a51507J2000o7220L6983c6957G1593J4797J18127
19078B04517D4389K1945b59566H378R81N016L09683A54526a3241q6787k0047c8574
19065b05644R3435l43834b14690O2146A08602b3845j30214d3067j10815A08282
19054A12037a48294f6353A22453a9730A09865b30120Q0852l2114m0906L6992D2364
19042b51569b6703o1976A47651h3998B174c81819B39043c9438o2024b7512F4532
19030b19841O6372B23334a93533m0203E758R3305a04568A1186c34466g5163j58819
$$ plain form
19019 -233982 -92029 180243 295891 41843 160077 -58048 -20974 60348 -40325 122460 -168163
19007 -30861 -143597 7708 106030 132678 -157070 -142251 149414 -372609 73288 -461761 39798
18995 -313341 100057 36381 -149890 -252658 218567 24791 105898 319535 253869 -157882
18984 -208627 -149617 96365 97005 9186 -402993 -91801 -18732 -559342 119662 133921 -94222
18972 -158255 -311013 135612 -228897 134694 -418026 -83371 -89017 193624 57126 -5394 -227346
18961 -227346 84057 48728 -14676 -51406 -161141 -221767 -306453 237204 -3434 -365900 252685
18949 -19593 -150765 -189140 -126420 -35285 -191927 -57716 -191052 -293166 153156 105811 -55004
18937 198281 28687 18012 6433 193142 339320 73688 -32936 -134775 -206402 -124209 -378648
$$ packed form
19019b33982i2029A80243J15648D1843J18234e8048b0974F0348d0325A22460a68163
19007c0861j12736G708R8322K6648a57070J4819A49414c72609G3288d61761C9798
18995c13341A00057C6381a49890j02768B18567B4791Q1107K13637o5666a57882
18984b08627N9010I6365O40I186d02993i1801a8732n40610A19662J4259i4222
18972a58255j52758A35612b28897A34694d18026h3371n646A93624E7126e394k21952
18961b27346H4057l5329a4676l6730j09735o0626q4686B37204c434l62466B52685
18949a9593j31172l8375O2720c5285j56642e7716j33336j02114A53156m7345e5004
18937A98281B8687j0675F433J86709J46178G3688c2936j01839p1627Q2193k54439
$$ plain form
18926 -378648 25293 25252 -59303 33266 -191223 39261 -126660 211199 42018 248558 -111956
18914 14728 197482 32597 -131873 -315148 -291945 -92436 -59457 -102029 -116126 -235638 438488
18902 41804 -85564 -234033 52031 -109318 -4661 67297 110781 115488 317166 69274 -284934
18890 -19189 -119625 -446257 -15054 15235 -174709 -42780 219987 53732 -115472 -192598 -62535
18878 -317543 155007 82836 -162618 -244129 120933 -166324 -58826 267617 47869 94270
18868 94270 -114645 -203630 -328992 109575 -138097 -213307 12433 -233751 -207042 -28848 -49873
18857 -49873 -127545 -55720 -144652 -50000 130626 257492 201814 -15148 132167 -300905 -75259
18845 -168204 142384 -196071 -53633 -136838 -119547 682 -19927 113291 -92574 -175502 -216531
$$ packed form
18926c78648B5293m1e9303C3266a91223C9261a26660B11199D2018K06540a11956
18914A4728J82754C2597a31873j83275K3203i2436L2979m2572j4097j19512D38488
18902D1804h5564j48469E2031a09318d661F7297M3484M707K01678F9274b84934
18890a9189j00436l26632a5054A5235a74709d2780B19987E3732a15472p7126f2535
18878c17543A55007p2171a62618q1511A20933a66324e8826B67617D7869M6401
18868I4270a14645q8985j25362A09575a38097p5210A2433b33751K6709b8848k1025
18857d9873p7672e5720q8932e0000A30626J26866n5678a5148A32167c00905g5259
18845a68204A42384a96071e3633q3205J7291F82a9927A13291i2574q2928m1029
$$ plain form
18834 -216531 61671 -261072 -113611 177390 -98718 67924 -34857 30458 -114874 -59265 135968
18822 -94785 -234073 -25913 322661 -138106 -58692 399580 48248 82845 101197 119986 -86902
18810 315403 79088 -112767 502006 85206 43764 87999 209042 -36351 -234447 108219
18799 61316 291645 -103520 78693 -226780 -23030 -37143 -40914 113949 -180274 15940 54824
18788 54824 144329 -209597 118666 -98248 -61398 18523 16263 14718 -139878 -213616 -206603 -323861
18776 -323861 -218623 -26253 216413 70018 -90642 -252806 37808 -337 -139302 -296652 -127906
18764 -173196 27783 158156 -155472 139410 46542 123469 -181965 -94919 -89052 -51495 -1690
18752 -51541 -44174 -37936 96475 46920 60408 54795 -147767 -83526 34588 -113000 -6695 -185842
$$ packed form
18834b16531F1671b61072a13611A77390i8718F7924c4857C0458a14874N5609A35968
18822i4785j39288b5913C22661a38106e8692C99580D8248L4597J8352J8789h6902
18810C15403G9088a12767E02006H5206m1442M4235J21043c6351j98096A08219
18799F1316K30329a03520G8693b26780b3030j4113l771A13949a80274A5940L8884
18788E4824Q9505b09597A18666i8248L6850A8523k260j545a39878p3738P013j17258
18776c23861J05238b6253B16413G0018i0642j62164C7808c37j38965j57350a27906
18764a73196B7783J30373a55472A39410D6542P6927a81965Q7046N867L7557a690
18752e1541P367O238I6475D6920J3488n613a47767O4241C4588a13000f695j79147
$$ plain form
18740 -185842 -53800 -21883 -111147 244351 233661 815 -109578 -209875 -63786 43893 99576
18729 99576 -58832 -95308 -43149 -118707 -138449 172530 119810 -61273 -303504 109387 323749
18718 323749 -143875 -134310 -67184 69050 81006 -83537 -157171 -86500 -376746 80706 -201326
18706 159482 5442 -153196 -182189 28886 -35292 -207141 -53085 -337009 -16636 184756 -128863
18694 -13121 112593 -114228 213232 86131 -227178 57427 49698 14549 -159405 -325001 -250882
18683 -250882 -237093 -62984 -224771 247565 -50121 -85458 -2836 -110550 -162729 -172898 -31705
18671 120487 212233 -159453 290881 -8084 181923 -165056 76057 -95708 -408230 -9868 -252747
18660 -252747 121222 -97859 146052 131 -123557 -171668 -55123 83051 175881 41082 -89819
$$ packed form
18740a85842e3800b1883q9264B44351j0690H15a09578j00297f3786D3893N5683
18729I9576e8832l6476d3149p5558j9742A72530n2720f1273k42231A09387K14362
18718C23749a43875R565O7126F9050J1956h3537p3634P0671k90246H0706b01326
18706A59482E442a53196k8993B8886c5292j71849e3085k83924a6636A84756a28863
18694a3121A12593a14228B13232H6131b27178E7427p729A4549a59405j65596P4119
18683b50882J3789f2984j61787B47565e0121l5337b836j07714n2179j0169c1705
18671A20487R1746a59453B90881h084A81923a65056G6057i5708l12522i868k42879
18660b52747A21222i7859A46052A31a23557m8111e5123H3051R2830D1082h9819
$$ plain form
18648 -37616 -65151 27797 311951 -57928 -276781 -280375 14606 -139329 -336694 301792 61778
18636 -61145 -111671 38335 -32160 -256255 -38905 171681 17285 70551 -169911 299729 -92344
18624 -196333 -12724 -194123 -350257 33915 417580 150025 227116 -58786 15014 -259726
18613 -75593 -103554 50512 64408 -323100 165741 -45037 -51823 -271575 -144880 50209 -75841
18601 -85038 -98977 -24239 -155453 -157616 -72483 -129163 -48063 531114 -50175 -411763 -99589
18589 -100333 125903 -18134 -180074 92184 161851 -173693 -192069 -244295 -177133 -119455 -31250
18577 -199659 -230105 -152517 -74612 -99716 -256972 202550 195776 -198647 -297990 -395831 326918
18565 234586 144067 56571 -173221 -425182 -47990 51445 -666 -343220 299228 9410 -218707
$$ packed form
18648c7616k7535B7797K84154e7928k18853l594A4606a39329j97365C01792F1778
18636f1145n0526C8335c2160k24095c8905A71681A7285N3266a69911B99729i2344
18624a96333a2724j81399j56134C3915L83665A50025P7091e8786A5014b59726
18613g5593k7961E0512J3896c23100A65741d5037o786k19752J26695E0209g5841
18601h5038j3939b4239j31214k163g2483n6680d8063E31114e0175l61588i9589
18589a00333A25903a8134j61940I2184O9667a73693j8376n2226O7162N7678c1250
18577a99659l0446P7588g4612k5104j57256B02550o774a98647r9343r7841C26918
18565B34586r0519E6571a73221k51961d7990E1445f66l42554B99228I410b18707
$$ plain form
18553 48297 23705 -149904 -131430 -165110 115326 -172370 -234476 -214942 -129894 39464 107345
18542 107345 12219 250033 -15235 -174108 128339 -20507 2733 -216560 11470 77970 75118
18531 75118 -241025 7394 -58463 90771 -192417 -75775 -131076 -368926 111320 92496 131075
18520 131075 143247 -231578 -132362 249509 55287 -396736 115463 -48226 31359 2148 -437005
18508 -155004 -46094 -192034 -166215 -58133 -138036 100303 47274 -199971 23083 224421 72499
18496 429941 177727 -30906 18875 134406 70259 61887 -208269 -21334 -148768 -464758 -114921
18484 58436 53603 196875 -187040 28677 -57959 -53996 113813 -154275 -165627 64930 54927
18473 54927 5650 -96052 -27629 -225995 -441279 -194427 156731 -147386 -149317 -18369 135738
$$ packed form
18553D8297B3705a49904J8474l3680A15326a72370o2106J9534Q5048C9464O7881
18542A07345A2219K37814a5235j58873A28339b0507B733b16560A1470O6500k852
18531G5118b41025G394e8463I0771a92417g5775n5301k37850A11320j8824L8579
18520A31075J2172b31578R9216B49509E5287c96736A15463d8226C1359B148d37005
18508a55004d6094j45940K5819e8133p9903A00303D7274a99971B3083K01338G2499
18496D29941A77727c0906A8875J15531o4147q372b08269b1334j27434l15990a14921
18484E8436m833J43272a87040B8677e7959L963A13813a54275j1352F4930j0003
18473E4927E650i6052b7629j98366k15284a94427A56731a47386j931a8369A35738
$$ plain form
18461 -67026 -14789 -102568 -219650 227043 -70775 83208 -91078 -86863 -210028 -164906 -118632
18450 -118632 180696 -125359 -151672 -285031 -87762 -222068 -172638 -143790 -303728 -68324
18439 208941 -178238 -311320 205108 251364 -89547 95611 121028 14460 40315 70611 -90911
18427 199808 -380442 -59177 42085 105201 -125054 -62631 -841 60063 -49708 231268 -143179
18415 21727 134946 -260232 138801 176405 210258 139586 -96657 4654 -64733 -4041 130006
18403 91678 172955 -349040 146041 -95752 68826 -311276 -60933 -276174 -195172 -46234 -206174
18392 -206174 -81877 79385 -16433 -282154 -109643 103379 -121305 75676 185609 -138067
18381 147755 57736 -572107 -340376 -43064 -175682 -158622 -156493 21801 -23606 160102 -330394
$$ packed form
18461f7026a4789q7779j17082B27043g0775H3208i1078M215j23165M5122M6274
18450a18632A80696a25359k6313j33359h7762j34306M9430K8848j59938f8324
18439B08941a78238j33082B05108M6256h9547I5611K5417A4460K5855L0296i0911
18427A99808c80442e9177D2085O3116a25054O2423h41F0063d9708B31268a43179
18415B1727J13219b60232A38801L7604L3853p0672i6657D654f4733d041A30006
18403I1678Q1277c49040A46041i5752F8826c11276f0933k15241Q1002d6234j59940
18392b06174h1877G9385a6433k65721a09643A03379a21305G5676J09933a38067
18381A47755E7736e72107K31731d3064j32618J7060K129B1801b3606A60102c30394
$$ plain form
18369 30166 148182 6543 -2565 37610 -141492 159654 -113917 -50600 194354 -49056 387796
18357 147240 94318 263561 88293 -959 -11479 -128546 -79519 -118580 -426271 -182369 -197800
18346 -197800 -10591 190085 -223201 86796 60737 -144509 -26953 6542 -120604 -84561 -25942
18334 458818 135923 62648 -197820 -60355 -7611 -119878 -40564 -114041 -84163 -168397 -232599
18323 -232599 -180618 -161541 117724 -207471 -28694 -17820 -4763 -336501 -29081 -239794 -226968
18312 -226968 -311443 -212945 147952 -163452 -154380 337190 -51498 -19350 868 -45795 -75914
18301 -75914 8832 -51889 226210 -176619 19787 -206175 -24212 76998 -252228 -233955 135043
18289 -298528 -243413 -123613 112357 -204776 -137544 -65960 226426 -104545 -256710 -108091
$$ packed form
18369C0166J18016F543b565C7610a41492A59654a13917e0600A94354d9056C87796
18357A47240n2922J69243H8293i59j0520j17067M9027l9061l07691a82369j5431
18346a97800a0591A90085b23201H6796k6059a44509b6953F542a20604L6043b5942
18334D58818A35923F2648a97820f0355g611j12267d0564p3477K9878q4234o4202
18323b32599N1981J9077A17724b07471b8694J0874d763l31738b9081k10713J2826
18312b26968q4475R8498A47952a63452R072C37190e1498a9350H68d5795l0119
18301g5914H832e1889B26210a76619A9787b06175b4212G6998b52228J8273A35043
18289b98528N5115J19800A12357b04776O7232f5960B26426a04545j52165a08091
$$ plain form
18278 -424053 93823 98032 176287 156480 -96922 -118881 248127 52564 -31540 -71266 124086
18266 -69914 -83801 34565 37682 -61444 73470 45783 -57557 197806 163775 -66758 55290 81960
18254 81960 230690 33930 -35817 262676 -137945 -179127 145230 -255012 -30124 -89461 -133052
18243 -133052 -25977 133771 48716 -115928 -183009 -63488 -251636 -224769 60094 35316 186490
18232 186490 -6295 -204245 -137463 -40096 -44649 5310 -35457 66817 130888 -198533 -7902 -221890
18220 -221890 -252200 -71397 217426 401141 -68468 -1420 -143015 20340 30387 -227583 74324
18208 -25747 311618 -78416 -313689 -61356 -223864 -208356 77571 -235828 -923 -240510 -89841
18196 -42649 -118651 -109946 -45246 165478 -115595 214923 191667 -173728 -21556 -14263 -173414
$$ packed form
18278d24053I3823M209P8255j9807i6922k1959B48127E2564c1540l9726A24086
18266f9914j3887C4565L117f1444G3470k7687e7557A97806l4031f6758E5290K6670
18254H1960J48730C3930c5817B62676a37945m1182A45230b55012c0124n9337m3591
18243a33052b5977A33771D8716a15928o7081f3488j88148K6867F0094k4778J51174
18232A86490f295j97950O6782d0096m553E310c5457F6817O4071a98533g902k13988
18220b21890l0310g1397B17426J83715f8468a420j41595B0340J0047b27583G4324
18208b5747C11618g8416k35273f1356j62508J5508G7571b35828i23k39587h9841
18196d2649p6002Q705d5246A65478a15595B14923k3256a73728b1556P293j59151
$$ plain form
18185 -173414 45170 255634 -119850 -281862 348383 -104312 -146670 -82457 13506 114584
18175 114584 -47791 159271 -119532 -62339 11981 94330 -230878 61394 -444809 -125320
18164 59279 -111807 203021 -91511 -259498 -241629 -69123 78119 -307187 -216064 -158658 -466928
18153 -466928 64014 -136493 161056 111588 -23458 3872 -162018 33433 30074 147010 -121583
18141 214115 153552 -16085 68589 -69488 157585 -263164 -38765 67141 -98279 -43638 -268515
18130 -268515 -77281 136993 -69490 -105969 83927 84283 -143489 -207900 -106567 198684 149789
18119 149789 -388999 103910 -686137 -52368 43138 -17080 52017 164897 -405298 38340
18108 113370 -159579 -42829 167683 -211071 -105525 208814 -268487 -57642 62534 -390344
$$ packed form
18185a73414D5170K10464a19850j62012C48383a04312m2358O4213A3506J01078
18175A14584d7791A59271a19532N7193A1981Q2349b30878F1394d44809a25320
18164E9279a11807B03021i1511j67987J7869f9123G8119c07187R1123N7406l08270
18153d66928F4014a36493A61056m9468b3458C872a62018C3433l359J16936a21583
18141B14115o0563a6085F8589f9488A57585b63164c8765F7141i8279d3638k24877
18130b68515g7281A36993f9490l6479H3927L56a43489o4411J01333A98684m8895
18119A49789c88999A03910f86137e2368D3138a7080E2017J12880d05298C8340
18108A13370a59579d2829A67683b11071a05525B08814b68487e7642F2534c90344
$$ plain form
18097 -16927 -54283 -425301 -44794 -120203 -172788 -30080 -179172 169155 -109783 -62989 335302
18085 -216417 -99520 83259 -57420 57224 132762 -298131 428660 112007 -151491 367162
18074 -126405 144227 107600 668 144145 -62561 356595 -505094 212385 215424 -83868 -196386
18063 -196386 -72310 -77261 75649 -15164 7777 -235680 -57321 -101338 -421371 181500 77067
18051 103196 -106912 -57416 177854 -128238 -54946 -36364 -203687 122108 -87103 51775
18040 230727 185837 -189595 -61940 108099 -34197 66031 23351 245969 94847 -144542 -28226
18028 -65427 -193728 -386687 -9949 181874 -169916 305576 16582 130131 52135 291062
18018 291062 55491 -4136 -21496 -221419 41929 305676 70331 213126 3825 35345 389891
$$ packed form
18097a6927l7356l71018d4794p5409n2585c0080j49092A69155a09783M6794C35302
18085b16417i9520H3259e7420E7224P5538b98131D28660A12007a51491C67162
18074a26405A44227l6627F68J43477f2561C56595e05094B12385L039h3868j12518
18063a96386g2310m951G5649a5164G777b35680e7321m4017l20033A81500G7067
18051A03196a06912M9496A77854a28238e4946J8582j67323A22108h7103E1775
18040B30727m4890a89595f1940A08099c4197F6031B3351K22618I4847a44542b8226
18028f5427j28301j92959i949A81874a69916C05576A6582J13549E2135K38927
18018B91062E5491d136j7360j99923D1929K63747G0331J42795C825L1520L54546
$$ plain form
18007 389891 -154932 41401 19613 265230 -249378 304559 -110620 -35695 -342591 271375
17996 -223748 -131826 399163 154692 138384 -256309 208403 108571 -323445 -482047 -135685
17985 137921 79839 125465 40411 -14166 38548 102480 36130 -1261 31707 102075 -421792
17973 -21847 -36368 377724 -435214 143251 -40766 -312957 -132338 -70039 -42540 3661 116275
17962 116275 -29429 -120738 -47359 -350765 8406 247486 -48598 212055 -186800 130072 -257898
17950 35179 -170634 -130813 328767 59813 -139390 -166646 -56384 57092 134525 -199353 -141212
17939 -141212 -76641 198892 -91798 110895 52826 -237063 -85773 118845 -404499 -239903
17929 -239903 -24820 316119 -156185 -167561 -4962 -117359 -60137 141714 -100909 -115580 85179
$$ packed form
18007C89891a54932D1401A9613K45617b49378C04559a10620c5695l06896B71375
17996b23748R1922C99163A54692j6308b56309B08403r9832c23445j58602a35685
17985A37921n8082M5626D0411a4166C8548O3932C6130a261C1707P0368d21792
17973b1847j4521C77724d35214A43251d0766k72191a32338O2299K7499C661J12614
17962A16275b9429r1309d7359l03406H406K39080d8598B12055a86800A30072b57898
17950C5179a70634L9821C28767E9813a39390k7256e6384E7092P7433a99353N8141
17939a41212O4571A98892i1798A10895E2826b37063h5773A18845d04499J64596
17929b39903b4820C16119a56185j1376d962j12397N7222A41714a00909j4671H5179
$$ plain form
17917 -30480 -242755 -238390 -352025 239578 157493 64114 268978 22392 -135006 -240879 100171
17905 -52068 156666 -144914 87933 -107398 159161 -113105 243067 -311837 -39459 92412
17894 -331778 138768 256243 -133537 -153652 -319563 -154445 70179 -299094 -106845 -127231
17884 -127231 -14663 102203 114477 246893 43708 73931 55232 -263246 -108550 51629 92643
17873 92643 -125830 66815 -96905 -284962 323472 -126478 46974 68132 157776 -224087 123331
17861 123971 -103960 -59282 -55050 -180898 -332585 214003 -16130 -153326 309514 -37059
17850 -137879 108637 96031 215325 158748 65745 121875 238161 -3124 276425 -26796 -27672
17839 -27672 -197585 60876 30517 313615 -209470 -52258 -56104 98859 -131608 -250896 -29018
$$ packed form
17917c0480k12275M365j13635B39578q2085F4114K04864B2392a35006j05873A00171
17905e2068A56666a44914H7933a07398A59161a13105B43067c11837c9459I2412
17894c31778A38768J17475a33537k0115j65911a54445G0179b99094a06845k0386
17884a27231a4663A02203J2274J32416D3708L0223j8699b63246a08550E1629M1014
17873I2643a25830F6815i6905j88057C23472a26478D6974K1158Q9644b24087A23331
17861A23971a03960M4678M232j25848j51687B14003a6130j37196C09514c7059
17850a37879A08637j2606J19294n6577F5745N6130J16286c124B76425b6796q76
17839b7672j69913F0876l0359K83098b09470e2258l846I8859a31608j19288b9018
$$ plain form
17827 -127745 131029 -147948 206820 -22711 -65275 -18142 218592 91479 283005 -102670
17816 -75738 -237295 67129 234697 107594 219155 -362640 33218 -289401 230659 -186519
17805 68584 -12980 -153074 -41192 134130 -480724 101226 -32563 -33691 -20138 -2427 19301
17793 -154458 65594 4743 171582 -105411 105061 -1700 162574 -220470 185742 57377 -45293
17781 -15110 -100534 -173009 -60366 127064 424745 -48531 50398 35020 -139073 -263091 138466
17769 -210330 -233998 184176 76468 83724 137086 308364 204364 205363 -261143 -162358 212484
17757 -1861 -35097 -133272 -163865 138685 -36801 -21757 -63319 -196306 18135 42364 203749
17746 203749 -51410 305032 89328 265029 180634 -335992 -54949 -171107 -161904 -261002 -271157
$$ packed form
17827a27745A31029a47948B06820b2711m2564a8142B18592I1479J91526a02670
17816g5738j61557F7129J67568A07594J11561c62640C3218b89401B30659a86519
17805F8584a2980j40094d1192A34130d80724A01226c2563j128J3553b427A9301
17793a54458F5594D743J66839a05411A05061a700A62574b20470A85742E7377d5293
17781a5110q5424p2475f0366A27064K97681d8531E0398j5378a39073j24018A38466
17769b10330k3668A84176G6468P256N3362J71278j04000R99b61143R8785B12484
17757a861l3236r8175l0593A38685c6801J5044m1562j32987A8135K4229J61385
17746B03749e1410C05032H9328J75701q4395c35992e4949j16158R203r9098j0155
$$ plain form
17735 -271157 57316 52149 194146 -106361 -32725 -69825 203284 -317536 177239 161279 146419
17724 146419 -11542 41352 -128701 26718 153001 -125168 69059 93992 -178409 -187781 222346
17712 136996 -147134 55561 335939 159027 -294593 -443224 59931 13145 332071 23133
17701 289760 -133474 119918 -124558 232984 -8076 12974 356359 396868 71453 -218010
17690 -125694 -58522 116338 26223 138698 213514 -10925 185358 201057 -260097 87958 6174
17678 144209 -58739 227777 -161641 125027 124692 241276 53180 130606 -159496 187066 -155758
17666 -261593 -65500 -32051 579683 280732 -51484 142292 234704 -6842 -150653 58313 8659
17654 270438 -482315 -119040 -20759 36254 -68915 -248897 161651 142978 39791 -14043 141084
$$ packed form
17735b71157E7316n167J41997a06361c2725l7100B03284c17536A77239j5960j4860
17724A46419a1542D1352a28701B6718J26283a25168F9059K4933a78409r372B22346
17712A36996a47134E5561K80378A59027b94593j48631E9931A3145L18926B3133
17701B89760a33474A19918a24558B32984h076A2974L43385M0509G1453b18010
17690a25694e8522A16338B6223J12475P4816a0925A85358J5699b60097H7958F174
17678A44209e8739B27777a61641A25027l35J16584E3180P7426a59496A87066a55758
17666b61593f5500c2051E79683B80732e1484A42292R2412f842j43811E8313H659
17654B70438d82315a19040b0759C6254f8915j79982A61651j8673C9791a4043A41084
$$ plain form
17642 339295 246299 -228932 -233460 -30695 -54864 -84187 -127976 -138672 104520 401786 -117668
17630 9304 -63670 90194 -1887 -51811 -95502 -17104 -201650 375871 119160 -97829 89512
17618 250061 -21799 104713 -209394 -181404 -56244 102145 232666 100717 -133537 -215255
17608 -215255 -122445 -74044 -323416 211675 -49631 83438 -182240 -422549 -118607 -22476
17597 35017 131944 214161 126763 12237 -36394 111562 -159826 315530 28876 -57824 200799
17585 -167824 267946 -146932 -43478 -198406 47998 10574 -215832 -166541 172727 -48005
17574 601881 75068 -162970 -27934 -87058 27067 -20351 -99073 -253126 222509 68100 22091
17562 -237099 258732 141661 -177377 -212718 151420 381193 120550 59575 221759 -8755
$$ packed form
17642C39295r2996b28932m528c0695k4169k9323m3789j0696A04520K97266a17668
17630I304f3670I0194a887m9924m3691a7104j84546C75871A19160i7829H9512
17618B50061b1799A04713b09394K7990e6244A02145J30521A00717a33537q1718
17608b15255R2810M8401k49372B11675d9631H3438a82240k40309a18607b2476
17597C5017R6927Q2217q7398A2237c6394A11562a59826C15530B8876e7824B00799
17585a67824B67946a46932d3478j54928D7998A0574b15832M9291A72727d8005
17574F01881G5068a62970b7934n9124B7067b0351p8722j54053B22509F8100B2091
17562b37099B58732j17071a77377l5341A51420K29773A20550E9575J62184h755
$$ plain form
17551 -39336 222628 -458283 117489 26890 195386 209256 64928 127159 -8740 159570 204638
17540 204638 210942 214373 110013 147800 -221705 382023 -101261 107391 -260653 157580
17529 107053 -138163 93596 82299 -127313 -3732 -218023 235753 367105 -133947 201594
17518 48398 -134333 35883 83700 100954 178120 -77819 -19298 -6053 -13731 77056 160063 337700
17506 337700 129104 56648 285052 -126004 88056 190343 84941 208808 204190 -8657 57409
17494 37176 -74048 127026 25783 153028 216748 299737 88626 196237 297166 -164629 214598
17482 -53396 -116440 -47268 -11823 269752 148672 102916 503906 341912 33458 -37482 375499
17470 108324 36806 168583 -5460 118264 186537 288464 -15763 408209 255873 133289
$$ packed form
17551c9336B22628d58283A17489B6890J68496J3870F4928O2231h740A59570M5068
17540B04638O304L431j04360L7787b21705C82023a01261A07391b60653A57580
17529A07053a38163I3596j1297a27313c732k14291B35753J31352a33947B01594
17518D8398a34333C5883M7817J7254P7166g7819a9298f053p678G7056Q3007J77637
17506C37700A29104E6648K28404a26004H8056J02287H4941J23867m618h657E7409
17494C7176g4048A27026B5783J27245O3720Q2989H8626J07611J00929a64629B14598
17482e3396o3044d7268a1823B69752j21080m5756M00990j61994C3458c7482C75499
17470A08324C6806J31777e460A18264O8273J01927a5763D08209j52336j22584
$$ plain form
17460 133289 480153 93862 -54308 469127 55336 -42438 184143 -3552 139611 162146 18967
17448 266077 -50126 387305 421129 60633 406705 -36257 283754 -323999 194371 377535
17438 377535 -48504 325527 588467 140167 299491 403708 141760 -256778 3244 76551
17428 76551 146094 -38567 324456 278092 267223 239575 233985 290766 171617 531380 254791
17416 121202 536303 344704 162433 142674 305388 241247 402370 398146 179095 -85290
17405 73263 -205445 39509 137781 -110402 -221744 -199978 90928 222695 -26267 241037 427991
17394 427991 373599 107303 91284 130966 236459 40016 -57436 -36436 61226 304597 85429
17382 7151 266433 54401 -45378 28550 213449 288534 102168 -3358 306937 393539 93409
$$ packed form
17460A33289L46864I3862e4308D69127E5336d2438A84143c552A39611K2535A8967
17448B66077e0126C87305L3824F0633L46072c6257B83754c23999A94371J83164
17438C77535d8504C25527K62940A40167J59324J04217A41760b56778C244P3307
17428G6551O9543c8567C24456m6364j0869k7648n590N6781j19149L59763B54791
17416A21202M15101j91599A62433j9759J62714o4141J61123m224A79095h5290
17405G3263b05445C9509R8272a10402j11342K1766I0928J31767b6267B41037J86954
17394D27991n4392A07303j6019L9682J05493D0016e7436K1000F1226K43371H5429
17382G151K59282E4401d5378B8550J84899P5085A02168c358C06937Q6602I3409
$$ plain form
17370 236388 -77670 -176661 -19245 335461 316838 -42765 390967 286482 185782 -99677 -146123
17359 -146123 -55690 133821 15472 9050 174803 -285874 64961 -14791 236683 173035 97274
17348 97274 235164 274971 202724 -102585 152135 203504 366029 254695 362933 98530
17337 351231 232836 123893 149174 185177 182644 170946 -57719 215045 620251 323284 176475
17326 176475 400495 -262701 57956 37403 328384 135186 -88417 295957 44125 404575
17316 404575 13945 450534 -357798 -61341 327974 100560 -18955 513036 275871 114848
17305 492490 84154 354421 82140 -223160 -134650 41478 28493 1759 300438 707621 166374
17293 112382 326711 90511 328794 59779 204182 192550 115688 -255129 390467 -73102
$$ packed form
17370B36388g7670r8991a9245C35461j8623d2765C90967j04485j00700i9677m6446
17359a46123e5690A33821A5472o422J65753b85874F4961a4791B36683o3648p5761
17348I7274J37890L9807p2247a02585A52135N1369J62525j11334J08238I8530
17337C51231j18395j08943K5281L6003k533j1698e7719B15045M05206k96967j46809
17326A76475K24020b62701E7956k0553K90981A35186h8417B95957D4125L60450
17316D04575A3945M36589c57798f1341C27974A00560a8955E13036k37165A14848
17305D92490H4154K70267H2140b23160Q8510D1478j2985A759K98679M07183A66374
17293A12382K14329I0511K38283E9779J44403j1632p6862b55129C90467g3102
$$ plain form
17282 -60232 -32432 210779 27942 64934 1312 377596 -40675 -21253 147863 395736 250376
17271 250376 -163662 -84660 185111 132327 119822 -204941 242036 443647 -2968 28463 256900
17260 256900 508518 37824 27795 284673 239075 -356331 56703 130617 254315 281014 19294
17248 33265 87391 293424 395953 -30220 -61570 130711 427663 394457 183062 560261
17238 560261 189835 521345 226114 -192943 118314 174650 86425 185021 297529 181462
17228 181462 374393 56069 -45939 365687 134944 313508 37344 423680 271917 52429
17217 311454 182357 140181 111424 50628 469334 -40581 -20807 301463 212451 637417 418710
17206 418710 130687 41940 372537 334894 368261 323086 -3661 233707 105848 -48924 292691
$$ packed form
17282f0232K7800B10779B7942L6992A312L76284d0675J9422A47863K47873j45360
17271B50376a63662P9002A85111n2784j2505b04941B42036K01611b968B8463K28437
17260B56900K51618C7824j0029K56878m5598c56331E6703P3914J23698K6699A9294
17248C3265N4126K06033J02529c0220l1350A30711K96952l3206A83062L77199
17238E60261A89835L31510B26114a92943A18314N6336H6425R8596J12508j16067
17228A81462J92931E6069d5939C65687A34944J78564C7344L86336j51763E2429
17217C11454j29097m2176k8757E0628M18706d0581J9774C01463q9012M24966k18707
17206D18710A30687D1940L30597l7643L3367m5175c661B33707A05848d8924B92691
$$ plain form
17194 267100 428237 -224074 476855 330070 107098 354146 259745 242061 488582 257762
17184 257762 436007 253257 164127 188269 345469 487242 185239 632995 261409 384036
17174 384036 269405 292693 45516 191621 272108 317182 502031 434216 303369 307414 319557
17163 319557 379312 200733 694148 760252 12395 346919 445934 -175089 21639 412474
17153 412474 216092 112330 576765 248144 289795 -19579 161611 15636 297789 -72403
17142 103330 242156 343919 402849 391077 64603 107048 353106 77733 345615 597771
17132 597771 121065 195086 537 113280 398855 422469 312285 194876 496430 168584
17121 295123 572045 138677 494661 366878 462620 82964 -22625 526284 449756 415651
$$ packed form
17194B67100J61137b24074D76855j46785A07098K47048r4401j7684K46521k30820
17184B57762J78245j82750q9130K4142J57200J41773A85239M47756B61409J22627
17174C84036j14631K3288D5516J46105Q0487M5074J84849o7815j30847M045J2143
17163C19557N9755j78579M93415O6104A2395L34524R9015a75089B1639L90835
17153D12474j96382j03762M64435B48144M1651a9579A61611A5636K82153g2403
17142A03330J38826J01763N8930j1772F4603M2445K46058G7733K67882K52156
17132E97771A21065P4021E37J12743K85575K3614j10184j17409L01554A68584
17121B95123K76922A38677L55984j27783R5742H2964b2625E26284p6528l4105
$$ plain form
17111 415651 381625 550132 319417 358902 379584 435943 345254 797176 665048 590885 236708
17099 290459 73571 479105 346254 404352 765675 240885 138715 211160 440863 358970
17089 358970 113607 196198 439892 177118 353109 -15065 223305 441082 465136 402040
17079 402040 381609 494990 589254 527757 154148 542165 714611 528004 506355 223318
17068 354376 423027 613778 483107 375377 170024 420851 499426 528112 295803 594832
17058 594832 191417 498235 536607 397431 255374 572488 281102 380065 601775 708560
17048 708560 592158 496496 295821 327840 413052 720791 451586 582197 469242 626837
17038 626837 692946 392730 647588 605097 512557 549071 533557 411050 550576 727287
$$ packed form
17111D15651l4026J68507k30715L9485K0682N6359r0689M51922j32128p4163B36708
17099B90459G3571M05534j32851N8098L61323B40885j02170P2445K29703q1893
17089C58970A13607Q2591K43694A77118J75991a5065B23305K17777K4054o3096
17079D02040k0431J13381R4264o1497A54148L88017J72446j86607k1649B23318
17068C54376O8651J90751j30671j07730A70024K50827P8575K8686k32309K99029
17058E94832A91417L06818L8372j39176j42057L17114B81102R8963K21710J06785
17048G08560j16402r5662k00675L2019Q5212L07739k69205J30611j12955J57595
17038F26837O6109l00216K54858m2491r2540L6514j5514j22507J39526J76711
$$ plain form
17028 727287 548483 474002 705621 517036 489302 543827 413078 693559 472069 512779
17018 512779 664758 576033 772368 727916 161517 611874 889012 735040 1014245 256763
17007 581595 622454 518992 1012715 485201 633481 973036 687807 866643 457121 431423
16997 431423 373749 536298 630019 738570 530379 593013 952459 659631 642968 475136
16987 475136 420246 1095691 771008 788353 727233 850512 804448 726611 1163258 515754
16976 1048297 661164 868045 1043780 825926 1087717 853542 835756 806374 1070304 977828
16966 977828 1164552 1059485 803581 754053 980359 1007581 1076458 937720 884407 869405
16956 869405 753038 1258769 920380 879885 1234622 959727 955145 1091636 1243785 1310353
$$ packed form
17028G27287j78804p4481K31619j88585k7734N4525j30749K80481k21490M0710
17018E12779J51979q8725J96335m4452A61517M50357K77138j53972K79205B56763
17007E81595M0859j03462M93723D85201J48280L39555k85229J78836m09522k5698
16997D31423n7674J62549R3721J08551k08191O2634L59446k92828j6663j67832
16987D75136n4890O75445l24683J7345o1120J23279m6064p7837M36647E15754
16976A048297l87133K06881J75735k17854K61791k34175j7786k9382K63930r2476
16966I77828J86724j05067k55904m9528K26306K7222O8877j38738n3313j5002
16956H69405j16367N05731l38389m0495L54737k74895m582J36491J52149O6568
$$ plain form
16946 1310353 1226333 1132045 1255998 875158 964524 1365800 1132369 1313611 1165175 1180570
16936 1180570 1282383 985350 1157949 995237 1468275 1568158 1542613 1157200 1393878 1476804
16926 1476804 1428932 1019536 1699333 1341429 1280911 1193739 1076952 1538547 1329900 1688478
16916 1688478 1456830 1536184 1213842 1943223 1460115 1464390 1432547 1454376 1794072 1882230
16906 1882230 1433327 1621304 1770010 1479271 1602103 1777190 1740895 1805354 1528762 1785537
16896 1785537 1721207 1556675 2065313 1742403 1959434 2098518 1763611 2007480 2028850 1874371
16886 1874371 2077443 1845815 1902723 2087122 2138230 2449305 2180632 2014032 2351871 2208090
16876 2208090 2068813 2117645 2046368 2369608 2384610 2306026 2371337 2202909 2817487 2246029
$$ packed form
16946A310353q4020r4288J23953l80840Q9366M01276k33431J81242j48436J5395
16936A180570J01813k97033J72599j62712M73038R9883k5545l85413K36678Q2926
16926A476804m7872m09396O79797l57904o0518q7172j16787M61595k08647L58578
16916A688478k31648P9354l22342P29381m83108M275l1843K1829L39696Q8158
16906A882230m48903J87977J48706k90739J22832J75087l6295O4459k76592K56775
16896A785537o4330j64532N08638l22910K17031J39084l34907K43869K1370j54479
16886A874371K03072k31628N6908J84399N1108L11075k68673j66600L37839j43781
16876B208090j39277M8832p1277L23240J5002p8584O5311j68428O14578n71458
$$ plain form
16866 2246029 2757865 2450295 2527022 2577520 2575469 2637863 2821584 2763650 2974795 2726380
16856 2726380 3186443 2717769 2728046 2813379 2916094 2915622 3304668 3432941 3401606 3005720
16846 3005720 3621718 3349314 3442257 3486418 2896297 3304982 3789989 3677154 4107810 3786365
16836 3786365 3869456 4130426 4038257 4158562 4053369 4204287 4295963 4141453 4604144 4391993
16826 4391993 4643258 4558434 4835773 4754569 4831342 5069425 4989893 4975750 5587675 5468660
16816 5468660 5321972 5528713 6016568 5769626 6058620 6222595 6282160 6470683 6453939 6485370
16806 6485370 7196660 7136480 7347270 7392282 7333667 7612680 7740606 8149383 8002483 8500150
16796 8500150 8507719 8769391 8962490 9125791 9615925 9750384 9935795 10357563 10732830 10722744
$$ packed form
16866B246029N11836l07570P6727N0498k051O2394J83721n7934K11145k48415
16856B726380M60063m68674J0277Q5333J02715m72L89046J28273l1335l95886
16846C005720O15998k72404R2943M4161n90121M08685M85007j12835M30656l21445
16836C786365Q3091K60970r2169J20305j05193J50918R1676j54510M62691k12151
16826D391993K51265q4824K77339q1204P6773K38083p9532j4143O11925j19015
16816E468660j46688K06741M87855k46942K88994J63975N9565J88523j6744L1431
16806F485370P11290o0180K10790M5012n8615K79013J27926M08777j46900M97667
16796H500150P569K61672J93099J63301M90134J34459J85411M21768L75267j0086
$$ plain form
16786 10722744 11048166 11089314 11774559 12166654 12260938 12890027 12896204 13563975 13693557 14507747
16776 14507747 14611941 15212134 15769761 16100739 17004983 17379524 17878892 18711295 19009812
16767 19009812 19783269 20505579 21085200 22207169 23098426 23575650 24767707 25784006 26397819
16758 26397819 27948080 28693675 30326764 31410350 32884905 34335220 35984392 37357897
16750 37357897 39217087 40949411 42977793 45627411 47782277 50250913 52735990 55833311
16742 55833311 58675094 61877573 65430289 69196353 72839921 77343563 81805084 86892787
16734 86892787 91771534 97534622 103000646 109562300 116360690 123199558 129874945 137149586
16726 137149586 144626566 151848919 159216056 166331144 172515023 178267150 183341098 187550960
$$ packed form
16786A0722744L25422M1148O85245L92095R4284O29089O177O67771J29582Q14190
16776A4507747J04194O00193N57627L30978R04244L74541M99368Q32403K98517
16767A9009812P73457P22310N79621J121969Q91257M77224J192057J016299O13813
16758B6397819J550261P45595J633089J083586J474555J450315J649172J373505
16750C7357897J859190J732324K028382K649618K154866K468636K485077L097321
16742E5833311K841783L202479L552716L766064L643568M503642M461521N087703
16734H6892787M878747N763088N466024O561654O798390O838868O675387P274641
16726A37149586P476980P222353P367137P115088O183879N752127N073948M209862
$$ plain form
16718 187550960 190274734 192074914 192566635 191600914 189341840 186149198 181745695 176413479
16710 176413479 170221517 163462249 156072997 148988706 141615999 134030664 126740447 119533475
16702 119533475 112436375 106009354 99902601 94023671 88573599 83421638 78161150 73658063
16694 73658063 69383904 65635931 62033223 58275614 55602516 52231096 49485572 46571380
16686 46571380 44549935 42207275 40458046 38341523 36479899 34291635 32884522 31296052
16678 31296052 30094658 28699328 27592281 26118134 25158337 24331768 23432381 22156924
16670 22156924 21201888 21005479 19946940 18991807 18309927 17702607 17105804 16581406 16021443
16661 16021443 15361337 14644321 14421730 13906984 13824662 13090679 12961765 12324479 11347247
$$ packed form
16718A87550960K723774J800180M91721r65721k259074l192642m403503n332216
16710A76413479o191962o759268p389252p084291p372707p585335p290217p206972
16702A19533475p097100o427021o106753n878930n450072n151961n260488m503087
16694G3658063m274159l747973l602708l757609k673098l371420k745524k914192
16686D6571380k021445k342660j749229k116523j861624k188264j407113j588470
16678C1296052j201394j395330j107047j474147r59797q26569q99387j275457
16670B2156924r55036j96409j058539r55133o81880o07320n96803n24398n59963
16661A6021443o60106p17016k22591n14746q2322p33983j28914o37286r77232
$$ plain form
16652 11347247 11428515 10883573 10915278 10485460 9977089 9723811 10032397 9660896 9158395 8852584
16642 8852584 8542453 8614961 8496603 7892099 7945125 7385376 7017999 7327141 7103481 6956985
16632 6956985 6659024 6968833 6217388 6541960 6235322 6016256 6000838 5734544 5692366 5562530
16622 5562530 5472043 5195272 5153417 5044033 5041306 4395093 4889648 4670816 4522539 4336460
16612 4336460 4265176 4634798 4120429 4126501 3831693 3859962 3761642 3660708 3619870 3982261
16602 3982261 3913865 3383396 3875296 3390905 3548648 3592141 3174841 3502699 3517604 3134695
16592 3134695 3248584 2927428 2634628 2988125 2905883 2791364 2733891 2841311 2615315 2763953
16582 2763953 2800549 2573250 2514976 2587375 2507148 2518208 2394219 2424759 2322199 2041369
$$ packed form
16652A1347247Q1268n44942L1705m29818n08371k53278L08586l71501n02501l05811
16642H852584l10131P2508j18358o04504N3026n59749l67377L09142k23660j46496
16632F956985k97961L09809p51445L24572l06638k19066j5418k66294m2178j29836
16622E562530r0487k76771m1855j09384k727o46213M94555k18832j48277j86079
16612D336460p1284L69622n14369O072k94808K8269r8320j00934m0838L62391
16602C982261o8396n30469M91900m84391J57743M3493m17300L27858J4905l82909
16592C134695J13889l21156k92800L53497q2242j14519n7473J07420k25996J48638
16582B763953L6596k27299n8274P2399q0227J1060j23989L0540j02560k80830
$$ plain form
16572 2041369 2140250 2506404 2097909 1965015 1956052 2243037 2300959 1825893 2092018 1840353
16562 1840353 1760245 1931527 1996491 2106042 1786322 1858663 1991226 1760380 1815028 2177622
16552 2177622 1726680 1683549 1701831 1736730 1693366 1459510 1571182 1646889 1307840 1445982
16542 1445982 1527535 1488287 1397076 1570154 1360365 1264169 1495171 1623458 1222056 1129596
16532 1129596 1290661 1533076 1281773 1221166 1038941 1430581 1135425 1285079 964861 1460608
16522 1460608 1094923 1343934 1027106 1169506 1338714 1027935 1155250 598948 1095664
16513 1095664 1172003 1160474 972311 795915 1094652 1178539 1226987 1035763 1026000 1023696 1071405
16502 1071405 960408 846319 872071 792055 915532 1048422 1009336 890528 1043548 1055211
$$ packed form
16572B041369R8881L66154m08495j32894q963K86985N7922m75066K66125k51665
16562A840353q0108J71282O4964J09551l19720P2341J32563k30846N4648L62594
16552B177622m50942m3131J8282L4899m3364k33856J11672P5707l39049J38142
16542A445982Q1553l9248r1211J73078k09789r6196K31002J28287m01402r2460
16532A129596J61065K42415k51303o0607j82225L91640k95156J49654l20218M95747
16522A460608l65685K49011l16828J42400J69208l10779J27315n56302M96716
16513A095664P6339j1529j88163j76396K98737Q3887M8448j91224r763k304M7709
16502A071405j10997j14089K5752q0016J23477J32890l9086j18808J53020J1663
$$ plain form
16492 1055211 783702 786859 887757 744682 712877 907209 763598 576405 816290 530732
16482 530732 1143075 917230 178571 584945 571495 419816 571021 650563 662946 659049
16472 659049 588401 746054 257163 435814 584294 426182 561387 657720 727403 879533
16462 879533 833825 532369 883029 568426 756323 776430 390469 558946 272972 414925
16452 414925 533619 707592 354911 548245 661698 306254 609307 289050 686469 488181
16442 488181 675040 643559 353390 541159 771408 360596 614212 458741 912107 355289
16431 509429 281090 660169 369588 300885 552057 423060 646425 122807 250547 642514
16421 642514 154158 352027 964287 524360 547581 164728 232495 363049 332659 630717
$$ packed form
16492A055211k71509L157J00898j43075l1805J94332j43611j87193K39885k85558
16482E30732O12343k25845A78571M06374j3450j51679J51205P9542J2383l897
16472F59049p0648J57653B57163J78651J48480j58112J35205R6333O9683J52130
16462H79533m5708l01456L50660l14603J87897K0107l85961J68477B72972J41953
16452D14925J18694J73973l52681J93334J13453C06254L03053B89050L97419j98288
16442D88181J86859l1481k90169J87769K30249C60596K53616j55471M53366C55289
16431E09429k28339L79079k90581o8703K51172j28997K23365A22807J27740L91967
16421F42514A54158J97869O12260m39927K3221A64728O7767J30554l0390K98058
$$ plain form
16411 630717 780932 676585 480173 637870 436478 336931 410391 515675 516527 111763
16400 799209 352867 560058 231056 567048 137348 440140 576392 263789 462879 467046
16390 467046 622135 299752 263718 547161 256460 240016 239182 233964 220190 167473 371172
16379 371172 223990 189677 276450 468507 330296 414625 411198 481495 319230 290681 340025
16368 340025 541972 441813 122634 235831 -25731 398637 493050 -161783 81521 323913
16358 323913 355029 336645 366339 149101 351439 287 63493 -64463 85528 287301 117972
16346 346921 132645 121863 381554 704529 281741 -24627 266432 239655 221324 10518
16335 186601 494867 51015 545257 121521 259064 -190078 262267 236148 180842 160534
$$ packed form
16411F30717J50215j04347j96412J57697k01392r9547P3460J05284Q52A11763
16400G99209C52867K07191B31056L35992A37348L02792J36252B63789J99090M167
16390D67046J55089B99752l6034K83443B56460j6444q34n218j3774n2717K03699
16379C71172j47182l4313Q6773J92057j38211Q4329l427P0297j62265k8549M9344
16368C40025K01947j00159A22634J13197b5731C98637R4413a61783H1521K42392
16358C23913L1116j8384K9694A49101K02338B87O3206f4463H5528K01773A17972
16346C46921A32645j0782K59691L22975B81741b4627B66432k6777j8331A0518
16335A86601L08266E1015M94242A21521J37543a90078B62267k6119n5306k0308
$$ plain form
16325 160534 351447 256306 -272795 105392 -79552 234675 270103 132376 387093 178299
16314 132869 23252 79004 301497 338072 -113775 23875 349399 463908 342962 263908
16304 263908 -179916 410281 579555 426806 187265 37936 50533 -6191 393582 158419
16293 138734 -61248 271671 288564 114279 4303 -113881 392913 272923 259330 -270808
16282 111527 276707 271041 -150565 233850 892 154777 72751 159998 204915 269701 76049
16270 200549 198167 273394 51124 98501 403196 393991 103059 296974 290444 -12012 67239
16258 425027 83270 53174 496134 3221 -18761 66181 14057 67112 105760 -310466 379046
16246 139266 54360 -126844 253629 151300 105134 315676 -58529 257734 112565 82992
$$ packed form
16325A60534J90913r5141b72795A05392g9552B34675L5428A32376K54717A78299
16314A32869B3252N5752K22493L6575a13775B3875L25524J14509j20946p9054
16304B63908a79916D10281J69274j52749A87265C7936J2597f191C93582A58419
16293A38734f1248B71671J6893A14279D303a13881C92913j19990j3593b70808
16282A11527J65180n666a50565B33850H92J53885G2751Q7247M4917O4786G6049
16270B00549k382P5227E1124M7377L04695r205A03059J93915o530a2012F7239
16258D25027H3270l0096M42960C221a8761F6181A4057N3055L8648c10466C79046
16246A39266E4360a26844B53629j02329m6166K10542e8529B57734A12565k9573
$$ plain form
16236 82992 144057 410163 136837 71712 369336 144426 126420 34806 418741 -117328
16225 -115703 -109815 -56371 38782 243001 -190273 95365 4010 146180 78165 271985 147104
16214 147104 -7213 -72574 400134 468457 3471 557612 281980 -9407 -33555 -204371 42897
16202 -200171 275751 66271 -130121 -36656 180459 212045 127569 -79637 -124878 349652 42267
16190 82048 14793 18374 20490 246783 202500 170760 314326 -13976 278489 -213228 330443
16178 122975 -2974 -128170 -83353 353006 -1833 69114 -423854 90835 -25252 94636 269345
16167 269345 153212 190473 187044 249090 -277676 11940 -270780 -149924 84271 -224038 360348
16155 193345 83922 335819 219294 -174614 163948 558702 -176103 -81675 321318 -126556
$$ packed form
16236H2992O1065K66106A36837o5125K97624A44426j8006C4806L83935a17328
16225a15703N888N3444C8782K04219a90273I5365D010J42170o8015J93820j24881
16214A47104g213o5361D00134O8323C471N54141k75632i407k4148j70816D2897
16202b00171B75751F6271a30121c6656A80459L1586q4476g9637m5241C49652D2267
16190H2048A4793L581K116K26293m4283l1740J43566a3976B78489b13228C30443
16178A22975b974j25196M4817C53006a833F9114d23854I0835b5252I4636J74709
16167B69345j16133L7261l429O2046b77676A1940b70780J20856H4271b24038C60348
16155A93345H3922K51897j16525a74614A63948L94754a76103h1675C21318a26556
$$ plain form
16144 -70829 304542 -280652 -10623 -189901 -169227 9988 -182277 -127742 61754 30891 -65578
16132 110767 65638 175186 -13593 -72546 166314 21840 47269 -18644 28209 225001 109688
16120 -267403 -34490 -217998 -139614 -188511 121567 -216473 28017 109656 -169610 195059
16109 -60633 -73212 78144 -287174 -150560 -38809 8748 9318 126592 612520 145087 9658
16097 130320 115853 -55294 139732 -163148 -221194 -110799 -57099 -117352 -254358 -65830 169321
16085 178077 -39506 -114680 181579 -97501 -205032 -172180 222455 -126116 149901 -130476
16074 33216 -152010 -51572 -41535 119253 130072 94777 -175321 241211 -276181 166056
16063 -75139 192297 -190989 329205 9351 -31943 -17850 -99867 256233 -179749 105276 83692
$$ packed form
16144g0829C04542b80652a0623j79278K0674I988a82277N4535F1754l0863f5578
16132A10767m5129J09548a3593n8953A66314B1840K5429a8644B8209J96792A09688
16120b67403c4490j83508P8384m8897A21567b16473B8017Q1639a69610A95059
16109f0633j2579G8144b87174J36614c8809H748N70J17274M85928A45087I658
16097A30320j4467e5294A39732a63148n8046J10395N3700o0253j37006f5830A69321
16085A78077c9506p5174A81579i7501j07531L2852B22455a26116A49901a30476
16074C3216a52010e1572J0037A19253J0819l5295a75321B41211b76181A66056
16063g5139A92297a90989C29205I351c1943J4093q2017B56233a79749A05276k1584
$$ plain form
16052 83692 -200999 -92753 -67283 294702 154011 -262884 341445 102762 120681 -186138
16041 -405198 -136410 221212 -134517 -113807 130456 121011 68926 -33099 95801 -70057 -282819
16030 -282819 187795 -132500 127977 -80611 299088 -181678 -241987 73215 -133525 47812
16019 -265588 -56852 -371273 40245 -1908 27170 204280 -207522 -162097 -142752 -81007 244972
16007 77967 69301 1990 -139743 -168350 3389 45569 30480 -93795 -42416 200544 239306 -59459
15994 -45496 -5256 -44819 -22845 -76756 111422 53762 213444 109618 -118259 103384 166008
15983 166008 185636 401744 -65990 74244 181050 147322 199386 126911 -262502 163470 -26618
15971 304993 132289 384557 141753 -39505 -295716 -351542 -195869 -89421 -76761 169394
$$ packed form
16052H3692b00999i2753K5470B94702j40691b62884C41445A02762J7919a86138
16041d05198a36410B21212a34517K0710A30456r445n2085c3099I5801g0057k12762
16030b82819A87795a32500A27977h0611B99088a81678o0309G3215a33525D7812
16019b65588e6852l14421D0245a908B7170J77110b07522M5425J9345O1745B44972
16007G7967q666A990a39743k8607C389M2180j5089i3795d2416B00544L8762e9459
15994d5496e256l9563K1974n3911A11422E3762J59682j03826a18259A03384O2624
15983A66008J9628K16108f5990G4244J06806l3728N2064p2475b62502A63470b6618
15971C04993A32289K52268A41753c9505k56211n5826J55673h9421J2660A69394
$$ plain form
15960 -45053 39688 -102590 62210 186180 18158 129124 -171997 -40533 -51677 174522 108398
15949 108398 -102094 -44803 -390756 195957 17184 57659 -188344 87 -481889 261321 14334
15937 -164341 -145510 -108812 290727 -238728 -27654 -512479 -102124 4379 -134950 240229
15926 -289336 -97860 -337567 -263986 -77804 -35131 223190 -130733 85210 184471 73284 44612
15915 44612 -325369 -115068 -399017 218532 212988 -63814 64603 -78516 77879 -25299 -240059
15904 -240059 13696 -80071 -252255 111489 -21843 -153999 -451402 -2780 112581 80790 -76472
15892 14065 -296851 -188511 6101 -22486 -74705 -81487 -44667 -61003 92962 -193320 163380
15880 379730 25182 33306 -216407 -153432 -101487 -144757 -174569 296917 -371091 -13576 316969
$$ packed form
15960d5053C9688a02590F2210J23970A8158J10966a71997d0533j1144A74522o6124
15949A08398a02094d4803l45953A95957A7184M0475a88344H7d81889B61321A4334
15937a64341J8831L6698B90727b38728b7654m84825a02124D379a34950B40229
15926b89336i7860k39707P3581g7804c5131B23190a30733H5210R9261G3284k8672
15915D4612c25369a15068k83949B18532n544f3814F4603g8516G7879b5299k14760
15904b40059A3696h0071j72184A11489b1843j32156k97403b780A12581l1791g6472
15892A4065b96851J08340F101b2486n2219o782L6820j6336I2962a93320A63380
15880C79730B5182Q124b16407O2975N1945m3270k9812B96917c71091a3576C16969
$$ plain form
15868 -109659 -89782 -158170 -205041 -26521 103722 95775 -7119 135224 -65190 -266347 169372
15856 -77873 16469 124345 -265893 255047 -116134 93761 37883 -188229 240254 -241308
15845 253897 348155 -24245 34651 -102612 77984 60594 -252140 96739 -129830 288831 65115
15833 239129 -147595 38002 -73895 6825 -157623 334463 -109429 -21613 -136609 -101823 -74556
15822 -74556 -194497 111768 72957 -93056 -31943 15666 -115426 -153607 -217205 -40309 -275534
15811 -275534 -51204 -320580 -432283 -348958 -8098 -102645 -322813 4805 -9283 -267513 66429
15799 -49824 192989 -108741 -45407 -5648 -20234 -157525 -31551 -118112 -237603 -89693 240639
15787 90485 153790 -161503 -118345 47270 -413336 -120807 -12324 -47068 651 233302 -181737
$$ packed form
15868a09659J9877o8388m6871b6521A03722p947g119A35224f5190k01157A69372
15856g7873A6469J07876b65893B55047a16134I3761C7883a88229B40254b41308
15845B53897R4258b4245C4651a02612G7984j7390b52140I6739a29830B88831F5115
15833B39129a47595C8002g3895F825a57623C34463a09429b1613j14996L4786K7267
15822g4556j19941A11768l8811i3056c1943A5666a15426l8181o3598d0309k35225
15811b75534e1204k69376j11703Q3325h098r4547k20168D805i283k58230F6429
15799d9824A92989a08741d5407e648j4586j37291c1551q6561j19491h9693B40639
15787I0485O3305a61503M3158D7270d13336a20807a2324l4744F51K32651a81737
$$ plain form
15775 145213 80743 195755 -161380 35697 -90964 -154296 73916 42347 3218 -184088 51578
15763 139060 -245953 452133 -28697 40712 155783 97044 -75754 -109940 249267 -266877
15752 268884 -207875 -605867 -59193 203960 288082 -434879 -20478 18149 197233 8138 -39193
15740 163181 5069 -73848 -287604 -215873 -268677 -139433 -263172 -154479 98542 -15702 -375969
15729 -375969 87662 156267 -191599 -123387 61326 -34567 94819 -57146 -242041 6971 -70999
15717 19353 -407127 170619 68518 -222605 274615 186204 -71702 -245176 -81014 67483 -4201
15705 121318 42472 -71677 -338811 -132333 100771 64796 357838 -149681 158722 -110333
15694 -243881 24751 87341 38447 42546 97795 184036 105884 243640 -369927 -118143 199738
$$ packed form
15775A45213o4470J15012a61380C5697i0964o3332G3916l1569C218a84088E1578
15763A39060b45953D52133b8697D0712J15071n8739g5754l4186B49267b66877
15752B68884b07875l97992e9193B03960Q4122d34879b0478A8149J79084H138c9193
15740A63181E069g3848k13756P1731n2804J29244j23739J08693I8542a5702l60267
15729c75969H7662O8605a91599O8212F1326c4567I4819e7146j84895F971g0999
15717A9353d07127A70619F8518b22605B74615q8411g1702j73474h1014F7483d201
15705A21318D2472g1677k67134a32333A00771l5975K93042a49681A58722a10333
15694b43881B4751O2590C8447M099N5249Q6241p8152J37756c69927a18143A99738
$$ plain form
15682 70770 41007 -553065 1247 74780 -228496 167612 -158305 -174770 114765 193245 215344
15671 215344 187990 238012 193366 315149 -84938 79410 307457 -121101 105929 -72317 195953
15659 45949 140581 -65697 14940 -82868 32080 67470 -704944 66395 -198742 153173 276137
15648 276137 -123892 -423294 -254279 -133894 369929 -135123 -242040 -216018 -252750 274250
15637 144028 -102284 144951 -367639 20238 -193794 -198283 -297773 -82830 -146351 75244 -144662
15625 148469 -114981 -65277 307929 -55674 -53962 -105870 -14569 180965 41421 -22572 -102750
15614 -102750 177283 -84968 78060 -381352 -8273 -219739 -264460 -172029 19859 -433520 -59718
15602 -241656 -156457 249485 380073 99294 8554 -255947 42371 -7305 40784 -81403 180395
$$ packed form
15682G0770k9763e53065A247P3533b28496A67612a58305j6465A14765P8480K2099
15671B15344k7354N0022m4646J21783h4938G9410K28047a21101A05929g2317A95953
15659D5949R4632f5697A4940h2868C2080L5390g04944F6395a98742A53173J22964
15648B76137a23892k99402J69015J20385C69929a35123j06917K6022l6732B74250
15637A44028a02284A44951c67639B0238a93794m489r9490h2830o3521G5244a44662
15625A48469a14981M9704C07929e5674J712n1908a4569A80965D1421b2572q0178
15614a02750A77283h4968G8060c81352h273k11466m4721R2431A9859d33520e9718
15602b41656Q5199B49485J30588I9294H554b55947D2371g305D0784h1403A80395
$$ plain form
15590 256008 -13358 -5869 4408 70976 -251258 -421705 203305 -76934 -28163 -86479 235988
15578 -60140 48997 152781 -72434 -443511 -283145 204412 90505 -84604 173167 -143538
15567 207495 -127553 27369 168628 -44493 -83703 343562 192501 328586 218111 156986
15557 156986 -27926 60615 149587 -201349 20124 -77405 73752 87831 172880 -164450 257645
15545 -106978 -351042 -56962 79949 -89957 5433 58775 345673 345024 -80334 112932 -200065
15533 -338800 -72621 -274217 137319 -110437 242500 -59642 172585 205670 -105792 229931
15522 196737 -3991 72984 372023 -275281 -134923 197958 -83709 233582 -287504 455321
15511 236536 219642 82585 186858 329592 -136813 -308648 -40757 -98536 61699 -270052
$$ packed form
15590B56008a3358e869D408O6568b51258j70447B03305g6934b8163n8316B35988
15578f0140D8997J03784g2434l71077J60366B04412I0505h4604A73167a43538
15567B07495a27553B7369J41259d4493l9210C43562j51061J36085j10475o1125
15557A56986b7926F0615Q8972b01349B0124g7405G3752J4079Q5049a64450B57645
15545a06978k44064e6962G9949h9957E433N3342K86898o49h0334A12932b00065
15533c38800g2621k01596A37319a10437B42500e9642A72585L3085a05792B29931
15522A96737c991G2984K99039b75281a34923A97958h3709B33582b87504D55321
15511B36536j6894H2585J04273J42734a36813j71835d0757n7779F1699b70052
$$ plain form
15500 -60353 -52738 -40479 155246 -172737 -267709 92171 -108079 -327266 -146082 -31699 -374162
15489 -374162 163580 355393 -260633 45333 -92565 -376264 -266635 -128525 387104 -162674
15478 63505 -31217 44725 -162063 -285837 275073 352590 -135665 138667 -211311 66702
15467 -117986 106806 -228676 -305451 111576 -6671 275671 166070 214274 226122 -266942
15456 -46212 -147364 -115992 -45706 89342 6718 67002 142688 95522 -60822 50579 112557 -250277
15443 37867 -154525 -39595 -236885 82481 156061 -180636 236347 313917 322434 83957 -361748
15431 -80193 69781 145381 51183 114051 143046 232943 111702 -72082 16644 160537 -37635
15419 111934 -53861 146445 -112039 -62711 -20045 83614 -29942 -70959 -29536 -30753 -117850
$$ packed form
15500f0353P615J2259A55246a72737r4972I2171a08079k19187a46082c1699l42463
15489c74162A63580J91813b60633D5333i2565k83699J09629a28525C87104a62674
15478F3505c1217D4725a62063j23774B75073P7517a35665A38667b11311F6702
15467a17986A06806b28676p6775A11576f671B75671j09601M8204J1848b66942
15456d6212j01152L1372d5706H9342F718O0284P5686m7166f0822E0579O1978b50277
15443C7867a54525c9595j97290H2481P3580a80636B36347P7570Q517H3957c61748
15431h0193F9781P5600E1183O2868K8995Q9897A11702g2082A6644J43893c7635
15419A11934e3861A46445a12039M9328b0045H3614b9942m1017b9536j217q7097
$$ plain form
15408 -117850 -314092 -91635 -160657 -128958 358917 -118291 -308836 -183784 -185019 -224715 71286
15396 39406 -22050 -359695 6112 -215916 -88086 -430661 96610 -77038 82033 103471 -74916
15384 -207074 -223087 -57980 404074 -7936 -27907 24482 235828 14902 -156193 -31950 -556731
15373 -556731 59140 -160789 13384 159487 99927 182172 61649 156787 -201931 -144592 -24211
15361 83529 32038 163854 5561 -121770 -87495 223098 -261722 458961 -59279 150204 -623
15349 220509 146048 72868 -20493 161268 -87848 -69994 -252040 225226 142013 -45642 22322
15337 229198 -37095 -14281 108557 165209 138814 6558 -127791 313391 34532 213129 -23728
15325 -74956 177285 -212361 160222 -85008 -410074 1208 -52464 139076 -173153 145669
$$ packed form
15408a17850j96242i1635o9022L1699C58917a18291j90545J25052j235l9696G1286
15396C9406b2050l37645F112b15916h8086l42575I6610g7038H2033K1438g4916
15384b07074j6013e7980D04074g936j9971B4482K11346A4902a56193c1950n24781
15373e56731E9140a60789A3384J46103n9560Q2245F1649R5138b01931N7339b4211
15361H3529C2038J31816E561a21770L4275B23098b61722D58961e9279A50204f23
15349B20509p4461G2868b0493A61268h7848J7854j82046B25226q3213d5642B2322
15337B29198c7095a4281A08557N6652k6395F558a27791C13391C4532J78597b3728
15325g4956A77285b12361A60222h5008l25066A208e2464A39076a73153A45669
$$ plain form
15314 -53060 210362 -57830 204717 13621 216425 37931 -31899 -171578 -148950 10675 53895
15303 53895 -234932 -182448 -200435 105211 -265389 -315602 206773 -91162 46319 330354 -260984
15291 89086 5343 51578 188178 303546 -69715 154994 85754 511153 379060 -176315 80788
15279 37325 402897 -12026 39001 49409 22185 21930 389390 41549 185186 -80514 22062
15267 67342 159558 100098 13042 182661 -244502 91176 -33129 216689 315309 200365 487659
15256 487659 115223 15667 270708 140004 159364 255448 356365 428074 732668 1124585
15246 1124585 1457791 1477067 1521080 909749 283646 223331 178921 58786 138599 259188
15236 259188 -64180 258334 -37606 132266 99517 42123 240132 272122 234490 -21198 3008
$$ packed form
15314e3060B10362e7830B04717A3621K02804C7931c1899j39679K2628A0675M3220
15303E3895b34932N2484j7987A05211b65389n0213B06773i1162D6319K84035b60984
15291H9086E343M6235J36600J15368f9715A54994o9240M25399j32093a76315H0788
15279C7325L65572a2026C9001J0408B2185k55L67460D1549J43637h0514B2062
15267F7342R2216n9460A3042J69619b44502I1176c3129B16689R8620j14944K87294
15256D87659A15223A5667K55041j30704J9360R6084J00917P1709L04594L91917
15246A124585L33206J9276M4013o11331B83646o0315m4410E8786P9813J20589
15236B59188f4180B58334c7606A32266l2749D2123J98009L1990l7632b1198C008
$$ plain form
15224 86656 35153 -56690 291658 156432 -56106 333789 62745 111329 93744 280512 -31442
15212 61498 76844 127401 158773 94243 -84040 -245645 -45493 163786 303780 331580 -30301
15200 333236 86342 -874 -134 186120 -176882 375626 -43750 165171 89063 -335417 155828
15188 139417 70745 355591 -188489 -706 346252 61336 98132 188129 -119740 -218304 -267067
15177 -267067 28390 7744 204405 233090 233164 320146 53722 246027 -11918 -231526 -374507
15166 -374507 -235254 102339 75896 -22684 -37931 460623 -270394 -220206 116092 -322334
15155 -58165 66640 102636 106462 62271 16682 331404 370499 95913 114414 90106 49431 310141
15143 310141 -30670 436257 18788 -133402 167555 2908 290701 -333213 364233 -31546
$$ packed form
15224H6656C5153e6690B91658j35226e6106C33789F2745M8584j7585J86768c1442
15212F1498J5346N0557L1372o4530h4040j61605d5493A63786J39994K7800c0301
15200C33236H6342h74a34A86120a76882C75626d3750A65171p6108c35417A55828
15188A39417o8672K84846a88489g06C46252F1336L6796Q9997a19740r8564m8763
15177b67067B8390G744J96661K8685P4Q6982E3722J92305a1918k19608j42981
15166c74507J39253A02339k6443b2684j5247D60623b70394N0188A16092c22334
15155e8165F6640L5996L826m4191A6682L14722L9095I5913J8501k4308m0675K60710
15143C10141c0670D36257A8788a33402A67555B908K87793c33213C64233c1546
$$ plain form
15132 20201 284297 522632 -36671 194848 13795 385910 22547 -152420 -125911 -19850 264364
15120 750630 403112 66433 234391 504784 146390 146100 -229909 129750 -355885 138728
15109 113564 -177897 329090 162117 294877 -222796 87710 54578 116558 -267042 289187
15098 164104 159052 224164 -6697 -161315 198814 162315 -35889 -24117 373128 376553 184872
15086 141995 222779 422467 432740 395288 209711 163917 198120 187731 57748 82816 302819
15075 302819 -169498 297835 -89406 346399 359076 473542 69616 258955 -28640 235622
15064 -27074 172062 114089 29694 359658 46030 307703 23687 184120 226193 -182022 426516
15052 -240713 206053 256565 -40890 21880 -61749 30213 70828 293641 380897 246964 20746
$$ packed form
15132B0201K64096K38335c6671A94848A3795L72115B2547a52420K6509a9850B64364
15120G50630l47518F6433J67958K70393A46390k90b29909A29750c55885A38728
15109A13564a77897C29090A62117J32760b22796H7710l3132O1980b67042B89187
15098A64104n052O5112f697j54618A98814l6499c5889J1772C73128L425A84872
15086A41995Q0784J99688J0273l7452j85577m5794L4203j0389E7748K5068K20003
15075C02819a69498B97835h9406C46399J2677J14466F9616J89339b8640B35622
15064b7074A72062n7973B9694L29964D6030K61673B3687J60433M2073a82022D26516
15052b40713B06053N0512d0890B1880f1749C0213M0615K22813Q7256j33933B0746
$$ plain form
15040 378763 471046 83409 -190973 241922 384982 341087 -36553 -65806 53134 494074 143952
15028 261008 27127 96724 73318 204798 -262050 -287441 124536 249715 -40439 134808
15017 192535 192962 493092 100465 258803 93705 -193461 348067 463752 154029 356052
15007 356052 61927 403845 59048 -149825 -181665 444108 537302 156200 442279 -112128
14996 383119 93947 289427 349416 386750 409939 360238 202389 186072 48107 277912 244045
14985 244045 357440 221533 262910 349591 88814 233052 124762 219016 347131 257851
14975 257851 94002 136544 502849 197893 245174 240611 324840 200745 380845 76416 341007
14964 341007 281287 87559 149115 600769 -2555 19543 393952 424534 137592 259411 290464
$$ packed form
15040C78763R2283H3409a90973B41922J43060m3895c6553k9253E3134M40940A43952
15028B61008B7127O9597k3406J31480b62050k5391A24536J25179d0439A34808
15017A92535M27L00130A00465J58338I3705a93461C48067J15685A54029K02023
15007C56052F1927L41918E9048a49825l1840D44108R3194A56200K86079a12128
14996C83119I3947J95480N9989L7334K3189m9701j57849j6317D8107K29805l3867
14985B44045J13395j35907M1377Q6681H8814J44238j08290R4254J28115q9280
14975B57851I4002M2542L66305A97893M7281m563Q4229j24095J80100G6416K64591
14964C41007n9720H7559O1556M51654b555A9543L74409L0582A37592J21819L1053
$$ plain form
14953 290464 408285 223357 593793 256702 202568 365234 32341 274741 487969 321833
14943 321833 22270 262890 166483 473304 169766 84504 124303 592405 461512 154576
14932 405449 60198 432357 259302 254152 250558 182718 164780 -25081 375002 703318 526830
14921 526830 448796 253209 35344 545904 365813 588761 3428 113362 396827 343245
14911 343245 408438 57176 471000 785936 338135 151114 61415 468166 247434 392344
14901 392344 350604 596920 457259 339751 119677 407267 402161 256747 216750 310400
14891 310400 302929 372842 102663 272584 220034 744838 287364 757983 217236 256923
14881 256923 365911 278259 253663 534699 493741 387801 257304 102263 428565 457786
$$ packed form
14953B90464J17821j84928L70436B56702n4134J62666C2341K42400K13228j66136
14943C21833B2270K40620r6407L06821A69766H4504L9799M68102j30893A54576
14932D05449F0198L72159j73055n150l594o7840j7938b5081C75002L28316j76488
14921E26830p8034j95587C5344N10560j80091K22948C428J09934K83465n3582
14911C43245O5193E7176M13824L14936C38135A51114F1415M06751k20732J44910
14901C92344m1740K46316j39661j17508A19677K87590n106j45414l9997R3650
14891C10400p471O9913A02663J69921n2550N24804B87364M70619B17236L9687
14881B56923J08988q7652k4596K81036m0958j05940j30497A02263L26302K9221
$$ plain form
14871 457786 406098 366146 428443 403823 464164 488597 226008 377908 230886 521433 32804
14859 485306 226794 398244 295775 347686 173628 386225 453736 439501 595985 88438
14848 317129 816357 248282 309573 383689 430785 418840 314405 275731 429456 427312 587806
14837 587806 663276 93241 262081 445429 198187 464747 433061 351078 705090 641000
14827 641000 426566 558988 637655 299278 352819 216681 329580 678112 263048 742655
14817 742655 497445 306320 573096 630577 849078 354902 823401 300643 671438 703305
14807 703305 589808 398831 340903 630695 584879 563648 337135 256573 422503 428316 607424
14796 607424 774200 426627 430454 563052 563475 495411 498180 449513 634998 274877 302324
$$ packed form
14871D57786n1688l9952O2297k4620O0341K4433B26008J51900j47022K90547C2804
14859D85306B26794J71450j02469N1911A73628K12597O7511j4235J56484H8438
14848C17129M99228B48282O1291P4116M7096j1945j04435l8674J53725k144J60494
14837E87806P5470I3241J68840J83348A98187K66560l1686q1983L54012o4090
14827F41000k14434J32422P8667B99278N3541j36138J12899L48532B63048M79607
14817G42655k45210j91125K66776N7481K18501C54902M68499C00643L70795L1867
14807G03305j13497j90977n7928K89792m5816k1231k26513q0562J65930N813J79108
14796F07424J66776l47573L827J32598M23o8064K769m8667J85485B74877K7447
$$ plain form
14785 302324 125215 533193 380725 478170 544504 557386 577991 549498 564364 513764 396280
14774 396280 665685 605990 822816 609716 573154 885985 440843 278002 933385 457270
14763 657410 635447 705223 509611 478869 837389 701920 610339 808825 497019 891608
14753 891608 353559 669738 816586 704102 680363 684512 413580 903119 514638 700703
14743 700703 979594 785230 591952 731381 843926 716303 489925 645718 322433 938743
14733 938743 778546 246651 492936 758587 770488 892876 764230 1000592 699252 847345
14723 847345 893858 600079 1118839 745320 1003330 644756 848826 891422 934092 1080570
14713 1080570 799356 1118214 1086655 1038145 778327 907168 645251 699882 1079385 823966
$$ packed form
14785C02324A25215M07978j52468R7445O6334J2882K0605k8493J4866n0600j17484
14774C96280K69405n9695K16826k13100l6562L12831D40843j62841O55383D57270
14763F57410k1963O9776j95612l0742L58520j35469r1581J98486l11806L94589
14753H91608C53559L16179J46848j12484k3739M149k70932M89539l88481J86065
14743G00703K78891j94364j93278J39429J12545j27623k26378J55793C22433O16310
14733I38743j60197B46651K46285K65651J1901J22388j28646K36362l01340J48093
14723H47345M6513k93779N18760l73519K58010l58574K04070M2596M2670J46478
14713A080570k81214L18858l1559m8510k59818J28841k61917N4631L79503k55419
$$ plain form
14703 823966 668744 1227647 724836 713213 848330 748634 680157 823417 704796 705901
14693 705901 890093 873847 907176 707267 688191 1062704 836734 885322 1263989 1058534
14683 1058534 814393 994025 1049689 1104945 895969 892601 752378 1186421 1124251 1020280
14673 1020280 1042073 1318492 1408110 1167045 1099798 830619 1029905 1089293 992794 1029938
14663 1029938 763648 1028040 1292627 807364 1190918 1195099 1139145 1148444 1003521 1247262
14653 1247262 1176845 1258967 1223603 1315136 1115290 1341032 1230323 1177626 1288471 1174200
14643 1174200 1347787 1224126 1337449 1136362 1315191 1452496 1423301 1686910 1378019 1143806
14633 1143806 1421821 1311001 1225602 1128114 1259471 1110512 1045017 1380461 1417091 1559673
$$ packed form
14703H23966j55222N58903n02811j1623J35117r9696o8477J43260j18621J105
14693G05901J84192j6246L3329j99909j9076L74513k25970M8588L78667k05455
14683A058534k44141J79632N5664N5256k08976l368j40223M34043o2170j03971
14673A020280K1793K76419Q9618k41065o7247k69179J99286N9388r6499L7144
14663A029938k66290K64392K64587m85263L83554M181n5954R299j44923K43741
14653A247262p0417Q2122l5364R1533j99846K25742j10709n2697J10845j14271
14643A174200J73587j23661J13323k01087J78829J37305k9195K63609l08891k34213
14633A143806K78015j10820q5399r7488J31357j48959o5495L35444L6630J42582
$$ plain form
14623 1559673 1320281 1756916 1378699 1329017 1413643 1709031 1279303 1801680 1495165 1560098
14613 1560098 1609659 1486531 1417894 1599610 1675597 1790364 1754333 1648960 1765944 1512541
14603 1512541 1692457 1738271 1657503 1300474 1559215 1792779 1698426 1765474 1828674 1817904
14593 1817904 1766452 1731914 2064701 1669295 2107726 2105957 1724054 2042589 1770756 1802305
14583 1802305 1727554 2034431 2182678 2010986 2190087 2060009 1713766 1859249 2241631 2104241
14573 2104241 2093628 2310324 2247115 2367965 2239074 2185972 2482936 2171829 2482442 2737173
14563 2737173 2567012 2697293 2688847 2526004 2612210 2815248 2971242 3372631 3211939 3851530
14553 3851530 3630540 4187085 4659954 5602385 7639575 10855204 18371874 34343814 46559213
$$ packed form
14623A559673k39392M36635l78217m9682Q4626K95388m29728N22377l06515O4933
14613A560098M9561j23128o8637J81716P5987J14767l6031j05373J16984k53403
14603A512541J79916M5814q0768l57029K58741K33564r4353O7048O3200j0770
14593A817904n1452l4538L32787l95406M38431j769l81903L18535k71833L1549
14583A802305p4751L06877J48247j71692J79101j30078l46243J45483L82382j37390
14573B104241j0613K16696o3209J20850j28891n3102K96964l11107L10613K54731
14563B737173j70161J30281q446j62843Q6206K03038J55994M01389j60692O39591
14553C851530k20990N56545M72869R42431K037190L215629P516670J5971940J2215399
$$ plain form
14544 46559213 23426110 12181574 7322450 4294139 3039899 2511710 2394319 2175390
14536 2175390 1909071 2374166 2100216 2157817 2018379 2132212 2349341 2425181 2577236 2198001
14526 2198001 2411245 2404184 2197773 2557141 2265657 2599174 2577477 2785730 2635042 2638910
14516 2638910 2768157 2580105 2817554 2823942 2769231 2511456 2917598 2862219 2864561 2904229 3044718
14505 3044718 3000421 3140632 3199216 3067221 3073417 3198320 3255269 3578598 3210349 3429822
14495 3429822 3640869 3366209 3216031 3675209 3396805 3473718 3912449 3739139 3768282 3684073
14485 3684073 3458190 3896276 3916074 3907017 4068344 3945270 3999507 4291905 4192997 4179105
14475 4179105 4110555 4521694 4017262 4129394 4641011 4318525 4614272 4362739 4427359 4634940
$$ packed form
14544D6559213k3133103j1244536m859124l028311j254240n28189j17391k18929
14536B175390k66319M65095k73950N7601j39438J13833K17129P5840J52055l79235
14526B198001K13244p061k06411L59368k91484L33517k1697K08253j50688L868
14516B638910J29247j88052K37449O388n4711k57775M06142n5379K342L9668J40489
14505C044718m4297J40211N8584j31995O196J24903N6949L23329l68249K19473
14495C429822K11047k74660j50178M59178k78404P6913M38731j73310K9143q4209
14485C684073k25883M38086J9798r057J61327j23074N4237K92398r8908j3892
14475D179105o8550M11139n04432J12132N11617l22486K95747k51533O4620K07581
$$ plain form
14465 4634940 4660254 4654469 5002719 4498842 5266341 5346079 4517957 5075580 5098006 5445525
14455 5445525 5254291 5454358 5512739 5449810 5698132 5152510 6000790 5862211 5960844 5847373
14445 5847373 5627112 6171744 6066053 6196922 6611918 6307679 6270043 6520858 6619269 6426815
14435 6426815 6727640 6787390 7084651 6921053 7065283 7177741 7067217 7482522 7155800 7280442
14425 7280442 7531766 7756666 7836435 8105348 8080266 8211885 8000149 8238471 8514702 8410398
14415 8410398 8650396 8502285 9094316 9210741 8976299 9429836 9444861 9504161 9426897 9731628
14405 9731628 10082083 10177200 10593527 10218962 10864668 10596559 11446207 11289720 11579533 11723236
14395 11723236 12001771 12064004 12650825 12508107 12653108 12834708 13068622 13119589 13601739 13868414
$$ packed form
14465D634940K5314n785L48250n03877P67499P9738q28122N57623K2426L47519
14455E445525j91234K00067N8381o2929K48322n45622Q48280j38579R8633j13471
14445E847373k20261N44632j05691J30869M14996l04239l7636K50815R8411j92454
14435F426815L00825N9750K97261j63598J44230J12458j10524M15305l26722J24642
14425G280442K51324K24900P9769K68913k5082J31619k11736K38322K76231j04304
14415H410398K39998j48111N92031J16425k34442M53537J5025N9300p7264L04731
14405I731628L50455R5117M16327l74565O45706k68109Q49648j56487K89813J43703
14395A1723236K78535O2233N86821j42718J45001J81600K33914N0967M82150K66675
$$ plain form
14385 13868414 14103513 14663791 14837061 14876224 14882561 15207302 15461977 16072286 15838484 16631015
14375 16631015 16467059 16911338 16964059 17940581 18193295 18740167 18888160 18902080 19826365 20061932
14365 20061932 20535367 20748061 21160812 21871568 22442359 22658927 23169652 23789071 24305896
14356 24305896 25070662 25638879 26407601 26578564 27390502 27621518 28217083 29499211 30055806
14347 30055806 30831145 31765781 32490129 33453792 34323933 34890639 35585056 37105547 37787384
14338 37787384 39039565 40400539 41205604 42083465 43529991 44568131 46134769 47670521
14330 47670521 49029742 50655823 52137360 53887055 55493641 57224210 59142289 60916148
14322 60916148 63296029 65777708 67519761 69702728 72451775 75261957 77939159 81088324
$$ packed form
14385A3868414K35099N60278J73270L9163O337L24741K54675O10309k33802P92531
14375A6631015j63956M44279N2721R76522K52714N46872J47993J3920R24285K35567
14365B0061932M73435K12694M12751P10756N70791K16568N10725O19419N16825
14356B4305896P64766N68217P68722J70963Q11938K31016N95565J282128N56595
14347C0055806P75339R34636P24348R63663Q70141N66706O94417J520491O81837
14338C7787384J252181J360974Q05065Q77861J446526J038140J566638J535752
14330D7670521J359221J626081J481537J749695J606586J730569J918079J773859
14322F0916148K379881K481679J742053K182967K749047K810182K677202L149165
$$ plain form
14314 81088324 83760747 87376891 90628487 94555941 98054723 102057020 106326196 110278798
14306 110278798 115533195 120193293 125400992 130685978 136739935 143088647 149122738 156338283
14298 156338283 163573138 171687564 179405848 187995998 197158925 206671430 216882856 227148977
14290 227148977 238337266 249868103 261888857 274521584 287485766 300646689 314427491
14283 314427491 328280206 342432582 356495781 370430293 383962118 396952616 409298742
14276 409298742 420373184 429961942 437381151 441474497 442879551 443423114 443408843 441356637
14268 441356637 438261057 433314014 426487794 417989542 408487496 397788655 386228733 373347222
14260 373347222 360103716 346310881 332275589 318284840 303772844 289955565 276589273
$$ packed form
14314H1088324K672423L616144L251596L927454L498782M002297M269176L952602
14306A10278798N254397M660098N207699N284986O053957O348712O034091P215545
14298A56338283P234855Q114426P718284Q590150R162927R512505J0211426J0266121
14290B27148977J1188289J1530837J2020754J2632727J2964182J3160923J3780802
14283C14427491J3852715J4152376J4063199J3934512J3531825J2990498J2346126
14276D09298742J1074442R588758P419209M093346J405054N43563j4271k052206
14268D41356637l095580m947043o826220q498252r502046j0698841j1559922j2881511
14260C73347222j3243506j3792835j4035292j3990749j4511996j3817279j3366292
$$ plain form
14253 276589273 264547827 252187350 239755654 228237648 217204057 206832086 196789332
14246 196789332 187131512 178332644 170396360 162488983 155108601 147867543 141335185 134888427
14238 134888427 129229686 124177900 118561401 113535756 108509936 104142869 100375144 96785912
14230 96785912 92691528 88875857 85425160 82257459 79092341 76041016 73465300 70821969
14222 70821969 68285529 65889943 63928553 62025025 59688390 57892564 55659249 54004344
14214 54004344 52364264 51297158 49621948 47828305 46407853 45208858 43815311 43364391
14206 43364391 42363956 40678973 39531700 38159508 37270134 36352242 35643094 34508405
14198 34508405 33753226 32733549 32026581 31232975 30681952 29972082 28717855 28244669 27646706
$$ packed form
14253B76589273j2041446j2360477j2431696j1518006j1033591j0371971j0042754
14246A96789332r657820q798868p936284p907377p380382p241058o532358o446758
14238A34888427n658741n051786n616499n025645n025820m367067l767725l589232
14230I6785912m094384l815671l450697l167701l165118l051325k575716k643331
14222G0821969k536440k395586j961390j903528k336635j795826k233315j654905
14214E4004344j640080j067106j675210j793643j420452j198995j393547m50920
14206D3364391j000435j684983j147273j372192q89374r17892p09148j134689
14198C4508405p55179j019677p06968p93606n51023p09870j254227m73186n97963
$$ plain form
14189 27646706 26888960 26003258 25691782 25106071 24314781 23751132 23346737 22789973 22477335
14180 22477335 21874803 21503097 20795988 20561131 20185119 19510163 19276969 19114123 18549980
14171 18549980 18108297 17886590 17357413 17324504 16771361 16513472 16731305 16172465 15515100
14162 15515100 15338888 14974120 14810901 14728333 14488538 14115124 13969003 13901489 13355362 13343503
14152 13343503 13062918 12954349 12895924 12480846 11921991 12429150 11740611 11806215 11453971 11389525
14142 11389525 11148655 11045736 11008335 10421910 10611632 10322162 10174894 9842539 9805116 9914857
14132 9914857 9853144 9337734 9446804 9236902 8976959 9141744 8771288 8551116 8680630 8815117
14122 8815117 8536035 8474140 8151903 7802664 8228436 7682131 7720377 7327512 7612392 7345770
$$ packed form
14189B7646706p57746q85702l11476n85711p91290n63649m04395n56764l12638
14180B2477335o02532l71706p07109k34857l76012o74956k33194j62846n64143
14171A8549980m41683k21707n29177l2909n53143k57889K17833n58840o57365
14162A5515100j76212l64768j63219q2568k39795l73414j46121o7514n46127j1859
14152A3343503k80585j08569n8425m15078n58855N07159o88539O5604l52244o4446
14142A1389525k40870j02919l7401n86425J89722k89470j47268l32355l7423J09741
14132I914857o1713n15410J09070k09902k59943J64785l70456k20172J29514J34487
14122H815117k79082o1895l22237l49239M25772n46305L8246l92865K84880k66622
$$ plain form
14112 7345770 7328151 7668936 6870321 7067423 6959714 7016785 6610742 6836828 6633628 6610364
14102 6610364 6630160 6341300 6647842 6232522 6359063 6107934 6004743 6094390 5955259 5806866
14092 5806866 5888635 5632430 5773296 5521104 5681322 5301305 5103997 4880538 5119595 5309768
14082 5309768 4844108 5131437 4956010 5050450 4954757 4723495 4760029 4963430 4890709 5010311
14072 5010311 4714597 4764135 4459105 4187462 4267262 4151278 4595539 4600972 4328825 4132231
14062 4132231 3986461 4134093 4174352 4517252 3952142 4293365 4089513 4477177 3940950 3801724
14052 3801724 3777054 3803797 3588434 3513022 3812921 3646425 3406794 3603206 3587509 3575365
14042 3575365 3025274 3044957 3308148 3364105 3356798 3408130 3010431 2886029 3140686 3044222
$$ packed form
14112G345770j7619L40785p98615J97102j07709N7071m06043K26086k03200k3264
14102F610364J9796k88860L06542m15320J26541k51129j03191Q9647j39131j48393
14092E806866Q1769k56205J40866k52192J60218l80017j97308k23459K39057J90173
14082E309768m65660K87329j75427R4440r5693k31262L6534K03401p2721J19602
14072E010311k95714M9538l05030k71643P9800j15984M44261N433k72147j96594
14062D132231j45770J47632M0259L42900n65110L41223k03852L87664n36227j39226
14052C801724k4670K6743k15363p5412K99899j66496k39631J96412j5697j2144
14042C575365n50091J9683K63191N5957p307N1332l97699j24402K54657r6464
$$ plain form
14032 3044222 3257675 2965854 3050587 3112754 3075632 2852296 2987764 2826033 2865271 2908759
14022 2908759 2908621 2578026 2467629 2624092 2880774 2618391 2729096 2395413 3015542 2461785
14012 2461785 2217360 2361475 2774909 2333164 2334434 2502433 2295378 2506276 2332163 2267969
14002 2267969 2305274 2153938 2265661 2048180 2038289 2113013 2332248 2033018 2225848 2229949
13992 2229949 2193996 2553388 2510739 3558190 5913466 11828938 27414288 46575976 28462017
13983 28462017 14638269 9063551 6697549 5326021 4556135 3759789 3518901 3362637
13975 3362637 3246169 3056520 2740776 2623340 2745286 2379791 2467126 2314997 2376217 2600423
13965 2600423 2643443 2448212 2250738 2223651 2330840 2173224 2248505 2308783 2356298 2306665
$$ packed form
14032C044222K13453k91821Q4733O2167l7122k23336J35468j61731L9238M3488
14022B908759j38l30595j10397J56463K56682k62383J10705l33683O20129n53757
14012B461785k44425J44115M13434m41745J270J67999k07055K10898j74113o4194
14002B267969L7305j51336J11723k17481r891P4724K19235k99230J92830M101
13992B229949l5953L59392m2649J047451K355276N915472J5585350J9161688j8113959
13983B8462017j3823748n574718k366002j371528p69886p96346k40888j56264
13975C362637j16468j89649l15744j17436J21946l65495Q7335j52129O1220K24206
13965B600423M3020j95231j97474k7087J07189j57616P5281O0278M7515m9633
$$ plain form
13955 2306665 2067295 1725068 1941437 1894963 1999840 2008108 1820753 2186219 2145298 1839852
13945 1839852 1733647 2069301 1996334 1978910 1909046 1938570 1814827 1852156 1963259 1872908
13935 1872908 1880039 1411885 1826422 1837385 1427105 1648253 1839607 1603788 1774756 1704439
13925 1704439 1747622 1540688 1450193 1437073 1711585 1419131 1683509 1678743 1483047 1786034
13915 1786034 1772902 1876360 1595252 1530240 1453454 1501733 1287782 1524626 1440167 1493315
13905 1493315 1509126 1798703 1139543 1333143 1460285 1431884 1610018 1411372 1324578 1486392
13895 1486392 1369680 1491766 1590528 975241 1083195 1452629 1286328 1195571 1426942 1388681
13885 1388681 1337585 1292060 1056265 1310390 1357129 1574255 1255555 1059445 1091292 1315586
$$ packed form
13955B306665k39370l42227K16369m6474J04877Q268j87355L65466m0921l05446
13945A839852j06205L35654p2967j7424o9864K9524j23743L7329J11103r0351
13935A872908P131m68154M14537J0963m10280K21148J91354k35819J70968p0317
13925A704439M3183k06934r0495j3120K74512k92454K64378m766j95696L02987
13915A786034j3132J03458k81108o5012p6786M8279k13951K36844q4459N3148
13905A493315J5811K89577o59160J93600J27142k8401J78134j98646q6794J61814
13895A486392j16712J22086R8762o15287J07954L69434j66301r0757K31371l8261
13885A388681n1096m5525k35795K54125M6739K17126l18700j96110L1847K24294
$$ plain form
13875 1315586 1211984 1433283 1413613 1006276 1209116 1319917 1210337 1471310 1417907 1409100
13865 1409100 1105268 1240131 1381373 1118018 1402794 1047742 986024 891314 893979 975359
13855 975359 1097644 838829 967486 959858 1123827 899705 1108212 1221404 912949 1135744
13845 1135744 943327 848069 992179 1126671 1093555 757007 915237 1198337 997829 939865
13835 939865 1055705 1100194 630668 1095841 930136 932842 813824 745530 1039762 864183
13825 864183 939519 912545 693327 963249 898438 906169 817148 539768 910177 731936 991481
13814 991481 407557 797794 1074129 792875 694153 595600 719797 1040271 978491 968643
13804 968643 789923 738393 956060 971007 985808 549862 645977 1028770 961204 909389 982814
$$ packed form
13875A315586j03602K21299j9670m07337K02840J10801j09580K60973n3403q807
13865A409100l03832J34863J41242k63355K84776l55052o1718r4710K665Q1380
13855I75359J22285k58815J28657p628J63969k24122K08507J13192l08455K22795
13845A135744j92417r5258J44110J34492l3116l36548J58230K83100k00508n7964
13835I39865J15840M4489m69526M65173j65705K706j19018o8294K94232j75579
13825H64183P5336k6974k19218K69922o4811P731q9021k77380L70409j78241K59545
13814I91481D07557L90237K76335k81254r8722r8553J24197L20474o1780r848
13804I68643j78720n1530K17667J4947J4801m35946R6115L82793o7566n1815P3425
$$ plain form
13793 982814 708808 772330 906835 908234 697860 967860 1039086 819699 1000013 703321
13783 703321 996305 865926 878165 804490 395225 948724 977911 696454 649609 646002 721229
13772 721229 1157788 925528 689592 687265 458312 442020 486342 522316 738731 735138 897451
13761 897451 580416 864682 550727 588604 310627 834922 612390 1129700 840221 508812
13751 508812 414657 882235 689097 1065332 908217 1030110 851696 737838 598292 499293
13741 499293 1173837 642389 1197125 610049 609507 371346 714378 319081 589898 636115
13731 636115 474303 410991 292406 662004 847010 544532 336136 760957 867286 791596
13721 791596 617955 833949 776203 778028 657539 699765 590182 820170 844602 591807
$$ packed form
13793I82814k74006O3522J34505J399k10374K70000P1226k19387J80314k96692
13783G03321K92984j30379J2239p3675C95225N53499K9187k81457m6845l607P5227
13772G21229M36559k32260k35936k327k28953j6292M4322L5974K16415l593J62313
13761H97451l17035K84266l13955L7877k77977N24295k22532N17310k89479l31409
13751E08812r4155M67578j93138L76235j57115J21893j78414j13858j39546r8999
13741D99293O74544n31448N54736n87076n42k38161L43032C19081K70817M6217
13731F36115j61812o3312j18585L69598J85006l02478k08396M24821J06329p5690
13721G91596j73641K15994n7746J825j20489M2226j09583K29988K4432k52795
$$ plain form
13711 591807 661015 744745 697744 571194 489273 554096 773726 397425 595686 732740
13701 732740 233716 829536 624321 453856 343170 460643 499540 808947 540667 -11563
13690 350671 284651 645410 709466 388080 288691 322474 440899 183720 465340 408072
13680 408072 600391 716474 618348 673485 339945 701336 867339 517075 237507 438716
13670 438716 627421 207787 491959 418416 676343 631008 327611 255719 625902 528259
13660 528259 240393 306693 428707 347573 330761 385528 374823 572816 457801 236158
13650 236158 474995 279727 446166 461156 279058 654875 465720 499221 720012 613188
13640 613188 78205 547484 740581 404094 278849 584729 380719 389207 36989 155114
$$ packed form
13711E91807O9208Q3730m7001j26550q1921O4823K19630l76301J98261J37054
13701G32740B33716N95820k05215j70465j10686J17473L8897L09407k68280a1563
13690C50671o6020L60759O4056l21386r9389L3783J18425A83720K81620n7268
13680D08072J92319J16083r8126N5137l33540L61391J66003l50264B37507K01209
13670D38716J88705B07787K84172p3543K57927m5335l03397p1892L70183r7643
13660E28259B40393O6300J22014q1134j6812N4767j0705J97993j15015k21643
13650B36158K38837j95268J66439J4990j82098L75817j89155L3501K20791j06824
13640F13188G8205M69279J93097l36487j25245L05880k04010Q488C6989J18125
$$ plain form
13630 155114 761681 179710 290247 358848 770364 210100 435888 751939 274743 450998
13620 450998 476026 630640 602456 670083 268111 374666 481508 256007 -25803 56777
13609 152879 313487 312629 489574 142401 538481 133836 261717 459446 349514 426889
13599 426889 565814 369541 389349 326667 259114 367944 -6590 -134154 494058 235398
13588 113639 391293 508298 583796 337242 407799 381319 455083 545643 416582 148261
13577 570318 404037 357781 650451 338937 244517 449614 401319 415612 262168 298393
13567 298393 341661 436780 494492 567517 238655 452504 2601 172142 263787 473734 390207
13556 390207 426976 210949 496072 40165 254981 171835 407400 630757 416683 323867
$$ packed form
13630A55114O06567A79710J10537O8601M11516B10100K25788L16051B74743J76255
13620D50998K5028J54614k8184O7627B68111J06555J06842k25501b5803E6777
13609A52879J60608q58J76945A42401L96080A33836J27881J97729j09932P7375
13599D26889J38925j96273J9808o2682o7553J08830f590j27564D94058B35398
13588A13639K77654J17005P5498k46554P0557k6480P3764R0560j29061A48261
13577E70318j66281m6256K92670l11514r4420K05097m8295J4293j53444L6225
13567B98393M3268R5119N7712P3025B38655K13849B601J69541R1645K09947q3527
13556C90207L6769B10949K85123D0165K14816q3146K35565K23357k14074r2816
$$ plain form
13546 323867 16104 218190 445416 87186 298476 500591 308478 371250 454441 127204
13535 649544 281141 280845 415814 438647 -95566 241931 392391 253240 460781 189376
13524 87705 391424 280403 362157 271661 166021 296241 19013 607783 -34991 528475
13513 118781 12697 593605 195236 343519 -44795 -31158 244254 612747 257104 203938
13503 203938 594560 273424 496153 464465 593326 112398 263743 678121 289718 396351
13493 396351 127019 385670 214777 306066 258281 12288 324400 54901 356293 382484
13483 382484 223952 279798 257134 529377 263672 117598 491517 134404 359121 234122
13473 234122 106254 379546 339069 455182 369857 175990 299301 340283 366805 194332
$$ packed form
13546C23867A6104K02086K27226H7186K11290K02115j92113O2772Q3191A27204
13535F49544B81141k96J34969K2833i5566B41931J50460j39151K07541A89376
13524H7705L03719j11021Q1754r0496j05640J30220A9013N88770c4991E28475
13513A18781A2697N80908A95236J48283d4795J3637B44254L68493B57104n3166
13503B03938L90622B73424K22729l1688J28861A12398J51345M14378B89718J06633
13493C96351A27019K58651j70893R1289m7785A2288L12112E4901L01392K6191
13483C82484j58532N5846k2664K72243B63672A17598L73919A34404K24717j24999
13473B34122A06254K73292m0477J16113q5325A75990J23311M0982K6522j72473
$$ plain form
13463 194332 306646 -52352 -311673 195904 139293 194392 153406 443551 487408 149251
13452 91334 211957 132458 -9858 196921 336806 325261 391927 38328 31196 415095 189887
13440 381338 294619 99903 313843 253777 149035 525698 157534 126861 113990 635606
13430 635606 123908 425608 374128 49009 177450 272952 184044 275318 292377 225134 218987
13419 218987 200448 95926 350669 203207 273713 145010 392554 265412 86388 222347
13409 222347 296876 69849 -67745 336157 -147174 131471 197828 99687 -50622 42651 472866
13398 472866 137187 79483 451380 278231 340802 111718 110959 76466 308494 -60755 -70144
13387 -70144 281302 180188 67621 372414 220498 144029 350967 30540 246116 320755
$$ packed form
13463A94332J12314e2352k59321A95904n6611N5099m0986K90145M3857A49251
13452I1334J20623p9499i858A96921J39885j1545O6666C8328p132L83899A89887
13440C81338q6719I9903K13940o0066j04742L76663A57534l0673j2871N21616
13430F35606A23908L01700n1480D9009J28441R5502q8908R1274J7059o7243o147
13419B18987j8539I5926K54743j47462P0506j28703K47544j27142H6388J35959
13409B22347P4529F9849f7745C36157a47174A31471O6357r8141e0622D2651M30215
13398D72866A37187n7704L71897j73149O2571A11718p59l4493K32028f0755r389
13387g0144B81302j01114F7621L04793j51916p6469K06938C0540K15576P4639
$$ plain form
13377 320755 87718 163254 35559 369161 -91000 523389 228080 121258 -141721 541143
13366 204676 95523 382326 30214 -117386 201213 687653 210301 123212 84765 107324
13356 107324 447971 -31204 -22643 133038 9593 420828 188343 354954 87054 672280 210338
13344 258431 78768 213705 277587 78140 487723 287252 247669 258759 323387 414603 120737
13332 243437 169711 456219 199218 486932 229698 179656 279380 122009 508099 17388
13321 303745 -92880 67414 -11690 190776 17086 11651 383617 551730 173058 212551 209649
13310 209649 199585 550731 348350 32494 410325 234280 153887 151739 204173 168731 315987
13299 315987 34652 329401 486385 208622 291827 253549 144652 -3827 264226 -23240 208146
$$ packed form
13377C20755H7718P5536C5559L33602i1000E23389B28080j06822a41721E41143
13366B04676I5523K86803C0214a17386B01213M86440B10301q7089l8447K2559
13356A07324L40647c1204Q561A33038I593M11235A88343J66611H7054N85226B10338
13344B58431G8768J34937O3882G8140M09583k00471l9583J1090O4628R1216A20737
13332B43437p3726K86508A99218K87714B29698n0042R9724A22009L86090A7388
13321C03745i2880F7414a1690A90776A7086n435L71966J68113A73058L9493k902
13310B09649j0064L51146k02381C2494L77831j76045q0393k148N2434l5442J47256
13299C15987C4652K94749J56984B08622Q3205l8278j08897c827B64226b3240B08146
$$ plain form
13287 123027 283709 308297 74945 282025 273945 234878 232225 173189 -58589 -412201 365702
13275 -88110 200680 342168 107831 -141537 199788 81849 212198 119929 18564 211624
13265 211624 -102722 81739 -56855 251946 222345 294205 338452 -144146 18248 139462 -60394
13253 65340 108257 275444 101227 24825 420873 203002 -159211 427499 42702 434597
13243 434597 22437 -262238 392661 310914 3083 -135986 431826 44764 -167416 265870
13232 383674 227207 -60155 66195 222808 212098 -76512 -289618 162337 275959 272216 82783
13220 269557 279436 -166017 38017 236789 112048 35287 44769 343066 121363 209819 440758
13209 440758 -176109 -29482 -91276 70566 6764 -44347 391011 -71869 2804 -4446 39580 79917
$$ packed form
13287A23027J60682K4588G4945K07080q080l9067k653n9036e8589l53612C65702
13275h8110B00680J41488A07831a41537A99788H1849J30349r2269A8564J93060
13265B11624a02722H1739e6855B51946k9601P1860M4247a44146A8248J21214f0394
13253F5340M2917J67187A01227B4825L96048B03002a59211D27499D2702L91895
13243D34597B2437b62238C92661q1747C083a35986D31826D4764a67416B65870
13232C83674j56467f0155F6195J56613j0710g6512k13106A62337J13622l743H2783
13220B69557R879a66017C8017J98772A12048C5287R482K98297A21363Q8456K30939
13209D40758a76109b9482o1794G0566F764d4347C91011g1869B804d446C9580M0337
$$ plain form
13197 79917 -22869 -269318 -33902 11033 -58125 -12796 65719 100729 -189267 184446 422000
13186 422000 240872 -164313 -35268 330013 199403 201266 46128 -102554 19591 151151
13176 151151 97313 -21350 -156457 -37426 225353 -140709 5178 -115621 84417 382527 166166
13164 3911 142531 142436 -170402 -58985 -203848 -15126 -37049 198717 -139506 83230 171531
13153 171531 -20826 243543 -114764 -66604 253472 317229 387911 181777 -243877 -172471
13143 -172471 198705 342901 -56845 -210322 -16664 298245 -167346 230282 385009 147468
13132 33599 180734 17318 -236294 -252978 278100 -176303 323867 -173622 -74572 75716
13121 39073 -16263 185250 106012 87310 177083 481407 52603 -245975 16902 246299 243760
$$ packed form
13197G9917b2869k46449c3902A1033e8125a2796F5719L5010a89267A84446K37554
13186D22000j81128a64313c5268C30013j30610J863D6128a02554A9591J31560
13176A51151n3838b1350j35107c7426B25353a40709E178a15621H4417K98110A66166
13164C911J38620r5a70402e8985j44863a5126k1923A98717a39506H3230Q8301
13153A71531b0826B43543a14764M8160B53472O3757P0682A81777b43877P1406
13143a72471A98705J44196e6845j53477a6664B98245a67346B30282J54727A47468
13132C3599J47135A7318b36294j6684B78100a76303C23867a73622g4572G5716
13121C9073a6263A85250p9238j8702Q9773L04324E2603b45975A6902K29397k539
$$ plain form
13110 243760 72445 151633 342777 336419 43593 -16889 192071 40204 163633 430364 158740
13098 33882 106029 -194388 162250 -38021 126775 148150 195682 -42822 -105236 -158465 364763
13086 89826 333547 241996 93960 9383 -38883 76423 -267810 293769 -143408 118712 -62631
13074 66244 47873 112317 237384 51040 -243365 198692 177643 -100646 86489 185830 251632
13063 251632 -10588 124947 208971 38266 247323 122333 231472 76092 48141 -252046
13052 -107485 201761 220004 -271767 99656 -285818 103883 103696 -24022 168159 92347 -104772
13040 324213 71131 274538 96479 45829 114083 -152760 -100997 259702 5245 -13447 98130
13028 369137 -139431 -70003 777 5150 -25837 -133391 378865 245681 199175 180830 -4192
$$ packed form
13110B43760G2445P9188J91144o358D3593a6889A92071D0204J23429K66731A58740
13098C3882P2147a94388A62250c8021A26775K1375M7532d2822o2414n3229C64763
13086H9826K43721r1551I3960I383c8883G6423b67810B93769a43408A18712f2631
13074F6244j8371O4444J25067E1040b43365A98692k1049a00646H6489R9341O5802
13063B51632a0588A24947Q4024C8266K09057A22333J09139G6092k7951b52046
13052a07485B01761J8243b71767I9656b85818A03883j87b4022A68159p5812a04772
13040C24213G1131K03407I6479D5829O8254a52760N1763B59702E245a3447I8130
13028C69137a39431O9428G77M373b5837j07554C78865j33184m6506j8345d192
$$ plain form
13016 -118477 107183 63810 105848 131539 214946 38429 -200458 2954 214830 -21972 -155374
13005 -155374 -218741 34790 -49125 -207372 -259639 -104178 -93720 205243 163397 251215 -240620
12993 67789 -27918 244189 76827 -83282 -77335 -163132 57692 -34711 31531 333120 -22727
12981 -159699 345569 127348 -189773 -53605 307689 -71310 218498 65321 21757 24733 141742
12970 141742 168944 -126066 91625 254302 -355538 -54664 77008 294615 113869 -110495
12959 57463 8969 215184 225520 17418 -312339 168402 185039 -148595 -93624 175321 153547
12948 153547 -19238 -212633 61455 164203 -52841 -175528 -65714 -25673 36795 -15918 208374
12936 -46834 280507 -146985 162378 197878 -10230 459147 135356 -40217 -71487 470043
$$ packed form
13016a18477A07183m3373M2038K5691Q3407C8429b00458B954K11876b1972j33402
13005a55374o3367C4790d9125j58247n2267a04178J0458B05243m1846Q7818b40620
12993F7789b7918B44189G6827h3282N947q5797E7692c4711C1531L01589b2727
12981a59699C45569A27348a89773e3605C07689g1310B18498F5321B1757K976J17009
12970A41742K7202a26066I1625J62677c55538e4664G7008K17607A13869a10495
12959E7463H969K06215J0336A7418c12339A68402J6637a48595N4971A75321k1774
12948A53547a9238j93395F1455J02748e2841j22687f5714b5673C6795a5918B08374
12936d6834B80507a46985A62378L5500a0230D59147A35356d0217l1270D70043
$$ plain form
12925 86731 197270 441016 -50427 -157067 180974 -19778 154809 2611 180407 111088 -15687
12913 -110316 350210 86574 81068 194558 -50838 449278 94873 70765 159760 8809 -24060
12901 260960 26830 -403832 -41655 -35473 137165 46348 -43011 175524 148803 193905 150739
12890 150739 138311 -6690 270092 -148135 164623 11288 299301 -138032 65267 2056 5219
12879 5219 -101550 69144 90718 472514 212767 292560 -61142 266585 -168420 221237 -47974
12867 -139813 200137 76841 -54165 95090 -251688 280678 238030 -232807 -125996 -26296
12856 -191494 124343 141863 185249 -307314 99321 53552 52007 45960 154641 126800 -21080
12844 -64930 305790 -188161 21929 250348 -95960 -140147 -71621 169271 -4521 -59895 -55177
$$ packed form
12925H6731J10539K43746e0427j06640A80974a9778A54809B611J77796o9319a5687
12913a10316C50210H6574n506J13490e0838D49278I4873k4108Q8995H809b4060
12901B60960B6830d03832d1655O182A37165D6348d3011A75524k6721M5102m3166
12890A50739j2428f690B70092a48135A64623A1288K88013a38032F5267B056L163
12879E219a01550F9144K1574L81796B12767P9793f1142B66585a68420B21237d7974
12867a39813B00137G6841e4165I5090b51688B80678m2648b32807J06811b6296
12856a91494A24343J7520M3386c07314I9321m5769j545o047J08681k7841b1080
12844f4930C05790a88161B1929K28419i5960m4187O8526A69271d521n5374M718
$$ plain form
12833 -55177 -123885 -89346 75523 -48879 259239 11946 235598 209493 154433 76362 -121432
12821 141044 158179 175180 23616 -42383 -70229 -146735 147326 46256 428914 -286254 34539
12809 169127 -88077 181980 -113158 271752 -156356 179087 166988 -462766 -57301 -116335
12799 -116335 121912 -397267 -126068 14600 -206781 45839 18290 14713 133691 -14454 272418
12787 29626 -112229 -338905 189408 7495 523367 2114 408930 172084 186183 102702 -6810
12775 417107 397773 209769 119307 148583 -33921 339592 36610 31993 -90788 -299485 11744
12763 -22158 -317787 83704 -238559 -24216 279995 69475 166260 -198356 125125 79271 -9608
12751 44173 90561 95569 175871 -39576 -76662 246155 37701 -63660 81184 71943 130461 -117683
$$ packed form
12833e5177o8708L4539G5523d8879B59239A1946K23652k6105n5060G6362a21432
12821A41044J7135J7001B3616d2383k7846p6506A47326D6256L82658b86254C4539
12809A69127h8077A81980a13158B71752a56356A79087j2099d62766e7301n9034
12799a16335A21912c97267a26068A4600b06781D5839A8290l577J18978a4454B72418
12787B9626a12229k26676A89408G495N15872B114M06816A72084J4099q3481f810
12775D17107j9334j88004r0462K9276c3921C39592C6610m617i0788k08697A1744
12763b2158k95629H3704b38559b4216B79995F9475R6785a98356A25125m5854i608
12751D4173M6388N008Q0302c9576l7086B46155C7701f3660H1184r241N8518a17683
$$ plain form
12738 285842 220306 66102 -1860 -106264 -17911 -78575 149806 -80263 64649 32468 267768
12727 267768 424 20791 194221 -96570 -98208 -119681 99667 -15151 -84583 -136819 -334323 -56122
12714 152940 28753 70227 -7116 16119 -61403 244717 240427 194513 35741 139720 -20530
12702 -348970 50031 104965 94864 205237 140431 -8446 237210 99275 195140 -130989 -45144
12690 31845 -131891 30108 46311 74868 -110563 152707 176338 266367 -147786 361684 51042
12678 114553 261532 25337 -143087 164644 109365 283755 -8954 178818 -22482 31600 239216
12667 239216 -9146 92528 -79519 74496 217903 117281 -139763 185969 -190424 168492
12656 220049 392750 -97760 282098 -136952 -185209 117519 -24466 -286130 6314 261747
$$ packed form
12738B85842o5536F6102a860j04404a7911o0664A49806h0263F4649l2181K35300
12727B67768D24K0367J73430i6570j638k1473I9667a5151o9432n2236j97504e6122
12714A52940B8753M1474g116A6119f1403B44717m290m5914C5741J03979b0530
12702c48970E0031N4934j0101J10373o4806h446B37210I9275R5865a30989d5144
12690C1845a31891C0108J6203K8557a10563A52707K3631R0029a47786C61684E1042
12678A14553J46979B5337a43087A64644n5279J74390h954A78818b2482C1600K07616
12667B39216i146I2528g9519G4496J43407j00622a39763A85969a90424A68492
12656B20049J72701i7760B82098a36952m8257A17519b4466k61664F314K55433
$$ plain form
12646 261747 102095 220987 109756 254770 -341368 148169 -199142 136272 -155169 -160494
12636 -160494 354839 45265 267450 134569 371500 334660 82069 491459 266384 326067
12626 326067 157720 -7495 371388 93347 39825 95628 390386 157096 -50945 -198056 56560
12614 458548 -91488 -294251 132212 15039 54889 -138962 -43139 -283771 153132 191373
12604 191373 126021 259874 -80252 132234 113603 60729 -14107 265457 297913 -75939 -176805
12593 -176805 354683 -195749 315349 290809 -241064 5849 412933 -391500 -216525 170589
12582 -160678 159868 100692 285407 -259080 227591 266708 -115694 55034 -29697 -203780
12572 -203780 176198 78561 -13637 133358 297118 -153918 108639 182951 222000 186734
$$ packed form
12646B61747A02095J18892A09756J45014c41368A48169a99142A36272a55169n325
12636a60494C54839D5265K22185j32881K36931l6840H2069M09390k25075N9683
12626C26067A57720g495C71388I3347C9825N5803K94758A57096e0945j47111E6560
12614D58548i1488k02763A32212A5039L9850a38962d3139k40632A53132L8241
12604A91373o5352J33853h0252A32234j8631n2874a4107B65457L2456g5939j00866
12593a76805C54683a95749C15349k4540b41064E849M07084c91500J74975A70589
12582a60678A59868n9176J84715b59080B27591L9117a15694E5034b9697j74083
12572b03780A76198G8561a3637A33358J63760a53918A08639P4312L9049l5266
$$ plain form
12562 186734 -18704 55791 86077 -49935 249817 -266673 3978 8424 254988 -291203 -23145
12550 -18838 42747 -19598 -48688 179479 -217790 30769 -291225 1963 -100840 71198 -110322
12538 103055 -91242 -137851 -4196 211576 74576 247450 -152409 -327686 -203725 358743
12527 -326036 326211 239294 -215553 -103844 -59166 321069 219237 40220 4293 121884
12517 121884 255550 98137 -101098 275106 104267 -205275 27037 -23563 215786 287184
12507 287184 37626 191343 74638 -18941 160822 182250 -211927 23030 5907 -95510 300659
12495 186863 224158 -131928 82035 -169412 80298 91742 -367058 49891 -146914 -173380 64189
12483 8414 -70958 -96859 294958 82806 42136 13959 45064 28111 28949 -10243 228554 -68702
$$ packed form
12562A86734a8704E5791L0286d9935B49817b66673C978M446K46564b91203b3145
12550a8838D2747a9598k9090A79479b17790C0769b91225A963a00840G1198a10322
12538A03055i1242m6609d196B11576G4576J72874a52409j75277J23961C58743
12527c26036C26211q6917b15553a03844M4678C21069j01832D0220D293J17591
12517A21884J33666I8137a01098B75106A04267b05275B7037b3563B15786P1398
12507B87184C7626J53717G4638a8941A60822K1428b11927B3030E907i5510C00659
12495A86863L7295a31928H2035a69412H0298J1444c67058D9891a46914k6466F4189
12483H414g0958k5901B94958H2806m0670A3959L1105j6953Q38a0243B28554f8702
$$ plain form
12470 -228579 -516841 131851 284732 154115 68038 -417010 209532 249102 -113897 -37072
12459 -13444 2853 -30616 -233466 154145 -114882 282324 -127087 -54096 -120587 330611 119236
12447 138994 222736 -210224 -172579 11512 215746 10783 -35237 253634 -252660 -229040 212688
12435 -90523 -177480 -220974 -105184 918 -16588 147742 277937 259873 104751 -11959 -417165
12424 -417165 67720 -151737 -149323 -39732 -82874 -6819 -47422 179086 -56215 19267 239 82096
12412 82096 -383428 -210133 30332 144028 -1794 -321190 20075 -186717 -185549 107344 15550
12400 -96966 -8172 -322766 -73870 522213 106662 60409 233525 -29509 -92929 -162610 224072
12388 -48693 153623 -201585 -3057 -26439 -16085 -243723 20232 -10011 99292 74333 119406
$$ packed form
12470b28579k88262A31851J52881j30617F8038d17010B09532L9570a13897c7072
12459a3444B853c0616k02850A54145a14882B82324a27087e4096o6491C30611A19236
12447A38994Q3742b10224L7645A1512K04234A0783c5237B53634b52660K3620B12688
12435i0523q6957m3494a05184I18a6588A47742J30195j8064A04751a1959m05206
12424d17165F7720a51737K414c9732m3142f819m0603A79086e6215A9267B39Q1857
12412H2096c83428J73295C0332J13696a794l19396B0075a86717J168A07344A5550
12400i6966h172l14594g3870E22213A06662m6253J73116b9509o3420o9681B24072
12388d8693A53623b01585c057k3382J0354k27638B0232a0011I9292k4959M5073
$$ plain form
12377 119406 -3595 44818 303466 166733 36897 -111796 10895 -78726 38592 29582 69778
12366 69778 194828 240552 -213873 141218 -114609 -223086 -139159 133694 44528 -365302
12355 75546 -228867 65989 102333 -149783 -47956 111081 -14361 -54689 -128252 236973 158019
12344 158019 -305841 377185 81609 -61116 -276994 -145071 -10709 -98503 -186231 381204
12333 -118772 -166955 -69871 -3425 -262775 -135761 -129583 128881 52850 -162634 50998 87518
12322 87518 141114 192198 152324 -107978 110378 148111 -265593 -209103 -95947 -117623 67668
12310 312375 30499 -125566 207452 165574 -31448 161259 -66544 315625 -187826 50896
12299 -5581 -207997 99980 13285 176980 217380 25386 110270 165476 -269995 38550 -2511
$$ packed form
12377A19406c595D4818K58648j36733C6897a11796A0895g8726C8592r010M0196
12366F9778J25050M5724b13873A41218a14609j08477Q3927A33694D4528c65302
12355G5546b28867F5989L6344a49783d7956A11081a4361m0328p3563B36973p8954
12344A58019c05841C77185H1609f1116k15878J31923a0709q7794q7728C81204
12333a18772m8183f9871c425k59350J27014O178A28881E2850a62634E0998L6520
12322H7518N3596N1084l9874a07978A10378L7733b65593N6490i5947k1676F7668
12310C12375C0499a25566B07452m1878c1448A61259f6544C15625a87826E0896
12299e581k02416I9980A3285J63695M0400B5386Q4884N5206b69995C8550b511
$$ plain form
12287 71645 80962 -65803 335147 -136778 -37441 124244 -134541 16430 314047 92406 5000
12275 -76572 225069 305529 174661 -272619 251054 297305 -234529 221140 106935 -103221
12264 210093 101747 98266 -140621 5803 89066 55942 -24170 -215386 165079 193402 494699
12253 494699 19709 335266 78473 215316 -147295 274905 94449 288891 -70417 20270
12242 18584 -94185 -271723 354347 143214 -46192 -76438 -191608 -85241 74441 -11203 290259
12230 334658 182909 181010 -77590 302962 356498 415661 311275 170086 340980 -105351
12219 276889 543208 455250 248089 9382 85375 360860 -128302 125561 -78970 31722 -121545
12207 -79172 -369769 -76326 83024 26166 13996 480215 382861 137876 183946 118265 305781
$$ packed form
12287G1645R317f5803C35147a36778c7441A24244a34541A6430K97617I2406E000
12275g6572B25069Q0460j30868b72619B51054M6251b34529B21140A06935a03221
12264B10093A01747l481a40621E803Q3263l3124b4170j91216A65079K8323L01297
12253D94699A9709L15557G8473J36843a47295B74905I4449J94442g0417B0270
12242A8584i4185j77538C54347A43214d6192l0246j15170h5241G4441a1203B90259
12230C34658j51749j899g7590C02962N3536N9163j04386j41189J70894a05351
12219B76889K66319q7958k07161I382P5993K75485a28302A25561g8970C1722a21545
12207g9172k90597g6326H3024B6166j2170M66219r7354A37876M6070o5681J87516
$$ plain form
12196 305781 290664 121065 30634 372728 213884 280057 -39253 139712 149141 59565 221122
12185 221122 130387 132080 263024 -50896 263444 -108227 248008 25330 -74931 223624 106405
12173 58628 122047 143519 153059 -87122 194126 79594 142903 -142612 -122397 -81845 133753
12161 270111 87673 -97286 -127707 -118757 170968 391020 62276 -182302 41088 150708 235658
12150 235658 291499 282904 -139054 -41486 -28177 180129 -110872 176798 193496 48157 -140451
12138 284115 -13016 142994 74888 155077 323822 -50601 176334 72713 453341 409311 61373
12126 3996 184763 -71071 183986 126064 242756 84367 282129 -47425 195261 229801 202811
12115 202811 -94472 -46000 -65759 -82263 -52314 -32694 -57438 -322137 -68553 316789 113747
$$ packed form
12196C05781j5117A21065C0634L42094j58844O6173c9253A39712R429E9565J61557
12185B21122r0735J693J30944e0896B63444a08227B48008B5330g4931B23624A06405
12173E8628O3419K1472R540h7122A94126G9594O3309a42612K0215M0552A33753
12161B70111H7673i7286l0421Q950A70968K20052F2276a82302D1088J09620Q4950
12150B35658N5841q595a39054d1486J3309A80129a10872A76798J6698D8157a40451
12138B84115a3016A42994o8106Q0189J68745e0601A76334G2713L80628m4030F1373
12126C996J80767g1071A83986n7922J16692H4367J97762d7425A95261L4540k6990
12115B02811i4472d6000j9759j6504K9949J9620k4744k64699f8553C16789A13747
$$ plain form
12103 24854 -64794 111460 -256340 211526 380671 -186480 156099 7667 163840 -80229
12092 -6538 -277269 -107502 -52697 -86100 301311 406570 88498 -45175 -99411 -201005 322581
12080 65380 -201634 53226 160041 20145 -204233 -69431 -195033 83732 12230 30476 -334994
12068 -75441 120161 197728 497692 1699694 1053927 428466 254243 146172 -128152 63682
12057 186553 -126100 44713 -122376 -2713 -127851 83913 108405 -59964 -36849 -59192 -212094
12046 -212094 -285891 -5286 -255860 36664 -367547 -126229 -146173 371652 78360 -202389 218888
12034 -72186 -81970 159426 -292658 8479 138644 181938 -186701 197510 124695 -132147 102673
12022 -103762 -52117 -179922 91166 -227127 -186866 -110240 -37472 368411 87404 40502 -70797
$$ packed form
12103B4854f4794A11460b56340B11526J69145a86480A56099G667J56173h0229
12092f538k70731a07502e2697l3403C01311J05259H8498d5175n4236j01594C22581
12080F5380b01634E3226J06815B0145b04233f9431j25602H3732A2230J8246c34994
12068g5441A20161P7567K99964J202002o45767D28466j74223j08071a28152F3682
12057A86553a26100D4713a22376b713j25138H3913K4492e9964K3115k2343j52902
12046b12094p3797e286k50574C6664c67547a26229j9944C71652G8360b02389B18888
12034g2186r784A59426b92658H479J30165M3294a86701A97510p2815a32147A02673
12022a03762N1645j27805I1166b27127M0261P6626c7472C68411H7404D0502g0797
$$ plain form
12010 37532 226184 60147 -57170 -107949 -511643 135021 -126274 78934 -9958 154254 -40670
11998 -63008 183757 264124 -264229 4242 361042 -71366 -41806 -179183 50808 313088 -154774
11986 -186578 -160605 136124 4700 -105564 268261 -123632 82677 18388 -381837 -69310 96466
11974 16094 -214957 -219088 -276135 -35371 214347 24355 174425 123911 -309539 -13979 259633
11962 -33845 -288693 160336 149228 -67316 180609 -192832 959 -84338 -91835 -136530 151353
11950 -249286 360795 -150549 9224 -361588 -45500 230164 -95609 -78287 -188065 71646 -70414
11938 34180 -191629 -251278 -89933 -219351 60827 53812 193929 13146 -46204 3157 -38729
11926 -124188 311417 53920 73827 -37200 -108510 81239 -440172 12938 48461 -2548 -68990
$$ packed form
12010C7532J88652F0147e7170n0779m03694A35021a26274G8934i958A54254d0670
11998f3008A83757Q0367b64229D242L56800g1366K9560j37377E0808K62280a54774
11986a86578K5973A36124D700a05564B68261a23632H2677A8388c81837f9310I6466
11974A6094b14957m131n7047c5371B14347B4355J50070n0514c09539a3979B59633
11962c3845k54848A60336j1108f7316A80609a92832I59h4338p497m4695A51353
11950b49286C60795a50549I224c61588d5500B30164i5609J7322j09778G1646g0414
11938C4180a91629n9649h9933j29418F0827p015J40117A3146d6204C157c8729
11926a24188C11417E3920J9907c7200p1310H1239d40172A2938L5523b548o6442
$$ plain form
11915 -68990 165021 92512 26309 186338 -279765 -93530 171626 198422 -18564 -170179 276024
11903 244297 275295 237031 223403 -156771 196038 -249302 173691 106867 -95512 278333
11892 -7876 -352859 505561 -43608 -229876 65187 -40243 163629 194743 -80831 76397 -327264
11880 -125315 115014 -2160 32976 -13102 -242695 105458 -178109 -183051 128266 -235637 224330
11868 -84461 321069 -35032 203367 -301009 -351623 -4602 -227050 55563 -139163 148387 26363
11856 -236657 31906 -12368 -106584 53422 -236429 106018 61324 -126522 175535 -163641
11845 344875 -88713 -404013 80631 -21875 -5931 68005 142479 -158245 89148 -220445 -136824
11834 -136824 -67692 26214 -456408 262786 -200685 151367 274009 -216053 -3392 -182217
$$ packed form
11915f8990A65021p2509B6309J60029b79765i3530A71626K6796a8564j51615B76024
11903B44297L0998l8264j3628a56771A96038b49302A73691o6824i5512B78333
11892g876l44983E05561d3608j86268F5187d0243A63629L1114h0831G6397c27264
11880a25315A15014b160C2976a3102k29593A05458a78109m942A28266b35637B24330
11868h4461C21069c5032B03367c01009n0614d602k22448E5563a39163A48387B6363
11856b36657C1906a2368r4216E3422b36429A06018m4694a26522A75535a63641
11845C44875h8713l15300H0631b1875e931F8005P4474a58245H9148b20445Q3621
11834a36824f7692B6214d56408B62786b00685A51367J22642b16053c392j78825
$$ plain form
11824 -182217 3716 47404 -143176 -68336 63865 -386056 -38859 10193 -87112 -31672 283104
11812 -186682 -242362 -52739 -140432 156116 -115942 -42505 -112849 -337825 -79827 -199404 -64027
11800 -110660 -490221 120512 -282363 -3594 -242981 53361 165182 -218704 174281 319229
11790 319229 430356 -159115 17609 424315 -356570 -112772 -111278 216784 -1931 -237987
11780 -237987 70116 -146828 120991 -93076 -51500 -40256 46461 -133422 76244 -58999 253787
11768 -28975 -259969 -154795 -226398 -48621 -100339 -209962 8735 417689 -56472 -310140 -319588
11757 -319588 224034 160461 -45316 -240517 -273924 -190680 65300 -161572 -27633 94764 -183088
11745 -66924 -277871 -121 -5762 -42850 -6030 239201 -77978 -206952 -184316 261632 -17570 240130
$$ packed form
11824a82217C716M3688a43176f8336F3865c86056c8859A0193h7112c1672B83104
11812a86682n5680e2739q7693A56116a15942d2505p0344k24976g9827j19577f4027
11800a10660l79561A20512b82363c594k39387E3361J11821b18704A74281J44948
11790C19229J11127a59115A7609M06706c56570a12772J494B16784a931k36056
11780b37987G0116a46828A20991i3076M1576J1244D6461a33422G6244e8999B53787
11768b8975k30994J05174p1603d8621n1718j09623H735M08954e6472k53668r448
11757c19588B24034o3573d5316j95201l3407Q3244F5300a61572b7633I4764a83088
11745f6924k10947a21n641l7088f030B39201g7978j28974K2636B61632a7570B40130
$$ plain form
11732 199309 341568 -150865 100610 133515 155275 -164258 -221180 -84189 83233 98010 -117529
11720 17818 -145875 191032 57345 -206952 52963 -47914 -334711 94154 -8543 287267 -39077
11708 -146382 59711 91828 -233001 -177299 -145097 139849 363897 54843 61445 -166682 -81392
11696 65929 130402 167849 -172197 40861 117033 -168152 -6537 -285173 -173022 433239 -45941
11684 -212397 -240942 352820 151258 172097 36901 -53773 138915 98241 343833 549 88752
11673 88752 -206914 -19263 173756 106714 -8204 182318 -181090 9804 -81931 178996 138713
11662 138713 -1675 -21323 -127204 -104678 308622 -269292 237281 -206083 85907 182479 174628
11651 174628 97287 -19031 -161385 -27646 -116848 -237310 63819 -31198 211501 -31361 154322
$$ packed form
11732A99309J42259a50865A00610L2905K1760a64258n6922h4189H3233J4777a17529
11720A7818a45875A91032E7345b06952E2963d7914k86797I4154h543B87267c9077
11708a46382E9711L2117b33001N5702L2202A39849K24048E4843O602a66682h1392
11696F5929O4473L7447a72197D0861P6172a68152f537k78636J12151D33239d5941
11684b12397k8545C52820A51258K0839C6901e3773A38915m0674K45592E49Q8203
11673H8752b06914a9263A73756o7042h204A82318a81090I804h1931A78996m0283
11662A38713a675j9648j05881K2526C08622b69292B37281b06083H5907R6572p851
11651A74628p7341a9031j42354b7646q9202j20462F3819c1198B11501c1361A54322
$$ plain form
11639 78848 -141439 193136 -151748 6360 -30823 -155204 260613 -267954 -52261 166764
11628 -116976 406733 78454 -44860 -213978 74116 144328 139588 268098 212250 -36002 60832
11616 122292 -146578 -93605 376568 -9586 3643 -20016 8176 -324782 94875 -154916 -155922
11605 -155922 157332 248274 140744 55609 -186243 47116 379644 90672 -87175 -40497 92104
11593 -106543 278994 -7317 351126 104645 416738 -158054 -4734 -52966 26709 18918 305675
11582 305675 -98643 106080 -105054 -6349 -53060 -25023 40830 62862 56917 410710 20376
11570 218613 88077 101531 -185642 19071 54014 -134689 126176 -167328 -23068 219437
11559 208549 234573 259490 346874 -69030 -16667 10322 195655 210652 8428 -110549 94259
$$ packed form
11639G8848a41439A93136a51748F360c0823j24381B60613b67954e2261A66764
11628a16976D06733G8454d4860j69118G4116P0212m740J28510n5848c6002F0832
11616A22292a46578N2973C76568i586C643b0016H176c24782I4875a54916j006
11605a55922A57332R0942j07530E5609a86243D7116L32528I0672h7175d0497I2104
11593a06543B78994g317C51126A04645L12093a58054d734m8232B6709p791K86757
11582C05675i8643A06080a05054f349m6711b5023D0830K2032n945L53793B0376
11570B18613H8077J3454a85642A9071L4943a34689A26176a67328b3068B19437
11559B08549K6024K4917Q7384f9030a6667A0322J85333J4997H428a10549I4259
$$ plain form
11547 110838 119309 -204964 -71930 139013 37476 193331 242542 -14765 365168 197697 131086
11536 131086 100772 -75970 454391 -312022 252786 26588 304388 289864 15193 106175 -88055
11524 357566 152268 77015 90177 -158641 202505 -18333 193002 192894 -164276 -173296 -200377
11513 -200377 148068 391182 165133 31405 -80704 129588 167157 -53196 136409 119664
11503 119664 34474 226469 273801 140213 78394 173580 235222 152021 54646 150611 23878
11491 -60478 203750 173916 103526 68456 -321874 591812 431153 219868 -60242 137312
11480 -137617 -20004 15125 72549 149762 368554 -154331 129232 268268 438949 -144894
11469 74459 196173 268571 201484 175984 55607 141683 -92536 297353 -119743 -53970 82440
$$ packed form
11547A10838Q471b04964g1930A39013C7476J55855M9211a4765C65168j67471o6611
11536A31086l0314g5970D54391c12022B52786B6588K77800j4524A5193R0982h8055
11524C57566A52268p5253J3162a58641B02505a8333A93002j08a64276r020k7081
11513b00377A48068K43114A65133C1405h0704A29588L7569e3196A36409j6745
11503A19664C4474J91995M7332j33588o1819R5186O1642q3201E4646R5965B3878
11491f0478B03750k9834p0390l5070c21874E91812j60659k11285f0242A37312
11480a37617b0004A5125N7424P7213K18792a54331A29232J39036J70681a44894
11469G4459J21714P2398o7087k5500E5607Q6076i2536B97353a19743e3970H2440
$$ plain form
11457 173477 51020 31482 366590 253268 -165612 -132574 -248732 -162993 124040 -273568
11446 -64 -291864 52271 -154998 -207462 41292 -221520 -172126 -141321 20406 -430022 135429
11434 8475 94797 111208 25554 -256438 32628 61985 82784 43283 179572 2099 -215665
11422 -79486 21701 -233439 142019 -71006 -183564 104605 -63578 454765 184507 15656
11411 99148 -157550 -119590 -113172 81611 199145 -220730 70090 -116580 -201914 208905 -193877
11399 54059 151651 -15034 -125100 133718 -203164 15089 -182498 27214 -64645 155172 -91198
11387 -1133 195600 -79880 195346 -219264 -2278 477631 387196 -305062 -62311 220126 -282443
11375 -291404 429188 283361 186920 205992 321082 93151 11814 188810 -37936 272477
$$ packed form
11457A73477E1020j9538L35108j13322a65612L3038j16158Q5739A24040b73568
11446f4k91800E2271a54998n2464D1292b21520M9394L0805B0406d30022A35429
11434H475Q6322J6411B5554b56438C2628K9357K0799l9501J36289B099b15665
11422g9486B1701b33439A42019g1006j12558A04605f3578D54765A84507A5656
11411I9148a57550L7960O418H1611J17534b20730G0090a16580q5334B08905a93877
11399E4059R7592a5034j10066A33718b03164A5089a82498B7214f4645A55172i1198
11387a133A95600g9880A95346b19264b278D77631r0435c05062f2311B20126b82443
11375b91404D29188j45827r6441J9072J15090I3151A1814J76996c7936B72477
$$ plain form
11364 -145768 176012 -176079 -190174 50941 -265870 -185452 -162243 -197660 -10148 -57273 -184425
11353 -184425 -336649 246024 -205343 -388651 336359 -5247 195836 -78149 65663 173883
11343 173883 69128 23547 234728 -234369 429662 -38174 -220518 13998 -6262 -265657 34135
11331 -94070 122782 337570 -20525 -400724 38479 -95065 -22844 108806 244361 -125200
11320 -187895 -131491 2453 -54663 74505 -60177 160506 126346 86821 -11283 -128474 -26181
11308 86041 -186602 98729 39294 -280717 96388 -201051 199783 -105127 20102 -337598
11297 -213577 -154612 5575 -3810 -11743 -343442 28479 126064 -155870 -119963 150845 85491
11286 85491 178067 69354 -86002 -115044 -184800 27744 -122458 -52006 -143956 -355827 67728
$$ packed form
11364a45768A76012a76079j4095E0941b65870Q0418K3209l5417a0148m7125j27152
11353a84425j52224B46024b05343j83308C36359e247A95836g8149F5663J08220
11343A73883F9128B3547K11181b34369D29662c8174j82344A3998f262k59395C4135
11331i4070A22782K14788b0525l80199C8479i5065b2844A08806J35555a25200
11320a87895N6404B453e4663G4505f0177A60506l4160l9525a1283j17191b6181
11308H6041a86602I8729C9294b80717I6388b01051A99783a05127B0102c37598
11297b13577N8965E575c810p933l31699B8479R7585a55870L5907A50845o5354
11286H5491R2576F9354h6002k9042o9756B7744a22458e2006r1950k11871F7728
$$ plain form
11274 47296 165915 33446 149322 -33645 244030 463111 171428 240737 37112 -19785 8439
11262 111778 -27648 -354248 -172955 -276731 80365 224885 205529 64601 4551 -372016 -250581
11251 -250581 68298 -125650 70430 157905 158769 60549 -170419 -126218 -35491 -91132 -511522
11240 -511522 -119413 245778 -46760 131619 130576 -32370 243530 145559 -146368 -193126 -10362
11228 58416 -286633 -13268 182244 80805 -122773 34027 -41956 -78143 -38398 81296 -140096
11216 -17113 -457802 320920 -65991 236083 130964 -1743 -42396 -225843 -311283 -240129 55437
11204 -57530 79201 -354757 -251381 119255 -126683 -99548 -58742 4287 61517 78771 38421
11192 -341527 329969 -131368 -166180 -358070 -99960 -90889 239884 -102178 -192030 44907 -80472
$$ packed form
11274D7296J18619C3446J15876c3645B44030K19081A71428O9309C7112a9785H439
11262A11778b7648l26600a72955j03776H0365J44520j9356F4601D551c72016J21435
11251b50581F8298a25650G0430Q7475Q64F0549a70419M4201c5491n5641m20390
11240e11522a19413B45778d6760A31619j043c2370B43530r7971a46368m6758a0362
11228E8416b86633a3268A82244H0805a22773C4027d1956l6187c8398H1296a40096
11216a7113m40689C20920f5991B36083j05119a743m0653j83447q5440P1154E5437
11204e7530G9201c54757J03376A19255a26683K7135M0806D287N7230J7254C8421
11192c41527C29969a31368l4812j91890i9960R071B39884a02178q9852D4907h0472
$$ plain form
11180 -58142 -192941 9047 -118758 -328906 -56829 -41085 1282 29867 -209473 -217908 156208
11168 -9190 -40477 -325181 -182535 -36587 -10631 128802 147881 114541 9249 375548 -33684
11156 66555 -196439 -35854 -83690 -67614 14932 393563 116066 179507 -165227 8177 76149
11145 76149 324012 298577 -342673 -216002 267828 26122 -56304 336079 60958 -171130
11134 326994 46743 131854 -136438 -150047 -150179 10189 121685 64257 128305 321604 7726
11122 114526 131833 -16501 -47624 337028 163551 110987 120581 -13387 152838 -348829 -49104
11110 -187816 212670 -106207 216214 372077 150128 -49679 374960 7349 299764 64950
11099 228097 126497 298089 36996 -202556 87181 289695 94226 -218165 63399 172335
$$ packed form
11180e8142j34799I047a18758k10148e6829J5744A282K8585b09473q435A56208
11168i190l1287k84704J42646c6587a0631A28802J9079l3340I249L66299c3684
11156F6555a96439c5854m7836J6076A4932L78631A16066O3441a65227H177O7972
11145G6149K47863k5435c42673J26671B67828B6122e6304C36079F0958a71130
11134C26994D6743Q5111a36438j3609j32A0189J11496n7428O4048J93299G726
11122A14526J7307a6501l1123C37028A63551n2564R594a3387A52838c48829d9104
11110a87816B12670a06207B16214J55863A50128d9679C74960G349K92415F4950
11099B28097j01600J71592C6996b02556H7181K02514I4226b18165F3399J08936
$$ plain form
11089 172335 -360410 67089 76165 342604 336956 181174 215683 485807 397066 64454 203501
11078 203501 529311 466815 615149 137852 363434 462646 303752 316056 380746 340370
11068 340370 368375 354161 196553 50279 293709 257123 327529 390844 172534 493128 403300
11057 403300 277132 560439 295569 757970 468916 592977 419295 551364 366181 609426
11047 609426 817218 820869 995802 428917 553505 976681 506404 508574 1041204 518096
11036 457822 609697 393324 834373 693218 478875 501285 469105 721701 609530 761822
11026 761822 816467 757471 703164 583346 716635 305360 570200 612725 518423 710220
11016 710220 612409 420494 519624 660213 777681 656148 821774 453241 622030 565329
$$ packed form
11089A72335c60410F7089R076K66439n648j55782L4509K70124q8741F4454J39047
11078B03501L25810o2496J48334A37852K25582R9212j58894J2304O4690m0376
11068C40370K8005j4214j57608E0279K43430l6586P0406O3315A72534L20594q9828
11057D03300j26168K83307k64870M62401k89054J24061j73682J32069j85183K43245
11047F09426K07792L651J74933D28917J24588M23176m70277K170N32630E18096
11036D57822J51875k16373M41049j41155k14343K2410l2180K52596j12171J52292
11026G61822N4645n8996n4307j19818J33289C05360K64840M2525r4302J91797
11016G10220r7811j91915R9130J40589J17468j21533J65626l68533J68789n6701
$$ plain form
11006 565329 1002039 799587 707652 380788 340617 977427 761036 764858 400125 685164
10996 685164 445863 638303 492484 612729 729606 637606 815892 785723 692898 588832
10986 588832 972192 932524 591083 1318630 699098 1016432 1325713 1049939 1258602 1618382
10976 1618382 1750801 2024361 1847973 2495587 2514682 2822628 2678055 2587068 2788702 2349052
10966 2349052 2127497 1750889 1344480 1746746 1481330 1291009 1666769 1452156 1745785
10957 1745785 1686072 1547646 1570276 1330227 1515189 1014500 751053 1071857 822260 501393
10947 501393 390898 508556 219007 131934 312430 539636 436683 332177 -45300 161445
10936 318772 228670 187901 -40712 95526 -48217 107540 111462 -32870 328314 189426 -40882
$$ packed form
11006E65329M36710k02452r1935l26864m0171O36810k16391L822l64733K85039
10996F85164k39301J92440j45819J20245J16877r2000J78286l0169r2825j04066
10986E88832L83360l9668l41441P27547o19532L17334L09281k75774K08663L59780
10976A618382J32419K73560j76388O47614J9095L07946j44573r0987K01634m39650
10966B349052k21555l76608m06409M02266k65416j90321L75760k14613K93629
10957A745785n9713j38426K2630k40049J84962n00689k63447L20804k49597l20867
10947E01393j10495J17658B19007q7073J80496K27206j02953j04506d5300A61445
10936C18772r0102m0769d0712I5526d8217A07540L922c2870C28314j38888d0882
$$ plain form
10924 192386 -354309 324228 255519 74155 -15854 -282211 8859 -1492 247268 -18175 -5557
10912 95334 -62515 231799 62757 259630 137811 230294 79400 -226644 -242240 230401 196391
10901 196391 38034 -29579 64190 -348428 176123 -55442 12739 -294181 -158891 -291425
10891 -291425 -238011 131634 -103315 -181136 3638 -267878 -135864 -371588 -223726 -56401
10880 -54316 110467 168441 -28395 -175954 -40152 -112203 -211126 -91586 -111253 115274 -115283
10868 88297 -165537 -82856 -109390 541331 -361897 -62895 142857 -138555 74134 -161643
10857 -411973 -145864 -53508 -90171 -116301 163677 206165 -137694 84005 231695 78512 -147196
10845 -107966 -68396 -228957 109203 -187745 146860 143284 41529 -54845 194056 -43321 -301839
$$ packed form
10924A92386c54309C24228o8709G4155a5854k66357H859a492B47268a8175e557
10912I5334f2515B31799F2757J96873j21819R2483G9400b26644j5596B30401l4010
10901A96391C8034b9579F4190c48428A76123e5442A2739b94181J35290j32534
10891b91425N3414A31634a03315p7821C638b67878J32014k35724J47862e6401
10880e4316A10467N7974b8395j47559d0152p2051r8923i1586j9667A15274a15283
10868H8297a65537Q2681k6534E41331c61897f2895A42857a38555G4134a61643
10857d11973a45864e3508l6663k6130A63677M2488a37694H4005J47690G8512a47196
10845a07966L9570j60561A09203a87745A46860l576D1529e4845A94056d3321k58518
$$ plain form
10834 -301839 -121143 -106858 167897 -62869 159652 49687 -60417 -15440 281599 426254
10824 426254 8331 165098 -170955 -112661 24330 167613 143817 -27928 -271099 -63430 -100855
10813 -100855 -324060 15976 75606 239980 2356 186859 -64411 -61308 -144164 -194440 36575
10801 -86489 -106985 -187049 -80606 86954 189390 45956 217039 -289463 106191 -162690 -39067
10789 -236534 -49269 -249459 -234439 -483766 57806 -199519 -156339 76932 -44442 210625 97661
10777 -11130 94147 -88831 -151273 -31299 -39162 -20172 56611 -152551 -60292 80174 35951 -464
10764 351047 -297374 -388786 18310 -148577 -120672 -324672 222657 -77501 -41396 91325 -335651
10752 -93784 -261132 -236732 182122 183528 -80346 -348364 12324 124253 -161823 144308 -57077
$$ packed form
10834c01839a21143J4285A67897f2869A59652D9687f0417a5440B81599J44655
10824D26254H331J56767a70955N8294B4330J43283k3796b7928k43171f3430l7425
10813a00855k23205A5976N9630J64374B356J84503f4411L103q2856n0276C6575
10801h6489k0496q0064h0606H6954J02436D5956J71083b89463A06191a62690c9067
10789b36534d9269k00190J5020k49327E7806a99519M3180G6932d4442B10625I7661
10777a1130I4147h8831o2442c1299p863J8990E6611a52551f0292H0174C5951d64
10764C51047b97374r1412A8310a48577K7905k04000B22657g7501L6105I1325c35651
10752i3784j67348K4400A82122J406h0346k68018A2324J11929a61823A44308e7077
$$ plain form
10740 -226161 -70115 133639 -70606 237811 45758 -7649 -116370 24959 -72891 -124041 111470
10728 45326 -274766 -60229 -418647 107140 -713 -122474 183834 390791 -101677 -89715 -35407
10716 -269392 -66513 -72023 -445347 73603 -250971 239581 -100126 -218059 -157630 200470
10705 329437 -252792 59664 -30996 71579 -123486 111753 -148097 34989 -82577 -196085
10695 -196085 7997 10349 -20744 -57269 -161735 -57761 104609 -131402 162608 -188392 -182064
10684 -182064 -162015 63983 53849 -59249 -51233 -55805 -124853 107259 68796 -179248 -55547
10672 -83063 127408 -42388 380989 -178700 147083 -205250 -52982 -197088 -205831 -280123 -78010
10660 -194737 -286003 -364845 9181 -147597 61937 -82834 -44190 5591 -105372 17528 188142
$$ packed form
10740b26161g0115A33639g0606B37811D5758g649j08721B4959g2891n1150A11470
10728D5326b74766f0229l58418A07140g13j21761A83834K06957a01677J1962c5407
10716b69392f6513n510l73324G3603b50971B39581a00126j17933O0429B00470
10705C29437b52792E9664c0996G1579a23486A11753a48097C4989h2577j13508
10695a96085G997K352b0744l6525j04466e7761A04609a31402A62608a88392O328
10684a82064K0049F3983j0134e9249Q016m572o9048A07259l8463a79248e5547
10672h3063A27408d2388C80989a78700A47083b05250e2982j44106q743p4292g8010
10660a94737r1266p8842I181a47597F1937h2834L8644E591a05372A7528J70614
$$ plain form
10649 188142 -180454 122825 103909 -177535 -237585 -210243 -30023 101336 149426 -48234 198948
10637 215054 -63045 -6359 -191437 -169421 660 -37052 149598 -112726 31039 -257021 172383
10625 173307 -91148 79056 89870 117300 -158657 -129113 -12876 -104324 -123252 -54102 -156488
10614 -156488 -10592 -219660 -415547 -379091 188110 -78800 -345279 -260557 -176034 20888 -40031
10602 -81053 -30562 251800 -151844 -45455 160982 -143067 -251743 -198543 2942 80003 -128677
10590 -119185 -102546 33495 -144687 -89878 -11950 -81934 -101499 -289613 -227427 106154 -19226
10578 -97865 192822 -220335 -160536 14302 165436 -161061 4025 3239 11972 126065 -45824
10566 -59147 46669 69761 -379390 252261 -104620 55838 81340 -110210 -182002 -152222 -315554
$$ packed form
10649A88142a80454A22825j8916a77535o0050K7342c0023A01336M8090d8234A98948
10637B15054f3045f359j85078K2016F60c7052A49598a12726C1039b57021A72383
10625A73307i1148G9056J0814K7430a58657K9544a2876r1448j8928e4102j02386
10614a56488a0592k09068j95887L6456A88110g8800k66479Q4722Q4523B0888d0031
10602h1053c0562B51800a51844d5455A60982a43067j08676N3200B942P7061a28677
10590a19185J6639C3495a44687N4809a1950o9984j9565j88114O2186A06154a9226
10578i7865A92822b20335N9799A4302J51134a61061D025p86Q733J14093d5824
10566e9147D6669K3092c79390B52261a04620E5838K5502a10210p1792K9780j63332
$$ plain form
10555 -315554 -130330 31915 291489 56408 19643 -288356 -221661 -105486 120637 -38226
10544 -27143 -72590 -179485 -88814 94192 -99187 142379 20240 13345 -423566 -185092 -412
10532 108265 -300734 -305949 216832 -83104 164160 111732 157122 -35665 76387 -29142 -22337
10521 -22337 -161657 79926 -68739 85817 -104663 -251046 -172817 -71331 118427 -149045 -246193
10510 -246193 -89141 -102553 -396501 84315 -73023 247824 -19650 -107641 -39781 -308146 -101515
10498 -195284 191855 -144726 -155596 135008 253940 171215 108907 -89952 -40579 -108593 -191999
10487 -191999 -104750 -131514 -172161 -58872 66361 55600 224993 381395 167198 14354 78718
10476 78718 -229271 -2795 -28645 13214 -37897 -13452 216860 -63321 -35477 -60214 -134995
$$ packed form
10555c15554a30330C1915K59574E6408A9643b88356O6695a05486A20637c8226
10544b7143m5447j06895h8814I4192i9187A42379B0240o895d23566a85092d12
10532A08265c00734n215B16832h3104A64160n2428M5390c5665G6387b9142O805
10521b2337j39320G9926f8739H5817a04663j46383P8229g1331A18427a49045r7148
10510b46193h9141j3412k93948H4315g3023B47824a9650q7991c9781k68365a01515
10498a95284A91855a44726j0870A35008J18932q2725o2308h9952d0579o8014q3406
10487a91999Q7249k6764m0647e8872F6361j0761J69393J56402A67198A4354O4364
10476G8718b29271b795k5850A3214c7897a3452B16860f3321K7844k4737p4781
$$ plain form
10465 -134995 -181235 83865 113275 136673 65623 282794 -24131 -42040 -109023 -176101 149367
10453 -274239 -276741 79203 362419 410962 -91673 91742 -151722 40498 -414442 22653 111715
10442 111715 74765 -198873 -27823 216045 8986 81963 -102280 125586 115290 -289343 396989
10430 12990 -287319 517717 28887 74783 172643 241843 101827 -7117 -300107 -120475 -205148
10419 -205148 27471 245298 70345 7164 95070 -45029 -73077 170096 92087 -221907 -137352
10408 -137352 -223653 96171 -193072 52481 -76835 285826 -200043 -263789 -50316 -147248 -317042
10397 -317042 271796 183241 -252324 168746 123494 -32807 -328701 -274633 53127 213365
10387 213365 130370 227465 222787 55225 286224 169880 285153 295764 324082 23851 395538
$$ packed form
10465a34995m6240H3865K9410K3398F5623K17171b4131j7909o6983o7078A49367
10453b74239k502G9203K83216M8543i1673I1742a51722D0498d14442B2653Q9062
10442A11715l6950a98873b7823B16045H986P2977a02280A25586j0296b89343C96989
10430A2990b87319E17717B8887M5896R7860O9200A01827g117k92990a20475q4673
10419b05148B7471K17827G0345G164Q7906d5029k8048A70096p8009b21907Q4555
10408a37352q6301I6171a93072E2481g6835B85826b00043o3746e0316r6932j69794
10397c17042B71796q8555b52324A68746m5252c2807k95894N4068E3127J60238
10387B13365q2995R7095m678E5225K30999j16344J15273J0611K8318B3851L71687
$$ plain form
10376 395538 156296 100569 85196 148728 192938 274027 191 288210 147368 1583 467270
10365 467270 239618 430384 221062 259490 112795 235587 243121 6325 84176 190392 333309
10354 333309 464662 195635 330764 536385 237305 464813 -772 153611 189988 63081
10343 301842 264569 122699 96795 164341 242151 -4990 270502 -163426 240020 -10602 -11898
10332 -11898 -95401 -94790 69910 180910 269160 268950 267087 104849 -72625 208086 421296 90708
10319 142839 299029 101526 175849 18177 -83518 416421 -314033 291339 -51131 172276
10308 -3449 210211 209604 -62187 -196074 -101487 -175331 278189 307304 42698 7016 -203045 -145757
10296 -145757 -141732 -198414 -264638 -96233 30109 270204 30923 19563 -378307 -191366 -111297
$$ packed form
10376C95538A56296n5727j5373O3532M4210Q1089A91K88019j40842A583M65687
10365D67270k27652J90766k09322L8428A12795J22792P534F325P7851J06216J42917
10354C33309J31353A95635J35129K05621B37305K27508g72A53611L6377F3081
10343C01842l7273A22699k5904O7546P7810d990B70502a63426B40020a0602j296
10332a1898q3503O11F9910J11000Q8250k10j863A04849g2625B08086K13210I0708
10319A42839J56190A01526P4323A8177h3518D16421c14033B91339e1131A72276
10308c449B10211o07f2187j33887R4587p3844B78189K9115D2698G016b03045N7288
10296a45757M025n6682o6224i6233C0109K40095C0923j1360c78307J86941Q0069
$$ plain form
10285 -111297 177739 -119435 -80704 -147255 -23460 77765 -76278 101917 -68259 109768 -149983
10273 56176 25596 -27288 -217692 -106514 3180 -235845 82475 -186682 136629 -109264 85496
10261 406274 289429 334454 85344 365586 655419 364165 5516 -13767 4618 103166 -97486
10249 -92687 83806 35111 -36857 -215116 112477 -91143 21471 132380 -19168 -54885 -127182
10238 -127182 223835 -265710 -28796 -148536 -105790 -240236 93975 -50947 -51937 83464 -85060
10226 130987 -125276 -130572 129580 -99707 170089 -115329 226299 -26544 45520 -10747 9904
10214 -332681 -102555 134166 28529 -157466 -453932 -124108 -362640 26922 -13081 159501
10203 30525 -247452 -127328 -106535 36664 128193 -151606 -118931 -316869 -401084 93069 56384
$$ packed form
10285a11297A77739a19435L8731o6551b3460G7765g6278A01917f8259A09768a49983
10273E6176B5596b7288j90404a06514C180b35845H2475a86682A36629a09264H5496
10261D06274j16845M5025H5344K80242K89833k91254E516a3767D618R8548i7486
10249i2687H3806C5111c6857j78259A12477i1143B1471J10909a9168l5717p2297
10238a27182B23835b65710b8796j19740M2746j34446I3975e0947r90H3464h5060
10226A30987a25276n296A29580i9707A70089a15329B26299b6544D5520a0747I904
10214c32681a02555A34166B8529a57466k96466a24108k38532B6922a3081A59501
10203C0525b47452J20124K0793C6664R1529a51606L2675j97938q4215I3069l6685
$$ plain form
10192 56384 13267 -237050 206080 -146545 -68618 -463974 -158216 -66015 -18537 -154753
10182 -154753 237189 -165657 60903 195951 -73221 -15311 99708 82790 -195284 -413003
10172 -413003 -47242 -255707 139359 78787 -98913 38515 265575 -344888 46932 271271
10162 271271 -215918 -50167 -594292 -15854 333317 288453 -162543 -290577 -86494 -211368
10152 -211368 -25069 -165994 -244037 -45617 -352664 102242 -270587 -107655 -15019 -375849
10142 -375849 248355 -254250 -119676 171039 -97708 55892 91273 -229229 -231328 14816 -303541
10130 -217922 54883 -6283 -78100 -133752 -83613 -635 -6511 -134270 49075 612473 51074 -198501
10117 60105 -439704 158070 -318050 -71358 -143644 -77074 47867 233400 -62482 191271 -275748
$$ packed form
10192E6384A3267b37050B06080a46545f8618l95356a58216f6015a8537j36216
10182a54753B37189a65657F0903J35048g3221a5311I9708j6918a95284k17719
10172d13003d7242k08465A39359o0572i8913C8515K27060c44888D6932K24339
10162B71271b15918e0167n44125a5854C33317m4864a62543j28034h6494j24874
10152b11368b5069j40925p8043d5617l07047A02242b70587a07655a5019l60830
10142c75849B48355b54250a19676A71039i7708E5892L5381b29229k099A4816c03541
10130b17922E4883f283p1817n5652N0139f35n876j27759D9075N63398E1074a98501
10117F0105d39704A58070c18050g1358p2286O6570D7867J85533f2482A91271b75748
$$ plain form
10105 190086 47553 -413490 -10569 -60632 -258308 -302694 -34298 -152336 -305653 -276438 -155791
10094 -155791 -84491 86925 -232772 -281896 97131 -273196 -262987 236534 -158004 3107 -470970
10082 -291045 -108595 126007 -429276 47813 257696 -85932 -111117 -99681 107074 285467
10072 285467 35050 -129221 64863 -111661 58237 -160306 -52983 127172 89193 -102925
10061 -230301 99157 -50472 -56294 -5809 -39473 -240129 88269 215946 -208986 -133387 -126840
10050 -126840 -166335 87169 -205431 -150771 101705 -99552 -76679 158108 241037 -294161 -234207
10039 -234207 -14613 -71842 -165434 44723 83722 -66241 -73180 -91626 -112437 -55501 153463
10027 19791 85555 47510 -254615 -46971 200194 -68032 -179626 48627 -144126 834 -71969
$$ packed form
10105A90086D7553d13490a0569n0063j97676m4386c4298j18038j53317K9215J20647
10094a55791P1300H6925b32772m9124I7131b73196J0209B36534a58004C107d70970
10082b91045a08595A26007d29276D7813K09883h5932k5185J1436A07074J78393
10072B85467C5050a29221F4863a11661E8237a60306e2983A27172l7979a02925
10061b30301I9157e0472n822e809l3664k00656H8269J27677b08986P5599O547
10050a26840l9495H7169b05431N4660A01705i9552K2873A58108Q2929b94161N9954
10039b34207a4613n7229r3592D4723L8999f6241o939j8446k0811e5501A53463
10027A9791O5764l8045b54615d6971B00194f8032j11594D8627a44126H34g1969
$$ plain form
10015 -119476 -218164 17015 -109770 -217690 -106712 122880 141025 68539 9084 56947 -154652
10003 -76393 -151590 222237 -236103 135256 -383519 -45805 125722 122167 -158323 -21372 91268
9991 -40688 -30569 -140093 -378958 -45928 -199020 -319662 -25271 3623 225174 -252987 71809
9979 -134921 270883 -50056 193407 123619 -142061 128891 -98230 202782 -154167 -96291
9969 -96291 12958 -220402 -97565 304992 27471 -393374 -114185 -163430 -142864 -125195 -215299
9958 -215299 130342 -86629 -90825 -189753 -86778 -69129 72118 -15819 45189 196205 -177433
9946 -6905 -101583 33626 -77828 44017 -15996 -99733 -8687 -95413 -12930 -147803 -283520 -136826
9933 45396 336830 -69271 -85674 150112 -363716 -217964 -56131 174957 400299 116456
$$ packed form
10015a19476r8688A7015a09770j07920a06712A22880J8145F8539I084M7863a54652
10003g6393p5197B22237b36103A35256c83519d5805A25722l555a58323b1372I1268
9991d0688J0119j09524k38865d5928j53092j20642b5271C623K21551b52987G1809
9979a34921B70883e0056A93407o9788a42061A28891i8230B02782a54167N7876
9969i6291A2958b20402i7565C04992B7471c93374a14185m9245K0566J7669r0104
9958b15299A30342h6629m196r8928h6778J7649G2118a5819D5189J51016a77433
9946f905r4678C3626g7828D4017a5996q3737h687q6726a2930j34873j35717a36826
9933D5396K91434f9271j6403A50112c63716J45752e6131A74957K25342A16456
$$ plain form
9922 -155920 -39879 -498471 37324 -91979 -263277 39937 -159394 6447 13999 72335 -89694
9910 31380 -29979 155116 -139734 -141463 -31575 -283137 -357853 -32262 57773 -99275 -167456
9899 -167456 -113052 -198795 -52668 -237924 139893 -200442 -185902 -173578 -92335 -26150 -58266
9888 -58266 -108964 -231071 206361 -164651 37812 -22043 28783 -260175 -180065 -100267 -233541
9877 -233541 -217802 -85241 -80151 165906 226866 -286943 -238866 -18667 -188066 -7450 -176583
9866 -176583 -171998 -90269 -206569 -300666 62348 -206274 -311990 112207 -191143 25763 -69643
9854 -237522 -274916 -244874 -93446 -184244 -160152 -484888 -174764 22446 -27364 -91696 289369
9842 -139767 45033 -56408 -205416 -26374 -176819 58366 890 198943 -83772 -430474 105582
$$ packed form
9922a55920c9879m58592C7324i1979j71298C9937a59394F447P552N8336h9694
9910C1380b9979A55116a39734j729c1575k51562p4716c2262E7773i9275o8181
9899a67456N4404q5743e2668j85256A39893b00442J4540J2324Q1243b6150l2116
9888e8266n0698j22107B06361a64651C7812b2043B8783b60175Q0110P9798j33274
9877b33541J5739h5241N090A65906O0960b86943M8077a8667j69399g450j69133
9866a76583M585Q1729j16300r4097F2348b06274j05716A12207a91143B5763f9643
9854b37522l7394L0042i3446r0798K4092l24736a74764B2446b7364o4332B89369
9842a39767D5033e6408j49008b6374j50445E8366H90J98053h3772l46702A05582
$$ plain form
9830 148732 79505 -152656 -357363 166780 -60615 -53289 155774 -51265 -192013 51352 191053
9819 191053 90811 -347580 181236 -362588 -76691 -167305 27168 152606 16952 -314021 135
9807 -58502 -244760 -12819 -168151 -106313 193772 -430576 -183135 -128484 -106274 213075 -18529
9795 -292697 -56028 42065 -79629 -169915 9495 155056 191411 -77032 -103540 156490 -49452
9783 -88702 -395005 -180921 -213885 176627 -107857 -221446 -155937 -207961 411394 23002 -70911
9771 34228 -223181 -59514 180977 -39064 -205131 -147514 -248007 5573 -167302 -123058 -297679
9760 -297679 31815 -352716 -1180 -1512 -318153 -370401 393279 -227880 -156293 56953 144938
9749 144938 -44028 156351 33982 -115722 16617 262706 16858 -247609 -29119 -198137 -272380
$$ packed form
9830A48732o9227a52656k04707A66780f0615P326A55774e1265j40748E1352J39701
9819A91053I0811c47580A81236c62588g6691r0614B7168J25438A6952c14021A35
9807e8502j86258a2819j55332O1838A93772d30576a83135N4651K2210B13075a8529
9795b92697e6028D2065g9629r0286I495J45561L6355g7032k6508A56490d9452
9783h8702l06303a80921l2964A76627a07857j13589O5509n2024D11394B3002g0911
9771C4228b23181e9514A80977c9064j66067N7617j00493E573a67302M4244j74621
9760b97679C1815c52716a180l32l16641n2248C93279b27880P1587E6953Q7985
9749A44938d4028A56351C3982a15722A6617K46089A6858b47609b9119j69018p4243
$$ plain form
9738 -272380 34014 61967 92129 283137 114096 -420905 -2099 55940 -370661 -88293 -33129
9726 -169898 11413 -437070 -214096 -232896 163521 -137922 -217522 -91442 63345 -98338 78804
9714 -224287 -96761 -198868 -221303 268555 -20471 -81002 -111844 740 -210737 -23538 -353299
9703 -353299 -46171 -37841 -31908 368433 -111478 -83942 32864 183332 30560 -232764 -236776
9692 -236776 -115942 90674 27885 -222333 -209047 -256624 208868 -171442 -460524 9599 -97425
9680 -55569 -176417 -298879 -194384 36276 -113301 327996 79165 -69037 -95569 -323464 -18393
9668 -42114 22192 132864 74071 168339 17774 -11348 -60612 -203439 11688 88806 221768
9657 221768 106499 211291 211534 -190855 -161120 1390 -92036 64517 -21922 -169349 24479
$$ packed form
9738b72380C4014K7953L0162J91008A14096d20905b099E5940c70661h8293c3129
9726a69898A1413d37070b14096j8800A63521a37922p9600i1442F3345i8338G8804
9714b24287i6761j02107k2435B68555b0471o0531l0842G40b10737b3538l29761
9703c53299d6171Q330N933C68433a11478K7536C2864J50468C0560b32764m012
9692b36776a15942I0674B7885b22333J3286m7577B08868a71442k89082I599i7425
9680e5569j20848j22462J04495C6276a13301C27996G9165f9037k6532k27895a8393
9668d2114B2192J10672n8793R4268A7774a1348m9264j42827A1688P7118J32962
9657B21768A06499J04792K43a90855K9735A390i2036F4517b1922j47427B4479
$$ plain form
9645 10208 -226219 -233111 208622 2531 278386 -113867 -20863 -69396 -250542 92693 -21549
9633 4960 -263837 -143979 -210916 -273659 -197501 -180662 -110663 -179866 43693 -317522 -165454
9622 -165454 -136 -312717 -134842 -82350 -135099 227620 197821 -167770 166721 -195455 -65733
9610 19770 -145730 -231200 170365 -412042 -55478 30434 49765 -176549 155564 -221027 86102
9598 -2771 -99801 -293681 -191193 149613 -55050 29110 -90986 280746 -105341 -118058 -33639
9586 59279 326077 81039 -32619 4781 -221108 165161 25186 -196830 -356095 -121628 64840
9574 -95106 212550 -164957 79063 190650 117103 -166933 -81263 -75616 -42420 79377 -53476
9562 -183245 -182770 75519 197108 -11500 -344163 -316064 -319355 -156656 13802 -21087 233239
$$ packed form
9645A0208b26219o892B08622B531K75855a13867b0863m8533j81146I2693b1549
9633D960b63837J19858o6937o2743P6158J6839O9999o9203D3693c17522J52068
9622a65454a36l12581a34842N2492n2749B27620k9799a67770A66721a95455f5733
9610A9770a45730q5470A70365d12042e5478C0434J9331a76549A55564b21027H6102
9598b771r7030j93880J02488A49613e5050B9110i0986B80746a05341j2717c3639
9586E9279K66798H1039c2619D781b21108A65161B5186a96830j59265a21628F4840
9574i5106B12550a64957G9063J11587p3547a66933h1263N647L3196G9377e3476
9562a83245M75G5519J21589a1500l32663K8099l291a56656A3802b1087B33239
$$ plain form
9550 -355147 140085 57596 168397 -59919 -135095 9807 -314252 -180329 -18112 -78494 -63220
9539 -63220 -16636 -383207 -73669 -222631 28638 -162691 158526 -51678 -114736 110902 -37022
9527 -57277 -181492 -113347 -113582 -7157 83582 -101699 -77556 -234266 -201753 -49193 -38949 -182083
9515 -182083 -255229 -87853 -521405 -47824 -216526 -339362 142249 -167911 -253986 -61655 -282147
9504 -282147 220035 -6682 -309655 -142033 -447891 -41876 133920 -186106 -19917 -70368 -191764
9493 -191764 -355337 -197935 -83148 -38529 -27061 17132 86084 -296001 -27706 188888 -183684
9481 -57894 252713 185949 -133465 81479 -214757 -144016 -67252 -198790 29760 -112956 -183891
9470 -183891 -93012 25309 -205148 -72273 -113862 87023 -258280 133917 -23712 -213123 -223887
$$ packed form
9550c55147A40085E7596J10801e9919p5176I807c14252J33923a8112o0382J5274
9539f3220a6636l66571g3669j48962B8638a62691A58526e1678o3058A10902c7022
9527e7277j24215O8145k35g157H3582a01699K4143j56710L2513d9193J0244j43134
9515a82083p3146h7853m33552d7824j68702j22836A42249a67911q6075f1655k20492
9504b82147B20035f682l02973a42033l05858d1876A33920a86106a9917n0451j21396
9493a91764j63573J57402h3148c8529J1468A7132O8952b96001b7706A88888a83684
9481e7894B52713o6764a33465H1479b14757P0741f7252j31538B9760a12956p0935
9470a83891R0879B5309b05148g2273m1589H7023b58280A33917b3712j89411j0764
$$ plain form
9459 -223887 -114044 138104 -18446 -70297 -51030 49528 -181927 182313 88709 -52093 -114295
9448 -114295 -76271 -396927 78988 -60619 115743 90973 43313 19862 60407 -15687 110324
9436 296125 150125 41666 -208185 56789 -54645 15430 29325 215415 -6460 -17042 -303863
9425 -303863 243241 344787 -305186 -238882 -184750 -146382 44420 132145 74185 -74920 -343062
9414 -343062 -20923 255497 27493 -60427 -108412 53965 -29116 -1478 60032 -136021 88358
9402 -48318 -47531 -278233 39737 -73892 59608 -210941 2470 83675 47798 -123955 -261182 233534
9389 51590 -18311 104143 142345 -249734 42602 -41057 -328914 10877 -101226 -40742 -241653
9378 -241653 73541 241997 -195018 -172362 -20450 -78136 -61918 -66048 69004 24045 30333 -177828
$$ packed form
9459b23887J09843A38104a8446n1851J9267D9528a81927A82313H8709e2093o2202
9448a14295L8024l20656G8988f0619A15743k4770D3313A9862M0545a5687A10324
9436B96125j46000D1666b08185E6789e4645A5430J3895J86090f460j0582k86821
9425c03863B43241J01546c05186O6304N4132L8368D4420Q7725n7960g4920k68142
9414c43062b0923B55497B7493f0427m7985E3965b9116a478F0032a36021H8358
9402d8318P87k30702C9737g3892E9608b10941B470Q1205l5877a23955j37227B33534
9389E1590a8311A04143L8202b49734D2602d1057k87857A0877a01226d0742k00911
9378b41653G3541J68456a95018K2656b0450n7686J6218m130F9004B4045O288a77828
$$ plain form
9365 -8660 -30204 -56012 -96804 -170428 -72372 105792 -137558 20528 -355329 55431 63092 19403
9352 170359 -124930 -298760 59908 269358 -141779 -68749 -351888 -159388 3657 -206138
9341 -165789 -229823 -66857 -113677 -409230 -190979 -100987 -165796 -27216 -161982 -364761 110764
9329 -17051 -91469 -69147 -103264 -147372 156135 78724 -76414 -180513 7195 134363 344322
9318 344322 -98130 218697 281121 -159699 37916 166427 52391 -198439 -85447 -102460 -228940
9307 -228940 -114274 -163287 -129266 -5185 -105991 -29152 -345357 -69552 180227 -283050 78254
9295 32457 12817 -80279 39964 -290920 -30805 -461938 -157703 263045 -78989 -127363 -45575
9283 71305 -125160 215604 -95380 61993 195323 -265406 -20464 -74511 40163 -134757 -105800
$$ packed form
9365h660k1544k5808m0792p3624g2372A05792a37558B0528c55329E5431P661A9403
9352A70359a24930j73830E9908K09450a41779f8749k83139a59388C657b06138
9341a65789o4034f6857m6820k95553a90979Q9992o4809b7216j34766k02779A10764
9329a7051p4418K2322l4117m4108A56135p7411g6414j04099G195J27168K09959
9318C44322i8130B18697O2424a59699C7916J28511E2391a98439h5447j7013j26480
9307b28940a14274m9013L4021e185j00806b9152l16205f9552A80227b83050G8254
9295C2457A2817h0279C9964b90920c0805m31133a57703B63045g8989m8374d5575
9283G1305a25160B15604i5380F1993J33330b65406b0464n4047D0163a34757K8957
$$ plain form
9272 -105800 -165884 11905 -178587 228273 -154339 -94694 -72731 -113707 13636 -62204 143888
9260 206907 -135978 91802 10836 -194635 -309208 114297 228175 -81057 -105142 -304607
9250 -304607 -143763 -240990 149979 -526478 9361 129437 124784 -224426 248944 -58351 -207463
9239 -207463 1887 -418020 -86132 118704 -365361 126235 77519 -68658 361964 53669 -49191
9227 13773 129300 114016 8209 -52145 80092 -53994 -316342 31860 140614 -370432 58046
9215 205701 -59373 178801 -21538 -180739 -141395 -214279 -22411 254407 224999 53932 273221
9204 273221 204214 -208421 96593 175268 -202450 355584 -173570 155457 -138161 30599
9193 -45206 116552 -125603 -74258 94236 -88347 -150126 -137753 -135366 90462 -167439 -334506
$$ packed form
9272a05800o0084A1905a78587B28273a54339N9645K1963m0976A3636f2204A43888
9260B06907a35978I1802A0836a94635j14573A14297J13878h1057k4085j99465
9250c04607a43763r7227A49979e26478I361J20076m653b24426B48944e8351j49112
9239b07463A887d18020h6132A18704c65361A26235m8716f8658C61964E3669d9191
9227A3773J15527j5284H209e2145H0092e3994k62348C1860J08754c70432E8046
9215B05701e9373A78801b1538j59201L9344p2884b2411B54407k9408E3932K19289
9204B73221o9007b08421I6593P8675b02450C55584a73570A55457a38161C0599
9193d5206A16552a25603N1345I4236h8347o1779J2373K387I0462a67439j67067
$$ plain form
9182 -334506 -180512 30719 -186836 18762 154294 -217050 -94160 79326 -27829 -5688 -176048
9171 -176048 -162057 233647 -220226 -12162 -155434 107480 42827 -308418 -178299 -276399
9161 -276399 -202388 -20723 -241829 4137 164018 -265302 20073 -159851 155589 -62509 -392620
9150 -392620 -43397 4290 -175309 9039 -196283 -128235 -210060 -72181 223727 -108908 -19648
9138 -303444 -56759 173313 -95142 206821 -114234 180846 -217917 -205366 -202906 -248624 -214906
9127 -214906 -13249 -152023 -81044 -70205 -196266 1493 96025 -222619 -174083 -170609 -242240
9116 -242240 -6137 64327 119800 -86056 -15009 -55364 8041 247182 45428 -111169 -251931
9105 -251931 387122 287682 395346 -14886 152582 -356115 -140584 33838 89923 6621 119426
$$ packed form
9182c34506J53994C0719a86836A8762J35532b17050i4160G9326b7829e688j70360
9171a76048J3991B33647b20226a2162j43272A07480D2827c08418J30119r8100
9161b76399P4011b0723k21106D137J59881b65302B0073a59851A55589f2509l30111
9150c92620d3397D290a75309I039a96283O8048q1825g2181B23727a08908a9648
9138c03444e6759A73313i5142B06821a14234A80846b17917J2551K460m5718L3718
9127b14906a3249j38774P0979J0839j26061A493R4532b22619M8536L474p1631
9116b42240f137F4327N5473h6056a5009m0355H041K39141D5428a11169j40762
9105b51931C87122r9440J07664a4886A52582c56115a40584C3838N6085F621J12805
$$ plain form
9094 119426 116770 -52786 128506 -79304 -179084 -103528 -125560 -227757 -95984 -16104 -126127
9083 -126127 139818 -186576 92288 180351 -69832 390774 -271628 -78538 47555 -4327 -198977
9072 -198977 138898 -135001 -10852 252499 -91733 66715 150442 -23742 -34010 38143 190362
9061 190362 -217514 270940 -198341 34390 251421 -132495 -352063 -240575 27340 156526
9051 156526 71042 95075 21447 -161981 -317556 -115891 -105560 -149409 -105658 21382 142136
9040 142136 -311804 -327609 -216 -527528 -80053 -360623 96308 37144 -138489 -511397 -37614
9028 275557 -180787 -188697 -116750 -189924 -219935 122886 -16378 -26632 -29344 -103035 -66936 73089
9015 58555 -189257 -285685 104787 -104545 -29422 -399011 -22714 -305629 116054 -36357 -270003
$$ packed form
9094A19426k656e2786A28506g9304r9780P5556k2032j02197i5984a6104j10023
9083a26127A39818a86576I2288Q8063f9832C90774b71628g8538D7555d327j94650
9072a98977A38898a35001a0852B52499i1733F6715Q3727b3742j0268C8143J52219
9061A90362b17514B70940a98341C4390K17031a32495k19568J11488B7340J29186
9051A56526G1042K4033B1447a61981j55575a15891J0331m3849M3751B1382J20754
9040A42136c11804j5805b16n27312h0053k80570I6308C7144a38489l72908c7614
9028B75557a80787p910P1947p3174l0011A22886a6378j0254k712p3691L6099G3089
9015E8555a89257r6428A04787a04545b9422l69589b2714k82915A16054c6357k33646
$$ plain form
9004 -270003 -53271 -44207 -297869 64075 -21805 -512027 -431937 -33335 52974 -267891 -215209
8993 -215209 -163140 75740 -799574 -13526 127704 420887 186571 26317 -247002 -162352 -40147
8981 -63155 -176183 57917 -53400 -175481 15844 71302 211765 -106825 58771 -69258 -67107
8970 -67107 102682 67457 16742 -147200 -158271 225949 -148675 77950 -59622 -173772 -104060
8959 -104060 -14056 92525 -94552 -54130 -131682 281329 -57953 -385441 -198666 -108569 -239111
8948 -239111 173779 84843 115405 -529063 305226 -182352 -117755 -274382 16986 -338891
8937 103041 -180549 82855 388417 434705 47742 -9805 48077 -64230 319589 -55436 292765
8925 254305 542396 1409059 3613170 11174160 20347987 6019249 2221610 1100067 823546
$$ packed form
9004b70003e3271R064k53662F4075b1805m90222Q0090c3335E2974b67891N2682
8993b15209N2069G5740g99574a3526A27704K93183A86571B6317b47002Q4650d0147
8981f3155j13028E7917e3400j22081A5844N5458J40463a06825E8771f9258K151
8970f7107A02682l5225A6742a47200j1071B25949a48675G7950e9622j14150O9712
8959a04060a4056I2525i4552M0422p7552B81329e7953l27488J86775R0097j30542
8948b39111A73779H4843L0562e29063C05226a82352O4597j56627A6986c38891
8937A03041a80549H2855L05562M6288D7742i805D8077f4230C19589e5436B92765
8925B54305K88091Q66663K204111P560990R173827F019249B221610A100067k76521
$$ plain form
8916 823546 451754 457794 163592 207127 94653 278862 -181835 306739 442487 59309 118704
8905 118704 -136963 779 15145 95753 33501 -103622 -38427 196965 -175289 -41468 88318
8893 4554 -289876 -61578 -199607 -161636 46969 111671 -234119 -231557 -62958 -78505 -182544
8882 -182544 -216031 -58809 -75061 -203609 114884 -185726 50099 -19341 -411737 -25848 84685
8870 -329292 -203742 -160253 -242211 -29576 -234854 -181918 -42733 -29124 -234581 64842 339146
$$ packed form
8916H23546l71792O040A63592M3535I4653J84209a81835C06739J35748E9309N9395
8905A18704a36963G79J4366Q0608C3501a03622c8427A96965a75289d1468H8318
8893D554b89876f1578j38029L7971D6969O4702b34119K562f2958j5547j04039
8882a82544l3487e8809j6252j28548A14884a85726E0099a9341l92396b5848H4685
8870c29292J25550M3489q1958b9576k05278N2936d2733J3609k05457F4842K74304
$$ [...]
##END NTUPLES=NMR SPECTRUM
##END=
