
##TITLE=UV1245_M9_1261-1207_30_7241217_HEbQtKXUtJ
##JCAMPDX= 6.0         $$ Bruker NMR JCAMP-DX V2.0
##DATA TYPE= NMR SPECTRUM
##DATA CLASS= NTUPLES
##ORIGIN= BRUKER
##OWNER= Administrator
$$ 1.72 TOPSPIN		Version 2.1
$$ 2013-01-19 04:26:39.434 -0500  Administrator@X
$$ Compression mode = diff/dup
##.OBSERVE FREQUENCY= 400.02188249412
##.OBSERVE NUCLEUS= ^1H
##.ACQUISITION MODE= SIMULTANEOUS (DQD)
##.ACQUISITION SCHEME= undefined
##.AVERAGES= 64
##.DIGITISER RES= 22
##SPECTROMETER/DATA SYSTEM= spect
##.PULSE SEQUENCE= noesygpps1d.comp
##.SOLVENT NAME= COFFEE_meoh
##.SHIFT REFERENCE= INTERNAL, COFFEE_meoh, 1, 14.96104
##AUDIT TRAIL= $$ (NUMBER, WHEN, WHO, WHERE, PROCESS, VERSION, WHAT)
$$ ##TITLE= Audit trail, TOPSPIN		Version 2.1
$$ ##JCAMPDX= 5.01
$$ ##ORIGIN= Bruker BioSpin GmbH
$$ ##OWNER= Administrator
$$ $$ E:\/data/COFFEE/nmr/UV1245_M9_1261-1207_30_7241217_HEbQtKXUtJ/22/pdata/1/auditp.txt
$$ ##AUDIT TRAIL=  $$ (NUMBER, WHEN, WHO, WHERE, PROCESS, VERSION, WHAT)
(   1,<2013-01-19 04:26:33.559 -0500>,<Administrator>,<X>,<go>,<TOPSPIN 2.1>,
      <created by zg
	started at 2013-01-19 04:15:03.558 -0500,
	POWCHK enabled, PULCHK disabled,
       configuration hash MD5:
       86 BA 57 50 F2 9D 5C 9B 26 00 A9 28 5F 66 2E 89
       data hash MD5: 64K
       F3 5F D1 44 A8 62 8D 4E 41 57 F7 DC 9C 26 DB 28>)
(   2,<2013-01-19 04:26:36.622 -0500>,<Administrator>,<X>,<proc1d>,<TOPSPIN 2.1>,
      <Start of raw data processing
       efp LB = 0.3 FT_mod = 6 PKNL = 1 PHC0 = 0 PHC1 = 0 SI = 128K 
       data hash MD5: 128K
       B7 E9 B7 A0 F7 1B DF E9 E0 C6 47 31 C8 A3 AB E0>)
(   3,<2013-01-19 04:26:37.684 -0500>,<Administrator>,<X>,<proc1d>,<TOPSPIN 2.1>,
      <pk PHC0 = -81.21643 PHC1 = 0 
       data hash MD5: 128K
       4A AB 05 C7 47 6E 28 5D 91 0E EB 2A D6 68 9A 80>)
(   4,<2013-01-19 04:26:38.356 -0500>,<Administrator>,<X>,<proc1d>,<TOPSPIN 2.1>,
      <abs ABSG = 1 
       data hash MD5: 128K
       27 54 CA 62 CE BD 7F 2A 6B BE 01 2F 04 1D 13 9C>)
(   5,<2013-01-19 04:26:38.544 -0500>,<Administrator>,<X>,<proc1d>,<TOPSPIN 2.1>,
      <abs ABSG = 2 
       data hash MD5: 128K
       C3 BE B8 DC 32 CD CD FB 95 90 B0 43 2D FF D7 54>)
(   6,<2013-01-19 04:26:38.716 -0500>,<Administrator>,<X>,<proc1d>,<TOPSPIN 2.1>,
      <abs ABSG = 3 
       data hash MD5: 128K
       CB F1 C5 CA FA CF 84 AA 67 56 BA 7B 38 DA 55 C5>)
(   7,<2013-01-19 04:26:38.903 -0500>,<Administrator>,<X>,<proc1d>,<TOPSPIN 2.1>,
      <abs ABSG = 4 
       data hash MD5: 128K
       E5 0C 54 03 CC F8 C9 3A 9C 04 F0 0F 76 E6 50 DD>)
(   8,<2013-01-19 04:26:39.091 -0500>,<Administrator>,<X>,<proc1d>,<TOPSPIN 2.1>,
      <abs ABSG = 5 
       data hash MD5: 128K
       70 F4 5C D6 06 03 86 D6 8B 02 F9 45 F8 88 3B CC>)
$$ ##END=
$$ 
$$ $$ hash MD5
$$ $$ C9 D8 B7 0F 3B EF 90 55 11 F7 5C 43 45 D9 33 5D
##$RELAX= 
##$RELAX= 
##$RELAX= 
##$RELAX= 
##$RELAX= 
##$RELAX= 
##$RELAX= 
##$RELAX= 
$$ Bruker specific parameters
$$ --------------------------
##$DU= <E:\>
##$EXPNO= 22
$$ [...]
##$TP07= 0
##$TPNAME0= <>
##$TPNAME1= <>
##$TPNAME2= <>
##$TPNAME3= <>
##$TPNAME4= <>
##$TPNAME5= <>
##$TPNAME6= <>
##$TPNAME7= <>
##$TPOAL= (0..7)
0.5 0.5 0.5 0.5 0.5 0.5 0.5 0.5
##$TPOFFS= (0..7)
0 0 0 0 0 0 0 0
##$TUNHIN= 0
##$TUNHOUT= 0
##$TUNXOUT= 0
##$USERA1= <user>
##$USERA2= <user>
##$USERA3= <user>
##$USERA4= <user>
##$USERA5= <user>
##$V9= 5
##$VALIST= <valist>
##$VCLIST= <CCCCCCCCCCCCCCC>
##$VD= 0
##$VDLIST= <DDDDDDDDDDDDDDD>
##$VPLIST= <PPPPPPPPPPPPPPP>
##$VTLIST= <TTTTTTTTTTTTTTT>
##$WBST= 1024
##$WBSW= 4
##$XGAIN= (0..3)
0 0 0 0
##$XL= 0
##$YL= 0
##$YMAX_a= 6402170
##$YMIN_a= -13349137
##$ZGOPTNS= <>
##$ZL1= 120
##$ZL2= 120
##$ZL3= 120
##$ZL4= 120
##$ABSF1= 14.96104
##$ABSF2= -5.597142
##$ABSG= 5
##$ABSL= 3
##$ALPHA= 0
##$AQORDER= 0
##$ASSFAC= 0
##$ASSFACI= 0
##$ASSFACX= 0
##$ASSWID= 0
##$AUNMP= <proc_prof1d_extract.lims>
##$AXLEFT= 0
##$AXNAME= <>
##$AXNUC= <1H>
##$AXRIGHT= 0
##$AXTYPE= 0
##$AXUNIT= <>
##$AZFE= 0.1
##$AZFW= 0.1
##$BCFW= 0
##$BC_mod= 0
##$BYTORDP= 0
##$COROFFS= 0
##$CY= 15
##$DATMOD= 1
##$DC= 0
##$DFILT= <>
##$DTYPP= 0
##$F1P= 0
##$F2P= 0
##$FCOR= 0.5
##$FTSIZE= 131072
##$FT_mod= 6
##$GAMMA= 0
##$GB= 0
##$INTBC= 1
##$INTSCL= 1
##$ISEN= 128
##$LB= 0.3
##$LEV0= 0
##$LPBIN= 0
##$MAXI= 10000
##$MC2= 0
##$MEAN= 0
##$ME_mod= 0
##$MI= 0
##$NCOEF= 0
##$NC_proc= -2
##$NLEV= 6
##$NOISF1= 0
##$NOISF2= 0
##$NSP= 0
##$NTH_PI= 0
##$NZP= 0
##$OFFSET= 14.96104
##$PC= 1
##$PHC0= -81.21643
##$PHC1= 0
##$PH_mod= 1
##$PKNL= yes
##$PPARMOD= 0
##$PPDIAG= 0
##$PPIPTYP= 0
##$PPMPNUM= 2147483647
##$PPRESOL= 1
##$PSCAL= 4
##$PSIGN= 0
##$PYNMP= <proc.py>
##$REVERSE= no
##$SF= 400.020009621539
##$SI= 131072
##$SIGF1= 0
##$SIGF2= 0
##$SINO= 400
##$SIOLD= 131072
##$SPECTYP= <>
##$SREGLST= <1H.CDCl3>
##$SSB= 0
##$STSI= 131072
##$STSR= 0
##$SW_p= 8223.68421052631
##$SYMM= 0
##$S_DEV= 0
##$TDeff= 65536
##$TDoff= 0
##$TI= <>
##$TILT= no
##$TM1= 0
##$TM2= 0
##$TOPLEV= 0
##$USERP1= <user>
##$USERP2= <user>
##$USERP3= <user>
##$USERP4= <user>
##$USERP5= <user>
##$WDW= 1
##$XDIM= 131072
##$YMAX_p= 422003848
##$YMIN_p= -12759
##$CURPLOT= <Network HP LaserJet P1505>
##$CURPRIN= <$Network HP LaserJet P1505>
##$DFORMAT= <normdp>
##$LAYOUT= <+/1D_H.xwp>
##$LFORMAT= <normlp>
##$PFORMAT= <normpl>
##$SURQMSG= 1
$$ End of Bruker specific parameters
$$ ---------------------------------
##NTUPLES= NMR SPECTRUM
##VAR_NAME=  FREQUENCY,     SPECTRUM/REAL,   SPECTRUM/IMAG
##SYMBOL=    X,             R,               I
##VAR_TYPE=  INDEPENDENT,   DEPENDENT,       DEPENDENT
##VAR_FORM=  AFFN,          ASDF,            ASDF
##VAR_DIM=   131072,        131072,          131072
##UNITS=     HZ,            ARBITRARY UNITS, ARBITRARY UNITS
##FACTOR=    0.0627417313425164, 1,          1
##FIRST=     8223.62146879497, -1548,        -66413
##LAST=      0,             1096,            -67936
##MIN=       0,             -12759,          0
##MAX=       8223.62146879497, 422003848,    0
$$ Real data points
##PAGE= N=1
##DATA TABLE= (X++(R..R)), XYDATA
$$ [...]
$$ plain form
63884 692265 676474 661108 646568 633097 620873 610355 602034 595916 591784 589835 590502 593731 599093
63871 599093 606624 616975 630628 647484 667322 690129 715828 744189 775240 809272 846228 885460
63859 885460 926258 968129 1010306 1051454 1090286 1126288 1159500 1189837 1216895 1240209 1259378
63848 1259378 1274072 1284222 1290157 1292274 1290531 1284383 1273194 1256687 1235117 1209140 1179444 1146398
63836 1146398 1110130 1070976 1029713 987221 944056 900487 856898 813988 772579 733355 696776
63825 696776 663075 632178 603664 576981 551815 528191 506158 485556 466261 448510 432635
63814 432635 418454 405307 392813 381263 371095 362340 354832 348586 343565 339295 335183 331099 327282
63801 327282 323748 320210 316569 313076 309935 307089 304440 301955 299501 296858 294005 291138 288279 285147
$$ packed form
63884F92265j5791j5366j4540j3471j2224j0518q321o118m132j949O67L229N362
63871E99093P531J0351J3653J6856J9838K2807K5699K8361L1051L4032L6956L9232
63859H85460M0798M1871M2177M1148L8832L6002L3212L0337K7058K3314J9169
63848A259378J4694J0150N935K117j743o148j1189j6507k1570k5977k9696l3046
63836A146398l6268l9154m1263m2492m3165m3569m3589m2910m1409l9224l6579
63825F96776l3701l0897k8514k6683k5166k3624k2033k0602j9295j7751j5875
63814D32635j4181j3147j2494j1550j0168q755p508o246n021m270m112m084l817
63801C27282l534l538l641l493l141k846k649k485k454k643k853k867k859l132
$$ plain form
63787 285147 281608 278034 274974 272554 270429 268359 266631 265724 265536 265203 263931 261873 259915 258601 257698
63772 257698 256825 256013 255364 254679 253819 253037 252412 251304 249028 245963 243339 241939 241511 241433 241353 241053 240304 239152
63754 239152 237985 237102 236502 236216 236416 237015 237508 237501 237158 236886 236810 236797 236857 237254 238257 239862 241727 243424 244895
63735 244895 246628 249170 252448 255811 258716 261185 263568 266164 269042 271994 274667 277051 279745 283342
63721 283342 287540 291374 294491 297724 302086 307548 313035 317333 319768 320421 320044 319581 319431 319230 318509 317307
63705 317307 315971 314677 313471 312473 311631 310445 308414 305772 303453 302300 302515 303819 305858 308392 311355
63690 311355 314819 318770 322951 327068 331130 335350 339659 343528 346321 347772 348059 347554 346540 345122 343379
63675 343379 341623 340387 340054 340526 341319 341963 342274 342392 342726 343789 345787 348279 350421 351644 352014 351889
$$ packed form
63787B85147l539l574l060k420k125k070j728r07j88l33j272k058j958j314r03
63772B57698q73q12o49o85q60p82o25j108k276l065k624j400m28p8q0l00p49j152
63754B39152j167q83o00k86K00N99M93pl43k72p6j3O0L97J003J605J865J697J471
63735B44895J733K542L278L363K905K469K383K596K878K952K673K384K694L597
63721B83342M198L834L117L233M362N462N487M298K435O53l77m63j50k01p21j202
63705C17307j336j294j206r98q42j186k031k642k319j153K15J304K039K534K963
63690C11355L464L951M181M117M062M220M309L869K793J451K87n05j014j418j743
63675C43379j756j236l33M72P93O44L11J18L34J063J998K492K142J223L70j25
$$ plain form
63659 351889 351410 350460 348965 346975 344463 341268 337338 332886 328203 323449 318706 314120 309842 305948 302638
63644 302638 300427 299794 300532 301767 302742 303506 304667 306684 309557 313034 316800 320568 324269 328181 332625
63629 332625 337441 342029 346071 350111 355143 361609 368940 376190 383071 390203 398441 408218 419610 432674
63615 432674 447338 463143 479584 496777 515416 536009 558530 582894 609339 638095 669037
63604 669037 701925 736558 772318 807834 841474 871980 898322 919293 933828 941739 943849 941501
63592 941501 936184 929327 921964 914578 907435 900712 893834 885037 872352 855046 833653 808826 781008
63579 781008 751364 722028 694829 670142 647416 626448 607646 591295 577163 564900 554494
63568 554494 546223 540384 537180 536723 538842 542796 547369 551644 555758 560608 566687 573506 580330 587104
$$ packed form
63659C51889m79r50j495j990k512l195l930m452m683m754m743m586m278l894l310
63644C02638k211o33P38J235R75P64J161K017K873L477L766L768L701L912M444
63629C32625M816M588M042M040N032O466P331P250O881P132Q238R777J1392J3064
63615D32674J4664J5805J6441J7193J8639K0593K2521K4364K6445K8756L0942
63604F69037L2888L4633L5760L5516L3640L0506K6342K0971J4535P911K110k348
63592I41501n317o857p363p386p143o723o878q797j2685j7306k1393k4827k7818
63579G81008k9644k9336k7199k4687k2726k0968j8802j6351j4132j2263j0406
63568E54494q271n839l204m57K119L954M573M275M114M850O079O819O824O774
$$ plain form
63554 587104 594309 602334 611496 622482 636181 653086 673185 696369 722603 751917 784738 822015
63542 822015 864448 911475 961165 1010555 1055476 1090758 1112246 1119238 1114510 1101933 1084794 1066100
63530 1066100 1048807 1034702 1023674 1014689 1006857 999060 989411 976101 958489 936732 910800 880644
63518 880644 847038 811383 774727 737582 700696 665385 632917 603831 577821 554124 532220
63507 532220 512409 495463 481428 469159 457446 446186 435901 426524 417432 408566 400661 394179
63495 394179 388657 383353 378115 373378 369643 367158 365811 365082 364310 363202 362027 361264 361152 361615 362488 363782
63479 363782 365731 368521 371931 375431 378761 382198 386045 390068 393744 396923 399832 402404 403981 403860
63465 403860 402024 399219 396324 393624 390616 386613 381605 376456 372233 369376 367512 365865 363803 361279
$$ packed form
63554E87104P205Q025R162J0986J3699J6905K0099K3184K6234K9314L2821L7277
63542H22015M2433M7027M9690M9390M4921L5282K1488O992m728j2577j7139j8694
63530A066100j7293j4105j1028q985p832p797r649j3310j7612k1757k5932l0156
63518H80644l3606l5655l6656l7145l6886l5311l2468k9086k6010k3697k1904
63507E32220j9811j6946j4035j2269j1713j1260j0285r377r092q866p905o482
63495C94179n522n304n238m737l735k485j347p29p72j108j175p63j12M63Q73J294
63479C63782J949K790L410L500L330L437L847M023L676L179K909K572J577j21
63465D03860j836k805k895k700l008m003n008n149m223k857j864j647k062k524
$$ plain form
63451 361279 358942 357656 357787 359087 361283 364457 368669 373588 378863 384639 391409 399437 408602 418710
63437 418710 429748 441996 456061 472711 492564 516103 544047 577226 615565 657205 698719
63426 698719 736144 766141 787039 799490 805912 808898 810261 811575 814897 822310 835073 853690 878347
63413 878347 908652 943351 981087 1021102 1062345 1102148 1136889 1164177 1183613 1195424 1199553 1196639
63401 1196639 1188924 1179228 1169238 1159273 1149226 1138948 1127736 1114127 1096476 1073638 1045164 1011230
63389 1011230 972693 931185 888824 847431 807873 770318 735180 703410 675594 651187 629173
63378 629173 609302 592128 578086 567215 559727 555911 555214 556155 557582 559536 562561 566815 572304 579494
63364 579494 589010 601018 615410 632347 652056 674225 698223 723869 751592 781827 814673 850152
$$ packed form
63451C61279k337j286J31J300K196L174M212M919N275N776O770Q028R165J0108
63437D18710J1038J2248J4065J6650J9853K3539K7944L3179L8339M1640M1514
63426F98719L7425K9997K0898J2451O422K986J363J314L322P413J2763J8617K4657
63413H78347L0305L4699L7736M0015M1243L9803L4741K7288J9436J1811M129k914
63401A196639p715r696r990r965j0047j0278j1212j3609j7651k2838k8474l3934
63389A011230l8537m1508m2361m1393l9558l7555l5138l1770k7816k4407k2014
63378F29173j9871j7174j4042j0871p488l816o97R41J427J954L025M254N489P190
63364E79494R516J2008J4392J6937J9709K2169K3998K5646K7723L0235L2846L5479
$$ plain form
63352 850152 888347 929063 971505 1014297 1055688 1093760 1126681 1152865 1171046 1180631 1182318 1178103
63340 1178103 1170237 1160168 1148728 1136917 1125757 1115238 1103971 1090103 1072307 1049896 1022686
63329 1022686 991188 956519 919695 881302 842201 804092 768745 736897 708567 684308 665275
63318 665275 651859 643061 637705 635488 635919 636462 632786 621462 602300 578084 552438 527934 505623
63305 505623 485575 467651 451877 438281 426594 416366 407343 399511 392765 386845 381713 377693 374953
63292 374953 373023 371078 368633 365701 362384 358613 354356 349879 345647 342056 339329 337609 337025 337569 338910
63277 338910 340366 341147 340701 338885 335997 332726 329935 328239 327770 328390 329959 332176 334340 335746 336398
63262 336398 336965 337938 339191 340469 341903 343761 346019 348489 351065 353534 355469 356795 358263 360812 364488
$$ packed form
63352H50152L8195M0716M2442M2792M1391L8072L2921K6184J8181R585J687m215
63340A178103p866j0069j1440j1811j1160j0519j1267j3868j7796k2411k7210
63329A022686l1498l4669l6824l8393l9101l8109l5347l1848k8330k4259j9033
63318F65275j3416q798n356k217M31N43l676j1324j9162k4216k5646k4504k2311
63305E05623k0048j7924j5774j3596j1687j0228r023p832o746n920n132m020k740
63292C74953j930j945k445k932l317l771m257m477m232l591k727j720n84N44J341
63277C38910J456P81m46j816k888l271k791j696m69O20J569K217K164J406O52
63262C36398N67R73J253J278J434J858K258K470K576K469J935J326J468K549L676
$$ plain form
63247 364488 368435 372006 375404 379113 383148 387220 391411 396292 402351 409568 417588 426158 435209 444640
63233 444640 454336 464478 475584 487951 501233 514909 529093 544418 561016 578076 594679 610722
63221 610722 626721 642953 659159 674969 690304 705441 720805 736591 752464 767850 782614
63210 782614 797018 810798 822672 831240 836043 837329 835127 829243 820000 808209 794339 778372 760726
63197 760726 742726 725788 710472 696653 684304 673755 665365 659391 656196 656266 659859 666702 676143
63184 676143 687658 701203 717114 735651 756673 779697 804120 829382 855070 881027 907243
63173 907243 933573 959661 985210 1010202 1034722 1058673 1081692 1103240 1122663 1139416 1153235
63162 1153235 1163877 1170538 1171826 1166568 1154494 1136049 1111831 1082455 1048702 1011505 971883 931053
$$ packed form
63247C64488L947L571L398L709M035M072M191M881O059P217Q020Q570R051R431
63233D44640R696J0142J1106J2367J3282J3676J4184J5325J6598J7060J6603J6043
63221F10722J5999J6232J6206J5810J5335J5137J5364J5786J5873J5386J4764
63210G82614J4404J3780J1874Q568M803J286k202n884r243j1791j3870j5967j7646
63197G60726j8000j6938j5316j3819j2349j0549q390n974l195P0L593O843R441
63184F76143J1515J3545J5911J8537K1022K3024K4423K5262K5688K5957K6216
63173I07243K6330K6088K5549K4992K4520K3951K3019K1548J9423J6753J3819
63162A153235J0642O661J288n258j2074j8445k4218k9376l3753l7197l9622m0830
$$ plain form
63150 931053 890319 850684 812701 776816 743502 712911 684830 659242 636508 616705 599268
63139 599268 583642 569819 557771 546925 536843 528011 521205 516369 512771 509977 507878 506053 504032
63126 504032 502120 501119 501204 501879 503096 505519 509477 514340 519235 523757 527848 531574 535265 539255 543269
63111 543269 546640 549308 552030 555365 558996 562277 564910 566927 568634 570727 573764 577231 579859 581209
63097 581209 582267 583973 585895 586963 586923 586371 585799 585395 585454 586208 587341 588291 588997 589786 590557 590695 589918 588745
63079 588745 587855 587282 586551 585540 584887 585346 586845 588534 589922 591577 594321 598083 602210 606724 612494
63064 612494 620001 628688 637850 647485 657842 668731 679928 692001 706135 723220 743320 765811
63052 765811 789864 815040 841705 870638 902111 935682 970965 1008026 1046766 1086478 1126421
$$ packed form
63150I31053m0734l9635l7983l5885l3314l0591k8081k5588k2734j9803j7437
63139E99268j5626j3823j2048j0846j0082q832o806m836l598k794k099j825k021
63126E04032j912j001Q5O75J217K423L958M863M895M522M091L726L691L990M014
63111E43269L371K668K722L335L631L281K633K017J707K093L037L467K628J350
63097E81209J058J706J922J068m0n52n72m04N9P54J133R50P06P89P71J38p77j173
63079E88745q90n73p31j011o53M59J499J689J388J655K744L762M127M514N770
63064F12494P507Q687R162R635J0357J0889J1197J2073J4134J7085K0100K2491
63052G65811K4053K5176K6665K8933L1473L3571L5283L7061L8740L9712L9943
$$ plain form
63041 1126421 1166399 1206306 1245597 1283748 1320982 1357978 1395109 1432377 1469854 1507658 1545630
63030 1545630 1583384 1620454 1655953 1688299 1715716 1736992 1751507 1758720 1757933 1748479 1730000 1702923
63018 1702923 1668869 1630139 1588416 1544335 1498618 1452981 1409350 1368727 1331608 1299081 1272578
63007 1272578 1252648 1238845 1230877 1229094 1233782 1244682 1261360 1283526 1310754 1342437 1378158 1417720
62995 1417720 1460662 1506106 1553124 1600943 1648865 1696490 1744039 1791902 1839750 1886572 1931599
62984 1931599 1974667 2015483 2053053 2086049 2113249 2133353 2144837 2146353 2137029 2116241 2083618 2039651
62972 2039651 1985876 1924035 1855342 1781061 1703493 1625637 1549752 1476636 1406414 1339594 1277116
62961 1277116 1219651 1167231 1119476 1075938 1036175 999733 966248 935507 907327 881381 857211
$$ packed form
63041A126421L9978L9907L9291L8151L7234L6996L7131L7268L7477L7804L7972
63030A545630L7754L7070L5499L2346K7417K1276J4515P213p87r454j8479k7077
63018A702923l4054l8730m1723m4081m5717m5637m3631m0623l7119l2527k6503
63007A272578j9930j3803p968j783M688J0900J6678K2166K7228L1683L5721L9562
62995A417720M2942M5444M7018M7819M7922M7625M7549M7863M7848M6822M5027
62984A931599M3068M0816L7570L2996K7200K0104J1484J516r324k0788l2623m3967
62972B039651n3775o1841o8693p4281p7568p7856p5885p3116p0222o6820o2478
62961A277116n7465n2420m7755m3538l9763l6442l3485l0741k8180k5946k4170
$$ plain form
62950 857211 834374 812469 791115 770100 749556 729815 711049 693208 676264 660279 645161
62939 645161 630641 616678 603622 591798 581148 571551 563267 556672 551565 547054 542248 536925 531522
62926 531522 526620 522517 519228 516759 515206 514465 513969 513016 511394 509445 507474 505419 503199 501017 499105
62911 499105 497466 496094 495093 494216 492665 489875 486364 483284 481096 479164 476795 474251 472470 472003 472507
62896 472507 473241 473860 474668 476168 478525 481460 484540 487418 489888 491889 493394 494174 493901 492754 491681
62881 491681 491511 491856 491552 490285 489136 489200 490296 491487 492336 493024 493585 493717 493284 492468 491391 489977 488113
62864 488113 485705 482666 479179 475873 473405 471853 470698 469346 467526 465381 463392 462070 461545 461521 461664
62849 461664 461803 461789 461616 461774 462923 464960 466923 468135 468849 469394 469357 468276 466569 464993 463543 461678
$$ packed form
62950H57211k2837k1905k1354k1015k0544j9741j8766j7841j6944j5985j5118
62939F45161j4520j3963j3056j1824j0650r597q284o595n107m511m806n323n403
62926E31522m902m103l289k469j553p41m96r53j622j949j971k055k220k182j912
62911D99105j639j372j001q77j551k790l511l080k188j932k369k544j781m67N04
62896D72507P34O19Q08J500K357K935L080K878K470K001J505P80k73j147j073
62881D91681j70L45l04j267j149O4J096J191Q49O88N61J32m33q16j077j414j864
62864D88113k408l039l487l306k468j552j155j352j820k145j989j322n25k4J43
62849D61664J39j4j73J58J149K037J963J212P14N45l7j081j707j576j450j865
$$ plain form
62833 461678 459388 457234 455484 453971 452806 452500 453299 454887 456724 458317 459324 459920 460870 462667 464805
62818 464805 466456 467657 469071 470796 472224 473068 473699 474457 475408 476885 479414 482860 486400 489662 493227
62803 493227 497666 502664 507497 511900 516127 520562 525555 531332 537713 544195 550509 556923 563986 572245
62789 572245 582144 593769 606629 620146 634481 650551 669222 690888 715814 744349 776690 812815
62777 812815 852799 896860 945048 997194 1053001 1111775 1172212 1232939 1293059 1351653 1406999
62766 1406999 1457056 1500538 1536727 1564466 1582395 1590190 1588462 1577311 1556152 1525311 1486606 1441857
62754 1441857 1391897 1337668 1281165 1224336 1167828 1111737 1056935 1004748 955838 910244 868091
62743 868091 829431 793858 761070 731499 705580 682774 662114 643340 626666 611797 598238
$$ packed form
62833D61678k290k154j750j513j165l06P99J588J837J593J007N96R50J797K138
62818D64805J651J201J414J725J428Q44O31P58R51J477K529L446L540L262L565
62803D93227M439M998M833M403M227M435M993N777O381O482O314O414P063Q259
62789E72245R899J1625J2860J3517J4335J6070J8671K1666K4926K8535L2341L6125
62777H12815L9984M4061M8188N2146N5807N8774O0437O0727O0120N8594N5346
62766A406999N0057M3482L6189K7739J7929P795j728j1151k1159l0841l8705m4749
62754A441857m9960n4229n6503n6829n6508n6091n4802n2187m8910m5594m2153
62743H68091l8660l5573l2788k9571k5919k2806k0660j8774j6674j4869j3559
$$ plain form
62732 598238 586336 576852 569366 562238 554560 547354 542299 539829 539008 538840 539130 540198 542277 545388 549589
62717 549589 555076 561839 569363 577029 584970 594198 605648 619332 634687 651454 669867 690302 713241
62704 713241 739417 769469 803457 841119 882627 928673 979776 1035868 1096658 1162086 1232251
62693 1232251 1307108 1386392 1469731 1556669 1646443 1737574 1827587 1913300 1991582 2059884 2116161
62682 2116161 2158668 2186047 2197420 2192218 2170149 2131592 2077942 2011407 1934605 1850381 1761615
62671 1761615 1670744 1579524 1489431 1402072 1318888 1240567 1167179 1098866 1036128 979288 927922
62660 927922 881054 837974 798762 763895 733338 706259 681777 659639 639775 621538 604032
62649 604032 587205 571888 558613 546952 536230 526246 516956 508057 499383 491289 484184 478043 472761
$$ packed form
62732E98238j1902r484p486p128p678p206n055k470q21j68K90J068K079L111M201
62717E49589N487O763P524P666P941R228J1450J3684J5355J6767J8413K0435K2939
62704G13241K6176L0052L3988L7662M1508M6046N1103N6092O0790O5428P0165
62693A232251P4857P9284Q3339Q6938Q9774R1131R0013Q5713P8282O8302N6277
62682B116161M2507K7379J1373n202k2069l8557n3650o6535p6802q4224q8766
62671A761615r0871r1220r0093q7359q3184p8321p3388o8313o2738n6840n1366
62660I27922m6868m3080l9212l4867l0557k7079k4482k2138j9864j8237j7506
62649F04032j6827j5317j3275j1661j0722r984r290q899q674q094p105o141n282
$$ plain form
62636 472761 468576 465677 463743 462385 461684 461818 462400 462709 462337 461178 459095 456161 453006 450360 448347
62621 448347 446620 444980 443376 441570 439390 437195 435601 434835 434855 435833 437913 440603 443129 445404 448101
62606 448101 451731 456186 461197 466623 472208 477670 483283 489966 498514 509022 521096 534280 548279
62593 548279 563294 580329 600656 624695 651597 680050 709149 738367 767146 794908 821220
62582 821220 845647 867454 885603 898995 906724 908362 904146 894803 881097 863622 842898 819439
62570 819439 793675 766127 737744 709848 683509 659055 636279 614996 595286 577254 560752
62559 560752 545472 531350 518753 508183 499770 493127 487600 482543 477580 472934 469395 467445 466405
62546 466405 464951 462633 460279 458676 457533 456262 455182 455226 456776 459482 462950 466910 470814 473998 476364
$$ packed form
62636D72761m185k899j934j358p01J34N82L09l72j159k083k934l155k646k013
62621D48347j727j640j604j806k180k195j594p66K0R78K080K690K526K275K697
62606D48101L630M455N011N426N585N462N613O683Q548J0508J2074J3184J3999
62593E48279J5015J7035K0327K4039K6902K8453K9099K9218K8779K7762K6312
62582H21220K4427K1807J8149J3392P729J638m216r343j3706j7475k0724k3459
62570H19439k5764k7548k8383k7896k6339k4454k2776k1283j9710j8032j6502
62559E60752j5280j4122j2597j0570q413o643n527n057m963m646l539j950j040
62546D66405j454k318k354j603j143j271j080M4J550K706L468L960L904L184K366
$$ plain form
62531 476364 478379 480397 482396 484359 486454 488864 491894 496216 502549 511051 521338 533032 546035
62518 546035 560545 577244 597180 620828 647503 676365 707806 743098 782806 826398 873313
62507 873313 923323 975586 1028343 1080052 1130141 1178177 1222904 1262565 1295626 1320801 1337000
62496 1337000 1343829 1341750 1331432 1313427 1288889 1259983 1229009 1197548 1166958 1139093 1115660 1097111
62484 1097111 1082959 1073106 1068207 1068728 1074286 1084104 1097656 1114712 1134948 1157434 1180300 1201030
62472 1201030 1217538 1228950 1235164 1235932 1230804 1219658 1202536 1178880 1147720 1109151 1065221 1018903
62460 1018903 972269 925893 879754 834261 790364 749083 711192 677191 647238 621054 598129
62449 598129 578216 561508 548093 537349 528244 520303 514006 510001 508153 507586 507509 507706 508357 509717
$$ packed form
62531D76364K015K018J999J963K095K410L030M322O333Q502J0287J1694J3003
62518E46035J4510J6699J9936K3648K6675K8862L1441L5292L9708M3592M6915
62507H73313N0010N2263N2757N1709N0089M8036M4727L9661L3061K5175J6199
62496A337000O829k079j0318j8005k4538k8906l0974l1461l0590k7865k3433j8549
62484A097111j4152r853m899N21N558R818J3552J7056K0236K2486K2866K0730
62472A201030J6508J1412O214P68n128j1146j7122k3656l1160l8569m3930m6318
62460A018903m6634m6376m6139m5493m3897m1281l7891l4001k9953k6184k2925
62449E98129j9913j6708j3415j0744r105p941o297m005j848n67p7J97O51J360
$$ plain form
62435 509717 512019 515378 519591 524070 528112 531239 533292 534240 533928 532038 528368 523134 516880 510018 502540
62420 502540 494343 485716 477343 469841 463431 457998 453305 449157 445530 442608 440467 438631 436228 432821
62406 432821 428962 425621 423099 420843 418325 415761 413778 412716 412514 412976 413771 414434 414873 415798 418130 421934
62390 421934 426386 430828 435275 439760 443837 447189 450238 453590 457258 460976 465024 470103 476448 483631
62376 483631 491275 499474 508402 517918 527651 537257 546576 555845 565699 576597 588328 600494 613465
62363 613465 628301 645621 665087 686261 709512 735690 765313 798615 836220 879160 927985
62352 927985 982072 1039976 1100346 1162405 1225513 1288307 1348280 1402238 1447365 1482104 1506325
62341 1506325 1520796 1526483 1524184 1514568 1498229 1475522 1446510 1411415 1371140 1327124 1280697 1232948
$$ packed form
62435E09717K302L359M213M479M042L127K053R48l12j890l670n234o254o862p478
62420E02540q197q627q373p502o410n433m693m148l627k922k141j836k403l407
62406D32821l859l341k522k256k518k564j983j062k02M62P95O63M39R25K332L804
62390D21934M452M442M447M485M077L352L049L352L668L718M048N079O345P183
62376D83631P644Q199Q928R516R733R606R319R269R854J0898J1731J2166J2971
62363F13465J4836J7320J9466K1174K3251K6178K9623L3302L7605M2940M8825
62352I27985N4087N7904O0370O2059O3108O2794N9973N3958M5127L4739K4221
62341A506325J4471N687k299r616j6339k2707k9012l5095m0275m4016m6427m7749
$$ plain form
62329 1232948 1185111 1138566 1094189 1052119 1012420 975586 942126 912057 885108 860951 838781
62318 838781 817206 795199 772879 750790 728767 706259 683523 661660 641441 622818 605584
62307 605584 589805 575466 562338 550425 540028 531233 523751 517344 511987 507639 504315 502314 501776
62294 501776 502095 502456 502910 504105 505964 507553 508533 509749 511928 514621 517013 519111 521523 524590 528294
62279 528294 532467 536557 539730 541874 544071 547493 552136 557176 562141 567155 572429 578172 584665 591839
62265 591839 599164 606700 615939 628765 645721 666032 689223 715849 746627 781681 820913 864460
62253 864460 912543 965318 1022992 1085528 1151920 1220124 1287824 1352927 1413257 1466389 1510208
62242 1510208 1543398 1565323 1575897 1575822 1566526 1549289 1524463 1491650 1450476 1401089 1344324 1281860
$$ packed form
62329A232948m7837m6545m4377m2070l9699l6834l3460l0069k6949k4157k2170
62318H38781k1575k2007k2320k2089k2023k2508k2736k1863k0219j8623j7234
62307F05584j5779j4339j3128j1913j0397q795p482o407n357m348l324k001n38
62294E01776L19L61M54J195J859J589R80J216K179K693K392K098K412L067L704
62279E28294M173M090L173K144K197L422M643N040M965N014N274N743O493P174
62265E91839P325P536R239J2826J6956K0311K3191K6626L0778L5054L9232M3547
62253H64460M8083N2775N7674O2536O6392O8204O7700O5103O0330N3132M3819
62242A510208L3190K1925J0574p5r296j7237k4826l2813m1174m9387n6765o2464
$$ plain form
62230 1281860 1216160 1149878 1085137 1023318 965314 911765 863120 819666 781483 748273 719335
62219 719335 693894 671401 651391 633197 616204 600423 586482 574797 564924 556007 547760 540669
62207 540669 535231 531213 527830 524395 520675 516875 513547 511402 510907 511940 513945 516363 518842 521286
62193 521286 524029 527890 533633 541247 549970 559118 568685 579101 590636 603234 616719 631000 646109
62180 646109 662166 679182 696803 714312 731066 747000 762655 778658 795097 811477 827477
62169 827477 843731 861580 881933 904686 929495 956765 987435 1022023 1060309 1101772 1145687
62158 1145687 1190748 1235133 1277174 1315604 1349070 1375882 1394623 1404875 1407331 1403314 1394052 1379944
62146 1379944 1360493 1335271 1304883 1270530 1232794 1191602 1147570 1102621 1058829 1017226 978151
$$ packed form
62230A281860o5700o6282o4741o1819n8004n3549m8645m3454l8183l3210k8938
62219G19335k5441k2493k0010j8194j6993j5781j3941j1685r873q917q247p091
62207E40669n438m018l383l435l720l800l328k145m95J033K005K418K479K444
62193E21286K743L861N743P614Q723R148R567J0416J1535J2598J3485J4281J5109
62180F46109J6057J7016J7621J7509J6754J5934J5655J6003J6439J6380J6000
62169H27477J6254J7849K0353K2753K4809K7270L0670L4588L8286M1463M3915
62158A145687M5061M4385M2041L8430L3466K6812J8741J0252K456m017r262j4108
62146A379944j9451k5222l0388l4353l7736m1192m4032m4949m3792m1603l9075
$$ plain form
62135 978151 942226 910323 882819 859450 839781 823393 809721 798145 788252 779815 772634 766614
62123 766614 761820 758223 755455 753039 750826 749155 748746 750505 755034 762076 770616 779703 789037 798554
62109 798554 807681 815216 819840 820796 818413 814134 809662 805879 802779 800405 799187 798948 798082 794452 787203
62094 787203 777464 767424 758908 752667 748596 746451 746314 748317 752113 757038 762790 769621 777884 787881
62080 787881 800119 815064 832443 851444 871873 894452 919574 946416 973825 1001514 1029728
62069 1029728 1058242 1086472 1114242 1141620 1168187 1193240 1216817 1239908 1263586 1288382 1314581
62058 1314581 1342509 1372186 1402809 1432841 1460707 1485484 1506849 1524259 1536433 1542193 1541763 1536571
62046 1536571 1527518 1514025 1494963 1469768 1438233 1400093 1355722 1306832 1255734 1204075 1152750
$$ packed form
62135I78151l5925l1903k7504k3369j9669j6388j3672j1576r893q437p181o020
62123G66614m794l597k768k416k213j671m09J759M529P042Q540R087R334R517
62109G98554R127P535M624R56k383m279m472l783l100k374j218k39q66l630p249
62094G87203r739j0040q516o241m071k145j37K003L796M925N752O831Q263R997
62080G87881J2238J4945J7379J9001K0429K2579K5122K6842K7409K7689K8214
62069A029728K8514K8230K7770K7378K6567K5053K3577K3091K3678K4796K6199
62058A314581K7928K9677L0623L0032K7866K4777K1365J7410J2174N760m30n192
62046A536571r053j3493j9062k5195l1535l8140m4371m8890n1098n1659n1325
$$ plain form
62035 1152750 1102451 1053502 1005513 958192 912448 870035 832135 798802 769537 743741 720758
62024 720758 700215 682261 666980 653741 641767 631056 621960 613995 606015 597630 589573 582492 576134
62011 576134 569989 564041 558547 553632 549478 546471 544792 544170 544277 545142 546952 549648 552909 556466 560301
61996 560301 564521 568894 572559 574583 574975 574746 574615 574094 572236 568817 564247 558747 552349 545385 538226
61981 538226 530720 522563 514016 505544 497007 488038 479128 471451 465595 461134 457345 453628 449336 444166
61967 444166 438757 434075 430184 426484 423111 420968 420153 419515 418247 416998 416812 417771 419296 421118 423275
61952 423275 425610 427897 430211 432770 435673 439065 443207 448160 453802 460278 468047 477354 488183 500751
61938 500751 515377 531732 548967 566843 585946 606409 627260 647588 667642 688040 708476
$$ packed form
62035A152750n0299m8949m7989m7321m5744m2413l7900l3333k9265k5796k2983
62024G20758k0543j7954j5281j3239j1974j0711r096p965p980q385q057p081o358
62011E76134o145n948n494m915m154l007j679o22J07Q65J810K696L261L557L835
61996E60301M220M373L665K024L92k29j31n21j858l419m570n500o398o964p159
61981E38226p506q157q547q472q537q969q910p677n856m461l789l717m292n170
61967D44166n409m682l891l700l373k143q15o38j268j249j86R59J525J822K157
61952D23275K335K287K314K559K903L392M142M953N642O476P769R307J0829J2568
61938E00751J4626J6355J7235J7876J9103K0463K0851K0328K0054K0398K0436
$$ plain form
61927 708476 727981 746056 762818 778195 791633 802562 810699 815973 818493 818457 815859 810530 802802
61914 802802 793916 785484 778601 773639 770622 769549 770512 773700 779258 787113 797084 809002 822411 836375
61900 836375 850062 863326 876021 886863 893852 896004 893910 888450 879860 868343 854636 839418
61888 839418 822933 805702 788867 773203 758470 744287 730973 718971 708156 698381 689917 682536
61876 682536 674916 666040 656652 648261 641151 634531 628350 623576 620543 618157 615200 611634 608322 606132
61862 606132 605594 606833 609405 612591 616152 620513 626129 633092 641530 652001 665172 681337 700426
61849 700426 722344 747029 774236 803376 833690 864619 895899 927160 957532 985907 1011563
61838 1011563 1034106 1052812 1066531 1074500 1076807 1073895 1066192 1054604 1040815 1026565 1012933 1000748
$$ packed form
61927G08476J9505J8075J6762J5377J3438J0929Q137N274K520l6k598n329p728
61914H02802q886q432o883m962l017j073R63L188N558P855R971J1918J3409J3964
61900H36375J3687J3264J2695J0842O989K152k094n460q590j1517j3707j5218
61888H39418j6485j7231j6835j5664j4733j4183j3314j2002j0815r775q464p381
61876F82536p620q876r388q391p110o620o181m774l033k386k957l566l312k190
61862F06132n38J239K572L186L561M361N616O963Q438J0471J3171J6165J9089
61849G00426K1918K4685K7207K9140L0314L0929L1280L1261L0372K8375K5656
61838A011563K2543J8706J3719P969K307k912p703j1588j3789j4250j3632j2185
$$ plain form
61826 1000748 991155 985162 983030 984717 990582 1000805 1014337 1029185 1043777 1057429 1069489 1078737
61814 1078737 1083727 1083204 1076144 1062032 1041442 1015997 987521 957366 926441 895401 864664 834539
61802 834539 805498 778158 753042 730561 711139 694939 681438 669651 658963 649534 641824 635906
61790 635906 631417 628073 626016 625494 626149 626886 626797 626112 625804 626280 626999 627438 627730 628048 628104 627776 627606 627970
61772 627970 628244 627576 626144 624853 623978 622881 620991 618306 615002 611288 607711 604918 602995 601539 600425
61757 600425 599878 599732 599288 598155 596733 595618 594947 594500 594019 593181 591622 589319 586721 584272 581919 579202
61741 579202 575774 571793 567883 564677 562287 560336 558524 556880 555382 553836 552482 552161 553233 554754
61727 554754 555462 555397 555732 557131 559099 561051 563116 565585 568272 570820 573169 575374 577350 579120 580993
$$ packed form
61826A000748r593n993k132J687N865J0223J3532J4848J4592J3652J2060R248
61814A078737M990n23p060j4112k0590k5445k8476l0155l0925l1040l0737l0125
61802H34539k9041k7340k5116k2481j9422j6200j3501j1787j0688r429p710n918
61790F35906m489l344k057n22O55P37q9o85l08M76P19M39K92L18N6l28j70L64
61772F27970K74o68j432j291q75j097j890k685l304l714l577k793j923j456j114
61757F00425n47j46m44j133j422j115o71m47m81q38j559k303k598k449k353k717
61741E79202l428l981l910l206k390j951j812j644j498j546j354l21J072J521
61727E54754P08o5L35J399J968J952K065K469K687K548K349K205J976J770J873
$$ plain form
61712 580993 583214 585575 587503 588356 587715 585800 583568 581969 580957 579595 577099 573398 568741 563474 558307
61697 558307 554135 551153 548591 545635 542277 539010 536104 533505 531122 528890 526743 524675 522610 520208
61683 520208 517209 514103 511907 511007 510665 509958 508749 507372 505842 503976 502013 500536 499816 499584 499367 498748
61667 498748 497392 495227 492581 489945 487612 485706 484357 483540 482880 481907 480503 478875 477210 475617 474319
61652 474319 473565 473296 473167 473002 473068 473786 475299 477396 479740 482115 484520 487108 489957 492881 495515 497690
61636 497690 499643 501724 503889 505635 506458 506206 504905 502536 499259 495669 492405 489532 486622 483412 479974
61621 479974 476312 472391 468724 466241 465143 464457 463208 461640 460626 460266 459766 458528 456633 454267 451333
61606 451333 447713 443351 438025 431566 424431 417582 411618 406376 401483 396926 392950 389760 387432 385794
$$ packed form
61712E80993K221K361J928Q53o41j915k232j599j012j362k496l701m657n267n167
61697E58307m172k982k562k956l358l267k906k599k383k232k147k068k065k402
61683E20208k999l106k196r00l42p07j209j377j530j866j963j477p20k32k17o19
61667D98748j356k165k646k636k333j906j349q17o60r73j404j628j665j593j298
61652D74319p54k69j29j65O6P18J513K097K344K375K405K588K849K924K634K175
61636D97690J953K081K165J746Q23k52j301k369l277l590l264k873k910l210l438
61621D79974l662l921l667k483j098o86j249j568j014l60n00j238j895k366k934
61606D51333l620m362n326o459p135o849n964n242m893m557l976l190k328j638
$$ plain form
61592 385794 384302 382316 379597 376368 372954 369648 366744 364307 361977 359439 356975 355057 353501 351639
61578 351639 349328 347181 345744 345028 344938 345407 345898 345548 344200 342733 341907 341433 340635 339573 338864 338680 338512
61561 338512 337866 336817 335888 335612 336074 336709 336781 336216 335771 336180 337386 338791 339954 340774 341247 341444 341634 342203
61543 342203 343413 345258 347419 349395 350939 352347 354011 355789 357304 358791 360975 363953 366990 369659
61529 369659 372389 375329 377477 377829 376833 375758 374894 373406 370894 368066 365592 363172 360229 356919 353930
61514 353930 351633 349908 348581 347600 346859 346200 345621 345264 345193 345345 345615 345844 345740 345055 343925 342839 342116
61497 342116 341531 340633 339411 338483 338565 339836 341792 343558 344355 343952 342864 341966 341738 341946 342094 342045 342052 342361
61479 342361 342946 343496 343581 343040 342342 342292 343211 344718 346433 348445 350704 352547 353425 353796 354544 355756 356743
$$ packed form
61592C85794j492j986k719l229l414l306k904k437k330k538k464j918j556j862
61578C51639k311k147j437p16r0M69M91l50j348j467q26m74p98j062p09j84j68
61561C38512o46j049r29k76M62O35P2n65m45M09J206J405J163Q20M73J97J90N69
61543C42203J210J845K161J976J544J408J664J778J515J487K184K978L037K669
61529C69659K730K940K148L52r96j075q64j488k512k828k474k420k943l310k989
61514C53930k297j725j327r81p41o59n79l57p1J52K70K29j04o85j130j086p23
61497C42116n85q98j222r28Q2J271J956J766P97m03j088q98k28K08J48m9PL09
61479C42361N85N50Q5n41o98n0R19J507J715K012K259J843Q78L71P48J212R87
$$ plain form
61462 356743 357125 357124 356820 355969 354709 353733 353495 353781 354260 354891 355654 356416 357262 358439 359818 360975 361850 362711
61444 362711 363378 363270 362488 362034 362587 363811 365355 367688 371203 375137 378284 380523 382917 386395 390876
61429 390876 395566 399694 403007 405819 408483 410805 412304 413065 413786 414814 415872 416953 418652 421132 423641
61414 423641 425769 428269 431729 435115 436865 437001 436962 437485 437902 437568 436803 436050 435059 433413 431166 428494
61398 428494 425187 421036 416457 412378 409553 408104 407549 407250 406960 406950 407446 408146 408548 408610 408763 409387 410596
61381 410596 412329 414268 415820 416612 416884 417086 417345 417734 418729 420727 423312 425694 427801 430171 432786 434902
61365 434902 436250 437654 439999 443102 446042 448241 449882 451534 453728 456707 460345 464311 468354 472317
61351 472317 476124 480082 485007 491490 499039 506561 513741 521301 529694 538262 546053 552876 558998 564337
$$ packed form
61462C56743L82jl04q51j260r76k38K86M79O31P63P62Q46J177J379J157Q75Q61
61444C62711O67j08p82m54N53J224J544K333L515L934L147K239K394L478M481
61429C90876M690M128L313K812K664K322J499P61P21J028J058J081J699K480K509
61414D23641K128K500L460L386J750J36l9N23M17l34p65p53r91j646k247k672
61398D28494l307m151m579m079k825j449n55k99k90j0M96P00M02O2J53O24J209
61381D10596J733J939J552P92K72K02K59L89R95J998K585K382K107K370K615K116
61365D34902J348J404K345L103K940K199J641J652K194K979L638L966M043L963
61351D72317L807L958M925O483P549P522P180P560Q393Q568P791O823O122N339
$$ plain form
61337 564337 568671 572392 576347 580855 585357 589066 591652 593251 594162 594619 594587 593703 591631 588555 585132
61322 585132 581860 578678 575337 571991 569188 567324 566317 565954 566382 568062 571203 575388 579857 584091 588167
61307 588167 592645 598176 605049 613081 621986 631924 643485 657049 672225 687919 702740 715346 724802
61294 724802 730949 734289 735251 733689 729345 722648 714755 706828 699456 692655 686040 679019 671166 662672
61280 662672 654386 647303 642008 638456 636131 634408 632919 631683 631001 631338 633240 637071 642628 649127 655687
61265 655687 661714 666851 670899 673994 676609 679144 681661 684239 687418 692097 699041 708468 719788 731606
61251 731606 742403 751478 759034 765218 769577 771692 771803 770303 767118 762188 756215 750154 744123 737548
61237 737548 730316 723075 716386 710262 704746 700257 697012 694532 692091 689458 686973 685156 684434 685104 687377
$$ packed form
61337E64337M334L721L955M508M502L709K586J599R11M57l2q84k072l076l423
61322E85132l272l182l341l346k803j864j007l63M28J680L141M185M469M234M076
61307E88167M478N531O873Q032Q905R938J1561J3564J5176J5694J4821J2606R456
61294G24802O147L340R62j562m344o697p893p927p372o801o615p021p853q494
61280F62672q286p083n295l552k325j723j489j236o82L37J902L831N557O499O560
61265F55687O027N137M048L095K615K535K517K578L179M679O944R427J1320J1818
61251G31606J0797R075P556O184M359K115J11j500l185m930n973o061o031o575
61237G37548p232p241o689o124n516m489l245k480k441k633k485j817p22O70K273
$$ plain form
61222 687377 691418 697259 704514 712364 720108 727668 735276 742766 749596 755510 760823 765988 771172 776321
61208 776321 781371 786311 791224 796238 801277 805921 809769 812890 815762 818914 822845 828088 835008 843602
61194 843602 853757 865576 879213 894673 912035 931523 952906 975043 996542 1016605 1034764
61183 1034764 1050190 1062105 1070819 1077564 1083147 1087351 1089768 1090581 1090380 1089711 1088965 1088205 1086844 1083850 1078472
61168 1078472 1070661 1060877 1049837 1038231 1026170 1012975 997963 981271 963421 944398 923989 902827
61156 902827 882133 862411 843295 824804 807682 792241 777903 764417 752612 743320 736322 731025
61144 731025 727506 726156 726653 727909 728660 727678 723991 717575 709599 701458 693754 686581 680284 675360 671910
61129 671910 669778 669072 670093 672914 677398 683480 691172 700616 712364 727214 745394 766304 789343
$$ packed form
61222F87377M041N841P255P850P744P560P608P490O830N914N313N165N184N149
61208G76321N050M940M913N014N039M644L848L121K872L152L931N243O920Q594
61194H43602J0155J1819J3637J5460J7362J9488K1383K2137K1499K0063J8159
61183A034764J5426J1915Q714O745N583M204K417Q13k01o69p46p60j361k994n378
61168A078472p811r784j1040j1606j2061j3195j5012j6692j7850j9023k0409k1162
61156I02827k0694j9722j9116j8491j7122j5441j4338j3486j1805r292o998n297
61144G31025l519j350M97J256P51r82l687o416p976q141p704p173o297m924l450
61129F71910k132p06J021K821M484O082P692R444J1748J4850J8180K0910K3039
$$ plain form
61116 789343 814517 841798 870448 899689 929726 961388 994902 1029537 1064314 1098576 1131932
61105 1131932 1164116 1194874 1223692 1249831 1272938 1293351 1311458 1327062 1339700 1349112 1354816 1355664
61093 1355664 1350620 1339875 1324564 1305522 1282941 1257112 1228716 1198250 1165834 1131830 1097198
61082 1097198 1063047 1030098 998677 968930 940917 914698 890369 867907 847116 827953 810731
61071 810731 795737 782823 771599 761821 753279 745651 738955 733897 731182 730533 730859 731360 732038 733223
61057 733223 735113 737811 741379 745768 750990 757296 764989 774152 784797 796969 810424 824605 839472
61044 839472 855995 875206 896988 920480 945393 972172 1001020 1031613 1063762 1097491 1132410
61033 1132410 1167757 1203241 1239247 1276187 1314340 1354259 1396390 1440230 1484788 1530052 1577075
$$ packed form
61116G89343K5174K7281K8650K9241L0037L1662L3514L4635L4777L4262L3356
61105A131932L2184L0758K8818K6139K3107K0413J8107J5604J2638R412N704Q48
61093A355664n044j0745j5311j9042k2581k5829k8396l0466l2416l4004l4632
61082A097198l4151l2949l1421k9747k8013k6219k4329k2462k0791j9163j7222
61071H10731j4994j2914j1224r778q542p628o696n058k715o49L26N01O78J185
61057G33223J890K698L568M389N222O306P693R163J0645J2172J3455J4181J4867
61044H39472J6523J9211K1782K3492K4913K6779K8848L0593L2149L3729L4919
61033A132410L5347L5484L6006L6940L8153L9919M2131M3840M4558M5264M7023
$$ plain form
61022 1577075 1626381 1677300 1729163 1782094 1836197 1891222 1947752 2007809 2073555 2146445 2228373
61011 2228373 2322413 2431146 2555107 2694160 2850025 3026878 3231009 3471545 3760466 4110092
61001 4110092 4531472 5037365 5646110 6380925 7267664 8336926 9625321 11165604 12971636
60992 12971636 15035972 17335430 19811063 22313690 24574960 26280556 27230337 27460544
60984 27460544 27217629 26813012 26491775 26395454 26571014 26947623 27299639 27289118 26616160 25177250
60974 25177250 23105199 20672919 18156522 15754383 13577981 11674050 10046314 8673165
60966 8673165 7523407 6565702 5770390 5109597 4559269 4100337 3717032 3395067 3121798
60957 3121798 2886717 2681090 2498102 2333836 2186994 2056865 1942021 1840844 1751994 1673799
$$ packed form
61022A577075M9306N0919N1863N2931N4103N5025N6530O0057O5746P2890Q1928
61011B228373R4040J08733J23961J39053J55865J76853K04131K40536K88921L49626
61001D110092M21380N05893O08745P34815Q86739J069262J288395J540283J806032
60992A2971636K064336K299458K475633K502627K261270J705596R49781K30207
60984B7460544k42915m04617l21237r6321J75560L76609L52016j0521o72958j438910
60974B5177250k072051k432280k516397k402139k176402j903931j627736j373149
60966H673165j149758r57705p95312o60793n50328m58932l83305l21965k73269
60957C121798k35081k05627j82988j64266j46842j30129j14844j01177q8850p8195
$$ plain form
60947 1673799 1604276 1542381 1488238 1441325 1399194 1358621 1317452 1274934 1231288 1187755 1146139
60936 1146139 1107280 1070426 1034773 1000830 969395 940045 911864 885107 860847 839308 819824
60925 819824 802277 787239 774662 763578 753307 743840 734881 725636 716018 707117 699895 694050 688551
60912 688551 682701 676326 669579 663010 657381 653013 649617 646856 644524 642139 639118 635695 632918 631291
60898 631291 629989 627863 624769 621458 618593 616314 614338 612048 608830 604803 600917 598004 596006 594439
60884 594439 593201 592502 592279 592128 591646 590663 589373 588459 588678 590036 591732 593224 594988 597872 602056 607050
60868 607050 612439 618169 624316 630891 637765 644642 651381 658443 666567 675825 685502 695158 705231 716205
60854 716205 727815 739615 751699 764070 775761 785519 793320 800544 808686 818354 829300 840759
$$ packed form
60947A673799o9523o1895n4143m6913m2131m0573m1169m2518m3646m3533m1616
60936A146139l8859l6854l5653l3943l1435k9350k8181k6757k4260k1539j9484
60925H19824j7547j5038j2577j1084j0271r467q959r245r618q901p222n845n499
60912F88551n850o375o747o569n629m368l396k761k332k385l021l423k777j627
60898F31291j302k126l094l311k865k279j976k290l218m027l886k913j998j567
60884E94439j238o99k23j51m82r83j290r14K19J358J696J492J764K884M184M994
60868F07050N389N730O147O575O874O877O739P062Q124R258R677R656J0073J0974
60854G16205J1610J1800J2084J2371J1691R758P801P224Q142R668J0946J1459
$$ plain form
60842 840759 851824 862114 872142 882539 893052 902814 911554 919939 928689 937975 947862 958784 971208
60829 971208 985080 999827 1014756 1029316 1043040 1055313 1065310 1072435 1076875 1079310 1079761 1077057 1069841
60816 1069841 1057922 1042271 1024018 1003934 982623 960521 937742 914410 891166 868864 847821
60805 847821 827853 809027 791800 776343 762206 748911 736498 725350 715681 707281 699550 691853
60793 691853 684134 677140 671678 667677 664256 660603 656425 651700 646529 641281 636340 631576 626482 620970
60779 620970 615629 611040 607175 603569 599702 595134 589700 583817 578266 573377 568631 563254 557052 550554
60765 550554 544564 539648 535762 532229 528250 523598 518685 513901 509158 504111 498623 492886 487344 482601
60751 482601 479122 476805 474983 473025 470879 468933 467543 466783 466554 466773 467441 468533 469812 470744 470768 469694
$$ packed form
60842H40759J1065J0290J0028J0397J0513R762Q740Q385Q750R286R887J0922J2424
60829I71208J3872J4747J4929J4560J3724J2273R997P125M440K435M51k704p216
60816A069841j1919j5651j8253k0084k1311k2102k2779k3332k3244k2302k1043
60805H47821j9968j8826j7227j5457j4137j3295j2413j1148r669q400p731p697
60793F91853p719o994n462m001l421l653m178m725n171n248m941m764n094n512
60779F20970n341m589l865l606l867m568n434n883n551m889m746n377o202o498
60765E50554n990m916l886l533l979m652m913m784m743n047n488n737n542m743
60751D82601l479k317j822j958k146j946j390p60k29K19O68J092J279R32K4j074
$$ plain form
60735 469694 467839 465771 463972 462698 462031 462037 462823 464391 466436 468441 469975 470801 470772 469948 468830 468025 467521
60718 467521 466626 464877 462584 460122 457157 453117 448168 443099 438299 433451 428258 422992 418146 413862
60704 413862 409902 405981 402082 398501 395534 393022 390445 387618 385028 383171 381898 380766 379735 379023
60690 379023 378525 377972 377529 377654 378386 379282 380117 381196 382900 385291 388132 391008 393571 396013 399097 403282
60674 403282 408032 412468 416425 420233 423802 426822 429715 433379 437814 441896 444769 446641 448020 449086
60660 449086 450213 452211 455392 459054 462479 465825 469417 472835 475510 477816 480713 484533 488886 493517
60646 493517 498453 503294 507168 509601 510845 511156 510280 507955 504485 500386 495692 490051 483501 476789 470779
60631 470779 465724 461267 457072 453191 449866 447217 445246 443881 442804 441459 439571 437625 436534 436794
$$ packed form
60735D69694j855k068j799j274o67OP86J568K045K005J534Q26k9q24j118q05n04
60718D67521q95j749k293k462k965m040m949n069m800m848n193n266m846m284
60704D13862l960l921l899l581k967k512k577k827k590j857j273j132j031p12
60690C79023m98n53m43J25P32Q96Q35J079J704K391K841K876K563K442L084M185
60674D03282M750M436L957L808L569L020K893L664M435M082K873J872J379J066
60660D49086J127J998L181L662L425L346L592L418K675K306K897L820M353M631
60646D93517M936M841L874K433J244L11q76k325l470m099m694n641o550o712o010
60631D70779n055m457m195l881l325k649j971j365j077j345j888j946j091K60
$$ plain form
60617 436794 438068 439494 440191 439678 438190 436561 435486 434896 434248 433300 432289 431495 431069 431198 431973 433055
60601 433055 433920 434488 435125 435957 436641 436916 436932 436928 437001 437400 438613 440886 443822 446672 448814 449963 450260 450255 450501
60582 450501 451042 451566 452084 453026 454536 456148 457441 458737 460783 463863 467474 470914 474137 478026 483645
60567 483645 491228 500219 510423 522598 537376 554111 571505 589086 607097 624999 641032 653500
60555 653500 661751 665754 665609 661823 655366 647066 637461 627416 618146 610288 603619 598067 594331 593134
60541 593134 594582 598671 605654 615384 627021 640046 654966 672370 691899 712808 734865 757706
60529 757706 779764 798819 813488 823433 828445 828347 823833 816542 807994 798888 789421 779752 770088 760769
60515 760769 752324 745158 739225 734328 730586 728257 727346 727765 729728 733481 738808 745237 752551 760697 769486
$$ packed form
60617D36794J274J426O97n13j488j629j075n90o48r48j011p94m26J29P75J082
60601D33055Q65N68O37Q32O84K75J6mP3L99J213K273K936K850K142J149K97nK46
60582D50501N41N24N18R42J510J612J293J296K046L080L611L440L223L889N619
60567D83645P583Q991J0204J2175J4778J6735J7394J7581J8011J7902J6033J2468
60555F53500Q251M003j45l786o457q300r605j0045r270p858o669n552l736j197
60541E93134J448M089O983R730J1637J3025J4920J7404J9529K0909K2057K2841
60529G57706K2058J9055J4669R945N012r8m514p291q548r106r467r669r664r319
60515G60769q445p166n933m897l742k329r11M19J963L753N327O429P314Q146Q789
$$ plain form
60500 769486 779102 790766 806196 826328 851134 880718 915878 957397 1005310 1059076 1117928 1180660
60488 1180660 1245397 1309863 1371653 1428054 1475970 1512520 1535862 1545359 1541037 1523040 1491731 1448263
60476 1448263 1394855 1334252 1268905 1200841 1132230 1065572 1003019 945726 894001 847774 806642
60465 806642 769927 737226 708797 684970 665251 648361 633090 618791 605173 592149 579992
60454 579992 569275 560360 553008 546556 540496 534839 529899 525629 521321 516323 510918 506017 501967 498357
60440 498357 495187 493339 493236 493748 493367 492112 491245 491237 491127 490105 488778 488293 488763 489179 488594 486927 484747
60423 484747 482655 480960 479704 478845 478343 478124 478101 478347 479089 480348 481745 482894 483864 484956 486134 487027
60407 487027 487497 487929 488844 490388 492266 494020 495367 496365 497223 497921 498129 497677 496955 496597 496849 497481 498304
$$ packed form
60500G69486R616J1664J5430K0132K4806K9584L5160M1519M7913N3766N8852O2732
60488A180660O4737O4466O1790N6401M7916L6550K3342R497m322j7997l1309m3468
60476A448263n3408o0603o5347o8064o8611o6658o2553n7293n1725m6227m1132
60465H06642l6715l2701k8429k3827j9719j6890j5271j4299j3618j3024j2157
60454E79992j0717q915p352o452o060n657m940m270m308m998n405m901m050l610
60440D98357l170j848j03N12l81j255q67qj10j022j327m85M70M16n85j667k180
60423D84747k092j695j256q59n02k19k3K46P42J259J397J149R70J092J178Q93
60407D87027M70M32R15J544J878J754J347R98Q58O98K08m52p22l58K52O32Q23
$$ plain form
60390 498304 499513 501366 503702 505965 507812 509595 512015 515213 518435 520864 522579 524287 526275 528124
60376 528124 529496 530575 531567 532353 532965 533964 535903 538626 541423 543690 545309 546641 548221 550142 551708
60361 551708 552227 552177 552891 554807 556781 557555 557251 556912 557268 558580 561039 564487 568197 571817 576213 582610
60345 582610 591087 600613 610309 619888 629064 637348 644423 650011 653443 654066 652084 648388 643530 637410
60331 637410 629990 621811 613748 606565 600571 595373 590246 585154 581011 578421 576669 574682 572516 570905
60317 570905 569711 568023 565729 563863 563219 563652 564975 567555 571634 576856 582819 589484 596836 604924 614526
60302 614526 626966 642917 662045 684136 709618 738346 768466 797190 822276 842272 855820
60291 855820 861533 858562 847018 827995 803505 776124 748306 721886 698043 677281 659385 643836
$$ packed form
60390D98304J209J853K336K263J847J783K420L198L222K429J715J708J988J849
60376E28124J372J079R92P86O12R99J939K723K797K267J619J332J580J921J566
60361E51708N19n0P14J916J974P74l04l39L56J312K459L448L710L620M396O397
60345E82610Q477R526R696R579R176Q284P075N588L432O23j982l696m858o120
60331F37410p420q179q063p183n994n198n127n092m143k590j752j987k166j611
60317E70905j194j688k294j866o44M33J323K580M079N222N963O665P352Q088R602
60302F14526J2440J5951J9128K2091K5482K8728L0120K8724K5086J9996J3548
60291H55820N713k971j1544j9023k4490k7381k7818k6420k3843k0762j7896j5549
$$ plain form
60279 643836 630490 619563 610925 603893 597830 592479 587566 582662 577704 573104 569053 565126 560929 556675
60265 556675 552806 549408 546386 543847 541952 540647 539804 539324 538902 538111 537065 536578 537248 538701 540130 541254
60249 541254 542209 542822 542689 541960 541456 541739 542456 542847 542653 542195 541710 541001 539918 538829 538238 538062 537754 537267
60231 537267 537358 538660 540877 543302 545785 548717 552314 556452 560946 565481 569476 572592 575183 577681 579791
60216 579791 581070 582094 584075 587237 590504 593072 595505 598868 603524 609209 615668 622646 629669 636361
60202 636361 642727 648816 654351 658971 662590 665298 667219 668666 670188 672196 674647 677099 678884 679407
60188 679407 678677 677505 676666 675928 674454 672061 669401 666879 664171 661009 657651 654299 650683 646625 642438
60173 642438 638477 634836 631751 629627 628332 627108 625581 624287 623788 623817 623800 623647 623559 623540 623544 623649 623616 622833
$$ packed form
60279F43836j3346j0927q638p032o063n351m913m904m958m600m051l927m197m254
60265E56675l869l398l022k539j895j305q43m80m22p91j046m87O70J453J429J124
60249E41254R55O13j33p29n04K83P17L91j94m58m85p09j083j089n91j76l08m87
60231E37267R1J302K217K425K483K932L597M138M494M535L995L116K591K498K110
60216E79791J279J024J981L162L267K568K433L363M656N685O459O978P023O692
60202F36361O366O089N535M620L619K708J921J447J522K008K451K452J785N23
60188F79407p30j172q39p38j474k393k660k522k708l162l358l352l616m058m187
60173F42438l961l641l085k124j295j224j527j294m99K9j7j53q8j9MJ05l3p83
$$ plain form
60155 622833 621233 619783 619467 620166 621087 621890 622798 623966 625426 627436 630266 633762 637606 641810 646490
60140 646490 651394 656233 661316 667284 674231 681555 688695 695582 702277 708487 713636 717424 720256 722941
60126 722941 725713 727619 727311 724499 720264 715929 712168 709252 707444 706746 706790 707346 708527 710233 711889
60111 711889 713097 714015 714755 715018 714782 714725 715347 716155 716364 715969 715445 714697 712988 709787 705171 699623 693949
60094 693949 689120 685626 683105 681020 679496 679074 679932 681886 684876 688916 693760 699169 705356 712560 720279
60079 720279 727420 733189 737462 740313 741600 741007 738240 733249 726399 718280 709234 699360 689041 678958
60065 678958 669375 659988 650809 642585 635872 630287 625199 620508 616071 611031 604743 597981 592215 587819
60051 587819 583945 580040 576537 573886 571829 569994 568651 568507 570076 573301 577470 581535 584899 587934
$$ packed form
60155F22833j600j450l16O99R21Q03R08J168J460K010K830L496L844M204M680
60140F46490M904M839N083N968O947P324P140O887O695O210N149L788K832K685
60126G22941K772J906l08k812m235m335l761k916j808o98M4N56J181J706J656
60111G11889J208R18P40K63k36n7O22Q08K09l95n24p48j709l201m616n548n674
60094F93949m829l494k521k085j524m22Q58J954K990M040M844N409O187P204P719
60079G20279P141N769M273K851J287n93k767m991o850q119r046r874j0319j0083
60065F78958r583r387r179q224o713n585n088m691m437n040o288o762n766m396
60051E87819l874l905l503k651k057j835j343j44J569L225M169M065L364L035
$$ plain form
60037 587934 591424 595588 600023 604407 608753 612982 616726 619574 621211 621410 620263 618348 616246 613900
60023 613900 610673 605921 599297 590865 581294 571647 562489 553465 544183 535186 527429 521114 515681 510817
60009 510817 506742 503594 501222 499609 498893 498868 498957 498776 498370 497896 497519 497484 497882 498434 498935 499726 501262 503313
59991 503313 505141 506370 507237 508126 509394 511508 514754 518878 523480 528600 534288 539802 543958 546346 547561
59976 547561 548286 548786 549262 549928 550508 550273 548860 546661 544343 542414 541267 541094 541689 542838 544888 548351
59960 548351 552915 557410 560861 563058 564179 564577 565027 566307 568100 568996 568055 565896 563755 561954 559878
59945 559878 557218 554571 552713 551659 550679 549147 547153 545170 543281 541094 538434 535643 532940 530004
59931 530004 526693 523777 522306 522435 523434 524703 526169 527810 529481 531277 533461 535953 538358 540534 542676
$$ packed form
60037E87934L490M164M435M384M346M229L744K848J637J99j147j915k102k346
60023F13900l227m752o624q432r571r647r158r024r282q997p757o315n433m864
60009E10817m075l148k372j613p16k5Q9j81m06m74l77l5L98N52N01P91J536K051
59991E03313J828J229Q67Q89J268K114L246M124M602N120N688N514M156K388J215
59976E47561P25N00M76O66N80k35j413k199k318j929j147j73N95J149K050L463
59960E48351M564M495L451K197J121L98M50J280J793Q96r41k159k141j801k076
59945E59878k660k647j858j054r80j532j994j983j889k187k660k791k703k936
59931E30004l311k916j471J29R99J269J466J641J671J796K184K492K405K176K142
$$ plain form
59916 542676 544844 546908 548989 551423 554302 557513 561174 565462 570037 574262 578107 582228 586967 591751
59902 591751 595675 598287 599702 600356 600735 600939 600417 598505 595313 591800 588920 587019 586040 585924 586781 588807
59886 588807 592000 595826 599553 603185 607566 613122 619046 624418 629551 635403 642057 648814 655409 662009
59872 662009 668174 673039 676540 679270 681019 680632 677626 672814 667081 660670 654059 648249 643480 638739
59858 638739 633379 628351 624933 623003 621527 620208 619600 619880 620490 621036 621886 623775 627255 632533 639524
59843 639524 648011 657893 669170 681530 693960 704819 712356 715614 715328 713735 712964 713636 715421 718446
59829 718446 723160 728847 733408 735005 733162 728156 720348 710651 700662 691525 683083 674663 666197 658104
59815 658104 650596 643702 637592 632419 628047 624293 621155 618598 616443 614597 612997 611277 609128 607025
$$ packed form
59916E42676K168K064K081K434K879L211L661M288M575M225L845M121M739M784
59902E91751L924K612J415O54L79K04n22j912l192l513k880j901r79j16Q57K026
59886E88807L193L826L727L632M381N556N924N372N133N852O654O757O595O600
59872F62009O165M865L501K730J749l87l006m812n733o411o611n810m769m741
59858F38739n360n028l418j930j476j319o08K80O10N46Q50J889L480N278O991
59843F39524Q487R882J1277J2360J2430J0859P537L258k86j593p71O72J785L025
59829G18446M714N687M561J597j843n006p808r697r989r137q442q420q466q093
59815F58104p508o894o110n173m372l754l138k557k155j846j600j720k149k103
$$ plain form
59801 607025 605885 605760 605624 604681 603043 600757 597103 591558 584744 577690 570723 563695 556804 550483 544833
59786 544833 539816 535675 532567 530053 527466 524660 521994 519822 518275 517271 516529 515826 515339 515312 515381 514878
59770 514878 513929 513516 514192 515507 516968 518664 520493 521706 521952 522028 522874 524383 525846 527023 528126 529313
59754 529313 530847 533203 536431 539962 543612 548052 553600 559253 563789 567228 570390 573584 576652 579788
59740 579788 583238 586555 589106 591131 593387 595977 598344 600219 601768 602977 603746 604452 605688 607466 609308
59725 609308 610929 612315 613452 614642 616671 619884 623373 625916 627436 628726 630035 630890 631109 631033 630772
59710 630772 630142 629334 628805 628528 628187 628094 628992 630836 632632 633624 633915 633764 633111 632103 631365 631424 632322 634055
59692 634055 636813 640581 644872 648999 652215 653709 653084 650991 648719 646960 645498 644099 643065 642644 642587
$$ packed form
59801F07025j140j25j36r43j638k286l654n545o814p054o967p028o891o321n650
59786E44833n017m141l108k514k587k806k666k172j547j004p42p03m87k7O9n03
59770E14878r49m13O76J315J461J696J829J213K46P6Q46J509J463J177J103J187
59754E29313J534K356L228L531L650M440N548N653M536L439L162L194L068L136
59740E79788L450L317K551K025K256K590K367J875J549J209P69P06J236J778J842
59725F09308J621J386J137J190K029L213L489K543J520J290J309Q55K19p6k61
59710F30772o30q08n29k77l41r3Q98J844J796R92K91j51o53j008p38N9Q98J733
59692F34055K758L768M291M127L216J494o25k093k272j759j462j399j034m21n7
$$ plain form
59677 642587 642688 643235 644354 645198 644377 641310 636859 632469 628819 625356 621108 615733 609656 603445 597406
59662 597406 591707 586399 581283 576275 572004 569430 568676 568856 569324 570331 572083 574051 575866 578113 581378
59647 581378 585113 588341 590950 593329 595201 595874 595314 593874 591266 586991 581735 577110 573858 571351 569104
59632 569104 567722 567905 569366 571240 572983 574411 575308 575422 574728 573525 572386 571866 571907 571777 571001 570135 570079
59615 570079 570830 571496 571357 570332 568644 566716 565218 564506 564164 563754 563756 564976 567278 569822 572327 575071
59599 575071 577690 579146 579067 578113 576862 575295 573610 572526 572325 572420 572245 571863 571381 570572 569461 568591 568294
59582 568294 568259 568109 567775 567063 565553 563250 560678 558013 554767 550729 546587 543235 540965 539573 538709 537906
59566 537906 536864 535956 535812 536202 536105 535112 533995 533565 533788 534474 535904 538134 540378 541845 542657 543362 544105
$$ packed form
59677F42587J01N47J119Q44q21l067m451m390l650l463m248n375o077o211o039
59662E97406n699n308n116n008m271k574p54J80M68J007J752J968J815K247L265
59647E81378L735L228K609K379J872O73n60j440k608m275n256m625l252k507k247
59632E69104j382J83J461J874J743J428Q97J14o94j203j139n20M1j30p76q66n6
59615E70079P51O66j39j025j688j928j498p12l42m10KJ220K302K544K505K744
59599E75071K619J456p9r54j251j567j685j084k01R5j75l82m82q09j111q70k97
59582E68294l5j50l34p12j510k303k572k665l246m038m142l352k270j392q64q03
59566E37906j042r08j44L90r7r93j117m30K23O86J430K230K244J467Q12P05P43
$$ plain form
59549 544105 544916 546331 548928 552496 556266 559757 563039 566437 570357 575113 580663 586886 594299 603904
59535 603904 616126 630726 648083 669241 693427 716182 731581 736686 733287 725534 716894 709335
59523 709335 704043 701772 702628 706053 711153 716946 722445 726752 729248 729794 728699 726296 722482 716838 709223
59508 709223 700068 690055 679761 669627 659938 650678 641742 633370 626026 619706 613784 607770 601894
59495 601894 596676 592281 588636 585889 584332 583947 584319 584956 585514 585860 586113 586638 587868 590125 593534 598016
59479 598016 603399 609649 616859 624898 633402 642419 652662 664599 677537 690226 702115 713176 722686
59466 722686 729196 732013 731882 729897 726574 722435 718709 716783 717295 720160 725114 731872 740261 750552
59452 750552 763231 778125 794217 810689 827573 845009 862434 879053 894660 909382 922799
$$ packed form
59549E44105Q11J415K597L568L770L491L282L398L920M756N550O223P413R605
59535F03904J2222J4600J7357K1158K4186K2755J5399N105l399p753q640p559
59523G09335n292k271Q56L425N100N793N499M307K496N46j095k403l814n644p615
59508G09223r155j0013j0294j0134r689r260q936q372p344o320n922o014n876
59495F01894n218m395l645k747j557l85L72O37N58L46K53N25J230K257L409M482
59479E98016N383O250P210Q039Q504R017J0243J1937J2938J2689J1889J1061R510
59466G22686O510K817j31j985l323m139l726j926N12K865M954O758Q389J0291
59452G50552J2679J4894J6092J6472J6884J7436J7425J6619J5607J4722J3417
$$ plain form
59441 922799 933735 940663 942066 936847 924915 907365 886025 863153 841328 822599 807121 793305
59429 793305 779792 766738 754763 743579 732619 722436 714423 709407 707382 708387 712727 720416 731151
59416 731151 744804 761242 779896 800317 823028 848819 877248 906925 937371 968968 999934
59405 999934 1024296 1034670 1027625 1006052 976638 945934 918553 897328 883561 877267 878043 885406
59393 885406 897124 907252 907653 893094 864896 829183 792154 757512 727043 701521 680652 663534
59381 663534 649762 639367 631606 625038 619235 615270 613856 614037 614603 615902 619086 624079 629376 633673
59367 633673 636883 639695 642943 647299 652850 658833 664279 668959 673494 678697 685102 692793 701371 710381
59353 710381 720089 731390 744545 758590 772640 787337 804127 823427 844341 865940 887877 909770
$$ packed form
59441I22799J0936O928J403n219j1932j7550k1340k2872k1825j8729j5478j3816
59429G93305j3513j3054j1975j1184j0960j0183q013n016k025J005M340P689J0735
59416G31151J3653J6438J8654K0421K2711K5791K8429K9677L0446L1597L0966
59405I99934K4362J0374p045k1573k9414l0704k7381k1225j3767o294P76P363
59393H85406J1718J0128M01j4559k8198l5713l7029l4642l0469k5522k0869j7118
59381F63534j3772j0395p761o568n803l965j414J81N66J299L184M993N297M297
59367F33673L210K812L248M356N551N983N446M680M535N203O405P691Q578R010
59353G10381R708J1301J3155J4045J4050J4697J6790J9300K0914K1599K1937K1893
$$ plain form
59341 909770 931009 951450 971460 990833 1008262 1022329 1032545 1038901 1040879 1037621 1029094 1016508
59329 1016508 1001330 984209 965111 944265 922528 900754 879277 858204 837892 818737 800787
59318 800787 784008 768722 755310 743681 733627 725477 719601 715354 711416 707385 704105 702168 701054
59305 701054 700232 700110 701162 703008 705270 708658 714121 721422 729658 738949 750440 764627 780787 798221
59291 798221 816840 835724 851722 860476 859164 848245 830856 810817 791032 773089 757581 744479
59279 744479 733509 724719 718689 715834 715628 717063 719890 724774 732168 741746 753216 766776 782193
59266 782193 798162 813320 827377 840509 852093 860937 866543 869260 869234 865992 859198 849171 836489
59253 836489 821578 805016 787904 771585 756958 744070 732414 721662 712096 704217 698127 693651
$$ packed form
59341I09770K1239K0441K0010J9373J7429J4067J0216O356J978l258q527j2586
59329A016508j5178j7121j9098k0846k1737k1774k1477k1073k0312j9155j7950
59318H00787j6779j5286j3412j1629j0054q150n876m247l938m031l280j937j114
59305G01054q22j22J052J846K262L388N463P301Q236R291J1491J4187J6160J7434
59291G98221J8619J8884J5998Q754j312j0919j7389k0039j9785j7943j5508j3102
59279G44479j0970q790o030k855k06J435K827M884P394R578J1470J3560J5417
59266G82193J5969J5158J4057J3132J1584Q844N606K717k6l242o794j0027j2682
59253H36489j4911j6562j7112j6319j4627j2888j1656j0752r566p879o090m476
$$ plain form
59241 693651 690889 690108 691089 693224 696357 700855 706672 713158 720111 728116 737297 746511 754506 761170 766891
59226 766891 771253 773328 772893 770447 766250 760156 752301 743259 733551 723539 713682 704412 695877 688241
59212 688241 681980 677401 674106 671431 669180 667468 666191 665213 664804 665315 666606 668275 670198 672393 674664
59197 674664 676901 679387 682237 684851 686556 687559 688656 690197 691827 693049 693586 693453 693111 693256 694027
59182 694027 694820 695235 695659 696474 697370 698081 699076 700707 702310 703153 703812 705610 709074 713866 719833 727078
59166 727078 735285 744050 753727 764978 777603 790705 803727 816369 827740 836753 843338 848209 851406
59153 851406 852106 849956 845593 839670 832215 823104 812442 800438 787607 775121 764139 754750 746200
59140 746200 738007 730108 722164 713729 705063 696918 689493 682454 675818 669866 664328 658715 653469 649672
$$ packed form
59241F93651k762p81R81K135L133M498N817O486O953Q005R181R214P995O664N721
59226G66891M362K075m35k446m197o094p855r042r708j0012r857r270q535p636
59212F88241o261m579l295k675k251j712j277r78m09N11J291J669J923K195K271
59197F74664K237K486K850K614J705J003J097J541J630J222N37j33l42J45P71
59182F94027P93M15M24Q15Q96P11R95J631J603Q43O59J798L464M792N967P245
59166G27078Q207Q765R677J1251J2625J3102J3022J2642J1371R013O585M871L197
59153H51406P00k150m363n923p455r111j0662j2004j2831j2486j0982r389q550
59140G46200q193p899p944q435q666q145p425p039o636n952n538n613n246l797
$$ plain form
59126 649672 647542 646248 645320 645206 646262 648276 651221 655506 661179 667772 675163 683699 693345 703638
59112 703638 714596 726567 738998 750478 760360 769234 777447 784340 789509 793756 798049 802422 806536
59099 806536 810464 814132 816649 817019 815164 811698 807182 802090 797073 792672 789008 786001 783577 781506
59085 781506 779490 777554 775825 773869 770839 766476 761331 755852 749837 742940 735075 726224 716591 707015
59071 707015 698490 691105 684200 677657 672091 667601 663356 658847 654600 651161 648190 645124 642035 639308
59057 639308 637076 635442 634600 634290 633725 632517 631105 629925 628752 627280 625788 624747 624194 623855 623510 623058
59041 623058 622623 622634 623279 623891 623619 622696 622221 622548 622832 622377 621559 621103 621316 622299 624117 626467 629048 632477
59023 632477 637915 645485 654002 662556 671340 680572 689773 698685 707834 717403 726334 733209 737461 739387
$$ packed form
59126F49672k130j294r28j14J056K014K945M285N673O593P391Q536R646J0293
59112G03638J0958J1971J2431J1480R882Q874Q213O893N169M247M293M373M114
59099H06536L928L668K517L70j855l466m516n092n017m401l664l007k424k071
59085G81506k016j936j729j956l030m363n145n479o015o897p865q851r633r576
59071G07015q525p385o905o543n566m490m245m509m247l439k971l066l089k727
59057F39308k232j634q42l10n65j208j412j180j173j472j492j041n53l39l45m52
59041F23058m35J1O45O12k72r23m75L27K84m55q18m56K13R83J818K350K581L429
59023F32477N438P570Q517Q554Q784R232R201Q912R149R569Q931O875M252J926
$$ plain form
59009 739387 739736 739591 739665 739353 737469 734316 731877 731507 732719 734858 738558 744577 752364 760937 770148 780010
58993 780010 789694 798351 806153 813474 819865 825000 829796 835121 839883 841849 840223 836289 831591 826521
58979 826521 820730 814111 807210 801108 796840 794721 794460 796101 800208 806898 815475 825445 836989 849924
58965 849924 863263 876594 890982 907441 925232 942667 958942 974124 987840 999071 1007017 1011353
58953 1011353 1011906 1008739 1002126 991889 977407 958993 938550 918050 897945 877852 858063 839336
58941 839336 821868 805581 790995 778749 768561 759661 751939 745781 741066 737175 733734 730556 727249
58928 727249 723635 720221 717561 715477 713492 711472 709210 706147 702396 699398 698530 699489 700872 701813 702221
58913 702221 702128 701856 702269 703811 705789 707587 709961 714065 719779 726184 733115 741082 750142 760141 771663
$$ packed form
59009G39387L49j45P4l12j884l153k439l70J212K139L700O019P787Q573R211R862
58993G80010R684Q657P802P321O391N135M796N325M762J966j626l934m698n070
58979H26521n791o619o901o102m268k119k61J641M107O690Q577R970J1544J2935
58965H49924J3339J3331J4388J6459J7791J7435J6275J5182J3716J1231P946M336
58953A011353N53l167o613j0237j4482j8414k0443k0500k0105k0093j9789j8727
58941H39336j7468j6287j4586j2246j0188q900p722o158m715l891l441l178l307
58928G27249l614l414k660k084j985k020k262l063l751k998q68R59J383R41M08
58913G02221r3k72M13J542J978J798K374M104N714O405O931P967R060R999J1522
$$ plain form
58898 771663 785457 801259 818321 836642 856341 876247 894657 911407 927918 945274 963602
58887 963602 983264 1005208 1029937 1057132 1086363 1117009 1147465 1175466 1199453 1218854 1233206
58876 1233206 1241994 1245313 1243744 1237574 1226822 1211755 1192564 1169074 1141900 1113413 1086247 1061112
58864 1061112 1037259 1014711 994506 976872 960750 945258 930325 915846 901529 887633 874549
58853 874549 861600 847579 832579 817910 804142 790734 777737 766219 756463 747262 737677 728220
58841 728220 719624 711663 703979 697048 691436 686855 682638 678524 674425 670067 665361 660687 656415 652621
58827 652621 649396 646880 644892 643137 641794 641245 641312 641570 642295 644193 647282 651040 655507 661064 667138
58812 667138 672445 676737 681016 685673 689675 692073 693185 693739 693928 693853 693938 694239 694098 692979 690912 687870
$$ packed form
58898G71663J3794J5802J7062J8321J9699J9906J8410J6750J6511J7356J8328
58887I63602J9662K1944K4729K7195K9231L0646L0456K8001K3987J9401J4352
58876A233206Q788L319j569o170j0752j5067j9191k3490k7174k8487k7166k5135
58864A061112k3853k2548k0205j7634j6122j5492j4933j4479j4317j3896j3084
58853H74549j2949j4021j5000j4669j3768j3408j2997j1518r756r201r585r457
58841G28220q596p961p684o931n612m581m217m114m099m358m706m674m272l794
58827F52621l225k516j988j755j343n49O7K58P25J898L089L758M467N557O074
58812F67138N307M292M279M657M002K398J112N54J89p5Q5L01j41j119k067l042
$$ plain form
58796 687870 683608 678518 673668 669510 665355 660577 655514 650770 646494 642770 639865 637623 635541 633957
58782 633957 634308 637501 642681 648201 653202 657697 661799 665519 668944 672054 674551 676077 676316 674879 671610
58767 671610 667016 661865 656398 650592 644946 640069 635559 630388 624514 619046 614626 610773 607198 604653
58753 604653 603946 604993 607244 610211 613217 615586 617508 619912 623109 626487 629905 634343 640589 648149
58739 648149 656024 663798 671522 679278 687313 695850 704383 712032 718895 726065 733890 741292 747474 753270
58725 753270 759915 767290 774286 780304 785567 790388 794930 799438 804102 808851 813607 818553 824068 830740
58711 830740 839326 849967 861419 871791 880199 886926 891969 894425 893558 889464 882327 871976 858604
58698 858604 843023 825745 806612 785741 764089 742665 721877 701982 683449 666553 651343
$$ packed form
58796F87870m262n090m850m158m155m778n063m744m276l724k905k242k082j584
58782F33957L51L193N180N520N001M495M102L720L425L110K497J526K39j437l269
58767F71610m594n151n467n806n646m877m510n171n874n468m420l853l575k545
58753F04653p07J047K251K967L006K369J922K404L197L378L418M438O246P560
58739F48149P875P774P724P756Q035Q537Q533P649O863P170P825P402O182N796
58725G53270O645P375O996O018N263M821M542M508M664M749M756M946N515O672
58711H30740Q586J0641J1452J0372Q408O727N043K456q67m094p137j0351j3372
58698H58604j5581j7278j9133k0871k1652k1424k0788j9895j8533j6896j5210
$$ plain form
58687 651343 638178 627529 619068 611788 605149 599232 593755 588031 582029 576345 570963 565278 559515 554801
58673 554801 551548 549124 547474 547542 549555 552388 555353 559235 564828 571789 579753 589191 600231 611815
58659 611815 622903 633317 642495 648783 651101 650312 647908 644392 639955 635533 631859 628299 623824 618528
58645 618528 613222 608207 603433 599178 595717 592892 590699 589556 589427 589606 589958 591346 594148 597541 600973
58630 600973 605041 609941 614437 617547 620031 622887 625499 626815 627407 628870 631780 635686 640514 646567
58616 646567 653520 660649 667873 675650 684221 693657 704050 714818 724418 731548 736066 738208 737843 735204
58602 735204 731269 726533 720490 713218 706217 700507 695081 688663 681929 676499 672561 669068 665636 662815
58588 662815 661047 660674 662413 666597 672487 679477 688251 699543 712469 725381 737672 749500 760509
$$ packed form
58687F51343j3165j0649q461p280o639n917n477n724o002n684n382n685n763m714
58673E54801l253k424j650O8K013K833K965L882N593O961P964R438J1040J1584
58659F11815J1088J0414R178O288K318p89k404l516m437m422l674l560m475n296
58645F18528n306n015m774m255l461k825k193j143j29J79L52J388K802L393L432
58630F00973M068M900M496L110K484K856K612J316N92J463K910L906M828O053
58616F46567O953P129P224P777Q571R436J0393J0768R600P130M518K142l65k639
58602G35204l935m736o043p272p001n710n426o418o734n430l938l493l432k821
58588F62815j768l73J739M184N890O990Q774J1292J2926J2912J2291J1828J1009
$$ plain form
58575 760509 770220 779048 787448 794605 799429 802508 805732 810361 816579 824486 834290 845883 859254 874906
58561 874906 892994 912763 933805 956950 982688 1009516 1034999 1057622 1076383 1089724 1096554 1097691
58549 1097691 1094826 1088779 1080095 1070382 1061263 1052637 1043614 1034549 1026456 1019045 1011007 1001696 990886 977518
58535 977518 960590 940973 920712 900865 881536 863433 847533 833662 821180 810688 803244 798294
58523 798294 794303 791236 790494 792477 796034 800376 805798 812421 819684 827091 834072 839361 842017 842876 843483
58508 843483 843860 842810 840099 836620 832710 828075 823180 818948 815152 810768 805809 801194 796999 792521
58494 792521 787826 783461 778893 773211 767202 762676 759695 756579 752844 750131 749859 751806 755477 761028
58480 761028 768214 776051 784230 793662 805120 818363 832730 847434 861250 873089 882794 890243 894089
$$ packed form
58575G60509R711Q828Q400P157M824L079L224M629O218P907R804J1593J3371J5652
58561H74906J8088J9769K1042K3145K5738K6828K5483K2623J8761J3341O830J137
58549A097691k865o047q684r713r119q626r023r065q093p411q038r311j0810j3368
58535I77518j6928j9617k0261j9847j9329j8103j5900j3871j2482j0492p444m950
58523G98294l991l067p42J983L557M342N422O623P263P407O981N289K656Q59O07
58508H43483L77j050k711l479l910m635m895m232l796m384m959m615m195m478
58494G92521m695m365m568n682o009m526k981l116l735k713k72J947L671N551
58480G61028P186P837Q179R432J1458J3243J4367J4704J3816J1839R705P449L846
$$ plain form
58467 894089 892963 887680 880572 872808 864043 854544 845730 838436 832292 827038 823055 820633 820145 822680
58453 822680 828871 837373 846255 855531 866350 877986 887863 894608 898893 901106 900358 896215 889482 880892
58439 880892 870875 860862 852850 847273 843031 839818 838536 839259 840843 842944 846484 851643 857312 863007
58425 863007 869568 877565 886758 897484 910674 925953 941329 955233 967342 977250 984094 987770 988892
58412 988892 987347 982594 975377 967332 958824 949017 938088 927381 917298 907089 896825 887533 879317
58399 879317 871482 864549 859909 857382 855389 853688 853589 855365 857802 860515 864190 868244 870815 871542 871949
58384 871949 872695 872868 872350 872329 873037 873494 873892 875704 879023 882338 885311 889192 894214 899443 905428 913904
58368 913904 924317 933872 941747 950183 960543 971492 982031 993223 1005724 1018517 1031238 1044929
$$ packed form
58467H94089j126n283p108p764q765r499q814p294o144n254l983k422m88K535
58453H22680O191Q502Q882R276J0819J1636R877O745M285K213p48m143o733q590
58439H80892j0017j0013q012n577m242l213j282P23J584K101L540N159N669N695
58425H63007O561P997R193J0726J3190J5279J5376J3904J2109R908O844L676J122
58412I88892j545m753p217q045q508r807j0929j0707j0083j0209j0264r292q216
58399H79317p835o933m640k527j993j701r9J776K437K713L675M054K571P27M07
58384H71949P46J73n18k1P08M57L98J812L319L315K973L881N022N229N985Q476
58368I13904J0413R555P875Q436J0360J0949J0539J1192J2501J2793J2721J3691
$$ plain form
58356 1044929 1059491 1073216 1085736 1098455 1111173 1121431 1128189 1133025 1136805 1138585 1138918 1140613 1144750
58343 1144750 1149319 1153257 1158367 1165672 1173446 1180661 1188936 1199140 1209483 1219019 1229792 1243449 1258816
58330 1258816 1274811 1292645 1313042 1334256 1354730 1374732 1393672 1409123 1420426 1429943 1438928 1445620
58318 1445620 1449419 1453228 1459318 1466316 1472613 1479285 1487335 1495505 1503229 1512362 1523662 1535072 1545773
58305 1545773 1558236 1573867 1590431 1606312 1623331 1642677 1662003 1679516 1696999 1715868 1734286
58294 1734286 1751265 1769513 1790876 1812941 1833518 1854461 1877671 1901481 1924670 1949853 1978932
58283 1978932 2009158 2037739 2066542 2098250 2131704 2164996 2199370 2236110 2273446 2310380 2349585
58272 2349585 2392628 2436621 2479484 2524018 2572622 2622802 2672412 2724391 2781459 2841014 2900406
$$ packed form
58356A044929J4562J3725J2520J2719J2718J0258O758M836L780J780L33J695M137
58343A144750M569L938N110P305P774P215Q275J0204J0343R536J0773J3657J5367
58330A258816J5995J7834K0397K1214K0474K0002J8940J5451J1303R517Q985O692
58318A445620L799L809O090O998O297O672Q050Q170P724R133J1300J1410J0701
58305A545773J2463J5631J6564J5881J7019J9346J9326J7513J7483J8869J8418
58294A734286J6979J8248K1363K2065K0577K0943K3210K3810K3189K5183K9079
58283A978932L0226K8581K8803L1708L3454L3292L4374L6740L7336L6934L9205
58272B349585M3043M3993M2863M4534M8604N0180M9610N1979N7068N9555N9392
$$ plain form
58261 2900406 2962383 3029968 3100745 3171616 3244363 3320964 3398430 3474087 3550906 3631638 3712875
58250 3712875 3791224 3870164 3954324 4042290 4131715 4226014 4328890 4437728 4549725 4668945
58240 4668945 4799702 4938643 5081337 5230946 5392246 5563052 5740154 5927552 6129811
58231 6129811 6343514 6564780 6798911 7052808 7324338 7609503 7913334 8242887 8596358
58222 8596358 8970476 9371560 9807542 10276627 10776443 11316613 11909282 12555650 13255883
58213 13255883 14023335 14873978 15811712 16840857 17983400 19266541 20704540 22312925
58205 22312925 24130019 26204711 28577484 31299137 34456718 38156700 42498751 47596005
58197 47596005 53605164 60705684 69075056 78936060 90623970 104578833 121307329 141400692
$$ packed form
58261B900406O1977O7585P0777P0871P2747P6601P7466P5657P6819Q0732Q1237
58250C712875P8349P8940Q4160Q7966Q9425R4299J02876J08838J11997J19220
58240D668945J30757J38941J42694J49609J61300J70806J77102J87398K02259
58231F129811K13703K21266K34131K53897K71530K85165L03831L29553L53471
58222H596358L74118M01084M35982M69085M99816N40170N92669O46368P00233
58213A3255883P67452Q50643R37734J029145J142543J283141J437999J608385
58205B2312925J817094K074692K372773K721653L157581L699982M342051N097254
58197D7596005O009159P100520Q369372R861004J1687910J3954863J6728496K0093363
$$ plain form
58189 141400692 165523632 194242834 227781042 265815959 307113114 348791560 385820689
58182 385820689 411911721 422003848 414743556 392959714 361888357 326809522 291718462
58175 291718462 259147284 230337119 205369857 183483970 163678606 145273523 128089503
58168 128089503 112280502 98068691 85566716 74734410 65432754 57494098 50747573
58161 50747573 45015575 40127485 35943810 32354094 29258015 26566420 24215483 22160652
58153 22160652 20357630 18762551 17345019 16084114 14954027 13927791 12991501 12140290
58145 12140290 11362937 10644058 9978448 9369263 8813677 8302875 7834051 7409545 7025113
58136 7025113 6670914 6343403 6045248 5774101 5521746 5283607 5059396 4845373 4635822
$$ packed form
58189A41400692K4122940K8719202L3538208L8034917M1297155M1678446L7029129
58182C85820689K6091032J0092127p260292k1783842l1071357l5078835l5091060
58175B91718462l2571178k8810165k4967262k1885887j9805364j8405083j7184020
58168A28089503j5809001j4211811j2501975j0832306r301656p938656o746525
58161E0747573n731998m888090m183675l589716l096079k691595k350937k054831
58153B2160652j803022j595079j417532j260905j130087j026236r36290q51211
58145A2140290p77353p18879o65610o09185n55586n10802m68824m24506l84432
58136G025113l54199l27511k98155k71147k52355k38139k24211k14023k09551
$$ plain form
58127 4635822 4431763 4239217 4059413 3888995 3728505 3581629 3446842 3318487 3195643
58118 3195643 3081763 2976278 2874826 2777320 2687668 2605681 2526942 2450541 2379441 2313365 2248723
58107 2248723 2185573 2127437 2074089 2021522 1969265 1920850 1876653 1832882 1788176 1744990 1704007
58096 1704007 1663265 1623213 1586628 1553011 1518789 1483572 1450628 1420817 1391609 1362544 1336202
58085 1336202 1313210 1291432 1270484 1251897 1234509 1214940 1193084 1172080 1152485 1131653 1109312
58074 1109312 1088457 1069962 1051343 1031776 1013434 996944 980226 962862 947058 933268 919273
58063 919273 904627 891759 881642 872413 863226 855485 849342 842810 835175 827533 819431 808885 796354
58050 796354 784769 774965 765024 754676 746191 740108 734206 727652 722166 718079 713266 707097 701585 697412
$$ packed form
58127D635822k04059j92546j79804j70418j60490j46876j34787j28355j22844
58118C195643j13880j05485j01452r7506q9652q1987p8739p6401p1100o6076o4642
58107B248723o3150n8136n3348n2567n2257m8415m4197m3771m4706m3186m0983
58096A704007m0742m0052l6585l3617l4222l5217l2944k9811k9208k9065k6342
58085A336202k2992k1778k0948j8587j7388j9569k1856k1004j9595k0832k2341
58074A109312k0855j8495j8619j9567j8342j6490j6718j7364j5804j3790j3995
58063I19273j4646j2868j0117r229r187p741o143o532p635p642q102j0546j2531
58050G96354j1585r804r941j0348q485o083n902o554n486m087m813o169n512m173
$$ plain form
58036 697412 692651 686612 681111 676601 670820 662807 654665 647720 640273 630739 619936 608751 596625
58023 596625 583799 572168 562502 553563 545028 538309 533436 528256 522001 516633 513366 510837 508000 505736
58009 505736 504265 502026 498659 496177 495572 495087 493425 491848 491369 490598 488341 485955 485272 486168 487717 489690
57993 489690 491556 492082 491332 491100 492259 493705 494742 496090 497511 497103 494295 491094 488999 487092 484519
57978 484519 482313 481155 479685 476808 473575 471180 469134 466915 465394 465054 464754 463741 462954 462931 462485 460942
57962 460942 459681 459882 460611 460682 460569 460974 461322 461177 461399 462457 463327 463402 463700 464853 465811 465917 466306 467830
57944 467830 469640 471346 474452 479879 486051 491348 496566 502961 509661 515231 520302 526466 533749 541185
57930 541185 548752 556800 564505 570727 575501 579162 580963 580121 577257 573313 568022 560868 552519 543876
$$ packed form
58036F97412m761o039n501m510n781q013q142o945p447r534j0803j1185j2126
58023E96625j2826j1631r666q939q535o719m873n180o255n368l267k529k837k264
58009E05736j471k239l367k482o05m85j662j577m79p71k257k386o83Q96J549J973
57993D89690J866N26p50k32J159J446J037J348J421m08k808l201k095j907k573
57978D84519k206j158j470k877l233k395k046k219j521l40l00j013p87k3m46j543
57962D60942j261K01P29P1j13M05L48j45K22J058Q70P5K98J153R58J06L89J524
57944D67830J810J706L106N427O172N297N218O395O700N570N071O164P283P436
57930E41185P567Q048P705O222M774L661J801q42k864l944n291p154q349q643
$$ plain form
57916 543876 534674 524423 513765 503601 493823 484154 475215 467560 460671 454110 448592 444770 442059
57903 442059 439842 438658 438968 439842 440076 439555 438520 436785 434687 433424 433286 432999 432024 431885 433786 436484
57887 436484 438113 438705 439303 439992 440503 441427 442970 443727 442562 440606 439589 439182 437828 435216 432052 428240
57871 428240 423205 417344 411421 405191 398292 391811 387146 383864 380356 376164 372092 368517 365192 362430
57857 362430 360986 360951 361942 364000 367167 370672 373660 376339 379380 382737 385987 389200 392543 395717 398616
57842 398616 401674 404820 407235 408918 411065 413791 415141 413826 411429 410109 409563 408239 406363 405489 405894
57827 405894 406623 407585 409550 412457 415601 419167 423835 429193 434117 438365 442338 445876 448842 452239 457008
57812 457008 462271 466468 469685 472983 475977 476967 475217 471302 465575 458096 449840 442147 435049 427787
$$ packed form
57916E43876r202j0251j0658j0164r778r669q939p655o889o561n518l822k711
57903D42059k217j184L10Q74K34n21j035j735k098j263j38k87r75j39J901K698
57887D36484J629N92N98O89N11R24J543P57j165j956j017m07j354k612l164l812
57871D28240n035n861n923o230o899o481m665l282l508m192m072l575l325k762
57857C62430j444l5R91K058L167L505K988K679L041L357L250L213L343L174K899
57842C98616L058L146K415J683K147K726J350j315k397j320n46j324j876q74M05
57827D05894P29R62J965K907L144L566M668N358M924M248L973L538K966L397M769
57812D57008N263M197L217L298K994R90j750l915n727p479q256p693p098p262
$$ plain form
57798 427787 420659 414647 409470 403846 397565 391583 386221 381038 376392 373250 371407 369660 367759 366457
57784 366457 365640 364282 362486 361711 362650 364573 367145 371169 377043 384059 391806 400764 410868 420830 429615
57769 429615 437494 445019 451956 457827 462658 466652 469763 471873 472807 472130 469606 465752 461244 456005 449759
57754 449759 443098 436876 430867 424295 417454 411457 406444 401415 395887 390409 385363 380615 376454 373519
57740 373519 371547 369448 366891 364640 363072 361536 359533 357413 355545 353784 352099 350860 350208 349918 350002
57725 350002 350678 351718 352647 353560 354837 356149 356651 356141 355174 354306 354085 355332 358126 360810 361387 359857
57709 359857 357912 356505 355179 353669 352504 351719 350484 348424 346107 343993 342093 340818 340857 341946 343041
57694 343041 343984 345698 348419 351080 352821 353846 354329 353766 352062 350128 348750 347745 346819 346498 347746
$$ packed form
57798D27787p128o012n177n624o281n982n362n183m646l142j843j747j901j302
57784C66457q17j358j796p75R39J923K572M024N874P016P747Q958J0104R962Q785
57769D29615P879P525O937N871M831L994L111K110R34o77k524l854m508n239o246
57754D49759o661o222o009o572o841n997n013n029n528n478n046m748m161k935
57740C73519j972k099k557k251j568j536k003k120j868j761j685j239o52k90Q4
57725C50002O76J040R29R13J277J312N02n10r67q68k21J247K794K684N77j530
57709C59857j945j407j326j510j165p85j235k060k317k114j900j275L9J089J095
57694C43041R43J714K721K661J741J025M83n63j704j934j378j005r26l21J248
$$ plain form
57679 347746 351252 357277 365554 375330 386315 399519 416269 436708 460462 488648 523791 567614
57667 567614 620178 681269 750981 828108 908466 984499 1045596 1080038 1079963 1046338 988337 917388
57655 917388 842344 769326 702902 645509 597026 556396 523110 496581 475264 457416 442089
57644 442089 428896 417656 408641 402192 397679 393791 390141 387358 385352 382983 380033 378012 378104 379559
57630 379559 380995 382097 383118 383773 383744 383417 383198 382782 381832 380649 379436 377720 375190 372483 370494 369519
57614 369519 369486 370251 371221 371519 370927 369943 368782 367317 366073 365914 366446 366212 364947 364075 364355 364716 364390 364454
57596 364454 365962 367932 368686 368085 367060 365881 364382 363011 362228 361395 359663 357462 355956 355378 355021 354465
57580 354465 353837 353211 352670 352564 352960 353252 353037 352792 352987 353195 352879 352391 352251 352123 351484 350758 350713 351107 350899
$$ packed form
57679C47746L506O025Q277R776J0985J3204J6750K0439K3754K8186L5143M3823
57667E67614N2564O1091O9712P7127Q0358P6033O1097L4442p5l3625n8001p0949
57655I17388p5044p3018o6424n7393m8483m0630l3286k6529k1317j7848j5327
57644D42089j3193j1240r015o449m513l888l650k783k006k369k950k021R2J455
57630C79559J436J102J021O55k9l27k19m16r50j183j213j716k530k707j989r75
57614C69519l3P65R70K98n92r84j161j465j244j59N32k34j265q72K80L61l26O4
57596C64454J508J970P54o01j025j179j499j371p83q33j732k201j506n78l57n56
57580C54465o28o26n41j06L96K92k15k45J95K08l16m88j40j28o39p26m5L94k08
$$ plain form
57561 350899 349640 347913 346649 346561 347880 350070 352175 353872 355663 357769 359679 361264 363324 366267 369223
57546 369223 371365 373207 375604 378222 380173 381575 383382 386060 389348 392944 396685 400479 404658 409724
57532 409724 415106 418990 420350 420383 420989 422625 424704 427293 430993 435601 440233 444638 449335 454620 460370
57517 460370 466586 473248 479922 486350 493107 500765 508690 515521 520601 524212 526746 528483 529877 531239
57503 531239 532394 533227 534174 535509 536669 537110 537351 538321 540049 541797 543060 543719 543709 543301 543197 543580 543690
57486 543690 543092 542650 543305 544670 545983 547693 550691 554469 557530 559484 561435 564304 567921 571779 575659
57471 575659 579448 583168 587125 591331 595047 597722 600087 603410 607922 612845 617636 622240 626415 629873
57457 629873 633012 636538 640456 644227 647777 651511 655531 659634 663875 668385 672881 677141 681639 686929
$$ packed form
57561C50899j259j727j264q8J319K190K105J697J791K106J910J585K060K943K956
57546C69223K142J842K397K618J951J402J807K678L288L596L741L794M179N066
57532D09724N382L884J360L3O06J636K079K589L700M608M632M405M697N285N750
57517D60370O216O662O674O428O757P658P925O831N080L611K534J737J394J362
57503E31239J155Q33R47J335J160M41K41R70J728J748J263O59j0m08j04L83J10
57486E43690n98m42O55J365J313J710K998L778L061J954J951K869L617L858L880
57471E75659L789L720L957M206L716K675K365L323M512M923M791M604M175L458
57457F29873L139L526L918L771L550L734M020M103M241M510M496M260M498N290
$$ plain form
57443 686929 692778 698686 704771 711239 717494 722824 727545 732437 737477 742305 747452 753779 760885 767395
57429 767395 772767 777700 782825 788104 793468 799007 804586 810165 816262 823099 829619 834556 838285 842415
57415 842415 847707 853591 859515 865498 871400 876958 882565 888889 895817 902891 910502 919250 928349 936279
57401 936279 943062 950226 958325 966198 973109 979958 987632 995648 1003322 1011061 1019546 1028523 1037298 1045781
57387 1045781 1054380 1063475 1073489 1084752 1096809 1108497 1119159 1129238 1139412 1149864 1160639 1171980
57375 1171980 1183867 1195872 1207764 1219669 1231410 1242375 1252292 1261556 1270630 1279819 1289696 1300890
57363 1300890 1313186 1325632 1337784 1350151 1363113 1376174 1388607 1400317 1411846 1424020 1437606
57352 1437606 1452680 1468279 1483352 1497993 1513037 1528577 1543876 1558676 1573540 1588697 1603635
$$ packed form
57443F86929N849N908O085O468O255N330M721M892N040M828N147O327P106O510
57429G67395N372M933N125N279N364N539N579N579O097O837O520M937L729M130
57415H42415N292N884N924N983N902N558N607O324O928P074P611Q748R099P930
57401I36279O783P164Q099P873O911O849P674Q016P674P739Q485Q977Q775Q483
57387A045781Q599R095J0014J1263J2057J1688J0662J0079J0174J0452J0775J1341
57375A171980J1887J2005J1892J1905J1741J0965R917R264R074R189R877J1194
57363A300890J2296J2446J2152J2367J2962J3061J2433J1710J1529J2174J3586
57352A437606J5074J5599J5073J4641J5044J5540J5299J4800J4864J5157J4938
$$ plain form
57341 1603635 1618119 1632672 1647725 1663108 1678670 1694613 1710948 1727337 1743669 1760036 1776120
57330 1776120 1791510 1806715 1822853 1840112 1857486 1874296 1890990 1908162 1925723 1943416 1961218
57319 1961218 1978934 1996259 2013559 2031693 2050738 2069786 2088291 2106733 2125637 2144913 2164476
57308 2164476 2184540 2204881 2224722 2243800 2262677 2281720 2300753 2320065 2340595 2362527 2384708
57297 2384708 2406081 2426831 2447616 2468626 2490038 2512454 2536085 2560246 2584324 2608535 2633068
57286 2633068 2657232 2680222 2702169 2723753 2745237 2766452 2787273 2807674 2827727 2847859 2868604
57275 2868604 2889910 2911369 2933294 2956634 2981444 3006410 3030402 3053776 3077614 3102437 3128147
57264 3128147 3154449 3180845 3206917 3233059 3260167 3288221 3316085 3343176 3370278 3398060 3425779
$$ packed form
57341A603635J4484J4553J5053J5383J5562J5943J6335J6389J6332J6367J6084
57330A776120J5390J5205J6138J7259J7374J6810J6694J7172J7561J7693J7802
57319A961218J7716J7325J7300J8134J9045J9048J8505J8442J8904J9276J9563
57308B164476K0064K0341J9841J9078J8877J9043J9033J9312K0530K1932K2181
57297B384708K1373K0750K0785K1010K1412K2416K3631K4161K4078K4211K4533
57286B633068K4164K2990K1947K1584K1484K1215K0821K0401K0053K0132K0745
57275B868604K1306K1459K1925K3340K4810K4966K3992K3374K3838K4823K5710
57264C128147K6302K6396K6072K6142K7108K8054K7864K7091K7102K7782K7719
$$ plain form
57253 3425779 3452394 3478224 3504532 3531945 3560061 3588203 3615929 3643130 3670163 3697566 3725350
57242 3725350 3753048 3780569 3808268 3835952 3862771 3888509 3914008 3939766 3965063 3989110 4012213
57231 4012213 4035059 4057631 4079533 4100651 4120813 4139590 4157208 4174966 4193949 4213891 4233965
57220 4233965 4253995 4274210 4294511 4314800 4335470 4356781 4378307 4399634 4421031 4442711 4464078
57209 4464078 4484507 4504364 4524462 4544941 4565312 4585172 4604256 4622296 4639407 4656130 4672549
57198 4672549 4687913 4701587 4713763 4724761 4734422 4742748 4750335 4757493 4763790 4769166 4774663 4781106 4787846
57185 4787846 4793692 4798433 4802518 4805912 4808359 4810285 4812416 4814858 4817392 4820276 4823871 4827814 4831403 4834462
57171 4834462 4837243 4839880 4842606 4845900 4849669 4852907 4854995 4856816 4859661 4863461 4866981 4869343 4870425 4870156
$$ packed form
57253C425779K6615K5830K6308K7413K8116K8142K7726K7201K7033K7403K7784
57242C725350K7698K7521K7699K7684K6819K5738K5499K5758K5297K4047K3103
57231D012213K2846K2572K1902K1118K0162J8777J7618J7758J8983J9942K0074
57220D233965K0030K0215K0301K0289K0670K1311K1526K1327K1397K1680K1367
57209D464078K0429J9857K0098K0479K0371J9860J9084J8040J7111J6723J6419
57198D672549J5364J3674J2176J0998R661Q326P587P158O297N376N497O443O740
57185D787846N846M741M085L394K447J926K131K442K534K884L595L943L589L059
57171D834462K781K637K726L294L769L238K088J821K845L800L520K362J082k69
$$ plain form
57157 4870156 4868381 4865287 4861217 4856224 4850249 4843307 4834927 4823966 4809704 4792658 4773725 4753061 4730494
57144 4730494 4706401 4681366 4655530 4629132 4603231 4579126 4557523 4538968 4524498 4514975 4510330 4510135
57132 4510135 4514308 4522400 4532862 4544096 4555749 4568108 4580806 4593127 4605097 4617351 4630417 4645127
57120 4645127 4663229 4686531 4715900 4752024 4796586 4851572 4917756 4994906 5083071 5182797 5294688
57109 5294688 5420066 5561852 5723947 5910303 6125694 6376924 6672058 7019017 7426455
57100 7426455 7906195 8474125 9149412 9954283 10914350 12057510 13411808 15004355 16861256
57091 16861256 19006757 21461819 24243084 27360894 30814909 34589497 38651803 42950865
57083 42950865 47413661 51937910 56385533 60580728 64316783 67376608 69566197 70748525
$$ packed form
57157D870156j775l094m070m993n975o942q380j0961j4262j7046j8933k0664k2567
57144D730494k4093k5035k5836k6398k5901k4105k1603j8555j4470r523m645j95
57132D510135M173Q092J0462J1234J1653J2359J2698J2321J1970J2254J3066J4710
57120D645127J8102K3302K9369L6124M4562N4986O6184P7150Q8165R9726J11891
57109E294688J25378J41786J62095J86356K15391K51230K95134L46959M07438
57100G426455M79740N67930O75287Q04871R60067J143160J354298J592547J856901
57091A6861256K145501K455062K781265L117810L454015L774588M062306M299062
57083D2950865M462796M524249M447623M195195L736055L059825K189589J182328
$$ plain form
57075 70748525 70862082 69920054 67999118 65226193 61763486 57790580 53486988 49019498
57067 49019498 44534682 40155121 35978713 32079842 28509897 25296717 22445537 19943052
57059 19943052 17763235 15872992 14237199 12822463 11598659 10538787 9618939 8818543
57051 8818543 8119774 7506670 6965465 6485476 6058638 5678098 5337961 5033782 4761731
57042 4761731 4517019 4294295 4089679 3901241 3727283 3565380 3413445 3270577 3136327
57033 3136327 3010071 2891545 2781183 2679493 2586716 2503324 2430107 2367636 2316386 2277417
57023 2277417 2251929 2240033 2241115 2255633 2284766 2326108 2369086 2395408 2385880 2329611 2229396
57012 2229396 2099276 1956296 1813227 1677152 1551947 1439791 1340799 1253328 1175522 1106096
$$ packed form
57075G0748525J13557r42028j920936k772925l462707l972906m303592m467490
57067D9019498m484816m379561m176408l898871l569945l213180k851180k502485
57059A9943052k179817j890243j635793j414736j223804j059872r19848q00396
57051H818543o98769o13104n41205m79989m26838l80540l40137l04179k72051
57042D761731k44712k22724k04616j88438j73958j61903j51935j42868j34250
57033C136327j26256j18526j10362j01690r2777q3392p3217o2471n1250l8969
57023B277417k5488j1896J082J4518K9133M1342M2978K6322r528n6269j00215
57012B229396j30120j42980j43069j36075j25205j12156r8992q7471p7806o9426
$$ plain form
57002 1106096 1043988 988379 939016 895439 856079 819268 785036 754614 728132 704072 681169
56991 681169 659567 639811 621880 605659 591464 579730 570866 565409 563507 564163 565717 566828 566119
56978 566119 561382 550592 533749 512608 488860 463824 439423 417529 398184 380197 363707 350416
56966 350416 340982 334027 328322 324314 322791 323658 326900 333343 343565 357185 373804 393134 413162
56953 413162 429469 437636 435852 424853 406620 383930 359920 336781 315294 295989 279807 267080
56941 267080 256967 248731 242735 239588 239232 241545 246981 256041 268957 286266 308563 335071 363345
56928 363345 390633 414273 430514 435026 426066 406184 379839 350306 319608 289790 262548 238313
56916 238313 217010 199141 184996 173538 163251 153749 145569 138856 133133 127961 123122 118593 114937
$$ packed form
57002A106096o2108n5609m9363m3577l9360l6811l4232l0422k6482k4060k2903
56991F81169k1602j9756j7931j6221j4195j1734q864n457j902O56J554J111p09
56978E66119m737j0790j6843k1141k3748k5036k4401k1894j9345j7987j6490j3291
56966C50416r434o955n705m008j523Q67L242O443J0222J3620J6619J9330K0028
56953D13162J6307Q167j784j0999j8233k2690k4010k3139k1487j9305j6182j2727
56941B67080j0113q236n996l147l56K313N436R060J2916J7309K2297K6508K8274
56928C63345K7288K3640J6241M512q960j9882k6345k9533l0698k9818k7242k4235
56916B38313k1303j7869j4145j1458j0287r502q180o713n723n172m839m529l656
$$ plain form
56903 114937 113086 113121 113895 114444 115039 116293 118079 120049 122381 125207 128151 131210 135366 141502 149453
56888 149453 158893 170395 184792 202114 221690 242219 260927 273845 278390 275247 266931 255312
56876 255312 241537 227286 214477 203970 195805 190441 188671 190489 195033 201668 210546 222454 238765
56863 238765 261125 290388 326115 367572 414588 466534 520557 571288 612062 636590 641038 625995
56851 625995 596383 558714 518416 479425 444712 415945 393284 376595 366563 363992 368717 380085
56839 380085 398040 423103 455954 497780 550266 614316 689092 772494 860959 947234 1019359
56828 1019359 1064312 1074128 1049073 996157 925594 847597 770096 697908 633571 578502 533248
56817 533248 497527 470893 453147 443774 441756 446591 458979 479977 510048 549387 598208 655607
$$ packed form
56903A14937j851L5P74N49N95J254J786J970K332K826K944L059M156O136P951
56888A49453R440J1502J4397J7322J9576K0529J8708J2918M545l143q316j1619
56876B55312j3775j4251j2809j0507q165n364j770J818M544O635Q878J1908J6311
56863B38765K2360K9263L5727M1457M7016N1946N4023N0731M0774K4528M448j5043
56851F25995k9612l7669m0298l8991l4713k8767k2661j6689j0032k571M725J1368
56839C80085J7955K5063L2851M1826N2486O4050P4776Q3402Q8465Q6275P2125
56828A019359M4953R816k5055n2916p0563p7997p7501p2188o4337n5069m5254
56817E33248l5721k6634j7746r373k018M835J2388K0998L0071L9339M8821N7399
$$ plain form
56805 655607 718222 780056 832951 867586 876328 857189 814941 757891 693984 629629 569742 516843
56793 516843 470827 430961 397591 371136 350678 334947 323960 318449 318501 324063 335881 354523
56781 354523 379048 407827 439675 472540 501748 521375 527411 518816 496540 463294 423747 382913
56769 382913 343886 307801 275380 247204 222974 202000 184233 169697 157423 146320 136621 129075
56757 129075 123154 117532 111981 107245 103335 99525 95867 93079 90985 88589 85725 83166 81087 78884
56743 78884 76613 75173 74763 74454 73607 72612 72020 71927 72314 73030 73377 72739 71655 71292 71870 72558 72837 72898 72828
56724 72828 72541 72506 73479 75458 77814 80337 83116 85568 86793 86910 86926 87299 87704 88226 89580 91966 94706
56707 94706 97208 99468 101520 103275 104956 106940 109119 111022 112453 113437 113853 113776 113720 113906 113818 113227 112849
$$ packed form
56805F55607O2615O1834N2895L4635Q742j9139m2248n7050o3907o4355n9887n2899
56793E16843m6016l9866l3370k6455k0458j5731j0987n511N2N562J1818J8642
56781C54523K4525K8779L1848L2865K9208J9627O036q595k2276l3246l9547m0834
56769C82913l9027l6085l2421k8176k4230k0974j7767j4536j2274j1103r699p546
56757A29075n921n622n551m736l910l810l658k788k094k396k864k559k079k203
56743G8884k271j440m10l09q47r95n92r3L87P16L47o38j084l63N78O88K79O1p0
56724G2828k87l5R73J979K356K523K779K452J225J17J6L73M05N22J354K386K740
56707I4706K502K260K052J755J681J984K179J903J431R84M16p7n6J86q8n91l78
$$ plain form
56690 112849 113103 113144 112292 111453 111657 112107 111387 109872 109017 108753 107688 105662 104082 103630 103592 103606 104272 105713
56672 105713 107175 108400 109870 111493 112523 113049 114084 115975 118247 121136 125612 131471 136958 140820
56658 140820 143456 145720 147905 150265 153136 156164 158609 160659 163199 166214 168785 170762 172859 174912
56644 174912 175733 175039 173889 172733 170720 167526 164220 161553 158892 155672 152560 150286 148482 146454 144128
56629 144128 141575 138700 135993 134522 134524 134924 134761 134200 133763 133564 133670 134160 134513 133930 132524 131120 129752
56612 129752 127660 124941 122752 121514 120379 118887 117707 117158 116469 115171 113918 113230 112668 111987 111873 112788
56596 112788 114130 115190 115972 116602 116939 117244 118130 119467 120476 121206 122578 124613 126041 126178 125790 125551
56580 125551 125128 124478 124536 125767 127356 128659 130262 132763 135705 138470 141085 143402 144737 145164 146079 148657
$$ packed form
56690A12849K54M1q52q39K04M50p20j515q55k64j065k026j580m52l8J4O66J441
56672A05713J462J225J470J623J030N26J035J891K272K889M476N859N487L862
56658A40820K636K264K185K360K871L028K445K050K540L015K571J977K097K053
56644A74912Q21o94j150j156k013l194l306k667k661l220l112k274j804k028k326
56629A44128k553k875k707j471KM00j63n61m37j99J06M90L53n83j406j404j368
56612A29752k092k719k189j238j135j492j180n49o89j298j253o88n62o81j14R15
56596A12788J342J060P82O30L37L05Q86J337J009P30J372K035J428J37l88k39
56580A25551m23o50N8J231J589J303J603K501K942K765K615K317J335M27R15K578
$$ plain form
56564 148657 152656 157308 162354 167667 173069 179072 186667 195837 205472 215101 225223 235455 243970 249593
56550 249593 252993 255122 256038 256083 256588 258269 260275 261717 262802 263633 263471 262176 260887 260195 259109 256878
56534 256878 254263 251855 248781 244468 240144 237041 234487 231372 228192 225902 223844 220647 216363 212121
56520 212121 208334 204719 201368 198355 194924 190428 185535 181327 177829 174525 171624 169612 168143 166518
56506 166518 164687 162909 161085 159300 158178 157825 157354 156335 155591 155597 155284 153746 151977 151507 152163 152677 152709
56489 152709 152886 153480 154359 155646 157208 158176 158114 157948 158586 159400 159343 158801 158933 159822 160681 161427 162718 164704
56471 164704 166858 168812 170469 171691 172656 174013 175926 177598 178472 179157 180378 181809 182789 183393 183951 184322
56455 184322 184442 184743 185309 185624 185826 186911 188829 189788 188684 186911 186424 187194 188002 188667 189856 191538 193117
$$ packed form
56564A48657L999M652N046N313N402O003P595R170R635R629J0122J0232Q515N623
56550B49593L400K129R16M5N05J681K006J442J085Q31j62j295j289o92j086k231
56534B56878k615k408l074m313m324l103k554l115l180k290k058l197m284m242
56520B12121l787l615l351l013l431m496m893m208l498l304k901k012j469j625
56506A66518j831j778j824j785j122l53m71j019p44Ol13j538j769m70O56N14L2
56489A52709J77N94Q79J287J562R68o2j66O38Q14n7n42J32Q89Q59P46J291J986
56471A64704K154J954J657J222R65J357J913J672Q74O85J221J431R80O04N58L71
56455A84322J20L01N66L15K02J085J918R59j104j773m87P70Q08O65J189J682J579
$$ plain form
56438 193117 194454 195548 195925 195505 195244 195784 196433 196560 196909 198259 199876 200658 200816 201066 201172 200717 200278
56421 200278 200392 200382 199667 199237 200274 202235 203809 204805 205571 205625 204582 203527 203686 204467 204454 203529 202488 201397
56403 201397 200044 199194 199678 200859 201608 202099 203136 204510 205603 206768 208504 210056 210429 210021 209752 209555
56387 209555 209284 210011 212618 216068 218828 220981 223182 224739 224855 224617 225501 226817 226981 226383 226531 227057
56371 227057 226226 224034 222352 222181 222972 224381 226474 228392 229024 228940 229703 231456 233028 234073 235143 236037
56355 236037 236100 235901 236650 238224 239623 240839 242362 243440 243023 241903 241726 242392 242672 242832 244157 246305
56339 246305 247640 247981 248517 249226 249003 248221 248528 250032 251247 251972 253654 256615 259504 261881 264905 268942
56323 268942 272792 275889 279105 282789 286017 288338 290428 292567 294246 295573 297282 299139 300152 300506
$$ packed form
56438A93117J337J094L77m20k61N40O49J27L49J350J617P82J58K50J06m55m39
56421B00278J14j0p15m30J037J961J574R96P66N4j043j055J59P81j3r25j041j091
56403B01397j353q50M84J181P49M91J037J374J093J165J736J552L73m08k69j97
56387B09555k71P27K607L450K760K153K201J557J16k38Q84J316J64n98J48N26
56371B27057q31k192j682j71P91J409K093J918O32q4P63J753J572J045J070Q94
56355B36037O3j99P49J574J399J216J523J078m17j120j77O66K80J60J325K148
56339B46305J335L41N36P09k23p82L07J504J215P25J682K961K889K377L024M037
56323B68942L850L097L216L684L228K321K090K139J679J327J709J857J013L54
$$ plain form
56309 300506 301436 303101 304544 305795 307994 311261 314382 316798 319018 321123 322806 324888 328687 333854
56295 333854 338815 343248 347992 352702 355995 357945 360043 362640 364766 366515 369118 372576 375790 379162
56281 379162 384402 391435 398208 403992 410243 417709 425366 432857 441327 450994 460393 468884 477668 487619
56267 487619 498371 510120 523898 539323 554582 569416 585766 604687 625087 646456 670393
56256 670393 698296 729734 764246 802700 845860 893556 946240 1005571 1072645 1147326 1229890
56245 1229890 1321372 1421734 1529566 1643993 1764817 1890427 2017805 2144955 2271073 2393811
56235 2393811 2508788 2612269 2702049 2775410 2828938 2861014 2872005 2861593 2828751 2775046 2705089
56224 2705089 2622753 2529556 2427420 2319964 2209876 2097827 1985202 1875183 1769839 1668737
$$ packed form
56309C00506R30J665J443J251K199L267L121K416K220K105J683K082L799N167
56295C33854M961M433M744M710L293J950K098K597K126J749K603L458L214L372
56281C79162N240P033O773N784O251P466P657P491Q470R667R399Q491Q784R951
56267D87619J0752J1749J3778J5425J5259J4834J6350J8921K0400K1369K3937
56256F70393K7903L1438L4512L8454M3160M7696N2684N9331O7074P4681Q2564
56245A229890R1482J00362J07832J14427J20824J25610J27378J27150J26118J22738
56235B393811J14977J03481Q9780P3361N3528L2076J0991j0412l2842n3705o9957
56224B705089q2336r3197j02136j07456j10088j12049j12625j10019j05344j01102
$$ plain form
56214 1668737 1571702 1480443 1396192 1318222 1245978 1180277 1121193 1067125 1017122 971831 931191
56203 931191 893697 858925 828153 801445 776780 753162 731884 713590 696939 681383 668319
56192 668319 658089 648618 638489 628666 619817 610887 601806 594697 590653 587953 585073 582731 581431 579854
56178 579854 577457 575872 575918 575988 575157 575146 577244 579939 581563 582755 584397 585641 585989 586983 589962 594250
56162 594250 599021 604555 610339 614716 617883 622505 629841 638133 646198 655335 666070 676494 685864 696551
56148 696551 710210 725272 740408 757260 777359 799636 823538 851537 885893 925782 970160
56137 970160 1020582 1078686 1143830 1215762 1296593 1387238 1484340 1583016 1679900 1771396 1852506
56126 1852506 1920576 1977777 2027535 2071206 2110181 2147361 2183357 2214156 2235389 2246230 2247039 2237124
$$ packed form
56214A668737r7035r1259q4251p7970p2244o5701n9084n4068n0003m5291m0640
56203I31191l7494l4772l0772k6708k4665k3618k1278j8294j6651j5556j3064
56192F68319j0230r471j0129r823q849q930r081p109m044k700k880k342j300j577
56178E79854k397j585M6P0q31j1K098K695J624J192J642J244L48R94K979M288
56162E94250M771N534N784M377L167M622P336Q292Q065R137J0735J0424R370J0687
56148F96551J3659J5062J5136J6852K0099K2277K3902K7999L4356L9889M4378
56137I70160N0422N8104O5144P1932Q0831R0645R7102R8676R6884R1496Q1110
56126A852506O8070N7201M9758M3671L8975L7180L5996L0799K1233J0841Q09r915
$$ plain form
56114 2237124 2217894 2194504 2170695 2144673 2112701 2073196 2024433 1962460 1885674 1798647 1707939
56103 1707939 1617070 1528747 1448092 1379176 1321038 1270942 1228954 1195854 1169642 1147958 1131220
56092 1131220 1119853 1111388 1103897 1099204 1099022 1100983 1102134 1103198 1105758 1108551 1110290 1112766 1117379 1122080
56078 1122080 1125555 1130619 1139454 1149451 1158088 1167789 1181213 1195782 1207966 1219252 1232666 1247163
56066 1247163 1260772 1275629 1294242 1314193 1332170 1350005 1371088 1394015 1415465 1436255 1458848
56055 1458848 1481911 1502984 1523548 1545857 1567887 1586961 1605119 1625314 1645837 1664234 1683069
56044 1683069 1705661 1729845 1752245 1775070 1802179 1832131 1861731 1892695 1927833 1964372 1998249
56033 1998249 2031565 2068683 2108573 2148189 2189511 2235652 2283890 2330372 2377897 2431055 2487562
$$ packed form
56114B237124j9230k3390k3809k6022l1972l9505m8763o1973p6786q7027r0708
56103A707939r0869q8323q0655o8916n8138n0096m1988l3100k6212k1684j6738
56092A131220j1367q465p491m693j82J961J151J064K560K793J739K476M613M701
56078A122080L475N064Q835R997Q637R701J3424J4569J2184J1286J3414J4497
56066A247163J3609J4857J8613J9951J7977J7835K1083K2927K1450K0790K2593
56055A458848K3063K1073K0564K2309K2030J9074J8158K0195K0523J8397J8835
56044A683069K2592K4184K2400K2825K7109K9952K9600L0964L5138L6539L3877
56033A998249L3316L7118L9890L9616M1322M6141M8238M6482M7525N3158N6507
$$ plain form
56022 2487562 2542656 2598065 2658010 2720341 2780625 2841184 2906855 2975590 3042651 3110390 3184211
56011 3184211 3262575 3340843 3421258 3509059 3602539 3697262 3796088 3904320 4019022 4134336 4253255
56000 4253255 4382619 4520653 4661452 4807625 4965937 5134680 5308257 5489912 5686392
55991 5686392 5894457 6106958 6328078 6567841 6825868 7095892 7381898 7693655 8030552
55982 8030552 8386553 8766710 9181417 9629092 10103152 10611494 11169786 11780506 12439254
55973 12439254 13156785 13953044 14834842 15803000 16876410 18084445 19441717 20957770 22666668
55964 22666668 24619538 26856253 29418179 32384065 35860663 39947335 44749645 50420211
55956 50420211 57144726 65102706 74502051 85655971 98984132 114963379 134145752
$$ packed form
56022B487562N5094N5409N9945O2331O0284O0559O5671O8735O7061O7739P3821
56011C184211P8364P8268Q0415Q7801R3480R4723R8826J08232J14702J15314J18919
56000D253255J29364J38034J40799J46173J58312J68743J73577J81655J96480
55991E686392K08065K12501K21120K39763K58027K70024K86006L11757L36897
55982H030552L56001L80157M14707M47675M74060N08342N58292O10720O58748
55973A2439254P17531P96259Q81798R68158J073410J208035J357272J516053J708898
55964B2666668J952870K236715K561926K965886L476598M086672M802310N670566
55956E0420211O724515P957980R399345J1153920J3328161J5979247J9182373
$$ plain form
55949 134145752 157182542 184682276 216955451 253818536 294289376 335866814 373839040
55942 373839040 401848208 414218246 408664668 387241561 354899865 317094116 278184609
55935 278184609 241058609 207345405 177714845 152202924 130536855 112320588 97080586
55928 97080586 84316647 73590201 64553199 56908210 50394393 44814772 40029981 35913921
55920 35913921 32343736 29228851 26511916 24135808 22037522 20174274 18525591 17065936
55912 17065936 15759615 14583535 13530327 12586606 11729853 10948101 10241615 9603296 9016681
55903 9016681 8474292 7979189 7527204 7105605 6710538 6348419 6018530 5710513 5420435
55894 5420435 5153526 4909446 4680049 4463400 4265448 4085956 3916620 3754947 3606732
$$ packed form
55949A34145752K3036790K7499734L2273175L6863085M0470840M1577438L7972226
55942C73839040K8009168J2370038n553578k1423107l2341696l7805749l8909507
55935B78184609l7126000l3713204k9630560k5511921k1666069j8216267j5240002
55928I7080586j2763939j0726446r037002p644989o513817n579621m784791m116060
55920C5913921l570185l114885k716935k376108k098286j863248j648683j459655
55912A7065936j306321j176080j053208r43721q56753p81752p06486o38319n86615
55903I016681n42389m95103m51985m21599l95067l62119l29889l08017k90078
55894E420435k66909k44080k29397k16649j97952j79492j69336j61673j48215
$$ plain form
55885 3606732 3473021 3347492 3228690 3122362 3029587 2944373 2865048 2796654 2740043 2689445
55875 2689445 2642485 2601724 2564352 2521071 2467666 2408007 2343794 2271246 2190161 2106761 2025036
55864 2025036 1943870 1864470 1791822 1726764 1664968 1605594 1552760 1506957 1463331 1420184 1381011
55853 1381011 1346404 1312070 1276723 1243977 1214559 1184424 1152511 1122646 1095736 1067690 1037267
55842 1037267 1008580 983522 958857 933139 909516 889289 869426 848855 830637 815599 800295
55831 800295 783620 769092 758149 747453 735222 724129 715471 706536 696279 687633 681472 674030
55819 674030 663128 651566 641629 631546 620033 609184 600081 590485 579526 569921 563087 556805 550076
55806 550076 545426 543928 542829 540707 540219 543111 547161 550854 556543 565912 576472 585437 593179 600168
$$ packed form
55885C606732j33711j25529j18802j06328r2775q5214p9325o8394n6611n0598
55875B689445m6960m0761l7372m3281n3405n9659o4213p2548q1085q3400q1725
55864B025036q1166p9400p2648o5058o1796n9374n2834m5803m3626m3147l9173
55853A381011l4607l4334l5347l2746k9418l0135l1913k9865k6910k8046l0423
55842A037267k8687k5058k4665k5718k3623k0227j9863k0571j8218j5038j5304
55831H00295j6675j4528j0943j0696j2231j1093q658q935j0257q646o161p442
55819F74030j0902j1562r937j0083j1513j0849r103r596j0959r605o834o282o729
55806E50076m650j498j099k122m88K892M050L693N689R369J0560Q965P742O989
$$ plain form
55792 600168 604451 604995 603833 602237 598242 590429 580613 570470 559157 546727 536159 529323 524106
55779 524106 517960 511064 503859 494909 483646 472150 462067 453010 445855 443918 448545 457036 467199
55766 467199 480171 496038 510206 517340 516221 508301 494679 477323 460187 445779 432665 418845
55754 418845 405241 393537 383140 372827 363079 354423 345721 336375 327932 321377 315151 307979 301204
55741 301204 296167 291718 286651 282163 279603 278020 276293 275444 276459 277892 277921 276771 275011 271657 266251
55726 266251 260734 256847 253534 249107 244062 239562 235056 229751 224670 221010 218059 214869 212374 211790
55712 211790 212570 213954 216893 222398 229466 236601 243848 251503 258392 263248 266188 267174 264846 258747 250910
55697 250910 243322 235597 227043 219055 213203 208633 203689 198707 195002 192478 190337 188853 188432 188220 187626
$$ packed form
55792F00168M283N44j162j596l995p813r816j0143j1313j2430j0568o836n217
55779E24106o146o896p205q950j1263j1496j0083r057p155j937M627Q491J0163
55766D67199J2972J5867J4168P134j119p920j3622j7356j7136j4408j3114j3820
55754D18845j3604j1704j0397j0313r748q656q702r346q443o555o226p172o775
55741C01204n037m449n067m488k560j583j727q49J015J433K9j150j760l354n406
55726B66251n517l887l313m427n045m500m506n305n081l660k951l190k495n84
55712B11790P80J384K939N505P068P135P247P655O889M856K940R86k328o099p837
55697B50910p588p725q554p988n852m570m944m982l705k524k141j484m21k12n94
$$ plain form
55682 187626 187868 190070 193135 195520 197733 201068 205124 208693 211912 215430 218476 219784 219550 218662 216974
55667 216974 214138 211158 209256 208014 206337 204344 202777 201546 200488 200505 202296 204895 207030 208939 211400
55652 211400 214072 216381 218918 222324 225813 228384 230438 232655 234360 234602 233770 232514 230116 225650 219829
55637 219829 214051 208431 202267 195611 188995 182458 176127 170769 166575 162523 158082 154239 151602 149059
55623 149059 145790 143000 141939 141706 140869 139825 139513 139182 137577 135316 133936 133445 132794 131924 131453 131143
55607 131143 130481 129972 130131 130056 128753 126905 125637 124551 122836 121220 120815 120967 120350 119284 118905 118848 117927
55590 117927 116440 115655 115551 115194 114777 115239 116303 116926 117241 118081 119072 119257 119218 120422 122704 124383 124781
55573 124781 124771 125059 125768 127587 131334 136363 141081 145099 149342 154186 159044 163622 167950 171330 172870
$$ packed form
55682A87626K42K202L065K385K213L335M056L569L219L518L046J308k34q88j688
55667B16974k836k980j902j242j677j993j567j231j058J7J791K599K135J909K461
55652B11400K672K309K537L406L489K571K054K217J705K42q32j256k398m466n821
55637B19829n778n620o164o656o616o537o331n358m194m052m441l843k637k543
55623A49059l269k790j061k33q37j044l12l31j605k261j380m91o51q70m71l10
55607A31143o62n09J59p5j303j848j268j086j715j616m05J52o17j066l79n7r21
55590A17927j487p85j04l57m17M62J064O23L15Q40R91J85l9J204K282J679L98
55573A24781j0K88P09J819L747N029M718M018M243M844M858M578M328L380J540
$$ plain form
55558 172870 172947 172614 171684 168953 164271 158884 153817 149239 145222 141781 138394 134768 131698 129868 128421
55543 128421 126229 123947 122989 123038 122537 121359 120864 121389 121708 121168 120531 120430 120649 121220 122640 124671 126314
55526 126314 127247 128080 129034 129644 129768 129620 128790 126578 123283 119919 116743 113338 110032 107737 106390 104949
55510 104949 102962 100834 98625 96017 93469 91939 91338 90614 89457 88619 88494 88622 88651 88557 87942 86415 84647
55493 84647 83805 83953 84199 84300 84773 85581 86101 86327 86752 87179 87051 86803 87351 88353 88521 87649 86751 86221 85519
55474 85519 84702 84556 84952 84798 83884 83269 83457 83752 83732 83820 84056 83811 83133 82891 83156 82942 82008 81427 81848 82572
55454 82572 82955 83334 83958 84329 84260 84375 84925 85240 84999 84922 85629 86739 87616 88020 87696 86434 84944 84570 85619
55435 85619 87023 87989 88884 90037 90918 91080 90889 90744 90483 90042 89773 89758 89733 89919 90830 91975 92027 90740 89547
$$ packed form
55558A72870P7l33r30k731m682n387n067m578m017l441l387l626l070j830j447
55543A28421k192k282r58M9n01j178m95N25L19n40o37j01K19N71J420K031J643
55526A26314R33Q33R54O10J24j48q30k212l295l364l176l405l306k295j347j441
55510A04949j987k128k209k608k548j530o01p24j157q38j25J28K9r4o15j527j768
55493H4647q42J48K46J01M73Q08N20K26M25M27j28k48N48J002J68q72q98n30p02
55474H5519q17j46L96j54r14o15J88K95k0Q8K36k45o78k42K65k14r34n81M21P24
55454H2572L83L79O24L71o9J15N50L15k41p7P07J110Q77M04l24j262j490l74J049
55435H5619J404R66Q95J153Q81J62j91j45k61m41k69j5k5J86R11J145N2j287j193
$$ plain form
55416 89547 89804 91571 94518 98648 103485 107829 111164 114231 117475 120005 120849 120253 118888 116750 113762
55401 113762 110588 107906 105513 102963 100510 98677 97392 96203 94883 93322 91362 89237 87661 86989
55387 86989 86793 86558 86298 86162 86072 86041 86244 86517 86466 86239 86487 87301 87980 88085 87931 87798 87518 87140 87131 87569 87909
55366 87909 87815 87389 86431 84471 81890 79952 79260 79051 78482 77718 77330 77483 78108 79086 79884 79955 79789 80543 82275
55347 82275 83659 83897 83699 83792 83759 83236 83027 83888 85050 85190 84305 83571 83685 84250 84569 84349 83806 83510 83857
55328 83857 84369 83926 82020 79351 77017 75695 75686 76905 78468 79146 78698 78074 77974 78033 77835 77780 78332 79225
55310 79225 80071 81034 82230 83113 83211 82955 83187 84203 85718 87290 88422 88750 88492 88227 88066 87645 87060 86947
55292 86947 87399 87735 87652 87696 88172 88541 88397 88140 88130 88060 87684 87323 87163 86942 86807 87485 88973 90069 89952 89294
$$ packed form
55416H9547K57J767K947M130M837M344L335L067L244K530Q44n96j365k138k988
55401A13762l174k682k393k550k453j833j285j189j320j561j960k125j576o72
55387H6989j96k35k60j36r0l1K03K73n1k27K48Q14O79J05j54j33k80l78rM38L40
55366H7909r4m26r58j960k581j938o92k09n69p64l88J53O25R78P98P1j66P54J732
55347H2275J384K38j98R3l3n23k09Q61J162J40q85p34J14N65L19k20n43k96L47
55328H3857N12m43j906k669k334j322rJ219J563O78m48o24j00N9j98n5N52Q93
55310G9225Q46R63J196Q83R8k56K32J016J515J572J132L28k58k65j61m21n85j13
55292H6947M52L36q3M4M76L69j44k57j0p0l76l61j60k21j35O78J488J096j17o58
$$ plain form
55272 89294 89017 88920 88437 87945 88241 89283 90324 90917 91095 91082 91400 92651 94577 95960 96069 95566 95442 95794
55254 95794 96293 97005 97984 98725 98790 98409 97847 96850 95355 94034 93463 93460 93800 94724 96025 96594 95767 94344 93410
55235 93410 92946 92482 92218 92463 92700 92331 91734 91567 91634 91473 91448 92162 93290 94044 94296 94304 93909 93069 92573 93007
55215 93007 93539 92989 91750 91304 92056 92966 93297 93466 93974 94546 94688 94370 93940 93817 94300 95231 95892 95724 94960
55196 94960 94300 94214 94768 95636 95977 95066 93472 92796 93642 94714 94627 93634 92697 91922 91113 90931 91986 93388
55178 93388 93689 92888 92132 91852 91608 91483 92067 93115 93704 93811 94376 95616 96482 96089 94693 93026 91673
55161 91673 91205 91910 93123 93682 93305 92770 92695 92940 93266 93675 93939 93643 92894 92280 92030 91873 91779 92072 92772
55142 92772 93511 94155 94860 95539 96007 96613 97961 99923 101627 102404 102136 100856 98825 96935 96158 96497 97203
$$ packed form
55272H9294k77r7m83m92K96J042J041N93J78j3L18J251J926J383J09n03j24L52
55254I5794M99P12R79P41O5l81n62r97j495j321n71lL40R24J301N69q27j423r34
55235I3410m64m64k64K45K37l69n97j67O7j61k5P14J128P54K52Ql95q40m96M34
55215I3007N32n50j239m46P52R10L31J69N08N72J42l18m30j23M83R31O61j68p64
55196I4960o60q6N54Q68L41r11j594o76Q46J072q7r93r37p75q09j82J055J402
55178I3388L01q01p56k80k44j25N84J048N89J07N65J240Q66l93j396j667j353
55161I1673m68P05J213N59l77n35p5K45L26M09K64k96p49o14k50j57r4K93P00
55142I2772P39O44P05O79M68O06J348J962J704P77k68j280k031j890p77L39P06
$$ plain form
55125 97203 97932 98873 99828 100175 99922 99810 100121 100152 99205 97507 95893 95051 95181 95954 96724 97187 97648 98266 98468
55106 98468 97830 97163 97751 99687 101883 103552 104732 105452 105547 105311 105316 105466 105201 104753 105153 106775 108902 110875
55088 110875 112649 113967 114183 113446 113007 113695 114854 115424 115314 115065 114747 113937 112434 110473 108446 106782
55072 106782 105888 105888 106604 107847 109440 110952 111831 111827 110997 109424 107425 105829 105314 105492 105327 104451 103398 102547
55054 102547 101686 100764 100318 100836 102247 104158 106059 107255 107268 106418 105519 105004 104909 105457 106759 108049 108219
55037 108219 107258 106197 105623 105251 105106 105868 107569 109077 109491 109157 108720 108064 106922 105739 105112 104843 104304
55020 104304 103417 102696 102621 103368 104880 106823 108736 110410 111800 112605 112478 111701 110970 110401 109529 108441 107988
55003 107988 108508 109277 109701 110180 111162 112158 112477 112342 112508 113233 114248 115294 116055 116065 115370 114915 115562 116978
$$ packed form
55125I7203P29R41R55L47k53j12L11L1r47j698j614q42J30P73P70M63M61O18K02
55106I8468o38o67N88J936K196J669J180P20R5k36NJ50k65m48M00J622K127J973
55088A10875J774J318K16p37m39O88J159N70j10k49l18q10j503j961k027j664
55072A06782q94%P16J243J593J512Q79mq30j573j999j596n15J78j65q76j053q51
55054A02547q61r22m46N18J411J911J901J196J3q50q99n15r5N48J302J290J70
55037A08219r61j061n74l72j45P62J701J508M14l34m37o56j142j183o27k69n39
55020A04304q87p21p5P47J512J943J913J674J390Q05j27p77p31n69q72j088m53
55003A07988N20P69M24M79R82R96L19j35J66P25J015J046P61J0o95m55O47J416
$$ plain form
54985 116978 118101 118429 118239 117781 116927 115666 114399 113610 113426 113502 113298 112628 111948 111795 111990 111861 111275 110814
54967 110814 110766 110664 110174 109819 110303 111627 113313 115012 116405 117026 116792 116442 116886 118241 119873 121140 121767
54950 121767 121810 121637 121731 122151 122410 122151 121704 121684 122282 123206 124133 124942 125655 126260 126490 125889 124489 123250 123221
54931 123221 124247 125226 125744 126635 128579 131004 132898 134131 135361 137125 139559 142690 146510 150993 156309
54916 156309 162672 169768 176808 183376 189684 195702 200616 203506 204008 202005 197416 190780 183419 176460
54902 176460 170153 164443 159470 154971 150046 144377 139064 135457 133630 132716 132173 131839 131299 130262 129339
54887 129339 129457 130589 131901 132989 134190 135770 137688 140126 143421 147338 151131 154497 157929 162022
54873 162022 166958 172718 179251 186258 193213 199672 205179 208892 209861 207872 203680 198241 191954 184747
$$ packed form
54985A16978J123L28j90m58q54j261j267p89j84P6k04o70o80j53J95j29n86m61
54967A10814m8j02m90l55M84J324J686J699J393O21k34l50M44J355J632J267O27
54950A21767M3j73R4M20K59k59m47k0N98R24R27Q09P13O05K30o01j400j239k9
54931A23221J026R79N18Q91J944K425J894J233J230J764K434L131L820M483N316
54916A56309O363P096P040O568O308O018M914K890N02k003m589o636p361o959
54902A76460o307n710m973m499m925n669n313l607j827r14n43l34n40j037r23
54887A29339J18J132J312J088J201J580J918K438L295L917L793L366L432M093
54873A62022M936N760O533P007O955O459N507L713R69j989m192n439o287p207
$$ plain form
54859 184747 176739 168682 161731 156590 152844 149363 145523 141770 138811 136657 134800 132941 131122 129403
54845 129403 127847 126612 125689 124732 123542 122469 121953 121884 121778 121336 120508 119295 117992 117304 117718 118898 120106
54828 120106 120973 121488 121523 120958 120086 119363 118885 118565 118642 119413 120536 121135 120634 119159 117200 115271 113842 113196
54810 113196 113329 114176 115724 117711 119551 120975 122384 124112 125653 126227 125888 125471 125617 126373 127599 129036
54794 129036 130044 129963 128945 127958 127891 128932 130709 132545 133670 133734 133204 132866 132863 132644 131887 131048 130820 131372
54776 131372 132287 133139 134048 135661 138478 142217 146183 150281 155091 160691 166090 170476 174561 179880 186991
54761 186991 195051 203004 210418 217230 223332 228557 232482 234224 232969 228839 222849 216018 208883 201751
54747 201751 194879 188323 182086 176470 171896 168363 165379 162444 159283 155806 152240 149205 147190 146012
$$ packed form
54859A84747q008q057o951n141l746l481l840l753k959k154j857j859j819j719
54845A29403j556j235r23r57j190j073n16o9j06m42q28j213j303o88M14J180J208
54828A20106Q67N15L5n65q72p23m78l20P7P71J123N99n01j475j959j929j429o46
54810A13196J33Q47J548J987J840J424J409J728J541N74l39m17J46P56J226J437
54794A29036J008q1j018r87o7J041J777J836J125O4n30l38lk19p57q39k28N52
54776A31372R15Q52R09J613K817L739L966M098M810N600N399M386M085N319P111
54761A86991Q060P953P414O812O102N225L925J742j255m130n990o831p135p132
54747B01751o872o556o237n616m574l533k984k935l161l477l566l035k015j178
$$ plain form
54733 146012 145089 144107 143109 142226 141782 142375 144242 146747 149090 151328 154136 157744 161803 166132 170854 175912
54717 175912 181207 187129 194098 201504 207884 212267 214631 215010 213042 208750 202985 196676 190113 183282
54703 183282 176387 169742 163564 158127 153725 150317 147570 145344 143709 142474 141284 140241 139830 140044 140195
54688 140195 139773 138917 137862 136557 135181 134349 134355 134581 134137 132819 131140 129673 128600 127706 126640 125351
54672 125351 124287 123940 124227 124663 124999 125242 125233 124808 124313 124255 124504 124534 124402 124615 125046 124999 124520 124485 125003 124920 123595
54651 123595 122124 121852 122504 122823 122456 122181 122624 123752 125369 127223 128730 129453 129798 130532 131623 132231 131849
54634 131849 130849 129849 129092 128539 128121 127805 127673 127902 128422 128805 128837 128944 129593 130530 131147 131422 131878 132682
54616 132682 133423 133751 133610 132866 131425 129860 129223 129809 130667 130728 130023 129363 129194 129297 129429 129698 130251 130985
$$ packed form
54733A46012r23r82r98q83m44N93J867K505K343K238K808L608M059M329M722N058
54717A75912N295N922O969P406O380M383K364L79j968m292n765o309o563o831
54703A83282o895o645o178n437m402l408k747k226j635j235j190j043m11K14J51
54688A40195m22q56j055j305j376q32OK26m44j318j679j467j073q94j066j289
54672A25351j064l47K87M36L36K43rm25m95n8K49L0j32K13M31m7m79l5N18q3j325
54651A23595j471k72O52L19l67k75M43J128J617J854J507P23L45P34J091O08l82
54634A31849j000j000p57n53m18l16j32K29N20L83L2J07O49R37O17K75M56Q04
54616A32682P41L28j41p44j441j565o37N86Q58O1p05o60j69J03J32K69N53P34
$$ plain form
54598 130985 131713 132375 132937 133264 133218 132830 132237 131552 130903 130522 130618 131080 131473 131433 131008 130528 130248 130282 130725 131601
54578 131601 132673 133490 133688 133181 132180 131169 130790 131400 132730 134158 135295 136017 136062 135104 133385 131816
54562 131816 131055 130777 130209 129221 128488 128608 129427 130311 130892 131362 132036 132770 133005 132466 131680 131581 132628 134496
54544 134496 136516 138081 138710 138232 137211 136806 137834 140027 142406 144225 145304 145718 145578 145199 145118 145740
54528 145740 146976 148389 149618 150544 151031 150709 149336 147330 145648 144918 144870 144773 144177 143044 141499 139869
54512 139869 138761 138611 139200 139999 140851 141854 142687 142697 141731 140326 138978 137766 136852 136746 137665 139045 140041
54495 140041 140289 139955 139392 138965 138895 139024 138996 138802 138786 138983 138921 138373 137888 138154 139171 140396 141452 142301 142955
54476 142955 143455 144038 144997 146396 148033 149532 150422 150433 149883 149450 149385 149292 148891 148552 148751 149421 150281 151382
$$ packed form
54598A30985P28O62N62L27m6l88n93o85o49l81R6M62L93m0m25m80k80L4M43Q76
54578A31601J072Q17J98n07j001j011l79O10J330J428J137P22M5r58j719j569
54562A31816p61k78n68r88p33J20Q19Q84N81M70O74P34K35n39p86r9J047J868
54544A34496K020J565O29m78j021m05J028K193K379J819J079M14j40l79q1O22
54528A45740J236J413J229R26M87l22j373k006j682p30m8r7n96j133j545j630
54512A39869j108j50N89P99Q52J003Q33J0r66j405j348j212r14j06R19J380R96
54495A40041K48l34n63m27p0J29k8j94j6J97o2n48m85K66J017J225J056Q49O54
54476A42955N00N83R59J399J637J499Q90J1n50m33o5r3m01l39J99O70Q60J101
$$ plain form
54458 151382 152818 154141 154701 154511 154273 154482 154831 154587 153306 151206 149022 147489 146849 146860 147251 147924 148741
54441 148741 149460 150029 150538 150718 150024 148498 147042 146368 146031 145072 143335 141637 140838 141230 142609 144414 145894
54424 145894 146658 147032 147516 148098 148548 149137 150408 152248 153883 154860 155522 156336 157262 158007 158500 158850 159096 159236
54406 159236 159335 159461 159598 159692 159672 159464 159128 158890 158861 158799 158422 157908 157822 158465 159482 160122 159860 158950 158434 159346
54386 159346 161629 164021 165283 165319 164868 164456 164125 163903 163892 163931 163803 163775 164333 165230 165364 163993 161753 160163
54368 160163 160244 161746 163552 164661 164925 164935 165234 165740 166014 165908 165684 165660 166008 166744 167584 168010 167880 167823 168531
54349 168531 169739 170520 170611 170743 171449 172156 171942 170806 169680 169414 170109 171385 172927 174764 177139 180143
54333 180143 183385 186229 188422 190360 192508 194709 196223 196451 195459 193774 191836 189689 187186 184369 181518
$$ packed form
54458A51382J436J323N60j90k38K09L49k44j281k100k184j533o40J1L91O73Q17
54441A48741P19N69N09J80o94j526j456o74l37r59j737j698p99L92J379J805J480
54424A45894P64L74M84N82M50N89J271J840J635R77O62Q14R26P45M93L50K46J40
54406A59236R9J26J37R4k0k08l36k38k9o2l77n14q6O43J017O40k62r10n16R12
54386A59346K283K392J262L6m51m12l31k22j1L9j28k8N58Q97J34j371k240j590
54368A60163Q1J502J806J109K64J0K99N06K74j06k24k4L48P36Q40M26j30n7P08
54349A68531J208P81R1J32P06P07k14j136j126k66O95J276J542J837K375L004
54333A80143L242K844K193J938K148K201J514K28r92j685j938k147k503k817k851
$$ plain form
54318 181518 178856 176376 174031 171952 170302 169068 168104 167299 166516 165525 164157 162472 160704 159173 158310
54303 158310 158403 159066 159296 158465 157067 156104 155956 156284 156758 157241 157351 156587 155102 153792 153370 153732 154344 154813
54285 154813 154889 154456 153884 154007 155325 157374 159202 160349 161121 161988 162917 163309 162633 161198 160147 160380 161583
54268 161583 162671 163111 163343 163841 164426 164729 164743 164512 163811 162657 161762 161835 162657 163406 163824 164431 165604 167016
54250 167016 168188 169097 169933 170599 170845 170710 170509 170346 169971 169182 168158 167252 166607 166161 165903 165808 165499 164378
54232 164378 162354 160229 158980 158722 158705 158297 157617 157210 157416 158182 159143 159782 159782 159411 159314 159778 160481 161106 161809
54213 161809 162717 163308 162831 161300 159568 158297 157252 155869 154244 153184 153306 154358 155533 156298 156769 157352
54197 157352 158257 159446 160830 162244 163292 163497 162797 161720 161014 161104 161934 163153 164339 165170 165544 165541 165240
$$ packed form
54318A81518k662k480k345k079j650j234r64q05p83r91j368j685j768j531q63
54303A58310R3O63K30q31j398r63j48L28M74M83J10p64j485j310m22L62O12M69
54285A54813P6m33n72J23J318K049J828J147P72Q67R29L92o76j435j051K33J203
54268A61583J088M40K32M98N85L03J4k31p01j154q95P3Q22P49M18O07J173J412
54250A67016J172R09Q36O66K46j35k01j63l75p89j024r06o45m46k58r5l09j121
54232A64378k024k125j249k58j7m08o80m07K06P66R61O39%l71r7M64P03O25P03
54213A61809R08N91m77j531j732j271j045j383j625j060J22J052J175P65M71N83
54197A57352R05J189J384J414J048K05p00j077p06R0Q30J219J186Q31L74ll01
$$ plain form
54180 165240 164660 163942 163426 163318 163378 163177 162693 162420 162717 163231 163196 162265 160836 159543 158668 158082 157518 156760 155787
54161 155787 154960 154794 155254 155464 154585 152900 151550 151168 151270 151161 150905 151044 151726 152541 153035 153038 152645 152161 151982
54142 151982 152327 153103 154135 155254 156112 156312 155951 155691 155975 156546 157066 157750 158893 160177 161043 161534 162091
54125 162091 162685 162840 162488 162134 162081 162075 161819 161397 161078 161131 161881 163474 165496 167194 168195 168708 169066 169414 169778
54106 169778 170001 169727 168918 168246 168414 169153 169547 169305 169040 169297 170056 171192 172574 173566 173364 172195 171409 171906
54088 171906 173151 174096 174384 174187 173674 173235 173500 174420 174900 174137 172864 172482 173367 174775 176069 177176 178026
54071 178026 178373 178254 178027 177921 178000 178390 179056 179510 179369 179109 179702 181526 184097 186803 189343 191432 192713
54054 192713 193126 193017 192832 192967 193775 195248 196698 197321 197177 197279 198590 201292 205051 209586 214848 220928
$$ packed form
54180A65240n80p18n16j08O0k01m84k73K97N14l5r31j429j293q75n86n64p58r73
54161A55787q27j66M60K10q79j685j350l82J02j09k56J39O82Q15M94Ll93m84j79
54142A51982L45P76J032J119Q58K00l61k60K84N71N20O84J143J284Q66M91N57
54125A62091N94J55l52l54n3ok56m22l19N3P50J593K022J698J001N13L58L48L64
54106A69778K23k74q09o72J68P39L94k42k65K57P59J136J382R92k02j169p86M97
54088A71906J245R45K88j97n13m39K65R20M80p63j273l82Q85J408J294J107Q50
54071A78026L47j19k27j06P9L90O66M54j41k60N93J824K571K706K540K089J281
54054A92713M13j09j85J35Q08J473J450O23j44J02J311K702L759M535N262O080
$$ plain form
54038 220928 227987 236087 245040 254638 265037 276767 290292 305640 322304 339340 355626 370093
54026 370093 381549 388399 389293 384533 376340 367114 357781 348379 339698 333157 329113 326311 323328 319815
54012 319815 316058 312137 308020 303886 299760 295174 289724 283759 278118 273238 268838 264443 260040 256157
53998 256157 253255 251026 248513 245165 241499 238345 235765 233310 231117 229816 229290 228469 226744 224756 223294
53983 223294 222127 220570 218563 216468 214297 211971 209992 209003 208818 208678 208378 208368 208724 208841 208362 207686 207282
53966 207282 207102 206981 207028 207214 207101 206529 206170 206816 208294 209614 210120 210033 210001 210528 211803 213559 215115 216050
53948 216050 216904 218666 221409 224057 225812 227242 229425 232512 235869 239298 243165 247378 251144 254099
53934 254099 256876 260105 263497 266527 269545 273406 278176 282894 286625 289207 290980 292410 294162 296988
$$ packed form
54038B20928P059Q100Q953R598J0399J1730J3525J5348J6664J7036J6286J4467
54026C70093J1456O850Q94m760q193r226r333r402q681o541m044k802k983l513
54012C19815l757l921m117m134m126m586n450n965n641m880m400m395m403l883
53998B56157k902k229k513l348l666l154k580k455k193j301n26q21j725j988j462
53983B23294j167j557k007k095k171k326j979r89j85j40l00j0L56J17m79o76m04
53966B07282j80j21M7J86j13n72l59O46J478J320N06q7l2N27J275J756J556R35
53948B16050Q54J762K743K648J755J430K183L087L357L429L867M213L766K955
53934B54099K777L229L392L030L018L861M770M718L731K582J773J430J752K826
$$ plain form
53920 296988 301108 305913 310608 315049 319765 325277 331586 338314 345223 352479 360368 368792 377209 385178
53906 385178 392745 400136 407277 413882 419880 425394 430392 434726 438450 441677 444062 444921 444044 441962 439181
53891 439181 435469 430225 423325 415321 406938 398686 390832 383508 376802 370898 366086 362602 360599 360442
53877 360442 362854 368552 377754 390121 405002 421509 438280 453229 463591 466557 460536 446263
53865 446263 426546 404641 382758 362012 343167 326812 312977 301176 290981 282192 274450 267203
53853 267203 260290 254152 249143 244995 241299 238186 235987 234357 232363 229596 226694 224575 223495 223158
53839 223158 223316 223783 224057 223533 222157 220537 219247 218351 217698 217372 217571 218217 218944 219432 219641 219768 220120 220884
53821 220884 221921 222804 223212 223229 223247 223594 224334 225307 226292 227229 228364 230019 232150 234265 235915 237177 238549
$$ packed form
53920B96988M120M805M695M441M716N512O309O728O909P256P889Q424Q417P969
53906C85178P567P391P141O605N998N514M998M334L724L227K385Q59q77k082k781
53891D39181l712n244o900q004q383q252p854p324o706n904m812l484k003j57
53877C60442K412N698R202J2367J4881J6507J6771J4949J0362K966o021j4273
53865D46263j9717k1905k1883k0746j8845j6355j3835j1801j0195q789p742p247
53853B67203o913o138n009m148l696l113k199j630j994k767k902k119j080l37
53839B23158J58M67K74n24j376j620j290q96o53l26J99O46P27M88K09J27L52P64
53821B20884J037Q83M08J7J8L47P40R73R85R37J135J655K131K115J650J262J372
$$ plain form
53804 238549 240447 242934 245738 248454 250882 253347 256503 260598 265084 269175 272700 276192 280212 284824
53790 284824 289663 294214 298052 301056 303526 305926 308455 310909 312886 314068 314417 314210 313768 313031 311558
53775 311558 309069 305820 302324 298924 295796 293018 290338 287197 283401 279490 276026 272774 269185 265390
53761 265390 262056 259318 256635 253743 250973 248504 246131 244046 242967 242883 242401 240149 236475 233056 231070
53746 231070 230426 230525 230958 231447 231775 232021 232427 232838 232687 231750 230591 230056 230518 231749 233283 234732 235933
53729 235933 236973 237986 238905 239529 239880 240282 240965 241807 242621 243536 244857 246553 248136 249119 249469 249591 249916
53712 249916 250593 251520 252574 253760 255153 256775 258597 260631 262923 265375 267681 269618 271403 273578 276420
53697 276420 279636 282803 285926 289282 292759 295746 297818 299292 300897 303026 305438 307509 308645 308697 308215
$$ packed form
53804B38549J898K487K804K716K428K465L156M095M486M091L525L492M020M612
53790B84824M839M551L838L004K470K400K529K454J977J182L49k07m42p37j473
53775C11558k489l249l496l400l128k778k680l141l796l911l464l252l589l795
53761B65390l334k738k683k892k770k469k373k085j079q4m82k252l674l419j986
53746B31070o44R9M33M89L28K46M06M11j51r37j159n35M62J231J534J449J201
53729B35933J040J013R19O24L51M02O83Q42Q14R15J321J696J583R83L50J22L25
53712B49916O77R27J054J186J393J622J822K034K292K452K306J937J785K175K842
53697B76420L216L167L123L356L477K987K072J474J605K129K412K071J136N2m82
$$ plain form
53682 308215 308139 308931 310033 310396 309498 307704 305724 303978 302409 300755 299009 297651 297243 297662 298105 298093 298127
53665 298127 298830 299789 299872 298633 296730 294936 293367 291881 290572 289542 288648 287800 287112 286463 285370 283693
53649 283693 282152 281675 282335 283241 283398 282512 281185 280534 281417 283731 286566 289111 291212 293011 294523 295880
53633 295880 297537 299798 302329 304505 306059 307111 307854 308626 309979 312162 314655 316719 318361 320305 323055
53618 323055 326459 330118 333745 337076 339945 342653 345838 349751 353921 357695 360856 363574 366067 368501
53604 368501 371043 373793 376783 380164 384200 388894 393787 398267 401978 404784 406569 407352 407554 407815 408400
53589 408400 408994 409185 408979 408567 407748 406032 403451 400897 399242 398379 397590 396772 396626 397507 398688 399208 399056
53572 399056 398986 399412 400002 400340 400489 400810 401484 402323 402852 402597 401481 399880 398148 396185 393695 390753 387857
$$ packed form
53682C08215p6P92J102L63q98j794j980j746j569j654j746j358m08M19M43j2L4
53665B98127P03R59Q3j239j903j794j569j486j309j030q94q48o88o49j093j677
53649B83693j541m77O60R06J57q86j327o51Q83K314K835K545K101J799J512J357
53633B95880J657K261K531K176J554J052P43P72J353K183K493K064J642J944K750
53618C23055L404L659L627L331K869K708L185L913M170L774L161K718K493K434
53604C68501K542K750K990L381M036M694M893M480L711K806J785P83K02K61N85
53589D08400N94J91k06m12q19j716k581k554j655q63p89q18j46Q81J181N20j52
53572C99056p0M26N90L38J49L21O74Q39N29k55j116j601j732j963k490k942k896
$$ plain form
53555 387857 385480 383848 383027 382870 382927 382780 382534 382716 383655 385229 387183 389404 391864 394619 397916 401896
53539 401896 406153 409968 413208 416606 420958 426328 432250 438385 444633 450920 457353 464502 473082 483209
53525 483209 494212 505318 516438 528198 541261 555667 570815 586068 601270 616621 632209
53514 632209 648006 664343 682013 701673 723306 746506 771036 796846 823731 851366 879604
53503 879604 908375 937263 965590 993016 1019704 1045752 1070830 1094621 1117328 1139392 1160928
53492 1160928 1181823 1202263 1222681 1243171 1263315 1282681 1301227 1319187 1336939 1355050 1373956
53481 1373956 1393351 1412276 1430160 1447422 1464718 1481928 1498286 1513176 1526168 1536519 1543418
53470 1543418 1546855 1547683 1546692 1544045 1539644 1533413 1524989 1513770 1499682 1483563 1466446 1448813 1430805
$$ packed form
53555C87857k377j632q21j57N7j47k46J82R39J574J954K221K460K755L297L980
53539D01896M257L815L240L398M352N370N922O135O248O287O433P149Q580J0127
53525D83209J1003J1106J1120J1760J3063J4406J5148J5253J5202J5351J5588
53514F32209J5797J6337J7670J9660K1633K3200K4530K5810K6885K7635K8238
53503H79604K8771K8888K8327K7426K6688K6048K5078K3791K2707K2064K1536
53492A160928K0895K0440K0418K0490K0144J9366J8546J7960J7752J8111J8906
53481A373956J9395J8925J7884J7262J7296J7210J6358J4890J2992J0351O899
53470A543418L437Q28r91k647m401o231q424j1219j4088j6119j7117j7633j8008
$$ plain form
53457 1430805 1412666 1394520 1376033 1356776 1336728 1315986 1294202 1270833 1246012 1220840 1196776
53446 1196776 1174705 1154386 1134668 1114566 1094368 1075381 1058433 1043110 1028795 1015873 1005277
53435 1005277 997201 990977 985971 981842 978144 974555 971624 970543 971908 975233 979793 985421 992314 1000612
53421 1000612 1010430 1021857 1034701 1048675 1064040 1081613 1101858 1124311 1148110 1172746 1198135
53410 1198135 1224485 1252453 1282979 1316457 1352216 1389140 1426744 1465433 1505990 1549034 1594809
53399 1594809 1643143 1693662 1746169 1800715 1857217 1915218 1974098 2033277 2092173 2150389 2208189
53388 2208189 2266458 2325809 2385870 2445622 2504209 2561115 2615815 2667690 2716356 2761862 2804428
53377 2804428 2843970 2879807 2910919 2936707 2957461 2973801 2985682 2992366 2993360 2988900 2979310 2964423
$$ packed form
53457A430805j8139j8146j8487j9257k0048k0742k1784k3369k4821k5172k4064
53446A196776k2071k0319j9718k0102k0198j8987j6948j5323j4315j2922j0596
53435A005277q076o224n006m129l698l589k931j081J365L325M560N628O893Q298
53421A000612R818J1427J2844J3974J5365J7573K0245K2453K3799K4636K5389
53410A198135K6350K7968L0526L3478L5759L6924L7604L8689M0557M3044M5775
53399A594809M8334N0519N2507N4546N6502N8001N8880N9179N8896N8216N7800
53388B208189N8269N9351O0061N9752N8587N6906N4700N1875M8666M5506M2566
53377B804428L9542L5837L1112K5788K0754J6340J1881O684R94m460r590j4887
$$ plain form
53365 2964423 2943813 2917099 2883706 2842936 2794863 2740785 2682375 2620820 2557269 2493495 2431090
53354 2431090 2370161 2309725 2249440 2190163 2132839 2077712 2024863 1974619 1926845 1880427 1834024
53343 1834024 1787044 1739603 1692062 1645138 1599984 1557422 1517200 1478588 1441667 1407449 1376658
53332 1376658 1348872 1323070 1298596 1275436 1253911 1234430 1217271 1202240 1188502 1174945 1160782
53321 1160782 1145886 1130788 1116517 1104127 1093984 1085456 1077600 1070218 1064011 1059657 1057030 1055540 1055008
53308 1055008 1055877 1058631 1063320 1069733 1077800 1087674 1099530 1113364 1128920 1145759 1163488 1182059 1201861
53295 1201861 1223468 1247271 1273262 1301059 1330121 1360028 1390677 1422196 1454596 1487394 1519517
53284 1519517 1549641 1576821 1600964 1622714 1642797 1661376 1677921 1691564 1701635 1708035 1711172 1711466
$$ packed form
53365B964423k0610k6714l3393m0770m8073n4078n8410o1555o3551o3774o2405
53354B431090o0929o0436o0285n9277n7324n5127n2849n0244m7774m6418m6403
53343A834024m6980m7441m7541m6924m5154m2562m0222l8612l6921l4218l0791
53332A376658k7786k5802k4474k3160k1525j9481j7159j5031j3738j3557j4163
53321A160782j4896j5098j4271j2390j0143q528p856p382o207m354k627j490n32
53308A055008Q69K754M689O413Q067R874J1856J3834J5556J6839J7729J8571J9802
53295A201861K1607K3803K5991K7797K9062K9907L0649L1519L2400L2798L2123
53284A519517L0124K7180K4143K1750K0083J8579J6545J3643J0071O400L137K94
$$ plain form
53272 1711466 1708887 1703153 1694336 1682958 1669390 1653479 1634967 1613962 1590727 1565356 1538077 1509623
53260 1509623 1480827 1451938 1422793 1393444 1364065 1334300 1303419 1271311 1238774 1206625 1175013
53249 1175013 1143869 1113479 1084188 1055869 1028095 1000628 973423 946385 919477 892911 866951
53238 866951 841609 816755 792425 768879 746426 725315 705652 687359 670425 655239 642329
53227 642329 631644 622402 613780 605419 597082 588324 578860 568946 559014 549162 539234 529087 518435
53214 518435 506839 494283 481499 469333 458049 447610 438175 429747 421707 413492 405562 398935 393743
53201 393743 388952 383605 377681 371580 365416 359131 352875 346935 341554 336971 333311 330270 327273 324089
53187 324089 320986 318163 315375 312306 308984 305665 302625 300207 298685 297819 296807 294963 292305 289367
$$ packed form
53272A711466k579n734q817j1378j3568j5911j8512k1005k3235k5371k7279k8454
53260A509623k8796k8889k9145k9349k9379k9765l0881l2108l2537l2149l1612
53249A175013l1144l0390k9291k8319k7774k7467k7205k7038k6908k6566k5960
53238H66951k5342k4854k4330k3546k2453k1111j9663j8293j6934j5186j2910
53227F42329j0685r242q622q361q337q758r464r914r932r852r928j0147j0652
53214E18435j1596j2556j2784j2166j1284j0439r435q428q040q215p930o627n192
53201C93743m791n347n924o101o164o285o256n940n381m583l660l041k997l184
53187C24089l103k823k788l069l322l319l040k418j522q66j012j844k658k938
$$ plain form
53173 289367 286762 285034 284543 285075 285796 285974 285665 285431 285522 285633 285388 284786 284120 283672 283500 283359 282829 281651
53155 281651 279958 278136 276432 274755 272867 270738 268735 267404 266917 266796 266330 265316 264202 263469 263059
53140 263059 262521 261583 260425 259462 259003 259098 259619 260387 261177 261670 261681 261628 262464 264754 267800 270056 270462 269167
53122 269167 266998 264739 262963 262083 262145 262794 263719 264941 266512 268145 269384 269957 269822 269188 268678 269048 270307
53105 270307 271398 271260 270044 268787 267989 267118 265558 263432 261248 259235 257395 255854 254746 253854 252701
53090 252701 251015 248944 246920 245456 244954 245455 246559 247724 248651 249325 249799 250079 250102 249680 248624 247137
53074 247137 245968 245848 246753 247971 248876 249311 249209 248352 246797 245164 244074 243469 242882 242247 242001 242412 243237
53057 243237 244103 244860 245480 245968 246496 247271 248114 248534 248398 248190 248339 248658 248761 248692 248724 248801 248634 248157 247431 246287
$$ packed form
53173B89367k605j728m91N32P21J78l09k34R1J11k45o02o66m48j72j41n30j178
53155B81651j693j822j704j677j888k129k003j331m87j21m66j014j114p33m10
53140B63059n38r38j158r63m59R5N21P68P90M93J1n3Q36K290L046K256M06j295
53122B69167k169k259j776q80O2O49R25J222J571J633J239N73j35o34n10L70J259
53105B70307J091j38j216j257p98q71j560k126k184k013j840j541j108q92j153
53090B52701j686k071k024j464n02N01J104J165R27O74M74K80K3m22j056j487
53074B47137j169j20R05J218R05M35j02q57j555j633j090o05n87o35k46M11Q25
53057B43237Q66P57O20M88N28P75Q43M20j36k08J49L19J03o9L2P7j67m77p26j144
$$ plain form
53037 246287 244607 242853 241672 240959 239877 238044 236158 235165 235215 235738 236178 236311 236157 235972 236130 236659 237028
53020 237028 236760 236083 235638 235610 235612 235412 235306 235570 235992 236250 236560 237436 238866 240123 240607 240568 240691 241163 241542
53001 241542 241489 241179 240864 240474 239962 239690 240062 240920 241724 242243 242681 243132 243407 243464 243637 244221 245126 246081 246961
52982 246961 247728 248317 248749 249209 249810 250475 251124 251867 252837 254025 255338 256674 257878 258893 260050 261854
52966 261854 264268 266474 267677 267957 268011 268247 268522 268639 268666 268674 268518 268029 267263 266465 265869 265559 265364 264847 263596
52947 263596 261608 259296 257110 255241 253738 252646 251858 250962 249547 247729 246184 245489 245545 245833 246174 246896
52931 246896 248171 249521 250312 250548 250794 251303 251632 251231 250135 248834 247637 246382 244726 242610 240459 238931
52915 238931 238354 238404 238478 238417 238672 239680 241288 242901 244040 244592 244676 244448 243986 243286 242408 241595 241052 240570 239636
$$ packed form
53037B46287j680j754j181p13j082j833j886r93N0N23M40J33j54j85J58N29L69
53020B37028k68o77m45k8Kk00j06K64M22K58L10Q76J430J257M84l9J23M72L79
53001B41542n3l10l15l90n12k72L72Q58Q04N19M38M51K75N7J73N84R05R55Q80
52982B46961P67N89M32M60O01O65O49P43R70J188J313J336J204J015J157J804
52966B61854K414K206J203K80N4K36K75J17K7Qj56m89p66p98n96l10j95n17j251
52947B63596j988k312k186j869j503j092p88q96j415j818j545o95N6K88L41P22
52931B46896J275J350P91K36K46N09L29m01j096j301j197j255j656k116k151j528
52915B38931n77N0P4o1K55J008J608J613J139N52Q4k28m62p00q78q13n43m82r34
$$ plain form
52896 239636 238041 236176 234603 233561 233084 233305 234296 235774 237262 238520 239556 240309 240628 240539 240227 239709
52880 239709 238789 237461 236098 235154 234842 235249 236496 238437 240272 240898 239964 238425 237723 238387 239646 240499
52864 240499 240863 241478 242960 245311 248236 251491 254806 257792 260107 261607 262315 262422 262318 262337 262368 261919 260617
52847 260617 258419 255323 251298 246627 241989 237949 234586 231831 229832 228721 228209 227753 227010 225975 224816
52832 224816 223770 223014 222460 221858 221280 221267 222293 224255 226665 229074 231082 232212 232206 231283 229840 228110 226304
52815 226304 224796 223776 223001 222317 222179 223128 224912 226734 228285 229955 232062 234502 237217 240348 243608
52800 243608 246070 246958 246315 244591 241980 238613 235121 232427 230906 230044 229046 227631 226195 225298 225079 225159
52784 225159 225053 224572 223810 222936 222177 221813 221885 221938 221420 220430 219790 220245 221795 223889 226040 228018 229658 230772
$$ packed form
52896B39636j595j865j573j042m77K21R91J478J488J258J036P53L19q9l12n18
52880B39709r20j328j363r44l12M07J247J941J835O26r34j539p02O64J259Q53
52864B40499L64O15J482K351K925L255L315K986K315J500P08J07j04J9L1m49j302
52847B60617k198l096m025m671m638m040l363k755j999j111n12m56p43j035j159
52832B24816j046p56n54o02n78j3J026J962K410K409K008J130or23j443j730j806
52815B26304j508j020p75o84j38R49J784J822J551J670K107K440K715L131L260
52800B43608K462Q88o43j724k611l367l492k694j521q62r98j415j436q97k19Q0
52784B25159j06m81p62q74p59l64P2N3n18r90o40M55J550K094K151J978J640J114
$$ plain form
52766 230772 231322 231477 231487 231492 231446 231155 230481 229545 228730 228381 228463 228570 228329 227900 227901 228697 229806 230306 229834 228943 228372
52745 228372 228326 228667 229397 230548 231821 232819 233532 234208 234797 234979 234756 234636 235157 236507 238613 241234 243932
52728 243932 246272 248159 249738 250952 251607 251884 252346 253244 254139 254429 253985 253116 252183 251440 250906 250204 248828
52711 248828 246883 245264 244770 245172 245495 245110 244226 243338 242544 241527 240057 238424 237383 237604 239022 240780
52695 240780 241956 242342 242404 242526 242531 242106 241516 241546 242617 244190 245368 245911 246333 247067 248064 249328 251201 253672
52677 253672 255837 256724 256401 255697 254977 253946 252587 251424 250613 249503 247586 245308 243517 242520 242179 242488
52661 242488 243449 244641 245562 246328 247501 249195 250831 251956 252908 254406 256688 259230 261265 262476 263236
52646 263236 264179 265510 266724 267061 266196 264384 262046 259383 256472 253582 251207 249772 249374 249779 250555 251199
$$ packed form
52766B30772N50J55J0Nm6k91o74r36q15l49Q2J07k41m29JP96J109N00m72q91n71
52745B28372m6L41P30J151J273R98P13O76N89J82k23j20N21J350K106K621K698
52728B43932K340J887J579J214O55K77M62Q98Q95K90m44q69r33p43n34p02j376
52711B48828j945j619m94M02L23l85q84q88p94j017j470j633j041K21J418J758
52695B40780J176L86O2J22Nm25n90L0J071J573J178N43M22P34R97J264J873K471
52677B53672K165Q87l23p04p20j031j359j163q11j110j917k278j791r97l41L09
52661B42488R61J192R21P66J173J694J636J125R52J498K282K542K035J211P60
52646B63236R43J331J214L37q65j812k338k663k911k890k375j435l98M05P76O44
$$ plain form
52630 251199 251398 251446 252264 254587 258038 261353 263728 265572 267656 269886 271291 271058 269154 266178 263013
52615 263013 260502 258966 258100 257609 257632 258098 258108 256827 254859 253748 254036 254699 254802 254766 255531 257196 259113
52598 259113 260767 261926 262426 262368 262273 262552 263168 264071 265480 267253 268604 269094 269459 270731 272828 274708 275599
52581 275599 275509 274821 274171 274413 275804 277336 277720 277065 276734 277447 278421 278638 278116 277429 276638 275398 273797 272447
52563 272447 271761 271484 270996 269929 268466 267111 266128 265302 264347 263317 262378 261326 259787 257877 256223 255281
52547 255281 254998 255204 255909 257047 258246 259120 259570 259683 259521 259147 258639 258042 257431 257066 257203 257701 258123 258329
52529 258329 258671 259455 260464 261281 261962 263136 265425 268813 272527 275503 277022 277024 275958 274469 273208 272601
52513 272601 272584 272765 273013 273714 275213 277330 279676 282181 284889 287499 289556 290922 291535 290930 288665 285225
$$ packed form
52630B51199J99M8Q18K323L451L315K375J844K084K230J405k33j904k976l165
52615B63013k511j536q66m91K3M66J0j281j968j111K88O63J03l6P65J665J917
52598B59113J654J159N00n8r5K79O16R03J409J773J351M90L65J272K097J880Q91
52581B75599r0o88o50K42J391J532L84o55l31P13R74K17n22o87p91j240j601j350
52563B72447o86k77m88j067j463j355r83q26r55j030r39j052j539j910j654r42
52547B55281k83K06P05J138J199Q74M50J13j62l74n08n97o11l65J37M98M22K06
52529B58329L42P84J009Q17O81J174K289L388L714K976J519Kj066j489j261o07
52513B72601j7J81K48P01J499K117K346K505K708K610K057J366O13o05k265l440
$$ plain form
52497 285225 281827 279284 277515 276210 275247 274363 273096 271387 269658 268060 266267 264358 263234 263585 264898
52482 264898 266060 266607 266839 267024 267132 267228 267536 268110 268863 269880 271348 273134 274803 276083 277090 278163
52466 278163 279655 281782 284432 287211 289928 292859 296219 299526 301925 303161 303851 304659 305522 305802 304982
52451 304982 303046 300405 297611 295044 292623 289842 286289 282225 278577 276180 274984 274158 273006 271642
52437 271642 270625 270167 270032 270024 270156 270329 270341 270352 270915 272307 274174 276044 277783 279277 280121 280141 279928 280300
52419 280300 281257 281952 281713 280709 279603 278926 278879 279500 280871 283220 286724 291060 295368 298989 302182 305823
52403 305823 310527 316445 323789 332881 343409 353991 362770 368304 369866 367391 361525 353507 344623 335757
52389 335757 327590 320918 316311 313433 311157 308636 306187 304879 305274 306710 307917 308261 308204 308560 309547 310823
$$ packed form
52497B85225l398k543j769j305r63q84j267j709j729j598j793j909j124L51J313
52482B64898J162N47K32J85J08R6L08N74P53J017J468J786J669J280J007J073
52466B78163J492K127K650K779K717K931L360L307K399J236O90Q08Q63K80q20
52451C04982j936k641k794k567k421k781l553m064l648k397j196q26j152j364
52437B71642j017m58j35qJ32J73J2J1N63J392J867J870J739J494Q44K0k13L72
52419B80300R57O95k39j004j106o77m7O21J371K349L504M336M308L621L193L641
52403C05823M704N918P344R092J0528J0582Q779N534J562k475n866q018q884q866
52389C35757q167o672m607k878k276k521k449j308L95J436J207L44n7L56R87J276
$$ plain form
52373 310823 312263 314246 317000 320089 322939 325685 329050 333356 338075 342459 346186 349118 350828 350944
52359 350944 349852 348485 347346 346209 344934 344010 343878 344130 343980 343385 343136 343846 345335 347070 348728 350227
52343 350227 351686 353546 356242 359429 362007 363371 364321 366279 369792 374333 379357 384882 390980 397329
52329 397329 403661 410303 417949 427025 437504 449122 461519 474321 487331 500675 514543 528848
52317 528848 543284 557675 572029 586279 600266 614057 628037 642412 656813 670681 683973
52306 683973 697172 710586 723982 737094 750187 763763 777848 791837 805029 817142 828312
52295 828312 838794 848584 857225 864049 868769 871683 873063 872626 870038 865841 861288 857135 853059 848484
52281 848484 843489 838600 834118 830157 827072 825312 824836 825159 826078 828090 831854 837352 843657 849617 854827
$$ packed form
52373C10823J440J983K754L089K850K746L365M306M719M384L727K932J710J16
52359C50944j092j367j139j137j275r24j32K52j50n95k49P10J489J735J658J499
52343C50227J459J860K696L187K578J364R50J958L513M541N024N525O098O349
52329C97329O332O642P646R076J0479J1618J2397J2802J3010J3344J3868J4305
52317E28848J4436J4391J4354J4250J3987J3791J3980J4375J4401J3868J3292
52306F83973J3199J3414J3396J3112J3093J3576J4085J3989J3192J2113J1170
52295H28312J0482R790Q641O824M720K914J380m37k588m197m553m153m076m575
52281H48484m995m889m482l961l085j760m76L23R19K012L764N498O305N960N210
$$ plain form
52266 854827 860007 866384 874682 884742 895900 907420 918565 928819 938357 947999 958339 969131
52254 969131 979869 990689 1002201 1014494 1026791 1038208 1048558 1058295 1067907 1077385 1086049 1092859
52242 1092859 1097158 1099193 1099751 1099350 1097999 1095715 1092895 1090037 1087406 1085073 1083022 1081005 1078575 1075651
52228 1075651 1072952 1071469 1071359 1071614 1071054 1069605 1068320 1068114 1068728 1069150 1068846 1068201 1067817 1067895 1068531 1070189 1073366
52211 1073366 1077887 1082942 1087890 1092778 1098062 1104060 1110754 1117905 1125189 1132272 1138898 1144976 1150630 1156184
52197 1156184 1161927 1167876 1173849 1179816 1185948 1192270 1198497 1204455 1210381 1216520 1222640 1228284 1233338 1237940
52183 1237940 1241848 1244348 1244917 1243692 1241189 1237794 1233611 1228583 1222611 1215682 1207925 1199568 1190918 1182478
52169 1182478 1174841 1168220 1162312 1156947 1152612 1149822 1148099 1146236 1143692 1141166 1139573 1139028 1139199 1140124 1142075
$$ packed form
52266H54827N180O377Q298J0060J1158J1520J1145J0254R538R642J0340J0792
52254I69131J0738J0820J1512J2293J2297J1417J0350R737R612R478Q664O810
52242A092859M299K035N58m01j351k284k820k858k631k333k051k017k430k924
52228A075651k699j483j10K55n60j449j285k06O14M22l04o45l84P8O36J658L177
52211A073366M521N055M948M888N284N998O694P151P284P083O626O078N654N554
52197A156184N743N949N973N967O132O322O227N958N926O139O120N644N054M602
52183A237940L908K500N69j225k503l395m183n028n972o929p757q357q650q440
52169A182478p637o621n908n365m335k790j723j863k544k526j593n45J71R25J951
$$ plain form
52154 1142075 1144785 1147282 1148598 1148400 1147002 1144972 1142742 1140504 1138475 1137182 1137199 1138565 1140707 1143005 1145129
52139 1145129 1146720 1147219 1146330 1144353 1141744 1138645 1135201 1132006 1129710 1128363 1127654 1127744 1129348 1132968 1138532
52124 1138532 1145888 1155257 1166989 1181146 1197502 1215728 1235450 1256311 1278047 1300295 1322363 1343494
52112 1343494 1363510 1382861 1401860 1420098 1436768 1451341 1463747 1474228 1483330 1491849 1500412 1509130
$$ packed form
52154A142075K710K497J316j98j398k030k230k238k029j293J7J366K142K298K124
52139A145129J591M99q89j977k609l099l444l195k296j347p09R0J604L620N564
52124A138532P356R369J1732J4157J6356J8226J9722K0861K1736K2248K2068K1131
52112A343494K0016J9351J8999J8238J6670J4573J2406J0481R102Q519Q563Q718
$$ [...]
##END NTUPLES=NMR SPECTRUM
##END=
