
##TITLE=UV1246_M9_1261-1207_50_7241393_epRdmHUI91
##JCAMPDX= 6.0         $$ Bruker NMR JCAMP-DX V2.0
##DATA TYPE= NMR SPECTRUM
##DATA CLASS= NTUPLES
##ORIGIN= BRUKER
##OWNER= Administrator
$$ 1.72 TOPSPIN		Version 2.1
$$ 2013-01-24 03:00:49.605 -0500  Administrator@X
$$ Compression mode = diff/dup
##.OBSERVE FREQUENCY= 400.02188249412
##.OBSERVE NUCLEUS= ^1H
##.ACQUISITION MODE= SIMULTANEOUS (DQD)
##.ACQUISITION SCHEME= undefined
##.AVERAGES= 8
##.DIGITISER RES= 22
##SPECTROMETER/DATA SYSTEM= spect
##.PULSE SEQUENCE= zg30
##.SOLVENT NAME= COFFEE_meoh
##.SHIFT REFERENCE= INTERNAL, COFFEE_meoh, 1, 14.98509
##AUDIT TRAIL= $$ (NUMBER, WHEN, WHO, WHERE, PROCESS, VERSION, WHAT)
$$ ##TITLE= Audit trail, TOPSPIN		Version 2.1
$$ ##JCAMPDX= 5.01
$$ ##ORIGIN= Bruker BioSpin GmbH
$$ ##OWNER= Administrator
$$ $$ E:\/data/COFFEE/nmr/UV1246_M9_1261-1207_50_7241393_epRdmHUI91/20/pdata/1/auditp.txt
$$ ##AUDIT TRAIL=  $$ (NUMBER, WHEN, WHO, WHERE, PROCESS, VERSION, WHAT)
(   1,<2013-01-24 03:00:41.542 -0500>,<Administrator>,<X>,<go>,<TOPSPIN 2.1>,
      <created by zg
	started at 2013-01-24 02:59:35.511 -0500,
	POWCHK enabled, PULCHK disabled,
       configuration hash MD5:
       86 BA 57 50 F2 9D 5C 9B 26 00 A9 28 5F 66 2E 89
       data hash MD5: 64K
       66 4F E6 A5 AC DE DF 21 E5 41 04 5F 60 6B E9 CD>)
(   2,<2013-01-24 03:00:44.605 -0500>,<Administrator>,<X>,<proc1d>,<TOPSPIN 2.1>,
      <Start of raw data processing
       efp LB = 0 FT_mod = 6 PKNL = 1 PHC0 = 0 PHC1 = 0 SI = 32K 
       data hash MD5: 32K
       A3 BE D9 16 46 70 3A D5 32 DA 69 8F 62 22 FC 25>)
(   3,<2013-01-24 03:00:45.074 -0500>,<Administrator>,<X>,<proc1d>,<TOPSPIN 2.1>,
      <pk PHC0 = 99.19556 PHC1 = 0 
       data hash MD5: 32K
       0F 81 33 7E 66 D3 79 55 99 21 00 96 A8 17 5B 52>)
(   4,<2013-01-24 03:00:45.292 -0500>,<Administrator>,<X>,<proc1d>,<TOPSPIN 2.1>,
      <abs ABSG = 1 
       data hash MD5: 32K
       15 0B 21 6F 54 45 31 DC D9 1B 7D 3A CF 40 4A 2D>)
(   5,<2013-01-24 03:00:45.449 -0500>,<Administrator>,<X>,<proc1d>,<TOPSPIN 2.1>,
      <abs ABSG = 2 
       data hash MD5: 32K
       48 D4 71 BF 1D B1 3F B2 C9 29 45 74 D4 22 D8 F3>)
(   6,<2013-01-24 03:00:45.589 -0500>,<Administrator>,<X>,<proc1d>,<TOPSPIN 2.1>,
      <abs ABSG = 3 
       data hash MD5: 32K
       13 C2 B3 9E DC F5 93 69 C0 7E 65 58 6B B8 EB 07>)
(   7,<2013-01-24 03:00:45.730 -0500>,<Administrator>,<X>,<proc1d>,<TOPSPIN 2.1>,
      <abs ABSG = 4 
       data hash MD5: 32K
       AB 39 28 79 21 9F AF 51 43 B6 60 51 6D 12 20 FC>)
(   8,<2013-01-24 03:00:45.886 -0500>,<Administrator>,<X>,<proc1d>,<TOPSPIN 2.1>,
      <abs ABSG = 5 
       data hash MD5: 32K
       B4 7A A4 61 32 EC F1 8D F7 0A 3F 72 B0 19 5D 6C>)
$$ ##END=
$$ 
$$ $$ hash MD5
$$ $$ 31 C7 2E B0 0A CE 4D 6E 63 0F 97 D3 2B 56 53 27
##$RELAX= 
##$RELAX= 
##$RELAX= 
##$RELAX= 
##$RELAX= 
##$RELAX= 
##$RELAX= 
$$ Bruker specific parameters
$$ --------------------------
##$DU= <E:\>
##$EXPNO= 20
$$ [...]
150 150 150 150 150 150 150 150
##$TP07= 0
##$TPNAME0= <>
##$TPNAME1= <>
##$TPNAME2= <>
##$TPNAME3= <>
##$TPNAME4= <>
##$TPNAME5= <>
##$TPNAME6= <>
##$TPNAME7= <>
##$TPOAL= (0..7)
0.5 0.5 0.5 0.5 0.5 0.5 0.5 0.5
##$TPOFFS= (0..7)
0 0 0 0 0 0 0 0
##$TUNHIN= 0
##$TUNHOUT= 0
##$TUNXOUT= 0
##$USERA1= <user>
##$USERA2= <user>
##$USERA3= <user>
##$USERA4= <user>
##$USERA5= <user>
##$V9= 5
##$VALIST= <valist>
##$VCLIST= <CCCCCCCCCCCCCCC>
##$VD= 0
##$VDLIST= <DDDDDDDDDDDDDDD>
##$VPLIST= <PPPPPPPPPPPPPPP>
##$VTLIST= <TTTTTTTTTTTTTTT>
##$WBST= 1024
##$WBSW= 4
##$XGAIN= (0..3)
0 0 0 0
##$XL= 0
##$YL= 0
##$YMAX_a= 679315
##$YMIN_a= -578739
##$ZGOPTNS= <>
##$ZL1= 120
##$ZL2= 120
##$ZL3= 120
##$ZL4= 120
##$ABSF1= 14.98509
##$ABSF2= -5.573092
##$ABSG= 5
##$ABSL= 3
##$ALPHA= 0
##$AQORDER= 0
##$ASSFAC= 0
##$ASSFACI= 0
##$ASSFACX= 0
##$ASSWID= 0
##$AUNMP= <proc_prof1d_extract_pilot.lims>
##$AXLEFT= 0
##$AXNAME= <>
##$AXNUC= <1H>
##$AXRIGHT= 0
##$AXTYPE= 0
##$AXUNIT= <>
##$AZFE= 0.1
##$AZFW= 0.1
##$BCFW= 0
##$BC_mod= 0
##$BYTORDP= 0
##$COROFFS= 0
##$CY= 15
##$DATMOD= 1
##$DC= 0
##$DFILT= <>
##$DTYPP= 0
##$F1P= 0
##$F2P= 0
##$FCOR= 0.5
##$FTSIZE= 32768
##$FT_mod= 6
##$GAMMA= 0
##$GB= 0
##$INTBC= 1
##$INTSCL= 1
##$ISEN= 128
##$LB= 0
##$LEV0= 0
##$LPBIN= 0
##$MAXI= 10000
##$MC2= 0
##$MEAN= 0
##$ME_mod= 0
##$MI= 0
##$NCOEF= 0
##$NC_proc= -8
##$NLEV= 6
##$NOISF1= 0
##$NOISF2= 0
##$NSP= 0
##$NTH_PI= 0
##$NZP= 0
##$OFFSET= 14.98509
##$PC= 1
##$PHC0= 99.19556
##$PHC1= 0
##$PH_mod= 1
##$PKNL= yes
##$PPARMOD= 0
##$PPDIAG= 0
##$PPIPTYP= 0
##$PPMPNUM= 2147483647
##$PPRESOL= 1
##$PSCAL= 4
##$PSIGN= 0
##$PYNMP= <proc.py>
##$REVERSE= no
##$SF= 400.02
##$SI= 32768
##$SIGF1= 0
##$SIGF2= 0
##$SINO= 400
##$SIOLD= 32768
##$SPECTYP= <>
##$SREGLST= <1H.CDCl3>
##$SSB= 0
##$STSI= 32768
##$STSR= 0
##$SW_p= 8223.68421052631
##$SYMM= 0
##$S_DEV= 0
##$TDeff= 65536
##$TDoff= 0
##$TI= <>
##$TILT= no
##$TM1= 0
##$TM2= 0
##$TOPLEV= 0
##$USERP1= <user>
##$USERP2= <user>
##$USERP3= <user>
##$USERP4= <user>
##$USERP5= <user>
##$WDW= 1
##$XDIM= 32768
##$YMAX_p= 476241242
##$YMIN_p= -811537
##$CURPLOT= <Network HP LaserJet P1505>
##$CURPRIN= <$Network HP LaserJet P1505>
##$DFORMAT= <normdp>
##$LAYOUT= <+/1D_H.xwp>
##$LFORMAT= <normlp>
##$PFORMAT= <normpl>
##$SURQMSG= 1
$$ End of Bruker specific parameters
$$ ---------------------------------
##NTUPLES= NMR SPECTRUM
##VAR_NAME=  FREQUENCY,     SPECTRUM/REAL,   SPECTRUM/IMAG
##SYMBOL=    X,             R,               I
##VAR_TYPE=  INDEPENDENT,   DEPENDENT,       DEPENDENT
##VAR_FORM=  AFFN,          ASDF,            ASDF
##VAR_DIM=   32768,         32768,           32768
##UNITS=     HZ,            ARBITRARY UNITS, ARBITRARY UNITS
##FACTOR=    0.250966925370066, 1,           1
##FIRST=     8223.43324360094, 81121,        -200037
##LAST=      0,             133989,          -144037
##MIN=       0,             -811537,         0
##MAX=       8223.43324360094, 476241242,    0
$$ Real data points
##PAGE= N=1
##DATA TABLE= (X++(R..R)), XYDATA
$$ [...]
19521a75366O5513B0752c8133J7034m6916k42626E5304a69027f3970l5468m825
$$ -175366 -109853 20752 -38133 -21099 -68015 -310641 55304 -169027 -63970 -99438 -104263
19510a04263l61682b337C1698b46611J02378a6657k88191B60330a59538B97683
$$ -104263 -465945 -2337 31698 -246611 -144233 -16657 -304848 260330 -159538 297683
19499h2902k28588J0293A44063b5253j58867g3030A6455b0178A12362c24945A12640
$$ -82902 -311490 -301197 144063 -25253 -184120 -73030 16455 -20178 112362 -324945 112640
19487b29536e6679G6807d8602J1826j26218A46805N5857N3806a43233n9201A00591
$$ -229536 -56679 76807 -48602 -36776 -162994 146805 202662 256468 -143233 -202434 100591
19475A27201d4338a4840k9347m59182N2589J89509A09350B9997J86204n962a692
$$ 127201 -44338 -14840 -44187 -503369 -450780 -261271 109350 29997 216201 210239 -1692
19463b24771g4115b8298j66846j48814H2315a93804k7083G2267A5556b19332C97985
$$ -224771 -74115 -28298 -195144 -343958 82315 -193804 -220887 72267 15556 -219332 397985
19451b81727J5096A41371a84985j92942a49649a9031I8670a47464A8527a7995
$$ -281727 -266631 141371 -184985 -377927 -149649 -19031 98670 -147464 18527 -17995
19440b1590F7724E585g5852j55576k32686E3087b27635A44496A3202a21290K3049
$$ -21590 67724 5585 -75852 -231428 -464114 53087 -227635 144496 13202 -121290 -98241
19429i8241m2799K7243l56986N9949a4241k94617J06258A17574f7351k37354G0683
$$ -98241 -141040 -113797 -470783 -410834 -14241 -308858 -202600 117574 -67351 -304705 70683
19417d1143j77285O736A95649f1794j24010l8785h4455B4403b90235n9464A47724
$$ -41143 -218428 -211692 195649 -61794 -185804 -224589 -84455 24403 -290235 -349699 147724
19405b05630e5575F2628a21951A54258e74401a95307O4317j07912m1059A45085
$$ -205630 -55575 62628 -121951 154258 -574401 -195307 -130990 -238902 -279961 145085
19394F539e3286j02004M4945B6373J25815o3667a90324E8530f278j94730j09672
$$ 6539 -53286 -155290 -110345 26373 152188 88521 -190324 58530 -6278 -201008 -310680
19383c10680B5630c25241P9122F7435d48557B31172j2758a32363N0603j11551
$$ -310680 25630 -325241 -246119 67435 -448557 231172 218414 -132363 -81760 -193311
19373a93311R0424A0245Q5547c40224d2097j75245P9028k8054j7212F0848b06799
$$ -193311 -102887 10245 95792 -340224 -42097 -217342 -138314 -166368 -183580 60848 -206799
19361i3983B34580h0271a5265A5456a42374C9835g9105k73737a20250j18676a08665
$$ -93983 234580 -80271 -15265 15456 -142374 39835 -79105 -352842 -120250 -238926 -108665
19349I8932N7893f7926A13795a38032j32308G6908c1020B19546h6935d0105A24542
$$ 98932 156825 -67926 113795 -138032 -270340 76908 -31020 219546 -86935 -40105 124542
19337f3984a7748j13741q5957B60920p9503A3505J7587a40645o7224O415c9547
$$ -63984 -17748 -131489 -217446 260920 181417 13505 31092 -140645 -207869 -201454 -39547
19325b43204A28231K447J14933J76187B00501G1059a56859o4738B78039b501A45898
$$ -243204 128231 130678 245611 421798 200501 71059 -156859 -221597 278039 -2501 145898
19313f143H4514a33072I0349a13407d0453j16964B20399c00918A16156a01118
$$ -6143 84514 -133072 90349 -113407 -40453 -157417 220399 -300918 116156 -101118
19302B05994J94833A92916c1531m85640h4376A62361E7984K32928b24714F5949
$$ 205994 400827 192916 -31531 -517171 -84376 162361 57984 290912 -224714 65949
19291f0474j4815j12314n4928b5932j26426B25695b41705B61937a50895j07788
$$ -60474 -75289 -187603 -242531 -25932 -152358 225695 -241705 261937 -150895 -258683
19281b58683e6764j58389C6715a29999F6906c42588g8476q1964F2801c1554b158
$$ -258683 -56764 -215153 36715 -129999 66906 -342588 -78476 -160440 62801 -31554 -2158
19269d90074C3795a93001A18270b42140B33288D1957g8615B17696q5650e4031
$$ -490074 33795 -193001 118270 -242140 233288 41957 -78615 217696 132046 -54031
19258b72610a26366j02859d9915b0922C8809c36617a8537k67943h1298D6476c8305
$$ -272610 -126366 -229225 -49915 -20922 38809 -336617 -18537 -286480 -81298 46476 -38305
19246c9844a8475B64337a67215p8599A38958a17483j32018f3863E9141a4097q7380
$$ -39844 -18475 264337 -167215 -245814 138958 -117483 -249501 -63863 59141 -14097 -101477
19235a01477p0796K4233m9914I7075a51889c9525G6647d6392j31588D7595J23339
$$ -101477 -172273 -148040 -197954 97075 -151889 -39525 76647 -46392 -177980 47595 170934
19224A70934A4204e9701a1660j19425l76670c4690C84281I1041a64079N4384j08809
$$ 170934 14204 -59701 -11660 -131085 -507755 -34690 384281 91041 -164079 -109695 -218504
19213b18504n2159D8313a99131l0517A01257a95532M9246D4183e6395o2316L7029
$$ -218504 -270663 48313 -199131 -229648 101257 -195532 -146286 44183 -56395 -118711 -81682
19202h1682c8514C0830a02433m2272l36153A98932b41505H3568B5027K24414J21983
$$ -81682 -38514 30830 -102433 -144705 -480858 198932 -241505 83568 25027 249441 371424
19191C71424b07849A3352k643a78183n94F678b70044P6912p5190j549A26411L2893
$$ 371424 -207849 13352 10709 -178183 -178777 6678 -270044 -193132 -268322 -269871 126411 159304
19179A59304l4454a50640E6567b22542j42589g9986A14734b51431B02879a93980
$$ 159304 124850 -150640 56567 -222542 -365131 -79986 114734 -251431 202879 -193980
19168b85000I8348b68203A06384A4645N1059b11041k6381g7001L6461C5903d0962
$$ -285000 98348 -268203 106384 14645 65704 -211041 -237422 -77001 -40540 35903 -40962
19156A74391g6827Q847J4796B12705c89494J39998I8725d42119E17262b90971
$$ 174391 -76827 -67980 -53184 212705 -389494 -249496 98725 -442119 517262 -290971
19145b54787b0129j73648N5105F7276L3652N3059e2647j05927C4801L2320b43168
$$ -254787 -20129 -193777 -138672 67276 100928 153987 -52647 -158574 34801 67121 -243168
19133A83841n1516b66551E8837a65881D72245a90606R2556A9751a61201G5178
$$ 183841 132325 -266551 58837 -165881 472245 -190606 -98050 19751 -161201 75178
19122A8413L9975h0863M74j4539D1364d47958J84060g8588C4567b27693d359C343
$$ 18413 58388 -80863 -80389 -94928 41364 -447958 -263898 -78588 34567 -227693 -4359 3343
19109c06026E6350j2866b70650a28756B40446i9651p0469L8272d1654B26139h1951
$$ -306026 56350 43484 -270650 -128756 240446 -99651 -170120 -131848 -41654 226139 -81951
19097A37908a11113o4817n557d961B32500b43042A18061b10423A19316k4268a97355
$$ 137908 -111113 -175930 -181487 -4961 232500 -243042 118061 -210423 119316 95048 -197355
19085A07998b25693A45643E6210J41782j9746f3173j3878A63569b28248e7612
$$ 107998 -225693 145643 56210 197992 178246 -63173 -77051 163569 -228248 -57612
19074b58888B2813a27449A1915a44938M5088C894c58546A17615d8581d558l0492
$$ -258888 22813 -127449 11915 -144938 -99850 3894 -358546 117615 -48581 -4558 -35050
19063c5050A51164K4991L2H8007B1399J40545B2854b99753a22132K7804b3809
$$ -35050 151164 176155 176187 88007 21399 161944 22854 -299753 -122132 -94328 -23809
19051a03944k1987J0399k19475G3910a60306g2185H0801b29511B52355K2932B4479
$$ -103944 -125931 -115532 -335007 73910 -160306 -72185 80801 -229511 252355 275287 24479
19039E7712c7346B18610e50285B4871j0013Q4948c2810D492b01610i935k24662
$$ 57712 -37346 218610 -550285 24871 14858 99806 -32810 4492 -201610 -9935 -234597
19028b34597O9313D1747a3391F8633a25979k08134B79569b70806J11585k40744
$$ -234597 -165284 41747 -13391 68633 -125979 -334113 279569 -270806 -159221 -399965
19018c99965G1643B0988M11784h9133l00393J38177P5699b3523k92742A62629
$$ -399965 71643 20988 432772 -89133 -389526 -251349 -175650 -23523 -316265 162629
19007a45252J9288m4976I8078N8651E1211M5072d9456k58433N3013C45047b69990
$$ -145252 -125964 -170940 98078 156729 51211 96283 -49456 -307889 -254876 345047 -269990
18995C21387a12380L2011B13040d32033i9378j36984B86082g9303J2475A6465
$$ 321387 -112380 -80369 213040 -432033 -99378 -236362 286082 -79303 -66828 16465
18984a7718A35501e8846p3283l874B02060c82627B82819A23230d3408l86694a59397
$$ -17718 135501 -58846 -132129 -136003 202060 -382627 282819 123230 -43408 -430102 -159397
18972b544j4832j62044A56295l5286a73190b9008q3901I5027k5513J83552h248
$$ -2544 -17376 -179420 156295 121009 -173190 -29008 -112909 95027 69514 253066 -8248
18960B14250b77549i158q3080m2436A12572e7078C237J84512A5386a87475B26365
$$ 214250 -277549 -9158 -92238 -134674 112572 -57078 3237 187749 15386 -187475 226365
18948B08265g6549C4649f6607R095o8803A24571J16027c56629D1915K8228a98715
$$ 208265 -76549 34649 -66607 -57512 -126315 124571 240598 -356629 41915 70143 -198715
18936b40011e2520q1130k29591C1432b19152b1398B49410E4096a8006j16485C3029
$$ -240011 -52520 -133650 -363241 31432 -219152 -21398 249410 54096 -18006 -134491 33029
18924d32k17518J01751j21059A79464L7283A06686a91062E3615K36717o8207e0828
$$ -432 -217950 -116199 -237258 179464 216747 106686 -191062 53615 290332 222125 -50828
18912b15108h5406j51449i9911l5518K4896H6320K87136a20691j32407e6644q4346
$$ -215108 -85406 -236855 -99911 -135429 -110533 86320 373456 -120691 -253098 -56644 -140990
18901a40990p1595M0353Q3595d2580B0214M577a68806C10108b33798f6254b7086
$$ -140990 -212585 -172232 -88637 -42580 20214 24791 -168806 310108 -233798 -66254 -27086
18889a37430L5194I0022a11465A35792a54938b2324A06272b82229r9875H6477
$$ -137430 -102236 90022 -111465 135792 -154938 -22324 106272 -282229 -382104 86477
18878I3885a6895l10956J06359g9120b2755j75032I8227j9735J0964M0725b84956
$$ 93885 -16895 -327851 -221492 -79120 -22755 -197787 98227 78492 89456 130181 -284956
18866A07952R9481b64422e2691l16447a67306h1994l43670B33395E8910c0953
$$ 107952 207433 -264422 -52691 -369138 -167306 -81994 -425664 233395 58910 -30953
18855f4761N701B44015a57967a287A30321e3590j17999E537d4945r3330M4990
$$ -64761 -59060 244015 -157967 -1287 130321 -53590 -171589 5537 -44945 -138275 -93285
18844i3285n1708R52k985k0993O9364A46074a96464E35762A61713d992A12481
$$ -93285 -144993 -144041 -147026 -168019 -98655 146074 -196464 535762 161713 -4992 112481
18832A05625d5277j1014M280F5427i275o9608D0768b05393D78183a6267A34531
$$ 105625 -45277 -56291 -52011 65427 -9275 -78883 40768 -205393 478183 -16267 134531
18820e0166A90066i7100A81826l5860n4566a88928E4613e1432C22634q2087J07116
$$ -50166 190066 -97100 181826 145966 91400 -188928 54613 -51432 322634 240547 347663
18809C47663c827l73721J07125c1369B8483K93836a82041d0126A10161a85045
$$ 347663 -3827 -377548 -270423 -31369 28483 322319 -182041 -40126 110161 -185045
18798F3489a61569L9631j39446a07099A53324K23354h1625A26827a09235A36711
$$ 63489 -161569 -121938 -261384 -107099 153324 376678 -81625 126827 -109235 136711
18787B44103h2747J6775A47310d3133E9634d71045J07724R9820M2305a154A35579
$$ 244103 -82747 -65972 147310 -43133 59634 -471045 -363321 -263501 -221196 -1154 135579
18775A7496Q0608h7817F730a79118J0568h1558A40703e0527j27273k6236a00138
$$ 17496 98104 -87817 6730 -179118 -168550 -81558 140703 -50527 -177800 -204036 -100138
18763e1095m615n7351A64293a63459c9192k01873A772a47966C20043F5918a18202
$$ -51095 -55710 -113061 164293 -163459 -39192 -241065 1772 -147966 320043 65918 -118202
18751F7632a02673K3937k75578a43135j83811c672k57059a08928l81578D16717
$$ 67632 -102673 -78736 -354314 -143135 -326946 -3672 -260731 -108928 -490506 416717
18740a05654A43876h47G3792b0232C4328i2510A53379a6140E2415b39676l2417
$$ -105654 143876 -847 73792 -20232 34328 -92510 153379 -16140 52415 -239676 -272093
18729b72093Q4816E9372L2787J2037a33321A90397b63402M5684F5803a46529A20918
$$ -272093 -187277 59372 92159 104196 -133321 190397 -263402 -217718 65803 -146529 120918
18717d98608K04123J13913A24430a66716A12534i2326A0920i9106B01769b95901
$$ -498608 -294485 -180572 124430 -166716 112534 -92326 10920 -99106 201769 -295901
18706B28964J4035o4257b60648J14727J6681A0157L13191F7832c46120B1280a75988
$$ 228964 242999 178742 -260648 -145921 -129240 10157 323348 67832 -346120 21280 -175988
18694a1339B66729a30951J5871j81896C7494J83925A03182R8991e5848B23738
$$ -11339 266729 -130951 -115080 -296976 37494 221419 103182 202173 -55848 223738
18683c01283P7792A3776n141c75734J30212B42744f0498k78505B02454a50121
$$ -301283 -223491 13776 8635 -375734 -245522 242744 -60498 -339003 202454 -150121
18672c7423B1908Q5133b42985e0995j02766D0787i0619j2890K4982l44389F8370
$$ -37423 21908 107041 -242985 -50995 -153761 40787 -90619 -103509 -78527 -422916 68370
18660c28337A85958a82166f1435I8111J6101E4057J90414J47956a51442H6335
$$ -328337 185958 -182166 -61435 98111 114212 54057 244471 392427 -151442 86335
18649c0367n1080A40364L6720J983G6220C7474c24100g2404j22811e9060I0088
$$ -30367 -81447 140364 177084 179067 76220 37474 -324100 -72404 -195215 -59060 90088
18637h7666B72536e030k08416a4542m25609a11572A284J916K9666M9970j3776
$$ -87666 272536 -5030 -213446 -14542 -440151 -111572 1284 3200 32866 82836 69060
18626F9060O9952b7326R236r8873D5666a92288c3215H7915e1817C2498j074J59411
$$ 69060 139012 -27326 -18090 -116963 45666 -192288 -33215 87915 -51817 32498 31424 190835
18614A90835b2012k45199F2891d83029e1912H4536a39119H326e30856A07665L6667
$$ 190835 -22012 -267211 62891 -483029 -51912 84536 -139119 8326 -530856 107665 144332
18603A44332i7862l9463e0252k7854j57673K7012M6675B72615f3433j62176F1109
$$ 144332 -97862 -137325 -50252 -78106 -235779 -208767 -162092 272615 -63433 -225609 61109
18591G29b65775A63627a4737k9398j66273A2943b9367G6525b9285q250H9933g820
$$ 729 -265775 163627 -14737 -44135 -210408 12943 -29367 76525 -29285 -37535 89933 -7820
18578C5250O1762b53099o5052g3129j5544D8542O3625K90885b68660D8713a99480
$$ 35250 97012 -253099 -318151 -73129 -88673 48542 112167 403052 -268660 48713 -199480
18566b36219b7300A4170b80877N5930F7967k3308b2774A77378q3656J5077J38604
$$ -236219 -27300 14170 -280877 -224947 67967 44659 -22774 177378 93722 108799 247403
18555B47403a99660H2801b28591e8521j12790j39298A28633J9736D6792f3660
$$ 247403 -199660 82801 -228591 -58521 -171311 -310609 128633 148369 46792 -63660
18544b24026g291j49153e9054k25115H2532a62663C6939a67696A42677k7997L7048
$$ -224026 -7291 -156444 -59054 -284169 82532 -162663 36939 -167696 142677 114680 151728
18533A51728l0804e3592j9330a9484E5745e0173j17293E554K06977i2210k4008
$$ 151728 120924 -53592 -72922 -19484 55745 -50173 -167466 5554 212531 -92210 -116218
18522a16218p144K5848M4716k00162f193k3864j89721h8417r8203B4666b0371
$$ -116218 -123362 -97514 -52798 -252960 -6193 -30057 -219778 -88417 -186620 24666 -20371
18510d590B43939B8407e1279B70542b86496k65975a14460l3860B3535K85900A44652
$$ -4590 243939 28407 -51279 270542 -286496 -552471 -114460 -148320 23535 309435 144652
18498A11665b53611K8032d1123l0139j09734E8736c09125f8727A51948a47278
$$ 111665 -253611 -225579 -41123 -71262 -180996 58736 -309125 -68727 151948 -147278
18487a84529e1413K0462j65871q335q8104b2830A00629h1921A5073a77045A60606
$$ -184529 -51413 -30951 -196822 -205157 -293261 -22830 100629 -81921 15073 -177045 160606
18475a69302D76346A01389a80083D2029g738k09124M1298I6240L1890c40767G6974
$$ -169302 476346 101389 -180083 42029 -7738 -216862 -175564 96240 128130 -340767 76974
18463b32715F2852a74063A68181D7539g1205H8100k4678d06366D04197a40323
$$ -232715 62852 -174063 168181 47539 -71205 88100 63422 -406366 404197 -140323
18452A37488i8441p2353D9447O3261i3502D7338e2988R488B88598E0968b7749
$$ 137488 -98441 -170794 49447 112708 -93502 47338 -52988 -43500 288598 50968 -27749
18440b35797J02705F0058f3904m92450a89873Q2655B6951a134q4001j99652C5577
$$ -235797 -133092 60058 -63904 -556354 -189873 -107218 26951 -1134 -85135 -284787 35577
18428a62684d9998p3001B89103j35048D930J13358a03704A35238d5204I7995d00501
$$ -162684 -49998 -122999 289103 154055 4930 118288 -103704 135238 -45204 97995 -400501
18416a7316r8309A15226a11287o9809K0476J2506k47187f1732q8198o7438B96832
$$ -17316 -115625 115226 -111287 -181096 -160620 -148114 -395301 -61732 -149930 -217368 296832
18404B025c30412B24536d36604a04857J1743M2163A4555O5792a50512C66283A53425
$$ 2025 -330412 224536 -436604 -104857 -93114 -50951 14555 80347 -150512 366283 153425
18392f05j71511A47085f1107l48818J45447L3835c401I7025J05145a64421m7161
$$ -605 -172116 147085 -61107 -409925 -264478 -230643 -3401 97025 202170 -164421 -211582
18381b11582o8236C9601J90270F7372K2105g8321e396j46141d9827C0631J59223
$$ -211582 -279818 39601 229871 67372 89477 -78321 -5396 -151537 -49827 30631 189854
18370A89854a25126j71631j91031a57734N8472k41998O2193A04498c3395j92818
$$ 189854 -125126 -296757 -487788 -157734 -99262 -341260 -279067 104498 -33395 -226213
18360b26213P8735M6930B10362A3973J10728a37855m229K0407D0133e8450B82620
$$ -226213 -147478 -100548 210362 13973 124701 -137855 -142084 -121677 40133 -58450 282620
18348b81886A0478J69607f498o7255k53303B6217a83572Q1781L178A88906i5455
$$ -281886 10478 180085 -6498 -73753 -327056 26217 -183572 -101791 -98613 188906 -95455
18336A50194j2809b70957R2209e8373E2901a01166C7818a13736B46439A21447
$$ 150194 137385 -270957 -178748 -58373 52901 -101166 37818 -113736 246439 121447
18325d2213l4052o0420A22605a64385M5379N8350n6235A82649E7693a28239B94202
$$ -42213 -76265 -136685 122605 -164385 -119006 -60656 -116891 182649 57693 -128239 294202
18313E737b6884j42472B43590a17707m5375N7462H3869J56372D0977A5154c45996
$$ 5737 -26884 -169356 243590 -117707 -163082 -105620 83869 240241 40977 15154 -345996
18301a43210d777k93604K119B5518P8828c28946J29185c5626A03592d2419A1759
$$ -143210 -4777 -298381 -296262 25518 104346 -328946 -199761 -35626 103592 -42419 11759
18289F2508a86283g5764K1118j9595A71436J05029j12003c3832m8410E689a75279
$$ 62508 -186283 -75764 -54646 -74241 171436 276465 164462 -33832 -82242 5689 -175279
18277g6052E7262c57682J51955M4983p440M9166D2443a20605D21734r5947D2941
$$ -76052 57262 -357682 -205727 -160744 -168184 -119018 42443 -120605 421734 325787 42941
18265c1173m3974D02032H4192i5645j85505C57768H1655c5508c884I7003K36459
$$ -31173 -75147 402032 84192 -95645 -281150 357768 81655 -35508 -3884 97003 333462
18254C33462a19690C7898c84250J13547A77301a78367A46226g96H4048A4651K96734
$$ 333462 -119690 37898 -384250 -270703 177301 -178367 146226 -796 84048 14651 311385
18243C11385j51317J4916e3294B65435F9596e1641b0097B8767b00199h2503j14489
$$ 311385 160068 174984 -53294 265435 69596 -51641 -20097 28767 -200199 -82503 -196992
18232a96992j462G1764d8224C58181c09315a1399j27898A26427a88233p3190A2744
$$ -196992 -198454 71764 -48224 358181 -309315 -11399 -139297 126427 -188233 -261423 12744
18220I2487d07482J31722a01850A41178g4509A08085J60792m3013M1186i3031
$$ 92487 -407482 -275760 -101850 141178 -74509 108085 268877 225864 267050 -93031
18209h3947D5521a12070C51613H6901L4890c10043A48600O7760c65094A10998
$$ -83947 45521 -112070 351613 86901 121791 -310043 148600 216360 -365094 110998
18198a80856e7496j69700I93i5559A58219f9687K9993H8571e16700B203d08556
$$ -180856 -57496 -227196 993 -95559 158219 -69687 -39694 88571 -516700 2203 -408556
18186a3479B3984P9866P7925m0701b26121O7488M6828a4674A71393o3146b08060
$$ -13479 23984 103850 181775 141074 -226121 -158633 -111805 -14674 171393 108247 -208060
18174b62909b1136j04384k82806f5570j21560B34094F3942K47993c01886E3679
$$ -262909 -21136 -125520 -408326 -65570 -187130 234094 63942 311935 -301886 53679
18163a5371j44526d6566o0244J384C45434G8740h6217k08979J4875B52374a31731
$$ -15371 -159897 -46566 -106810 -105426 345434 78740 -86217 -295196 -280321 252374 -131731
18151c1106r4395A84823f537k7091k50666J2807A42233C5784Q8473a88843J7377
$$ -31106 -125501 184823 -6537 -33628 -284294 -271487 142233 35784 124257 -188843 -171466
18140a71466B87399E7514M7759A3470i43m1016j77469B69672a14991J7641E4008
$$ -171466 287399 57514 105273 13470 -943 -41959 -219428 269672 -114991 -97350 54008
18128C11740A6519a72669C07914a29711J9396A80104a99745K2031e9305k73446
$$ 311740 16519 -172669 307914 -129711 -110315 180104 -199745 -177714 -59305 -332751
18118c32751J42238e9431D276a2942q3120A2624K4591i3116j19068o0744a12949
$$ -332751 -190513 -59431 4276 -12942 -96062 12624 37215 -93116 -212184 -272928 -112949
18106A03495J06296F3644a91752j67979a69307k46555d3421E5968a37529j81627
$$ 103495 209791 63644 -191752 -359731 -169307 -415862 -43421 55968 -137529 -319156
18096c19156b5443l9811l3631D3011b44987b7527k23861n6023a4760j61824d1160
$$ -319156 -25443 -65254 -98885 43011 -244987 -27527 -251388 -307411 -14760 -176584 -41160
18084B48912A1647b58675Q1410f294j33690D04753A20136n7750a93561O3945A14567
$$ 248912 11647 -258675 -177265 -6294 -139984 404753 120136 62386 -193561 -129616 114567
18072A71025a50486I8142a17202b2850j50048C98054E184h5598A46913M1397b0444
$$ 171025 -150486 98142 -117202 -22850 -172898 398054 5184 -85598 146913 188310 -20444
18060b76063j4914M8339a027k89886G8034e8761j04418C1725R0157k4022L7648
$$ -276063 -290977 -242638 -1027 -290913 78034 -58761 -163179 31725 121882 97860 135508
18049A35508c54274C37614B176J69824F9166J48867A04673a19154q3448J7208
$$ 135508 -354274 337614 2176 172000 69166 218033 104673 -119154 -202602 -185394
18039a85394O8079C20786b40807C09039F2722b92619J21782o809f7787j67143
$$ -185394 -117315 320786 -240807 309039 62722 -292619 -170837 -177646 -67787 -234930
18029b34930a4750J68j9081j04164H0207b4489k3572A58315L27976a39827D2070
$$ -234930 -14750 -14582 -33663 -137827 80207 -24489 -48061 158315 486291 -139827 42070
18017B85529a1260B62664D8425K0832d24668C2919r498J03192A7384N6192K40203
$$ 285529 -11260 262664 48425 69257 -424668 32919 23421 126613 17384 73576 313779
18006C13779d80534h2984p6252I9618D0029K69862H2502a79497L7745K7583j0346
$$ 313779 -480534 -82984 -159236 99618 40029 309891 82502 -179497 -141752 -114169 -124515
17995a24515D6443b72727e2533j43205A14006A7197b00770i9937j54411a14335
$$ -124515 46443 -272727 -52533 -195738 114006 17197 -200770 -99937 -254348 -114335
17984a50578p9567R9229N8053A34368a7307k7479D2517b38601i3291K663E6870
$$ -150578 -230145 -130916 -72863 134368 -17307 -44786 42517 -238601 -93291 -90628 56870
17972A2695e5783m723b9210j3257a8134B6815K62863a68435k285n4826a06771
$$ 12695 -55783 -60506 -29210 -42467 -18134 26815 289678 -168435 -170720 -225546 -106771
17960f445A71671e2340B93330a09809C6721a765k50505M8706F5986j6179c3995
$$ -6445 171671 -52340 293330 -109809 36721 -1765 -252270 -203564 65986 49807 -33995
17948b14181A1709Q3567j2615i0624K1577A33159h098A89542b68535i4287C6093
$$ -214181 11709 95276 82661 -90624 -69047 133159 -8098 189542 -268535 -94287 36093
17936G4585O870h670E3964B546a65004B7548i1987b0149C40889A02803l6210k0984
$$ 74585 81455 -8670 53964 2546 -165004 27548 -91987 -20149 340889 102803 66593 45609
17924D5609b8082o5911C3025a74203B78488B0207O6104N9574F8853J6761K06935
$$ 45609 -28082 -93993 33025 -174203 278488 20207 86311 145885 68853 85614 292549
17913B92549r7744I4217b91745N7709d1971A32831a62324L2612I2991a48692P0707
$$ 292549 194805 94217 -291745 -234036 -41971 132831 -162324 -129712 92991 -148692 -77985
17902g7985q8207B12273B9805L4882a10472m8588k24947B70571a69940a4556l1571
$$ -77985 -166192 212273 29805 64687 -110472 -159060 -384007 270571 -169940 -14556 -46127
17891d6127H1049C440J1904b457j8912l29044g9212j05689A03240f4132K9143
$$ -46127 81049 3440 15344 -2457 -21369 -350413 -79212 -184901 103240 -64132 -34989
17880c4989D89224j45540e60033C2369a31088k7537C1548C033h9011k12107a3254
$$ -34989 489224 343684 -560033 32369 -131088 -158625 31548 3033 -89011 -301118 -13254
17868d4646J6705A69450a87206A88581L7740h2406E0810J8278A3919L6027d9378
$$ -44646 -27941 169450 -187206 188581 226321 -82406 50810 69088 13919 49946 -49378
17856b83185A98800a75586B90992D6389K54851j43138M18342c10113e106G077
$$ -283185 198800 -175586 290992 46389 301240 158102 576444 -310113 -5106 7077
17845A26255K55897a81046B14474d294l07163b3124E57545m2048A57393h1556
$$ 126255 382152 -181046 214474 -4294 -311457 -23124 557545 515497 157393 -81556
17834E9153a71082B24971a0239j34198q4343j1263H6860a87584i2000k58808a54831
$$ 59153 -171082 224971 -10239 -144437 -228780 -240043 86860 -187584 -92000 -350808 -154831
17822A61470K9479b70442O6797c7352o4706o4907A24148N9548a83619B01583b99438
$$ 161470 190949 -270442 -203645 -37352 -102058 -166965 124148 183696 -183619 201583 -299438
17810D7805c9815A9199b00485R6456k647r0178M9190m661C299e3703f357E80119
$$ 47805 -39815 19199 -200485 -104029 -106676 -196854 -147664 -152325 3299 -53703 -6357 580119
17797a76795b3548j51070j88965B24884F6503C1933o415P358K10274q7158d8506
$$ -176795 -23548 -174618 -363583 224884 66503 31933 25518 32876 243150 155992 -48506
17785a81463E1478d7612j68026A64532F5654a78084A5018K1287c63201J46446
$$ -181463 51478 -47612 -215638 164532 65654 -178084 15018 36305 -363201 -216755
17775b16755o8366A29231a88821A26478a19587B07845G8271b6062a0313r3761
$$ -216755 -285121 129231 -188821 126478 -119587 207845 78271 -26062 -10313 -104074
17765a04074B47859a39844A68995J66513A02331m1463f6165A96958d5620D7760
$$ -104074 247859 -139844 168995 335508 102331 60868 -66165 196958 -45620 47760
17754b70799A7347J1567b74972g8993j2552A42113c59131H0103J86640I5326O5399
$$ -270799 17347 28914 -274972 -78993 -91545 142113 -359131 80103 266743 95326 160725
17743A60725a72316A61137a96224i44k82215A29656b02001R7387k32500A88825
$$ 160725 -172316 161137 -196224 -944 -283159 129656 -202001 -104614 -337114 188825
17732H1010J74370J20424b29633Q9442A04129a96386B52205J64563a11989n9698
$$ 81010 255380 375804 -229633 -140191 104129 -196386 252205 416768 -111989 -171687
17722a71687A46058l827a53479M5697C9242i8706f220H3556j8487L3134A1975
$$ -171687 146058 142231 -153479 -107782 39242 -98706 -6220 83556 65069 98203 11975
17710A96342c11776A66683J89163D1551a20797B77684b21607C812P063J06399
$$ 196342 -311776 166683 355846 41551 -120797 277684 -221607 3812 10875 117274
17700A17274g7821A6585c29698j54416B28805E88h1152D91007b70589f2868A96241
$$ 117274 -77821 16585 -329698 -484114 228805 588 -81152 491007 -270589 -62868 196241
17688E9582b64652J12815k37654B7667R19M9366J31120F9620K0505a85434M5881
$$ 59582 -264652 -151837 -389491 27667 28586 77952 209072 69620 90125 -185434 -139553
17677a39553J6220n4318A7862J12532b55901c3552j33322q9200K201b0492I9858
$$ -139553 -123333 -177651 17862 130394 -255901 -33552 -166874 -256074 -253873 -20492 99858
17665I9562b24220j51798I9405a79067j1658B16317d5328k74597h7287H0178R204
$$ 99562 -224220 -376018 99405 -179067 -190725 216317 -45328 -319925 -87287 80178 89382
17654H9382a51196A95371J04434a52778B17821E4010Q9207m9291K78300j04257
$$ 89382 -151196 195371 299805 -152778 217821 54010 143217 93926 372226 267969
17644B67969A27306d3165a3455A08179k8492J06660f4065A80429d0260l3041E7609
$$ 267969 127306 -43165 -13455 108179 79687 186347 -64065 180429 -40260 -73301 57609
17632E7291M6996a27004A79309o4881m8100J49336p9069k3204J78071P1592I6189
$$ 57291 104287 -127004 179309 114428 66328 215664 136595 113391 291462 363054 96189
17620A66982b31158F6281J69168a93423C75392d2161R132C56121i816G8070L5153
$$ 166982 -231158 66281 235449 -193423 375392 -42161 -33029 356121 -9816 78070 113223
17609A13223E2683j9793K23016j09040c28515a47035C46375g9345B55145j11610
$$ 113223 52683 32890 255906 146866 -328515 -147035 346375 -79345 255145 143535
17599A43535j3261a44820B38682J61966b98234e365p806C0053N9887m684c1207
$$ 143535 130274 -144820 238682 400648 -298234 -5365 -13171 30053 89940 85256 -31207
17587A40660a04588A23719l3327J32620a34903B55133b4605D0736J49245K3377
$$ 140660 -104588 123719 90392 223012 -134903 255133 -24605 40736 189981 213358
17577B13358i5818B9203c3924m415p3179D82818A30025D4114L7203L3097b14495
$$ 213358 -95818 29203 -33924 -38339 -111518 482818 130025 44114 81317 114414 -214495
17565f7271p37B04044c80415A32014a02065E4701f9965L3554A48252i7312c9520
$$ -67271 -68008 204044 -380415 132014 -102065 54701 -69965 -36411 148252 -97312 -39520
17553d07728a63524I2540h4695K5926A91119b73382A57184B5670a25540B5464
$$ -407728 -163524 92540 -84695 -58769 191119 -273382 157184 25670 -125540 25464
17542H6548K25216j46110N2058l6805K8096A5588b62560B28096e5022D01064r7907
$$ 86548 311764 165654 217712 180907 209003 15588 -262560 228096 -55022 401064 303157
17531C03157d9165C09953a9213H9975J24424H7884J57465C2282o736K92185G0177
$$ 303157 -49165 309953 -19213 89975 214399 87884 245349 32282 25546 317731 70177
17519b1336I2303K50186C5029F824J43066n7273a93503A63103a22277B89482N0857
$$ -21336 92303 342489 35029 6824 149890 92617 -193503 163103 -122277 289482 340339
17508C40339p6416c1296C3414P5316D9523a04187A12600k6912O4523G950b20780
$$ 340339 263923 -31296 33414 108730 49523 -104187 112600 85688 150211 7950 -220780
17496C5922i1124C81427j84882H7449J84132N9422j33811F5830g0699b6928B62549
$$ 35922 -91124 381427 196545 87449 271581 331003 197192 65830 -70699 -26928 262549
17484a33321A75149i03C39221a47328A72710J12249a41400C2717N2840a27460
$$ -133321 175149 -903 339221 -147328 172710 284959 -141400 32717 85557 -127460
17473D41547E3224P2543L70722a07236A01112B9083N9731a85409D7439O5870E503
$$ 441547 53224 125767 496489 -107236 101112 29083 88814 -185409 47439 113309 5503
17461D3375J10679N5746J7300m1908G0381J46964o1744J30756b1445B62367o6169
$$ 43375 154054 209800 227100 185192 70381 217345 155601 286357 -21445 262367 196198
17450A96198K32348j37770L1883J05452m2134M1465A29103K13037I9914K50873
$$ 196198 428546 290776 322659 428111 385977 427442 129103 342140 99914 350787
17440C50787q8282m2249I3599d5222D39178j51306K74430k115j29835k2054I3726
$$ 350787 262505 220256 93599 -45222 439178 287872 562302 560187 430352 408298 93726
17428A43609J70562j35748J6458h811F35255B84758O9651j67912J24846i1102
$$ 143609 314171 178423 194881 -8811 635255 284758 354409 186497 311343 -91102
17417A69774J06751R9392C56K12899J10698a04528A43943k1232J79093G0966K5758
$$ 169774 276525 375917 356 213255 323953 -104528 143943 122711 301804 70966 96724
17406I6724B6517J53752b95284C32640A46872m8572k8210J50786j6553I900Q6381
$$ 96724 26517 180269 -295284 332640 146872 98300 70090 220876 204323 9900 96281
17395I6281K16755A03135j1946J04740q8254K0316B7968P055O00483A16127K32927
$$ 96281 313036 103135 91189 195929 107675 127991 27968 35023 635506 116127 349054
17384C49054A64663K48652A77108B5127J48229Q7455g0837A19035E3280J19839
$$ 349054 164663 413315 177108 25127 173356 260811 -70837 119035 53280 173119
17374A73119L10475L3327D8281G679J46317C4928Q0324b02049d7901r3689F8551
$$ 173119 483594 516921 48281 7679 153996 34928 115252 -202049 -47901 -141590 68551
17362B80205k0346A14261J9601L58152A35269J0138a50285C15992J7550j52024
$$ 280205 259859 114261 133862 492014 135269 145407 -150285 315992 333542 181518
17352A81518q7258J1181a77982A20794B5030J48955D2150K03032J21051c60582
$$ 181518 94260 105441 -177982 120794 25030 173985 42150 245182 366233 -360582
17341C29298m7604O1916A53671J67526B5368O9285e080B8420P7139m4568a68313
$$ 329298 281694 343610 153671 321197 25368 94653 -5080 28420 105559 60991 -168313
17329a02543C10190F3008e2863D9595a22222B51107A08277k7677C3488Q3554M5151
$$ -102543 310190 63008 -52863 49595 -122222 251107 108277 80600 33488 117042 162193
17318A62193l0984O3779L13546h4320D34679B07926q984J6658P3590j20819m1495
$$ 162193 131209 194988 508534 -84320 434679 207926 198942 215600 289190 168371 126876
17307A26876r923J73047o6086J68256A33653m9989a32931C24178l4216f3865B21883
$$ 126876 116953 290000 223914 392170 133653 83664 -132931 324178 289962 -63865 221883
17295C17477A48583J29657o0537o9368J36901H6264Q9745o7840J27310K1493G3498
$$ 317477 148583 278240 217703 148335 285236 86264 176009 108169 235479 256972 73498
17283a63195e3205D23666k06549g6097B04742Q2154g0812j15473B00532i9370
$$ -163195 -53205 423666 217117 -76097 204742 286896 -70812 -186285 200532 -99370
17272B60568c3455C70800j02016L29033B7705b2725A66188M00078n2921I2479
$$ 260568 -33455 370800 268784 597817 27705 -22725 166188 566266 513345 92479
17261c1173A45829L9235J02540n585M5420L754A5910K1252K49448J4094a677l01485
$$ -31173 145829 185064 287604 282019 327439 331193 15910 37162 286610 300704 -1677 -303162
17249c03162A62986o5779B8393d6842C72086j46519O3689j07097q8481K942j9649
$$ -303162 162986 97207 28393 -46842 372086 225567 289256 182159 93678 96620 76971
17238G6971g2649H7828c0152B30993L8545J00847j22841C2235R7158o2918J64097
$$ 76971 -72649 87828 -30152 230993 269538 370385 247544 32235 129393 66475 230572
17227B30572F5721k0692K72813j0934a1242D82234A61934M3664b39025J04825
$$ 230572 65721 45029 317842 306908 -11242 482234 161934 205598 -239025 -134200
17217a34200H8740K15688r6236m2219j6470L55815k17225K30622A20465C8840
$$ -134200 88740 304428 208192 165973 149503 505318 288093 518715 120465 38840
17206B03741m6371J74734e3760A98502q6441J44354o3650k0844L6357L7773k5457
$$ 203741 157370 332104 -53760 198502 112061 256415 192765 171921 208278 246051 220594
17195B20594K07935Q3769k32768P4963k4559P2642R8602j00961j15260J20697
$$ 220594 428529 512298 279530 354493 329934 402576 501178 400217 284957 405654
17185D05654L56012A21042K85308P2841k04016R0558q6569I2524J23749L47789
$$ 405654 761666 121042 406350 479191 275175 365733 279164 92524 216273 564062
17175E64062j52542K05656M8784j09244j20074j43660J39551j52606K90449j72401
$$ 564062 411520 617176 665960 556716 436642 292982 432533 279927 570376 397975
17165C97975n4649o3005G9566K33717m5169N51586C1525M52577B35544J17443
$$ 397975 343326 280321 79566 313283 268114 819700 31525 484102 235544 352987
17155C52987j16137J93144A41767L16699A26981L3917N8766J18835f9835E22480
$$ 352987 236850 429994 141767 458466 126981 160898 219664 338499 -69835 522480
17144B98624A21545L50099K82591k81210r8270L34598B01068J07098J81898A66555
$$ 298624 121545 471644 754235 473025 374755 709353 201068 308166 490064 166555
17133D33714h3535C98030J21944j16229J07254J08501j64092j04368p0772L0103
$$ 433714 -83535 398030 519974 403745 510999 619500 455408 351040 280268 310371
17123C10371L1535g3099B72709J1568L29338j48565Q8004j66574L2455A84759
$$ 310371 341906 -73099 272709 284277 613615 465050 553054 386480 418935 184759
17112B73352M25068k48759K13057B60229m5123M13644j14352I2974K08454L27312
$$ 273352 698420 449661 662718 260229 215106 628750 514398 92974 301428 628740
17102F28740j79694F5864P1225J45164L20140j45052A28621M20464j40705L09992
$$ 628740 449046 65864 137089 282253 602393 457341 128621 549085 408380 718372
17092G18372l46657q990J0530p2111m9786R4809J60694M8818k64331I6563N07522
$$ 718372 371715 362725 373255 301144 251358 346167 506861 555679 291348 96563 604085
17081F04085L0587n7567k15879Q0030m5901J11892o6458K62426l50891J86018
$$ 604085 634672 577105 361226 441256 395355 507247 440789 703215 352324 538342
17071E38342k2587J65305C31910J11919K12679l04046M9563J76396B05321K7049
$$ 538342 515755 681060 331910 443829 656508 352462 402025 578421 205321 232370
17061B32370M13346k10470O2367k16423L48448B99296N72389k30728O4255k67245
$$ 232370 645716 435246 497613 281190 629638 299296 871685 640957 705212 437967
17051D37967L06839j07077B71391R4037Q0875O9022J06480J14370k44218P5564
$$ 437967 744806 637729 271391 365428 446303 515325 621805 736175 491957 567521
17041E67521p0428o9342K75850B96707K87831J06838R0779k0373j90498M0137
$$ 567521 497093 427751 703601 296707 584538 691376 782155 761782 571284 611421
17031F11421J20558k02725k28393N3559K53076K41271l21804j02773J55536N8921
$$ 611421 731979 529254 300861 354420 607496 848767 526963 424190 579726 638647
17021F38647k78684L25172j24453B77579O41005k14706k83477L17526k38130L10480
$$ 638647 359963 685135 560682 277579 918584 703878 420401 737927 499797 810277
17011H10277k25564J60925J52108l84658J17174o4068P31185E94433J90999K84218
$$ 810277 584713 745638 897746 513088 630262 566194 1297379 594433 785432 1069650
17001A069650r0648l03693j13276L38326m24259J30106O6043O2845J61490q3587
$$ 1069650 979002 675309 562033 900359 476100 606206 672249 735094 896584 812997
16991H12997L3245k7168J27941k76584L70836k88804j69062L68313N7222o4503
$$ 812997 846242 819074 947015 670431 1041267 752463 583401 951714 1008936 944433
16981I44433K623J98046l57204K51040k67316K90179l09847R9391K4246l7653
$$ 944433 947056 1145102 787898 1038938 771622 1061801 751954 851345 875591 837938
16971H37938k54819M0428L53658M9098J4306r243k59865J80047J34304l7144l31209
$$ 837938 583119 623547 977205 1026303 1040609 1031366 771501 951548 1085852 1048708 717499
16960G17499N07664Q562l28708k75742K44975M38825l42445n7476L33740j74233
$$ 717499 1225163 1233725 905017 629275 874250 1313075 970630 913154 1246894 1072661
16950A072661n2140o9854R0556J77403l4335k76513J31727L15916k27958O3091
$$ 1072661 1020521 950667 1041223 1218626 1184291 907778 1039505 1355421 1127463 1190554
16940A190554K12767q6417J26929m74359K22700L52109m01106J99897p4540K24740
$$ 1190554 1403321 1316904 1443833 969474 1192174 1544283 1143177 1343074 1268534 1493274
16930A493274l7102k14676r7388J45396K40371J3289k72043l6547M10696l05943
$$ 1493274 1456172 1241496 1144108 1289504 1529875 1543164 1271121 1234574 1645270 1339327
16920A339327q1713K71187J38055J28826m58284p1700J48669N58601k80621l01823
$$ 1339327 1257614 1528801 1666856 1795682 1337398 1265698 1414367 1972968 1692347 1390524
16910A390524K62284j95231K65957j87227L41127o44096M74023M51729o87192
$$ 1390524 1652808 1457577 1723534 1536307 1877434 1233338 1707361 2159090 1471898
16901A471898K58253J42001j03394K40827k23786k15727J85348o3446K77145k8059
$$ 1471898 1730151 1872152 1768758 2009585 1785799 1570072 1755420 1691974 1969119 1941060
16891A941060l33129J98019M61152k75853M83943l71696k04533J96108K18915
$$ 1941060 1607931 1805950 2267102 1991249 2475192 2103496 1898963 2095071 2313986
16882B313986j37571j80246p8081L55348K15414l36171J65461j91285L12817k12682
$$ 2313986 2176415 1996169 1918088 2273436 2488850 2152679 2318140 2126855 2439672 2226990
16872B226990L13611K00958k04039k88945O44076j65227J19191k11789K78191
$$ 2226990 2540601 2741559 2537520 2248575 2892651 2727424 2846615 2634826 2913017
16863B913017j18279J88809J92961k02368q2970j42895J96801j67437Q0556J21694
$$ 2913017 2794738 2983547 3176508 2974140 2891170 2748275 2945076 2777639 2858195 2979889
16853B979889R7216j14767N58548p4570J49442L9863l40840J78725l5872n7845
$$ 2979889 3077105 2962338 3520886 3446316 3595758 3635621 3294781 3473506 3437634 3379789
16843C379789m1449M10921o2342M63860k87062m1208M08815N3005k02358J05164
$$ 3379789 3338340 3749261 3686919 4150779 3863717 3822509 4231324 4284329 4081971 4187135
16833D187135L93809J05834r9199J91120m05307J31680L75700K09371N5505P4004
$$ 4187135 4580944 4686778 4587579 4778699 4373392 4505072 4880772 5090143 5145648 5219652
16823E219652k8238n818K16960K08695O4448K79465r4201j31083K51627K08990
$$ 5219652 5191414 5185596 5402556 5611251 5675699 5955164 5860963 5729880 5981507 6190497
16813F190497J12001j51454L19631K94172O9077k753J3175K07141K12052J251
$$ 6190497 6302498 6151044 6470675 6764847 6833924 6831171 6844346 7051487 7263539 7264790
16803G264790M50757P2409P0385N78656K02158j87995M28810J61955P2060L95702
$$ 7264790 7715547 7787956 7858341 8436997 8639155 8451160 8879970 9041925 9113985 9509687
16793I509687K24304M69942K18974L24639m8061J16635O07686N8909L84948N55433
$$ 9509687 9733991 10203933 10422907 10747546 10699485 10816120 11423806 11482715 11867663 12423096
16783A2423096k11741M64389P78803J01275J60713O54207Q53653N3564K42432
$$ 12423096 12211355 12675744 13454547 13555822 13716535 14370742 15224395 15277959 15520391
16774A5520391O65979L97548P33221R65875M45764J42305J049192O67227Q76960
$$ 15520391 16186370 16583918 17317139 18283014 18728778 18871083 19920275 20587502 21464462
16765B1464462Q00193P25442N42675J275637J023318J010059R95996J019882J361285
$$ 21464462 22264655 22990097 23532772 24808409 25831727 26841786 27837782 28857664 30218949
16756C0218949J318846J427442J333745J738653J436818J518200K255487J764283
$$ 30218949 31537795 32965237 34298982 36037635 37474453 38992653 41248140 43012423
16748D3012423K515075J900092K238009K967773K635339K825066K923107L675787
$$ 43012423 45527498 47427590 49665599 52633372 55268711 58093777 61016884 64692671
16740F4692671L451595M235247L962577L915435M764627N144293N263690N633060
$$ 64692671 68144266 72379513 76342090 80257525 85022152 90166445 95430135 101063195
16732A01063195N965834O500888O704976O663424P368823P110602P217564P355118
$$ 101063195 107029029 113529917 120234893 126898317 134267140 141377742 148595306 155950424
16724A55950424P529948O975997O702920N905310N468342M035566L323839K271092
$$ 155950424 163480372 170456369 177159289 183064599 188532941 192568507 195892346 198163438
16716A98163438N44730n15249j544744l256363m140010n252638n785791o682632
$$ 198163438 198708168 198192919 196648175 193391812 189251802 183999164 178213373 171530741
16708A71530741p308238p084899p868675p378500p638634p175725p001988o502052
$$ 171530741 164222503 157137604 149268929 141890429 134251795 127076070 120074082 113572030
16700A13572030o804687o024755n727150n680445n376895m440826m763845l819120
$$ 113572030 106767343 100742588 95015438 89334993 83958098 79517272 74753427 70934307
16692G0934307m169567l465971l234868l182525l065774l013274k403778k392631
$$ 70934307 66764740 63298769 60063901 56881376 53815602 50802328 48398550 46005919
16684D6005919k548791j938190j867566k005434j590183j511469j573362j406239
$$ 46005919 43457128 41518938 39651372 37645938 36055755 34544286 32970924 31564685
16676C1564685j345141r30360j972168o71190j157812j356405n80659r03842q70149
$$ 31564685 30219544 29289184 27317016 26645826 25488014 24131609 23550950 22647108 21776959
16667B1776959q67901q55412j03706j163511o45796o09753n83384o19563l62471
$$ 21776959 20909058 20053646 19949940 18786429 18140633 17530880 16947496 16327933 15965462
16658A5965462k92713j295913k0121j91480k97423j141628k13086r0454k72604
$$ 15965462 15672749 14376836 14356715 14165235 13867812 12726184 12513098 12422644 12150040
16649A2150040j83359m70305n51163m05390l62402l41521k83l89895r8545k7108
$$ 12150040 11966681 11496376 10945213 10539823 10177421 9835900 9835617 9445722 9347177 9320069
16639I320069n39658l27572k4549r7772m60718r2586m41430J99905j11400k62711
$$ 9320069 8780411 8452839 8428290 8330518 7869800 7777214 7335784 7535689 7424289 7161578
16629G161578n21115Q472j53745j68073j23062J04566l74885n7954k0330j69354
$$ 7161578 6640463 6648935 6495190 6327117 6204055 6308621 5933736 5875782 5855452 5686098
16619E686098o1105m94778r879K15434M1738n25066J11269j08096J6772k90711
$$ 5686098 5624993 5130215 5120336 5335770 5377508 4852442 4963711 4855615 4872387 4581676
16609D581676K17234n16148K14003l6261M3913n09832k60153L16375l45571J11368
$$ 4581676 4798910 4282762 4496765 4460504 4504417 3994585 3734432 4050807 3705236 3816604
16599C816604K9907k97598L93392n36162l0254P8163J43526j39144r324r0150
$$ 3816604 3846511 3548913 3942305 3406143 3375889 3454052 3597578 3458434 3449110 3358960
16589C358960l45789K22851j00467k65513L83912k28416k54886j14499n7935k37365
$$ 3358960 3013171 3236022 3135555 2870042 3253954 3025538 2770652 2656153 2598218 2360853
16579B360853M56323k34138N5275r2982L3817j36011R4200j38952K95026k57469
$$ 2360853 2817176 2583038 2638313 2545331 2579148 2443137 2537337 2398385 2693411 2435942
16569B435942K10742j61295j34340k44097L38548k19639k31962p6765K11891P0685
$$ 2435942 2646684 2485389 2351049 2106952 2445500 2225861 1993899 1917134 2129025 2199710
16559B199710j66014q6261m91216N53145O5706J11058j84036k16847J94645J36065
$$ 2199710 2033696 1947435 1456219 2009364 2075070 2186128 2002092 1785245 1979890 2115955
16549B115955n27551L23407J34601k10538j83986Q5103k17166j89999R6487M01507
$$ 2115955 1588404 1911811 2046412 1835874 1651888 1736991 1519825 1329826 1426313 1827820
16539A827820k86991j04057j20412L19655k41795K95349m24232L58301q7346J03572
$$ 1827820 1540829 1436772 1316360 1636015 1394220 1689569 1265337 1623638 1536292 1639864
16529A639864m51540L2970K37153k97962J33171j60404J36949o0049L02318k62385
$$ 1639864 1188324 1221294 1458447 1160485 1293656 1133252 1270201 1210152 1512470 1250085
16519A250085J9703L49064m70911o8965J64263q054k21704N500j1865K9045K70361
$$ 1250085 1269788 1618852 1147941 1078976 1243239 1235185 1013481 1018981 1007116 1036161 1306522
16508A306522k04609J23633l47485j91554N54382m51639O29667K094l38002j10782
$$ 1306522 1101913 1225546 878061 686507 1240889 789250 1418917 1421011 1083009 972227
16498I72227n4825J98351K14985l68573p4331L8658k55189K19102K20825k96257
$$ 972227 917402 1115753 1330738 962165 887834 926492 671303 890405 1111230 814973
16488H14973J85324l7264j97766K88548m0039K31562j56112k77103J65778l27061
$$ 814973 1000297 963033 765267 1053815 1013776 1245338 1089226 812123 977901 650840
16478F50840R1600K59477k67452J5392K55769k98378q3364L83230J8456l22823
$$ 650840 742440 1001917 734465 749857 1005626 707248 623884 1007114 1025570 702747
16468G02747J4624J39092j7354q3785J90879O6609l93361P0496J0742P5514k51804
$$ 702747 717371 856463 839109 755324 946203 1012812 619451 689947 700689 776203 524399
16457E24399J99293k0748j04661p1185Q3000K06840m01685M69310l10668P1909
$$ 524399 723692 702944 598283 527098 610098 816938 415253 884563 573895 645804
16447F45804o3915R2684p8481K10228l68069k223K06359Q7409k68653M7952J34729
$$ 645804 581889 674573 596092 806320 438251 436028 642387 729796 461143 509095 643824
16436F43824P3412j53530L575K76197l29804J60459M4637k95702L7236J84712
$$ 643824 717236 563706 567281 843478 513674 674133 718770 423068 460304 645016
16426F45016J732J03654j86287B47744J74701o2079K91096j38860j05423k1122
$$ 645016 646748 750402 564115 247744 422445 360366 651462 512602 407179 386057
16416C86057p5414M83384k38394J22995B08908L91846q9728j34102j25911N5883
$$ 386057 310643 794027 555633 678628 208908 600754 511026 376924 251013 306896
16406C06896J19146K65645l19289J00919N10565D19368M33636l54500j39293J56857
$$ 306896 426042 691687 372398 473317 983882 419368 853004 498504 359211 516068
16396E16068O6241L8556A48566M82855o9610j32421K26087k73859P5352K42386
$$ 516068 582309 620865 148566 631421 561811 429390 655477 381618 456970 699356
16386F99356r3078D5539M00000j34639L25115k16042b1649D31067K24958k23952
$$ 699356 606278 45539 445539 310900 636015 419973 -21649 431067 656025 432073
16376D32073k1251l7654Q6058k170k7397A25943J09836J46412j28739K82488J6382
$$ 432073 410822 373168 459226 457056 429659 125943 235779 382191 253452 535940 552322
16365E52322J14442l10068A11795L35777A36957Q0489E6173l259N08328J20359
$$ 552322 666764 356696 111795 447572 136957 217446 56173 52914 561242 681601
16355F81601A63712L96214j43377L01035l27719j11584L1379A45377K77025k03454
$$ 681601 163712 559926 416549 717584 389865 278281 309660 145377 422402 218948
16345B18948R622J79642A25034K7645J89549R5739j02346r6045Q8814P3945j75785
$$ 218948 228570 408212 125034 152679 342228 437967 335621 239576 328390 402335 226550
16334B26550M28680B50103K83261j86696J40957B21840L21604q344B13220K25595
$$ 226550 655230 250103 533364 346668 487625 221840 543444 535100 213220 438815
16324D38815O448r9352R7939j16182k6747k056J43759B20560r0855R7667o0399
$$ 438815 445263 345911 443850 327668 300921 298865 442624 220560 129705 227372 166973
16313A66973L26310j00334a43729H9850C681K00315P9952A20720m0141J10801
$$ 166973 493283 392949 -143729 89850 3681 203996 283948 120720 80579 191380
16303A91380C203a17752h321H1511C0158a24669A53695L962J11828P0120E6553
$$ 191380 3203 -117752 -8321 81511 30158 -124669 153695 157657 269485 339605 56553
16291C43499e5122A195K92255J49492I3659K14605o633D4527i6672B25898F1892
$$ 343499 -55122 1195 293450 442942 93659 308264 301631 44527 -96672 225898 61892
16279B72689j16985J20743J39696q7171l5100J15810A60202F3191J85484J03081
$$ 272689 155704 276447 416143 328972 293872 409682 160202 63191 248675 351756
16269C51756n2891a22199B33784m1315p5719N1683J07268Q5696C7514J03861J45058
$$ 351756 298865 -122199 233784 192469 116750 168433 275701 361397 37514 141375 286433
16258B86433r8637f3795J8336C0217L49359A82607K13158A09636J5329j3264l2111
$$ 286433 187796 -63795 -45459 30217 379576 182607 395765 109636 124965 111701 79590
16247G9590J45748o7345K80071j71247P8718k4441m3039a2011B82227p4219J68890
$$ 79590 225338 157993 438064 266817 345535 321094 278055 -12011 282227 208008 376898
16236C76898m7398a61139L7072F1258K81691H6454J33013p7096J8320J99101b9134
$$ 376898 329500 -161139 -124067 61258 342949 86454 219467 142371 160691 359792 -29134
16224f3196D8904a19979E7225O7086J37668c2529A74869H3705J69375a60435B02835
$$ -63196 48904 -119979 57225 124311 261979 -32529 174869 83705 253080 -160435 202835
16212h3257A5682a72852e8580B33122M2162k6037b06513A42724J05220K04235
$$ -83257 15682 -172852 -58580 233122 275284 249247 -206513 142724 247944 452179
16202D52179o6838o5759J22503A23716B0657m010J25592b55466A39472a44126
$$ 452179 385341 319582 442085 123716 20657 16647 142239 -255466 139472 -144126
16191A11741l3234b8989D1744K98693C0849J41632E1310J56578a36574G3002J5206
$$ 111741 78507 -28989 41744 340437 30849 172481 51310 207888 -136574 73002 88208
16180H8208B5146K29317l3347K07594g538A25585c0252j90297o180D11157b36637
$$ 88208 25146 254463 221116 428710 -7538 125585 -30252 -220549 -226729 411157 -236637
16168b54066a12816k31402A79659j2292Q7301B1751Q7556K0471B8775N7181D0139
$$ -254066 -112816 -344218 179659 167367 254668 21751 109307 129778 28775 85956 40139
16156E45005B10650b27175i6835B26015m0204a32280A31804o3366M86584E0696
$$ 545005 210650 -227175 -96835 226015 185811 -132280 131804 68438 555022 50696
16145B340K63710b02661C53887j66293J28746A41689F6778K09454f8564m4241
$$ 2340 266050 -202661 353887 187594 316340 141689 66778 276232 -68564 -112805
16135a12805b8144c475A49794h4195l71308B19520b19827B66563L2546j2637b54745
$$ -112805 -28144 -3475 149794 -84195 -455503 219520 -219827 266563 299109 286472 -254745
16123A30705F0894b0893A75262a53888m7196B01695J43679a17341k19379B82026
$$ 130705 60894 -20893 175262 -153888 -201084 201695 345374 -117341 -336720 282026
16112A06327g3817E9563a07862A57886j1097a83742A90531O4517B3223J248I428
$$ 106327 -73817 59563 -107862 157886 146789 -183742 190531 255048 23223 24471 9428
16100A23950M3463l6327J41954G1785d1721F6055a40950C01330f9820b0358D7593
$$ 123950 167413 131086 273040 71785 -41721 66055 -140950 301330 -69820 -20358 47593
16088E5680N8650f7045r0331F2298b677o7893k56469f6091B29727J81191j59903
$$ 55680 114330 -67045 -157376 62298 -2677 -70570 -327039 -66091 229727 410918 251015
16077B51015k2550a1833j5785j25548H7971K62126a19964E7348k1153P0126b21871
$$ 251015 228465 -11833 -27618 -153166 87971 350097 -119964 57348 36195 106321 -221871
16065C43454a35146B6822J02471i9636B58571a80159Q9128A04045m7170B0353
$$ 343454 -135146 26822 129293 -99636 258571 -180159 -91031 104045 56875 20353
16054A38543P465n1714D5196I627c62637J06357h9881A8596J72986p2479O8704
$$ 138543 146008 94294 45196 9627 -362637 -256280 -89881 18596 191582 119103 187807
16043A87807k4861c55106F2954J38822f0361A46629l8824f2915j26928D0477a72123
$$ 187807 162946 -355106 62954 201776 -60361 146629 107805 -62915 -189843 40477 -172123
16031B1831b7500D3738c7788D0911r79c67014g8120n8309o3239B04517I8062a29862
$$ 21831 -27500 43738 -37788 40911 39932 -367014 -78120 -136429 -199668 204517 98062 -129862
16018g0008j08935F4831K6574J80005p9258b31267J05334N7457b5189k39312d8007
$$ -70008 -178943 64831 91405 271410 192152 -231267 -125933 -68476 -25189 -264501 -48007
16006A10327L01195j30607i1325L9060l4393o9304N1075B21474b33515k2698O9679
$$ 110327 411522 280915 -91325 -52265 -86658 -155962 -104887 221474 -233515 -256213 -186534
15995a86534B20006g5469F0424O9703D1894J04148o9579l1282f4436A40944a36367
$$ -186534 220006 -75469 60424 130127 41894 146042 76463 45181 -64436 140944 -136367
15983D4074K54023A15966a33225D57280n6005l2677n4592L0152H2390A9712P3101
$$ 44074 298097 115966 -133225 457280 401275 368598 314006 344158 82390 19712 92813
15972I2813c13970j05941A42779a96397H7240d9502A41610p0168c0957B36288
$$ 92813 -313970 -419911 142779 -196397 87240 -49502 141610 71442 -30957 236288
15961B50900E0479B0016b9549G231a34397d5443j37528I8120g4287A3757b63071
$$ 250900 50479 20016 -29549 7231 -134397 -45443 -182971 98120 -74287 13757 -263071
15949b91695i5873R656l6417A01798J1864a17598k1752I6079e6033l47089A60620
$$ -291695 -95873 -86217 -122634 101798 113662 -117598 -139350 96079 -56033 -403122 160620
15937C33219a47694j63004E3931K05366a52948G2535e60460b51798c7098a6839
$$ 333219 -147694 -310698 53931 259297 -152948 72535 -560460 -251798 -37098 -16839
15926c86967B00512c65138i9190b7743O300k1602E4888b33120A98722F9368J06740
$$ -386967 200512 -365138 -99190 -27743 -21443 -43045 54888 -233120 198722 69368 176108
15915A76108d3859m6496l31564a38220L0785A46297b57759J05915j36923k62005
$$ 176108 -43859 -90355 -421919 -138220 -107435 146297 -257759 -151844 -288767 -550772
15905e50772B76008C4345j135h8977G4404J56052a98400b3505A76299J76571d4435
$$ -550772 276008 34345 33210 -88977 74404 230456 -198400 -23505 176299 352870 -44435
15893i2974i127j50612l2743B7546R3221f936B42867A13710h8610l17064B34937
$$ -92974 -9127 -159739 -192482 27546 120767 -6936 242867 113710 -88610 -405674 234937
15881f5295A80550k9682A0349d6183l8861p0125J2498p1812b4664n9014K1355
$$ -65295 180550 150868 10349 -46183 -85044 -155169 -142671 -214483 -24664 -83678 -62323
15870f2323H3474a26288B19634C9945K26964b43068b0406j05915A03006h3886
$$ -62323 83474 -126288 219634 39945 266909 -243068 -20406 -126321 103006 -83886
15859h1863B307K05549b33060j07201K163i9217r9613h875k28328d7482A68111
$$ -81863 2307 207856 -233060 -340261 -338098 -99217 -198830 -8875 -237203 -47482 168111
15847b53757j1310c4313l04347B23233b92026A24409r603M5050b5385C7356K02497
$$ -253757 -265067 -34313 -338660 223233 -292026 124409 114806 159856 -25385 37356 239853
15836B39853a42036j46052b759j20226n5138M0930J4816j85947f8084m3337C36491
$$ 239853 -142036 -288088 -2759 -122985 -178123 -137193 -122377 -308324 -68084 -111421 336491
15824b09824d6283K0880k15913g565A25614c27555B32040b47989d1168j15174
$$ -209824 -46283 -25403 -241316 -7565 125614 -327555 232040 -247989 -41168 -156342
15814a56342j89009e4553A70735G4987J88848b57855a3562m8521n8107B66995
$$ -156342 -345351 -54553 170735 74987 263835 -257855 -13562 -62083 -120190 266995
15803E5121H015N8621a2490j47338A78990a75512A52336b01248j28370G0453d7471
$$ 55121 8015 66636 -12490 -159828 178990 -175512 152336 -201248 -329618 70453 -47471
15791A54543p552l4594L28186I20d37605A96233a60700j57823A11644J13312b69162
$$ 154543 146991 112397 440583 920 -437605 196233 -160700 -318523 111644 224956 -269162
15779B80131j30285R3724e319l40829F7192f625j30822B28585c82723A21711Q0575
$$ 280131 149846 243570 -5319 -346148 67192 -6625 -137447 228585 -382723 121711 202286
15768B02286a29839a3823k49948A5931f5236j24157e429B26487B6167c86484D03662
$$ 202286 -129839 -13823 -263771 15931 -65236 -189393 -5429 226487 26167 -386484 403662
15756C19350H0362o038j7499e58I0303a05526B3896d71961i1529A60225j1394
$$ 319350 80362 74324 56825 -558 90303 -105526 23896 -471961 -91529 160225 148831
15745A48831J60591r3117J08646b6018o1430k76438J75872D4005a89080b3424
$$ 148831 309422 216305 324951 -26018 -87448 -363886 -188014 44005 -189080 -23424
15734A62040G1931J90989B7312c13818g4675A35588a68618c4554H746b27961Q3698
$$ 162040 71931 262920 27312 -313818 -74675 135588 -168618 -34554 8746 -227961 -144263
15723a44263L2440D0837e25195B37165j03500n3339e9140p3346A8946h2916p3973
$$ -144263 -111823 40837 -525195 237165 133665 80326 -59140 -132486 18946 -82916 -156889
15712a56889F6535a91607A40909b19260p9867A41400b642j69277C35950E0101
$$ -156889 66535 -191607 140909 -219260 -299127 141400 -2642 -171919 335950 50101
15701B68438a4590k10455A30664B7718h8188j4805G6751k8516a88499K8733C11037
$$ 268438 -14590 -225045 130664 27718 -88188 -102993 76751 48235 -188499 -159766 311037
15689d82130g0500A01109J61178a40810l816n0729e9346n5404j68255h4505B08900
$$ -482130 -70500 101109 262287 -140810 -144626 -195355 -59346 -114750 -283005 -84505 208900
15677A06075a55536c5328A59316Q9506F7571N3135c2193o4454k33748A74221D5634
$$ 106075 -155536 -35328 159316 248822 67571 120706 -32193 -96647 -330395 174221 45634
15665G0278Q2517b38216j18462a36169A55448e6813D37428c10691A43410L6301
$$ 70278 152795 -238216 -356678 -136169 155448 -56813 437428 -310691 143410 179711
15655A79711g502E3204b5935A4391a77196d1709a6393E109J31144j6444b15833
$$ 179711 -7502 53204 -25935 14391 -177196 -41709 -16393 5109 136253 119809 -215833
15643b24907j03910P3533a10072E2944I116a76395A20797g7802A18585J20699
$$ -224907 -328817 -255284 -110072 52944 9116 -176395 120797 -77802 118585 239284
15633B39284d6425A974i8759C2740a88987F2942J02418J03996F3234a08093C6691
$$ 239284 -46425 1974 -98759 32740 -188987 62942 165360 269356 63234 -108093 36691
15621E87762d47789L9571A33178a06665j03609B38242g3567k4646J8681g976C17412
$$ 587762 -447789 -408218 133178 -106665 -210274 238242 -73567 -98213 -79532 -7976 317412
15609d37508A91835F4977a04859A01609J13039a52613A69864a46557k13965Q4877
$$ -437508 191835 64977 -104859 101609 214648 -152613 169864 -146557 -360522 -275645
15599b75645K0737k850G0364a37886A8359h2790a0137F6197a10097B0136M4785
$$ -275645 -254908 -257758 70364 -137886 18359 -82790 -10137 66197 -110097 20136 64921
15588F4921b55701I0886J31316R7006g3911k16491I6879D4630e4939k02496B97405
$$ 64921 -255701 90886 222202 319208 -73911 -290402 96879 44630 -54939 -257435 297405
15576G9501h9779j88648a7760O216A41662C856K7770a6740I8079a87717O4367
$$ 79501 -89779 -278427 -17760 -11544 141662 3856 31626 -16740 98079 -187717 -123350
15565a23350d6634o4567M2176K4358C15865b47013G9217J01519K94413a36444
$$ -123350 -46634 -111201 -69025 -44667 315865 -247013 79217 180736 475149 -136444
15554G3305f4020l62911a99433p7918J31015A52499e2303m6296b5115I5708N6791
$$ 73305 -64020 -426931 -199433 -277351 -146336 152499 -52303 -98599 -25115 95708 152499
15543A52499c8077a810o8520j30286B4684L35927e2840C140g3544A37882a14935
$$ 152499 -38077 -1810 -70330 -200616 24684 360611 -52840 3140 -73544 137882 -114935
15531b32048e3695j42383B37601c3480C7413J25559D1078e2396j16719J4692B40336
$$ -232048 -53695 -196078 237601 -33480 37413 162972 41078 -52396 -169115 -154423 240336
15519A8921g8339B47902a54590j87550i4873B5467M11580a15534M5252m5720i40
$$ 18921 -78339 247902 -154590 -342140 -94873 25467 437047 -115534 -70282 -116002 -940
15507a44004F9595b77521R5832q3281J11425O7940H774a90404M3567b8499B5821
$$ -144004 69595 -277521 -181689 -264970 -153545 -85605 8774 -190404 -146837 -28499 25821
15495C21928C8810J23513b27978G2638b02423E9771J28881a18651c0814A0578
$$ 321928 38810 162323 -227978 72638 -202423 59771 188652 -118651 -30814 10578
15484b16391R9762K0853C11232D9628a34210I0210c9820G2059b14448P5442A54091
$$ -216391 -116629 -95776 311232 49628 -134210 90210 -39820 72059 -214448 -139006 154091
15472i7959C27J43116N9065a69091B2209a34937e8862A12262M1053E2099a38207
$$ -97959 327 143443 202508 -169091 22209 -134937 -58862 112262 153315 52099 -138207
15460I0279a02696j19525c664A72896j3258j4826h6148B08670K53495A01885b9970
$$ 90279 -102696 -222221 -3664 172896 159638 144812 -86148 208670 462165 101885 -29970
15448c3932B33164b91720A90544N5584e9994C48287D5517a32941C1008K20530
$$ -33932 233164 -291720 190544 246128 -59994 348287 45517 -132941 31008 251538
15438B51538e8236j59143A05963a09306d2041A08522a10754e0762g073j67807
$$ 251538 -58236 -217379 105963 -109306 -42041 108522 -110754 -50762 -7073 -174880
15428a74880B96417G0545a80551p9340a15540A53800b77918i8744A9054K27288
$$ -174880 296417 70545 -180551 -259891 -115540 153800 -277918 -98744 19054 246342
15418B46342d0614j82416R5152G4053f0154I9121l6001N1427L1312a3923q7338
$$ 246342 -40614 -223030 -127878 74053 -60154 99121 63120 114547 145859 -13923 -101261
15407a01261F2131J22584B1339p213P988J46042O0765a36760O0146E2175b5969
$$ -101261 62131 184715 21339 14126 22114 168156 228921 -136760 -76614 52175 -25969
15395a19002B50125n8928M205I1457P3613i5969K7050G1491c14099A74867a96912
$$ -119002 250125 191197 195402 91457 165070 -95969 -68919 71491 -314099 174867 -196912
15383g3753L0822j26197j3927O718C50992A42343b00387B652d3558j84049c5069
$$ -73753 -42931 -169128 -183055 -176337 350992 142343 -200387 2652 -43558 -227607 -35069
15371I304K74906I2470f3491k1461A236K51516q0711b67660J02420A73119q2431
$$ 9304 284210 92470 -63491 -84952 1236 252752 172041 -267660 -165240 173119 90688
15360I0688c86195D7564j6998J23778L4162C9759L75771G9190b30043a5221q632
$$ 90688 -386195 47564 30566 154344 188506 39759 415530 79190 -230043 -15221 -23853
15349b3853A40315h075D7014a21372A64353l4431N8641a45474A75241D5741c2837
$$ -23853 140315 -8075 47014 -121372 164353 129922 188563 -145474 175241 45741 -32837
15337A09557E4309b13593a9581A95050N7239a09621B30638a30394N7445j79494
$$ 109557 54309 -213593 -19581 195050 252289 -109621 230638 -130394 -72949 -252443
15327b52443B3125a10970A14353c7348k95906a19954A7478J37205M094d5766N204
$$ -252443 23125 -110970 114353 -37348 -333254 -119954 17478 154683 158777 -45766 -40562
15316d0562A51222M03164E7816J01069e9789p0523D77456d63139F97178k75889
$$ -40562 151222 554386 57816 158885 -59789 -130312 477456 -463139 697178 421289
15306D21289j58985I9677J45926B4015a0364D9759P1758Q8881m6504Q0274a35544
$$ 421289 262304 99677 245603 24015 -10364 49759 121517 210398 163894 244168 -135544
15294C41553F2128d9237j23768F5136K30892A39278b38999E1087b37173a0973
$$ 341553 62128 -49237 -173005 65136 296028 139278 -238999 51087 -237173 -10973
15283B80915c75751C39809a59459B59925e4123o0770K5132C37480j12830a21226
$$ 280915 -375751 339809 -159459 259925 -54123 -114893 -89761 337480 224650 -121226
15272A3451c4778H3647l8153P5445L10163b76949B27577L4856A20365N0373a10067
$$ 13451 -34778 83647 45494 120939 431102 -276949 227577 262433 120365 170738 -110067
15260b80416A90205i1282d4316C5104L9001P9974J23077g6046a700A61155k7941
$$ -280416 190205 -91282 -44316 35104 74105 154079 277156 -76046 -1700 161155 133214
15249A33214K0757L40994J037994J8394K1464O92041I80351D62865A32543B4780
$$ 133214 153971 494965 1532959 1551353 1572817 2264858 980351 462865 132543 24780
15238a28512D6772q039m238b19953O7564L038D73997a53452q6646A92745a54152
$$ -128512 46772 38733 34495 -219953 -152389 -149351 473997 -153452 -240098 192745 -154152
15226A26775c0246A94145J28968D698a89298C75807a9044B4811B527h7157j02316
$$ 126775 -30246 194145 323113 4698 -189298 375807 -19044 24811 2527 -87157 -189473
15215a89473B29022p0489m8354k6674h5861D0517K12449A3483o690Q3788d2836
$$ -189473 229022 158533 110179 83505 -85861 40517 252966 13483 6793 90581 -42836
15203h7146L7340G8124J8493R937c39559A98553A2685b8960o0589C64546A6566
$$ -87146 -49806 78124 96617 106554 -339559 198553 12685 -28960 -89549 364546 16566
15191A75141L00870A16684O0162J10548a07803B20132J12864p7143F4958K79916
$$ 175141 476011 116684 176846 287394 -107803 220132 332996 255853 64958 344874
15181C44874p457A06532k279K68539p7113q0425N6445p6650b64188a06016F5105
$$ 344874 337417 106532 104253 372792 295679 215254 271699 195049 -264188 -106016 65105
15169D58504j45174a95652g0249b4850B95928a25137C17718b51063C98281F0964
$$ 458504 313330 -195652 -70249 -24850 295928 -125137 317718 -251063 398281 60964
15158a53552A31778L17449n5767j54394Q371H9744J17793q3444m2989L6127a97047
$$ -153552 131778 449227 393460 239066 247437 89744 207537 124093 81104 117231 -197047
15146G2462B1500J09873C5466c8380E29524A33355J80036b2681B60418i6385B09052
$$ 72462 21500 131373 35466 -38380 529524 133355 313391 -22681 260418 -96385 209052
15134B73901A32278l6358b8849A48433J13952J70623A78768b02160A18728C6140
$$ 273901 132278 95920 -28849 148433 262385 433008 178768 -202160 118728 36140
15123B87189a71569I2232L75671j81583l5731L953o996m8029b01114a3762B16277
$$ 287189 -171569 92232 467903 286320 250589 254542 247546 199517 -201114 -13762 216277
15111A25366J89454j24712c5885B16838o1709c1307B88898I4028e4199E4571K14273
$$ 125366 314820 190108 -35885 216838 155129 -31307 288898 94028 -54199 54571 268844
15100B68844K5162j724A40256M41738k38474A21250e4718A67982C9562R4709F4757
$$ 268844 294006 292282 140256 581994 343520 121250 -54718 167982 39562 134271 64757
15088B12328a22401C24629A40148C0128J25448m7996L7931G2283L2218i507B43499
$$ 212328 -122401 324629 140148 30128 155576 107580 145511 72283 104501 -9507 243499
15076C9640M66229A72477N2657a61305C14034I6248L95865n3047j2948m1259j0282
$$ 39640 505869 172477 225134 -161305 314034 96248 492113 439066 426118 384859 374577
15065C74577j15039m9067l9349m8810C0625M04504A47342K14358j65092B0431
$$ 374577 259538 210471 171122 122312 30625 435129 147342 361700 196608 20431
15054b3664I4982P2267O2229E2J94009D7589K9837C1309J09515M02996g3160C5085
$$ -23664 94982 167249 229478 52 194061 47589 77426 31309 140824 543820 -73160 35085
15041H4500a39609A6132J32046N0484J7782J09663A52661J72596o4114A3982R5799
$$ 84500 -139609 16132 148178 198662 216444 326107 152661 325257 261143 13982 109781
15030A09781J45055N6944p8724m7319P4296J38402A92564Q6621A31661K39495
$$ 109781 254836 311780 233056 185737 260033 398435 192564 279185 131661 371156
15020C71156A69149R0072h9451c1005A53802J53492K5021G3574J50748J81665
$$ 371156 169149 259221 -89451 -31005 153802 307294 332315 73574 224322 405987
15010D05987C8494K88246K16248k42257K3625J9000A60988N8801B1009N0402M12330
$$ 405987 38494 326740 542988 300731 324356 343356 160988 219789 21009 71411 483741
14999D83741N0462B58979k0205m8574K06093j9110F0954a00049B46014C545L71630
$$ 483741 534203 258979 238774 190200 396293 377183 60954 -100049 246014 3545 375175
14988C75175j80125K69179A41228k1903a0464F8623K63143l3318R8084n9425q5550
$$ 375175 195050 464229 141228 119325 -10464 68623 331766 298448 396532 337107 251557
14977B51557O5482A25145K99905j90762E4545J58142L95380k77400L04087A57135
$$ 251557 317039 125145 425050 234288 54545 212687 608067 330667 634754 157135
14966B80499Q8367o4732J12626J07971A11689O7082E0564L08930m9016A53292
$$ 280499 368866 304134 416760 524731 111689 178771 50564 359494 310478 153292
14955F48750F6265K47242f2599E72407A36365P8834L3185K66669L415j35817I9012
$$ 648750 66265 313507 -62599 572407 136365 215199 248384 515053 518468 382651 99012
14943A30650K86001j84779p959q1328o9284K52642M5190P5508A4754K61137K36828
$$ 130650 416651 231872 223913 142585 73301 325943 371133 446641 14754 275891 512719
14932E12719n4350J50232F0381M39720e9244C06944n4235j4899j01332M31975
$$ 512719 458369 608601 60381 500101 -59244 306944 252709 237810 136478 568453
14922E68453j21603A75611a0161D20310q1024K90165A46960N6648P3659Q8125
$$ 568453 446850 175611 -10161 420310 339286 629451 146960 203608 277267 365392
14912C65392j70554B9457N8999L72912B12696Q3029J86900j64305k433j35360
$$ 365392 194838 29457 88456 461368 212696 295725 482625 318320 315887 180527
14902A80527J63560j63657J31051r6574R7365O9023r069R7793n4753J02403N5563
$$ 180527 344087 180430 311481 214907 312272 381295 372226 470019 415266 517669 573232
14891E73232R8368l34647m9099K08606A54608l8549L27239p2442K28401k6321
$$ 573232 671600 336953 287854 496460 154608 116059 443298 370856 599257 572936
14881E72936B79232A155K72730K36827M194A79971k7315n3513K31104P7279j08117
$$ 572936 279232 1155 273885 510712 514906 179971 152656 99143 330247 407526 299409
14870B99409K55719j59432j49770K22203k15557L11673l4255k50394J82396K76844
$$ 299409 555128 395696 245926 468129 252572 564245 529990 279596 461992 738836
14860G38836C67438K680M18120A97470K64223N1508K28557j57678K12657k87753
$$ 738836 367438 370118 788238 197470 461693 513201 741758 584080 796737 508984
14850E08984j19881M9081M05467l90801J15272p7143P0200j54879J64392k9680
$$ 508984 389103 438184 843651 452850 568122 490979 561179 406300 570692 541012
14840E41012L2332k83851L95070j99672q0436Q9109L77757j84486k24843L43843
$$ 541012 573344 289493 684563 484891 404455 493564 871321 686835 461992 805835
14830H05835l05300B09732Q5743N39017m0169C64869J23760N9493j06629J94245
$$ 805835 500535 209732 295475 834492 794323 364869 488629 548122 441493 635738
14820F35738k75553L38895h9483F61074l22819N6545K62118n3960M4280B93692
$$ 635738 360185 699080 -89483 661074 338255 394800 656918 602958 647238 293692
14809G21729k56160j00640J72740B34193P17547n3710l12651K54807l24234R0135
$$ 721729 465569 364929 537669 234193 951740 898030 585379 840186 515952 606087
14799F06087B31077O93090j62840j58164j22476K60650l4792j59054B49345M35090
$$ 606087 231077 924167 761327 603163 480687 741337 706545 547491 249345 684435
14789F84435B00648J4227L24737J52917q8062j87047j22053J23281K55243q0532
$$ 684435 200648 214875 539612 692529 604467 417420 295367 418648 673891 593359
14779E93359n9413M25846m19431H4058N06488j02094K23848k30195K53532K92417
$$ 593359 533946 959792 540361 84058 590546 488452 712300 482105 735637 1028054
14769A028054l48141L4698k5957n2889j5662n3877M8285j84199K66642j56949
$$ 1028054 679913 714611 688654 635765 620103 566226 614511 430312 696954 540005
14759E40005K40110r0908k759r7770K87415k36057L0030K93159l85958J49789
$$ 540005 780115 689207 686448 588678 876093 640036 670066 963225 577267 727056
14749G27056l35796L7370L01366K54241j82646r4323P8678J46185l18346M8729
$$ 727056 391260 428630 729996 984237 801591 707268 785946 932131 613785 662514
14739F62514L57899j63460M8584C84532K94065J80531O9412k97839j47144J36955
$$ 662514 1020413 856953 905537 384532 678597 859128 928540 630701 483557 620512
14729F20512M38307o0821j60297n7588K6043k85671K89694L71620l50271J60183
$$ 620512 1058819 997998 837701 780113 806156 520485 810179 1181799 831528 991711
14719I91711p5865J7237J98350l74278P3577n2561K8050N2955L9241N5220l2063
$$ 991711 915846 933083 1131433 757155 830732 778171 806221 859176 898417 953637 921574
14708I21574J92918m91315L73401j73955k24119P0206K66959P9210P7777m90654
$$ 921574 1114492 623177 996578 822623 598504 668710 935669 1014879 1092656 602002
14698F02002O42399k70050L27408m11506l2931O5531L44472P1463k21216k40045
$$ 602002 1244401 974351 1301759 890253 857322 922853 1267325 1338788 1117572 877527
14688H77527J4203M19864j19002k16552m6143J189K04082k56431l4896q5613J49877
$$ 877527 891730 1311594 1192592 976040 929897 931086 1135168 878737 843841 758228 908105
14677I08105J00277l96304N08318l47852M44258k05728M01413k25482m7830M4875
$$ 908105 1008382 612078 1120396 772544 1216802 1011074 1412487 1187005 1139175 1184050
14667A184050k92986L92669J16693q8257j00342O8365L5830k33932j7447K8165
$$ 1184050 891064 1283733 1400426 1312169 1211827 1280192 1316022 1082090 1064643 1092808
14657A092808k35498K96465J75106J50037k89877R0450K47814k33821J735j13880
$$ 1092808 857310 1153775 1328881 1478918 1189041 1279491 1527305 1293484 1295219 1181339
14647A181339j18360K86275m0342j7553l6566J81791j44419J34283r1513O0584
$$ 1181339 1062979 1349254 1308912 1291359 1254793 1436584 1292165 1426448 1334935 1395519
14637A395519O0158J34410j49032R7243n9594M25243m63077j52531j22912M1656
$$ 1395519 1455677 1590087 1441055 1538298 1478704 1903947 1440870 1288339 1165427 1207083
14627A207083l9137L85161J85133j07324k81167R1480L12622o6630k78871J67314
$$ 1207083 1167946 1553107 1738240 1630916 1349749 1441229 1753851 1687221 1408350 1575664
14617A575664l2964k28457L2700K57273J41329k3439M7110m18753j4265K65443
$$ 1575664 1542700 1314243 1346943 1604216 1745545 1722106 1769216 1350463 1336198 1601641
14607A601641K63099m40659K29180M7977N50573n45742l42754P21663j75985j17361
$$ 1601641 1864740 1424081 1653261 1701238 2251811 1706069 1363315 2084978 1908993 1791632
14597A791632j70593K20491o4581J35142o5684m4564j68747l3285N85109j14976
$$ 1791632 1621039 1841530 1776949 1912091 1846407 1801843 1633096 1599811 2184920 2069944
14587B069944K73469m09015J45718l94873J47578J00899J88056K96346j34223
$$ 2069944 2343413 1934398 2080116 1685243 1832821 1933720 2121776 2418122 2283899
14578B283899j93781P7026L5566K52412l54210K94126l97608L40870r6746J32066
$$ 2283899 2090118 2167144 2202710 2455122 2100912 2395038 1997430 2338300 2241554 2373620
14568B373620K99635m40864L37302L08706l68630K02953j72397N18816l11079
$$ 2373620 2673255 2232391 2569693 2878399 2509769 2712722 2540325 3059141 2748062
14559B748062L93918k3327k8220L48978J65422p5040M65534M3885P02901J133441
$$ 2748062 3141980 3118653 3090433 3439411 3604833 3529793 3995327 4039212 4742113 5875554
14549E875554J669148L636007R131379J9623501Q344028B3009555j0293323n281134
$$ 5875554 7544702 11180709 20312088 39935589 48279617 23009555 12716232 7435098
14541G435098C571020p94789l41725n88482Q14016m73034j02740m9232J13193
$$ 7435098 3571020 2776231 2434506 1846024 2660040 2187006 2084266 2035034 2148227
14532B148227J8693K30336P8210l7108j20643J23247n0320O6693L5392k26868
$$ 2148227 2166920 2397256 2475466 2438358 2317715 2440962 2390642 2457335 2492727 2265859
14522B265859O48756l51110L26716j78212j05709J39580k89192K13059N3385l4285
$$ 2265859 2914615 2563505 2890221 2712009 2606300 2745880 2456688 2669747 2723132 2688847
14512B688847J30810K96180o9787P9141p2083j47117K63300r2912R1366J09804
$$ 2688847 2819657 3115837 3046050 3125191 3053108 2905991 3169291 3076379 3167745 3277549
14502C277549j70107K06234k49724o8722P94006l69207K22579J77101k09016J48150
$$ 3277549 3107442 3313676 3063952 2995230 3789236 3420029 3642608 3819709 3610693 3758843
14492C758843K08853n48107N63768m36463j7958k22201M71709Q1504j35000L33896
$$ 3758843 3967696 3419589 3983357 3546894 3528936 3306735 3778444 3859948 3724948 4058844
14482D058844O9352K37710r0580L8985K34054l61187L88782N2637k69764Q4060
$$ 4058844 4128196 4365906 4275326 4314311 4548365 4187178 4575960 4628597 4358833 4442893
14472D442893j09670L28941o2286P9807L2234m990L57840l32268J37151J54925
$$ 4442893 4333223 4662164 4599878 4679685 4711919 4706929 5064769 4732501 4869652 5024577
14462E024577j2693R8229J89145l89799M39158k05932J58754m4211P0618M92226
$$ 5024577 5011884 5110113 5299258 4909459 5348617 5142685 5301439 5257228 5327846 5820072
14452E820072l5577N3388k51319L21600J86321k19543K39511L67756l6822m37632
$$ 5820072 5784495 5837883 5586564 5908164 6094485 5874942 6114453 6482209 6445387 6007755
14442F007755J08166N70226k74398Q7341M12128l65263K93263k39749O52670L9498
$$ 6007755 6115921 6686147 6411749 6499090 6911218 6545955 6839218 6599469 7252139 7291637
14432G291637l65784K96504L70935j35960N3664j63975K10340J9893L70490J76796
$$ 7291637 6925853 7222357 7593292 7457332 7510996 7347021 7557361 7577254 7947744 8124540
14422H124540N9144o632K47558J20144M09934m36422O20853Q8569n7843K88870
$$ 8124540 8183684 8177052 8424610 8544754 8954688 8518266 9139119 9227688 9169845 9458715
14412I458715j4076K11954o322L76177j48566L53785J10262k72611O70627M83742
$$ 9458715 9444639 9656593 9650271 10026448 9877882 10231667 10341929 10069318 10739945 11223687
14402A1223687k37238j55279L28013K35864L74756M4207L70360K84486O3746K6187
$$ 11223687 10986449 10831170 11159183 11395047 11769803 11814010 12184370 12468856 12532602 12558789
14392A2558789J96671N88313O4265J39697L12078J62241K20961L14585K06028
$$ 12558789 12755460 13343773 13408038 13547735 13859813 14022054 14243015 14557600 14763628
14383A4763628K10558N26118j4382M11572K27796J71235O03868K3394M99747N95334
$$ 14763628 14974186 15500304 15485922 15897494 16125290 16296525 16900393 16923787 17423534 18018868
14373A8018868J3308L07738N15713K71022K00969M35730N89182L54823N45650
$$ 18018868 18032176 18339914 18855627 19126649 19327618 19763348 20352530 20707353 21253003
14364B1253003N47736J35467J55869J002386L41008K10693R93180M63363M76502
$$ 21253003 21800739 21936206 22092075 23094461 23435469 23646162 24639342 25102705 25579207
14355B5579207L94192L29218J101916O89982M72236Q24681N36011P78793R29300
$$ 25579207 25973399 26302617 27404533 28094515 28566751 29391432 29927443 30706236 31635536
14346C1635536L75951J112308M99871J144076J114795L03812J288964R74941J067073
$$ 31635536 32011487 33123795 33623666 34767742 35882537 36186349 37475313 38450254 39517327
14337C9517327J117723J152013J315059J014395J257838J802234J190368J565385
$$ 39517327 40635050 41787063 43102122 44116517 45374355 47176589 48366957 49932342
14329D9932342J389629J808992J543568J741608K145624K082820J632469K146477
$$ 49932342 51321971 53130963 54674531 56416139 58561763 60644583 62277052 64423529
14321F4423529K310416K391106K324991K681043K851769K564285L006071L261453
$$ 64423529 66733945 69125051 71450042 74131085 76982854 79547139 82553210 85814663
14313H5814663L509628L211467L867468M188992M065434M388263M755825M729657
$$ 85814663 89324291 92535758 96403226 100592218 104657652 109045915 113801740 118531397
14305A18531397N488983N112473N963941O284229O512913P123189P392913P371163
$$ 118531397 124020380 129132853 135096794 141381023 147893936 155017125 162410038 169781201
14297A69781201Q165728Q618985R435027R376676J0674473J0198636J1673309
$$ 169781201 177946929 186565914 196000941 205377617 216052090 226250726 237924035
14290B37924035J1504643J2397292J3123373J3449960J3855893J4410700J4843591
$$ 237924035 249428678 261825970 274949343 288399303 302255196 316665896 331509487
14283C31509487J4778600J5124520J4921213J4800763J4535371J3888172J2940672
$$ 331509487 346288087 361412607 376333820 391134583 405669954 419558126 432498798
14276D32498798J2009964J0859694Q953960P210757M353175L54894q30778j240423
$$ 432498798 444508762 455368456 464322416 471533173 475886348 476241242 475410464 474170041
14268D74170041l237884m034823o257027p509727r919739j2050707j3400605j4677441
$$ 474170041 470932157 466897334 460640307 453130580 443210841 431160134 417759529 403082088
14260D03082088j5406553j5603910j6132197j5623799j5577732j5173315j4839292
$$ 403082088 387675535 372071625 355939428 340315629 324737897 309564582 294725290
14253B94725290j3029943j3482736j3100796j2690033j1751400j1271333j0731891
$$ 294725290 281695347 268212611 255111815 242421782 230670382 219399049 208667158
14246B08667158j0162666r512881q537123q071416q442577p524899p325490o933931
$$ 208667158 198504492 188991611 180454488 172383072 163940495 156415596 149090106 142156175
14238A42156175n526950n955971n528333n622924m999840m941150m295062l632037
$$ 142156175 136629225 130673254 125144921 119521997 114522157 109581007 105285945 101653908
14230A01653908m320466l692180l861030l452137l259298k666832l395534k847825
$$ 101653908 97333442 93641262 89780232 86328095 83068797 80401965 77006431 74158606
14222G4158606k583073k301531k150294k171525k535179k165398j690393j758579
$$ 74158606 71575533 69274002 67123708 64952183 62417004 60251606 58561213 56802634
14214E6802634j902182j016295j967186j591027j769971j567416q96728p02441
$$ 56802634 54900452 53884157 51916971 50325944 48555973 46988557 46091829 45389388
14206D5389388j454722j565703j229702j245401q51241j340367m24148r89900
$$ 45389388 43934666 42368963 41139261 39893860 39042619 37702252 37278104 36288204
14198C6288204j004649r33202j305784j048073j6286j006171q30876q70975q97048
$$ 36288204 35283555 34350353 33044569 31996496 31980210 30974039 30143163 29272188 28375140
14189B8375140n00640o46303n52332p50944p58367l59146o98817n42325m99055
$$ 28375140 27874500 27228197 26675865 25924921 25166554 24807408 24108591 23566266 23067211
14180B3067211l61908n48336l52191q01844m40332m5019o41609l84724k65130
$$ 23067211 22705303 22156967 21804776 21002932 20562600 20517581 19875972 19491248 19226118
14171A9226118p40884j54117l21580j35246k35065o93193k22422p080o07873k04423
$$ 19226118 18485234 18331117 18009537 17874291 17639226 16946033 16723611 16716531 16108658 15904235
14161A5904235k61204l14217m41155P6739n33291j37629k5801n85933n2202j83245
$$ 15904235 15643031 15328814 14887659 14964398 14431107 14293478 14267677 13681744 13629542 13446297
14151A3446297o7773o27029Q8380q7963k84989k91219k49338N4814l62116Q3690
$$ 13446297 13378524 12751495 12839875 12751912 12466923 12175704 11926366 11981180 11619064 11702754
14141A1702754n68407p4672m525n17538P9589k54315K78716l85909l25874m359
$$ 11702754 11134347 11059675 11055150 10537612 10617201 10362886 10641602 10255693 9929819 9925460
14131I925460n4568m36844k18631M49052n85230l1176k97176J31359L497l28859
$$ 9925460 9870892 9434048 9215417 9664469 9079239 9048063 8750887 8882246 8885743 8556884
14121H556884n9491k2451k88659K04162k00309j67448N9726l84406j36034M4120
$$ 8556884 8497393 8474942 8186283 8390445 8190136 8022688 8082414 7698008 7561974 7606094
14111G606094k39420j21625J80644l26703K05212j77556k61898p4614l0609l5273
$$ 7606094 7366674 7245049 7425693 7098990 7304202 7126646 6864748 6790134 6759525 6724252
14101F724252j72557r4859q7988p3906k8615k26635P5933J25028j48621L62765
$$ 6724252 6551695 6456836 6368848 6294942 6266327 6039692 6115625 6240653 6092032 6454797
14091F454797l94638j90176j16641r621n9512r8709k46325j89233j5983J46443
$$ 6454797 6060159 5869983 5753342 5743721 5684209 5585500 5339175 5149942 5133959 5280402
14081E280402k07660m1041k66375J72133j0684K11827p5229l84055p116j78188
$$ 5280402 5072742 5031701 4765326 4937459 4926775 5138602 5063373 4679318 4672202 4494014
14071D494014j54064M81674m36775m943J91176J14172k46033N3268K03217k91240
$$ 4494014 4339950 4821624 4384849 4379906 4571082 4685254 4439221 4492489 4695706 4404466
14061D404466k02580q2670M01571q1470l95556K99159K9593m08448J84397j61781
$$ 4404466 4201886 4119216 4520787 4439317 4043761 4342920 4372513 3964065 4148462 3986681
14051C986681o5374n6595J03997j19999m16852L61704j47673p2075k20603r0029
$$ 3986681 3921307 3864712 3968709 3848710 3431858 3793562 3645889 3573814 3353211 3263182
14041C263182m9961M9292N26884m07776J58948l09848O4949K39564l53350P986
$$ 3263182 3213221 3262513 3789397 3381621 3540569 3230721 3295670 3535234 3181884 3189870
14031C189870K54936J1194j66285j65534n7749K19781k16383J35521m29508L3622
$$ 3189870 3444806 3456000 3289715 3124181 3066432 3286213 3069830 3205351 2775843 2809465
14021B809465K29647r2155j5739j16883j41391L03094k23772K8264J03882k62279
$$ 2809465 3039112 2946957 2931218 2814335 2672944 2976038 2752266 2780530 2884412 2622133
14011B622133j14298M09733l39637m7915O3457j89593M81086q93056K30028J30504
$$ 2622133 2507835 2917568 2577931 2530016 2593473 2403880 2884966 1991910 2221938 2352442
14001B352442K57293j26989k58077k6487j6071o2379J3214N6575J22679J97678
$$ 2352442 2609735 2482746 2224669 2198182 2182111 2119732 2132946 2189521 2312200 2509878
13991B509878p26M23936P60546K351045P119622J8577329J8006134k0959313j3776115
$$ 2509878 2509152 2933088 3693634 6044679 13164301 31741630 49747764 28788451 15012336
13982A5012336n960458k426458j612055m45322n22838o00068J34693k49456J43681
$$ 15012336 9051878 6625420 5013365 4568043 4045205 3445137 3579830 3330374 3474055
13973C474055n48171l19144q3371K36957J27784j92700k61603O9768l13703L16876
$$ 3474055 2925884 2606740 2523369 2760326 2888110 2695410 2433807 2503575 2189872 2506748
13963B506748k40126L57612j56306k33625o7474o1937K86094l37851r9471N42920
$$ 2506748 2266622 2624234 2467928 2234303 2166829 2104892 2390986 2053135 1953664 2496584
13953B496584j38021l79853K49976N4777l95594P482J02915J19626k99462J43031
$$ 2496584 2358563 1978710 2228686 2283463 1887869 1895351 1998266 2117892 1818430 1961461
13943A961461q5362M0166K35633j22150l40941K13346K29149m59029L03085J58878
$$ 1961461 1876099 1916265 2151898 2029748 1688807 1902153 2131302 1672273 1975358 2134236
13933B134236m48066J22282q3683l3289N1360n5749J03735j78996r850J1310k10072
$$ 2134236 1686170 1808452 1724769 1691480 1742840 1687091 1790826 1611830 1601980 1613290 1403218
13922A403218K31584M5234j16682O3635m9690R4569Q6581m82951O5421J3427J88255
$$ 1403218 1634802 1680036 1563354 1626989 1577299 1671868 1758449 1275498 1340919 1354346 1542601
13911A542601Q1763k80562M17672k58600M6853k17682J62978r9764M4950l48426
$$ 1542601 1624364 1343802 1761474 1502874 1549727 1332045 1495023 1395259 1440209 1091783
13901A091783J63049K87358j93750j61695J06294J7479J59960l0915J47217k19660
$$ 1091783 1254832 1542190 1348440 1186745 1293039 1310518 1470478 1439563 1586780 1367120
13891A367120K1424J07334M9570n18081L55699L825o185k32894J52490J19496
$$ 1367120 1388544 1495878 1545448 1027367 1383066 1386891 1380706 1147812 1300302 1419798
13881A419798q529j53247l945Kj97751L05999l55494J90821K71034m93497L87316
$$ 1419798 1411269 1258022 1254077 1254079 1056328 1362327 1006833 1197654 1468688 975191 1362507
13870A362507j32365K33675k00245k22295P5676K35720l15450L14475K1772o25408
$$ 1362507 1230142 1463817 1263572 1041277 1116953 1352673 1037223 1351698 1373470 748062
13860G48062M46406R8164m70653p1220K64310L46446j24154L0054k92446j08799
$$ 748062 1194468 1292632 821979 750759 1015069 1361515 1237361 1267415 974969 866170
13850H66170J25378j07189K06161j1336L0903k53575L59595k28592R8541k76420
$$ 866170 991548 884359 1090520 1079184 1110087 856512 1216107 987515 1086056 809636
13840H09636J86553l2127k54016O73850k9695l27117j11482j03780J24850K47098
$$ 809636 996189 964062 710046 1383896 1354201 1027084 915602 811822 936672 1183770
13830A183770N7010m31373K31433N0093j64346K00803j01083k23851L28882l15443
$$ 1183770 1240780 809407 1040840 1090933 926587 1127390 1026307 802456 1131338 815895
13820H15895K14354D94488M25972k13840M43527k49684l63596M47654k34327q8416
$$ 815895 1030249 494488 920460 706620 1150147 900463 536867 984521 750194 661778
13810F61778J89655K15796k98987J60470m2241O5603j4795k5385j05954L18941
$$ 661778 851433 1067229 768242 928712 886471 952074 937279 911894 805940 1124881
13800A124881l48465J54967m8637K40598k89610q0634L95047l53934j43594o3778
$$ 1124881 776416 931383 882746 1123344 833734 753100 1148147 794213 650619 586841
13790E86841L46784j11895J60685D30934N71614l17015l7737l22578J98221M43007
$$ 586841 933625 821730 982415 430934 1002548 685533 647796 325218 523439 966446
13780I66446m46319K20099j21770m4372q2899M89902m40959L07099N535j70029
$$ 966446 520127 740226 618456 574084 491185 981087 540128 847227 852762 682733
13770F82733p2143R4478J04035j71765J77554j92208J14341O5543k4168n1505
$$ 682733 610590 705068 809103 637338 814892 622684 737025 802568 778400 726895
13760G26895k34610L03994C48260K99680K30341q5216K50506m02822j78630N64755
$$ 726895 492285 796279 348260 647940 878281 793065 1043571 640749 462119 1026874
13750A026874m10483K43851k94813L8225K12039o2949j86841M26118D39328J25374
$$ 1026874 616391 860242 565429 603654 815693 752744 565903 992021 439328 564702
13740E64702j97034K70809j48782p5712J21435L47754l00042j57091J19097K30820
$$ 564702 367668 638477 489695 413983 535418 883172 583130 426039 545136 775956
13730G75956K658C37511O54662D10865K00753J4055j17288j94308M38220l62596
$$ 775956 778614 337511 992173 410865 611618 625673 508385 314077 752297 389701
13720C89701L72514k5004j98997p5110M12262j89524L64327l42620k80291J2027
$$ 389701 762215 737211 538214 463104 875366 685842 1050169 707549 427258 439285
13710D39285K03296J50159J29117k83455j27665k32422M32726E6717N11600M38959
$$ 439285 642581 792740 921857 638402 510737 278315 711041 56717 568317 1007276
13700A007276C20710A23914M02493j36226Q1297Q704L0159l530J34859J39528
$$ 1007276 320710 123914 526407 390181 471478 480182 510341 506811 641670 781198
13690G81198k86258j15149K36291k33115M01217j78491J96194B93368J01158R8760
$$ 781198 494940 379791 616082 382967 784184 605693 801887 293368 394526 493286
13680D93286l7464j65101j3551J72909L5676M7906L52785l20324J76557k20905
$$ 493286 455822 290721 277170 450079 485755 533661 886446 566122 742679 521774
13670E21774j02264J20385K11415k18311k13883L58923k84605n6652K66733k99627
$$ 521774 419510 539895 751310 532999 319116 678039 393434 336782 603515 303888
13660C03888A22617N17509K5068r9115k9367K05949l49255Q6682J33407k65081
$$ 303888 122617 640126 665194 566079 536712 742661 393406 480088 613495 348414
13650C48414R0863A59340N5213J03744o5708M61181k11381p2498l2292k0304J94139
$$ 348414 439277 159340 214553 318297 252589 713770 502389 429891 397599 377295 571434
13639E71434k36194r5965m3056K80670K66889A89883N61989C34832J95757r9232
$$ 571434 335240 239275 196219 476889 743778 189883 751872 334832 530589 431357
13629D31357K08235C12995j3824J50476Q9294o5076k24084J27341J92877M2565
$$ 431357 639592 312995 299171 449647 538941 473865 249781 377122 569999 612564
13619F12564j29540k10404K15364J14604A22562J16376L88077j12935J2600k18823
$$ 612564 483024 272620 487984 602588 122562 238938 627015 514080 526680 307857
13609C07857L65045k08349k1837j08985r26n9998J58618A33674O67851B35374
$$ 307857 672902 464553 442716 333731 332805 272807 431425 133674 801525 235374
13598C53249p2129R3888j76938A9604L61638j65457L30816k52529j35298K36664
$$ 353249 281120 375008 198070 19604 381242 215785 546601 294072 158774 395438
13588C95438J63367B4981L50670p9878P2192A50415K86299K976l1766j72912R272
$$ 395438 558805 24981 375651 295773 367965 150415 436714 439690 407924 235012 244284
13577B44284L25884k66409J1162J24621J40921B57696D147K00387M79504k30981
$$ 244284 570168 303759 314921 439542 580463 257696 4147 204534 684038 453057
13567D53057A45822f2946D97901k35351K6197A40706J88245l4107J27588j47270
$$ 453057 145822 -62946 497901 262550 288747 140706 328951 294844 422432 275162
13557B75162M74778A24233d8336C30939J67335k48146j10729K50081i3425B72273
$$ 275162 749940 124233 -48336 330939 498274 250128 139399 389480 -93425 272273
13546B66990J88178q0782n001p955j28761Q4941p3280K9277H2451K80688A48350
$$ 266990 455168 374386 369385 361430 232669 317610 244330 273607 82451 363139 148350
13534A51918J77733j14782K92747F1633K86797O9238j46114b7735F1095K64721
$$ 151918 329651 214869 507616 61633 348430 417668 271554 -27735 61095 325816
13524C25816K44122k38811j53593M94375A73433K53636p358A62356J21216K20825
$$ 325816 569938 331127 177534 671909 173433 427069 419711 162356 283572 504397
13514E04397j96301O3964d0481E08573n7137A62036E2365L18014p2418N0806A67428
$$ 504397 308096 372060 -40481 508573 451436 162036 52365 370379 297961 348767 167428
13502A42389L26341A86976N5145N524r225J42684O884D7388L40673f879E98968
$$ 142389 468730 186976 242121 247645 238420 381104 387988 47388 388061 -6879 598968
13490A89736o0253J33603h2108D58341A34343R5587m291M1911o1439K25166k14809
$$ 189736 129483 263086 -82108 458341 134343 229930 225639 267550 206111 431277 216468
13479B16468n5429J92257K28907B01863J993J93292f2578E42742k66816P2349
$$ 216468 161039 353296 582203 201863 203856 397148 -62578 542742 275926 348275
13469C48275e7477o3352C31319j16842L19461A79671J26823C6261J29303q902
$$ 348275 -57477 -120829 331319 214477 533938 179671 306494 36261 165564 156662
13459A56662J73226O6543A74476a08049A71439N3535b3388B01047L2825q3597
$$ 156662 329888 396431 174476 -108049 171439 224974 -23388 201047 233872 150275
13449A50275o9062L28800H7818J93416J02716D2145J28137I492K73798K59590
$$ 150275 81213 410013 87818 281234 383950 42145 170282 9492 283290 542880
13439E42880A92499H0713P7434M28375A00756J02710K174E0779a18870E10992
$$ 542880 192499 80713 158147 586522 100756 203466 205640 50779 -118870 510992
13428B88987m9703d7891B42714L2723m7687D4164M9282J11843R9538D3565J47785
$$ 288987 239284 -47891 242714 275437 227750 44164 93446 205289 304827 43565 191350
13417A91350j4486J38406J16251K00833A66509K493L97683j71109A35J18630l709
$$ 191350 176864 315270 431521 632354 166509 169002 566685 395576 135 118765 115056
13406A15056b29144B89967d2362A33640a03355C20625l1380J34483Q1234j36251
$$ 115056 -229144 289967 -42362 133640 -103355 320625 289245 423728 504962 368711
13396C68711c8654j28437C21391L51488e4231E20231A68774q1126B180L25557
$$ 368711 -38654 -167091 321391 672879 -54231 520231 168774 87648 2180 327737
13386C27737j8881m8014L6252f3694B39382A12941J1829J10596J14654a05511
$$ 327737 308856 260842 297094 -63694 239382 112941 124770 235366 350020 -105511
13375A97084q4624d3509D76873h563C23857J54512A86481L895J70475j45591J06938
$$ 197084 112460 -43509 476873 -8563 323857 478369 186481 190376 360851 215260 322198
13364C22198P0769A11033L99118g4338I4815K89937A49336J01085k1359E7623
$$ 322198 392967 111033 510151 -74338 94815 384752 149336 250421 229062 57623
13353C55791A53820k5918H766L27375m6537k6183P5489g7914a1577C0595J16784
$$ 355791 153820 127902 8766 336141 289604 263421 338910 -77914 -11577 30595 147379
13342A47379d8668A34429J25166R1852K4843j30160J7943A29857J38104K26319
$$ 147379 -48668 134429 259595 351447 376290 246130 264073 129857 267961 494280
13332D94280j20580o2741j03336m27B3043K19104f6477n7367B27286L14769B67561
$$ 494280 373700 310959 207623 207196 23043 242147 -66477 -123844 227286 542055 267561
13320B61689E6082J43630m3329J09615N6290I7523L22762j85836a13548J7998
$$ 261689 56082 199712 156383 265998 322288 97523 420285 234449 -113548 -95550
13310i5550B69510I2878K5233k0560B2927K27651J64689a4998A11234M1180J44028
$$ -95550 269510 92878 118111 97551 22927 250578 415267 -14998 111234 152414 296442
13299B96442I3971j9093f837B78655A24933K56403j89671e8939F04851B91084
$$ 296442 93971 74878 -6837 278655 124933 381336 191665 -58939 604851 291084
13288A99168i0507B15276J55838F9796N30K65687B2872K35716A9935K38140j18131
$$ 199168 -90507 215276 371114 69796 70326 336013 22872 258588 19935 258075 139944
13277A39944J25348j17484N8681J31795E3282J62446j1455K9550G8956b08480
$$ 139944 265292 147808 206489 338284 53282 215728 204273 233823 78956 -208480
13266B03679J10868F5150d5383D65738A48662k4261L20339k20984l9249m5570
$$ 203679 314547 65150 -45383 465738 148662 124401 444740 223756 184507 138937
13256A38937a4136B70911G0398B2565a12172k25036C29390j40801a22315A22815
$$ 138937 -14136 270911 70398 22565 -112172 -337208 329390 188589 -122315 122815
13245C10368E5838K29179j15153n439J7653m8849J59678P8270a14011H12350B19172
$$ 310368 55838 285017 169864 164425 182078 133229 292907 371177 -114011 812350 219172
13233C8118J4166J6981J1755M370c41054B68844c373F2977J2870b07877B71274
$$ 38118 52284 69265 81020 85390 -341054 268844 -3373 62977 75847 -207877 271274
13221C90498g1941B30561n1308b18855a03163B53443K4547c8386k14413a9087
$$ 390498 -71941 230561 179253 -218855 -103163 253443 277990 -38386 -252799 -19087
13210B4135c6060A45198a16491a7262C25406G058P8745l1300K6664J74758d372
$$ 24135 -36060 145198 -116491 -17262 325406 7058 85803 54503 81167 255925 -4372
13198A28583D492h2428A58317J48966D4026c0532A16030J2599L32104B20761Q944
$$ 128583 4492 -82428 158317 307283 44026 -30532 116030 128629 460733 220761 229705
13187B29705B3966J33071L9265R608b32094a01927A09650J62159b5265F1065a14831
$$ 229705 23966 157037 196302 205910 -232094 -101927 109650 271809 -25265 61065 -114831
13175B18867b7236A68988e9580j9279c7573C79901j5666G8256B3481n586M71986
$$ 218867 -27236 168988 -59580 -78859 -37573 379901 364235 78256 23481 17895 489881
13164D89881d0951n3724C47363a441B38627m5123Q6058E1752k4997L6893b53237
$$ 489881 -40951 -94675 347363 -1441 238627 193504 279562 51752 26755 63648 -253237
13152D3930N0165a29711B24006F9043r692J43199N3466a73498j5163O6289d6274
$$ 43930 94095 -129711 224006 69043 59351 202550 256016 -173498 -188661 -122372 -46274
13140a73143J4224A51383C0797K04847O8476D3837J34914B3818a38830A39114
$$ -173143 -158919 151383 30797 235644 304120 43837 178751 23818 -138830 139114
13129B60674o1794k5135h6220A64281p1179a75805A30757P2035A5361a83154I3261
$$ 260674 198880 173745 -86220 164281 93102 -175805 130757 202792 15361 -183154 93261
13117B27371e7140k8031I8339J05977K5796G216b4331A04446D8379L78066a72286
$$ 227371 -57140 -85171 98339 204316 230112 7216 -24331 104446 48379 426445 -172286
13105a44194I3526J63534C5639d1979g051m7793I4608a10044A04586k6000b29261
$$ -144194 93526 257060 35639 -41979 -7051 -54844 94608 -110044 104586 78586 -229261
13093A14321q800K74361A3362J42190F3727d0863F79933a58683G2490F547Q0655
$$ 114321 105521 379882 13362 155552 63727 -40863 679933 -158683 72490 6547 87202
13082H7202m2997L15211g3421j51878a04213C04686G7085J99231B3277J09246
$$ 87202 44205 359416 -73421 -225299 -104213 304686 77085 276316 23277 132523
13072A32523b4249D5195K1646c53317J75812d3224A79323I078J83520Q9408A5824
$$ 132523 -24249 45195 66841 -353317 -177505 -43224 179323 9078 192598 282006 15824
13060B96919f1820D3682K66413d4480A39788e6461j99599B53421B7712q614J69529
$$ 296919 -61820 43682 310095 -44480 139788 -56461 -256060 253421 27712 19098 188627
13049A88627P310D5469J23234k5885K82750f7374A98384F3515K89095q1392I2421
$$ 188627 195937 45469 168703 142818 425568 -67374 198384 63515 352610 271218 92421
13037D4493J0116i072A33235K3210a74854l4702F6854a28271A92170e3057B82352
$$ 44493 54609 -9072 133235 156445 -174854 -209556 66854 -128271 192170 -53057 282352
13025A26978R2694R132a69403K5238B73118b0B67672H6160O7791J30273b23780
$$ 126978 219672 228804 -169403 -144165 273118 -20 267672 86160 153951 284224 -223780
13013F58816G1432J31448H0107B6527J54751b20110i4714B20708j3729H4364b28315
$$ 658816 71432 202880 80107 26527 181278 -220110 -94714 220708 206979 84364 -228315
13001C02873d8263j18783e3938C00840c64557M9186B90220b53025A14940M8491
$$ 302873 -48263 -167046 -53938 300840 -364557 -315371 290220 -253025 114940 163431
12991A63431J63844c91B23769a31041G7677c1779m5104C23609a44438B20248H1552
$$ 163431 327275 -391 223769 -131041 77677 -31779 -76883 323609 -144438 220248 81552
12979E2811c8024o9841H7729j9748b33148o2040a01208E9029N5548A6468b8133
$$ 52811 -38024 -107865 87729 67981 -233148 -295188 -101208 59029 114577 16468 -28133
12967G2181K4757K03465f1184F9479Q7508j9179C4107K76701o1460a95424A66253
$$ 72181 96938 300403 -61184 69479 156987 137808 34107 310808 249348 -195424 166253
12955b22504d1205o1087B14256A5431J7169a01832A56163a94323H039J2092J95976
$$ -222504 -41205 -102292 214256 15431 32600 -101832 156163 -194323 8039 20131 216107
12944B16107E5334O3704P2173K22649C2794i3823I2426a86946A15134K60711A33307
$$ 216107 55334 119038 191211 413860 32794 -93823 92426 -186946 115134 375845 133307
12932C5462K22651o9490f1019E9559O4563a24052b1747j65709B54177A13255J12999
$$ 35462 258113 188623 -61019 59559 124122 -124052 -21747 -187456 254177 113255 226254
12921B26254m4843R578b56902j3623A77751a73961B53178F6787K47110b23735
$$ 226254 181411 190989 -256902 -270525 177751 -173961 253178 66787 313897 -223735
12910A45383a14025A77027e7704D7354M6213b27106A9825K376e713A1964J21827
$$ 145383 -114025 177027 -57704 47354 93567 -227106 19825 22201 -5713 11964 133791
12899A33791b59799J02766A56416K9841o3866O4204a11255D68120r8351a02119
$$ 133791 -259799 -157033 156416 186257 122391 186595 -111255 468120 369769 -102119
12888c3240G6992K35606a05318B21869a36226C61146A25806J97250b85954c0454
$$ -33240 76992 312598 -105318 221869 -136226 361146 125806 323056 -285954 -30454
12877C39830o6834r7353C3121L48771A23829a51596H42K5722a26529C923J24121
$$ 339830 272996 175643 33121 381892 123829 -151596 842 26564 -126529 3923 128044
12866A28044N9063E6243g6840b8480A43130n736J64858a17798e8549j12034N6761
$$ 128044 187107 56243 -76840 -28480 143130 137394 302252 -117798 -58549 -170583 -113822
12855a13822A77768a85037f1867K9539l5553B27272C5258b671C61177a21642A08767
$$ -113822 177768 -185037 -61867 -32328 -67881 227272 35258 -2671 361177 -121642 108767
12843b15986I830J16114h338j35450C28597j31435J49923A06577g2831J3148B1183
$$ -215986 9830 125944 -8338 -143788 328597 197162 347085 106577 -72831 -59683 21183
12831A52144F7109a75246B01187a49681j7139j15009C01709c8776A91077r2737
$$ 152144 67109 -175246 201187 -149681 -166820 -281829 301709 -38776 191077 98340
12821I8340a76880I3007C2014k076d67828A19206a83616P7657j28962A68767M0103
$$ 98340 -176880 93007 32014 29938 -467828 119206 -183616 -105959 -234921 168767 208870
12810B08870F7437J78509i6884A81161H4336K91807c23577a59750F1188J1783
$$ 208870 67437 245946 -96884 181161 84336 376143 -323577 -159750 61188 72971
12800G2971b7492j33850c1772k32598J26161A0752J5329J45316b57068J09851
$$ 72971 -27492 -161342 -31772 -264370 -138209 10752 26081 171397 -257068 -147217
12790a47217a6559C0920R9156a4224j48628j58969F6430g7705i614B80511a30329
$$ -147217 -16559 30920 130076 -14224 -162852 -321821 66430 -77705 -9614 280511 -130329
12778b1677o2479B45084b1168j07862C18452h256m4217B5119a0289A16966c67206
$$ -21677 -84156 245084 -21168 -129030 318452 -8256 -52473 25119 -10289 116966 -367206
12766b54625g7841B18417a868E6516a73329j1034h0912c53q149A46676P563j1525
$$ -254625 -77841 218417 -1868 56516 -173329 -184363 -80912 -353 -8502 146676 154239 142714
12754A42714a10995I9569a31652D9762a98262B49053b572j0656A49350b12683
$$ 142714 -110995 99569 -131652 49762 -198262 249053 -2572 -13228 149350 -212683
12743b30830D14374a41684d7509E1215e538A03087j0911a17341B77920h3040A65491
$$ -230830 414374 -141684 -47509 51215 -5538 103087 92176 -117341 277920 -83040 165491
12731f6734G2583O783A227L32520c7804B08936J13181A28141b57088c65l61621
$$ -66734 72583 79366 1227 333747 -37804 208936 322117 128141 -257088 -365 -361986
12720c61986H936a35968j83113I8226K94750g088l32896H7700a36316k81925F2085
$$ -361986 8936 -135968 -319081 98226 392976 -7088 -339984 87700 -136316 -418241 62085
12708g8330E8139J63619N569n2825g5110A12124L8181J12748r5857a06341j4822
$$ -78330 58139 221758 227327 174502 -75110 112124 150305 263053 167196 -106341 -121163
12697a21163A95862F6082K31828H3011L5498k1159J90187H6911M578N0224i1537
$$ -121163 195862 66082 297910 83011 118509 97350 287537 86911 91489 141713 -91537
12685i4168D8055J2321a06606C1335M4453K75882I9419J3082c5706B47720f9550
$$ -94168 48055 60376 -106606 31335 75788 351670 99419 112501 -35706 247720 -69550
12673C33893j61369q192a83463K7235J1331C8978L38085I225J98548j4118r3047
$$ 333893 172524 164332 -183463 -156228 -144897 38978 377063 9225 207773 193655 100608
12662A00608Q0856o2407g5267G5970b01082B83524p3739K2661d0502D5916N37978
$$ 100608 181464 119057 -75267 75970 -201082 283524 209785 232446 -40502 45916 583894
12651E83894A01820J0803D2914M27883F3895B8914L54695j64496D9948A9766a19139
$$ 583894 101820 112623 42914 470797 63895 28914 383609 219113 49948 19766 -119139
12639B57119c11481B7230J49955G4938J8699g1351A32635e9401I8137e7087B9202
$$ 257119 -311481 27230 177185 74938 93637 -71351 132635 -59401 98137 -57087 29202
12627A76686K29056l5378j61701J1475n2121M5230d4511A67751K07231j61440
$$ 176686 405742 370364 208663 220138 168017 213247 -44511 167751 374982 213542
12617B13542A2430F116c66351J57973A66544a31884c1269A0288L16367A18689
$$ 213542 12430 6116 -366351 -208378 166544 -131884 -31269 10288 326655 118689
12606B33835D7850O6131c054D85566b73659B04552b30895B07294q9542J6865Q8044
$$ 233835 47850 113981 -3054 485566 -273659 204552 -230895 207294 117752 134617 222661
12595B22661C743a16632Q122c2962k7631D9479J79146a39631j49794d1750r3109
$$ 222661 3743 -116632 -108510 -32962 -60593 49479 228625 -139631 -289425 -41750 -134859
12584a34859A67575a01476A36867B9283P308a14634A64018n7613J0505J3387n4477
$$ -134859 167575 -101476 136867 29283 36591 -114634 164018 106405 116910 130297 75820
12573G5820i2358A05217J23825j02537D676O6965a10688B88398Q0349a8963B9191
$$ 75820 -92358 105217 229042 126505 4676 71641 -110688 288398 368747 -18963 29191
12561i1462G1078e6302B25528F4972a2763F997K50176q5208F0011A0358K37392
$$ -91462 71078 -56302 225528 64972 -12763 6997 257173 171965 60011 10358 247750
12550B47750a46045b7057K701A08714l9232b8339B30558e2710j53503a7365G163
$$ 247750 -146045 -27057 -24356 108714 69482 -28339 230558 -52710 -206213 -17365 7163
12538I8651b71629J01669A16165n7668R5661m8959g3049A422c01515B24697a02737
$$ 98651 -271629 -169960 116165 58497 154158 105199 -73049 1422 -301515 224697 -102737
12526B9463f4905l41391A77264b60529e8204B12764j9812d6875B20039E3864K1418
$$ 29463 -64905 -406296 177264 -260529 -58204 212764 192952 -46875 220039 53864 75282
12515G5282f2265C35842B8783M65M45183a52395a5352G1227R0311l9849M2080
$$ 75282 -62265 335842 28783 29248 474431 -152395 -15352 71227 161538 121689 163769
12504A63769q271K50693c12426K61i7494c6436m2419b1514A50478e6624o2145
$$ 163769 155498 406191 -312426 -312165 -97494 -36436 -78855 -21514 150478 -56624 -118769
12493a18769j7574I5182a46762A6299a06932A91297J20710C4198p883J3495a33683
$$ -118769 -136343 95182 -146762 16299 -106932 191297 312007 34198 26315 39810 -133683
12481c28088F7995J33882J14569h4876A3796d2534l3636A70997K0754f648n3141
$$ -328088 67995 201877 316446 -84876 13796 -42534 -76170 170997 191751 -6648 -59789
12470e9789B66442g5205A23428l0450K14701h7674D9180b37775A47485o0183a40294
$$ -59789 266442 -75205 123428 92978 307679 -87674 49180 -237775 147485 87302 -140294
12458a53181j53421a43848F7573O0317c9150A12605B3755Q0121a18787B02730
$$ -153181 -306602 -143848 67573 127890 -39150 112605 23755 103876 -118787 202730
12447a40275A01887b29695n8742j47190a56690A87O5825b41283k30226H1123h8272
$$ -140275 101887 -229695 -288437 -435627 -156690 187 66012 -241283 -471509 81123 -88272
12435A3242J84381Q5310A8548g287m6292r2915G4911m897J95549c62270b3764
$$ 13242 197623 282933 18548 -7287 -53579 -146494 74911 70014 265563 -362270 -23764
12423d4917m4907I6540b50887e514A32802B4771M0264A3346b3385A19543a62137
$$ -44917 -89824 96540 -250887 -5514 132802 24771 65035 13346 -23385 119543 -162137
12411A36772a24782c5787D6510d17517A23687j9840d72885B77153F4997f9104
$$ 136772 -124782 -35787 46510 -417517 123687 103847 -472885 277153 64997 -69104
12400A35737N6777d71018A97167b03825i5263I8845l0451a0222o3793r9142A53949
$$ 135737 192514 -471018 197167 -203825 -95263 98845 68394 -10222 -74015 -173157 153949
12388A43475j7097J03379g4594l4479l4368F4460b5647I141a06548l3793D4242
$$ 143475 126378 229757 -74594 -109073 -143441 64460 -25647 9141 -106548 -140341 44242
12376A06648a03714A13087B0881h0782A14102K0980a07730J7019R788j16186B85940
$$ 106648 -103714 113087 20881 -80782 114102 135082 -107730 -90711 -80923 -197109 285940
12364c96638A64222F2273A2471b4759j04795L3845r5119H0841c38144a61474k7570
$$ -396638 164222 62273 12471 -24759 -129554 -95709 -190828 80841 -338144 -161474 -189044
12353a89044J3058B02424b70314j53998I8761C8087J45361f810j1971A56696j0605
$$ -189044 -175986 202424 -270314 -424312 98761 38087 183448 -6810 -18781 156696 146091
12342A46091o588f5502G8449a04323A00697c04288C2336a99826J70d3920E6611
$$ 146091 139503 -65502 78449 -104323 100697 -304288 32336 -199826 -199656 -43920 56611
12330G3313r435a0742A55753d708j35282F3033i4054H4156e8709d675B18446f4372
$$ 73313 63878 -10742 155753 -4708 -139990 63033 -94054 84156 -58709 -4675 218446 -64372
12317a74123B90796B5542E012L33478a6331L611m8760p2553k64226a49697c6194
$$ -174123 290796 25542 5012 338490 -16331 -12720 -61480 -134033 -398259 -149697 -36194
12305c0448A74678a07544A74576m8407a25071B08819e4684A43639n5606e37518
$$ -30448 174678 -107544 174576 126169 -125071 208819 -54684 143639 88033 -537518
12294d00299a00041A32691J11978A12838a29155A14596j4761J5705a23106j5186
$$ -400299 -100041 132691 244669 112838 -129155 114596 99835 115540 -123106 -138292
12284a38292A40311b7902G8614h4723k3319C7995B717K20719K8293b028o3977
$$ -138292 140311 -27902 78614 -84723 -108042 37995 2717 223436 251729 -2028 -66005
12273f6005G7254R8583E8584a53221B31090B3667a26831a6775F052J16430B2349
$$ -66005 77254 175837 58584 -153221 231090 23667 -126831 -16775 6052 122482 22349
12261H1387N0953K742B6637L84474j34087L2017A09183l5093P462J9723i5425
$$ 81387 132340 135082 26637 411111 277024 309041 109183 74090 81552 101275 -95425
12249C4540a67967j02562M5571J12459l8034B52195M5561j43369K2459e4425B21441
$$ 34540 -167967 -270529 -224958 -112499 -150533 252195 297756 154387 176846 -54425 221441
12237d5042P973o6615c0871B11014J83112A42134n0942K76112n1757j53955J30849
$$ -45042 -37069 -103684 -30871 211014 394126 142134 91192 367304 315547 161592 292441
12226B92441p016H2858f1702C02596E6945B6996O8016K67375I6850N4482J11313
$$ 292441 285425 82858 -61702 302596 56945 26996 95012 362387 96850 151332 262645
12215B62645A17953a53510A46238l0492Q3339a58821g48j0324l9617H9431B2309
$$ 262645 117953 -153510 146238 115746 199085 -158821 -748 -11072 -50689 89431 22309
12203B71036J15629a54787B84256J91425a39545C1614a24541C34705j40525K08310
$$ 271036 386665 -154787 284256 475681 -139545 31614 -124541 334705 194180 402490
12193D02490n7860K4448j35931A11995K27126j65664K75707B5686L19058c4754
$$ 402490 344630 369078 233147 111995 339121 173457 449164 25686 344744 -34754
12182A43981P7746E3354e0392C10250p8428N5892F9038a090j6608q7371E24304
$$ 143981 221727 53354 -50392 310250 231822 287714 69038 -1090 -17698 -105069 524304
12170C32812A65086L6200G4387J41893A1850M32487f8115j02315A91497G1334
$$ 332812 165086 201286 74387 216280 11850 444337 -68115 -170430 191497 71334
12159b12466C2534a43427L7494D8511J83739c8285B31203i2026k35559F591a28579
$$ -212466 32534 -143427 -105933 48511 232250 -38285 231203 -92026 -327585 6591 -128579
12147F937K64427e430E6460d12279B28550e5897B40705a98974C42057l6129c50544
$$ 6937 271364 -5430 56460 -412279 228550 -55897 240705 -198974 342057 305928 -350544
12135d05608e7528D05828E7436J23023e15831i942k22463R8854e7556j00389A74805
$$ -405608 -57528 405828 57436 180459 -515831 -9942 -232405 -133551 -57556 -157945 174805
12123b33566e2923F7737P8575Q9774G499i9542F911N53081B30360m9254j2390
$$ -233566 -52923 67737 146312 236086 7499 -99542 6911 559992 230360 181106 168716
12112A68716H0770c0772k2569j07079N2921E6360Q5089D5443a06298j38145A46782
$$ 168716 80770 -30772 -53341 -160420 -107499 56360 141449 45443 -106298 -244443 146782
12100H8024a80705O8844i451j68735A96818k7529o2054a99620e0471A84651l8031
$$ 88024 -180705 -111861 -9451 -178186 196818 169289 107235 -199620 -50471 184651 146620
12089A46620c85003h1710c2268n0665A03861c4958g918A540a44564G3859b21116
$$ 146620 -385003 -81710 -32268 -82933 103861 -34958 -7918 1540 -144564 73859 -221116
12077d57494d6185q7907m9437A51764a3688E1794k1074a90090I6693K5315B0560
$$ -457494 -46185 -134092 -183529 151764 -13688 51794 30720 -190090 96693 122008 20560
12065a92425R2482B73670q6700K5335J037128R0601D25457A31482J73470A5914
$$ -192425 -99943 273670 186970 212305 1249433 1340034 425457 131482 304952 15914
12054b61140a04469A54811n6816a27008o772A00561k4465R5777b1125k89970i3868
$$ -261140 -104469 154811 97995 -127008 -133780 100561 76096 171873 -21125 -311095 -93868
12042A62747p3214J53727G2642b6116j22478l8259j86977h2206b5058E8611J99951
$$ 162747 89533 243260 72642 -26116 -148594 -186853 -373830 -82206 -25058 58611 258562
12031B58562d1124j40917k09591J41040g1274Q914K2085C67L08575J14006D9854
$$ 258562 -41124 -182041 -391632 -250592 -71274 -62360 -40275 367 308942 422948 49854
12019F0637L0959J13113b25221L1414A39333L78a53618L7042m9758j45508a17075
$$ 60637 91596 204709 -225221 -193807 139333 139711 -153618 -116576 -166334 -311842 -117075
12007a09908A03239a54804A5055b4347k16159k390C1398a37090A47371a17839
$$ -109908 103239 -154804 15055 -24347 -240506 -242896 31398 -137090 147371 -117839
11996b24847A49388j3560E3745b1066m97109B14577F9891J0509b26466B68818
$$ -224847 149388 135828 53745 -21066 -518175 214577 69891 80400 -226466 268818
11985a34060E1890b55965J3760C16532m8975a2096l22982a50638I7349J81897
$$ -134060 51890 -255965 -242205 316532 267557 -12096 -335078 -150638 97349 279246
11975B79246j35839a72881f907k32193a8119B08365h6144A10277a86279C62453
$$ 279246 143407 -172881 -6907 -239100 -18119 208365 -86144 110277 -186279 362453
11964h8230j84461A61027G9768J39198a93706M3124R196A75334O0438p9825a98439
$$ -88230 -272691 161027 79768 218966 -193706 -150582 -141386 175334 235772 155947 -198439
11952A97679L2648b734k14810e7099B94452G7927q027J15358n3275O3320b42117
$$ 197679 230327 -2734 -217544 -57099 294452 77927 69900 185258 131983 195303 -242117
11940i2298r5932j7134C561L6633c24273i5928A16640D9694K12854F7537Q1576
$$ -92298 -188230 -205364 3561 40194 -324273 -95928 116640 49694 262548 67537 149113
11929A49113d06918C0531a27992B1500a16951A21799a53475D4677J03094i7552
$$ 149113 -406918 30531 -127992 21500 -116951 121799 -153475 44677 147771 -97552
11918f8445F1062c6568j42370A36998f3443j7657j9225C8791a82965f1122J2018
$$ -68445 61062 -36568 -178938 136998 -63443 -81100 -100325 38791 -182965 -61122 -49104
11907d9104b4543E7817d99557a55098A15141b92876A78621n4071c64165m626i8621
$$ -49104 -24543 57817 -499557 -155098 115141 -292876 178621 124550 -364165 -368791 -98621
11895c3885h593l7614j56666A35058b04374E9228c44046a6569G4117b34140D02268
$$ -33885 -8593 -46207 -202873 135058 -204374 59228 -344046 -16569 74117 -234140 402268
11883b1881C13744e1149C29035a07670c232F5381K1777m2983r929b19644B05060
$$ -21881 313744 -51149 329035 -107670 -3232 65381 87158 44175 34246 -219644 205060
11871a54763n3494Q0752g94A258L8610a30728a0920j53319I6042C4286O7760m9202
$$ -154763 -208257 -127505 -794 1258 39868 -130728 -10920 -164239 96042 34286 102046 52844
11859E2844G109K9766A12b424C199c04334i9462k51797a26677M3953j00944e2587
$$ 52844 7109 36875 112 -2424 3199 -304334 -99462 -351259 -126677 -82724 -183668 -52587
11846d25672D0178A3530b18307b3688C12764g2336J509j54704A0035J66678j7172
$$ -425672 40178 13530 -218307 -23688 312764 -72336 -70827 -225531 10035 176713 159541
11835A59541a50949A3066b47678i8699A45452b59269a5161n7064h096B26981a15517
$$ 159541 -150949 13066 -247678 -98699 145452 -259269 -15161 -72225 -8096 226981 -115517
11823g8059j3597p0474h0155k0702j34533B3304O8480g2211G4221a8237k83047
$$ -78059 -91656 -162130 -80155 -100857 -235390 23304 91784 -72211 74221 -18237 -301284
11812c01284a1182A19724K26388b380a96l98310N8571i4420m9456A80718h8489
$$ -301284 -11182 119724 346112 -2380 -196 -398506 -339935 -94420 -143876 180718 -88489
11800A93083a90017L1966p1642R8025C1325a7508m63671a32438O5133B43046A17811
$$ 193083 -190017 -158051 -229693 -131668 31325 -17508 -481179 -132438 -67305 243046 117811
11788b67034D2488c0152A53778e081B9648b46629B03277g6788A94566o5427d16990
$$ -267034 42488 -30152 153778 -5081 29648 -246629 203277 -76788 194566 129139 -416990
11776G1531C0422a68080q0772b916A17440A0525K01268d3203B29524a28026e24
$$ 71531 30422 -168080 -248852 -2916 117440 10525 211793 -43203 229524 -128026 -524
11764b94231J08085C08791j49959c72511a51630n4026d4376j98565b5797A5513
$$ -294231 -186146 308791 158832 -372511 -151630 -205656 -44376 -242941 -25797 15513
11753B60808G6843a58281a4435A95703C4094i0816j44319C4144j2336a92595h7159
$$ 260808 76843 -158281 -14435 195703 34094 -90816 -235135 34144 21808 -192595 -87159
11741a83833k23721a91765Q2648K2996j38715A07823K59621a76680B48164H9858
$$ -183833 -407554 -191765 -109117 -86121 -224836 107823 367444 -176680 248164 89858
11730C9210J09199a35751r7041L046A93162a1119q6267C24474a69782J154D50
$$ 39210 148409 -135751 -232792 -229746 193162 -11119 -97386 324474 -169782 -168628 450
11718a98184i8061D3688K19819c59647J4046J39108K8861A01430a10710A70209
$$ -198184 -98061 43688 263507 -359647 -345601 -206493 -177632 101430 -110710 170209
11707A39798a21730L5680A36473l5327d8481A4553O0723f8349H8951c8212l5270
$$ 139798 -121730 -86050 136473 101146 -48481 14553 75276 -68349 88951 -38212 -73482
11696g3482G2218M5524b03871H7514a52931l0842H3210O4165D9566J65063a9134
$$ -73482 72218 117742 -203871 87514 -152931 -183773 83210 147375 49566 214629 -19134
11684A63673C8083J38020D5146L26087r3989F0550J35447K7580A2585K67772c0821
$$ 163673 38083 176103 45146 371233 277244 60550 195997 223577 12585 280357 -30821
11672A0588a23800P186N6563A24864a05577p3642A54679O6782B2076e2492J473
$$ 10588 -123800 -116614 -60051 124864 -105577 -179219 154679 221461 22076 -52492 -51019
11661e1019q935o378D26J30059A9573L0459P3817M2535h7731k23504H8421g2727
$$ -51019 -59954 -66332 426 130485 19573 50032 123849 166384 -87731 -311235 88421 -72727
11648A97922E4729j4604b79237a30450C07465e8919l17562f5917A5218J70277
$$ 197922 54729 40125 -279237 -130450 307465 -58919 -376481 -65917 15218 185495
11638A85495a55171g6731H4196f8477A00633j3005l2654A9267J49020M04734B19248
$$ 185495 -155171 -76731 84196 -68477 100633 87628 54974 19267 168287 573021 219248
11626D6841e7042h05B20401E6065B3118J11107b28278k8239A51680i8770A42219
$$ 46841 -57042 -805 220401 56065 23118 134225 -228278 -256517 151680 -98770 142219
11614g6835p2041D7982f1159I9491c11988C43070A63051K98145A62325K66635
$$ -76835 -148876 47982 -61159 99491 -311988 343070 163051 461196 162325 428960
11604D28960b41175a2455j4034I9498Q7056k0972a24399I9567B1671K44099c22728
$$ 428960 -241175 -12455 -26489 99498 186554 165582 -124399 99567 21671 265770 -322728
11592B55780M8886c04394b421j4473G6671A7206J46143P7294a31009E4705a16979
$$ 255780 304666 -304394 -2421 -16894 76671 17206 163349 240643 -131009 54705 -116979
11580C2318J23640b0954j7250A64603b13530h8232j0315B13688o8073a83813g7608
$$ 32318 155958 -20954 -38204 164603 -213530 -88232 -98547 213688 145615 -183813 -77608
11568c5863H5231b2801j45151f986C33476a3520I1747M45541A18205M868i4827
$$ -35863 85231 -22801 -167952 -6986 333476 -13520 91747 537288 118205 123073 -94827
11556b79051h5445F2970K0661b28387e1281l06873C47375d4322A82088c9008J4259
$$ -279051 -85445 62970 83631 -228387 -51281 -358154 347375 -44322 182088 -39008 -24749
11545b4749p7603H6817J4468A1958a04279L9802k07145F9048J27397h3987D17317
$$ -24749 -102352 86817 101285 11958 -104279 -64477 -271622 69048 196445 -83987 417317
11533C42977A40936n9945K9409d6992p7309A29407e9194H6796K3606B8597J78525
$$ 342977 140936 80991 110400 -46992 -124301 129407 -59194 86796 110402 28597 207122
11522B07122H2461K21668A11342N5099O3123b83379e7297C05434c52256B87870
$$ 207122 82461 304129 111342 166441 229564 -283379 -57297 305434 -352256 287870
11511b30513A57711J35756a11794H5924J70654o7399A6923L68316r4886j08123
$$ -230513 157711 293467 -111794 85924 256578 189179 16923 385239 290353 182230
11501A82230I0816k7528i0279m2245e2585A569J89476F5588N0799C421J04431
$$ 182230 90816 63288 -90279 -132524 -52585 1569 191045 65588 116387 3421 107852
11490A07852L39978B05592I9782N7957d9462A53719J82206r2486a8718F1905K13964
$$ 107852 447830 205592 99782 157739 -49462 153719 335925 243439 -18718 61905 275869
11479B75869a06895A41039M0325a98553n9106A30996B7652a52702A52864a15179
$$ 275869 -106895 141039 181364 -198553 -257659 130996 27652 -152702 152864 -115179
11468d5774B10684G0590J60397a46007B29543b12434A14051b00275C24403a18406
$$ -45774 210684 70590 230987 -146007 229543 -212434 114051 -200275 324403 -118406
11457F9853N559k9277P9406h2289B55920m1292b02040A15989k9172K65564F8863
$$ 69853 75412 46135 125541 -82289 255920 214628 -202040 115989 86817 352381 68863
11445B80652C6868b14454E90372B13271K353A05715O8077A1610L7401G060P7974
$$ 280652 36868 -214454 590372 213271 215624 105715 173792 11610 49011 7060 85034
11434H5034A8670L1525h8572r7508o6683B86854m3537K479c75024D8678b92171
$$ 85034 18670 50195 -88572 -186080 -252763 286854 243317 245796 -375024 48678 -292171
11422b9892B05041e3030A89790F575J64676E6058a20966B48131E4431c8302j06309
$$ -29892 205041 -53030 189790 6575 171251 56058 -120966 248131 54431 -38302 -144611
11411a44611B58826p7981k8684b04340c305k79847J8990G5049a80111k0971A1640
$$ -144611 258826 180845 152161 -204340 -3305 -283152 -264162 75049 -180111 -201082 11640
11399g036D95495I4785c8920j69329A44996a40960k5286A23351b17956b8053E09724
$$ -7036 495495 94785 -38920 -208249 144996 -140960 -166246 123351 -217956 -28053 509724
11387e580A40704A3069c36578F1825i1078C4696J42121A8247A585a34766b0840
$$ -5580 140704 13069 -336578 61825 -91078 34696 176817 18247 1585 -134766 -20840
11375c975B05532k0714b85882A1386J25049Q6334H1882q468b87127A2937G63M0173
$$ -3975 205532 184818 -285882 11386 136435 222769 81882 73414 -287127 12937 763 40936
11363D0936J19997j3327a72994P9595B68084a86845C39317d04052f53F3661K8708
$$ 40936 160933 147606 -172994 -93399 268084 -186845 339317 -404052 -653 63661 92369
11352I2369E944b26817F7285k2928M62204e1119l37096A24377q231d27176a4560
$$ 92369 5944 -226817 67285 44357 506561 -51119 -388215 124377 116146 -427176 -14560
11340B15968f1084j6464o7081E6132b47514C13808a10818J7186B9100b60126A90151
$$ 215968 -61084 -77548 -144629 56132 -247514 313808 -110818 -93632 29100 -260126 190151
11328i907A49747a28168c2674l94781A6849J97646a09677k08494e3479n4739D7611
$$ -9907 149747 -128168 -32674 -427455 16849 214495 -109677 -318171 -53479 -108218 47611
11316F9970j6125c06645a06800p670j56368A5564a04754l1960A70551e8150j54985
$$ 69970 53845 -306645 -106800 -114470 -270838 15564 -104754 -136714 170551 -58150 -213135
11305b13135H772i8571j16666B32630b59139G2317j7582K50206c8261J4549m22534
$$ -213135 8772 -98571 -215237 232630 -259139 72317 54735 304941 -38261 -23712 -446246
11294d46246B16182i8155F5759i6912M3471j57260L6965B20725a88599j5777M3779
$$ -446246 216182 -98155 65759 -96912 -53441 -210701 -173736 220725 -188599 -204376 -160597
11283a60597A84970b12976J2975M0338a8248A86009a07295I9737q526b39355B25437
$$ -160597 184970 -212976 -200001 -159663 -18248 186009 -107295 99737 91211 -239355 225437
11271H1353g0941C09365b1305j02402A51152E3057a48430N3135A12902e5435o1594
$$ 81353 -70941 309365 -21305 -123707 151152 53057 -148430 -95295 112902 -55435 -117029
11260a17029o86B35615p5891h2292D33185h4234B25982a02355j40196h2347A48943
$$ -117029 -117715 235615 159724 -82292 433185 -84234 225982 -102355 -242551 -82347 148943
11248a11877k38858e1364j138j41192d3731D556Q4339a54552e149G9105b27579
$$ -111877 -350735 -51364 -52502 -193694 -43731 4556 88895 -154552 -5149 79105 -227579
11236B2996i8879r5617K7025P5574q1456C48490a13136A18316P6333a95599N7509
$$ 22996 -98879 -194496 -167471 -91897 -173353 348490 -113136 118316 194649 -195599 -138090
11225a38090F7847i006E22505G5809b49010l8971g0279F3611a13958a743A6589
$$ -138090 67847 -9006 522505 75809 -249010 -287981 -70279 63611 -113958 -1743 16589
11213a4349A58338c5474A85552L8520e9107j98396P7153j27455E7025A2839a54370
$$ -14349 158338 -35474 185552 224072 -59107 -257503 -180350 -307805 57025 12839 -154370
11201b62961e6420K6490B6109i7211l61805a11845A13115L952a09133n6995K6475
$$ -262961 -56420 -29930 26109 -97211 -459016 -111845 113115 117067 -109133 -166128 -139653
11190a39653L7921k72540L9801F0523K51897c13697N2158A02474c4804j01530
$$ -139653 -101732 -374272 -334471 60523 312420 -313697 -261539 102474 -34804 -136334
11180a36334j77307B58011C9534e111l96637A19391C0741a9707r5176n5096j06403
$$ -136334 -313641 258011 39534 -5111 -401748 119391 30741 -19707 -114883 -169979 -276382
11169b76382q70A74661h0764l4200H0690K96659g6259j64093h2639A28889a95426
$$ -276382 -277252 174661 -80764 -114964 80690 377349 -76259 -240352 -82639 128889 -195426
11157a95298B01189C4031B700h4789A53681b49351B10866f7314l34250A31655
$$ -195298 201189 34031 2700 -84789 153681 -249351 210866 -67314 -401564 131655
11146A89493k0126c8215G3582a32016k7684N8191q3463C0535a76308D9540L829
$$ 189493 169367 -38215 73582 -132016 -159700 -101509 -184972 30535 -176308 49540 53369
11135E3369K70918A43465b14485b5930A00378b20p2879C80054A45663j1965a51710
$$ 53369 324287 143465 -214485 -25930 100378 -220 -73099 380054 145663 133698 -151710
11123A59075o3453r744c54191a75864o6615f0720C19241a31371c9649j91633L8099
$$ 159075 95622 85878 -354191 -175864 -242479 -60720 319241 -131371 -39649 -231282 -193183
11112a93183D96677e1503E4790a18153A73595m62h8352A25425P0860a53045A01303
$$ -193183 496677 -51503 54790 -118153 173595 173133 -88352 125425 196285 -153045 101303
11100F796K17911j4137J009O9465H6560j4294e1061A63729j1767c95857i4939
$$ 6796 224707 210570 211579 281044 86560 72266 -51061 163729 151962 -395857 -94939
11088d3876C2848M43645k10688K4991L760E9030J20952J05157C35J88281k8995
$$ -43876 32848 476493 265805 290796 294556 59030 179982 285139 335 188616 159621
11077A59621K1894R261J72348m9284M1620j13319J60835j83030b9255B31102K48754
$$ 159621 181515 190776 363124 313840 355460 242141 402976 219946 -29255 231102 479856
11066D79856k01694q3800L20155A99980K07568j20714L32989k20821L0866J79666
$$ 479856 278162 194362 514517 199980 407548 286834 619823 399002 429868 609534
11056F09534m0555O0620k66248K93052j2210k20063M1535L94239l02983R1816
$$ 609534 568979 629599 363351 656403 644193 424130 465665 859904 556921 648737
11046F48737N16889m49083Q7931M0379j91524R0327j74681K10020P1317C82256
$$ 648737 1165626 716543 804474 844853 653329 743656 568975 778995 850312 382256
11035G79348l25079L88677l20403r8804L96672j87405k63959L70740J4855J42319
$$ 779348 454269 842946 522543 423739 820411 633006 369047 739787 754642 896961
11025H96961l70105L5164j47363K06924k41657J11374j7338K32791n6892m9803
$$ 896961 526856 562020 414657 621581 379924 491298 473960 706751 649859 600056
11015F00056L18479D53674K023K26490j12916j19354K99479N4881C02175L20714
$$ 600056 918535 453674 455697 682187 569271 449917 749396 804277 302175 622889
11005F22889N066B3971O38661j81482L05346k81739J82746C18167J27407J95368
$$ 622889 627955 23971 662632 481150 786496 504757 687503 318167 445574 640942
10995F40942L1567J27171j07752P0805N220p1663o4254K20790r5974K48743k07824
$$ 640942 672509 799680 691928 762733 767953 696290 632036 852826 756852 1005595 797771
10984G97771J05670k2029K18496N8740k3839M3735L45519O974P2139L82513K04501
$$ 797771 903441 881412 1099908 1158648 1134809 1178544 1524063 1531037 1603176 1985689 2190190
10973B190190N7043N08822o1627R0508j13120l46152l9025m36555L0787m59464
$$ 2190190 2247233 2756055 2694428 2784936 2671816 2325664 2286639 1850084 1880871 1421407
10963A421407J53455O6358n6782P1472j38761m3798K8859M17037k79032l65133
$$ 1421407 1574862 1641220 1584438 1655910 1517149 1473351 1502210 1919247 1640215 1275082
10953A275082P4447l94669j30723D00921L63265B83867J47160O932K05510q7592
$$ 1275082 1349529 954860 824137 400921 764186 283867 431027 437959 643469 555877
10943E55877A30185K603J18712K05218k09343F7475K50852j53566b30265H0716
$$ 555877 130185 132788 251500 456718 247375 67475 318327 164761 -230265 80716
10932A39307K03811a58186B12011N4972d7613F877q79J08117A0790K46427h5248
$$ 139307 343118 -158186 212011 266983 -47613 6877 5998 114115 10790 257217 -85248
10920B31860K67386b64242a31363r9652b716I9105a69781A69492a4941k175G1726
$$ 231860 499246 -264242 -131363 -231015 -2716 99105 -169781 169492 -14941 -17116 71726
10908A11161C0704g5478j66228A42712A5000e658m7106B03193B3240c29382k65196
$$ 111161 30704 -75478 -241706 142712 15000 -5658 -52764 203193 23240 -329382 -594578
10897e94578i5489a1863D5999j2433a88822j20973A26122P963a87712q780H0883
$$ -594578 -95489 -11863 45999 33566 -188822 -309795 126122 134085 -187712 -196492 80883
10885b04629A24322J07557O4909A05434c99186b925B88592b5474A30075b50024
$$ -204629 124322 231879 296788 105434 -399186 -2925 288592 -25474 130075 -250024
10874E1474N0228c5858j33819j67376A35438K10507a00693B14479a03746B06414
$$ 51474 101702 -35858 -169677 -337053 135438 345945 -100693 214479 -103746 206414
10863c8575j94965b0700l04059e1570C6160j4859a83147A07815e8818A29440E6356
$$ -38575 -233540 -20700 -324759 -51570 36160 21301 -183147 107815 -58818 129440 56356
10851F1822p527f1510j13540k29677g6683B32420a45691K7982I7922a47378B26045
$$ 61822 54295 -61510 -175050 -404727 -76683 232420 -145691 -117709 97922 -147378 226045
10839A93458f4986j96257J05105e8863k1034B51455b27455I8137i9455F940M06139
$$ 193458 -64986 -261243 -156138 -58863 -79897 251455 -227455 98137 -99455 6940 413079
10828D13079a39191k71080I8751m3235c25383C7772a10187j32491J11187b0685
$$ 413079 -139191 -410271 98751 55516 -325383 37772 -110187 -242678 -131491 -20685
10817a69337F9649i9526I1268c91832a09326j47986A5377J82699a40024p6866
$$ -169337 69649 -99526 91268 -391832 -109326 -257312 15377 198076 -140024 -216890
10807b16890P2776P1800B39479a59989j05661A43005b44820c4283F4046J63202
$$ -216890 -144114 -72314 239479 -159989 -265650 143005 -244820 -34283 64046 227248
10797B27248b73847c1315k29172B43151q8758p4253C8373a09795j01215O1266
$$ 227248 -273847 -31315 -260487 243151 154393 80140 38373 -109795 -211010 -149744
10787a49744G9968a49076D204i3732b0625l901j87946F1794a29735B46928A0133
$$ -149744 79968 -149076 4204 -93732 -20625 -24526 -212472 61794 -129735 246928 10133
10775B29466g6257j31080F4505c94166D1773L4632a946m6759j8738A54732a38381
$$ 229466 -76257 -207337 64505 -394166 41773 76405 -1946 -48705 -67443 154732 -138381
10763a28721k94298f6949A0983J54465j7767b89138A4207a94942A04868J7299
$$ -128721 -423019 -66949 10983 165448 147681 -289138 14207 -194942 104868 122167
10753A22167B6371J88435c97866J54778n1077a12963A7904J36092J23390b01161
$$ 122167 26371 214806 -397866 -243088 -294165 -112963 17904 153996 277386 -201161
10742a13935j16057a06097L6111D3428b4878A04617Q2003a82536A53740a00334
$$ -113935 -229992 -106097 -69986 43428 -24878 104617 186620 -182536 153740 -100334
10731b74692A25847h2461B89397d29034h7760l4537j9576J9505e4639l692B40350
$$ -274692 125847 -82461 289397 -429034 -87760 -122297 -141873 -122368 -54639 -58331 240350
10719i9418E7330D181J35382C3248O7835b13830G302i3642D2150d13697a14515
$$ -99418 57330 4181 139563 33248 101083 -213830 7302 -93642 42150 -413697 -114515
10707C707a74280D2627Q4032e8786k18974E6986L02018a90670i518F0187j2403
$$ 3707 -174280 42627 126659 -58786 -277760 56986 359004 -190670 -9518 60187 47784
10696D7784b45118J21147j87880J01716A24889R2806a5568k70162f1926A96004
$$ 47784 -245118 -123971 -311851 -210135 124889 217695 -15568 -285730 -61926 196004
10685c4680l49346a09817N3340A14966b17435F3795N1371e7659A33688a31940
$$ -34680 -384026 -109817 -56477 114966 -217435 63795 115166 -57659 133688 -131940
10674B60957I9324b15357d1435j05409j02507J07333j436j21553L7466f951m67495
$$ 260957 99324 -215357 -41435 -146844 -249351 -142018 -143454 -265007 -227541 -6951 -474446
10663d74446a32389g125B41457r7528b16254B9502a15785D22599c35268H0220
$$ -474446 -132389 -7125 241457 143929 -216254 29502 -115785 422599 -335268 80220
10652A8501N5405c13731G6344b06822B02425a29117o72N8068j64773A48882J1729
$$ 18501 73906 -313731 76344 -206822 202425 -129117 -129789 -71721 -236494 148882 160611
10641A60611m8366a27852K4j8171k2627b0107m31460a19859J7572a8273j65631
$$ 160611 112245 -127852 -127828 -145999 -168626 -20107 -451567 -119859 -102287 -18273 -183904
10630a83904c2892E5507a32648C1509J71779I9193h617j35498l1129K1344A32704
$$ -183904 -32892 55507 -132648 31509 203288 99193 -8617 -144115 -175244 -153900 132704
10618A68434a18503p2674B43352D8182P6110P7818a80188b6101J0852q7685J4385
$$ 168434 -118503 -191177 243352 48182 124292 202110 -180188 -26101 -15249 -102934 -88549
10607h8549C2936i0084j64444a04744j41840A88736l2851G2063d9823B27633h0561
$$ -88549 32936 -90084 -254528 -104744 -246584 188736 155885 72063 -49823 227633 -80561
10595i26j88063A14429h1088C29558A26140j1663b37655B12192c48212C2262R1788
$$ -926 -188989 114429 -81088 329558 126140 114477 -237655 212192 -348212 32262 124050
10584A24050a45581O3093A45194c54260A47970l7108l8711P5812E0816b68975
$$ 124050 -145581 -82488 145194 -354260 147970 110862 72151 147963 50816 -268975
10573G8929b05027N1720A28121h6554j58340C989a50380B01775c7042A10624a53462
$$ 78929 -205027 -153307 128121 -86554 -244894 3989 -150380 201775 -37042 110624 -153462
10561b82605E7693h4585j27963B81738j16930a68125e3380A39115a1198k36111
$$ -282605 57693 -84585 -212548 281738 164808 -168125 -53380 139115 -11198 -247309
10551b47309d6670k19536F4021L7266A6008d04306b8996k88786A27395a68328
$$ -247309 -46670 -266206 64021 101287 16008 -404306 -28996 -317782 127395 -168328
10540d71658A46797d4019H3259O4041b10204n6722j0767L3868d8317I3523J17647
$$ -471658 146797 -44019 83259 147300 -210204 -266926 -277693 -243825 -48317 93523 211170
10529B11170a14099d2778A09553f7878j66668G3022c27804A41461m4858b18641
$$ 211170 -114099 -42778 109553 -67878 -234546 73022 -327804 141461 96603 -218641
10518B15451I7264b24093o1830m9803E9381b03012G0297b14556e2420j10327A72180
$$ 215451 97264 -224093 -285923 -335726 59381 -203012 70297 -214556 -52420 -162747 172180
10506I1549a15123G5358M5162a74060b1713j43529i686j01547p6797A16498Q8108
$$ 91549 -115123 75358 120520 -174060 -21713 -165242 -9686 -111233 -188030 116498 204606
10495B04606e4825j26501G2846J3161L00957a02542L7092o6411j78609e5104A77418
$$ 204606 -54825 -181326 72846 86007 386964 -102542 -65450 -131861 -310470 -55104 177418
10483b35120B88340a1510I5031l634l4623j9036K18047b18344E18093E4457J05931
$$ -235120 288340 -11510 95031 91397 56774 37738 255785 -218344 518093 54457 160388
10472A60388a21076A72747J08076a54796A52943b16607A6502e6636J8786N310
$$ 160388 -121076 172747 280823 -154796 152943 -216607 16502 -56636 -37850 -32540
10462c2540A01245j2998i327j58982C6430P2177b18505E5721a25279F1005i0573
$$ -32540 101245 88247 -9327 -168309 36430 108607 -218505 55721 -125279 61005 -90573
10450A06190c04612B25005F6887N081B034K38300a537B4277K08707A12134D7342
$$ 106190 -304612 225005 66887 71968 2034 240334 -1537 24277 232984 112134 47342
10438A81759b56577O5816L3990j1628A8016b51705A59928d4667j82956p8852N5252
$$ 181759 -256577 -190761 -156771 -168399 18016 -251705 159928 -44667 -227623 -306475 -251223
10427b51223A63206Q0681f1334A18515a81924P4983E8543a57300B0973c07075
$$ -251223 163206 243887 -61334 118515 -181924 -106941 58543 -157300 20973 -307075
10416i9565D546f5869D14678b49239a12654j9311A98182L6264i1824j62616D6248
$$ -99565 4546 -65869 414678 -249239 -112654 -131965 198182 234446 -91824 -254440 46248
10404h7249B67393a32664j56332j00a10044A65332B5095k709e3750B40241G2986
$$ -87249 267393 -132664 -288996 -289096 -110044 165332 25095 22386 -53750 240241 72986
10392A44226M3666P0317n4320q3676J18270k352n7214a61885A8943J06773J08215
$$ 144226 187892 258209 203889 120213 238483 236131 178917 -161885 18943 125716 233931
10381B33931a19415B14509b15627G2760O1692o1346J8076J36264M638k646K0610
$$ 233931 -119415 214509 -215627 72760 134452 73106 91182 227446 232084 229438 250048
10370B50048d403B11882J63524r3820M98193C09830Q6334j69876m0738a48408
$$ 250048 -4403 211882 375406 281586 779779 309830 396164 226288 185550 -148408
10359C46636g1145E8420d6825A27086d1744A05884a6806m2473D99061r18n8893
$$ 346636 -71145 58420 -46825 127086 -41744 105884 -16806 -59279 499061 498143 439250
10348D39250j44326R9632p9096b6423E10451k47883q1232K12479A77410a12344
$$ 439250 294924 394556 315460 -26423 510451 262568 181336 393815 177410 -112344
10337F16157A67690B5893K67713j12540e2660A16588K38733D625R4956J0305I173
$$ 616157 167690 25893 293606 181066 -52660 116588 355321 4625 99581 109886 9173
10325A10825J41501A2520K33709I0554M04904A02585c7250D21004j85312M4244
$$ 110825 252326 12520 246229 90554 495458 102585 -37250 421004 235692 279936
10315B79936E1206a07823q0326c4493B15449a79965A35418g5293k29276M2981
$$ 279936 51206 -107823 -188149 -34493 215449 -179965 135418 -75293 -304569 -261588
10305b61588J11006g0849k03206d6030E927a29004A85862a01572B08552L2098
$$ -261588 -150582 -70849 -274055 -46030 5927 -129004 185862 -101572 208552 240650
10295B40650M9423j42631a72160A10483f6062j87082J0117J4195R9633I8313J90892
$$ 240650 290073 147442 -172160 110483 -66062 -253144 -243027 -228832 -129199 98313 289205
10284B89205E3022e37682B80513H8264a84096p0628a13765q9395E7833J3849b03295
$$ 289205 53022 -537682 280513 88264 -184096 -254724 -113765 -203160 57833 71682 -203295
10272C6453O3266b29806E7178a52625A2121Q5003a70016b7301G8665L29179a71880
$$ 36453 99719 -229806 57178 -152625 12121 97124 -170016 -27301 78665 407844 -171880
10260D43485j48954K3735p0575K15099j07588r1770P7845a67682C9954N6942J35146
$$ 443485 294531 318266 247691 462790 355202 263432 341277 -167682 39954 96896 232042
10249B32042k9726O2979a37364r8510D1060a0497A02126d7962k9194b8041j20058
$$ 232042 202316 265295 -137364 -235874 41060 -10497 102126 -47962 -77156 -28041 -148099
10238a48099n841O0521o9106g2196j9259B5001J59800b80938A63847b536k13957
$$ -148099 -153940 -93419 -162525 -72196 -91455 25001 184801 -280938 163847 -2536 -216493
10227b16493k022J03145A68451c51919C0981a11978q5546g7741E1841k82A7534
$$ -216493 -218515 -115370 168451 -351919 30981 -111978 -197524 -77741 51841 51559 17534
10215A08126m6529a08259j22578a9767r6854N1121I3272a35307N4555J3144j05818
$$ 108126 61597 -108259 -230837 -19767 -116621 -65500 93272 -135307 -80752 -67608 -173426
10204a73426e0974B33784B9373K35625A09002a59434N4440K2084J0947b0595B16481
$$ -173426 -50974 233784 29373 264998 109002 -159434 -104994 -82910 -71963 -20595 216481
10192a63090l2948p41A34703E0901b02600A70398G4092H445L2227a95785R389
$$ -163090 -196038 -196779 134703 50901 -202600 170398 74092 8445 40672 -195785 -186396
10181a86396N3499j63998A4740a11985B98509c66906b0474K963j41997I4307b92809
$$ -186396 -132897 -296895 14740 -111985 298509 -366906 -20474 -17511 -159508 94307 -292809
10169A03992l7196k3642M1373h5752k23512a43087J5762b3625C95667b6540A79038
$$ 103992 66796 43154 84527 -85752 -309264 -143087 -127325 -23625 395667 -26540 179038
10157G7958e32690b21543g6569G8626J17751n8867b10619B95410b34609C63059
$$ 77958 -532690 -221543 -76569 78626 196377 137510 -210619 295410 -234609 363059
10146b25944d2088p5883j64066k8897P5222a862j98432O3481f2349C15579j1251
$$ -225944 -42088 -117971 -282037 -310934 -235712 -1862 -200294 -136813 -62349 315579 304328
10135C04328I8805a61404A30564i5269H4768b1787F5916i5534k13080A63486b74514
$$ 304328 98805 -161404 130564 -95269 84768 -21787 65916 -95534 -308614 163486 -274514
10123F162M1409a82865O8137E9375c79499a83879J3811p7275d5971B9879Q0940
$$ 6162 47571 -182865 -114728 59375 -379499 -183879 -170068 -247343 -45971 29879 110819
10112A10819c7463k152b19A68270O0322a91616Q3971L7788m80732a36521l058
$$ 110819 -37463 -39615 -219 168270 228592 -191616 -107645 -69857 -550589 -136521 -139579
10101a39579j2086k30779A02298J65559R3114a66954B4878b5564A14076b45541
$$ -139579 -151665 -382444 102298 267857 360971 -166954 24878 -25564 114076 -245541
10090c35816b5030l33186A00647b12430O0705a3075p8564q7293k97845a23644
$$ -335816 -25030 -358216 100647 -212430 -151725 -13075 -91639 -178932 -476777 -123644
10079a19665e2935A6054d9189J1743j25186f9774p1194e9374A89815A9067K12472
$$ -119665 -52935 16054 -49189 -37446 -162632 -69774 -140968 -59374 189815 19067 231539
10068B31539A03051a78580c3983B05018b41325J1535n2610H4293l5571f9261J8820
$$ 231539 103051 -178580 -33983 205018 -241325 -229790 -282400 84293 48722 -69261 -50441
10057e0441k03410N7852g7317L8311l77205J75433J06172A38708G322a08225I8019
$$ -50441 -253851 -195999 -77317 -39006 -416211 -240778 -134606 138708 7322 -108225 98019
10045a96278K6787l5599C0138K0241i834l8066j56646E7233b7761B8178a61005
$$ -196278 -169491 -205090 30138 50379 -9834 -47900 -204546 57233 -27761 28178 -161005
10033c16327J20718j00357C04844b21566L0645J0688E5804J36490a32499C0257
$$ -316327 -195609 -295966 304844 -221566 -190921 -180233 55804 192294 -132499 30257
10022D5042a15604D5051a85369b8139A54203d17587E0744a53356r0100A71230
$$ 45042 -115604 45051 -185369 -28139 154203 -417587 50744 -153356 -243456 171230
10011c6649g539j06520A38000d21602a08336j81224P5439F2459b98410R2639j4646
$$ -36649 -7539 -114059 138000 -421602 -108336 -289560 -214121 62459 -298410 -205771 -220417
10000b20417a0946k71125f1879j07521b4167C60685I7453M2201M8561o9782e1058
$$ -220417 -10946 -282071 -61879 -169400 -24167 360685 97453 139654 188215 118433 -51058
9988a07553o591n023L3823j44374P0354l43777g0628E8807N1059b48167d7078
$$ -107553 -114144 -119167 -85344 -229718 -159364 -503141 -70628 58807 109866 -248167 -47078
9976d44730f1925k02182A9355a56333b3420j56168N3880j94794j1913H333e6667
$$ -444730 -61925 -264107 19355 -156333 -23420 -179588 -125708 -320502 -332415 8333 -56667
9964d34103G2220d09942a54296j33357b9569j53403m3775k00103b612o5592j60310
$$ -434103 72220 -409942 -154296 -287653 -29569 -182972 -226747 -426850 -2612 -68204 -228514
9953b28514B01515d17890a07499A21481a10863B17614a08856j88422m5569i6019
$$ -228514 201515 -417890 -107499 121481 -110863 217614 -108856 -297278 -342847 -96019
9942A1160i6481B7687a26014j08175J13968A30828o3503i5172A00355A9913N2727
$$ 11160 -96481 27687 -126014 -234189 -120221 130828 67325 -95172 100355 19913 72640
9931G2640b2654A84749N392R5580F461f9471B8513b5358A04619N1555B1575L7718
$$ 72640 -22654 184749 190141 285721 6461 -69471 28513 -25358 104619 156174 21575 59293
9919E9293k1927L5484J05472a94147r7652A80342J27320c03292A74762a5978k74080
$$ 59293 37366 72850 178322 -194147 -291799 180342 307662 -303292 174762 -15978 -290058
9908b90058L5597j07284a15899k1472N9888A75843K9636F6173b30585B02996l1755
$$ -290058 -254461 -361745 -115899 -137371 -77483 175843 205479 66173 -230585 202996 171241
9897A71241i9409j14305H5408K9349a46224C5765c28530E0481P5863k0527b13925
$$ 171241 -99409 -213714 85408 114757 -146224 35765 -328530 50481 126344 105817 -213925
9885a16469r2894h8811o0457H9025b58020A81585b83798G6088b09626Q3975j1824
$$ -116469 -209363 -88811 -149268 89025 -258020 181585 -283798 76088 -209626 -125651 -137475
9874a37475q902B7657d1827n9294j27L8527A05862c54363J6822A0198M4175c6365
$$ -137475 -146377 27657 -41827 -101121 -101248 -62721 105862 -354363 -337541 10198 54373 -36365
9861a74829j36538A45444b82383A04034b26976Q2204K263m35820A26010C0830
$$ -174829 -311367 145444 -282383 104034 -226976 -144772 -142509 -578329 126010 30830
9850d34069a89220n1329A00630d4867n5202n0812A76052c86138a3672B80777c06615
$$ -434069 -189220 -240549 100630 -44867 -100069 -150881 176052 -386138 -13672 280777 -306615
9838c7665j25331j26253a26812l3000P7526j77039H8228b05237R2811o0226J0213
$$ -37665 -162996 -289249 -126812 -159812 -82286 -259325 88228 -205237 -112426 -172652 -162439
9827a62439C48154c13106h1881K1327N079n3607F7756a28617N3974D7467N1300
$$ -162439 348154 -313106 -81881 -60554 -55475 -109082 67756 -128617 -74643 47467 98767
9816I8767a80424P6638b2940q4369j33392L5503G527H74a36938O2647H0148J27940
$$ 98767 -180424 -103786 -22940 -107309 -240701 -205198 7527 874 -136938 -74291 80148 208088
9804B08088f1607C4835d9783K3522j79720A02648b78547B18373l8140d5184j9191
$$ 208088 -61607 34835 -49783 -26261 -205981 102648 -278547 218373 180233 -45184 -64375
9793f4375o4601A24364b58366D9791a12887A64414h397A80122a67246f2054l16403
$$ -64375 -128976 124364 -258366 49791 -112887 164414 -8397 180122 -167246 -62054 -378457
9782c78457k673A14222a96861j46895B79433D4181K05058a39447N0201B14538
$$ -378457 -381130 114222 -196861 -343756 279433 44181 249239 -139447 -89246 214538
9771a68425k19139g7484b4520G632h6231l5950G1418b65336A00994M1616a91996
$$ -168425 -387564 -77484 -24520 7632 -86231 -122181 71418 -265336 100994 142610 -191996
9759a88305D6039c31394F3990b30245l65613D0627a11730G5122b5668p327A05518
$$ -188305 46039 -331394 63990 -230245 -595858 40627 -111730 75122 -25668 -32995 105518
9747e1648J593q7125B96532N0979B832L696M5027b44486d5454B78033B3135a85226
$$ -51648 -50055 -137180 296532 347511 2832 6528 51555 -244486 -45454 278033 23135 -185226
9734B90483a50882A48678l1505c23705J48429B1883P4954D5697K6996a36314I643
$$ 290483 -150882 148678 117173 -323705 -175276 21883 96837 45697 72693 -136314 9643
9722b26262B74540F9389a73577D5546d89322A09551a31192A95053c5444E7085
$$ -226262 274540 69389 -173577 45546 -489322 109551 -131192 195053 -35444 57085
9711A67669b96981n185n9390B4604a66740b336j51409L7807c5453l7472j49285
$$ 167669 -296981 -302166 -361556 24604 -166740 -2336 -153745 -115938 -35453 -72925 -222210
9700b22210i2712l22707F2707a58656l03721C85639h44A23080n092g4952o9226
$$ -222210 -92712 -415419 62707 -158656 -462377 385639 -844 123080 117988 -74952 -144178
9689a44178q7120H8410d13379A38036d8682r9422d9919k22264g1817D7345b8055
$$ -144178 -231298 88410 -413379 138036 -48682 -148104 -49919 -272183 -71817 47345 -28055
9677A4852b28614d5830E6516d21937i3549K5214j17130A86280G2430J12291a10919
$$ 14852 -228614 -45830 56516 -421937 -93549 -68335 -185465 186280 72430 184721 -110919
9665B72688r5436b0650l41401g8536j60429b5454I3229g2472j67482F7060g5399
$$ 272688 177252 -20650 -362051 -78536 -238965 -25454 93229 -72472 -239954 67060 -75399
9653b34244a5430A20713a61153d0632B9568b84534a873j24300l4676B1892g7950
$$ -234244 -15430 120713 -161153 -40632 29568 -284534 -1873 -126173 -160849 21892 -77950
9641d57833A10647i7358a5227o9401A27737b12038j88344j37504a72412E6097
$$ -457833 110647 -97358 -15227 -84628 127737 -212038 -400382 -537886 -172412 56097
9630a76710A121a67955j28168i7419j02115A7120J97272G9294a57120q3393K0231
$$ -176710 1121 -167955 -296123 -97419 -199534 17120 214392 79294 -157120 -240513 -220282
9619b20282D53306A58959a34662J0592k7021k78784c790n6154B9488Q9717L671
$$ -220282 453306 158959 -134662 -124070 -151091 -429875 -3790 -59944 29488 119205 122876
9608A22876c55479n300E3151L15328C9803b9775I5321J31847d2063l38526J74920
$$ 122876 -355479 -360779 53151 368479 39803 -29775 95321 227168 -42063 -380589 -205669
9597b05669A50002c92668i2532j66944J22566A27528b08022f3887A57865a02481
$$ -205669 150002 -392668 -92532 -259476 -136910 127528 -208022 -63887 157865 -102481
9586B0487a99981A08311b8928q1653N0921D41666i9657c7765j68927H2119b2060
$$ 20487 -199981 108311 -28928 -110581 -59660 441666 -99657 -37765 -206692 82119 -22060
9574c995l04082i9953p778a3328A82330p3843Q3569I1795e95117b08973A42083
$$ -3995 -308077 -99953 -107731 -13328 182330 108487 192056 91795 -595117 -208973 142083
9562A00509A7466a79343j51571k81852B41554p1225A2673K31933b18146A68013
$$ 100509 17466 -179343 -330914 -612766 241554 170329 12673 244606 -218146 168013
9551b19993k42938i0287A46949e3149k84578B1826b20720A40477i3520c6678j44788
$$ -219993 -462931 -90287 146949 -53149 -337727 21826 -220720 140477 -93520 -36678 -181466
9540a81466I7597b67762J15742a2814m6733A67935o851a68733I5985b9896l34444
$$ -181466 97597 -267762 -152020 -12814 -59547 167935 161084 -168733 95985 -29896 -364340
9529c64340A02636a37180p5809j9781k39782E5944K22102A18989a41777e4114
$$ -364340 102636 -137180 -212989 -232770 -472552 55944 278046 118989 -141777 -54114
9518b94639B10000c23950h3417j06145m627B51609b95674c778l02313h45k30773
$$ -294639 210000 -323950 -83417 -189562 -194189 251609 -295674 -3778 -306091 -845 -231618
9507b31618g7316A5152g6416A39352J13643d09776B06653a38218B74331g4386
$$ -231618 -77316 15152 -76416 139352 252995 -409776 206653 -138218 274331 -74386
9496a55912o3485K5384L7679D8995a97252Q0469j04727A39524a4863j87700e06
$$ -155912 -219397 -194013 -156334 48995 -197252 -116783 -221510 139524 -14863 -202563 -506
9484c64297a7786k89132P3748a3898j17485k8082m43945D4174d50121i9284G7434
$$ -364297 -17786 -306918 -233170 -13898 -131383 -159465 -603410 44174 -450121 -99284 77434
9472D03279a21743A80485b3878E3320a70445C4671a0462j62017n0910j09528k7975
$$ 403279 -121743 180485 -23878 53320 -170445 34671 -10462 -172479 -223389 -332917 -360892
9461c60892B8002M69660d29708K00971A14131g8634H6563a01733m11602G6008
$$ -360892 28002 497662 -429708 -228737 114131 -78634 86563 -101733 -513335 76008
9450A96532b87188J31424f984B21902c18957R0030D65a03661l4664m124b3241
$$ 196532 -287188 -155764 -6984 221902 -318957 -228927 465 -103661 -138325 -142449 -23241
9438a17603m2850A03225i3237C0035a31171k2620B0653d30383a89484b027F7981
$$ -117603 -160453 103225 -93237 30035 -131171 -153791 20653 -430383 -189484 -2027 67981
9426A66127b45398a4103A16932n75J48889j04167a62969b4602j33366c7399i673
$$ 166127 -245398 -14103 116932 116357 265246 161079 -162969 -24602 -157968 -37399 -9673
9414B1929b46085E01742B5064h6787C1031d24501J03772H4090L3538a1146j15859
$$ 21929 -246085 501742 25064 -86787 31031 -424501 -320729 84090 117628 -11146 -127005
9403a27005M252E5852a5454B33994b07067B2693a11367F967a34619H4208a18002
$$ -127005 -122753 55852 -15454 233994 -207067 22693 -111367 6967 -134619 84208 -118002
9391f8988F313b02448I8053a43893A09423a51609b1801A07234e1928l28626a29134
$$ -68988 6313 -202448 98053 -143893 109423 -151609 -21801 107234 -51928 -380554 -129134
9379D7646L444i9692r8212g9105j18887n6867l4021J29188j48553B34690c41523
$$ 47646 51090 -99692 -197904 -79105 -197992 -254859 -288880 -159692 -308245 234690 -341523
9367a09186j746N0797j51332C07298c3757n0972K7893k9687j8215a0543H9979
$$ -109186 -110932 -60135 -211467 307298 -33757 -84729 -56836 -86523 -104738 -10543 89979
9355a71228B41874c47841C1608d5958q3548e6364G613b52531k06922A582c4300
$$ -171228 241874 -347841 31608 -45958 -129506 -56364 7613 -252531 -459453 1582 -34300
9343f1256B6436N1127h2680c9504F0139a39877i313A36683g9592a5001m22284
$$ -61256 26436 77563 -82680 -39504 60139 -139877 -9313 136683 -79592 -15001 -437285
9332d37285E06684a57614j02381B1813N1097b16330N1997J8241O3776l0432k55605
$$ -437285 506684 -157614 -259995 21813 72910 -216330 -164333 -146092 -82316 -112748 -368353
9321c68353J33076j3263B28511h1285K8609A35405a60148i801l44294o0661A33862
$$ -368353 -235277 -248540 228511 -81285 -52676 135405 -160148 -9801 -354095 -414756 133862
9309b15869p2437N834J09254A1574c79047A35742j4430b81845A12578a04663n7288
$$ -215869 -288306 -282472 -173218 11574 -379047 135742 121312 -281845 112578 -104663 -161951
9298a61951B20626a18082m3529D7709a27879d1276p8142A95196h6250F4106P0403
$$ -161951 220626 -118082 -161611 47709 -127879 -41276 -119418 195196 -86250 64106 134509
9287A34509a57181N4834C9325c7264q7978p5795J7166P2704B51189n2131p1100
$$ 134509 -157181 -102347 39325 -37264 -125242 -201037 -183871 -111167 251189 199058 127958
9276A27958n9241l0478e34A39682a63269H0150d8914A00789b01923A81173b90968
$$ 127958 68717 38239 -534 139682 -163269 80150 -48914 100789 -201923 181173 -290968
9264C19685a97982f3426k10971A33950a63491B72198a59891j799A91136d200n3487
$$ 319685 -197982 -63426 -274397 133950 -163491 272198 -159891 -161690 191136 -4200 -57687
9253e7687l2353A51555C3804b49347J20989L244j64604d0814j09552K0160p4163
$$ -57687 -90040 151555 33804 -249347 -128358 -125114 -289718 -40814 -150366 -130206 -204369
9242b04369A76181h0304K5238k17876J1453h7187d2719j64772j8808C44972G6785
$$ -204369 176181 -80304 -55066 -272942 -261489 -87187 -42719 -207491 -226299 344972 76785
9230b10555i5328q1547g9698a0638j89841f9963b4819B2413b40136J02217K97
$$ -210555 -95328 -176875 -79698 -10638 -200479 -69963 -24819 22413 -240136 -137919 -137622
9219a37622j58718i6182f029r0451l8728B94530d4153A46460i0534n8814l8811
$$ -137622 -296340 -96182 -6029 -96480 -135208 294530 -44153 146460 -90534 -149348 -188159
9208a88159n7115a00778o0823j30906A70028a12562P356G706b34686C45743H1095
$$ -188159 -245274 -100778 -161601 -292507 170028 -112562 -105206 7706 -234686 345743 81095
9196H3114K27586a67341j74761a42515d0546r5565A83454j463a9291m19055a90361
$$ 83114 310700 -167341 -342102 -142515 -40546 -136111 183454 181991 -19291 -438346 -190361
9184a71565O1630r095j24393j02485K3615F1051O026b8090j12852N9573A62958
$$ -171565 -109935 -119030 -243423 -345908 -322293 61051 67077 -28090 -140942 -81369 162958
9172h672l47368a36419J9339I8721a77882l69742a30947j37269A94767p6594e4611
$$ -8672 -356040 -136419 -117080 98721 -177882 -547624 -130947 -268216 194767 118173 -54611
9160b35805d2575j5576q5049b0034B00312a37317k6370n6096f5392A45315j0160
$$ -235805 -42575 -58151 -143200 -20034 200312 -137317 -163687 -219783 -65392 145315 135155
9149A35155d0836j70968R0856L7783k33420b1390r4332M9777q2127a2798r4214
$$ 135155 -40836 -211804 -120948 -83165 -316585 -21390 -115722 -65945 -148072 -12798 -107012
9138a07012c5243I1037P9975f4812B51240C768g8583A18520J60498a86591B18970
$$ -107012 -35243 91037 171012 -64812 251240 3768 -78583 118520 279018 -186591 218970
9126a60829K9282E4084e4500K399A61209h040m7705E1265K87134l4766d5073d17
$$ -160829 -131547 54084 -54500 -52101 161209 -8040 -55745 51265 338399 303633 -45073 -417
9113B54036A4106g5604a1828j2028A3523b27522j23856A8134Q4001a05460D46856
$$ 254036 14106 -75604 -11828 -23856 13523 -227522 -351378 18134 102135 -105460 446856
9101a45600G076b03872e728B5580P770h8318l58908d6213j8433J1508r1480A30170
$$ -145600 7076 -203872 -5728 25580 33350 -88318 -447226 -46213 -64646 -53138 -144618 130170
9088G4495b56347l7352f8174j06023E1321K32362A1281J17551a54542k44681J86349
$$ 74495 -256347 -293699 -68174 -174197 51321 283683 11281 128832 -154542 -399223 -212874
9077b12874b500A89966f443j52739K7270A11915n0232k5518K39930h3245k21266
$$ -212874 -2500 189966 -6443 -159182 -131912 111915 61683 36165 276095 -83245 -304511
9066c04511B9754a86079O8687l15781a63422C11373I7171L82754A51701m8791
$$ -304511 29754 -186079 -117392 -433173 -163422 311373 97171 479925 151701 102910
9056A02910J0308a3266K782A15186L853g3993K2134I1601a27904j9444A7315b7063
$$ 102910 113218 -13266 -10484 115186 119039 -73993 -51859 91601 -127904 -147348 17315 -27063
9043b42568a17170E3268h1809A50087a07202A62247n2416h5271l50179a87889
$$ -242568 -117170 53268 -81809 150087 -107202 162247 109831 -85271 -435450 -187889
9032a85211C6046b03504F8371a43668C05981a29490j53081j55842J71671R7659
$$ -185211 36046 -203504 68371 -143668 305981 -129490 -282571 -438413 -266742 -169083
9022a69083P6855C3666c67478Q2351R4402A0378i4938c7480l01951a29945G3668
$$ -169083 -92228 33666 -367478 -285127 -190725 10378 -94938 -37480 -339431 -129945 73668
9010E2722j1811b42506g1058B52437h5846c8063o1552k24277J51871r7384P6697
$$ 52722 40911 -242506 -71058 252437 -85846 -38063 -99615 -323892 -172021 -269405 -192708
8999a92708c1004j9838m0017B43837d2194a7210k25284B10083b28686e3293n3420
$$ -192708 -31004 -50842 -90859 243837 -42194 -17210 -242494 210083 -228686 -53293 -106713
8988a06713k69200a22846C35263E4009N5271b1304k39363c3196l3525k98599j20746
$$ -106713 -375913 -122846 335263 54009 109280 -21304 -260667 -33196 -66721 -365320 -486066
8977d86066D1502a62412A49119D1062M8498h0263k94376d9938B26748c71238I7952
$$ -486066 41502 -162412 149119 41062 89560 -80263 -374639 -49938 226748 -371238 97952
8965A55843a54295H9598Q2740c07964J45543G9603A8095a96940A33066l9979j1051
$$ 155843 -154295 89598 172338 -307964 -162421 79603 18095 -196940 133066 93087 82036
8954H2036a10006A55401K8379a17812F1704a88916i892B95744g4628E6743P4330
$$ 82036 -110006 155401 183780 -117812 61704 -188916 -9892 295744 -74628 56743 131073
8943A31073m8315J334a04354A37624j1865b54091J19304B57237j3084L79403C07640
$$ 131073 82758 84092 -104354 137624 125759 -254091 -134787 257237 244153 623556 307640
8931g2222B6159d3450l49502a71395A78802O3396O84655O374K388122J0505374
$$ -72222 26159 -43450 -392952 -171395 178802 242198 926853 933227 3321349 13826723
8921A3826723N735708E504064A654946p56439l98608B34460K53553B16745D3508
$$ 13826723 19562431 5504064 1654946 898507 499899 234460 488013 216745 43508
8911B43353b7686n7200D6284L58447H7933k1639A5174a0651A86144I465J58955
$$ 243353 -27686 -84886 46284 404731 87933 66294 15174 -10651 186144 9465 168420
8900A68420n0644J06491a01330j48042N0135i3790B2545O1288b0609p9323H0302
$$ 168420 117776 224267 -101330 -249372 -199237 -93790 22545 83833 -20609 -99932 80302
8888a00818A05646i2294j67791B53378A7413P8046B4102J71683H5805c19304G5121
$$ -100818 105646 -92294 -260085 253378 17413 95459 24102 195785 85805 -319304 75121
8876D957a65368h1471j5664L5526D3246e1340L524A04350a19239p1034g9881j96644
$$ 4957 -165368 -81471 -97135 -61609 43246 -51340 -47816 104350 -119239 -190273 -79881 -276525
$$ [...]
##END NTUPLES=NMR SPECTRUM
##END=
