
##TITLE=UV1246_M9_1261-1207_50_7241393_epRdmHUI91
##JCAMPDX= 6.0         $$ Bruker NMR JCAMP-DX V2.0
##DATA TYPE= NMR SPECTRUM
##DATA CLASS= NTUPLES
##ORIGIN= BRUKER
##OWNER= Administrator
$$ 1.72 TOPSPIN		Version 2.1
$$ 2013-01-24 03:13:52.261 -0500  Administrator@X
$$ Compression mode = diff/dup
##.OBSERVE FREQUENCY= 400.02188249412
##.OBSERVE NUCLEUS= ^1H
##.ACQUISITION MODE= SIMULTANEOUS (DQD)
##.ACQUISITION SCHEME= undefined
##.AVERAGES= 64
##.DIGITISER RES= 22
##SPECTROMETER/DATA SYSTEM= spect
##.PULSE SEQUENCE= noesygpps1d.comp
##.SOLVENT NAME= COFFEE_meoh
##.SHIFT REFERENCE= INTERNAL, COFFEE_meoh, 1, 14.96095
##AUDIT TRAIL= $$ (NUMBER, WHEN, WHO, WHERE, PROCESS, VERSION, WHAT)
$$ ##TITLE= Audit trail, TOPSPIN		Version 2.1
$$ ##JCAMPDX= 5.01
$$ ##ORIGIN= Bruker BioSpin GmbH
$$ ##OWNER= Administrator
$$ $$ E:\/data/COFFEE/nmr/UV1246_M9_1261-1207_50_7241393_epRdmHUI91/22/pdata/1/auditp.txt
$$ ##AUDIT TRAIL=  $$ (NUMBER, WHEN, WHO, WHERE, PROCESS, VERSION, WHAT)
(   1,<2013-01-24 03:13:46.527 -0500>,<Administrator>,<X>,<go>,<TOPSPIN 2.1>,
      <created by zg
	started at 2013-01-24 03:02:16.417 -0500,
	POWCHK enabled, PULCHK disabled,
       configuration hash MD5:
       86 BA 57 50 F2 9D 5C 9B 26 00 A9 28 5F 66 2E 89
       data hash MD5: 64K
       70 69 A1 18 0F 6E 98 78 1F 60 61 4E E5 E0 A6 FA>)
(   2,<2013-01-24 03:13:49.495 -0500>,<Administrator>,<X>,<proc1d>,<TOPSPIN 2.1>,
      <Start of raw data processing
       efp LB = 0.3 FT_mod = 6 PKNL = 1 PHC0 = 0 PHC1 = 0 SI = 128K 
       data hash MD5: 128K
       8C 22 07 9F 46 C3 B3 19 8C E3 06 47 0D E8 72 CE>)
(   3,<2013-01-24 03:13:50.542 -0500>,<Administrator>,<X>,<proc1d>,<TOPSPIN 2.1>,
      <pk PHC0 = -78.55225 PHC1 = 0 
       data hash MD5: 128K
       B3 67 2B 89 98 EB 69 43 86 F8 D5 C3 C8 DE 44 92>)
(   4,<2013-01-24 03:13:51.230 -0500>,<Administrator>,<X>,<proc1d>,<TOPSPIN 2.1>,
      <abs ABSG = 1 
       data hash MD5: 128K
       7A D4 97 1E 7E 75 74 36 90 5D 8E 72 5E 71 4F 8D>)
(   5,<2013-01-24 03:13:51.386 -0500>,<Administrator>,<X>,<proc1d>,<TOPSPIN 2.1>,
      <abs ABSG = 2 
       data hash MD5: 128K
       6C 78 BF EE 1C 23 E9 EF 5A 08 9F 62 D2 90 5A 1A>)
(   6,<2013-01-24 03:13:51.558 -0500>,<Administrator>,<X>,<proc1d>,<TOPSPIN 2.1>,
      <abs ABSG = 3 
       data hash MD5: 128K
       70 A2 FA AE B9 DC 7E EF 1D C2 59 70 3C C4 57 F2>)
(   7,<2013-01-24 03:13:51.730 -0500>,<Administrator>,<X>,<proc1d>,<TOPSPIN 2.1>,
      <abs ABSG = 4 
       data hash MD5: 128K
       2F 3E 74 9E F9 A8 A4 7D E6 7D F1 D7 A5 A2 68 48>)
(   8,<2013-01-24 03:13:51.917 -0500>,<Administrator>,<X>,<proc1d>,<TOPSPIN 2.1>,
      <abs ABSG = 5 
       data hash MD5: 128K
       3C 38 7B 01 B2 EC B0 5E 44 47 52 6B 0B BE E6 FF>)
$$ ##END=
$$ 
$$ $$ hash MD5
$$ $$ FA D4 74 BD 9D 84 C4 1B 61 0C 24 C3 EC 59 D4 7E
##$RELAX= 
##$RELAX= 
##$RELAX= 
##$RELAX= 
##$RELAX= 
##$RELAX= 
##$RELAX= 
##$RELAX= 
$$ Bruker specific parameters
$$ --------------------------
##$DU= <E:\>
##$EXPNO= 22
$$ [...]
##$TP07= 0
##$TPNAME0= <>
##$TPNAME1= <>
##$TPNAME2= <>
##$TPNAME3= <>
##$TPNAME4= <>
##$TPNAME5= <>
##$TPNAME6= <>
##$TPNAME7= <>
##$TPOAL= (0..7)
0.5 0.5 0.5 0.5 0.5 0.5 0.5 0.5
##$TPOFFS= (0..7)
0 0 0 0 0 0 0 0
##$TUNHIN= 0
##$TUNHOUT= 0
##$TUNXOUT= 0
##$USERA1= <user>
##$USERA2= <user>
##$USERA3= <user>
##$USERA4= <user>
##$USERA5= <user>
##$V9= 5
##$VALIST= <valist>
##$VCLIST= <CCCCCCCCCCCCCCC>
##$VD= 0
##$VDLIST= <DDDDDDDDDDDDDDD>
##$VPLIST= <PPPPPPPPPPPPPPP>
##$VTLIST= <TTTTTTTTTTTTTTT>
##$WBST= 1024
##$WBSW= 4
##$XGAIN= (0..3)
0 0 0 0
##$XL= 0
##$YL= 0
##$YMAX_a= 6576988
##$YMIN_a= -13140822
##$ZGOPTNS= <>
##$ZL1= 120
##$ZL2= 120
##$ZL3= 120
##$ZL4= 120
##$ABSF1= 14.96095
##$ABSF2= -5.597232
##$ABSG= 5
##$ABSL= 3
##$ALPHA= 0
##$AQORDER= 0
##$ASSFAC= 0
##$ASSFACI= 0
##$ASSFACX= 0
##$ASSWID= 0
##$AUNMP= <proc_prof1d_extract.lims>
##$AXLEFT= 0
##$AXNAME= <>
##$AXNUC= <1H>
##$AXRIGHT= 0
##$AXTYPE= 0
##$AXUNIT= <>
##$AZFE= 0.1
##$AZFW= 0.1
##$BCFW= 0
##$BC_mod= 0
##$BYTORDP= 0
##$COROFFS= 0
##$CY= 15
##$DATMOD= 1
##$DC= 0
##$DFILT= <>
##$DTYPP= 0
##$F1P= 0
##$F2P= 0
##$FCOR= 0.5
##$FTSIZE= 131072
##$FT_mod= 6
##$GAMMA= 0
##$GB= 0
##$INTBC= 1
##$INTSCL= 1
##$ISEN= 128
##$LB= 0.3
##$LEV0= 0
##$LPBIN= 0
##$MAXI= 10000
##$MC2= 0
##$MEAN= 0
##$ME_mod= 0
##$MI= 0
##$NCOEF= 0
##$NC_proc= -2
##$NLEV= 6
##$NOISF1= 0
##$NOISF2= 0
##$NSP= 0
##$NTH_PI= 0
##$NZP= 0
##$OFFSET= 14.96095
##$PC= 1
##$PHC0= -78.55225
##$PHC1= 0
##$PH_mod= 1
##$PKNL= yes
##$PPARMOD= 0
##$PPDIAG= 0
##$PPIPTYP= 0
##$PPMPNUM= 2147483647
##$PPRESOL= 1
##$PSCAL= 4
##$PSIGN= 0
##$PYNMP= <proc.py>
##$REVERSE= no
##$SF= 400.020009657811
##$SI= 131072
##$SIGF1= 0
##$SIGF2= 0
##$SINO= 400
##$SIOLD= 131072
##$SPECTYP= <>
##$SREGLST= <1H.CDCl3>
##$SSB= 0
##$STSI= 131072
##$STSR= 0
##$SW_p= 8223.68421052631
##$SYMM= 0
##$S_DEV= 0
##$TDeff= 65536
##$TDoff= 0
##$TI= <>
##$TILT= no
##$TM1= 0
##$TM2= 0
##$TOPLEV= 0
##$USERP1= <user>
##$USERP2= <user>
##$USERP3= <user>
##$USERP4= <user>
##$USERP5= <user>
##$WDW= 1
##$XDIM= 131072
##$YMAX_p= 438014157
##$YMIN_p= -16854
##$CURPLOT= <Network HP LaserJet P1505>
##$CURPRIN= <$Network HP LaserJet P1505>
##$DFORMAT= <normdp>
##$LAYOUT= <+/1D_H.xwp>
##$LFORMAT= <normlp>
##$PFORMAT= <normpl>
##$SURQMSG= 1
$$ End of Bruker specific parameters
$$ ---------------------------------
##NTUPLES= NMR SPECTRUM
##VAR_NAME=  FREQUENCY,     SPECTRUM/REAL,   SPECTRUM/IMAG
##SYMBOL=    X,             R,               I
##VAR_TYPE=  INDEPENDENT,   DEPENDENT,       DEPENDENT
##VAR_FORM=  AFFN,          ASDF,            ASDF
##VAR_DIM=   131072,        131072,          131072
##UNITS=     HZ,            ARBITRARY UNITS, ARBITRARY UNITS
##FACTOR=    0.0627417313425164, 1,          1
##FIRST=     8223.62146879497, 1610,         -61013
##LAST=      0,             2745,            -62116
##MIN=       0,             -16854,          0
##MAX=       8223.62146879497, 438014157,    0
$$ Real data points
##PAGE= N=1
##DATA TABLE= (X++(R..R)), XYDATA
$$ [...]
61588D17631k316k586k396j812j608k012k437k434k237k184k174j992j775j819
61574C87849k106k314k168j614p92o7L8o58j566j777j173o74j020j676j541n81
61558C68160R1j36n43k93L28N52L90M12P03R29J170J739K287K012Q63k46o18m29
61540C77371j13K60P00J058J328J687K100K326K426K713L098L135K696K037J137
61525D03959k08j619k346k477k920l850m212l270j764p90m17j37M7j50n82r71
61509C78293j443k048k245j615o39n1N5j39q08j768j919n39J228J518J63j258
61493C66785j644j343q57jJ135J677J146K96k5j07o74j467j432j95J383K171J842
61476C68690R81M22N67J155J598J569J203P96N46N81R59J431J471Q55L4l14j32
$$ y = [417631, 415315, 412729, 410333, 408521, 406913, 404901, 402464, 400030, 397793, 395609, 393435, 391443, 389668, 387849, 385743, 383429, 381261, 379647, 378855, 378788, 378826, 378168, 376602, 374825, 373652, 372978, 371958, 370282, 368741, 368160, 368251, 368115, 367572, 367279, 367607, 368159, 368549, 368961, 369664, 370593, 371763, 373502, 375789, 377801, 378664, 378418, 377800, 377371, 377258, 377518, 378218, 379276, 380604, 382291, 384391, 386717, 389143, 391856, 394954, 398089, 400785, 402822, 403959, 403751, 402132, 399786, 397309, 394389, 390539, 386327, 383057, 381293, 380503, 380086, 379949, 379996, 379846, 379264, 378293, 376850, 374802, 372557, 370942, 370303, 370252, 370307, 370168, 369360, 367592, 365673, 365134, 366362, 367880, 368043, 366785, 365141, 363798, 362941, 362940, 364075, 365752, 366898, 367194, 367169, 367062, 366388, 364921, 363489, 363294, 364677, 366848, 368690, 369671, 370093, 370660, 371815, 373413, 374982, 376185, 376981, 377527, 378108, 379067, 380498, 381969, 382824, 382858, 382544, 382412]
61459C82412o2n81j252j194k40P11P45Oo15o64m68l18n5M10O41K99k31k67L71
61440C79648J289K006K207J851J450J868L303M752N019M118L146K886L102L117
61426D19762K554J488L54k72j82J50J90K09R70K510L816L942L039K045J648J767
61410D43990J876J594R97M37P9l23j049k024k937l607m021m146l971l564k924
61395D20407j996j028n42o43p72n52m21p92j058k76J303K328K014R16m4n12n42
61378D17790k06K20L56L40Q33K050L247L558K914J858R36N66J018K032K778K751
61362D43041K382K356K576K379J685J318K020L530M866N362N169M898N036N713
61348D92331O800P955Q837R509J0541J2198J3584J3266J1078Q618P420P238O818
$$ y = [382412, 382350, 381769, 380517, 379323, 379083, 379794, 380539, 380545, 379930, 379266, 378798, 378480, 378425, 378835, 379476, 379775, 379544, 379277, 379648, 380937, 382943, 385150, 387001, 388451, 390319, 393622, 398374, 403393, 407511, 410657, 413543, 416645, 419762, 422316, 423804, 424158, 423886, 423704, 423854, 424044, 424253, 425223, 427733, 431549, 435491, 438530, 440575, 442223, 443990, 445866, 447460, 448457, 448894, 448973, 448650, 447601, 445577, 442640, 439033, 435012, 430866, 426895, 423331, 420407, 418411, 417383, 416841, 416198, 415426, 414874, 414453, 413661, 412603, 412327, 413630, 415958, 417972, 418888, 418844, 418332, 417790, 417584, 417804, 418160, 418500, 419333, 421383, 424630, 428188, 431102, 432960, 433896, 434462, 435480, 437512, 440290, 443041, 445423, 447779, 450355, 452734, 454419, 455737, 457757, 461287, 466153, 471515, 476684, 481582, 486618, 492331, 499131, 507086, 515923, 525432, 535973, 548171, 561755, 575021, 586099, 594717, 602137, 609375, 616193]
61335F16193N821M963M498L727K210M54r18j887k638l136l451l862m283m212l589
61320F09890l039k868k494j401o6O74O75L59rl31k86L97J545K883M483O425Q338
61303F25175R856J1190J2653J3914J4417J4209J3684J2656J0540P395M047J090
61291G50826j589m147o302p784q720r368r780r950r884r443q492p298o315n462
61277F46292m138k208m20N20Q91J477K503L558M361N004N428N265M481L757L858
61262F80629M775N767O276O551P278Q735J0506J1988J3016J3804J4404J4509J3846
61249H12084J2523J0803Q658N846K440r37l584n241o133o642p122p832q779r598
61235G96486r830r302q091o316m306k862k732l609m132l247j213R96K855M398
$$ y = [616193, 622014, 626977, 631475, 635202, 637412, 637866, 636948, 635061, 632423, 629287, 625836, 621974, 617691, 613479, 609890, 606851, 603983, 601489, 600088, 600022, 600696, 601371, 601730, 601721, 601390, 601104, 601501, 603046, 605929, 610412, 616837, 625175, 635031, 646221, 658874, 672788, 687205, 701414, 715098, 727754, 738294, 745689, 749736, 750826, 749237, 745090, 738788, 731004, 722284, 712916, 703136, 693186, 683302, 673859, 665367, 658069, 651754, 646292, 642154, 639946, 639526, 640046, 640937, 642414, 644917, 648475, 652836, 657840, 663268, 668533, 673014, 676771, 680629, 685404, 691171, 697447, 703998, 711276, 720011, 730517, 742505, 755521, 769325, 783729, 798238, 812084, 824607, 835410, 844068, 849914, 852354, 851417, 847833, 842592, 836459, 829817, 822695, 814863, 806084, 796486, 786656, 777354, 769263, 762947, 758641, 755779, 753047, 749438, 745306, 742059, 740846, 741842, 744697, 749095]
61221G49095N601O322O702O992P114O904O625O567O299N168L594K887L522M428
61207H27820M508L971L557L207K446J551J314J762K084J930K036L302N782Q837
61193H74107J1835J4513J6939J9338K1744K3771K4899K4936K3968K1942J8798
61182A096790J5076J1840R717Q320O915N361M041L019J793Nj986l502m434n420
61168A147535p064r196j1136j2596j4038j5969j8223k0109k1234k1809k2177k2282
61156I51702k1768k0506j8821j7179j5741j4286j2597j0769r066p547n932l922
61144G93568j579N42J764J885J423R99M16j183m015o909q448q492q000p523o665
61129G47783n037k849l63K471N460P996R927J1966J4680J7633K0116K2212K4433
$$ y = [749095, 754696, 761018, 767720, 774712, 781826, 788730, 795355, 801922, 808221, 813389, 816983, 819870, 823392, 827820, 832328, 836299, 839856, 843063, 845509, 847060, 848374, 850136, 852220, 854150, 856186, 859488, 865270, 874107, 885942, 900455, 917394, 936732, 958476, 982247, 1007146, 1032082, 1056050, 1077992, 1096790, 1111866, 1123706, 1133423, 1141743, 1148658, 1154019, 1158060, 1161079, 1162872, 1162877, 1160891, 1157389, 1152955, 1147535, 1140471, 1131275, 1120139, 1107543, 1093505, 1077536, 1059313, 1039204, 1017970, 996161, 973984, 951702, 929934, 909428, 890607, 873428, 857687, 843401, 830804, 820035, 810969, 803422, 797490, 793568, 791989, 792531, 794295, 796180, 797603, 798602, 799018, 797835, 793820, 786911, 778463, 769971, 761971, 754448, 747783, 742746, 739897, 739534, 742005, 747465, 755461, 765388, 777354, 792034, 809667, 829783, 851995, 876428]
61116H76428K6764K8802L0511L2098L3374L4003L4161L4237L4040L3044L1371
61105A228833K9678K8071K5955K3095K0075J7399J4840J1917Q508M663L42m368
61093A409008r212j4156j9353k4512k8781l1583l3184l4176l4824l5129l5087
61082A109011l4574l3382l1659k9942k8429k6637k4117k1177j8505j6405j4742
61071H29442j3286j1739r737p366n406m547m466m200l329k334j715j266l84J123
61057G60790K819M151N045N892P021Q299R365J0144J0882J1817J3097J4912J7285
61044H81519J9777K1808K3327K4748K6189K7370K8305K9484L1184L3098L4861
61033A181670L6341L7324L7618L7754L8709M0554M2267M3360M4699M6996M9524
$$ y = [876428, 903192, 931994, 962505, 994603, 1027977, 1061980, 1096141, 1130378, 1164418, 1197462, 1228833, 1258511, 1286582, 1312537, 1335632, 1355707, 1373106, 1387946, 1399863, 1408371, 1413034, 1413376, 1409008, 1399796, 1385640, 1366287, 1341775, 1312994, 1281411, 1248227, 1214051, 1179227, 1144098, 1109011, 1074437, 1041055, 1009396, 979454, 951025, 924388, 900271, 879094, 860589, 844184, 829442, 816156, 804417, 794680, 787314, 781908, 777361, 772895, 768695, 765366, 763032, 761317, 760051, 759667, 760790, 763609, 767760, 772805, 778697, 785718, 794017, 803382, 813526, 824408, 836225, 849322, 864234, 881519, 901296, 923104, 946431, 971179, 997368, 1024738, 1053043, 1082527, 1113711, 1146809, 1181670, 1218011, 1255335, 1292953, 1330707, 1369416, 1409970, 1452237, 1495597, 1540296, 1587292, 1636816]
61022A636816N1243N2210N2751N2306N0694M9765N1959N7520O4847P3237Q3419
61011B276767R5400J07845J19952J32165J44988J59277J78170K06223K45813K96745
61001C963345L60375M41202N43294O69020Q23888J018595J262845J562038J923126
60992A2567728K347649K790417L117119L135070K715885J916053R72814J67300
60984B9730035l20301m47948k61165J41050N87534Q40017O90277R4072p86408
60975C0267163j680727k362945k738272k828666k711533k471106k176439j874013
60967A1423462j588678j331619j108263r20030p63538o33140n24877m36744l66446
60958C750127l10947k67527k33484k05475j80919j59590j42173j27603j13495
$$ y = [1636816, 1688059, 1740269, 1793020, 1845326, 1896020, 1945785, 1997744, 2055264, 2120111, 2193348, 2276767, 2372167, 2480012, 2599964, 2732129, 2877117, 3036394, 3214564, 3420787, 3666600, 3963345, 4323720, 4764922, 5308216, 5977236, 6801124, 7819719, 9082564, 10644602, 12567728, 14915377, 17705794, 20822913, 23957983, 26673868, 28589921, 29562735, 29730035, 29409734, 28961786, 28700621, 28841671, 29429205, 30269222, 30959499, 31053571, 30267163, 28586436, 26223491, 23485219, 20656553, 17945020, 15473914, 13297475, 11423462, 9834784, 8503165, 7394902, 6474872, 5711334, 5078194, 4553317, 4116573, 3750127, 3439180, 3171653, 2938169, 2732694, 2551775, 2392185, 2250012, 2122409, 2008914]
60949B008914r9013q5480p4074o4559n6706n1318m9014m8983m9754n0471n0818
60938A328724n0370m8784m6319m3682m1400l9543l7798l5688l2993l0025k7279
60927H94843k4910k2836k1154j9944j8805j7112j4808j2427j0448r054q426q471
60915G06448q394p302n374l662k631j708n21L74M43J78M72J490K683L481L464
60900F89441K352L99j458k441k761l213m136n192o012o589p077p510p789p753
60886F30261p412p104p213p625p791p519p261p370p509p180o475n806n148m160
60872E34688k937k040j693j428p10L66J273J834K513L842N622O933P119O599O396
60857E68377P043Q230R422J0230J0287R331P705O165N016L975L047K832L526M339
$$ y = [2008914, 1909901, 1824421, 1750347, 1685788, 1629082, 1577764, 1528750, 1479767, 1430013, 1379542, 1328724, 1278354, 1229570, 1183251, 1139569, 1098169, 1058626, 1020828, 985140, 952147, 922122, 894843, 869933, 847097, 825943, 805999, 787194, 770082, 755274, 742847, 732399, 723345, 714919, 706448, 698054, 690752, 685378, 681716, 679085, 677377, 676856, 677230, 677673, 677851, 678323, 679813, 682496, 685977, 689441, 691793, 692192, 690734, 688293, 685532, 682319, 678183, 672991, 666979, 660390, 653313, 645803, 638014, 630261, 622849, 615745, 608532, 600907, 593116, 585597, 578336, 570966, 563457, 556277, 549802, 543996, 538848, 534688, 531751, 529711, 528018, 526590, 525880, 526246, 527519, 529353, 531866, 535708, 541330, 548263, 555382, 561981, 568377, 575420, 583650, 593072, 603302, 613589, 622920, 630625, 636790, 641806, 645781, 648828, 651660, 655186, 659525]
60843F59525M473M058L508K529O92j469k981l889n158p119q914r734r783r715
60829F16023r783r925j0027r798q856p430o431o361o490n756m227l067l066l731
60815E21075m020l587k993k834l010k938k354j568r71m82K36J241K240L065L873
60800E06973M757N482N781N721N609N614N749O150P018Q249R330R874J0119J0611
60786F07037J1492J2376J2973J3474J4100J4648J4847J4888J5219J5858J6400
60775G63312J6698J7097J7857J8820J9727K0526K1230K1817K2413K3150K3804
60764I86451K3970K3720K3474K3062K1553J8468J4628J1206Q372N451K065j636
60752A160784n603j0017j4670j8885k2108k4248k5427k5786k5608k5216k4777
$$ y = [659525, 663998, 668056, 671564, 674093, 674785, 673316, 670335, 666446, 661288, 654169, 645255, 635521, 625738, 616023, 606240, 596315, 586288, 576490, 567634, 560204, 553773, 547412, 540922, 535166, 530939, 527872, 524806, 521075, 517055, 513468, 510475, 507641, 504631, 501693, 499339, 497771, 496800, 496318, 496554, 497795, 500035, 503100, 506973, 511730, 517212, 522993, 528714, 534323, 539937, 545686, 551836, 558854, 567103, 576433, 586307, 596426, 607037, 618529, 630905, 643878, 657352, 671452, 686100, 700947, 715835, 731054, 746912, 763312, 780010, 797107, 814964, 833784, 853511, 874037, 895267, 917084, 939497, 962647, 986451, 1010421, 1034141, 1057615, 1080677, 1102230, 1120698, 1135326, 1146532, 1154904, 1160355, 1162420, 1160784, 1155181, 1145164, 1130494, 1111609, 1089501, 1065253, 1039826, 1014040, 988432, 963216, 938439]
60741I38439k4366k4181k4348k4611k4581k4175k3588k2912k2085k1062j9672
60730F82858j7606j4990j2675j1374j0638r426p573o029n503n538n158l963k295
60717E70090p80J04L19L05M79N85p2j665l442m488m590m278m284n050o390p528
60701E29315p708o970o060n619n713o142o731p216p260o770n973n072m124l276
60687D44681k787k633k498k231j965j635q42N02J782K253J922J584J995L140M219
60672D47487M323L213J516J27m47j87O39J509J821J459R49O41J28r34j842j589
60656D58813m15M09M59P11J977L742N072N836O361O628O558O538O916P322P138
60641E24065O343N338M322L367K724K366J613o0k022l021k694j819j244j227j841
$$ y = [938439, 914073, 889892, 865544, 840933, 816352, 792177, 768589, 745677, 723592, 702530, 682858, 665252, 650262, 637587, 626213, 615575, 606149, 598576, 592547, 587044, 581506, 576348, 572385, 570090, 569310, 569414, 569733, 570038, 570517, 571102, 571030, 569365, 565923, 561435, 556845, 552567, 548283, 543233, 536843, 529315, 521607, 514637, 508577, 502958, 497245, 491103, 484372, 477156, 469896, 463126, 457153, 452081, 447957, 444681, 441894, 439261, 436763, 434532, 432567, 430932, 430090, 430592, 432374, 434627, 436549, 438133, 440128, 443268, 447487, 451810, 455023, 456539, 456666, 456219, 456032, 456671, 458180, 460001, 461460, 462409, 463050, 463178, 462244, 460402, 458813, 458398, 458807, 459266, 459977, 461954, 465696, 470768, 476604, 482965, 489593, 496151, 502689, 509605, 516927, 524065, 530408, 535746, 540068, 543435, 546159, 548525, 550138, 550078, 548056, 545035, 542341, 540522, 539278, 538051, 536210]
60626E36210l201m959o128n928m598l198k664l069l605l289j959n27l8n90j444
60611D91013k045k370k366j718n03M38L07o22j283j089n45m51r00j306j271r81
60595D74308p01l39K56Q08Q39K94m15q75q97l27Q53K195K999K990K492J853J165
60578D87498O89R04J807K623K752K666L311M799O281P169P949R580J2358J5593
60564E65979J8414K0650K2763K4873K6202K5803K3588K0145J5732J0147L676k682
60552G75290q181j2820j6375j7870j6725j3872j0793p873m608j085J862L986O130
60539F77066R021J2384J5601J8669K2048K5876K9594L2157L2516L0203K5593J9438
60527I50166J2260M550k709q389j2149j4409j5346j4675j2631j0380q884p966
$$ y = [536210, 533009, 528050, 521922, 515994, 511396, 508198, 505534, 502465, 498860, 495571, 493612, 493085, 493047, 492457, 491013, 488968, 486598, 484232, 482514, 482011, 482449, 482756, 482134, 480851, 479762, 479217, 478766, 477866, 476560, 475289, 474308, 473607, 473268, 473524, 474332, 475171, 475465, 475050, 474175, 473278, 472951, 473804, 475999, 478998, 481988, 484480, 486333, 487498, 488187, 489091, 490898, 493521, 496273, 498939, 502250, 507049, 513330, 520499, 528448, 538028, 550386, 565979, 584393, 605043, 627806, 652679, 678881, 704684, 728272, 748417, 764149, 774296, 777972, 775290, 767109, 754289, 737914, 720044, 703319, 689447, 678654, 670781, 666173, 665088, 666950, 670936, 677066, 686087, 698471, 714072, 732741, 754789, 780665, 810259, 842416, 874932, 905135, 930728, 950166, 962426, 966976, 964267, 955878, 943729, 929320, 913974, 899299, 886668, 876288, 867404, 859438]
60515H59438o994n960n183m403l025j112O37J904L062M354N384N796N961O675
60501H66534Q472J1471J5554K0415K5719L1538L8426M6646N5580O4244P2177P9296
60489A336072Q4962Q7773Q6435Q0562P0547N7155M1300K3772M991j4561l3596
60478A825412n0345o3923p4706q2899q7574q7885q4669p9829p4408o8309o1672
60467A009193n5328m9693m4318l8926l3996k9863k6080k2256j8851j6580j5442
60456F57860j4840j4192j3020j1017q525o419n115m150l188k721l192m024m353
60443E63104m165l947l684l075k391k194k326k131j530j083r98r36p93q36r82
60428E32033p54j22K83M1n58j060j280j152p42n38j050j936k153j265l0N74L54
$$ y = [859438, 852444, 846484, 841301, 836898, 833873, 832761, 833398, 835302, 838364, 842718, 848102, 853898, 859859, 866534, 875006, 886477, 902031, 922446, 948165, 979703, 1018129, 1064775, 1120355, 1184599, 1256776, 1336072, 1421034, 1508807, 1595242, 1675804, 1746351, 1803506, 1844806, 1868578, 1873569, 1859008, 1825412, 1775067, 1711144, 1636438, 1553539, 1465965, 1378080, 1293411, 1213582, 1139174, 1070865, 1009193, 953865, 904172, 859854, 820928, 786932, 757069, 730989, 708733, 689882, 673302, 657860, 643020, 628828, 615808, 604791, 596266, 589847, 584732, 580582, 577394, 574673, 571481, 567457, 563104, 558939, 554992, 551308, 548233, 545842, 543648, 541322, 539191, 537661, 536578, 535580, 534644, 533851, 533015, 532033, 531279, 531157, 531440, 531481, 530923, 529863, 528583, 527431, 526689, 526151, 525101, 523165, 521012, 519747, 519717, 520291, 520645]
60411E20645k74q23q09J18J558K402J979Q75J99L46R09J412J610J296M46m67p80
60394E30642m09N8J18pK77J122K039K564K863L328L718L211J560k03p59J6J065
60377E51203J470J297J084J108J290J413J262Q52O17J025J958K797L144L075K619
60362E76214J618K71o58n84K25R74J168R09O52P81J243J537J315J008J424K684
60346E90781M044M932N625O562P509P927P784P447O900N649L445P28j751l526
60332F54056m614n325n939o491o753o434n365l677j926r69j329k625l786l930
60318E94893k939j309K82J269J480J273J180J468K191L496N383P321Q744R978
60304F34710J2030J5208J8776K2269K6255L1010L5073L6174L3529K8297K1764
$$ y = [520645, 520371, 519548, 518739, 518857, 520415, 522817, 524796, 525671, 525870, 526216, 527125, 528537, 530147, 531443, 531889, 531422, 530642, 530233, 530291, 530409, 530402, 530679, 531801, 533840, 536404, 539267, 542595, 546313, 549524, 551084, 550881, 550122, 550138, 551203, 552673, 553970, 555054, 556162, 557452, 558865, 560127, 560979, 561596, 562621, 564579, 567376, 570520, 573595, 576214, 577832, 578103, 577445, 576861, 577086, 578060, 579228, 580137, 580789, 581570, 582813, 584350, 585665, 586673, 588097, 590781, 594825, 599757, 605382, 611944, 619453, 627380, 635164, 642611, 649511, 655160, 658605, 659333, 657582, 654056, 649442, 644117, 638178, 631687, 624934, 618500, 613135, 609458, 607532, 606563, 605234, 602609, 598823, 594893, 591954, 590645, 590927, 592196, 593676, 594949, 596129, 597597, 599788, 603284, 608667, 615988, 624732, 634710, 646740, 661948, 680724, 702993, 729248, 760258, 795331, 831505, 865034, 893331, 915095]
60293I15095J3982M639n433j4357k0616k3955k4978k4404k2869k1018j9300j7707
60281G39079j6019j4355j3159j2542j2024j1181j0209r558r228q845q196p272
60269F06491o056m685l662l293l082k299j065k52k83p06j016j203j339j312j165
60254E75073j115j016m43N15J193J288J149R91O62L70P00J441J502N68j71J95
60238E82902Q62O97P3J4K65j95j100j080J47J312J675K081L402N052N858N467
60222F07432M280K673J082K18M60J269J846K082K408K974L507L832M060M308M538
60207F46969M666M673M633M735N078N362N064M111L100K629K619K613K458K289
60193G00999J984J124k86j515j815j368j124j646k387k444j797j379j847k807
$$ y = [915095, 929077, 933716, 928283, 913926, 893310, 869355, 844377, 819973, 797104, 776086, 756786, 739079, 723060, 708705, 695546, 683004, 670980, 659799, 649590, 640032, 630804, 621959, 613763, 606491, 600435, 595750, 592088, 588795, 585713, 583414, 582349, 582097, 581814, 581108, 580092, 578889, 577550, 576238, 575073, 573958, 572942, 572499, 573014, 574207, 575495, 576644, 577635, 578297, 578667, 579367, 580808, 582310, 582878, 582707, 582902, 583764, 584461, 584534, 584548, 584813, 584618, 583518, 582438, 582585, 583897, 585572, 587653, 591055, 596107, 601965, 607432, 611712, 614385, 615467, 615685, 616145, 617414, 619260, 621342, 623750, 626724, 630231, 634063, 638123, 642431, 646969, 651635, 656308, 660941, 665676, 670754, 676116, 681180, 685291, 688391, 691020, 693639, 696252, 698710, 700999, 702983, 704107, 703821, 702306, 700491, 699123, 697999, 696353, 693966, 691522, 689725, 688346, 686499, 683692]
60179F83692l463l625l656l726l624l268k894k636k285j610o83J35M78K77o9L1
60163F53074O65J164Q83Lp35r50p92l63M34J394J946J849J537J532J868K269K584
60146F68362K828L028L261L642M144M607M955N198N255N051M890N316O434P691
60132G34662Q461Q564Q104P151N718L812J392j347l649m686m565m304m479m443
60118G50391l381j632l15N3p9k10l04l83k16L15Q85J091Q46L71j37o72j359k194
60100G43070k854k916k412j875j654j462j018p29j118j803j822r62J3O98J734
60085G24890L690N945P431P979Q231Q444Q265P508O387M888K666j79k862m790
60071G88493o149p319q235q772r255r971j0508j0219r205q248p806p665p609p757
$$ y = [683692, 680229, 676604, 672948, 669222, 665598, 662330, 659436, 656800, 654515, 652905, 652222, 652357, 652835, 653112, 653043, 653074, 653739, 654903, 655786, 655789, 655054, 654104, 653312, 652949, 653383, 654777, 656723, 658572, 660109, 661641, 663509, 665778, 668362, 671190, 674218, 677479, 681121, 685265, 689872, 694827, 700025, 705280, 710331, 715221, 720537, 726971, 734662, 743123, 751687, 759791, 766942, 772660, 776472, 777864, 776517, 772868, 768182, 763617, 759313, 754834, 750391, 747010, 745378, 745063, 745116, 745037, 744827, 744523, 744140, 743924, 744239, 745124, 746215, 747061, 747432, 747295, 746623, 745264, 743070, 740216, 737300, 734888, 733013, 731359, 729897, 728879, 728150, 727032, 725229, 723407, 722445, 722458, 723156, 724890, 728580, 734525, 741956, 749935, 758166, 766610, 774875, 782383, 788770, 793658, 796324, 796145, 793283, 788493, 782344, 775025, 766790, 758018, 748763, 738792, 728284, 718065, 708860, 700612, 692806, 685141, 677532, 669775]
60057F69775q058q064p596p151p229p563p464o739n785m900l924k641j118M48
60043E91991J922L126L754L652L055K432K146K350L000L798M143L538K207J080
60029F32194Q22J052P74l86j834k994m091n574p177q165q367q308q308q005p046
60014E64587n751m801m524m702m809m335l205k009j496j583j375l46R25J632J815
59999E30023K085K661L270L726L987L823L155K624L029M110M615L902K833K648
59985E76491L406M102L986L292K686K445K313J917J134P4j151k461l583m032l624
59970E86995k898k624k817k745j964r90n36n17k86L33Q31Q71Q40J281K066K524
59954E80364K191J198m9j236k072k186j370R3J526K347K461K222K058K060J862
$$ y = [669775, 661717, 653653, 646057, 638906, 631677, 624114, 616650, 609911, 604126, 599226, 595302, 592661, 591543, 591991, 593913, 597039, 600793, 604445, 607500, 609932, 612078, 614428, 617428, 621226, 625369, 628907, 631114, 632194, 633016, 634068, 634842, 634456, 632622, 629628, 625537, 619963, 612786, 604621, 596254, 587946, 579638, 571633, 564587, 558836, 554035, 549511, 544809, 540000, 535665, 532460, 530451, 528955, 527372, 525997, 525651, 526576, 528208, 530023, 532108, 534769, 538039, 541765, 545752, 549575, 552730, 555354, 558383, 562493, 567108, 571010, 573843, 576491, 579897, 583999, 587985, 591277, 593963, 596408, 598721, 600638, 601772, 601846, 600695, 598234, 594651, 590619, 586995, 584097, 581473, 578656, 575911, 573947, 572957, 572421, 571904, 571618, 571951, 572782, 573653, 574493, 575774, 577840, 580364, 582555, 583753, 583704, 582468, 580396, 578210, 576840, 576933, 578459, 580806, 583267, 585489, 587547, 589607, 591469]
59939E91469J009m25j731k264k169k136k477k735k420j747j419j744k235k126
59925E66850j212r2L81K6m71l09N01J219J308R70P24Q17J159J596J957K068J873
59908E79365J508J140Q89Q68J156J666K208K660K922K824K469K458L249M369M887
59893F14638M748M812N423N767N147M071L422L234L017K779K874L256L705M426
59879F71319N607O713P060O902O978P214O828N627M159K535K16k749n348o910
59865G16151p945r112j0098j0124r069p510o061n063m506l950k864j384k81P1
59851F38255K06P22J542K433L632N382P321R037J0814J3104J5416J6472J5450
59838G39786J2604Q764M846J761J24j52M52J791L934O155O732M435o7m791q381
$$ y = [591469, 592478, 592053, 590322, 588058, 585889, 583753, 581276, 578541, 576121, 574374, 572955, 571211, 568976, 566850, 565638, 565546, 565927, 565953, 565482, 565173, 565674, 566893, 568201, 569171, 569895, 570712, 571871, 573467, 575424, 577492, 579365, 580873, 582013, 582902, 583770, 584926, 586592, 588800, 591460, 594382, 597206, 599675, 602133, 605382, 609751, 614638, 619386, 624198, 629621, 635388, 640535, 644606, 648028, 651262, 654279, 657058, 659932, 663188, 666893, 671319, 676926, 683639, 690699, 697601, 704579, 711793, 718621, 724248, 728407, 730942, 731158, 728409, 723061, 716151, 708206, 699094, 688996, 678872, 669803, 662293, 656232, 651169, 646663, 642713, 639849, 638465, 638184, 638255, 638461, 639183, 640725, 643158, 646790, 652172, 659493, 668530, 679344, 692448, 707864, 724336, 739786, 752390, 761154, 766000, 767761, 767885, 767733, 768185, 769976, 773910, 780065, 786797, 791232, 791165, 786374, 777993]
59823G77993j0920j2914j4189j4322j3678j3177j3059j2658j1586j0437r778r141
59811F32134p749n865m486l878l324k410j615j353j217p15j45k06j054k201l074
59796E92842l336k913k146j655j777k274k783l291l893m466m788m765m352l511
59782E46892k528j958k014k315k523k796l257l456k888j720n04O01J740K735L097
59767E29106K724K044J461J091J032J438K186K828K983K616J892J069N48P35J652
59752E55405K830L686L906L474K583J647J266J823L038L971L799K688J730J788
59738E93634K525K843K210J190O17P16J138J480J547J368J184J231J363J215P71
59723F15032M74N69P56P38P18J007J433J499R75M8q81j328r59M3J074J788K398
$$ y = [777993, 767073, 754159, 739970, 725648, 711970, 698793, 685734, 673076, 661490, 651053, 641275, 632134, 624385, 618520, 614034, 610156, 606832, 604422, 602807, 601454, 600237, 599522, 599377, 599171, 598117, 595916, 592842, 589506, 586593, 584447, 582792, 581015, 578741, 575958, 572667, 568774, 564308, 559520, 554755, 550403, 546892, 544364, 542406, 540392, 538077, 535554, 532758, 529501, 526045, 523157, 521437, 520933, 521534, 523274, 526009, 529106, 531830, 533874, 535335, 536426, 537458, 538896, 541082, 543910, 546893, 549509, 551401, 552470, 553018, 553753, 555405, 558235, 561921, 565827, 569301, 571884, 573531, 574797, 576620, 579658, 583629, 587428, 590116, 591846, 593634, 596159, 599002, 601212, 602402, 603019, 603735, 604873, 606353, 607900, 609268, 610452, 611683, 613046, 614261, 615032, 615506, 616075, 616831, 617569, 618287, 619294, 620727, 622226, 623201, 623249, 622368, 621040, 620081, 620124, 621198, 622986, 625384]
59706F25384L065L426L148K541K123J838J250L41m32p30o05k02L74R91J579K174
59690F46265K596K368J343J30n61p80j041j469j822k095k394k385j607m18K04
59675F38334j00o59q52q97j307k140l177m334n397n841n373m443l748l434l176
59660E93456k851k640k494j996r01M19J329J660J892K526L464M167M388M375M263
59645F11057L665K222L11j309k403l329m229m708m463l725k900k219j890k072
59631E84008k407k090q87L44O47K03l6K52M52J41j82J64J122K098K732K970K632
59614E92163J438m77k448l752l991l102j366N02J715K106K242K674L302L601L194
59599E97801K075N10j004j918k113j947j686j192m00K65M49M15M76K53p16j918
$$ y = [625384, 628449, 631875, 635023, 637564, 639687, 641525, 642775, 643116, 642684, 641954, 641349, 641147, 641521, 642512, 644091, 646265, 648861, 651229, 652572, 652702, 652141, 651361, 650320, 648851, 647029, 644934, 642540, 640155, 638548, 638130, 638334, 638234, 637575, 636723, 635826, 634519, 632379, 629202, 624868, 619471, 613630, 608257, 603814, 600066, 596632, 593456, 590605, 587965, 585471, 583475, 582574, 582993, 584322, 585982, 587874, 590400, 593864, 598031, 602419, 606794, 611057, 614722, 616944, 617255, 615946, 613543, 610214, 605985, 601277, 596814, 593089, 590189, 587970, 586080, 584008, 581601, 579511, 578624, 578968, 579615, 579818, 579782, 580034, 580486, 580627, 580445, 580609, 581731, 583829, 586561, 589531, 592163, 593601, 593124, 590676, 586924, 582933, 579831, 578465, 578967, 580682, 582788, 585030, 587704, 591006, 594607, 597801, 599876, 600386, 599382, 597464, 595351, 593404, 591718, 590526, 590126, 590391, 590840, 591255, 591731, 591984, 591268, 589350]
59583E89350k293j661q23k67K18N44L2j375k687l216l471l980m197l497k476k116
59567E58085k188j739q22m59q64j000k12P48R40O42Q49J822K774K941K419J890
59551E65826J803J974J981J779J654J703J705J665J947K629L232L576M373O385
59537F02232R375J2751J6771K1910K6825K8233K3625J3884K739o027j0607j1164
59525G30547q815m908p59K564M614N683O323O631O224M987L396J865J10k325n183
59510G50954p602r040r650r866j0072j0538j1199j1498j0923r667q381p383o498
59497F28637n661n046m630m081l294k575k160j911j671j544j650j763j428l72
59483E90851J194K688L674M307N016N782O150O177O713Q281J0153J1140J0927
$$ y = [589350, 587057, 585396, 584573, 584306, 584524, 585068, 585100, 583725, 581038, 577822, 574351, 570371, 566174, 562677, 560201, 558085, 555897, 554158, 553336, 552877, 552013, 551013, 550801, 551549, 552489, 553131, 553980, 555802, 558576, 561517, 563936, 565826, 567629, 569603, 571584, 573363, 575017, 576720, 578425, 580090, 582037, 584666, 587898, 591474, 595847, 602232, 611607, 624358, 641129, 663039, 689864, 718097, 741722, 755606, 758345, 752318, 741711, 730547, 721732, 716824, 716065, 718629, 723243, 728926, 735249, 741880, 748104, 753091, 756487, 758352, 758462, 756137, 750954, 743352, 734312, 724662, 714796, 704724, 694186, 682987, 671489, 660566, 650899, 642518, 635135, 628637, 622976, 617930, 613300, 609219, 605925, 603350, 601190, 599279, 597608, 596064, 594414, 592651, 591223, 590851, 592045, 594733, 598407, 602714, 607730, 613512, 619662, 625839, 632552, 640833, 650986, 662126, 673053]
59470F73053R974Q536O529M170J954R6j398k261k239j625q74J28J736L785N937
59455G07501Q419J1422J4092J5368J5712J6638J8408J9610J9384J8682J8563J8386
59443I02185J6621J2671P001K20p028j3610j8255k0359k0238j8792j7069j5707
59431H07640j4592j3409j2460j2224j2190j1107q661n868l551j438Q33K993N083
59418G21049P926J1778J5559J8407K0942K3919K6711K8604L0628L3997L6838L4513
59406A010871K3996P052j1101k5313l2746l3333k9117k2577j4738n283N026J2751
59394H85488J3519N746p675k1339l0869l4893l4484l1490k7447k3296j9347j5467
59382F58446j1718q650o674n323l903k590k047j991j321R6J043R13Q49J996L648
$$ y = [673053, 683027, 691563, 698092, 702262, 704216, 704312, 702914, 700653, 698414, 696789, 695915, 696043, 697779, 701564, 707501, 715920, 727342, 741434, 756802, 772514, 789152, 807560, 827170, 846554, 865236, 883799, 902185, 918806, 931477, 938478, 938698, 931670, 918060, 899805, 879446, 859208, 840416, 823347, 807640, 793048, 779639, 767179, 754955, 742765, 731658, 722997, 717129, 713578, 712140, 712973, 715966, 721049, 728975, 740753, 756312, 774719, 795661, 819580, 846291, 874895, 905523, 939520, 976358, 1010871, 1034867, 1041919, 1030818, 1005505, 972759, 939426, 910309, 887732, 872994, 867711, 872737, 885488, 899007, 904753, 897078, 875739, 844870, 809977, 775493, 744003, 716556, 693260, 673913, 658446, 646728, 638078, 631404, 626081, 622178, 619588, 617541, 615550, 614229, 614325, 615368, 616281, 617130, 619126, 622774]
59367F22774M328L915L453L373L303L306L942N103O063O702P576Q656R211R176
59353G00881R537J0865J2545J3924J5371J7484J9907K1766K2921K3976K5164K5870
59341I20211K5407K3894K2095K0421J8330J4961J0337N479J243k520o306j0044
59329A043508j3379j6387j9221k1386k2276k2245k2247k2369k1737k0041j8141
59318H24079j6804j5639j3910j1738r846q529p459o335n227m324l680l152k494
59305G14942j580n40M89J668L164M699N846O806Q335J0741J3614J6642K0066K3771
59291H28663K6423K6061K1500J3099K583p527j4918j8718j9780j9451j8241j5972
59279H03722j2762r253n936k922m00J366K700M582P574J0970J3463J4531J4744
$$ y = [622774, 627102, 631017, 634470, 637843, 641146, 644452, 648394, 653497, 659560, 666262, 673838, 682494, 691705, 700881, 710418, 721283, 733828, 747752, 763123, 780607, 800514, 822280, 845201, 869177, 894341, 920211, 945618, 969512, 991607, 1012028, 1030358, 1045319, 1055656, 1061135, 1062378, 1059858, 1053552, 1043508, 1030129, 1013742, 994521, 973135, 950859, 928614, 906367, 883998, 862261, 842220, 824079, 807275, 791636, 777726, 765988, 756142, 747613, 740154, 733819, 728592, 724268, 720588, 717436, 714942, 713362, 712822, 713311, 714979, 718143, 722842, 728688, 735494, 743829, 754570, 768184, 784826, 804892, 828663, 855086, 881147, 902647, 915746, 918329, 910802, 895884, 877166, 857386, 837935, 819694, 803722, 790960, 781707, 775771, 772849, 772449, 773815, 776515, 781097, 788671, 799641, 813104, 827635, 842379]
59266H42379J4800J4770J4339J3273J1382Q401M409J39l564o547r189j1639j3698
59253H79255j5431j7184j8788j9390j8481j6603j4561j2480j0124p747n842m288
59241G18336k504m33J320K462L497M967O680Q023Q723Q971Q975Q615P609N850
59227G91091L635J436n67k580m731o728q227r361j0470j1462j1823j1385j0632
59214G08196j0089r692r012p905o685n668m788l805k782k067j727j308m86L77
59200F42559P83R71J625K779L770M368N061N919O108N200M106L982M746N520N949
59185G03446O142N855M847L746L446L693L412K444J850K325L304M006M351M487
59171G57354M309M017M359N697P392Q698R739J0972J2208J2846J2771J2335J1524
$$ y = [842379, 857179, 871949, 886288, 899561, 910943, 919344, 923753, 923892, 920328, 913781, 904592, 892953, 879255, 863824, 846640, 827852, 808462, 789981, 773378, 758817, 746337, 736213, 728466, 722624, 718336, 715832, 715399, 716719, 719181, 722678, 727645, 734325, 742348, 751071, 760042, 769017, 777632, 785241, 791091, 794726, 796162, 795595, 793015, 788284, 781556, 773329, 763968, 753498, 742036, 730213, 718828, 708196, 698107, 688415, 679403, 671498, 664813, 659145, 654357, 650552, 647770, 645703, 643976, 642668, 642182, 642559, 643342, 644313, 645938, 648717, 652487, 656855, 661916, 667835, 673943, 679143, 683249, 687231, 691977, 697497, 703446, 709588, 715443, 720290, 724036, 727482, 731175, 734587, 737031, 738881, 741206, 744510, 748516, 752867, 757354, 761663, 765680, 770039, 775736, 783128, 791826, 801565, 812537, 824745, 837591, 850362, 862697, 874221]
59158H74221R925P508M924K688N06k272n624q647j0509j1379j2096j3030j3695
59145H22520j3582j2857j1918j0787r351p927o950o324n624m761l950l219k584
59132G22686k440l036l691l399k227j326j289j404q22K39J053J569K478M296O786
59117G19473R221J0956J1821J2143J2324J2465J2489J2387J2074J1193R547P532
59105H53625N769M408L336K697K588K361J138r90k966m078m574m922n186n335
59091H47871n434n299m580l383k255j444q43o80j442k939m320n258o271p563q461
59076G87699q549q428q727r084q865q259p850p574o878n725m710m222l981l483
59062F91364k626j902j925k646l119k493j119j38n8m25q76j611k614l290l293
$$ y = [874221, 884146, 891654, 896578, 899266, 899772, 897500, 891876, 883229, 872720, 861341, 849245, 836215, 822520, 808938, 796081, 784163, 773376, 764025, 756098, 749148, 742824, 737200, 732439, 728489, 725270, 722686, 720246, 717210, 713519, 710120, 707893, 706567, 705278, 703874, 703052, 703291, 704344, 705913, 708391, 712687, 719473, 728694, 739650, 751471, 763614, 775938, 788403, 800892, 813279, 825353, 836546, 846093, 853625, 859394, 863802, 867138, 869835, 872423, 874784, 875922, 874932, 871966, 867888, 863314, 858392, 853206, 847871, 842437, 837138, 832558, 829175, 826920, 825476, 824633, 823953, 822511, 819572, 815252, 809994, 803723, 796160, 787699, 779150, 770722, 761995, 752911, 744046, 735787, 727937, 720363, 713485, 707760, 703050, 698828, 694847, 691364, 688738, 686836, 684911, 682265, 679146, 676653, 675534, 675396, 675338, 674913, 674037, 672426, 669812, 666522, 663229]
59047F63229k957k616k167j676j504j509r80J19P64K99n37o84o0P89J545J949
59031F54004J618Q31O57J534K523K826L158M522O443P678Q135Q740R744J0496
59017G22909J0703J0673J0383R387P700N820L885J707m44j938k638k826k446j326
59003G71549O0J044J874L359N422P120Q126R034J0010J0347R721Q848Q415Q209
58989H63138P805P260O563N204K849r3l082o015q615j0012r678q335p115o109
58975H33765m533k209l0J299K256L870O403R185J1551J3512J5307J6719J7298
58962I24393J7145J6992J7331J7801J7588J6190J3595J0033N838J302l515q635
58950A046058j3630j7682k0326k1875k2843k3336k3291k2775k1707j9748j6970
$$ y = [663229, 660272, 657656, 655489, 653813, 652309, 650800, 649820, 649939, 650703, 651002, 650465, 649781, 649721, 650510, 652055, 654004, 655622, 656453, 657110, 658644, 661167, 663993, 667151, 671673, 678116, 685794, 693929, 702669, 712413, 722909, 733612, 744285, 754668, 764055, 771755, 777575, 781460, 783167, 782723, 780785, 778147, 775321, 772875, 771549, 771609, 772653, 774527, 777886, 783308, 790428, 798554, 807588, 817598, 827945, 837666, 846514, 854929, 863138, 870943, 878203, 884766, 889970, 892819, 892726, 889644, 883629, 875014, 865002, 855324, 846989, 839874, 833765, 829232, 827023, 826993, 828292, 830548, 834418, 840821, 850006, 861557, 875069, 890376, 907095, 924393, 941538, 958530, 975861, 993662, 1011250, 1027440, 1041035, 1051068, 1056906, 1058208, 1054693, 1046058, 1032428, 1014746, 994420, 972545, 949702, 926366, 903075, 880300, 858593, 838845, 821875]
58939H21875j4174j2019j0254q382o620n511m986m514l966l539l130k516k005
58926G40259k061k464k578k404k503k916l020k532j865j321p11OM22L91M41J092
58910G18236K140K970L320L517M076N198O573P764Q819J0268J2293J4320J5736
58897H15230J6572J7097J7183J6719J6118J5810J5712J5961J7538K1098K5568
58886A010606K9169L1570L3709L5620L5942L3853L0056K5378J9698J3022O382
58875A305005P04m440j0032j6099k1815k6575l0182l2285l2502l0981k8346k5141
58863A047311k1741j8648j6426j5274j4886j4694j4290j3766j3657j4229j4968
58852H74732j5128j4663j4106j3604j2836j1816j1027j0485r562q126p054p045
$$ y = [821875, 807701, 795682, 785428, 777046, 770426, 764915, 759929, 755415, 751449, 747910, 744780, 742264, 740259, 738198, 735734, 733156, 730752, 728249, 725333, 722313, 719781, 717916, 716595, 715884, 715890, 716312, 716703, 717144, 718236, 720376, 723346, 726666, 730183, 734259, 739457, 746030, 753794, 762613, 772881, 785174, 799494, 815230, 831802, 848899, 866082, 882801, 898919, 914729, 930441, 946402, 963940, 985038, 1010606, 1039775, 1071345, 1105054, 1140674, 1176616, 1210469, 1240525, 1265903, 1285601, 1298623, 1305005, 1305709, 1301269, 1291237, 1275138, 1253323, 1226748, 1196566, 1164281, 1131779, 1100798, 1072452, 1047311, 1025570, 1006922, 990496, 975222, 960336, 945642, 931352, 917586, 903929, 889700, 874732, 859604, 844941, 830835, 817231, 804395, 792579, 781552, 771067, 761505, 753379, 746325, 739280]
58840G39280p537p493o820o287o292o366n967n201m640m625m898m921m534m094
58826F59605l841l414k401j079j38K89P16J443K226K874L633M711N894O790P137
58811F84445O791N838M698L721K793J786J155J334J722J162n23k385l791m953
58797G03793n858n769m444k971k635l487m596n159m916l924k548j306l95M22J289
58782F57496K125L057M326N601O144N870N462N164M380K879J343J53j342l526
58768F99132n409n833n150m655m830n162n403n929o826p466p163n781l717j605
58754F24203M6J229K191K762K472J613J369K308L478L738L434L854N444P494R289
58739F74924J0640J1351J1155J0256R289Q595Q057P653P598P913Q356Q842R421
$$ y = [739280, 731743, 724250, 717430, 711143, 704851, 698485, 692518, 687317, 682677, 678052, 673154, 668233, 663699, 659605, 655764, 652350, 649949, 648870, 648732, 649021, 649737, 651180, 653406, 656280, 659913, 664624, 670518, 677308, 684445, 691236, 697074, 701772, 705493, 708286, 710072, 711227, 712561, 714283, 715445, 714922, 712537, 708746, 703793, 697935, 692166, 687722, 684751, 682116, 678629, 674033, 668874, 663958, 660034, 657486, 656180, 655785, 656207, 657496, 659621, 662678, 667004, 672605, 678749, 684619, 690081, 695245, 699625, 702504, 703847, 704000, 702658, 699132, 693723, 687890, 682740, 678085, 673255, 668093, 662690, 656761, 649935, 642469, 635306, 629525, 625808, 624203, 624249, 625478, 627669, 630431, 632903, 634516, 635885, 638193, 641671, 645409, 648843, 652697, 658141, 665635, 674924, 685564, 696915, 708070, 718326, 727615, 736210, 744267, 751920, 759518, 767431, 775787, 784629, 794050]
58726G94050R871R696Q691P168N601M326L574L409L637L981M470N439P072Q988
58712H79973J0309J0342R325Q316P942P514N847K822n73l677o707r790j2435j4528
58698H94680j6885k0062k3241k5065k5159k4172k2740k0997j8858j6218j3161
58687F68122j0323q647q278q215p560o592o109o179o220n928n425m824m169l589
58673E76064l051k290j326n68l0R78K889N162P049Q485R682J0532J1008J1495
58659F36079J1924J1253Q679M900J387j115k627l233l267l587m595n467n310m591
58645F40430m344m523m329l716l244k792j778n30J3j7O37K510M673O017O365O090
58629F41462N574N175M824L691J224j531k756k136j087n45J30J664L495M714N431
$$ y = [794050, 803921, 813617, 822308, 829476, 835077, 839403, 842977, 846386, 850023, 854004, 858474, 863913, 870985, 879973, 890282, 900624, 909949, 918265, 926207, 933721, 939568, 942390, 941817, 938140, 931433, 921643, 909208, 894680, 877795, 857733, 834492, 809427, 784268, 760096, 737356, 716359, 697501, 681283, 668122, 657799, 649152, 640874, 632659, 625099, 618507, 612398, 606219, 599999, 594071, 588646, 583822, 579653, 576064, 573013, 570723, 569397, 568829, 568799, 569777, 572666, 577828, 584877, 593362, 603044, 613576, 624584, 636079, 648003, 659256, 667935, 672835, 674222, 673107, 670480, 667247, 663980, 660393, 655798, 650331, 645021, 640430, 636086, 631563, 627234, 623518, 620274, 617482, 615704, 615174, 615187, 615170, 615807, 618317, 622990, 629007, 635372, 641462, 647036, 652211, 657035, 660726, 661950, 660419, 657663, 655527, 654440, 653895, 654025, 655689, 659184, 663898, 669329]
58614F69329O341P645R072J0511J1833J2476J1796R733O823L643N29k335m711
58601G52685o224o651o373o206o493o759o593o421o716o905n994l956j642N04
58587F76256K699M950O890Q535J0259J1985J3247J4065J4800J5146J4315J2364
58575H05511J0305Q629O761M383K325J533J943K928M295O238Q838J1978J5422
58562H91089J8651K1001K2317K3057K3599K3755K3109K1377J8336J3888Q404K713
58550A111296k331o117q321r170r499r958j0352j0200r712r614j0221j1355j2964
58537I91482j5029j7037j8296j8667j8398j7532j6209j5055j4344j3193j0698
58526H17024p545n195l760k022N05K916M410N101N293N213N511O689P919P912
$$ y = [669329, 675670, 683315, 692387, 702898, 714731, 727207, 739003, 748736, 755559, 759202, 759731, 757396, 752685, 746461, 739810, 733437, 727231, 720738, 713979, 707386, 700965, 694249, 687344, 681350, 677394, 675752, 676256, 678955, 683905, 690795, 699330, 709589, 721574, 734821, 748886, 763686, 778832, 793147, 805511, 815816, 824445, 831206, 835589, 837914, 839447, 841390, 844318, 848613, 854851, 863689, 875667, 891089, 909740, 930741, 953058, 976115, 999714, 1023469, 1046578, 1067955, 1086291, 1100179, 1108583, 1111296, 1108965, 1102848, 1094527, 1085357, 1075858, 1065900, 1055548, 1045348, 1035636, 1026022, 1015801, 1004446, 991482, 976453, 959416, 941120, 922453, 904055, 886523, 870314, 855259, 840915, 827722, 817024, 809479, 804284, 800524, 798502, 799007, 801923, 806333, 811434, 816727, 821940, 827451, 834140, 842059, 849971]
58512H49971O987O716P259O922M851K408R46q2j715l567m674n101n544o097o537
58497H52743p022p609p772p314o994p338p549o578m663k948k071j848j814j396
58483G79827j73J439K379K521L262N735R157J1824J3130J3609J3478J2232R605
58470H78025O109K526o75l463o024q292r652r593q578p632o991n915m013j833
58456H13999M1J624K979M062N390P679J0344J1501J0170P451M856K535n8k693
58442H79880m636n683o041n770m979m076l211k034m66J003K099L015L606L412
58428H56119K879L301M961O650P684R043J1473J3910J4925J4650J3914J2525R851
58415I81885O382L332J130o52k322l942n558o852p240p100p829r833j1486j1261
$$ y = [849971, 856958, 863674, 870933, 877855, 882706, 885114, 886060, 885978, 884263, 880696, 876022, 870921, 865377, 859280, 852743, 845721, 838112, 830340, 823026, 816032, 808694, 801145, 794567, 789904, 786956, 784885, 783037, 781223, 779827, 779654, 781093, 783472, 785993, 789255, 794990, 804147, 815971, 829101, 842710, 856188, 868420, 878025, 884134, 886660, 885985, 882522, 876498, 868206, 858554, 848961, 840383, 832751, 825760, 819845, 815832, 813999, 814040, 815664, 818643, 822705, 828095, 835774, 846118, 857619, 867789, 875240, 880096, 882631, 882573, 879880, 875244, 869561, 863520, 857750, 852771, 848695, 845484, 843450, 842984, 843987, 846086, 849101, 852707, 856119, 858998, 862299, 867260, 873910, 881594, 890637, 902110, 916020, 930945, 945595, 959509, 972034, 981885, 988267, 991599, 992729, 992077, 989755, 985813, 980255, 973403, 966163, 959063, 951234, 941401, 929915, 918654]
58401I18654r819q757q144o858m639k368o68N10J245J635K030K427K181J092M1
58386H88562l14n49j174j378l80R37J242Q91J299K577L398K983J921J151J175
58371I02341K115L651N050O005O977Q145Q770Q438Q069Q718J0108J1353J2350
58358A002090J3373J4045J3867J3172J2582J2033J1181J0087Q800P062N172M081
58346A127545L975L919L636M141N679O787O639O629Q128J0281J1671J2610J3975
58333A225615J5304J5896J6430J7574J8436J8230J7955J8377J7983J5280J1554
58322A408634Q846O778M039J615J373K593L055K778L599N596P017P477Q238R542
58308A481180J0437J1114J2688J4821J6048J6398J7147J8271J8557J8024J7776
$$ y = [918654, 908835, 900078, 891934, 885076, 880437, 878069, 877401, 877911, 879156, 880791, 882821, 885248, 887429, 888521, 888562, 888248, 887699, 886525, 885147, 884767, 885704, 886946, 887837, 889136, 891713, 895111, 898094, 900015, 901166, 902341, 904456, 908107, 913157, 919162, 926139, 934284, 943054, 951492, 959561, 968279, 978387, 989740, 1002090, 1015463, 1029508, 1043375, 1056547, 1069129, 1081162, 1092343, 1102430, 1111230, 1118292, 1123464, 1127545, 1131520, 1135439, 1139075, 1143216, 1148895, 1155682, 1162321, 1168950, 1177078, 1187359, 1199030, 1211640, 1225615, 1240919, 1256815, 1273245, 1290819, 1309255, 1327485, 1345440, 1363817, 1381800, 1397080, 1408634, 1417480, 1424258, 1428297, 1429912, 1431285, 1433878, 1436933, 1439711, 1443310, 1448906, 1455923, 1463400, 1471638, 1481180, 1491617, 1502731, 1515419, 1530240, 1546288, 1562686, 1579833, 1598104, 1616661, 1634685, 1652461]
58297A652461J7773J7139J6299J6421J7173J7452J7718J9083K0783K1322K1415
58286A855039K2893K5344K6877K7537K8835L0492L0957L0717L1676L3618L4633
58275B178618L4786L5915L8060L9477M0054M1247M2933M3837M4704M7422N1330
58264B638383N4132N6092N9431O3948O7354O9635P2809P6521P8339P8376P9142
58253C394162Q0788Q1136Q0477Q1561Q4602Q7091Q8837R2381R8083J03687J09013
58242D381818J16081J24412J31416J37520J45560J55121J63249J70748J81500
58233E707425J95440K08630K20607K34806K51455K67334K83064L03015L27198
58224G998974L51024L73992M00534M31581M63905M98471N40123N88042O36579
$$ y = [1652461, 1670234, 1687373, 1703672, 1720093, 1737266, 1754718, 1772436, 1791519, 1812302, 1833624, 1855039, 1877932, 1903276, 1930153, 1957690, 1986525, 2017017, 2047974, 2078691, 2110367, 2143985, 2178618, 2213404, 2249319, 2287379, 2326856, 2366910, 2408157, 2451090, 2494927, 2539631, 2587053, 2638383, 2692515, 2748607, 2808038, 2871986, 2939340, 3008975, 3081784, 3158305, 3236644, 3315020, 3394162, 3474950, 3556086, 3636563, 3718124, 3802726, 3889817, 3978654, 4071035, 4169118, 4272805, 4381818, 4497899, 4622311, 4753727, 4891247, 5036807, 5191928, 5355177, 5525925, 5707425, 5902865, 6111495, 6332102, 6566908, 6818363, 7085697, 7368761, 7671776, 7998974, 8349998, 8723990, 9124524, 9556105, 10020010, 10518481, 11058604, 11646646, 12283225]
58215A2283225O86684P45971Q16361Q93098R77342J077160J194441J324417J470379
58206B1469078J644420J851553K089437K366539K703091L111734L598067M184459
58198D3018378M911422N813280O921149Q296467J0031519J2211062J4906565J8203327
58190A24313169K2172451K6799593L1978267L7476896M2606157M5716948M4318249
58183C75381730L6377051K2048846M206530j2946140k6041891l3745340l6448961
58176C28831825l5365260l1957090k7732942k3977071k1367789j9836815j8845117
58169A49749741j7836540j6528657j4928365j3187440j1459459r840273q378127
58162E7590880p096707o000551n076189m303239l663370l136943k700214k332753
$$ y = [12283225, 12969909, 13715880, 14532241, 15425339, 16402681, 17479841, 18674282, 19998699, 21469078, 23113498, 24965051, 27054488, 29421027, 32124118, 35235852, 38833919, 43018378, 47929800, 53743080, 60664229, 68960696, 78992215, 91203277, 106109842, 124313169, 146485620, 173285213, 205263480, 242740376, 285346533, 331063481, 375381730, 411758781, 433807627, 438014157, 425068017, 399026126, 365280786, 328831825, 293466565, 261509475, 233776533, 209799462, 188431673, 168594858, 149749741, 131913201, 115384544, 100456179, 87268739, 75809280, 65969007, 57590880, 50494173, 44493622, 39417433, 35114194, 31450824, 28313881, 25613667, 23280914]
58154B3280914k022790j761743j539856j350774j193334j064355r55638q61717
58146A2530707p83858p22261o70418o21513n74636n30646m87464m43858m02776
58137G293277l66672l33743l02287k74398k52188k34700k21399k13951k11406
58128D882533k08365k01281j92170j83317j73092j60436j48536j40060j32782
58119C342494j23848j14572j07271j00944r3878q7250q2453p7911p2098o6800
58109B415469o3930o1885n8410n4550n2422n1529n0461m9806n0288n0256m8169
58098A823763m5540m4488m4280m3024m0887l8930l6700l3522l0512k8803k7499
58087A409578k5524k3678k2788k1825k0034j8844j9482k0695k1052k1386k2665
$$ y = [23280914, 21258124, 19496381, 17956525, 16605751, 15412417, 14348062, 13392424, 12530707, 11746849, 11024588, 10354170, 9732657, 9158021, 8627375, 8139911, 7696053, 7293277, 6926605, 6592862, 6290575, 6016177, 5763989, 5529289, 5307890, 5093939, 4882533, 4674168, 4472887, 4280717, 4097400, 3924308, 3763872, 3615336, 3475276, 3342494, 3218646, 3104074, 2996803, 2895859, 2801981, 2714731, 2632278, 2554367, 2482269, 2415469, 2351539, 2289654, 2231244, 2176694, 2124272, 2072743, 2022282, 1972476, 1922188, 1871932, 1823763, 1778223, 1733735, 1689455, 1646431, 1605544, 1566614, 1529914, 1496392, 1465880, 1437077, 1409578, 1384054, 1360376, 1337588, 1315763, 1295729, 1276885, 1257403, 1236708, 1215656, 1194270, 1171605]
58076A171605k3599k2792k1330k0787k0572j9654j8979j9588k0102j8770j6404
58065I49028j4839j3893j2398j0762j0032r678q693p742p977q926r592j0322j1543
58052H12631j2110j1083r773r777j0326r820q694q375q571p941o513n387m929
58039F99332n043o113p811q377p036n696o230p543p627o992p529r200j0442j0809
58025E92884j0826j0264q942q190r039r988r005o834n735n908n774m979m360l675
58011D89365k143p33j126k726l287k342j395j041m48L49L21l26k31O99J216J139
57995D77291J571K646L324L533M204N054M594K704J064O11N34J67j37l43j053
57980E05764k062k460k402k970l982l948k599j499j610k095k096j900j687q59
$$ y = [1171605, 1148006, 1125214, 1103884, 1083097, 1062525, 1042871, 1023892, 1004304, 984202, 965432, 949028, 934189, 920296, 907898, 897136, 887104, 877426, 868733, 860991, 853014, 844088, 834496, 824174, 812631, 800521, 789438, 779665, 769888, 759562, 749742, 741048, 732673, 724102, 716161, 709648, 704261, 699332, 694289, 688176, 680365, 671988, 664952, 659256, 653026, 645483, 637856, 630864, 623335, 614135, 603693, 592884, 582058, 571794, 562852, 554662, 545623, 535635, 526630, 519796, 514061, 508153, 502379, 497400, 493040, 489365, 487222, 486489, 485363, 482637, 479350, 477008, 475613, 474572, 474124, 474473, 474794, 474468, 474237, 474936, 476152, 477291, 478862, 481508, 484832, 488365, 492569, 497623, 502217, 504921, 505985, 506596, 507130, 507297, 507160, 506817, 505764, 503702, 501242, 498840, 495870, 491888, 487940, 485341, 483842, 482232, 480137, 478041, 476141, 474454, 473595]
57966D73595O43J749J762J193O51K42L29J386K743K969J970J210J372J439N70
57951D93823o38j463k119k800l017k706k702l382l927l663l024k544j942r17J94
57936D59173J182K447M117N574O446P184Q081Q552Q030O791N396L935K314P07
57922E29929o70j780k557l006l500m388n425o203o848p425p154n423l269k407
57908D69874k908l271k823k400k564k725k554k791m002n682p073p919q083p538
57894D07541o910o896p023o253m890m334m764m737l556k273j719j291m86n7m70
57879C51882p61j68M31j04j366k215k494k754l036l035k915k953k949k724k622
57864C22217k766k608j893j339j510j808j386l77O53J735L095M361N074N501O109
$$ y = [473595, 474238, 475987, 477749, 478942, 479593, 479835, 480164, 481550, 484293, 487262, 489232, 490442, 491814, 493253, 493823, 493185, 491722, 489603, 486803, 483786, 481080, 478378, 474996, 471069, 467406, 464382, 461838, 459896, 458979, 459173, 460355, 462802, 466919, 472493, 478939, 486123, 494204, 502756, 510786, 517577, 522973, 526908, 529222, 529929, 529259, 527479, 524922, 521916, 518416, 514028, 508603, 502400, 495552, 488127, 480973, 475550, 472281, 469874, 466966, 463695, 460872, 458472, 455908, 453183, 450629, 447838, 443836, 438154, 431081, 423162, 415079, 407541, 400631, 393735, 386712, 380459, 375569, 371235, 366471, 361734, 358178, 355905, 354186, 352895, 352409, 352352, 351882, 351121, 350953, 351384, 351280, 349914, 347699, 345205, 342451, 339415, 336380, 333465, 330512, 327563, 324839, 322217, 319451, 316843, 314950, 313611, 312101, 310293, 308907, 308530, 309183, 310918, 314013, 318374, 323448, 328949, 335058]
57849C35058O708O849O663O557O475O159N728N485N379N147M662L813K611J540
57835D08834J158J109M30q58j511r33k01m31j193j394r53n60m53m21n03q29j146
57818D00145j246j411j805j982j670j418j743k184j990j268p08o51j131k338m254
57803C74346o264p732q629r116r038q385p540o546m860k541q07n72j151j284p75
57788B99106j44N75J548K291K284K051K454L239L441K973K625K666K555K132J974
57773C31770K388K890K927K508J965J551J327J112O90K48J66M4j273m032o653
57758C37628p380o366n155m614m425m258m163l941l251k380j940j879j677j439
57744B84760j680k116j826p87j16m50j106j316j330j727k315k376j624m22O52
$$ y = [335058, 341766, 348615, 355278, 361835, 368310, 374469, 380197, 385682, 391061, 396208, 400870, 404683, 407294, 408834, 409992, 411101, 411531, 410673, 409162, 408229, 408028, 407597, 406404, 405010, 404057, 403497, 403044, 402623, 402120, 401291, 400145, 398899, 397488, 395683, 393701, 392031, 390613, 388870, 386686, 384696, 383428, 382720, 382069, 380938, 378600, 374346, 368082, 360350, 351721, 342605, 333567, 325182, 317642, 311096, 306236, 303695, 302888, 302316, 301165, 299881, 299106, 298962, 299537, 301085, 303376, 305660, 307711, 310165, 313404, 316845, 319818, 322443, 325109, 327664, 329796, 331770, 334158, 337048, 339975, 342483, 344448, 345999, 347326, 348438, 349128, 349376, 349542, 349586, 348313, 344281, 337628, 330248, 323882, 318727, 314113, 309688, 305430, 301267, 297326, 294075, 291695, 289755, 287876, 286199, 284760, 283080, 280964, 279138, 278351, 278235, 277785, 276679, 275363, 274033, 272306, 269991, 267615, 265991, 265569, 266221]
57729B66221J212J306J376J737K121K096J785J666J755J684J536J758K180J982
57715B90415Q96k73p56p48q35j084j268j444j760k055k153k254k544k769k637
57700B68731k383k346k271j685q03l15k22K55J342K039J449J61m75j79J26jJ71
57683B63594J213K407K790K648L089M468O251Q259J1043J4849J9201K3944K9879
57670C93635L7849M7686N8702P0824Q4273R7574J05934J02279Q1372M4374k99
57659A124203m1344p0731q6465r0902q7784q0532p1526o1812n1728m2071l4052
57648D05256k8033k3148j8553j4324j0868q227o324n158m400l540k675k331k229
57635B75446j381J75R74K31q82j033o73r24j494j181k7N34l52j962l050l079k426
$$ y = [266221, 267433, 268739, 270115, 271852, 273973, 276069, 277854, 279520, 281275, 282959, 284495, 286253, 288433, 290415, 291311, 291038, 290282, 289534, 288699, 287615, 286347, 284903, 283143, 281088, 278935, 276681, 274137, 271368, 268731, 266348, 264002, 261731, 260046, 259243, 258928, 258706, 258961, 260303, 262342, 263791, 263952, 263477, 263298, 263424, 263423, 263594, 264807, 267214, 270004, 272652, 275741, 280209, 286460, 294719, 305762, 320611, 339812, 363756, 393635, 431484, 479170, 537872, 608696, 692969, 790543, 896477, 998756, 1080128, 1124502, 1124203, 1082859, 1012128, 925663, 834761, 746977, 666445, 594919, 533107, 481379, 439308, 405256, 377223, 354075, 335522, 321198, 310330, 302103, 295779, 290621, 286221, 282681, 280006, 277675, 275446, 274065, 274240, 275214, 275445, 274563, 273530, 272857, 271933, 270439, 269258, 269231, 269765, 269413, 267451, 264401, 261322, 258896]
57618B58896j920k081k486k231j322r18j654k591k634k133k080k439k483k183
57604B29741k013j798r75J93Q58Q40O00K44m20j013r35m43l44q13j431k194l279
57587B16818m088l733k515j745k027k694k962k604j591j06J042J070L15l09p16
57572A94155j458k304k356j654j299j720k112j877j449j336j430j581j814j769
57558A69996r97n6o4r09j251o28j29l97m62N53J869K298J944J579J188L23o96
57541A74161j125r05m46K87J550K937L585L212K309J437Q48O17O57O96N41K44
57525A90605k05r19j649j743r74lL90K48J44L48O83R88J331J797K292K519K222
57508A98074J578J214J447J719J335N35J11N6m69j697k714k702j973j369j318
$$ y = [258896, 256976, 254895, 252409, 250178, 248856, 247938, 246284, 243693, 241059, 238926, 236846, 234407, 231924, 229741, 227728, 225930, 224955, 225148, 226006, 226846, 227446, 227690, 227270, 226257, 225322, 224879, 224535, 223722, 222291, 220097, 216818, 212730, 208997, 206482, 204737, 202710, 200016, 197054, 194450, 192859, 192753, 193795, 194865, 195180, 194871, 194155, 192697, 190393, 188037, 186383, 185084, 183364, 181252, 179375, 177926, 176590, 175160, 173579, 171765, 169996, 168999, 168943, 168879, 167970, 166719, 166091, 165962, 165565, 165103, 165656, 167525, 169823, 171767, 173346, 174534, 174857, 174161, 173036, 172131, 171685, 171972, 173522, 176459, 180044, 183256, 185565, 187002, 187850, 188467, 189124, 189820, 190361, 190605, 190400, 189481, 187832, 186089, 185115, 185112, 185502, 185750, 185894, 186242, 186925, 187913, 189244, 191041, 193333, 195852, 198074, 199652, 200866, 202313, 204032, 205367, 205902, 206013, 206069, 205600, 203903, 201189, 198487, 196514, 195145, 193827]
57493A93827j783k519l032k883k294j883j668j154n19p09j910k892k583j421n14
57478A66063j56O3K80K83L4l61q84j339j368j100j203j831k198j754j053p78o01
57461A52097J03J044J486J551J980K791L103K408J229L98J91L39N00N41N64O62
57445A70987O74L63j61n18n73m89k39K96P43N12j48k67L72P53J96n40m53J83M13
57426A72104P6k53k94j08M53J403K070J810J040O30M94k15j515k241j557pJ239
57409A75129J633J487J327J311J175O39r0m62l06m2N0K69P68R74L46o24r12k78
57391A82394O10J182J471J658J740J687J545J386J479K181L205L456K256N72N3
57376B06875R60J883J664P82M38R48J588J624R65k5q81j158o32M13J225J252P49
$$ y = [193827, 192044, 189525, 186493, 183610, 181316, 179433, 177765, 176611, 176092, 175383, 173473, 170581, 167998, 166577, 166063, 165907, 165970, 166250, 166533, 166567, 166206, 165322, 163983, 162615, 161515, 160312, 158481, 156283, 154529, 153476, 152698, 152097, 152200, 153244, 154730, 156281, 158261, 161052, 164155, 166563, 167792, 168190, 168381, 168720, 169220, 169761, 170325, 170987, 171661, 172024, 171863, 171345, 170772, 170283, 170044, 170340, 171083, 171595, 171447, 171180, 171552, 172305, 172501, 171961, 171508, 171691, 172104, 172180, 171927, 171633, 171525, 171978, 173381, 175451, 177261, 178301, 178931, 179425, 179210, 177695, 175454, 173897, 173890, 175129, 176762, 178249, 179576, 180887, 182062, 182701, 182611, 182149, 181843, 181801, 181851, 182120, 182888, 183862, 184208, 183584, 182672, 182394, 183004, 184186, 185657, 187315, 189055, 190742, 192287, 193673, 195152, 197333, 200538, 203994, 206250, 206822, 206875, 207835, 209718, 211382, 212164, 212602, 213550, 215138, 216762, 217727, 217702, 216821, 215663, 215031, 215444, 216669, 217921, 218670]
57359B18670M94P88J085Q38L11Q3J28P0N8N47J249J331Q27P60J549K301K216J737
57341B35042J589J596J308J034J264J655J533R62M70J71K3L69J268J821J285M46
57325B51836O44J685K060J170Q1j62K45O55Q77Q51L79k80k72Q33K394L466L786
57308B70248L598L098K452K002J996K330K764L229L685L967L959L712L261K637
57294C12938K137K246L044L948M232L749L013K707L117L937M571M631M157L494
57280C61921L112L493M756O303P224P235O788O184N162L737K726K825L612M136
57266D29214M182M246M576M931N112N045M554L637K869K882L532M230M888N856
57252D89754P074Q003Q505Q995R680J0242J0419J0267R799Q952Q106Q001Q863
$$ y = [218670, 219164, 219952, 221037, 221875, 222186, 222269, 222397, 222467, 222525, 223072, 224321, 225652, 226479, 227239, 228788, 231089, 233305, 235042, 236631, 238227, 239535, 240569, 241833, 243488, 245021, 245983, 246453, 246624, 246647, 247016, 248284, 250105, 251390, 251836, 252480, 254165, 256225, 257395, 257476, 257314, 257559, 258214, 259091, 259942, 260321, 260041, 259769, 260602, 262996, 266462, 270248, 273846, 276944, 279396, 281398, 283394, 285724, 288488, 291717, 295402, 299369, 303328, 307040, 310301, 312938, 315075, 317321, 320365, 324313, 328545, 332294, 335307, 338014, 341131, 345068, 349639, 354270, 358427, 361921, 365033, 368526, 373282, 379585, 386809, 394044, 400832, 407016, 412178, 415915, 418641, 421466, 425078, 429214, 433396, 437642, 442218, 447149, 452261, 457306, 461860, 465497, 468366, 471248, 474780, 479010, 483898, 489754, 496828, 504831, 513336, 522331, 532011, 542253, 552672, 562939, 572738, 581690, 589796, 597797, 606660]
57239F06660J0048J0794J1036J1227J1654J2156J2434J2484J2672J3281J4061
57228G38507J4536J4830J5566J6832J7885J8359J8941K0179K1285K1195K0301
57217I38416K0050K0977K2293K3338K4321K5434K6331K6860K7390K8045K8316
57206A211771K7928K7413K7393K7879K8587K9463L0384L0850L0524K9827K9561
57195A531580K9923L0185K9426K7550K5544K4591K4816K5207K4933K4378K4443
57184A822576K5202K5904K6114K6183K6530K7081K7572K8010K8607K9505L0623
57173B123907L1663L2445L3265L4563L6074L6865L6595L6178L6618L7695L8450
57162B514318L8490L8062L7330L6397L5705L5627L5921L6317L7189L8780M0221
$$ y = [606660, 616708, 627502, 638538, 649765, 661419, 673575, 686009, 698493, 711165, 724446, 738507, 753043, 767873, 783439, 800271, 818156, 836515, 855456, 875635, 896920, 918115, 938416, 958466, 979443, 1001736, 1025074, 1049395, 1074829, 1101160, 1128020, 1155410, 1183455, 1211771, 1239699, 1267112, 1294505, 1322384, 1350971, 1380434, 1410818, 1441668, 1472192, 1502019, 1531580, 1561503, 1591688, 1621114, 1648664, 1674208, 1698799, 1723615, 1748822, 1773755, 1798133, 1822576, 1847778, 1873682, 1899796, 1925979, 1952509, 1979590, 2007162, 2035172, 2063779, 2093284, 2123907, 2155570, 2188015, 2221280, 2255843, 2291917, 2328782, 2365377, 2401555, 2438173, 2475868, 2514318, 2552808, 2590870, 2628200, 2664597, 2700302, 2735929, 2771850, 2808167, 2845356, 2884136, 2924357]
57151B924357M0395L9396L8108L6737L4941L3031L1751L0970K9950K8730K7894
57140C296260K7077K5308K2977K1841K2649K4307K5792K7430K9614L1732L3233
57129C588220L4569L6190L7664L8608L9456M0489M1027M0488L9400L8610L8392
57118D013113L9026M1324M5599N0924N6361O2201O9065P6649Q4460R3282J04619
57107D736623J19064J36136J55575J77988K04525K36799K76937L27092L88974
57098F759713M64402N55947O66543P98843R55274J137936J347340J580998J833041
57089A6100037K093960K349891K583120K774872K908428K970598K952569K850497
57081C7583972K663140K386328K011426J534256R68421L48644k81001q82753j431164
$$ y = [2924357, 2964752, 3004148, 3042256, 3078993, 3113934, 3146965, 3178716, 3209686, 3239636, 3268366, 3296260, 3323337, 3348645, 3371622, 3393463, 3416112, 3440419, 3466211, 3493641, 3523255, 3554987, 3588220, 3622789, 3658979, 3696643, 3735251, 3774707, 3815196, 3856223, 3896711, 3936111, 3974721, 4013113, 4052139, 4093463, 4139062, 4189986, 4246347, 4308548, 4377613, 4454262, 4538722, 4632004, 4736623, 4855687, 4991823, 5147398, 5325386, 5529911, 5766710, 6043647, 6370739, 6759713, 7224115, 7780062, 8446605, 9245448, 10200722, 11338658, 12685998, 14266996, 16100037, 18193997, 20543888, 23127008, 25901880, 28810308, 31780906, 34733475, 37583972, 40247112, 42633440, 44644866, 46179122, 47147543, 47496187, 47215186, 46332433, 44901269]
57072D4901269j908854k301731k599669k799530k905411k926092k872909k759211
57064B3827862k599823k409487k201270j986102j772919j568510j377284j201815
57056H710652j043757r03959p81920o75882n83951n04773m37102l79229l29290
57047C070789k85887k48199k15731j88235j65504j46896j31228j17409j05064
57038A466636r4295q5059p6970o9586o2616n5885m9225m2432l5338k8070k0992
57027H46168j4149o856J839J2442K5230M1085O1177Q5037J08467J23317J20072
57016A403829R2892M4498j3406o5912j02758j21792j26419j21431j10954r8073
57006G80474q4639p1432n9100m8571m0299l3779k8280k3575j9602j6080j2910
$$ y = [44901269, 42992415, 40690684, 38091015, 35291485, 32386074, 29459982, 26587073, 23827862, 21228039, 18818552, 16617282, 14631180, 12858261, 11289751, 9912467, 8710652, 7666895, 6762936, 5981016, 5305134, 4721183, 4216410, 3779308, 3400079, 3070789, 2784902, 2536703, 2320972, 2132737, 1967233, 1820337, 1689109, 1571700, 1466636, 1372341, 1287282, 1210312, 1140726, 1078110, 1022225, 973000, 930568, 895230, 867160, 846168, 832019, 825163, 827002, 839444, 864674, 905759, 966936, 1051973, 1160440, 1283757, 1403829, 1496721, 1541219, 1527813, 1461901, 1359143, 1237351, 1110932, 989501, 878547, 780474, 695835, 624403, 565303, 516732, 476433, 442654, 414374, 390799, 371197, 355117, 342207]
56995C42207j0468q967q055p347o888o627o020m612k652o47J271L282N432P491
56981B97400Q758Q048M558r80o698j1307j4684j6778j7074j5671j3749j2230j0821
56968A98772r016p163n655l968j463J485M170O757R871J3467J7055K0502K3622
56955B68436K5214K3609J8194R863K76q700j5329j8876k0076k0090j9143j6857
56943B26521j3536j0199p415m900k344R3K235M299O715R798J3700J8349K3351
56930B66667K7912L0633K9639K3606J3116O37j1095k0367k6425k9128k9112k7484
56918B48599k4900k1478j7775j4890j3146j1673r894q448p858p360o008m125k626
56905I8418j642q42m15o28q82l71P52J780K585L483M469N467O833Q742J0607J2013
$$ y = [342207, 331739, 322772, 314717, 307370, 300482, 293855, 287835, 283223, 280571, 279924, 281195, 284477, 289909, 297400, 306158, 314206, 318764, 317784, 311086, 299779, 285095, 268317, 251243, 235572, 221823, 209593, 198772, 189756, 182593, 176938, 172970, 171507, 172992, 177162, 183919, 193790, 207257, 224312, 244814, 268436, 293650, 317259, 335453, 345316, 345592, 336892, 321563, 302687, 282611, 262521, 243378, 226521, 212985, 202786, 195371, 190471, 188127, 188220, 190455, 194754, 201469, 211267, 224967, 243316, 266667, 294579, 325212, 354851, 378457, 391573, 392210, 381115, 360748, 334323, 305195, 276083, 248599, 223699, 202221, 184446, 169556, 156410, 144737, 134843, 126395, 118537, 111177, 105169, 101044, 98418, 96776, 95934, 95519, 94891, 94009, 93638, 94390, 96170, 98755, 102238, 106707, 112174, 119007, 127749, 138356, 150369]
56889A50369J3578J6011J9013K2035K5157K7906K8163K3999J6193P423n49p375
56877C41923j2423j4689j4452j3193j1620r236o018k874j23K985O746J0445J3843
56864B91314J7888K3321K9678L6349M3423N0589N5914N6592N0598L7560J8945
56853G12171j928k0763l4144m0908m2041l9621l5586l0791k5005j8123j0946m243
56841D08072K428R963J8289K6793L5803M6274N8179P0500Q2470R2752R7178Q9702
56829A038403O7424L3949k948l6176o1505p7069q2966q1344p5280o6979n7248
56818E98261m6531l5743k5906j7408r738k000O290J4962K3876L3526M4444N5959
56806F39992O5756P0511O6837N2544K8450p73k8447m9411o1962o7053o6574o2370
$$ y = [150369, 163947, 179958, 198971, 221006, 246163, 274069, 302232, 326231, 342424, 349847, 349298, 341923, 329500, 314811, 300359, 287166, 275546, 266310, 260292, 257418, 257295, 260280, 267026, 277471, 291314, 309202, 332523, 362201, 398550, 441973, 492562, 548476, 605068, 655666, 693226, 712171, 710243, 689480, 655336, 614428, 572387, 532766, 497180, 466389, 441384, 423261, 412315, 408072, 410500, 420463, 438752, 465545, 501348, 547622, 605801, 676301, 758771, 851523, 948701, 1038403, 1105827, 1139776, 1136828, 1100652, 1039147, 962078, 879112, 797768, 722488, 655509, 598261, 551730, 515987, 490081, 472673, 462935, 460935, 467225, 482187, 506063, 539589, 584033, 639992, 705748, 776259, 843096, 895640, 924090, 923317, 894870, 845459, 783497, 716444, 649870, 587500]
56794E87500n5978m8556m1027l4043k7560k0902j3863p329k086K546P952J4375
56782C61029K0904K6935L2298L5858L5316K8957J7020J418j4919k8608l7172m0568
56770D38468m0651l8976l5871l1677k7519k4309k1821j9387j6814j4289j1980
56759A55174j0128q914p998o731n084l723l001k551j999j430r84o55o22j186k125
56744I8043k755k627j814o41K69L0j509l060l120j802m81J26M03O22N45K87K65
56727H2781K88j84p57m61N66J075O37J64K88N53O35R35J457J428O64O0J77M51
56709I0757L40J93L42M65L35L13N33O08M85N82P63L59n00q16l43j3l57q45j129
56690I2072j444j424k98J245J256n45j921j341j83l43j361j603r24l59k23j80
$$ y = [587500, 531522, 482966, 441939, 407896, 380336, 359434, 345571, 338242, 336156, 338702, 346654, 361029, 381933, 408868, 441166, 477024, 512340, 541297, 558317, 559735, 544816, 516208, 479036, 438468, 397817, 358841, 322970, 291293, 263774, 239465, 217644, 198257, 181443, 167154, 155174, 145046, 136132, 128134, 121403, 116319, 112596, 109595, 107044, 105045, 103615, 102631, 101976, 101354, 100168, 98043, 95288, 92661, 90847, 90206, 90475, 90505, 88996, 85936, 82816, 81014, 80533, 80659, 81062, 81684, 82229, 82516, 82781, 83069, 82885, 82128, 81667, 82233, 83308, 83945, 84109, 84397, 84950, 85585, 86520, 87977, 89405, 90069, 90129, 90306, 90757, 91097, 91290, 91632, 92097, 92432, 92745, 93278, 93886, 94371, 94953, 95716, 96075, 95575, 94759, 94416, 94403, 94046, 93201, 92072, 90628, 89204, 88906, 90151, 91407, 90862, 88941, 87600, 87417, 87074, 85713, 84110, 83186, 82827, 82604, 82424]
56674H2424l89j009j232l35R08J182M67k70o17p81o63p6N68Q54J076J511J623
56657H5241J012L73N06J112J610K279L460M432M469M252M803N618N405M271L572
56642A32415L791M035L661L105K907K921K790K453K069J844J881J910J543J080
56628A68405J341K279K619J575M9p17q24j035j269r53k55K38N29Q51P71j87j489
56611A71928k204k347k529k719k396j633j050r01j029j399j987k457k655k885
56597A43737l092k518r87L43L89l39o40k76K86R08J432J166k8q37j05J307J643
56580A42389P39o7l9M31J023J747K141J656P29L36N98R01J152J810K826L674M212
56563A66258M625M835M912N568P196Q972R974J0454J0785R999P087L185O39R8
$$ y = [82424, 82035, 81026, 79794, 79459, 80367, 81549, 82016, 81746, 81129, 80348, 79685, 79609, 80177, 81031, 82107, 83618, 85241, 86253, 86626, 87132, 88244, 89854, 92133, 95593, 100025, 104494, 108746, 113549, 119167, 124572, 128843, 132415, 136206, 140241, 143902, 147007, 149914, 152835, 155625, 158078, 160147, 161991, 163872, 165782, 167325, 168405, 169746, 172025, 174644, 176219, 176268, 175551, 174727, 173692, 172423, 171470, 171215, 171453, 171982, 172833, 173604, 173417, 171928, 169724, 167377, 164848, 162129, 159733, 158100, 157050, 156149, 155120, 153721, 151734, 149277, 146622, 143737, 140645, 138127, 137140, 137483, 137872, 137533, 136893, 136617, 136903, 137811, 139243, 140409, 140381, 139544, 139439, 140746, 142389, 143128, 143061, 143022, 143453, 144476, 146223, 148364, 150020, 150749, 151085, 151683, 152584, 153736, 155546, 158372, 162046, 166258, 170883, 175718, 180630, 186198, 193394, 202366, 212340, 222794, 233579, 243578, 250665, 253850, 254489, 254587]
56549B54587K53K81O66J556K090J840J455J350R92m5j329k254k663k651k488k754
56533B50886l711m634m639l992l683l899l942l521l093k988l096l323l572l504
56519A99289l123l124l839m452m196l645l620l617k768j650j489k064k123j547
56505A58032j295j420r27L14J264J431J425J577J536J310J343J483J171O89Q54
56490A68787J483J555Q57J18l99r71j250o01M97R08O95Q92J505J473O59P5K7j65
56472A76145m33J46J440K136J950K095L035L588K951J905J290Q65M54O04J278
56457A99449J318J03j422k122j958j307k81P17R28L45j79k90m62p30m84J88L71
56440A94184l5k8O56J025O19K73M86N90K49K47R50J431J005L18P8o5n13q66q12
$$ y = [254587, 254840, 255121, 255787, 257343, 259433, 261273, 262728, 264078, 265070, 265025, 263696, 261442, 258779, 256128, 253640, 250886, 247175, 242541, 237902, 233910, 230227, 226328, 222386, 218865, 215772, 212784, 209688, 206365, 202793, 199289, 196166, 193042, 189203, 184751, 180555, 176910, 173290, 169673, 166905, 165255, 163766, 161702, 159579, 158032, 156737, 155317, 154390, 154704, 155968, 157399, 158824, 160401, 161937, 163247, 164590, 166073, 167244, 167933, 168787, 170270, 171825, 172682, 172800, 172401, 171430, 170180, 169579, 170076, 170984, 171679, 172571, 174076, 175549, 176208, 176283, 176310, 176145, 175712, 175858, 177298, 179434, 181384, 183479, 186514, 190102, 193053, 194958, 196248, 197113, 197567, 198171, 199449, 200767, 200870, 199448, 197326, 195368, 194061, 193780, 194497, 195425, 195770, 195591, 195301, 194839, 194109, 193625, 193813, 194184, 194149, 194121, 194777, 195802, 196421, 196694, 197180, 197770, 198019, 198266, 199216, 200647, 201652, 201970, 202048, 201983, 201470, 200604, 199792]
56421A99792p78r40q11l39k31n96n97l0K38JK77J347J860R55k63n01j52j44k26
56402A98862K81J033J289J153J147J266J346J580J893J717J089J003J903K801
56388B18363K738K120J785J738J586J340J054N16n2lN06L82o64j458j122l21m
56371B28504j17k52l73j71R64K577L076J909N26K48N70N30L43M95N46N3l38L7
56353B39127P63J264J811K532K623J613M02p1r5j63J15R76J623J564J627K457
56337B58168L163K816K084J979K107J686J291J872K872K907J847P32J47m4J90
56322B83817R25J646J826J796K161K762L051K892K322J211j34q36n97j42J32Q27
56306C03659K078K757K182J434J743K639K947K676K565K643K551K578L111L669
$$ y = [199792, 199014, 198074, 197263, 196924, 196693, 196097, 195500, 195470, 195708, 195709, 195986, 197333, 199193, 200148, 199885, 199384, 199232, 199088, 198862, 199143, 200176, 201465, 202618, 203765, 205031, 206377, 207957, 209850, 211567, 212656, 213659, 215562, 218363, 221101, 223221, 225006, 226744, 228330, 229670, 230724, 231240, 231188, 231185, 231691, 232073, 231409, 229951, 228829, 228508, 228504, 228387, 228135, 227762, 227591, 228555, 231132, 234208, 236117, 236643, 236891, 237461, 237991, 238334, 238829, 239375, 239428, 239090, 239127, 239890, 241154, 242965, 245497, 248120, 249733, 250135, 250064, 249969, 249806, 249921, 250897, 252520, 254084, 255711, 258168, 261331, 264147, 266231, 268210, 270317, 272003, 273294, 275166, 278038, 280945, 282792, 283524, 283671, 283627, 283817, 284742, 286388, 288214, 290010, 292171, 294933, 297984, 300876, 303198, 304409, 304275, 303439, 302842, 302700, 302832, 303659, 305737, 308494, 310676, 312110, 313853, 316492, 319439, 322115, 324680, 327323, 329874, 332452, 335563, 339232]
56292C39232L574L000K461J970J545J728K666L523L732L929M794N865O353O320
56278C90692O165N917N712O048O841P360P572Q272R373R723R287R644J1327J2669
56264E06602J2543J2303J3441J5265J6574J7903K0171K2734K4788K7284L1381
56253G20989L6276M0566M4672M9909N6267O2987P0227P8287Q6262R3323J00211
56242A439976J07598J14147J18193J20158J21174J20460J16237J08283R7375Q3236
56232B546837O5396M5287K5078N054j5609l6102n4299o9409q2124r2524r9924
56221B237661j04531j07325j08468j07523j04804j00902r5515q8474q1230p5423
56211A263466p0615o5317n9534n4367m9821m5086m0413l6629l3355k9710k6244
$$ y = [339232, 342806, 345806, 348267, 350237, 351782, 353510, 356176, 359699, 363431, 367360, 372154, 378019, 384372, 390692, 396857, 402774, 408486, 414534, 421375, 428735, 436307, 444579, 453952, 463675, 472962, 482606, 493933, 506602, 519145, 531448, 544889, 560154, 576728, 594631, 614802, 637536, 662324, 689608, 720989, 757265, 797831, 842503, 892412, 948679, 1011666, 1081893, 1160180, 1246442, 1339765, 1439976, 1547574, 1661721, 1779914, 1900072, 2021246, 2141706, 2257943, 2366226, 2463601, 2546837, 2612233, 2657520, 2682598, 2687652, 2672043, 2635941, 2581642, 2512233, 2430109, 2337585, 2237661, 2133130, 2025805, 1917337, 1809814, 1705010, 1604108, 1508593, 1420119, 1338889, 1263466, 1192851, 1127534, 1068000, 1013633, 963812, 918726, 878313, 841684, 808329, 778619, 752375]
56200G52375k4063k2535k0059j6819j4589j3910j3447j2137j0298q635p524p162
56188E81197p146o448m913l879m125m303l057j371r74j500j389n62p9NL63P61
56172E42580O33N51J192J821J611J392K097K795K359J790K511L705L888L784M938
56157E77647O686P324P203P799Q689Q442P627P958R246J0081J0699J2220J3981
56144F95602J4709J5586J8818K3811K8011L1066L4988M0649M7358N5454O6024
56133A072076P8189Q9522R8810J05544J07506J02377R1437P8591O6224N4961M6493
56122A991730M2621M1677L9535L4204K6424J6504M492o957j3973j6131j6526j7524
56110B126076k0004k6092l8144n4433o9777q0989q8440r2347r1515q6220p8672
$$ y = [752375, 728312, 705777, 685718, 668899, 654310, 640400, 626953, 614816, 604518, 595883, 588359, 581197, 574051, 567603, 562690, 558811, 554686, 550383, 547326, 545955, 544981, 543481, 542092, 541530, 541451, 541456, 541819, 542580, 543213, 543764, 544956, 546777, 548388, 549780, 551877, 554672, 557031, 558821, 561332, 565037, 568925, 572709, 577647, 584333, 591657, 598860, 606659, 615348, 623790, 631417, 639375, 648621, 658702, 669401, 681621, 695602, 710311, 725897, 744715, 768526, 796537, 827603, 862591, 903240, 950598, 1006052, 1072076, 1150265, 1239787, 1338597, 1444141, 1551647, 1654024, 1745461, 1824052, 1890276, 1945237, 1991730, 2034351, 2076028, 2115563, 2149767, 2176191, 2192695, 2197187, 2190230, 2176257, 2160126, 2143600, 2126076, 2106072, 2079980, 2041836, 1987403, 1917626, 1836637, 1748197, 1655850, 1564335, 1478115, 1399443]
56099A399443p0042o0170n0186m1922l4896k7366k0150j5542j2928r630n806m070
56087A046735m288l476j055M46L54R03K716L771L607M146N659O260O024P137R425
56072A088364J0290R673J0385J2849J4320J4122J4734J6779J7867J7461J8004
56061A244848K0114K1426K1212K1355K1873K0570J7980J7385J8881J8887J6597
56050A461128J5294J6040J5947J4261J4219J6963J9400K0018K1174K3669K4846
56039A662959K4140K4714K7486K9289K9039K9845L2834L4891L4848L5796L8910
56028B004751M1087M1179M2343M5735M8168M8515N0030N3727N6077N5959N7202
56017B544773O1388O4972O6366O8893P3780P7413P8585Q1209Q6687R1054R2829
$$ y = [1399443, 1329401, 1269231, 1219045, 1177123, 1142227, 1114861, 1094711, 1079169, 1066241, 1056611, 1050805, 1046735, 1042447, 1038971, 1037916, 1038362, 1038716, 1039619, 1042335, 1046106, 1049713, 1053859, 1059518, 1065778, 1071802, 1078939, 1088364, 1098654, 1108327, 1118712, 1131561, 1145881, 1160003, 1174737, 1191516, 1209383, 1226844, 1244848, 1264962, 1286388, 1307600, 1328955, 1350828, 1371398, 1389378, 1406763, 1425644, 1444531, 1461128, 1476422, 1492462, 1508409, 1522670, 1536889, 1553852, 1573252, 1593270, 1614444, 1638113, 1662959, 1687099, 1711813, 1739299, 1768588, 1797627, 1827472, 1860306, 1895197, 1930045, 1965841, 2004751, 2045838, 2087017, 2129360, 2175095, 2223263, 2271778, 2321808, 2375535, 2431612, 2487571, 2544773, 2606161, 2671133, 2737499, 2806392, 2880172, 2957585, 3036170, 3117379, 3204066, 3295120, 3387949]
56006C387949R5998J02011J06812J09134J13407J21047J27392J30955J36719J46570
55996D577994J55708J62416J71626J84719J96106K04342K16001K33611K50878
55987F353401K64945K81826L04174L25833L44562L67629L98399M30306M60700
55978I531775M96987N42078N88328O33504O87495P55127Q28580R05334R96209
55969A5965417J106413J227581J358872J515847J707652J927695K179143K485680
55961B9474300K864155L314117L850227M516114N351368O381171P658885R279359
55953G2689696J1327767J3860009J6951260K0693377K5105107L0104405L5525198
55946B26256819M0848622M4626777M4381296L7759054K4390477O737645j1058651
$$ y = [3387949, 3483947, 3585958, 3692770, 3801904, 3915311, 4036358, 4163750, 4294705, 4431424, 4577994, 4733702, 4896118, 5067744, 5252463, 5448569, 5652911, 5868912, 6102523, 6353401, 6618346, 6900172, 7204346, 7530179, 7874741, 8242370, 8640769, 9071075, 9531775, 10028762, 10570840, 11159168, 11792672, 12480167, 13235294, 14063874, 14969208, 15965417, 17071830, 18299411, 19658283, 21174130, 22881782, 24809477, 26988620, 29474300, 32338455, 35652572, 39502799, 44018913, 49370281, 55751452, 63410337, 72689696, 84017463, 97877472, 114828732, 135522109, 160627216, 190731621, 226256819, 267105441, 311732218, 356113514, 393872568, 418263045, 425000690, 413942039]
55939D13942039k5379686l4557653l8780177l9179066l7063399l3566419k9518772
55932A75896867k5436896k1611719j8206681j5285931j2824591j0762558r052759
55925F2715732p650925o495264n528230m720662m053710l496156l019070k614315
55917B5137400k279033j996893j750937j539724j364655j214774j078798r59382
55909A2953204q61383p77794p00296o32357n79161n34845m91718m52369m21305
55900G501976l93734l63692l34726l12098k92364k70487k49583k34125k20776
55891D830391k05001j89807j79214j69821j57251j44387j35096j26143j13349
55882C410322r9705q9484p9977o6682n1329l7662k4809j2058m852q608k0993l6558
$$ y = [413942039, 388562353, 354004700, 315224523, 276045457, 238982058, 205415639, 175896867, 150459971, 128848252, 110641571, 95355640, 82531049, 71768491, 62715732, 55064807, 48569543, 43041313, 38320651, 34266941, 30770785, 27751715, 25137400, 22858367, 20861474, 19110537, 17570813, 16206158, 14991384, 13912586, 12953204, 12091821, 11314027, 10613731, 9981374, 9402213, 8867368, 8375650, 7923281, 7501976, 7108242, 6744550, 6409824, 6097726, 5805362, 5534875, 5285292, 5051167, 4830391, 4625390, 4435583, 4256369, 4086548, 3929297, 3784910, 3649814, 3523671, 3410322, 3310617, 3221133, 3141156, 3074474, 3023145, 2985483, 2960674, 2948616, 2943764, 2935156, 2914163, 2877605]
55870B877605n4078p3062q8524r6384r9623j02517j03270r8735r1678q6470q1757
55859A901507p4268o5998o0929n7973n3651m8584m5193m2098l7035l2362l1566
55848A351850l2899l2329l0262k9675l0009k8647k6309k5527k5641k4432k2817
55837A043303k2992k3746k2453j9915j8712j8459j7090j5085j4199j3704j2019
55826H44929j0265j0281j0982j0525j0047j1329j2908j2516j1369j1878j3090
55815G19739j2534j0765r988r871q692p094o754o859n631l809l074k592o99J650
55801F33027K705L457N699Q291Q927Q011P217N973L014l30k174l650o748j0237
55787F63182j1605j1370j1561j1507r307o105m787n537o600q192j1523j5008j5652
$$ y = [2877605, 2823527, 2750465, 2661941, 2565557, 2465934, 2363417, 2260147, 2161412, 2069734, 1983264, 1901507, 1827239, 1761241, 1700312, 1642339, 1588688, 1540104, 1494911, 1452813, 1415778, 1383416, 1351850, 1318951, 1286622, 1256360, 1226685, 1196676, 1168029, 1141720, 1116193, 1090552, 1066120, 1043303, 1020311, 996565, 974112, 954197, 935485, 917026, 899936, 884851, 870652, 856948, 844929, 834664, 824383, 813401, 802876, 792829, 781500, 768592, 756076, 744707, 732829, 719739, 707205, 696440, 686452, 676581, 667889, 660795, 654041, 647182, 641551, 637742, 634668, 632076, 631377, 633027, 635732, 639189, 644888, 653179, 662106, 670117, 677334, 683307, 686321, 685991, 683817, 680167, 673419, 663182, 651577, 640207, 628646, 617139, 607832, 601727, 596940, 591403, 584803, 576611, 565088, 550080, 534428]
55774E34428j3616j1471r640o436j979J878N034Q628J1417J0503N707j85n297
55761E28971r585j2346j2402j0768r904j0257j0346r893r865r886q769p294p331
55748D00325q477q599p497o930p258p060o019n190m654l643k688k847l266k413
55734C23784j174j596l055l102j761j450k687l442k999k974l993m630m335m397
55720B82189n233n512m645l646k920j693r8O12L51M24J183J840K606M427O429
55705B76314O459M492K739J987O47j986m390n527o277p225p491o709n945n711
55691B41377n133l916l045k846k311j070r6J87N27J085J082P24J344L037M233
55676B35179M244M190M593M251K406Q4j599k769l607l574k702k032k031j988j576
$$ y = [534428, 520812, 509341, 499701, 493265, 491286, 493164, 498198, 506826, 518243, 528746, 534453, 534268, 528971, 519386, 507040, 494638, 483870, 473966, 463709, 453363, 443470, 433605, 423719, 414950, 407656, 400325, 391848, 383249, 375752, 368822, 361564, 354504, 348485, 343295, 338641, 334998, 332310, 329463, 326197, 323784, 322610, 321014, 317959, 314857, 313096, 311646, 308959, 305517, 302518, 299544, 295551, 290921, 286586, 282189, 276956, 271444, 266799, 263153, 260233, 258540, 258442, 259054, 259405, 259829, 261012, 262852, 265458, 269885, 276314, 282773, 287265, 290004, 291991, 292638, 290652, 286262, 280735, 274458, 267233, 259742, 253033, 247088, 241377, 236244, 232328, 229283, 226437, 224126, 223056, 222960, 223147, 223674, 224759, 225841, 226565, 227909, 230946, 235179, 239423, 243613, 248206, 252457, 254863, 254947, 253348, 250579, 246972, 243398, 240696, 238664, 236633, 234645, 233069]
55661B33069j394j511j069R9J057J443J927K625K838K736L451M948N624M692L237
55646B63772K302J575O21k82j186k672m461n372n273n426o348p064o958o723o754
55631B09751o344n212m231l900l555k733j892j277n92j83r12k334k755j689n73
55616A71569m66p93r46j316j963k010j265q14j175j468j127q21q43m09O33J015
55600A57801O7j056j150o42n51j094k013l020l275j945J44R71O8r21r75j031j757
55583A39621k062j109N5J93l04o22r04j266r55J74Q07J69n81k52N09O96Q00J590
55565A36559K244J514j46j206j183p92o44q79j487k037j804r45n93j109j385p33
55549A25374q9l40p97n34J2K2j89J8L86N43R50J827K226J492N90P01J470J945
$$ y = [233069, 231675, 230164, 229095, 229194, 230251, 231694, 233621, 236246, 239084, 241820, 245271, 250219, 255843, 260535, 263772, 266074, 267649, 268270, 267988, 266802, 264130, 259669, 254297, 249024, 243598, 237250, 230186, 223228, 216505, 209751, 203407, 198195, 193964, 190064, 186509, 183776, 181884, 180607, 180015, 179832, 178920, 176586, 173831, 172142, 171569, 171103, 170310, 169364, 168048, 166085, 164075, 162810, 161996, 160821, 159353, 158226, 157405, 156562, 156153, 156786, 157801, 157868, 156812, 155662, 155020, 154469, 153375, 151362, 148342, 145067, 143122, 143266, 144237, 144305, 143384, 142409, 141378, 139621, 137559, 136450, 136505, 136698, 136394, 135772, 134868, 133602, 132647, 132821, 133628, 133797, 133216, 132964, 133473, 134169, 134969, 136559, 138803, 140317, 140171, 138965, 137782, 136990, 136346, 135467, 133980, 131943, 130139, 129194, 128601, 127492, 126107, 125374, 125285, 124945, 124148, 123614, 123626, 123648, 123459, 123477, 123863, 124406, 125356, 127183, 129409, 130901, 131491, 132192, 133662, 135607]
55531A35607K147K337J886M41q05o32J92K4j236k382k838k790k074o31M90K66
55515A30002n55m22O20J051K08j024j778k104k261k288k375k710k999k857k439
55500A08069j992j267k15L32k69j238j360p27m05o84q77n48Q8Q78J783K415K412
55483A06395K040J720J290M74l38o25n51m68j42O18J226J172R66J183J219K52
55467A16431j148j659j110m87l72n58q81j254j173l76K74j62j123j250m01L34
55451A05085M42L84K73l25j146j170j89P90J062J033J095Q53L3o88n14L51R45
55434A08314O47k90j092j202p69l96l04j21L62P34O98O35Q93J060O87J33j14l52
55416A09523r27j149j40J604K697K790K748L027L000K129P34o03j592k022j777
$$ y = [135607, 137754, 140091, 141977, 142418, 141613, 140981, 141173, 141197, 139961, 137579, 134741, 131951, 129877, 129246, 129736, 130002, 129447, 129025, 129645, 130696, 130904, 129880, 128102, 125998, 123737, 121449, 119074, 116364, 113365, 110508, 108069, 106077, 104810, 104595, 104927, 104658, 103420, 102060, 101333, 100928, 100244, 99367, 98819, 98907, 99785, 101568, 103983, 106395, 108435, 110155, 111445, 111919, 111581, 110956, 110405, 109937, 109795, 110413, 111639, 112811, 113777, 114960, 116179, 116431, 115283, 113624, 112514, 112027, 111655, 111097, 110216, 108962, 107789, 107413, 107687, 107525, 106402, 105152, 104751, 105085, 105527, 105911, 106184, 105859, 104713, 103543, 103354, 104144, 105206, 106239, 107334, 108187, 108220, 107532, 107018, 107369, 108314, 108961, 108671, 107579, 106377, 105608, 105212, 104908, 104787, 105149, 105883, 106581, 107216, 108109, 109169, 109856, 109989, 109875, 109523, 108596, 107447, 107307, 108911, 111608, 114398, 117146, 120173, 123173, 125302, 126036, 125433, 123841, 121819, 120042]
55401A20042j197q25p30o98q71j435j818j226N4Q03M55l28p66q31p84o30l50n2
55383A08813L43R61J462J230K44p66j197j133r15o96n04l79l33m15p66j277j420
55366A03252q87j69j0m56r16j016q66o36l86j45J81P63J357J337O76L25R12J633
55348A04949J326J95n07k32M05P84Q70O50k2r29j501j525j245p92j45M31N28J83
55330A03423j80k91j66J01K77J20j22J82R55J187M00n07o95p08j277j742j153
55313I9804j41j0n15l88K74J30q26r43L76J568J275K68nN35J014J066R41Q07P07
55294A05937O99N64k0p64r23m34n6j31j33K73O56P29Q51J139J028K93m25o54q27
55275A07802j312j590j186o01n08n77PJ251K303K414J518J41q42p97p8K74j02
$$ y = [120042, 118845, 118020, 117290, 116592, 115721, 114286, 112468, 111242, 111296, 112099, 112554, 112226, 111460, 110629, 109845, 109215, 108865, 108813, 109156, 110117, 111579, 112809, 113053, 112287, 111090, 109957, 109042, 108346, 107842, 107463, 107130, 106715, 105949, 104672, 103252, 102365, 102196, 102186, 101730, 100814, 99798, 98932, 98296, 97910, 97765, 97946, 98709, 100066, 101403, 102079, 102404, 103316, 104949, 106275, 106470, 105963, 105731, 106136, 106920, 107790, 108440, 108418, 107489, 105988, 104463, 103218, 102426, 102281, 102712, 103240, 103423, 103243, 102952, 102786, 102887, 103164, 103284, 103162, 103344, 104299, 105486, 105886, 105379, 104684, 103976, 102699, 100957, 99804, 99663, 99653, 99138, 98750, 99024, 99154, 98328, 97385, 97761, 99329, 100604, 100872, 100867, 101402, 102416, 103482, 104423, 105230, 105937, 106636, 107200, 107180, 106416, 105493, 105059, 105003, 104872, 104739, 105012, 105668, 106397, 107248, 108387, 109415, 109708, 109283, 108629, 107802, 106490, 104900, 103714, 103113, 102605, 102028, 102035, 103286, 105589, 108003, 109521, 109662, 108820, 108023, 107945, 108219, 108117]
55258A08117m07P7Q66J051N69Q4o6j28k87l61j20L72P52N91j62r76j252r84n96
55239A07140k46J58M08J70l06m39l31o66j396j535n94O58J302J353J174O93j56
55222A07387q51q49k86L24O72N89K0n76n03P4J32o13r80OJ600K400K283K112K095
55203A15036J622O28q2l9K72K43j15m68o56o50m47j63om4k02m12o45q03q41q24
55183A11404p05k58M66Q74M32n91j358j379q40j50M99J023J232R69M36J62M86
55166A12702J083J222O62k1k50k40m62o35p3J022J498P83l49r00q30o10l18J30
55148A14414L22j95r84j066k51N46N33L7j16J56J09o23j285r22K51R95O51j07
55130A12465m18l75m52m86j14K64J1n21m16K58N04P9j31K84N53P7n86p86p82r24
$$ y = [108117, 107710, 107787, 108653, 109704, 110273, 110357, 110291, 110163, 109876, 109515, 109395, 109767, 110519, 111110, 110948, 109972, 108720, 107736, 107140, 106894, 107052, 107460, 107630, 107324, 106885, 106554, 105888, 104492, 102957, 102363, 103021, 104323, 105676, 106850, 107543, 107387, 106536, 105687, 105401, 105725, 106397, 106986, 107006, 106430, 105927, 106001, 106133, 105520, 104540, 104546, 106146, 108546, 110829, 112941, 115036, 116658, 117286, 117204, 117165, 117437, 117680, 117565, 117097, 116441, 115791, 115344, 115181, 115175, 115131, 114929, 114517, 113872, 113069, 112228, 111404, 110699, 110441, 110907, 111781, 112213, 111622, 110264, 108885, 108045, 107895, 108394, 109417, 110649, 111618, 112054, 112216, 112702, 113785, 115007, 115669, 115648, 115398, 115158, 114696, 114061, 113988, 115010, 116508, 117291, 116942, 116042, 115212, 114602, 114284, 114414, 114736, 114541, 113557, 112491, 112240, 112786, 113319, 113356, 113240, 113396, 113505, 112882, 111597, 110675, 110926, 111921, 112572, 112465, 112047, 111672, 111220, 110734, 110620, 110884, 110895, 110374, 109958, 110216, 110720, 110799, 110668, 110952, 111505, 111582, 110996, 110210, 109428, 108504]
55110A08504q01n9O94P82O57J165K082K382J764R94O87O38L90m1k36J32Q83J392
55092A22009J220P75Q55J417J440L91q54j170o45j73n8J38N54P30L56k80p02o83
55074A25320k90J73L09K8k93k99j45k30n52p06l98K55Q72J134J042Q39N93mj004
55055A26644j654j180j00K18o00j376j113k93R0l9j52j49k73m69n58o23o34k14
55037A17525N95R68M27k91l07P7R3n2M06J248J441P48Q6J37N10N03n8q49j323
55018A21884r58J18R00O05j67j70O51J074M41l62k54N98J184R89L28l67r58j401
55000A24135j448q28L28J356J616J170O60M51L86M08P59J281J218L36m88m83j47
54983A30710l46q25p02k6L18Q2j49j28j77k05K90J051J090K67k73K18R44P85j50
$$ y = [108504, 107703, 107644, 108338, 109120, 109777, 110942, 113024, 115406, 117170, 118164, 118851, 119489, 119879, 119838, 119602, 119734, 120617, 122009, 123229, 124004, 124859, 126276, 127716, 128107, 127253, 126083, 125438, 125265, 125207, 125345, 125899, 126629, 126985, 126705, 126003, 125320, 125030, 125203, 125512, 125540, 125247, 124948, 124803, 124573, 124021, 123315, 122917, 123172, 124044, 125178, 126220, 127059, 127652, 127648, 126644, 124990, 123810, 123710, 123928, 123328, 121952, 120839, 120546, 120636, 120597, 120445, 120296, 120023, 119554, 118996, 118373, 117739, 117525, 118120, 119088, 119515, 119224, 118917, 118994, 119087, 119035, 119441, 120689, 122130, 122878, 122964, 123101, 123611, 124114, 124056, 123207, 121884, 120926, 121044, 121944, 122549, 122382, 122212, 122863, 123937, 124378, 124016, 123762, 124360, 125544, 126533, 126861, 126494, 125536, 124135, 122687, 121859, 122187, 123543, 125159, 126329, 126989, 127440, 127826, 128234, 128993, 130274, 131492, 131828, 131340, 130857, 130710, 130364, 129539, 128837, 128811, 129129, 129211, 129062, 128934, 128757, 128552, 128842, 129893, 130983, 131250, 130977, 131195, 132139, 132924, 132774]
54964A32774r06r84n55J34Q80J344J353J161J008P40K37r3J66P35R55O66K24j15
54946A39724l82m62q6O38J110R78O01N35O82M40l87j205j366q83j00R51K257L134
54928A46179K706J205P1L09J450K544L502M750O156P188P904Q867J0134J0975
54914B13940J0710R252O835L749M21k655n219p175q379q830q837q657q135p142
54900A79878o021n120m244l121k109j711j704j577j483j891k467k345j510q32
54886A43743o23j66R97K268K962L230L564M043M546N209O156P206Q136Q891R306
54871B09468R087Q220O954N229K705m64l531n965p793q945r032q130p075o482
54857A84246o068n379m594m100l788l366k929k718k653k548k503k588k457j787
$$ y = [132774, 131868, 130884, 130329, 130463, 131343, 132687, 134040, 135201, 136209, 136949, 137186, 137093, 137259, 137994, 138949, 139615, 139839, 139724, 139342, 138880, 138794, 139432, 140542, 141520, 142121, 142656, 143338, 143778, 143391, 142186, 140820, 139937, 139837, 140788, 143045, 146179, 148885, 150090, 150161, 150470, 151920, 154464, 157966, 162716, 168872, 176060, 183964, 192831, 202965, 213940, 224650, 233902, 240737, 244486, 244907, 242252, 237033, 229858, 221479, 212649, 203812, 195155, 187020, 179878, 173857, 168737, 164493, 161372, 159263, 157552, 155848, 154271, 152788, 150897, 148430, 146085, 144575, 143743, 143120, 142954, 143951, 146219, 149181, 152411, 155975, 160018, 164564, 169773, 175929, 183135, 191271, 200162, 209468, 218555, 226775, 233729, 238958, 241663, 241199, 237668, 231703, 223910, 214965, 205933, 197803, 190728, 184246, 178178, 172799, 168205, 164105, 160317, 156951, 154022, 151304, 148651, 146103, 143600, 141012, 138555, 136768]
54843A36768q30j66n6l28o61p06k72L48N20O2m74n15j17L80Q74J306J379Q92J08
54824A38512n45q78q04k28N60Q35K63n70q74o04k71j18k6jk18n99p55l62N08J339
54804A35164J443O44k05K9J274K115J518J26p36p11l82q0L68Q86J090R52Q29P83
54786A45107N16K1l27l65k56L3P04J481J653J015K19n6K30Q98J941L112L682L295
54768A62903K744L176M660O217P240Q151R435J0636J0839R785P966N816L338N83
54754B53489k050m194n863p191q102q443q282p857p357o836o139m919l077j336
54740A71843p97j624k591k450j368m31j23oK80N61O66P36Q35R22J233K122L403
54723A73211M453N109N810O794P800Q657R332R299P778N041K532J096j33k386
$$ y = [136768, 135938, 135772, 135716, 135388, 134727, 134021, 133749, 134097, 134617, 134679, 134205, 133690, 133573, 133953, 134827, 136133, 137512, 138404, 138512, 137967, 137089, 136285, 136057, 136617, 137452, 137715, 137145, 136271, 135667, 135396, 135278, 135252, 135251, 135033, 134434, 133679, 133317, 133825, 135164, 136607, 137251, 137046, 137075, 138349, 140464, 141982, 142108, 141372, 140661, 140279, 140199, 140567, 141453, 142543, 143495, 144324, 145107, 145623, 145644, 145317, 144952, 144696, 144729, 145433, 146914, 148567, 149582, 149801, 149745, 149975, 150873, 152814, 155926, 159608, 162903, 165647, 168823, 173483, 179700, 186940, 195091, 204526, 215162, 226001, 235786, 243752, 249568, 252906, 253489, 251439, 247245, 241382, 234191, 226089, 217646, 209364, 201507, 194150, 187314, 181175, 176256, 173179, 171843, 171046, 169422, 166831, 164381, 163013, 162582, 162459, 162453, 162733, 163294, 163960, 164696, 165531, 166453, 167686, 169808, 173211, 177664, 182773, 188583, 195377, 203177, 211834, 221166, 230465, 238243, 243284, 245816, 246912, 246779, 244393]
54709B44393n504q294j0061j0854j0647r359p502o003n184m627l942l188k527
54696A56701k004j660j404r03o6N17J98p70j518j693j682j669j275l84L57L55
54680A43100q1k26KJ0n08j051r44j83O02R84J172J484J622R45n43j865k039j143
54662A41338j06M15O08R82J566J803J238J36p63j091j243j645j940j406o3J190
54646A41019J672J527J105L70p05j684k082j885j288l61O57J197J064Q99J300
54631A42805J833J583M99n29q46o31l36j79k78o58r46o46J11N56K72k47l20M2
54613A42085L20K77J57K19L80M11K47qk81n97q53o95J08J151J587R94q7p26n62
54594A44127N4O22Q90P86L55j47m11m32n11q09j013o86J26P66O27j33p73q86q16
$$ y = [244393, 238889, 230595, 220534, 209680, 199033, 189674, 182172, 176169, 170985, 166358, 162416, 159228, 156701, 154697, 153037, 151633, 150730, 150664, 151181, 151379, 150609, 149091, 147398, 145716, 144047, 142772, 142388, 142745, 143100, 143019, 142793, 142795, 142805, 142297, 141246, 140302, 140119, 140721, 141705, 142877, 144361, 145983, 146928, 146385, 144520, 142481, 141338, 141232, 141647, 142255, 143237, 144803, 146606, 147844, 147980, 147217, 146126, 144883, 143238, 141298, 139892, 139829, 141019, 142691, 144218, 145323, 145693, 144988, 143304, 141222, 139337, 138049, 137688, 138345, 139542, 140606, 141505, 142805, 144638, 146221, 146720, 146191, 145345, 144714, 144378, 144199, 143921, 143263, 142317, 141671, 141782, 142338, 142610, 142363, 142043, 142085, 142405, 142682, 142839, 143058, 143438, 143849, 144096, 144088, 143807, 143210, 142357, 141662, 141770, 142921, 144508, 145502, 145415, 144689, 144127, 144181, 144803, 145693, 146479, 146834, 146687, 146276, 145844, 145333, 144524, 143511, 142825, 142951, 143717, 144344, 144211, 143438, 142552, 141736]
54575A41736r14q05L6J216J695J206N60L76K80j58n30l28Kl51j206j506q08J33
54557A40634L93j8l36K2Q92J546J377N20k73m73k35L2K25L85M10L02M59J133J876
54538A48871K016J529J025R17J117J344J345R00J16m85n40m04o04r98j033o65
54522A54451k99N1Q02J855K361J749M16p96j385j254n98M5P2n10r98r14n90n42
54504A53916o47m14J48M85K86o0l1L54O82Q06R74J205J042K42n23l51N54R47J49
54485A59764j076j660j583j479j407q49K18J103J296J048Q96J038J265J242Q48
54470A60664M28N09J069J425J132N93L34J68k98p80p66n33p75j360j432p89k04
54453A59385j62j88K81J045J486J219J55j408k581k442j138J41N73N15O27Q41
$$ y = [141736, 140822, 140017, 140053, 141269, 142964, 144170, 144730, 145106, 145386, 145228, 144698, 144370, 144372, 144021, 142815, 141309, 140501, 140634, 141027, 141009, 140673, 140695, 141587, 143133, 144510, 145030, 144757, 144284, 144049, 144081, 144306, 144691, 145101, 145403, 145862, 146995, 148871, 150887, 152416, 153441, 154358, 155475, 156819, 158164, 159064, 159180, 158695, 158155, 157751, 157147, 156149, 155116, 154451, 154152, 154203, 155005, 156860, 159221, 160970, 161386, 160590, 159205, 157951, 157353, 157398, 157470, 156960, 155962, 155048, 154458, 153916, 153269, 152855, 153003, 153488, 153774, 153714, 153683, 154037, 154719, 155525, 156499, 157704, 158746, 158988, 158465, 158114, 158668, 159615, 159764, 158688, 157028, 155445, 153966, 152559, 151710, 151928, 153031, 154327, 155375, 156271, 157309, 158574, 159816, 160664, 161092, 161601, 162670, 164095, 165227, 165820, 166154, 166322, 166024, 165244, 164478, 163945, 163170, 161810, 160378, 159589, 159385, 159223, 159035, 159316, 160361, 161847, 163066, 163221, 161813, 159232, 156790, 155652, 155793, 156366, 156881, 157508, 158349]
54437A58349O53l4q36j370j439j029l73K61R10J699K259K003J085M42N53Q34O13
54420A64580P4k40l11m40o09o02m62k58K21R72J310N83p46j373o11Q33J655J280
54402A65856K26n41m90J82R98J695K172K180J526N86R2K93P25R72J157J450J594
54385A80673J312Q03L92k8p09j468j817j623j204q38m94r3K25K74N7j82k09o7
54367A75004oj15j73l1N6j56l97k03L19O51O96Q59J148R71J02p07n82L58J220
54348A79014J357Q22mp71j320j687k009k254k178j603o00N28J272J103J37o31
54332A71176l29N59P11j84r12l35J255K756L576L767L491L054L041L749M633M785
54316B04793L819K015o7j800k700k783k551k386k317k460l062l845m012l327k576
$$ y = [158349, 159002, 158968, 158132, 156762, 155323, 154294, 153921, 154182, 155092, 156791, 159050, 161053, 162138, 162580, 163133, 163967, 164580, 164654, 164414, 164103, 163663, 163054, 162452, 161990, 161732, 161953, 162925, 164235, 164818, 164072, 162699, 162088, 162921, 164576, 165856, 166082, 165541, 165051, 165233, 166231, 167926, 170098, 172278, 173804, 174390, 174482, 174775, 175500, 176472, 177629, 179079, 180673, 181985, 182788, 183180, 183152, 182443, 180975, 179158, 177535, 176331, 175493, 174999, 174906, 175131, 175405, 175462, 175280, 175071, 175004, 174998, 174883, 174710, 174679, 174735, 174579, 174182, 173979, 174298, 174949, 175645, 176504, 177652, 178623, 178725, 178018, 177436, 177794, 179014, 180371, 181193, 181189, 180418, 179098, 177411, 175402, 173148, 170970, 169367, 168767, 169295, 170567, 171670, 171807, 171176, 170847, 171406, 172117, 171933, 171021, 170686, 171941, 174697, 178273, 182040, 185531, 188585, 191626, 195375, 200008, 204793, 208612, 210627, 210560, 208760, 206060, 203277, 200726, 198340, 196023, 193563, 190501, 186656, 182644, 179317, 176741]
54301A76741k425k438j883q83o9L43M31j0r84j682j262n8Q33R61O93K85l13p78
54283A67502n92J05O72J045J706K433K100K46j989l030k481j158K0O07N43R0k38
54266A67581j51O1p7m74m91K33J188J477Q43k3k99Q3O07R60J174J137O33j6o1
54247A74385N65R21K97p87j419j526j538j343n02O98J332J041M19R8J11K05K43
54230A73200J38j72n41p50q05q14o83l09Q2K59L88O59P21J04r28j629j699j404
54212A65817q84j74K71q1q41r14M8J111J258M86m69r64p03J48R00R20M51L27P37
54193A67444J000P71N78Q35J115R29N52M16L45K9k29p4J15k71j006j342j130q61
54175A69216o35J7J105J768J313J80n67m26J83N67M55O1k62l84n03r19j619k125
$$ y = [176741, 174316, 171878, 169995, 169112, 169043, 169386, 169817, 169807, 168823, 167141, 165879, 165821, 166654, 167615, 168308, 168593, 168280, 167502, 166910, 167015, 167687, 168732, 170438, 172871, 174971, 175217, 173228, 170198, 167717, 166559, 166579, 167186, 167729, 167819, 167581, 167430, 167491, 167414, 166940, 166449, 166682, 167870, 169347, 170190, 170167, 169868, 169951, 170558, 171518, 172692, 173829, 174462, 174446, 174385, 174950, 175871, 176168, 175381, 173962, 172436, 170898, 169555, 169053, 169751, 171083, 172124, 172543, 172641, 172752, 172957, 173200, 173338, 173166, 172625, 171875, 171070, 170256, 169573, 169264, 169346, 169605, 169993, 170652, 171373, 171477, 170549, 168920, 167221, 165817, 164933, 164759, 165030, 164949, 164108, 163194, 163242, 164353, 165611, 166097, 165628, 164664, 163961, 164109, 165009, 165929, 166380, 166707, 167444, 168444, 169215, 169793, 170628, 171743, 172672, 173224, 173640, 173985, 174014, 173785, 173711, 173826, 173555, 172549, 171207, 170077, 169216, 168581, 168598, 169703, 171471, 172784, 172964, 172397, 171971, 172154, 172721, 173176, 173237, 172975, 172591, 172088, 171169, 169550, 167425]
54157A67425j835o40Q89J933K110J708J229R05O56L76R4j30k91m23n79p33p37
54140A71957m43O2N02P37Q26P24K55m83r83r29n88l60k02J06M95Q32J248J742
54122A75498J754Q00o09j370j100m02J16M22N97N42L41L16N16O23N62O49R66J165
54104A81386J044Q12N59N1o70j129j134j109j272j165m75K36K77j02j11L82P81
54087A78361P87P69J020J181P19l26j262j344l89J053K077K081J182M4o54o51
54071A84648k13J56K49L29P03J249J614J701J609J253N08l26p78q93j082j248
54055A89479p85K95J017P03l8j84M07J124J640K053K282K169K134K902M390N510
54039B15098N398M444L774L950M572N032N251N534N941O119N855N510N662O329
$$ y = [167425, 165590, 164950, 165839, 167772, 169882, 171590, 172819, 173724, 174380, 174756, 174850, 174720, 174429, 174006, 173427, 172694, 171957, 171514, 171576, 172078, 172815, 173641, 174365, 174620, 174137, 173154, 172225, 171637, 171277, 171075, 171181, 171676, 172508, 173756, 175498, 177252, 178052, 177443, 176073, 174973, 174571, 174687, 175109, 175706, 176248, 176589, 176905, 177421, 178044, 178606, 179255, 180221, 181386, 182430, 183242, 183801, 183852, 183182, 182053, 180919, 179810, 178538, 177373, 176898, 177134, 177411, 177309, 177198, 177580, 178361, 179148, 179917, 180937, 182118, 182837, 182511, 181249, 179905, 179516, 180569, 182646, 184727, 185909, 185953, 185299, 184648, 184435, 184591, 184840, 185169, 185872, 187121, 188735, 190436, 192045, 193298, 193806, 193480, 192702, 191809, 190727, 189479, 188694, 188989, 190006, 190709, 190671, 190487, 190894, 192018, 193658, 195711, 197993, 200162, 202296, 205198, 209588, 215098, 220496, 224940, 228714, 232664, 237236, 242268, 247519, 253053, 258994, 265113, 270968, 276478, 282140, 288469]
54025B88469O818O484N381M129L230K638J963J056K98K03P09J187J284J322J608
54010C26779J796J509J168J461K169K493K554L646O526J0136J2403J1867Q420
53997C92927L037k745p587j1012j3199j4227j4042j3088j2157j1446j0463r089
53985B76909p839o885n712m242l202k912k705k234k268l190l821l002j552j144
53971B26201j809k101j453p69o88p80p22q69j202r68K7P87M80l44n72J02J143
53954B16463K012K477K479K206J962J765J333P24M49P33J208J590K114K886L461
53939B43862L509L426L717M144M156L791L571L651L681L503L353L392L441L328
53925B94525L157L167L505M176M958N406N209M698M626N304O133O272N749N542
$$ y = [288469, 295287, 301771, 307152, 311281, 314511, 317149, 319112, 320168, 320466, 320669, 321378, 322565, 323849, 325171, 326779, 328575, 330084, 331252, 332713, 334882, 337375, 339929, 343575, 350101, 360237, 372640, 384507, 392927, 395964, 393219, 385632, 374620, 361421, 347194, 333152, 320064, 307907, 296461, 285998, 276909, 269070, 262185, 256473, 252231, 249029, 246117, 243412, 241178, 238910, 235720, 231899, 228897, 227345, 226201, 224392, 222291, 220838, 220069, 219381, 218601, 217879, 217010, 215808, 214840, 214867, 215654, 216134, 215790, 215218, 215320, 216463, 218475, 220952, 223431, 225637, 227599, 229364, 230697, 231421, 231870, 232603, 233811, 235401, 237515, 240401, 243862, 247371, 250797, 254514, 258658, 262814, 266605, 270176, 273827, 277508, 281011, 284364, 287756, 291197, 294525, 297682, 300849, 304354, 308530, 313488, 318894, 324103, 328801, 333427, 338731, 344864, 351136, 356885, 362427]
53911C62427O431P997R080R138Q755Q642Q610P875O165M017K038L78j073k362
53897D38118l512m405m603l720k231j440k159l737m857n087n149n777o847p766
53883C76828q188q127p717p253p115p257o960n613l666k335k141k371k247k059
53869C03779k504l311l393k424j378j229j777k274k528k753k811k388j793j731
53855B71485k216k415j869j230j313j853j790o27J042K467L627M905O263P422
53841B83898Q706J1008J4620J8688K2221K4894K6143K4168J7339O755l951j1799
53829D42690j6528j9117j9705j8116j5334j2802j0604p859m811l029l245m339
53817C07201m897m743m353l773l003k664l282m301m589l752k315q08N82J649K151
$$ y = [362427, 368858, 376855, 385935, 395073, 403828, 412470, 421080, 428955, 435120, 439137, 441175, 441553, 440480, 438118, 434606, 430201, 425598, 421878, 419647, 418207, 416048, 412311, 407454, 402367, 397218, 391441, 384594, 376828, 368640, 360513, 352796, 345543, 338428, 331171, 324211, 318598, 314932, 312597, 310456, 308085, 305838, 303779, 301275, 297964, 294571, 292147, 290769, 289540, 287763, 285489, 282961, 280208, 277397, 275009, 273216, 271485, 269269, 266854, 264985, 263755, 262442, 260589, 258799, 258172, 259214, 261681, 265308, 270213, 276476, 283898, 292604, 303612, 318232, 336920, 359141, 384035, 410178, 434346, 451685, 458440, 454489, 442690, 426162, 407045, 387340, 369224, 353890, 341088, 330484, 322625, 317814, 314785, 311540, 307201, 302304, 297561, 293208, 289435, 286432, 283768, 280486, 276185, 271596, 267844, 265529, 264721, 265303, 266952, 269103]
53802B69103K314K739L631M535M960M940M683M136L252K470K388K899L196K799
53788C18045K258K347K911K996K091O87m72j162j466j383j042r12j329k068k745
53773C18756l382m115m692m739m375m066m000m072m241m501m631m490m258m014
53759B59180l338k011p41m34r33j276j078p57m91JN58M92k57q45p72n19n32m71
53741B45776m2K87Q3k63k67k67p74j446j540j035n25k68n0K33N64J111J927K466
53723B45970K100J030O5l82m82l15K40R88J432J481J514J701J775J625J517J557
53707B61816J428R51M72M39Q27J304J664J925K183K536L018L471L625L429L131
53692B92219K943K783K449J933J448J200J167J121Q21K47l94r12j234j312j143
$$ y = [269103, 271417, 274156, 277787, 282322, 287282, 292222, 296905, 301041, 304293, 306763, 309151, 312050, 315246, 318045, 320303, 322650, 325561, 328557, 330648, 331335, 330863, 329701, 328235, 326852, 325810, 324898, 323569, 321501, 318756, 315374, 311259, 306567, 301828, 297453, 293387, 289387, 285315, 281074, 276573, 271942, 267452, 263194, 259180, 255842, 253831, 253090, 252656, 251723, 250447, 249369, 248612, 248121, 248122, 248680, 249172, 248915, 248070, 247298, 246779, 246247, 245776, 245734, 246021, 246104, 245841, 245574, 245307, 244533, 243087, 241547, 240512, 239987, 239719, 239669, 239902, 240466, 241577, 243504, 245970, 248070, 249100, 249165, 248783, 248301, 247986, 248226, 249214, 250646, 252127, 253641, 255342, 257117, 258742, 260259, 261816, 263244, 264195, 264667, 265106, 265933, 267237, 268901, 270826, 273009, 275545, 278563, 282034, 285659, 289088, 292219, 295162, 297945, 300394, 302327, 303775, 304975, 306142, 307263, 308084, 308331, 307937, 307025, 305791, 304479, 303336]
53677C03336r22r07r73o35K10Q54N41n37j431j499r27k38J42l6p29j379j332o47
53659B92891r5j96o47r06q83p94p13p18j042j654j963j494o96m12o51n64K30J009
53641B80702J037O63P40J335J717J535J209J037O88o6o08j29J269K620L220L216
53625C00185L092K992K743K225J539R62Q43J305K060K706L237L899M529M489L630
53610C40436K788K856L577L938L612L307L476L548K960K305K551L380L357J970
53596C84061N32M13J242J635J227Q72J053J175O62k12r73j618k202k402k099j733
53580C81633j610j379q20m46o56r15o89n67j354k456k487j348m22n77j168j304
53564C63435r72m51K95J065J176M49k77k13L77R12J423K126K611K366J734J488
$$ y = [303336, 302414, 301507, 300534, 299899, 300109, 300963, 301504, 300967, 299536, 298037, 297110, 296872, 297014, 296978, 296249, 294870, 293538, 292891, 292796, 292600, 291953, 291047, 290164, 289370, 288657, 287939, 286897, 285243, 283280, 281786, 281090, 280678, 280027, 279463, 279693, 280702, 281739, 282402, 283142, 284477, 286194, 287729, 288938, 289975, 290663, 290597, 289989, 289860, 291129, 293749, 296969, 300185, 303277, 306269, 309012, 311237, 312776, 313738, 314581, 315886, 317946, 320652, 323889, 327788, 332317, 336806, 340436, 343224, 346080, 349657, 353595, 357207, 360514, 363990, 367538, 370498, 372803, 375354, 378734, 382091, 384061, 384593, 385006, 386248, 387883, 389110, 389982, 391035, 392210, 392872, 392660, 391687, 390069, 387867, 385465, 383366, 381633, 380023, 378644, 377824, 377378, 376722, 375807, 375118, 374551, 373197, 370741, 368254, 366906, 366484, 365907, 364739, 363435, 362463, 362012, 362307, 363372, 364548, 364997, 364720, 364507, 364884, 365796, 367219, 369345, 371956, 374322, 376056, 377544]
53548C77544J809K274K702L283M006M504M516M074L336K524J903J583J465J528
53534D17051J829K160K176K137K871M651O667Q118R135J0124J0823J0832J0521
53521D99095J0636J1265J2019J2815J3741J4446J4616J4772J5734J7447J9142
53510F55728K0545K1971K3431K4558K5409K6370K7206K7227K6485K5866K5725
53499I30521K5400K4392K3092K1968K0846J9575J8622J8403J8629J8869J9203
53488A159520J9800K0326K0333J9891J9292J8516J7479J6515J6083J6247J6819
53477A360821J7623J8196J7595J5257J1880Q888P008N842M674L159J211j286m293
53464A466575p510j0590j3321j5481j6764j7055j6689j6250j6175j6638j7733
$$ y = [377544, 379353, 381627, 384329, 387612, 391618, 396122, 400638, 404712, 408048, 410572, 412475, 414058, 415523, 417051, 418880, 421040, 423216, 425353, 428224, 432875, 439542, 447660, 456795, 466919, 477742, 488574, 499095, 509731, 520996, 533015, 545830, 559571, 574017, 588633, 603405, 619139, 636586, 655728, 676273, 698244, 721675, 746233, 771642, 798012, 825218, 852445, 878930, 904796, 930521, 955921, 980313, 1003405, 1025373, 1046219, 1065794, 1084416, 1102819, 1121448, 1140317, 1159520, 1179320, 1199646, 1219979, 1239870, 1259162, 1277678, 1295157, 1311672, 1327755, 1344002, 1360821, 1378444, 1396640, 1414235, 1429492, 1441372, 1450260, 1457268, 1463110, 1467784, 1470943, 1472154, 1470868, 1466575, 1459065, 1448475, 1435154, 1419673, 1402909, 1385854, 1369165, 1352915, 1336740, 1320102, 1302369]
53453A302369j9506k1654k3399k4037k3641k2978k2544k2091k1303k0525k0294
53442A060397k0319j9633j7827j5534j3515j1784r969q112o634n738n221m861
53430I21250m548l991k662l18K472M666N780O426P551R252J0804J1867J3058J4909
53416I96516J6904J8199J8941K0061K1845K3657K5142K6850K9240L1745L3406
53405A262506L4086L4586L5727L7649L9917M2024M3902M5903M8252N0630N2590
53394A727772N4221N5830N7119N7396N6808N6532N7298N8319N8246N6780N4744
53383B351065N2865N1094M9017M6414M3425M0443L7747L5048L1579K6989K1890
53372B787576J7241J3345R700N647Q43m734j0885j7382k4278l1805l9658m6724
$$ y = [1302369, 1282863, 1261209, 1237810, 1213773, 1190132, 1167154, 1144610, 1122519, 1101216, 1080691, 1060397, 1040078, 1020445, 1002618, 987084, 973569, 961785, 951816, 943704, 937070, 931332, 926111, 921250, 916702, 912711, 910049, 909731, 912203, 916869, 922649, 929075, 936626, 945878, 956682, 968549, 981607, 996516, 1013420, 1031619, 1050560, 1070621, 1092466, 1116123, 1141265, 1168115, 1197355, 1229100, 1262506, 1296592, 1331178, 1366905, 1404554, 1444471, 1486495, 1530397, 1576300, 1624552, 1675182, 1727772, 1781993, 1837823, 1894942, 1952338, 2009146, 2065678, 2122976, 2181295, 2239541, 2296321, 2351065, 2403930, 2455024, 2504041, 2550455, 2593880, 2634323, 2672070, 2707118, 2738697, 2765686, 2787576, 2804817, 2818162, 2827862, 2833509, 2834352, 2829618, 2818733, 2801351, 2777073, 2745268, 2705610, 2658886]
53360B658886n1953n5340n7599n9082n9563n9037n8123n7385n6690n5474n3488
53349B035152n1059m8759m6960m5665m4729m4198m4307m5108m6162m6735m6263
53338A525207m4606m2050l9143l6372l3853l1398k8987k6851k5022k3077k0623
53327A173225j7923j5749j4708j4813j5485j5827j5121j3423j1580j0419r943
53316A018234r515q601p174n570m235l376k606j168J173L688N511O680P854R212
53302A010107J0310J1047J2096J4058J6732J9416K1633K3208K4044K4296K4556
53291A211503K5434K6912K8404K9480L0194L0648L0484K9170K6751K4004K1733
53280A514717K0025J8399J6521J4479J2322R707O210J926k473o147q561r792j0608
$$ y = [2658886, 2606933, 2551593, 2493994, 2434912, 2375349, 2316312, 2258189, 2200804, 2144114, 2088640, 2035152, 1984093, 1935334, 1888374, 1842709, 1797980, 1753782, 1709475, 1664367, 1618205, 1571470, 1525207, 1480601, 1438551, 1399408, 1363036, 1329183, 1297785, 1268798, 1241947, 1216925, 1193848, 1173225, 1155302, 1139553, 1124845, 1110032, 1094547, 1078720, 1063599, 1050176, 1038596, 1028177, 1018234, 1008719, 1000118, 992944, 987374, 983139, 979763, 977157, 975989, 977162, 980850, 986361, 993041, 1000895, 1010107, 1020417, 1031464, 1043560, 1057618, 1074350, 1093766, 1115399, 1138607, 1162651, 1186947, 1211503, 1236937, 1263849, 1292253, 1321733, 1351927, 1382575, 1413059, 1442229, 1468980, 1492984, 1514717, 1534742, 1553141, 1569662, 1584141, 1596463, 1606170, 1612380, 1614306, 1611833, 1605686, 1597125, 1587333, 1576725]
53267A576725j1982j4287j7001j9431k1513k3613k5700k7159k7576k7344k7313
53256A333806k7963k9066l0078l0689l1003l1215l1219l0685k9513k8076k6911
53245A007388k6292k6188k6418k6726k6810k6542k6061k5501k4821k4019k3313
53234G24697k2739k1813k0021j7606j5437j3989j2876j1503r871q447p530p031
53222E55834o771o806p362q494r845j0786j0980j0710j0502j0458j0230r660r027
53209D34203q531p934o975n914n241n021m919m766m764n029n398n725o032o136
53195C51818n595m339l088k626k835k950k722k673l140l644l597l054k392j691
53181C07472j000q57j735l074l679l181k443k248k230j538j56R72J012O3j016
$$ y = [1576725, 1564743, 1550456, 1533455, 1514024, 1492511, 1468898, 1443198, 1416039, 1388463, 1361119, 1333806, 1305843, 1276777, 1246699, 1216010, 1185007, 1153792, 1122573, 1091888, 1062375, 1034299, 1007388, 981096, 954908, 928490, 901764, 874954, 848412, 822351, 796850, 772029, 748010, 724697, 701958, 680145, 660124, 642518, 627081, 613092, 600216, 588713, 578842, 570395, 562865, 555834, 549063, 542257, 534895, 526401, 516556, 505770, 494790, 484080, 473578, 463120, 452890, 443230, 434203, 425672, 417738, 410763, 404849, 399608, 394587, 389668, 384902, 380138, 375109, 369711, 363986, 357954, 351818, 346223, 341884, 338796, 336170, 333335, 330385, 327663, 324990, 321850, 318206, 314609, 311555, 309163, 307472, 306472, 305615, 303880, 300806, 297127, 293946, 291503, 289255, 287025, 285487, 285331, 286303, 287315, 287378, 286362]
53166B86362j375q60m5M39N02M15J72m47j220j483r91k71J50L63O02O80M11Q9
53148B83493%j46p11j363j517j297j340j722j867j520j048o34L9R61J402R03J46
53131B73779J73R45J364O93n42j317j294r23n53PQ43J307O10j051k427k506j437
53114B67671K5J407K421K513J333m79j717j965j898k128k400k220j716j341j108
53099B58398p01j87j03p00j456j631j133o04n85p94m93N22J558J765R91k56j361
53082B53230j850j450l79N40N86m6m98l40L9J01k33p48j267j588j493j023n01
53065B43080p0M47J088J493J299O22j15n36m06K85J065J181M62k59m5R76J723
53048B52290J435L98n64r42p23j20N61Q76M90m19j154j145n98k94o80j366j688
$$ y = [286362, 284987, 284127, 284082, 284521, 285023, 285438, 285610, 285163, 283943, 282460, 281469, 281198, 281348, 281711, 282313, 282993, 283404, 283493, 283493, 283347, 282636, 281273, 279756, 278459, 277119, 275397, 273530, 272010, 270962, 270328, 270367, 271328, 272730, 273633, 273779, 273952, 274897, 276261, 276954, 276412, 275095, 273801, 272878, 272325, 272332, 273175, 274482, 275092, 274041, 271614, 269108, 267671, 267696, 269103, 271524, 274037, 275370, 274891, 273174, 271209, 269311, 267183, 264783, 262563, 260847, 259506, 258398, 257697, 257510, 257407, 256707, 255251, 253620, 252487, 251883, 251298, 250504, 250011, 250533, 252091, 253856, 254847, 254591, 253230, 251380, 249930, 249551, 250091, 250677, 250631, 250133, 249793, 249832, 249933, 249700, 248952, 247685, 246097, 244604, 243581, 243080, 243010, 243457, 244545, 246038, 247337, 247959, 247844, 247308, 246902, 247187, 248252, 249433, 249895, 249636, 249591, 250567, 252290, 253725, 254123, 253559, 252617, 251894, 251774, 252335, 253211, 253701, 253282, 252128, 250983, 250385, 250091, 249411, 248045, 246357]
53031B46357j470j027n09K11J031J401Q70l54j594k278k262j790j297j050q54
53016B35385k78P03J473J386M92m66o71Q2J153J485O08p30j254o22K34M26K33
52999B39639L94Q08O99m1n37j59O34J066J140J338J566J080l83j965k440j479
52983B41360J55J467K033J935J339M80j30N1R56J791J813J146N58N45Q52R88Q73
52966B58212Q28J055J337J280P34jl80j18M82P79M79l9k30q4j21o49j372j787
52948B60405j829j789j883k075k255k286j977j265m50O4J97R6l13j216k296k743
52932B38385k148j032j44L74P49Q68L77n82j278j165m43K13K72k24p14o36p1L31
52914B33132K66K76Q71J574J484O70J37L10M32j45q53p01K66J075J144P59L31
$$ y = [246357, 244887, 243860, 243351, 243562, 244593, 245994, 246864, 246510, 244916, 242638, 240376, 238586, 237289, 236239, 235385, 235107, 235810, 237283, 238669, 239161, 238695, 238024, 238106, 239259, 240744, 241352, 240622, 239368, 238746, 238980, 239406, 239639, 240033, 240841, 241540, 241499, 240962, 240803, 241437, 242503, 243643, 244981, 246547, 247627, 247244, 245279, 242839, 241360, 241515, 242982, 245015, 246950, 248289, 248769, 248639, 248690, 249646, 251437, 253250, 254396, 254954, 255499, 256351, 257339, 258212, 259040, 260095, 261432, 262712, 263446, 263445, 263065, 262947, 263429, 264208, 264687, 264648, 264418, 264334, 264213, 263564, 262192, 260405, 258576, 256787, 254904, 252829, 250574, 248288, 246311, 245046, 244596, 244660, 244857, 244953, 244640, 243424, 241128, 238385, 236237, 235205, 235061, 235435, 236184, 237052, 237429, 236847, 235569, 234404, 233961, 234174, 234446, 234222, 233508, 232872, 232801, 233132, 233398, 233674, 234545, 236119, 237603, 238273, 238410, 238720, 239152, 239007, 238154, 237453, 237719, 238794, 239938, 240697, 241028]
52897B41028j38o71r89r27q26j049j312r28J81J205J407J106J120J448J138k40
52881B41553j671j860r14r0qm1L41N20k87j590j988r07P61J814J966J706J399
52864B40704J077Q61J059J619J974J821J729K440L567L748K344L60q48j210j558
52849B59687k049k044j536j533k579l744l837k959k176k028k087j865j430j105
52835B28715j048j212j382j203n50J74M07P3l47m07k8O56J412J830J517N48n04
52818B28651j157j432j569j604j360q02j20M68Q96J235J616K188L068M226N325
52803B39629N683M631K152p62k723l157k887l154m084m479l363j404k82p31j770
52788B23299k029j301m64k47o31j172j450j152k31R36J807K122J962J523J055
$$ y = [241028, 240890, 240219, 239230, 238303, 237477, 236428, 235116, 234188, 234369, 235574, 236981, 238087, 239207, 240655, 241793, 241553, 239882, 238022, 237108, 237018, 237010, 236969, 237310, 237830, 237543, 235953, 233965, 233058, 233819, 235633, 237599, 239305, 240704, 241781, 242642, 243701, 245320, 247294, 249115, 250844, 253284, 256851, 260599, 262943, 263303, 262455, 261245, 259687, 257638, 255594, 254058, 252525, 249946, 246202, 242365, 239406, 237230, 235202, 233115, 231250, 229820, 228715, 227667, 226455, 225073, 223870, 223320, 223494, 223901, 223974, 223627, 223220, 223192, 223848, 225260, 227090, 228607, 229155, 228651, 227494, 226062, 224493, 222889, 221529, 220727, 220607, 221075, 221971, 223206, 224822, 227010, 230078, 234304, 239629, 245312, 249943, 252095, 251333, 248610, 245453, 242566, 239412, 235328, 230849, 227486, 226082, 225800, 225069, 223299, 221270, 219969, 219505, 219258, 218627, 217455, 216005, 214853, 214622, 215558, 217365, 219487, 221449, 222972, 224027]
52773B24027Q82J074J263J110Q23Q16J012J011P63N56L62o0m78l58J61L15r3l35
52755B32851M7N41O00N28O88O38j57j181j381n56O01J512K010J865R88J08K49
52738B39951J281J867J196R5j61M50P99K06p41j007l89L11K33n60j155p94L21
52721B41903J281J359N42o60j666k135k034j531p94M4P47J046R01N56K52P9J55
52704B40045N65R97Q24r5j024j194p94o06q52r69n31J26M32L25K31N17J136J687
52686B40820J758J285O68M16O73J109J253R35M34J55J77J80L6J71R06J631J314
52669B53921L4q43l83O66R97M46j62m65q02j205j151m91K25N88Q41J252J553J431
52651B56452J115J131J652K308K532J985Q45k69q77j150j607k325k831k761k317
$$ y = [224027, 224909, 225983, 227246, 228356, 229179, 229995, 231007, 232018, 232781, 233337, 233699, 233639, 233161, 232803, 232964, 233279, 233186, 232851, 232898, 233439, 234039, 234567, 235255, 235893, 235736, 234555, 233174, 232618, 233219, 234731, 236741, 238606, 239594, 239702, 239951, 241232, 243099, 244295, 244390, 244229, 244679, 245478, 245684, 244943, 243936, 243547, 243858, 244091, 243531, 242376, 241582, 241903, 243184, 244543, 245085, 244425, 242759, 240624, 238590, 237059, 236265, 236309, 237056, 238102, 239003, 239559, 239811, 239890, 240045, 240610, 241607, 242431, 242336, 241312, 240118, 239324, 238718, 237866, 236897, 236366, 236492, 236924, 237249, 237480, 237997, 239133, 240820, 242578, 243863, 244531, 244947, 245620, 246729, 247982, 248917, 249351, 249506, 249683, 249863, 249899, 250070, 250976, 252607, 253921, 253955, 253112, 252729, 253395, 254392, 254838, 254676, 254211, 253409, 252204, 251053, 250562, 250787, 251375, 252216, 253468, 255021, 256452, 257567, 258698, 260350, 262658, 265190, 267175, 268020, 267751, 266874, 265724, 264117, 261792, 258961, 256200, 253883]
52636B53883j911j697j509j054j71Q94J556J523J240J340J751J901J675J542J636
52621B62599J394M10q74j693j782j378q24m95o95j221j327o40J68R4q91j770j726
52604B49349j047n49n03n05k12K32O15J090J795K283J931R12J82K85P48R66J087
52587B58659J439J674J321Q02R36J594J810J322R60J234J525J174N40K96L14M6
52571B75646m61o72n13m61p73j186j407j397j189p97l85k39m06n89m39J39Q86
52554B65757J295J030L27j39k7K17p4r03j594j594r83k17L33N25L81Q5j00n6P7
52535B64340J05K0q0k67o69j067r34j38N95N01j52l53J82N72J25n83n84N6M72
52516B62141L06j9j39o7K93J141K206K906L176L529M114M338L650K174L96j215
$$ y = [253883, 251972, 250275, 248766, 247712, 247541, 248435, 249991, 251514, 252754, 254094, 255845, 257746, 259421, 260963, 262599, 263993, 264403, 263529, 261836, 260054, 258676, 257852, 257357, 256662, 255441, 254114, 253474, 253642, 253736, 252845, 251075, 249349, 248302, 247753, 247250, 246745, 246533, 246765, 247380, 248470, 250265, 252548, 254479, 255391, 255573, 255858, 256606, 257572, 258659, 260098, 261772, 263093, 263895, 264831, 266425, 268235, 269557, 270517, 271751, 273276, 274450, 274990, 275286, 275600, 275646, 275185, 274513, 274000, 273539, 272766, 271580, 270173, 268776, 267587, 266790, 266405, 266166, 265760, 265171, 264732, 264871, 265757, 267052, 268082, 268409, 268270, 268243, 268460, 268386, 267483, 265889, 264295, 263312, 263095, 263428, 263953, 264334, 264419, 264319, 264263, 264340, 264445, 264465, 264385, 264118, 263449, 262382, 261448, 261310, 261905, 262406, 262254, 261901, 262083, 262655, 262780, 262197, 261613, 261669, 262141, 262447, 262428, 262289, 262222, 262515, 263656, 265862, 268768, 271944, 275473, 279587, 283925, 287575, 289749, 290145, 288930]
52500B88930k211k377k148k208k572k627k191j768j580j190m48M3j14m24l28r3
52484B66694k24n98q01p66n11K32J417K254K090J380J024J154J288J293J385J456
52468B78767J267J146J621K412K647K093J391J102J170J468K010K464K159R65
52454C02682l66j075j228j351j666j987k180k338k574k801k790k385j740j220
52440B76981j042j119j281j350j057k46N90N57m98j532j490n94J35K43O5j11l08
52423B67943l62Q4R55J698J924J600P66l78j185j057k36N26J062J852K965L858
52407B82015M406N254O779Q418R550J0350J1195J1781J1373R621O606K497k233
52394C77612o458r009r655r167q399p601o567n125l465k046j201q17n24j72J49
$$ y = [288930, 286719, 284342, 282194, 279986, 277414, 274787, 272596, 270828, 269248, 268058, 267610, 267653, 267539, 267115, 266787, 266694, 266470, 265872, 265071, 264305, 263794, 264026, 265443, 267697, 269787, 271167, 272191, 273345, 274633, 275926, 277311, 278767, 280034, 281180, 282801, 285213, 287860, 289953, 291344, 292446, 293616, 295084, 297094, 299558, 301717, 302682, 302316, 301241, 300013, 298662, 296996, 295009, 292829, 290491, 287917, 285116, 282326, 279941, 278201, 276981, 275939, 274820, 273539, 272189, 271132, 270886, 271476, 272033, 271535, 270003, 268513, 267919, 268054, 268297, 268362, 268251, 267943, 267581, 267665, 268620, 270318, 272242, 273842, 274608, 274230, 273045, 271988, 271752, 272278, 273340, 275192, 278157, 282015, 286421, 291675, 298454, 306872, 316422, 326772, 337967, 349748, 361121, 370742, 377348, 379845, 377612, 371154, 362145, 352490, 343323, 334924, 327323, 320756, 315631, 312166, 310120, 308919, 308102, 307578, 307406, 307555]
52379C07555M99J058J647J826J623J693K339K961K893K419K328K770L183L242
52365C38036L135K916K253J059j71r57j432j925k278k018j132k60N1K6L07J004
52349C38614J417Q41m65j427j263k17Q89J605K153K838L520L732L291K620K439
52334C60587L096M312N508O375O998P522P951Q295Q787R730J1168J2725J3848
52321D66902J4187J3809J3047J2141J1158J0271R910J0310J0998J1124J0458R750
52309F04065R854J0680J1358J1386J1253J1748J2873J3707J3403J2095J0660R802
52297G42884R563R670R927J0099R692Q268N938L342J107n09j549k203k732l360
52283H00137m092m704m910m433l207j610m40k04m98m23L90J505K492L468M578
$$ y = [307555, 308054, 309112, 310759, 312585, 314208, 315901, 318240, 321201, 324094, 326513, 328841, 331611, 334794, 338036, 341171, 344087, 346340, 347399, 347228, 346271, 344839, 342914, 340636, 338618, 337486, 337226, 337277, 337303, 337610, 338614, 340031, 340872, 340407, 338980, 337717, 337500, 338389, 339994, 342147, 344985, 348505, 352237, 355528, 358148, 360587, 363683, 367995, 373503, 379878, 386876, 394398, 402349, 410644, 419431, 429161, 440329, 453054, 466902, 481089, 494898, 507945, 520086, 531244, 541515, 551425, 561735, 572733, 583857, 594315, 604065, 613919, 624599, 635957, 647343, 658596, 670344, 683217, 696924, 710327, 722422, 733082, 742884, 752447, 762117, 772044, 782143, 791835, 800103, 806041, 809383, 810490, 809981, 808432, 806229, 803497, 800137, 796045, 791341, 786431, 781998, 778791, 777181, 776741, 776537, 776039, 775616, 776006, 777511, 780003, 783471, 788049]
52268G88049N461N715N661O095P252Q525R320R683R936J0038R807R506R670J0332
52254I05050J0873J0858J0617J0732J1244J1708J1842J1608J0827R227P013M900
52242A026499L407K452J825J576J678J683J230O51O20J273K072K477K418K149
52228A052010J911J776J650J403J156J274J877K524K686K342J862J472J280J586
52214A076809K611L878M475M154L756M203N397O452O835O918P328Q048Q386P843
52200A157093O761N902N486N057M410M166N051O834Q442R019Q544P531O525N852
52186A246673N475N067M427L667K713R74j924n198p427q135q176q387q588q319
52172A212842p892q008q578q726p984o869o011n219l935k341j324j141p73P89
$$ y = [788049, 793510, 799225, 804886, 810981, 818233, 826758, 836078, 845761, 855697, 865735, 875542, 885048, 894718, 905050, 915923, 926781, 937398, 948130, 959374, 971082, 982924, 994532, 1005359, 1014586, 1021599, 1026499, 1029906, 1032358, 1034183, 1035759, 1037437, 1039120, 1040350, 1041001, 1041621, 1042894, 1044966, 1047443, 1049861, 1052010, 1053921, 1055697, 1057347, 1058750, 1059906, 1061180, 1063057, 1065581, 1068267, 1070609, 1072471, 1073943, 1075223, 1076809, 1079420, 1083298, 1087773, 1091927, 1095683, 1099886, 1105283, 1111735, 1118570, 1125488, 1132816, 1140864, 1149250, 1157093, 1163854, 1169756, 1175242, 1180299, 1184709, 1188875, 1193926, 1200760, 1209202, 1218221, 1226765, 1234296, 1240821, 1246673, 1252148, 1257215, 1261642, 1265309, 1268022, 1268996, 1267072, 1261874, 1254447, 1246312, 1238136, 1229749, 1221161, 1212842, 1204950, 1196942, 1188364, 1179638, 1171654, 1164785, 1158774, 1153555, 1149620, 1147279, 1145955, 1144814, 1144041, 1144830]
52158A144830K934L954L174J676P17K72k68q07q55o01o46r81j052p65m71j23O25
52141A151613J503J708J068J44q54k268l896m786m585m080l859l373k001k31J160
52126A127263K396M194O465Q527J0311J2404J4880J6945J7920J8033J8042J8355
52114A275735J8683J8367J7099J5368J3982J3026J1788R938Q181P329P225P287
52102A424008P638Q840J0728J2305J2914J2749J2284J1743J1258J0853J0034P964
52090A553318M387K1m158p660j0366j2114j2813j2720j2189j1279r834p890n769
52077A450934l769k035p38j13j28k11L33J620L083M237N263O589Q088R127R320
52062A491600Q827P978O995O103N503N106M770M746N390O274O316N072L328J951
$$ y = [1144830, 1147764, 1151718, 1154892, 1156568, 1157285, 1157557, 1157289, 1156482, 1155627, 1155026, 1154380, 1153399, 1152347, 1151582, 1151111, 1150988, 1151613, 1153116, 1154824, 1155892, 1156036, 1155182, 1152914, 1149018, 1144232, 1139647, 1135567, 1131708, 1128335, 1126334, 1126103, 1127263, 1129659, 1133853, 1140318, 1148845, 1159156, 1171560, 1186440, 1203385, 1221305, 1239338, 1257380, 1275735, 1294418, 1312785, 1329884, 1345252, 1359234, 1372260, 1384048, 1393986, 1402167, 1409496, 1416721, 1424008, 1431646, 1440486, 1451214, 1463519, 1476433, 1489182, 1501466, 1513209, 1524467, 1535320, 1545354, 1553318, 1557705, 1557726, 1553568, 1545908, 1535542, 1523428, 1510615, 1497895, 1485706, 1474427, 1464593, 1456703, 1450934, 1447165, 1445130, 1444392, 1444279, 1444151, 1443940, 1444273, 1445893, 1448976, 1453213, 1458476, 1465065, 1473153, 1482280, 1491600, 1500427, 1508405, 1515400, 1521503, 1527006, 1532112, 1536882, 1541628, 1547018, 1553292, 1559608, 1564680, 1568008, 1569959]
52048A569959P19j066l394n602p405r067j0670j1882j2510j2728j2626j2027j0899
52035A460802r629q677q136p780p364o866o431o142n891n558n261n194n279n293
52021A367301n311n594o023o194o179o544p316p622o830n502m599m265m054l990
52007A287278m603o095q130j0362j2592j4673j6678j9079k2110k5178k7366k8311
51995A092101k8154k6958k4943k2908k1618k0816j9652j8026j6711j6153j5929
51984H60233j5507j4793j3885j2912j2211j2056j2128j2041j2238j3490j5382
51973G13590j6370j5673j4178j2941j1693r570o605l635j086J332L864O271Q126
51960F41432R199R532R406R094Q497P211N041K264p31l730o467q508r539r530
$$ y = [1569959, 1570678, 1569612, 1566218, 1560616, 1553211, 1544144, 1533474, 1521592, 1509082, 1496354, 1483728, 1471701, 1460802, 1451173, 1442496, 1434360, 1426580, 1419216, 1412350, 1405919, 1399777, 1393886, 1388328, 1383067, 1377873, 1372594, 1367301, 1361990, 1356396, 1350373, 1344179, 1338000, 1331456, 1324140, 1316518, 1309688, 1304186, 1299587, 1295322, 1291268, 1287278, 1282675, 1276580, 1268450, 1258088, 1245496, 1230823, 1214145, 1195066, 1172956, 1147778, 1120412, 1092101, 1063947, 1036989, 1012046, 989138, 967520, 946704, 927052, 909026, 892315, 876162, 860233, 844726, 829933, 816048, 803136, 790925, 778869, 766741, 754700, 742462, 728972, 713590, 697220, 681547, 667369, 654428, 642735, 633165, 626560, 622925, 621839, 623171, 627035, 633306, 641432, 650631, 660163, 669569, 678663, 687160, 694371, 699412, 701676, 700945, 697215, 690748, 682240, 672701, 663171]
51946F63171q551o762m629k639o15K105N571Q856J1174J2792J4328J5621J5918
51933G26340J4941J3108J0886Q432N816L110J94l214p187j1380j5148j7861j9327
51920G08710k0028k0601k0979k0409j8565j6198j4292j2941j1585j0039q658p548
51908E26867o286m564k676j111R5J374L122N294P488R326J0688J1567J1756J0924
51894E83864Q889N704J490l451q326j2114j4283j4991j4483j2782j0175p447n168
51881D96727l008k72L053O242Q679J0494J2377J5025J8590K2491K5882K8475L0628
51868F75383L2465L3370L2570K9740K4605J6581N628o752j8124k6666l1732l3361
51856G33707l2132k9280k5939k2172j7606j2954r741q283p231n734m794n451o687
$$ y = [663171, 654620, 647858, 643229, 640590, 639975, 642080, 647651, 656507, 667681, 680473, 694801, 710422, 726340, 741281, 754389, 765275, 773707, 779523, 782633, 782827, 779613, 772426, 761046, 745898, 728037, 708710, 688682, 668081, 647102, 626693, 608128, 591930, 577638, 564697, 553112, 543073, 534415, 526867, 520581, 516017, 513341, 512230, 512325, 513699, 516821, 522115, 529603, 538929, 549617, 561184, 572940, 583864, 592753, 598457, 599947, 596496, 588170, 576056, 561773, 546782, 532299, 519517, 509342, 501895, 496727, 493719, 493447, 496500, 502742, 511421, 521915, 534292, 549317, 567907, 590398, 616280, 644755, 675383, 707848, 741218, 773788, 803528, 828133, 844714, 850342, 843590, 825466, 798800, 767068, 733707, 701575, 672295, 646356, 624184, 606578, 593624, 583883, 575600, 568369, 562635, 557841, 552390, 545703]
51843E45703o636n261m310m662n347n495n691o552p184o314m276k583j787r50
51829D78655O57K477L627M026L993L393J894k63k351l875m677m616l634k121p10
51814D76475L28J125J792K402L249M546N703N580L787J262p73k058l139m359n477
51799D90443o121o109n403m204l047k393k036j334j89N87J84j128k147j996r53
51784D54154j3J66k15n25m13j57l69j415k933l951l662k237o82K42P51J521K726
51767D42988L973N113O492Q306J0078J1078J0970R819P704M713J216k143m817
51754E15490o668p883q693r122r024q405p630p081o657n909m747l634k866k046
51740D25125o29J232K826L880M918O556Q714J0756J2147J2708J2310J0700P826
$$ y = [545703, 539067, 533806, 529496, 524834, 519487, 513992, 508301, 501749, 494565, 488251, 483975, 481392, 479605, 478655, 479312, 481789, 485416, 489442, 493435, 496828, 498722, 498459, 496108, 492233, 487556, 482940, 479306, 477185, 476475, 476803, 477928, 479720, 482122, 485371, 489917, 495620, 501200, 504987, 506249, 505476, 503418, 500279, 495920, 490443, 484322, 478213, 472810, 468606, 465559, 463166, 461130, 459796, 459607, 460194, 460378, 459250, 457103, 455107, 454154, 454141, 454307, 454092, 453567, 453154, 452997, 452628, 451213, 448280, 444329, 440667, 438430, 437748, 437990, 438741, 440262, 442988, 446961, 452074, 458566, 466872, 476950, 488028, 498998, 508817, 516521, 521234, 522450, 520307, 515490, 508822, 500939, 492246, 483124, 474100, 465695, 458065, 450984, 444327, 438418, 433671, 430037, 427171, 425125, 424496, 425728, 428554, 432434, 437352, 443908, 452622, 463378, 475525, 488233, 500543, 511243, 519069]
51727E19069M253R42j338k335k004l68K084M110M393K633k41l030n108o335o612
51712E10113n856m236k225m96J99n39k144l176k492l22K134M069N609O947P465
51697E15050O280L517N46j293j891k030j997j202P55L087M394L925J858j331n147
51682E24521q687j0762j0868r662q177o758n035k674J15K643M141M242L275J973
51668D78287Q59N9l16O2J395L537O146Q652J0012R095N841J597k141n069p625
51653E10391r538r690p447l588M62L960P119J0207J2651J3069J0300M560k462
51640E39994q686j2901j5068j5727j5370j4314j2777j0970r119p359n711m205
51628D07787l118k750k898k852k099q69K17Q17R77P95L54j08k85q8K82N08L28
$$ y = [519069, 523322, 524264, 522926, 520591, 518587, 518219, 520303, 524413, 528806, 531439, 531198, 528168, 523060, 516725, 510113, 504257, 500021, 497796, 497300, 497499, 496960, 494816, 491640, 489148, 488826, 490960, 495029, 500638, 507585, 515050, 521330, 524847, 525393, 524100, 522209, 520179, 518182, 516980, 517735, 520822, 525216, 529141, 530999, 529668, 524521, 515834, 505072, 494204, 484542, 476365, 469607, 464572, 461898, 462013, 464656, 468797, 473039, 476314, 478287, 479146, 479205, 478889, 478951, 480346, 483883, 490029, 498681, 508693, 517788, 523629, 525226, 523085, 518016, 510391, 500853, 491163, 483716, 480128, 480590, 484550, 491669, 501876, 514527, 527596, 537896, 542456, 539994, 531308, 518407, 503339, 487612, 472242, 457928, 445151, 434181, 425062, 417703, 411992, 407787, 404669, 401919, 399021, 396169, 394070, 393201, 393418, 394235, 395212, 396007, 396361, 396253, 395968, 395880, 396162, 396670, 396998]
51611C96998k59q81j100r48r34j342j802j802j310o13J66J044J892K634L542M900
51595D00185O495P839Q944J0417J2643J5082J6442J5460J1807O463J112l056n876
51582E03957p517p711o130l194N1K885N345P870J0865J4498J8409K1649K3316
51569E84293K3463K3188K3878K6333L0186L3768L5066L3565L1051L0107L1969
51558I06867L6234M2126M8987N5767O1093O3956O3485N8192M6885L0723J3124
51547A427439l178j7988l1990m4512n4219o1087o6079o9193o9436o6756o2596
51536H80405n8049n2731m6114l8998l2732k7585k2786j8045j4098j1741j0812
51525E46714j0407r708q528p172o026n178m483l953l817m102m373m153l520k914
$$ y = [396998, 396739, 395858, 394758, 393810, 392876, 391534, 389732, 387930, 386620, 386007, 386173, 387217, 389109, 391743, 395285, 400185, 406680, 414519, 423463, 433880, 446523, 461605, 478047, 493507, 505314, 511777, 512889, 509833, 503957, 496440, 488729, 482599, 479405, 479456, 482341, 487686, 495556, 506421, 520919, 539328, 560977, 584293, 607756, 630944, 654822, 681155, 711341, 745109, 780175, 813740, 844791, 874898, 906867, 943101, 985227, 1034214, 1089981, 1151074, 1215030, 1278515, 1336707, 1383592, 1414315, 1427439, 1424261, 1406273, 1374283, 1329771, 1275552, 1214465, 1148386, 1079193, 1009757, 943001, 880405, 822356, 769625, 723511, 684513, 651781, 624196, 601410, 583365, 569267, 557526, 546714, 536307, 526599, 518071, 510899, 504873, 499695, 495212, 491259, 487442, 483340, 478967, 474814, 471294, 468380]
51511D68380k447j803q98k41m07j374k729m220n793p121p551o626m593k327p91
51496D19459l68n67m70K43R52R61N16M65J085J797K116K144K000J369Q3j395k534
51479D27856l301l776l663k823j894j634j849j777j380j373j888k031j152J45
51465C99460Q61R85J401K549L831M313L688K350Q46n83j893k950l548l708l722
51450D03880l660l115j716J75J758K758L751N400P751J0447J3341J6427J9196
51437D76393K0365J8561J3553O896J130j935k275j072M60J438R57j668n986j0288
51423E16529j2811j3048j1776j0094q649p491o392n165l859k623j478m29L78R03
51409D33995J544K788M356N162M433K626R42J16J3J79L94O54R82J412K003K703
$$ y = [468380, 465933, 464130, 463232, 462991, 462584, 461210, 458481, 454261, 448468, 441347, 433796, 427170, 422577, 420250, 419459, 419091, 418524, 418054, 418297, 419249, 420210, 420726, 421191, 422276, 424073, 426189, 428333, 430333, 431702, 431785, 430390, 427856, 424555, 420779, 417116, 414293, 412399, 410765, 408916, 407139, 405759, 404386, 402498, 400467, 399315, 399460, 400321, 401306, 402707, 405256, 409087, 413400, 417088, 419438, 420284, 419701, 417808, 414858, 411310, 407602, 403880, 400220, 397105, 395389, 395564, 397322, 400080, 403831, 409231, 416982, 427429, 440770, 457197, 476393, 496758, 515319, 528872, 535768, 536898, 534963, 532688, 531616, 532076, 533514, 534471, 532803, 526817, 516529, 503718, 490670, 478894, 468800, 460151, 452660, 446268, 441103, 437244, 434621, 433143, 432714, 433092, 433995, 435539, 438327, 442683, 447845, 452278, 454904, 455846, 455962, 455975, 456154, 456548, 457202, 458184, 459596, 461599, 464302]
51393D64302L392M051M859N985P385Q908J0574J2556J4851J7206J9612K2764K7666
51380F24111L4661M2955N1274N8886O5940P2960Q0073Q6452R0415R0211Q4918
51369A382856P4646O0065M2222K2706L344j4745l1411m6551n9401o9118p5612
51358A289001p9345q0666p9864p7444p3656o8109o0624n2221m4450l7828l1846
51347F02948k6380k2105j9329j7369j5508j3825j2671j1939j1276j0467r301p610
51335D25168n761m516m038l634k850k211k258k538k239j370n16J81R35J401P66
51320C96520r88k679l142k446j612j367j483j230k05J300K636L388L541L232K557
51305C98022J695R45N41M92O87R81J120Q08Mr90j925k890m105n501o576o678n490
$$ y = [464302, 467694, 471745, 476604, 482589, 489974, 498882, 509456, 522012, 536863, 554069, 573681, 596445, 624111, 658772, 701727, 753001, 811887, 877827, 950787, 1030860, 1117312, 1207727, 1297938, 1382856, 1457502, 1517567, 1559789, 1582495, 1585839, 1571094, 1539683, 1493132, 1433731, 1364613, 1289001, 1209656, 1128990, 1049126, 971682, 898026, 829917, 769293, 717072, 672622, 634794, 602948, 576568, 554463, 535134, 517765, 502257, 488432, 475761, 463822, 452546, 442079, 432778, 425168, 419407, 414891, 410853, 407219, 404369, 402158, 399900, 397362, 395123, 393753, 393237, 393418, 394353, 395754, 396520, 395532, 392853, 389711, 387265, 385653, 384286, 382803, 381573, 381368, 382668, 385304, 388692, 392233, 395465, 398022, 399717, 400662, 401203, 401695, 402382, 403363, 404483, 405291, 405295, 404305, 402380, 399490, 395385, 389884, 383308, 376630, 371140]
51288C71140l396j400m21n27r96j038l96P31K012L257M463N604O411O538O101
51273C98083N659N463N178M682M543N070N439M679L147K010J525R77J77l20n54
51258D45758j349k785l764l746l650m307n166n372n112m869m333l161k077j937
51244C94130k303k090j258o66n96n96n22o18p02l70R4l8p60j364j535j439q65
51227C78502N81K333L073K394J308P53N31J27k72j39N33J252J527J167M43J25
51211C94238P62J880K465K374K522L439M426M600M055L453L001K493J968J729
51197D33405J814J922J725J027j33j302j814j516j069j138j555j579q84J15Q37
51182D29855J158J387J821K391K654K250J374O72O20J085J564J626J162L44m86
$$ y = [371140, 367744, 366344, 365923, 365396, 364400, 363362, 362966, 363697, 365709, 368966, 373429, 379033, 385444, 391982, 398083, 403742, 409205, 414383, 419065, 423608, 428678, 434117, 438796, 441943, 443953, 445478, 446455, 446632, 446312, 445758, 444409, 441624, 437860, 434114, 430464, 426157, 420991, 415619, 410507, 405638, 401305, 398144, 396067, 394130, 391827, 389737, 388479, 387813, 387217, 386621, 386099, 385481, 384779, 384409, 384503, 384465, 383705, 382341, 380806, 379367, 378502, 379083, 381416, 384489, 386883, 388191, 388944, 389475, 389602, 389330, 389191, 389724, 390976, 392503, 393670, 394113, 394238, 395000, 396880, 399345, 401719, 404241, 407680, 412106, 416706, 420761, 424214, 427215, 429708, 431676, 433405, 435219, 437141, 438866, 439893, 439760, 438458, 436644, 435128, 434059, 432921, 431366, 429787, 428903, 429018, 429855, 431013, 432400, 434221, 436612, 439266, 441516, 442890, 443562, 444182, 445267, 446831, 448457, 449619, 449963, 449477]
51167D49477j089j517k019k663l185l261k864k288j863j674j527j304j255j730
51153D21238k578l105k836k118j702j959k656l308l375k411n28J402K326J889
51139D00279N93o96j230p06M75J412J616J477J502J441P73k30p52o55o61j062
51123D03576j135k00J271K206K251K055K355L223M262N209O081O762O819N929
51109D50664M398K901J705O11l95r42r83j032j359j534j219q47q40q26l67po29
51092D49299k020l060l112k417j318j0J010J182O72J84M9K03Q23K012L006K845
51076D49348J894J528K211K967L011K694K460K089J466J046R31N30j94j45J420
51061D73256L690N449O674Q092R766J1014J1298J0437Q352N358K433O66N97K332
$$ y = [449477, 448388, 446871, 444852, 442189, 439004, 435743, 432879, 430591, 428728, 427054, 425527, 424223, 422968, 421238, 418660, 415555, 412719, 410601, 408899, 406940, 404284, 400976, 397601, 395190, 394662, 396064, 398390, 400279, 400872, 400176, 398946, 398240, 398715, 400127, 401743, 403220, 404722, 406163, 406936, 406706, 405954, 405299, 404638, 403576, 402441, 402241, 403512, 405718, 407969, 410024, 412379, 415602, 419864, 425073, 431154, 437916, 444735, 450664, 455062, 457963, 459668, 460279, 459884, 458942, 457959, 456927, 455568, 454034, 452815, 451968, 451128, 450302, 449935, 449928, 449299, 447279, 444219, 441107, 438690, 437372, 437362, 438372, 439554, 440226, 440410, 440459, 440662, 441485, 443497, 446503, 449348, 451242, 452770, 454981, 457948, 460959, 463653, 466113, 468202, 469668, 470714, 471645, 472175, 471981, 471836, 473256, 476946, 482395, 489069, 497161, 506927, 517941, 529239, 539676, 548028, 553386, 555819, 556485, 557082, 559414]
51047E59414N560R062J1091J1067J0350J0586J1748J2549J2121J0443P729M535
51035F76255K097J497K385L225K645N0m556j0347j5536j8535j9355j9147j8431
51022E82247j6655j3540r917o904m811l175j436O04K625M026M527M514M548M788
51008E51441N226O093P446Q661R031Q789Q775R184R378Q954Q242P597O853N786
50994F61456M669M071M397N689P498Q958R448R310R521J0600J2137J3512J4582
50981G75848J5538J6421J7121J7559J7659J7136J5507J2382P880K879j359l956
50969I10615m762l969j730J612N412R177J2965J7000K1209K5398K9477L3191L6035
50956A091630L7859L9217M0469M1040M0196L8305L6508L5311L4215L2718L1066
$$ y = [559414, 564974, 574036, 585127, 596194, 606544, 617130, 628878, 641427, 653548, 663991, 671720, 676255, 678352, 679849, 682234, 685459, 688104, 688154, 683598, 673251, 657715, 639180, 619825, 600678, 582247, 565592, 552052, 542135, 535231, 530420, 527245, 525809, 526413, 529038, 533064, 537591, 542105, 546653, 551441, 556667, 562760, 570206, 578867, 587898, 596687, 605462, 614646, 624024, 632978, 641220, 648817, 655670, 661456, 666125, 670196, 674593, 680282, 687780, 696738, 706186, 715496, 725017, 735617, 747754, 761266, 775848, 791386, 807807, 824928, 842487, 860146, 877282, 892789, 905171, 913051, 915930, 914571, 910615, 905853, 901884, 900154, 901766, 907178, 916355, 929320, 946320, 967529, 992927, 1022404, 1055595, 1091630, 1129489, 1168706, 1209175, 1250215, 1290411, 1328716, 1365224, 1400535, 1434750, 1467468, 1498534]
50945A498534K9930K9897L1178L3373L5762L8199M1272M4881M7134M5832M0901
50934A916893L4318K7688K1109J4526Q682L985m63n776j1888j8093k4376l1304
50922A935301l8825m6026n2105n6965o0853o3846o5818o6549o5775o3322n9333
50911A295884n4374m9258m4622m0527l6583l2621k9063k6362k4303k2304k0264
50900I15603j8536j7139j5586j3643j1685j0106q837p676o694o053n800n939o345
50887G81564o473n692m108k621j861j501r03qP73J250J637K209L041L993M731
50872G76031N029N084N386O139P143Q170R180J0059J0649J1172J2148J3743J5589
50859H95522J7418J9396K1533K3424K4968K6864K9849L3735L7820M1939M6475
$$ y = [1498534, 1528464, 1558361, 1589539, 1622912, 1658674, 1696873, 1738145, 1783026, 1830160, 1875992, 1916893, 1951211, 1978899, 2000008, 2014534, 2023216, 2027201, 2026738, 2020962, 2009074, 1990981, 1966605, 1935301, 1896476, 1850450, 1798345, 1741380, 1680527, 1616681, 1550863, 1484314, 1418539, 1355217, 1295884, 1241510, 1192252, 1147630, 1107103, 1070520, 1037899, 1008836, 982474, 958171, 935867, 915603, 897067, 879928, 864342, 850699, 839014, 828908, 820071, 812395, 805701, 799648, 793848, 787909, 781564, 775091, 769399, 765291, 762670, 760809, 759308, 758405, 758397, 759170, 760420, 762057, 764266, 767307, 771300, 776031, 781060, 786144, 791530, 797669, 804812, 812982, 822162, 832221, 842870, 854042, 866190, 879933, 895522, 912940, 932336, 953869, 977293, 1002261, 1029125, 1058974, 1092709, 1130529, 1172468, 1218943]
50848A218943N1494N6449O0963O5308O9945P4870P9715Q4273Q8582R2451R5167
50837B038160R5921R4479R1242Q6621Q0694P3626O6100N8876N2163M5893M0531
50826B824306L7074L6210L7846M1432M6408N2336N9044O6530P4300Q0863Q4413
50815C440762Q3853P8674O8183N1952L1191Q539j4050l6472n9126q1345j01840
50804C470321j19923j35287j47048j54004j55840j53379j47639j39226j28627
50795B189348j16550j03879r1472p9945o9364n9321m9513m0133l1512k3755j6959
50784A506945j1458p423m575k645j864k460l939n377o388p373q784j0530j2129
50771A422000j3214j3906j4721j6051j7755j9552k1612k4249k6995k8710k8896
$$ y = [1218943, 1270437, 1326886, 1387849, 1453157, 1523102, 1597972, 1677687, 1761960, 1850542, 1942993, 2038160, 2134081, 2228560, 2319802, 2406423, 2487117, 2560743, 2626843, 2685719, 2737882, 2783775, 2824306, 2861380, 2897590, 2935436, 2976868, 3023276, 3075612, 3134656, 3201186, 3275486, 3356349, 3440762, 3524615, 3603289, 3671472, 3723424, 3754615, 3763154, 3749104, 3712632, 3653506, 3572161, 3470321, 3350398, 3215111, 3068063, 2914059, 2758219, 2604840, 2457201, 2317975, 2189348, 2072798, 1968919, 1877447, 1797502, 1728138, 1668817, 1619304, 1579171, 1547659, 1523904, 1506945, 1495487, 1488064, 1483489, 1480844, 1478980, 1476520, 1472581, 1467204, 1460816, 1453443, 1444659, 1434129, 1422000, 1408786, 1394880, 1380159, 1364108, 1346353, 1326801, 1305189, 1280940, 1253945, 1225235, 1196339]
50760A196339k8199k7246k5859k3929k2242k1421k0687j8776j5745j2804j0537
50749I68894q431o166m222k810j141J688N534R408J2497J4741J6714J9122K2209
50736A048037K5559K8613L1275L3794L6258L8672M1303M4355M7387M9649N1005
50725A475907N1970N2821N3288N3109N2299N0757M8210M4731M0726L6258L0890
50714A990966K4356J6956R218J869l871o765o649m357k48O255J5078K4409L2133
50701B099350L7892M2694M6768M8933M8093M4300L7856K8310J5064j291j8939
50690B429030l5972n1127o3488p2196p6915p8245p7186p4207o9281o2698n5341
50679A712374m7913m0416l2725k5201j8241j1582m661K519R575J6549K3742L0603
$$ y = [1196339, 1168140, 1140894, 1115035, 1091106, 1068864, 1047443, 1026756, 1007980, 992235, 979431, 968894, 960463, 954297, 950075, 947265, 946124, 947812, 953346, 962754, 975251, 989992, 1006706, 1025828, 1048037, 1073596, 1102209, 1133484, 1167278, 1203536, 1242208, 1283511, 1327866, 1375253, 1424902, 1475907, 1527877, 1580698, 1633986, 1687095, 1739394, 1790151, 1838361, 1883092, 1923818, 1960076, 1990966, 2015322, 2032278, 2041496, 2043365, 2039494, 2032729, 2026080, 2021723, 2021475, 2027730, 2042808, 2067217, 2099350, 2137242, 2179936, 2226704, 2275637, 2323730, 2368030, 2405886, 2434196, 2449260, 2447969, 2429030, 2393058, 2341931, 2278443, 2206247, 2129332, 2051087, 1973901, 1899694, 1830413, 1767715, 1712374, 1664461, 1624045, 1591320, 1566119, 1547878, 1536296, 1531635, 1534154, 1543729, 1560278, 1584020, 1614623]
50667A614623L5691L8057L8095L6706L4196L0517K6047K1602J7814J4930J2954
50656A921232J1653J0642R761R208R014Q710P821O467N181M380M368N520P965
50643B021922J1272J4861J8642K2818K7319L1826L6159M0189M3435M5340M5900
50632B359683M5498M4186M1747L8588L5844L4321L3909L4396L6000L8011L7198
50621B779381K8895J0720j4729m1034o1776p3471p5942p1097o1694n0381l8866
50610B330006k7708j7012p342L47N517Q319Q919O914J746o452j6700k7734l8559
50597B220261m8529n7188o4134o9023p1722p2481p1762o9831o6731o2750n8622
50586A507488n4885n1215m6835m1607l6308l1665k7491k3084j8249j3514r304
$$ y = [1614623, 1650314, 1688371, 1726466, 1763172, 1797368, 1827885, 1853932, 1875534, 1893348, 1908278, 1921232, 1932885, 1943527, 1953288, 1962496, 1971510, 1980220, 1988041, 1994508, 1999689, 2004069, 2008437, 2013957, 2021922, 2033194, 2048055, 2066697, 2089515, 2116834, 2148660, 2184819, 2225008, 2268443, 2313783, 2359683, 2405181, 2449367, 2491114, 2529702, 2565546, 2599867, 2633776, 2668172, 2704172, 2742183, 2779381, 2808276, 2818996, 2804267, 2763233, 2701457, 2627986, 2552044, 2480947, 2419253, 2368872, 2330006, 2302298, 2285286, 2277944, 2278291, 2283808, 2292127, 2301046, 2307960, 2309706, 2303254, 2286554, 2258820, 2220261, 2171732, 2114544, 2050410, 1981387, 1909665, 1837184, 1765422, 1695591, 1628860, 1566110, 1507488, 1452603, 1401388, 1354553, 1312946, 1276638, 1244973, 1217482, 1194398, 1176149, 1162635, 1153331]
50575A153331n343j151L131O764R271J0890J2025J2618J2423J1598J0571R421
50563A245549P986O602O145P055Q883J1150J4102J8131K2842K7355L1348L5142
50551A442290L8862M2194M4933M7023M7930M6701M3045L7905L2643K8106K4704
50540A876336K2832K2710K4200K7198L1818L7683M3622M8759N3647N9478O6335
50529B314618P3166P9473Q6097R3889J02431J10602J17791J23946J28821J31828
50519C362662J32505J30614J25870J18006J07040R3220P6810N8179L7859J6232
50509D258997o460k9437n1101p0101q6418j00657j12433j20334j23494j22261
50499C436301j17021j07372r3100p5372n6201l7020j8291j05J7362L3674M7639
$$ y = [1153331, 1147988, 1146837, 1149968, 1156732, 1166003, 1176893, 1188918, 1201536, 1213959, 1225557, 1236128, 1245549, 1253535, 1260137, 1266282, 1273337, 1282220, 1293370, 1307472, 1325603, 1348445, 1375800, 1407148, 1442290, 1481152, 1523346, 1568279, 1615302, 1663232, 1709933, 1752978, 1790883, 1823526, 1851632, 1876336, 1899168, 1921878, 1946078, 1973276, 2005094, 2042777, 2086399, 2135158, 2188805, 2248283, 2314618, 2387784, 2467257, 2553354, 2647243, 2749674, 2860276, 2978067, 3102013, 3230834, 3362662, 3495167, 3625781, 3751651, 3869657, 3976697, 4069917, 4146727, 4204906, 4242765, 4258997, 4252537, 4223100, 4171999, 4101898, 4015480, 3914823, 3802390, 3682056, 3558562, 3436301, 3319280, 3211908, 3118808, 3043436, 2987235, 2950215, 2931924, 2931819, 2949181, 2982855, 3030494]
50488C030494N7164O0198N5873M4480K6724L705k2597m9610p5067r7149j14089
50477B920126j24675j29351j29967j27986j23612j16916j08966j01136r3910q7082
50467A776525q0634p4654o8746o2481n6272n0856m6008m0679l4625k8947k4560
50456A208063k0941j7056j2854r108o184l774j645J67J827L600N227O100O306
50443A159728O772Q047R585J0652J1377J2251J3000J2817J1561R961Q634P524
50431A281909O481N791N814O487P457Q468R427J0402J1689J3536J5685J7539J9008
50418A419693K0802K3594K7206L0902L4289L7645M1573M6566N2589N8868O4360
50407A858087O8672P2206P5189P7077P7281P5917P3240O8843O2238N3924M4949
$$ y = [3030494, 3087658, 3147856, 3203729, 3248209, 3274933, 3278638, 3256041, 3206431, 3131364, 3034215, 2920126, 2795451, 2666100, 2536133, 2408147, 2284535, 2167619, 2058653, 1957517, 1863607, 1776525, 1695891, 1621237, 1552491, 1490010, 1433738, 1382882, 1336874, 1296195, 1261570, 1232623, 1208063, 1187122, 1170066, 1157212, 1148104, 1141920, 1138146, 1136501, 1136668, 1138495, 1142095, 1147322, 1153422, 1159728, 1166500, 1174547, 1184132, 1194784, 1206161, 1218412, 1231412, 1244229, 1255790, 1265751, 1274385, 1281909, 1288390, 1294181, 1299995, 1306482, 1313939, 1322407, 1331834, 1342236, 1353925, 1367461, 1383146, 1400685, 1419693, 1440495, 1464089, 1491295, 1522197, 1556486, 1594131, 1635704, 1682270, 1734859, 1793727, 1858087, 1926759, 1998965, 2074154, 2151231, 2228512, 2304429, 2377669, 2446512, 2508750, 2562674, 2607623]
50396B607623L5460K4597J1905j993j6348l1027m5881n9948p1851q0630q5894
50385B286013q7652q6343q2637p6854o8871n8898m7906l6867k5871j4528l015
50374A696571P606J6087K1698K4407K4538K2226J7037Q518k838j5479k7820l9011
50362A753540m8485n5521n9730o1584o1754o0243n6885n2357m7907m4080m0469
50351A164525l6760l3305l0493k8146k5896k3594k1159j8449j5684j3513j2276
50340I05250j1542j0663r528q365p093n386l322j487l56J84N93J184J869K318
50326H53656K348K243K589L606M755N304N311N677P028Q795R778R528Q737Q242
50312I37597Q020P502O561N774N714O408P493Q587R371R711R916J0607J2113J4163
$$ y = [2607623, 2643083, 2667680, 2679585, 2677592, 2661244, 2630217, 2584336, 2524388, 2452537, 2371907, 2286013, 2198361, 2112018, 2029381, 1952527, 1883656, 1824758, 1776852, 1739985, 1714114, 1699586, 1696571, 1704177, 1720264, 1741962, 1766369, 1790907, 1813133, 1830170, 1838688, 1835850, 1820371, 1792551, 1753540, 1705055, 1649534, 1589804, 1528220, 1466466, 1406223, 1349338, 1296981, 1249074, 1204994, 1164525, 1127765, 1094460, 1063967, 1035821, 1009925, 986331, 965172, 946723, 931039, 917526, 905250, 893708, 883045, 873517, 865152, 858059, 852673, 849351, 847864, 847508, 847692, 848285, 849469, 851338, 853656, 856004, 858247, 860836, 864442, 869197, 874501, 879812, 885489, 892517, 901312, 911090, 920618, 929355, 937597, 945617, 953119, 959680, 965454, 971168, 977576, 985069, 993656, 1003027, 1012738, 1022654, 1033261, 1045374, 1059537]
50298A059537J6324J8381K0101K0936K0271J7788J3370P070k97o994j1448j3456
50286A161583j3852j3198j1457q640m869R2O199J1694J3447R709K079n815j1187
50273A135785j3267j2598j0272p540n112k717mK376L341K862J918R47n40k595
50259A092584m134m220l232k109j082O8J082J380R33K35l66p28n65J63O78P8j315
50242A079450k116j600n44m3j82k14M17J696L201M193L959K566J036L21L70N17
50226A093027M31J98k26j030k064k901l351l545l519l109k264j033O27K665M756
50211A078662O774R241J2593J6142J8594J9591J9926K0041J9381J7660J5800J4848
50199A269253J4678J4646J4886J5925J7453J8430J8142J6123J1375L043p895j8823
$$ y = [1059537, 1075861, 1094242, 1114343, 1135279, 1155550, 1173338, 1186708, 1193778, 1193481, 1186487, 1175039, 1161583, 1147731, 1134533, 1123076, 1114436, 1109567, 1109659, 1115858, 1127552, 1140999, 1150708, 1152787, 1146972, 1135785, 1122518, 1109920, 1099648, 1092108, 1086996, 1084279, 1084275, 1086651, 1089992, 1092854, 1094772, 1095719, 1095179, 1092584, 1088450, 1084230, 1080998, 1078889, 1077807, 1077875, 1078957, 1080337, 1081270, 1081505, 1081139, 1080411, 1079846, 1080009, 1080687, 1080765, 1079450, 1077334, 1075734, 1075190, 1075147, 1074965, 1074751, 1075168, 1076864, 1080065, 1084258, 1088217, 1090783, 1091819, 1092140, 1092510, 1093027, 1093458, 1093656, 1093430, 1092400, 1090336, 1087435, 1084084, 1080539, 1077020, 1073911, 1071647, 1070614, 1071241, 1073906, 1078662, 1085436, 1094677, 1107270, 1123412, 1142006, 1161597, 1181523, 1201564, 1220945, 1238605, 1254405, 1269253, 1283931, 1298577, 1313463, 1329388, 1346841, 1365271, 1383413, 1399536, 1410911, 1413954, 1406059, 1387236]
50187A387236k7846l4956m0468m3511m3131m0022l5961l1812k7120k1580j5844
50176A024985j0721o468l240j645k407n645j0606j5890j9917k1715k1496k0231
50164H85004j8586j6550j4094j1662r713q154o598m995l657k793k212j419O5K276
50150G86912M564N971O075N223L887K148N6j943l413m496n653o871p585p317o066
50135G71492m167k135n00N73J497K697M009N017N680O072N762M334K510J711K259
50120H06811K940K798K412K759L708M463M940N688O826Q060R422J1071J2481J2912
50106H97291J2618J2669J3437J4221J4543J4883J5784J7105J8642K0686K3444
50095A075323K6523K9614L3096L7414M2290M7047N1185N4090N4895N3514N1376
$$ y = [1387236, 1359390, 1324434, 1283966, 1240455, 1197324, 1157302, 1121341, 1089529, 1062409, 1040829, 1024985, 1014264, 1007796, 1004556, 1002911, 1000504, 994859, 984253, 968363, 948446, 926731, 905235, 885004, 866418, 849868, 835774, 824112, 814399, 806245, 799647, 794652, 790995, 788202, 785990, 784571, 784636, 786912, 791476, 797447, 803522, 808745, 812632, 814780, 814836, 812893, 809480, 804984, 799331, 792460, 784875, 777558, 771492, 767325, 765190, 764690, 765263, 766760, 769457, 773466, 778483, 784163, 790235, 795997, 800331, 802841, 804552, 806811, 809751, 812549, 814961, 817720, 821428, 825891, 830831, 836519, 843345, 851405, 860827, 871898, 884379, 897291, 909909, 922578, 936015, 950236, 964779, 979662, 995446, 1012551, 1031193, 1051879, 1075323, 1101846, 1131460, 1164556, 1201970, 1244260, 1291307, 1342492, 1396582, 1451477, 1504991, 1556367]
50084A556367N0227N0407N1205N2510N4865N7717N8897N6500N0532M2015L1276
50073B112518J8108L280j1249k3921l4673m4087n2007n7633o0688o1807o1636
50062A726205o0225n7567n4234n0877m7410m3320l8705l4311l0498k6950k3679
50051A258429k1527k1030k1350k1048j9624j7644j5583j3323j0726q040n480k979
50039A080075n44J579L253M654N919O977P903R049J0509J1716J1918J1111J0135
50026A174254R763R707Q794O237K631n99k738m239n687o904p602q289r775j2072
50012A153481j4529j6828j8958k0340k0085j8311j6348j5199j4592j3875j2966
50001I71450j1805r742o341k302J344M667Q554J3084J6926J8525J7423J4480J1297
$$ y = [1556367, 1606594, 1657001, 1708206, 1760716, 1815581, 1873298, 1932195, 1988695, 2039227, 2081242, 2112518, 2130626, 2133906, 2122657, 2098736, 2064063, 2019976, 1967969, 1910336, 1849648, 1787841, 1726205, 1665980, 1608413, 1554179, 1503302, 1455892, 1412572, 1373867, 1339556, 1309058, 1282108, 1258429, 1236902, 1215872, 1194522, 1173474, 1153850, 1136206, 1120623, 1107300, 1096574, 1088534, 1083054, 1080075, 1079531, 1081110, 1084363, 1089017, 1094936, 1101913, 1109816, 1118865, 1129374, 1141090, 1153008, 1164119, 1174254, 1184017, 1193724, 1202518, 1208755, 1211386, 1210787, 1208049, 1203810, 1198123, 1191219, 1183617, 1175328, 1165553, 1153481, 1138952, 1122124, 1103166, 1082826, 1062741, 1044430, 1028082, 1012883, 998291, 984416, 971450, 959645, 949903, 943562, 941260, 942604, 947271, 955825, 968909, 985835, 1004360, 1021783, 1036263, 1047560]
49988A047560R330Q929R034Q190N936K934q5k924n461p163p369n814k820Q10M203
49973A065290P126J0282J4454J9283K3397K5804K6650K6502K5524K3843K2186
49962A290341K1518K2131K3529K5101K6537K7595K7798K6359K2385J5431O156
49951A534881l708j2396j9163k4153k7587k9474l0052k9956k9741k9510k9113
49940A270028k8421k7358k5980k4742k4356k5112k6579k8143k9656l1182l2379
49929I66120l2569l1499k9636k7591k5504k3114k0200j6870j3606j1083r638q765
49917G16045p419n083k359k41Q99J336J330R98P23J109K351M062N859P737R752
49902G37099J1775J3773J6016J8634K1195K2977K3470K2474K0122J6955J3660
$$ y = [1047560, 1056890, 1065819, 1074853, 1083043, 1088979, 1091913, 1091828, 1088904, 1083443, 1076280, 1068911, 1063097, 1060277, 1061087, 1065290, 1072416, 1082698, 1097152, 1116435, 1139832, 1165636, 1192286, 1218788, 1244312, 1268155, 1290341, 1311859, 1333990, 1357519, 1382620, 1409157, 1436752, 1464550, 1490909, 1513294, 1528725, 1534881, 1531173, 1518777, 1499614, 1475461, 1447874, 1418400, 1388348, 1358392, 1328651, 1299141, 1270028, 1241607, 1214249, 1188269, 1163527, 1139171, 1114059, 1087480, 1059337, 1029681, 998499, 966120, 933551, 902052, 872416, 844825, 819321, 796207, 776007, 759137, 745531, 734448, 724810, 716045, 708626, 703543, 701184, 700943, 701842, 703178, 704508, 705506, 706229, 707338, 709689, 713751, 719610, 727347, 737099, 748874, 762647, 778663, 797297, 818492, 841469, 864939, 887413, 907535, 924490, 938150]
49891I38150J0419O862K960o02l456o369j0293j4854j8665k1007k2327k3058k2987
49878H14773k2110k1173k0767k0472j9534j7853j5815j3555j1031q539o500m911
$$ y = [938150, 948569, 955431, 958391, 957789, 954333, 947964, 937671, 922817, 904152, 883145, 860818, 837760, 814773, 792663, 771490, 750723, 730251, 710717, 692864, 677049, 663494, 652463, 643924, 637424, 632513]
$$ [...]
##END NTUPLES=NMR SPECTRUM
##END=
