
##TITLE=UV1247_M9_1261-1207_70_7241305_NDJgzlZaKL
##JCAMPDX= 6.0         $$ Bruker NMR JCAMP-DX V2.0
##DATA TYPE= NMR SPECTRUM
##DATA CLASS= NTUPLES
##ORIGIN= BRUKER
##OWNER= Administrator
$$ 1.72 TOPSPIN		Version 2.1
$$ 2013-01-24 04:14:02.778 -0500  Administrator@X
$$ Compression mode = diff/dup
##.OBSERVE FREQUENCY= 400.02188249412
##.OBSERVE NUCLEUS= ^1H
##.ACQUISITION MODE= SIMULTANEOUS (DQD)
##.ACQUISITION SCHEME= undefined
##.AVERAGES= 8
##.DIGITISER RES= 22
##SPECTROMETER/DATA SYSTEM= spect
##.PULSE SEQUENCE= zg30
##.SOLVENT NAME= COFFEE_meoh
##.SHIFT REFERENCE= INTERNAL, COFFEE_meoh, 1, 14.98509
##AUDIT TRAIL= $$ (NUMBER, WHEN, WHO, WHERE, PROCESS, VERSION, WHAT)
$$ ##TITLE= Audit trail, TOPSPIN		Version 2.1
$$ ##JCAMPDX= 5.01
$$ ##ORIGIN= Bruker BioSpin GmbH
$$ ##OWNER= Administrator
$$ $$ E:\/data/COFFEE/nmr/UV1247_M9_1261-1207_70_7241305_NDJgzlZaKL/20/pdata/1/auditp.txt
$$ ##AUDIT TRAIL=  $$ (NUMBER, WHEN, WHO, WHERE, PROCESS, VERSION, WHAT)
(   1,<2013-01-24 04:13:54.685 -0500>,<Administrator>,<X>,<go>,<TOPSPIN 2.1>,
      <created by zg
	started at 2013-01-24 04:12:48.403 -0500,
	POWCHK enabled, PULCHK disabled,
       configuration hash MD5:
       86 BA 57 50 F2 9D 5C 9B 26 00 A9 28 5F 66 2E 89
       data hash MD5: 64K
       C3 53 4E CF 58 7B D9 E1 C1 05 30 E0 6D 8A 71 07>)
(   2,<2013-01-24 04:13:57.669 -0500>,<Administrator>,<X>,<proc1d>,<TOPSPIN 2.1>,
      <Start of raw data processing
       efp LB = 0 FT_mod = 6 PKNL = 1 PHC0 = 0 PHC1 = 0 SI = 32K 
       data hash MD5: 32K
       74 D5 24 A6 B5 DC 65 92 C0 E5 BC 8E 35 40 1D 74>)
(   3,<2013-01-24 04:13:58.122 -0500>,<Administrator>,<X>,<proc1d>,<TOPSPIN 2.1>,
      <pk PHC0 = 99.49219 PHC1 = 0 
       data hash MD5: 32K
       F0 8A BC 02 29 30 20 B5 3E 6B 2E E7 E3 E9 9E 98>)
(   4,<2013-01-24 04:13:58.357 -0500>,<Administrator>,<X>,<proc1d>,<TOPSPIN 2.1>,
      <abs ABSG = 1 
       data hash MD5: 32K
       52 18 03 6E FC D3 57 AF 90 E0 B4 75 01 E1 AE AE>)
(   5,<2013-01-24 04:13:58.513 -0500>,<Administrator>,<X>,<proc1d>,<TOPSPIN 2.1>,
      <abs ABSG = 2 
       data hash MD5: 32K
       37 00 82 62 80 24 4B 8B D1 61 AC 25 65 74 FC B3>)
(   6,<2013-01-24 04:13:58.653 -0500>,<Administrator>,<X>,<proc1d>,<TOPSPIN 2.1>,
      <abs ABSG = 3 
       data hash MD5: 32K
       4F 83 E2 23 DD 5A 4D 2F 39 55 6A AB A0 D4 AD 32>)
(   7,<2013-01-24 04:13:58.794 -0500>,<Administrator>,<X>,<proc1d>,<TOPSPIN 2.1>,
      <abs ABSG = 4 
       data hash MD5: 32K
       52 DD D0 FC A4 CA 80 7F 1D 3D 2C 11 9A A5 63 3D>)
(   8,<2013-01-24 04:13:58.966 -0500>,<Administrator>,<X>,<proc1d>,<TOPSPIN 2.1>,
      <abs ABSG = 5 
       data hash MD5: 32K
       D5 BC 88 42 45 F1 2E F2 AA 58 CA 5D E7 6C 94 31>)
$$ ##END=
$$ 
$$ $$ hash MD5
$$ $$ 36 BA F1 A3 2F DA 9E 80 53 18 7B F1 80 12 11 57
##$RELAX= 
##$RELAX= 
##$RELAX= 
##$RELAX= 
##$RELAX= 
##$RELAX= 
##$RELAX= 
$$ Bruker specific parameters
$$ --------------------------
##$DU= <E:\>
##$EXPNO= 20
$$ [...]
150 150 150 150 150 150 150 150
##$TP07= 0
##$TPNAME0= <>
##$TPNAME1= <>
##$TPNAME2= <>
##$TPNAME3= <>
##$TPNAME4= <>
##$TPNAME5= <>
##$TPNAME6= <>
##$TPNAME7= <>
##$TPOAL= (0..7)
0.5 0.5 0.5 0.5 0.5 0.5 0.5 0.5
##$TPOFFS= (0..7)
0 0 0 0 0 0 0 0
##$TUNHIN= 0
##$TUNHOUT= 0
##$TUNXOUT= 0
##$USERA1= <user>
##$USERA2= <user>
##$USERA3= <user>
##$USERA4= <user>
##$USERA5= <user>
##$V9= 5
##$VALIST= <valist>
##$VCLIST= <CCCCCCCCCCCCCCC>
##$VD= 0
##$VDLIST= <DDDDDDDDDDDDDDD>
##$VPLIST= <PPPPPPPPPPPPPPP>
##$VTLIST= <TTTTTTTTTTTTTTT>
##$WBST= 1024
##$WBSW= 4
##$XGAIN= (0..3)
0 0 0 0
##$XL= 0
##$YL= 0
##$YMAX_a= 673028
##$YMIN_a= -573357
##$ZGOPTNS= <>
##$ZL1= 120
##$ZL2= 120
##$ZL3= 120
##$ZL4= 120
##$ABSF1= 14.98509
##$ABSF2= -5.573092
##$ABSG= 5
##$ABSL= 3
##$ALPHA= 0
##$AQORDER= 0
##$ASSFAC= 0
##$ASSFACI= 0
##$ASSFACX= 0
##$ASSWID= 0
##$AUNMP= <proc_prof1d_extract_pilot.lims>
##$AXLEFT= 0
##$AXNAME= <>
##$AXNUC= <1H>
##$AXRIGHT= 0
##$AXTYPE= 0
##$AXUNIT= <>
##$AZFE= 0.1
##$AZFW= 0.1
##$BCFW= 0
##$BC_mod= 0
##$BYTORDP= 0
##$COROFFS= 0
##$CY= 15
##$DATMOD= 1
##$DC= 0
##$DFILT= <>
##$DTYPP= 0
##$F1P= 0
##$F2P= 0
##$FCOR= 0.5
##$FTSIZE= 32768
##$FT_mod= 6
##$GAMMA= 0
##$GB= 0
##$INTBC= 1
##$INTSCL= 1
##$ISEN= 128
##$LB= 0
##$LEV0= 0
##$LPBIN= 0
##$MAXI= 10000
##$MC2= 0
##$MEAN= 0
##$ME_mod= 0
##$MI= 0
##$NCOEF= 0
##$NC_proc= -8
##$NLEV= 6
##$NOISF1= 0
##$NOISF2= 0
##$NSP= 0
##$NTH_PI= 0
##$NZP= 0
##$OFFSET= 14.98509
##$PC= 1
##$PHC0= 99.49219
##$PHC1= 0
##$PH_mod= 1
##$PKNL= yes
##$PPARMOD= 0
##$PPDIAG= 0
##$PPIPTYP= 0
##$PPMPNUM= 2147483647
##$PPRESOL= 1
##$PSCAL= 4
##$PSIGN= 0
##$PYNMP= <proc.py>
##$REVERSE= no
##$SF= 400.02
##$SI= 32768
##$SIGF1= 0
##$SIGF2= 0
##$SINO= 400
##$SIOLD= 32768
##$SPECTYP= <>
##$SREGLST= <1H.CDCl3>
##$SSB= 0
##$STSI= 32768
##$STSR= 0
##$SW_p= 8223.68421052631
##$SYMM= 0
##$S_DEV= 0
##$TDeff= 65536
##$TDoff= 0
##$TI= <>
##$TILT= no
##$TM1= 0
##$TM2= 0
##$TOPLEV= 0
##$USERP1= <user>
##$USERP2= <user>
##$USERP3= <user>
##$USERP4= <user>
##$USERP5= <user>
##$WDW= 1
##$XDIM= 32768
##$YMAX_p= 471774673
##$YMIN_p= -691473
##$CURPLOT= <Network HP LaserJet P1505>
##$CURPRIN= <$Network HP LaserJet P1505>
##$DFORMAT= <normdp>
##$LAYOUT= <+/1D_H.xwp>
##$LFORMAT= <normlp>
##$PFORMAT= <normpl>
##$SURQMSG= 1
$$ End of Bruker specific parameters
$$ ---------------------------------
##NTUPLES= NMR SPECTRUM
##VAR_NAME=  FREQUENCY,     SPECTRUM/REAL,   SPECTRUM/IMAG
##SYMBOL=    X,             R,               I
##VAR_TYPE=  INDEPENDENT,   DEPENDENT,       DEPENDENT
##VAR_FORM=  AFFN,          ASDF,            ASDF
##VAR_DIM=   32768,         32768,           32768
##UNITS=     HZ,            ARBITRARY UNITS, ARBITRARY UNITS
##FACTOR=    0.250966925370066, 1,           1
##FIRST=     8223.43324360094, -58375,       -145148
##LAST=      0,             3815,            -10310
##MIN=       0,             -691473,         0
##MAX=       8223.43324360094, 471774673,    0
$$ Real data points
##PAGE= N=1
##DATA TABLE= (X++(R..R)), XYDATA
$$ [...]
19544a52478D06509c9812m9772k9691N1880B2599a77018H7769a28588q342d6127
19532E2264a38262k788g0245n5600A6437J9056a23244I040a14171C24307A1032
19520A45532f2058E554b11856c0797B34623D1634a93183M7544j22347P0341B00161
19508g4984p2262B36950A09761h0328j51305a07723A53594b08285l0298A9316
19497A98167f0209b0478q0749A5264J0618M7582a11553j05014a4624l16395c9632
19485e77192K61031N1837N9137q6559A4910P0441b02686j25575A20401a74928
19474h6788J7258q0179n519c9417k47676H4402d69243A2866L4246M683j0269Q1428
19462A22954c7612F5324a03759o0895A51362a251o0855j76944A57244a36847A65539
$$ y = [-152478, 406509, -39812, -89584, -119275, -67395, 22599, -177018, 87769, -128588, -136930, -46127, 52264, -138262, -141050, -70245, -125845, 16437, 35493, -123244, 9040, -114171, 324307, 11032, 145532, -62058, 5554, -211856, -30797, 234623, 41634, -193183, -145639, -267986, -197645, 200161, -74984, -147246, 236950, 109761, -80328, -231633, -107723, 153594, -208285, -238583, 19316, 198167, -60209, -20478, -101227, 15264, 25882, 73464, -111553, -216567, -14624, -331019, -39632, -577192, -316161, -264324, -205187, -291746, 14910, 85351, -202686, -328261, 120401, -174928, -86788, -69530, -149709, -155228, -39417, -287093, 84402, -469243, 12866, 47112, 51795, 41526, 122954, -37612, 65324, -103759, -164654, 151362, -1251, -62106, -239050, 157244, -136847, 165539]
19450A6740c08822a17454j40436H7830g2369D5547N0627d83976a5780o8981p4243
19439a59004L388E9118i3349A62332d92819A04654h6006A10573h2280B8706e16606
19427F5135J1061J53470P751B2949H596J80733n3041a62638j21241h070A95406
19415i1266h779F345c33447B27140L2434k1658a15864j0553D5020C470N11094
19404E14564a40466J848A11029J2372a05324R175k64936E2274a19161A10248f795
19392f3046m8671k8130o1754f7141j41852A6631b30920A0814b86198a41524A74177
19380d29569a40461n9466K1738d0285j16534c6943k10677H5991a04916j69194
19370b74110a13752p8142c1350j9528b1585p194o0003k60534J31669j90757a74503
$$ y = [16740, -308822, -117454, -257890, 87830, -72369, 45547, 96174, -483976, -15780, -84761, -159004, -155616, 59118, -93349, 162332, -492819, 104654, -86006, 110573, -82280, 28706, -516606, 65135, 76196, 229666, 237417, 22949, 8596, 189329, 136288, -162638, -283879, -8070, 195406, -91266, -8779, 6345, -333447, 227140, 259574, 237916, -115864, -126417, 45020, 3470, 514564, -140466, -138618, 111029, 123401, -105324, -96149, -361085, 52274, -119161, 110248, -6795, -63046, -111717, -139847, -201601, -67141, -208993, 16631, -230920, 10814, -286198, -141524, 174177, -429569, -140461, -199927, -178189, -40285, -156819, -36943, -247620, 85991, -104916, -274110, -113752, -191894, -31350, -50878, -21585, -28779, -88782, -349316, -217647, -408404, -174503]
19358e48685D55926h5732A06633b03733l06763R8207c7937l04145A00901K25294
19348C26195o8662a33935c0446I2559K6132n6486a81441A72338a84A13547E482
19336C1784a50526B03793l1188F0835J66010b13770G7003b92636O5261b412B22031
19324A96306r3312a76891l520j7169G6593F502d3605j80148m2924I7275b89661
19312H2236b0039A03558a16929n5426A12384K12934a45964K009j25021A8318a67219
19300A35815g0781B679J93918p0291g078l90209E3588K9949b24544O7426A20088
19288a32809q2777A263d5143n6379A90869A9946J0557J26285e7724r4154N6514
19277i5364l00135J54695l13614A18522O2199a45856j55609j00127J70811a00612
$$ y = [-548685, 455926, -85732, 106633, -203733, -510496, -412289, -37937, -342082, 100901, 326195, 257533, -133935, -30446, 92559, 118691, 62205, -181441, 172338, -184, 113547, 5482, 31784, -150526, 203793, 172605, 60835, 226845, -213770, 77003, -292636, -227375, -2412, 222031, 196306, 102994, -176891, -180411, -197580, 76593, 6502, -43605, -223753, -266677, 97275, -289661, 82236, -20039, 103558, -116929, -172355, 112384, 325318, -145964, -143955, -268976, 18318, -167219, 135815, -70781, 2679, 196597, 126306, -7078, -397287, 53588, 83537, -224544, -157118, 120088, -132809, -215586, 1263, -45143, -101522, 190869, 19946, 30503, 156788, -57724, -151878, -95364, -395499, -240804, -554418, 118522, 180721, -145856, -301465, -401592, -230781, -100612]
19266F4180L2017M4312b03370B9093L9940d3016j53097F8074e4882n52172A61460
19254c8869k5051k05422a00398j44920B69083b0483I8767b09235o6858L4604B6720
19242a17870j89777b1836j3074D9491b16763C6136h871k52146h3518D1930f3700
19230e9587j1516l1531l53656F614Q7218K20937B995b17638J08386n6960L2534
19219a33678A70873b73302a27620F8773b13975f3050a2869j08841j90504a27106
19208a21192A64074d74690b17578a08575A1252K17765H9366e6017a5602k62757
19198b78359G54a34686A34543b46196A94890E2453a14182I7304b23750I4543a32945
19186b13166E3620b86841i771p9565J873b2076G2456M036d7242E8950k4566M05296
$$ y = [64180, 96197, 140509, -203370, 29093, 69033, -43016, -196113, 68074, -54882, -607054, 161460, -38869, -63920, -269342, -100398, -245318, 269083, -20483, 98767, -209235, -276093, -241489, 26720, -117870, -307647, -21836, -34910, 49491, -216763, 36136, -8871, -261017, -83518, 41930, -63700, -59587, -71103, -102634, -456290, 6614, 93832, 314769, 2995, -217638, -109252, -166212, -133678, 170873, -273302, -127620, 68773, -213975, -63050, -12869, -121710, -312214, -127106, -121192, 164074, -474690, -217578, -108575, 11252, 229017, 89366, -56017, -15602, -278359, 754, -134686, 134543, -246196, 194890, 52453, -114182, 97304, -223750, 94543, -132945, -213166, 53620, -286841, -9771, -89336, -87463, -22076, 72456, 76492, -47242, 58950, 34384, 439680]
19174D39680F562d03895B56822A02979m1322b28136K5324j58787c3140m418j61794
19163a99352B16349B4175K50220c17570i0559H9707c0340E497l3d1120A95364
19151b14872Q5192G8614K2433J06134H8585d36172A91121C5184a83700m9100j47522
19140c80322J58090d4683p0466L9107A67010i9087E4741d9157A97546c81259a45553
19128A22765C8647A5083b03179m6377f7297B3940b84240A68711O7463A8752a24841
19116b19856B20092b22704a00610E2438a93781C45834A41558g8950j72714A20790
19105d4732q5348K3468j61295P4250j14744c8252j422k37382P8584k09928a31638
19093a80287E0049b79378Q4762k5001O1347B3908b42294A09321a35133B9930J62283
$$ y = [439680, 6562, -403895, 256822, 102979, 61657, -228136, -202812, -361599, -33140, -37558, -199352, 216349, 24175, 274395, -317570, -90559, 89707, -30340, 5497, 5464, -41120, 195364, -214872, -129680, 78614, 101047, 207181, 88585, -436172, 191121, 35184, -183700, -232800, -380322, -222232, -44683, -115149, -76042, 167010, -99087, 54741, -49157, 197546, -381259, -145553, 122765, 38647, 15083, -203179, -249556, -67297, 23940, -284240, 168711, 236174, 18752, -124841, -219856, 220092, -222704, -100610, 52438, -193781, 345834, 141558, -78950, -251664, 120790, -44732, -130080, -106612, -267907, -193657, -308401, -38252, -39674, -277056, -198472, -408400, -131638, -180287, 50049, -279378, -194616, -219617, -158270, 23908, -242294, 109321, -135133, 29930, 192213]
19082A92213a04745A49563b11843Q1725B7410a46121e2490l6138K0876E4347J32779
19071A87126H173b20593C01753a84372d8284Q629A08395a789l9420l3954E5162
19059A57519B5722O0464O4898b51251A14486b17176H6858d47879A53586f354k5657
19048c2011j21377B17309a20024A06300B5210e27771A76175a93104B7199c5223
19037A57643L9096g9383j76677B34979A02913j4248A017b00644Q5022A13503m9594
19026F3909I823K88675j42960b95533a14688K2362G0504a07007F8947a5905r2293
19015a08198k43980h5745C979K59606A05570a37511p7660Q0010d9324e147E740
19003b2497k91615J44274A4961L851Q1395a51228A52417K28251G2398J24955J90968
$$ y = [192213, -104745, 149563, -211843, -130118, 27410, -146121, -52490, -88628, -67752, 54347, 187126, 8173, -220593, 301753, -184372, -48284, -39655, 108395, -1789, -41209, -75163, 55162, 157519, 25722, 86186, 151084, -251251, 114486, -217176, 86858, -447879, 153586, -6354, -32011, -153388, 217309, -120024, 106300, 25210, -527771, 176175, -193104, 27199, -35223, 157643, 196739, -79383, -256060, 234979, 102913, 88665, 1017, -200644, -115622, 113503, 63909, 9823, 298498, 155538, -295533, -114688, -92326, 70504, -107007, 68947, -15905, -108198, -352178, -85745, 3979, 263585, 105570, -137511, -215171, -135161, -49324, -5147, 5740, -22497, -314112, -169838, 14961, 18812, 100207, -151228, 152417, 380668, 72398, 197353, 388321]
18992C88321a55653k13091R8892m4901A75391G766K02190b6645A38299l8534b2666
18980A37106m702e7997o0845b0745l58842a32646l5815j55400a2633A32042c13462
18968c60651a59259m2A25287B5855J80125h3768a4366o05441I6636L397O1403
18957A61436i5105M5857o7417C881a34496L7918G2625a74981b2191A19732b01614
18945a63192P6795k20114D243L07137h5026A49346h3788a6442I6284b98132a43910
18933A32705o4500Q9429M0963a39709E5059K75037a81962c6480B33050b40789
18922A27988b65489A51010a8569C9332f2708o0353d564m8179A6362b51860B30891
18910g9114L1373A08002a86639B82616b26355a10183B67519a07045l36539D9389
$$ y = [388321, -155653, -368744, -269852, -314753, 175391, 7766, 209956, -26645, 138299, 99765, -22666, 137106, 132404, -57997, -118842, -20745, -379587, -132646, -168461, -323861, -12633, 132042, -313462, -360651, -159259, -159301, 125287, 25855, 205980, -83768, -14366, -619807, 96636, 100033, 161436, -95105, -49248, -116665, 3881, -134496, -96578, 72625, -174981, -22191, 119732, -201614, -163192, -86397, -306511, 4243, 311380, -85026, 149346, -83788, -16442, 96284, -298132, -143910, 132705, 68205, 157634, 198597, -139709, 55059, 330096, -181962, -36480, 233050, -240789, 127988, -265489, 151010, -18569, 39332, -62708, -123061, -4564, -52743, 16362, -251860, 230891, -79114, -47741, 108002, -186639, 282616, -226355, -110183, 267519, -107045, -443584, 49389]
18899B75142C0443b13383G2603a26794e2044j3346j32196e2616a8389k8213J0689
18888c5913o0520B15902f2173m5574l16658a15635j74189f176j3363k54678D3168
18876A57612M8561b7495I4732A5711a55972f0541j40363o4509B3609b46807P916
18865b38891d8071A34118b07223B10393I4709a60400M1048j27905P4016l0498
18855b03739J2071l3710m1299H1801f7640B06020c55751a27252b3772D9522J37229
18844A86751c23858O3865J6888M6251I7127b00037C10419a36597A27373A2948
18833i8723A30778p989g9415B8187e6254R258j78233B06197a43329B14143c34388
18821c14633K5596J44467B32454a15867E4636I222K9005K9088K11653c91295C74473
$$ y = [275142, 30443, -213383, 72603, -126794, -52044, -65390, -197586, -52616, -18389, -46602, -35913, -96433, 215902, -62173, -107747, -424405, -115635, -289824, -6176, -19539, -274217, 43168, 157612, 206173, -27495, 94732, 15711, -155972, -60541, -200904, -265413, 23609, -246807, -238891, -48071, 134118, -207223, 210393, 94709, -160400, -119352, -247257, -173241, -203739, -191668, -225378, -266677, 81801, -67640, 206020, -355751, -127252, -23772, 49522, 186751, -323858, -259993, -243105, -196854, 97127, -200037, 310419, -136597, 127373, 12948, -98723, 130778, 122789, -79415, 28187, -56254, -46996, -225229, 206197, -143329, 214143, -334388, -314633, -289037, -144570, 232454, -115867, 54636, 9222, 38227, 67315, 278968, -391295, 374473]
18809A01055j5536b93449A86334a19044d7127j15314j23118A1967M2574c26128
18798B22798f2428A46809b49249e0489F7757f2007j71363A40723J28563D4648
18787a3053r5911A68347C2774c6126j56579F2270M8675l9291B6910i8379A89875
18775A13978b7540j61453A32829c33933g0222j1437c5967o7627j86620A44550
18764A07806d30172C7500a39827D3630e21036b8564A05984d36398B7653h7103
18753B5394g7458h443A7736b50749A53402P0339H7749b65213d1796F7032e3360
18741g2879A5279d41636g4491j979j08031O1763j49560J26952j71804a52353B32526
18729d7743P64C3613l772a34244H9416a04184K1903n7531e0172K2949j81171k7194
$$ y = [101055, 85519, -293449, 186334, -119044, -47127, -162441, -285559, 11967, 54541, -326128, 222798, -62428, 146809, -249249, -50489, 67757, -62007, -233370, 140723, 269286, 44648, -13053, -108964, 168347, 32774, -36126, -192705, 62270, 110945, 71654, 26910, -98379, 189875, 113978, -27540, -188993, 132829, -333933, -70222, -81659, -35967, -103594, -290214, 144550, 107806, -430172, 37500, -139827, 43630, -521036, -28564, 105984, -436398, 27653, -87103, 25394, -77458, -8443, 17736, -250749, 153402, 223741, 87749, -265213, -41796, 67032, -53360, -72879, 15279, -441636, -74491, -76470, -184501, -122738, -272298, -145346, -317150, -152353, 232526, -47743, -46979, 33613, 29841, -134244, 89416, -104184, -82281, -139812, -50172, -27223, -208394, -235588]
18717b35588a802l30469J27744E1593b78990a4425I7917B6070a00339G189d8830
18705a1067A21275m5311b36422B04451J8184R3026j10026a08406N144M1720j1765
18694g3307k25001a39984D412J80965M4010e32379B764J49517p3284A2892i5464
18682c19998B892O2787h5157m372B14341d78004B95942b74306a02557c4668r7725
18671a32393D5563a63136I5376e2351D5514M3062g4873L4312j33159l6628I7235
18659c03846Q2881R4727J8043j57417H4355e00038A92692c36648a63947j05867
18649b69814a0860k81431A01371L3159M2554g8486K9149l29617a24919I2966A2112
18637b06157B15146d99225A72698d06576e4504a5497A5661c83733A39220b28259
$$ y = [-235588, -1802, -332271, -204527, 51593, -278990, -14425, 97917, 26070, -100339, 7189, -48830, -11067, 121275, 75964, -236422, 204451, 222635, 315661, 205635, -108406, -103262, -61542, -73307, -298308, -139984, 4412, 185377, 229387, -532379, 2764, 152281, 78997, 12892, -95464, -319998, 2892, 65679, -85157, -89529, 214341, -478004, 295942, -274306, -102557, -34668, -132393, 45563, -163136, 95376, -52351, 45514, 88576, -74873, -40561, -173720, -210348, 97235, -303846, -220965, -126238, -108195, -265612, 84355, -500038, 192692, -336648, -163947, -269814, -10860, -292291, 101371, 134530, 177084, -78486, -49337, -378954, -124919, 92966, 12112, -206157, 215146, -499225, 172698, -406576, -54504, -15497, 15661, -383733, 139220, -228259]
18626A15696n5438p985a9684j95210j23865B39726E5325i8524j40096A29577e5989
18614c33339N2513A23038A6902a0923o25156b15046B02130b51270e9757A18484
18603A64755G9942a27248A39843b418j98508M6535j13674j10515B52378b10852
18592f4493m2050B26984E7226g6163C2762D919b08786o7431e5655j85403E6493
18580h8782M1076p5256J1554j38304e9480l25828E2617A5028a73259C5576d2449
18568e24l56103f6095K5K559k92884c8583F2067N1713b1066k89589A1603a3325
18555d61515B890L39064j70074B4223b30572A23230c19353m3149B44161a25695
18544A98251C5423a36316C3976d5910j59612N6955A33745j6476J54138a45430
$$ y = [115696, 60258, 52273, -19684, -214894, -338759, 239726, 55325, -98524, -238620, 129577, -55989, -333339, -280826, 123038, 16902, -10923, -636079, -215046, 202130, -251270, -59757, 118484, 164755, 79942, -127248, 139843, -2418, -200926, -154391, -268065, -378580, 252378, -210852, -64493, -106543, 226984, 57226, -76163, 32762, 4919, -208786, -276217, -55655, -241058, 56493, -88782, -47706, -122962, -111408, -249712, -59480, -385308, 52617, 15028, -173259, 35576, -42449, -524, -356627, -66095, -66070, -63511, -356395, -38583, 62067, 113780, -21066, -310655, 11603, -13325, -461515, 2890, 341954, 171880, 24223, -230572, 123230, -319353, -362502, 244161, -125695, 198251, 35423, -136316, 33976, -45910, -205522, -148567, 133745, 117269, 271407, -145430]
18533b5632k44278A33392d01700j37479D1043b75936j09989H18a01370j66209
18523b67579J7334O3763P5461L0952q8464j97809I1170m4999b10141F4087g602
18511F863q54O44L78109a92636e9208H8286d06088A51516a27253p1691i0036o6986
18499a57022L5664E2960M8915c36955O574C7594P4623a12171A97195B0215e2711
18487A54491b65567H6129H768h8366p9845N5106M4380E1432a81A88901d215A24764
18474A03868d0424q2265J3350N2754k86766e8499j60575A74495e9229A16820h5323
18462A95360E1033a71095m0116B1331L2262P8758a45400H1920R4818a53444o3821
18451b17265C15426a93453A41135i614r5834i057k01978D4784a21526p3005R5071
$$ y = [-25632, -269910, 133392, -401700, -539179, 41043, -275936, -385925, 818, -101370, -267579, -250245, -186482, -111021, -80069, -168533, -366342, 91170, 46171, -210141, 64087, -7602, 6863, 6009, 6653, 384762, -192636, -59208, 88286, -406088, 151516, -127253, -198944, -90036, -157022, -121358, 52960, 101875, -336955, -330381, 37594, 112217, -112171, 197195, 20215, -52711, 154491, -265567, 86129, 8768, -88366, -168211, -113105, -68725, 51432, -181, 188901, -4215, 124764, 103868, -40424, -122689, -109339, -56585, -343351, -58499, -219074, 174495, -59229, 116820, -85323, 195360, 51033, -171095, -211211, 21331, 53593, 132351, -145400, 81920, 176738, -153444, -217265, 315426, -193453, 141135, -9614, -105448, -9057, -211035, 44784, -121526, -194531, -99460]
18440i9460A17291K09133C613d5616l22546j8849a38972B02329a99823B0573L8634
18429E9207c7142l16931h7314j38735q9857d8746a8483A03344g6845B08987A625
18417A30685P0495b0860k45481B7620a48080p8275A39274L66100f5749q5582n7892
18406b09223J03300k26950a33307k82069a12712c6192A48857a20927r0976F1523
18395B3846a61237j06161g8133B106J65606a04013B19428a7164k72322B47146
18384b57495B2054a17809j09655i285j83844L0969j51339E3935J22374a09313
18373a08724B2146O2284a01184j15739G8289g5935B4700N387c1525k52956l0821
18362c15302E1648b5692k06862h9656F093M0966e8853A61037A4568a14286M0027
$$ y = [-99460, 117291, 326424, 3613, -45616, -368162, -387011, -138972, 202329, -199823, 20573, 59207, -37142, -354073, -87314, -226049, -315906, -48746, -18483, 103344, -76845, 208987, 1625, 130685, 201180, -20860, -266341, 27620, -148080, -226355, 139274, 505374, -65749, -151331, -209223, -105923, -332873, -133307, -415376, -112712, -36192, 148857, -120927, -211903, 61523, 23846, -161237, -267398, -78133, 2106, 167712, -104013, 219428, -17164, -289486, 247146, -257495, 22054, -117809, -227464, -9285, -193129, -162160, -313499, 53935, 176309, -109313, -108724, 22146, 84430, -101184, -216923, 78289, -75935, 24700, 30087, -31525, -284481, -315302, 51648, -25692, -232554, -89656, 6093, 47059, -58853, 161037, 14568, -114286, -74259]
18351g4259A85810p2012j7950b62473a26283B61063H1368a39955B1280a19577
18340d7125B08238a14739B59511D3826a25729k68187a03582C61177F1067a06915
18329B5110O0415b2182C34303j41651a86274K8639B040b65509e6293A61569i3666
18317D848K49412A5124K49946a09202b3964n0908A51440a67249O6349B91849a3293
18305b11426B8096K53865b49281m2076a6794C30885A3639a49423j18635N1835
18295b16223i4845d269l5038k1605B88528a52624B61165q2351n9572c0445q4174
18284a14619L2751j78169g2088l12516f102A0820a60663g4238A39649a61353O1904
18273i9449C26166b08201J2544K5536B21941c73466h8807r322A31138n1845f8345
$$ y = [-74259, 185810, 113798, 95848, -262473, -126283, 261063, 81368, -139955, 21280, -119577, -47125, 208238, -114739, 259511, 43826, -125729, -393916, -103582, 361177, 61067, -106915, 25110, 85525, -22182, 334303, 192652, -186274, -157635, 2040, -265509, -56293, 161569, -93666, 4848, 254260, 15124, 265070, -109202, -23964, -74872, 151440, -167249, -100900, 291849, -13293, -211426, 28096, 281961, -249281, -291357, -16794, 330885, 13639, -149423, -268058, -216223, -94845, -4269, -39307, -60912, 288528, -152624, 261165, 178814, 119242, -30445, -114619, -81868, -260037, -72088, -384604, -6102, 10820, -160663, -74238, 139649, -161353, -99449, 326166, -208201, -195657, -170121, 221941, -373466, -88807, -98129, 131138, 79293, -68345]
18261c111C3274f350k37310B66270O9795H3946d3641m4802B88245B1821J01935
18250A23756d18106D4355Q8441i2292m6263R334K6193m8862A73173a05915G0801
18238F7023b27888j83491Q6068B4221e2881l8374j6274A70245b4459k74444j805
18227c00708H4785c22351I2312N2921a99724q1245J13727A32662a36911I3541
18216a74594P1991e570o3150p0456N1333L5239n2476l3896a4525D21179D379a65776
18203a7013A42506b81738B81325b34736L5875G3478a22294K3419A66908l6340
18193A30568c5068B75206P8393a44012l5394J4462l00864b28716F8846K8569i2391
18181h8812j12181A62330D5766b05176B10125b0619j48032l1371f3248j04642
$$ y = [-3111, 33274, -6350, -243660, 266270, 336065, 83946, -43641, -88443, 288245, 21821, 123756, -418106, 44355, 132796, -92292, -138555, -129221, -103028, -151890, 173173, -105915, 70801, 67023, -227888, -411379, -325311, 24221, -52881, -91255, -107529, 170245, -24459, -298903, -300708, 84785, -322351, 92312, 145233, -199724, -280969, -167242, 132662, -136911, 93541, -174594, -102603, -5570, -68720, -139176, -87843, -52604, -105080, -138976, -14525, 421179, 4379, -165776, -17013, 142506, -281738, 281325, -234736, -198861, 73478, -122294, -98875, 166908, 130568, -35068, 275206, 353599, -144012, -179406, -164944, -465808, -228716, 68846, 97415, -92391, -88812, -200993, 162330, 45766, -205176, 210125, -20619, -168651, -200022, -63248, -167890]
18171a67890b3466K776A72855i3972E6751K28141c442A26627b41859H1623a39481
18159b14759J06190E9709M6342h3466l6645N9073j07294f7191D16140G739b42162
18147C40145A50309a03813H1698i9450j9737B78907a30249l7284H9990g1296m1947
18136a13243C2508J39339a29481l7999M0994l7407D3832d4015l23718a69768j6800
18125a86568A98295p8310a65034A80628a94154B18080a62023E0444a33120k52463
18115c85583a36851B7530a21806A74913c7047A41154b48585g3330B06126E4446
18104A86625d12042K7924I4085b8273B25225i0304a8816j33921A75317c3676I933
18092a78714j33597b8355m9290A59075O3070c2474R556k951C0047a19586L0265
$$ y = [-167890, -23466, -20690, 172855, -93972, 56751, 284892, -3442, 126627, -241859, 81623, -139481, -214759, -108569, 59709, 106051, -83466, -120111, -61038, -168332, -67191, 416140, 7739, -242162, 340145, 150309, -103813, 81698, -99450, -119187, 278907, -130249, -167533, 89990, -71296, -113243, 32508, 171847, -129481, -167480, -126486, -163893, 43832, -44015, -367733, -169768, -186568, 198295, 119985, -165034, 180628, -194154, 218080, -162023, 50444, -133120, -385583, -136851, 27530, -121806, 174913, -37047, 141154, -248585, -73330, 206126, 54446, 186625, -412042, -384118, 94085, -28273, 225225, -90304, -18816, -152737, 175317, -33676, 9933, -178714, -312311, -28355, -77645, 159075, 222145, -32474, -22918, -25869, 30047, -119586, -89321]
18081h9321l8683K9103j28856D25609b2844k3869j38025A71948H649M10290q6901
18070C32038f6179b2704C15184j20309q8091d26363J71594E8360b73733c8078
18059d94147c3767A59584j9410c37589B0528M56822G8674P0520a71199j13389
18049b84588l5043j09123B08366I0010k8622J43245a9075q50A53626l4499b77453
18037A83818a12440B04504n9915K69566A45804E7345K91839A6738e51j48321A12996
18025C63189a32575D5743k639N1635L2959e187j02114M9273B0998c93766a79212
18013D443c23868P9674M7169f1123O530j06616m4178J00258F7733a77061c6902
18001a7441l9181n1007A99571g6366C8657a02364A48133a26495j10263L9052A15120
$$ y = [-89321, -128004, -98901, -227757, 425609, -22844, -46713, -184738, 171948, 8649, 418939, 332038, -66179, -22704, 315184, 194875, 106784, -426363, -254769, 58360, -273733, -38078, -494147, -33767, 159584, 140174, -337589, 20528, 477350, 78674, 149194, -171199, -284588, -319631, -428754, 208366, 90010, 61388, 204633, -19075, -19925, 153626, 119127, -277453, 183818, -112440, 204504, 144589, 414155, 145804, 57345, 349184, 16738, -551, -148872, 112996, 363189, -132575, 45743, 43104, 94739, 127698, -5187, -107301, -58028, 20998, -393766, -179212, 4443, -323868, -244194, -197025, -61123, -54593, -161209, -205387, -105129, 67733, -177061, -36902, -17441, -56622, -107629, 199571, -76366, 38657, -102364, 148133, -126495, -236758, -197706, 115120]
17989B70852A17297d7779b2323B09496k5429H0733k2704Q4350R3188q1657a22961
17977I8951M1033e6498f656j62044j92637j2323a3126A58970b69264F5176D592
17965f2048k36175j7603L1166I907f5241n1834j25173D865a25177A91152M94097
17954F85249a80663h8793k58036a72229B36334r7442b63983a08298F4055J85300
17944B49355j24321J12595I0098g1480A57027K33585a11284l523A46642b08591
17933b07208h0325B7653c6664I0885b251A32598C0505c0559B10341b4437A30845
17921A09536c57225A41555F2224a43153n6653I8374c22520J21142Q0984k39787
17911c60181B04805H003b31420g3465m9102A37406d6262A46658n4466B5919K05448
$$ y = [270852, 117297, -47779, -22323, 209496, 184067, 80733, 58029, 142379, 235567, 153910, -122961, 98951, 139984, -56498, -6656, -168700, -361337, -373660, -13126, 158970, -269264, 65176, 4592, -62048, -298223, -315826, -284660, 9907, -65241, -117075, -242248, 4865, -125177, 191152, 685249, -180663, -88793, -346829, -172229, 236334, 138892, -263983, -108298, 64055, 249355, 125034, 237629, 90098, -71480, 157027, 390612, -111284, -114807, 146642, -208591, -207208, -80325, 27653, -36664, 90885, -2251, 132598, 30505, -30559, 210341, -24437, 130845, 109536, -357225, 141555, 62224, -143153, -199806, 98374, -322520, -201378, -120394, -360181, 204805, 8003, -231420, -73465, -122567, 137406, -46262, 146658, 92192, 25919, 231367]
17900B31367m1031q8125m9618N1621h3762B49131G6026b10374j0432P7890p6269
17889b19185C38318A31212a51009L2068o9753g6625m2166e1829l12309i7148n0089
17878a47237E05845j47651a31940q487O8197F6846J18463g4408j1506o8728k37130
17867c91772J86063d1934B36154B5723a12630E1692a49994C39027a32985j67756
17857c00741A39553M0973a15868A20847M9842A629a64249D3504j0326L4063h5453
17845D23582E6519b576B72421b53549A1519a46979A47958a16858F3079C0860b50001
17833a63359n2814d8895j52343L2632O130N7038a4620j97971F4455J23696a35622
17821a24893A46959a98751C11069e52631A62536E1624a56231j72511B03645q0797
$$ y = [231367, 190336, 102211, 52593, 104214, -83762, 249131, 76026, -210374, -220806, -142916, -219185, 338318, 131212, -151009, -118941, -188694, -76625, -118791, -51829, -364138, -97148, -147237, 505845, 358194, -131940, -140427, -72230, 66846, 185309, -74408, -85914, -154642, -391772, -205709, -41934, 236154, 25723, -112630, 51692, -149994, 339027, -132985, -300741, 139553, 180526, -115868, 120847, 170689, 1629, -164249, 43504, 33178, 67241, -85453, 423582, 56519, -2576, 272421, -253549, 11519, -146979, 147958, -116858, 63079, 30860, -250001, -163359, -216173, -48895, -201238, -168606, -162476, -105438, -14620, -212591, 64455, 188151, -135622, -124893, 146959, -198751, 311069, -552631, 162536, 51624, -156231, -328742, 203645, 122848]
17811A22848K8573b16935F9191J07415c0766n3508C29294a48742B23277H1528
17800c08067a00149A25023G674a16913j7132D8412J79683g6322j31403E8895b11401
17788B15429b38832C15J23156J20570a37082O96e5050B93149a87169B44710d9635
17776b84301A47026J3161n1562a4071A99994n9922a39144q3098a02521L9756A19255
17764i6090B48001e4445j76498c8435j62481A1338L0831n570A0327O2592Q0287
17753A53206p274c6466k4170f988J502C69664g1487j9647j79460J04410b0074
17741b445r6300B12975I5264K06959c16047B65145b09850h8416K6424D14982a07575
17729A42685F4953f1012A28028b48974A62906L6937i7712F4471j8946f272A04131
$$ y = [122848, 151421, -216935, 69191, 176606, -30766, -84274, 329294, -148742, 223277, 81528, -308067, -100149, 125023, 7674, -116913, -134045, 48412, 228095, -76322, -207725, 58895, -211401, 215429, -238832, 315, 123471, 244041, -137082, -136386, -55050, 293149, -187169, 244710, -49635, -284301, 147026, 160187, 108625, -14071, 199994, 140072, -139144, -222242, -102521, -62765, 119255, -96090, 248001, -54445, -230943, -38435, -200916, 11338, 42169, 36599, 10327, 72919, 153206, 145932, -36466, -60636, -6988, -5486, 369664, -71487, -91134, -270594, -166184, -20074, -2445, -98745, 212975, 95264, 302223, -316047, 265145, -209850, -88416, -61992, 414982, -107575, 142685, 64953, -61012, 128028, -248974, 162906, 199843, -97712, 64471, 45525, -6272, 104131]
17717B18351a20074C7020J05091g9635B85176a69604h2102A9752K35512j10174
17707A45090N975A1554a49711l2971M360b9972B0139a83143F0598O8066J56456
17696B85120j32885f0647m3892l9518L8256H898J41990g5300A83660K1981g5477
17684I7678o585N3305O2773a62794l7549A35829n6520M6724a54684D77262j63090
17673C14172a41193L2094j93763M6076A54267k2156O9236J0279P1244a56543B2610
17661b97815j9098A75962p4630Q5234a52164B73866B2849J33776a9836G3253g7599
17649I1680J60029A0830K03462C5683J2450L13944a35686A92319G2430J98962
17639B71392j9904a26543A53814k7989b14755O0551f5361a8694o5875A21666C4118
$$ y = [218351, -120074, 37020, 142111, -79635, 285176, -169604, -82102, 19752, 255264, 145090, 151065, 11554, -149711, -182682, -178322, -29972, 20139, -183143, 60598, 128664, 285120, 152235, -60647, -104539, -144057, -105801, 8898, 150888, -75300, 183660, 205641, -75477, 97678, 91093, 144398, 207171, -162794, -200343, 135829, 79309, 126033, -154684, 477262, 314172, -141193, -109099, -302862, -256786, 154267, 132111, 201347, 211626, 282870, -156543, 22610, -297815, -316913, 175962, 101332, 186566, -152164, 273866, 22849, 156625, -19836, 73253, -77599, 91680, 251709, 10830, 214292, 35683, 48133, 362077, -135686, 192319, 72430, 271392, 251488, -126543, 153814, 125825, -214755, -154204, -65361, -18694, -84569, 121666, 34118]
17627b23545B91595a74444C02039a72166A51339l9171k9750a14318B12528a20068
17616A03447b2677A372J2042a67261B0668K41647e8384k65988C3235g4627B13073
17604A14110R5660M3979a32652G4218b3481A54635j8022b7839L888C01517g6004
17592c8471A84867a40913p5771C76893B0214c3375k0158H1031g1850A56500b99476
17580i9202k1546j62222B69333I0515e337B82457g9998b6254G0207R8728a4360
17568e1506A43108b22460e8156A69097i9035B6933N18152i7970D701h5274A00818
17556B53498j05382j0211d0022h872B21656J0389a34566m6291K7911N8433G4310
17544g4485I4428k1658K36933b79290C16938b07094h0047a0411B33887A04251
$$ y = [-223545, 291595, -174444, 302039, -172166, 151339, 112168, 82418, -114318, 212528, -120068, 103447, -22677, 1372, 13414, -167261, 20668, 262315, -58384, -324372, 33235, -74627, 213073, 114110, 209770, 253749, -132652, 74218, -23481, 154635, 136613, -27839, -23951, 301517, -76004, -38471, 184867, -140913, -216684, 376893, 20214, -33375, -53533, 81031, -71850, 156500, -299476, -99202, -120748, -282970, 269333, 90515, -5337, 282457, -79998, -26254, 70207, 168935, -14360, -51506, 143108, -222460, -58156, 169097, -99035, 26933, 545085, -97970, 4701, -85274, 100818, 253498, 148116, 137905, -40022, -8872, 221656, 232045, -134566, -180857, -152946, -94513, 74310, -74485, 94428, 72770, 309703, -279290, 316938, -207094, -80047, -10411, 233887, 104251]
17533A0644K87216a45623A7655b9929F8791M0992A4982J84894j8057E6258M5735
17522A01993B3120K36614C7955J67499O8331a9121k68928A87056H1723L65151
17512D46874A56113P0800c4458C18505n3641F5714M3707J13554J73999p3979L9139
17501C62134H4508j377J03377a45799A04562a21577e4361A3451P5205K3699K48233
17490C60588c9082A78844b27701c3471B84871L2498i2352M3937F32276j63181
17480D69095a44756A16446J49950a62026k5225A89560j0736j3907C8209R1753
17470A29962O4481h3446C50773A26081A1131b4526I727J328J21576i4579q4102
17459a78681A09034J85611a54631q5007B79337j06528G3972K64168a4265C76518
$$ y = [10644, 297860, -145623, 17655, -29929, 68791, 109783, 14982, 199876, 181819, 56258, 101993, 23120, 259734, 37955, 205454, 273785, -19121, -288049, 187056, 81723, 446874, 156113, 226913, -34458, 318505, 264864, 65714, 109421, 222975, 396974, 322995, 362134, 84508, 83131, 186508, -145799, 104562, -121577, -54361, 13451, 88656, 112355, 360588, -39082, 178844, -227701, -33471, 284871, 317369, -92352, -48415, 632276, 469095, -144756, 116446, 266396, -162026, -187251, 189560, 178824, 164917, 38209, 129962, 194443, -83446, 350773, 126081, 11131, -24526, 9727, 11055, 132631, -94579, -178681, 109034, 294645, -154631, -239638, 279337, 172809, 73972, 338140, -14265, 376518]
17448B75629j09224K09314j42189L22270A99758r273n9867J98269A25197J73627
17438B98824j00049m1151N3750L3456c5437B66020n7222j4572q161Q2895a72560
17426B45739J34579E2674J70951J5448J08976p6589B1245J30194K36952k6778
17416C61613B8693a28153D35844B15746K01102A41110o8565b7049A91771a7496
17405A27776N6473q0559j1202O3643b27584D02883j28607d4400A04513O8340l4
17394A72819C8152J30816L4660N9658b1205A93174J2881L76073a79943D25718
17383c80434D1807J01189a3048A34770L8251a59306N2846J8142K3024E4168K01207
17372B55375L52850k87010B4851J48367M4827J52771J574f8909I2829e1026k685
$$ y = [275629, 166405, 375719, 233530, 555800, 199758, 190485, 130618, 328887, 125197, 298824, 198775, 157624, 211374, 244830, -35437, 266020, 208798, 194226, 186065, 268960, -172560, 245739, 380318, 52674, 223625, 239073, 348049, 271460, 21245, 151439, 388391, 361613, 28693, -128153, 435844, 215746, 416848, 141110, 72545, -27049, 191771, -17496, 127776, 184249, 103690, 92488, 156131, -227584, 402883, 274276, -44400, 104513, 172853, 172819, 38152, 168968, 203628, 263286, -21205, 193174, 206055, 582128, -179943, 425718, -380434, 41807, 142996, -13048, 134770, 173021, -159306, -106460, -88318, -65294, 54168, 255375, 608225, 321215, 24851, 173218, 218045, 370816, 372390, -68909, 92829, -51026, -53711]
17361e3711B48158D0441g7561B83291a25035B96585A12476K79537A73993b5073
17350C08563R4209f7663o3585K3089H4297L34854k05002C8865r291P6341K3014
17339A28929M32502i9647E13650B47688n5258J64608c6549j08264C60487E3759
17328A74956b01949i692A46530J98719l7912A1470K83030A27950J65225j26205
17318A66970J93128A05423J55512r8415o2580J21063g561B16448g9857C25879
17307I2379J5001J59616A01062F232M92451A62392J50085j44695p2757J21604
17297B16629c9318B39086j05474Q5668a51016B85019o8435j05586J91858g5831
17286C82209j07536A36468L6902k8244J5889K649J29438d49355G2326i4683C0941
$$ y = [-53711, 248158, 40441, -77561, 283291, -125035, 296585, 112476, 392013, 173993, -25073, 308563, 402772, -67663, -131248, -108159, 84297, 419151, 214149, 38865, 29574, 105915, 128929, 561431, -99647, 513650, 247688, 192430, 357038, -36549, -144813, 360487, 53759, 174956, -201949, -9692, 146530, 345249, 307337, 11470, 294500, 127950, 293175, 166970, 360098, 105423, 260935, 162520, 99940, 221003, -7561, 216448, -79857, 325879, 92379, 107380, 266996, 101062, 6232, 498683, 162392, 312477, 167782, 95025, 216629, -39318, 239086, 133612, 219280, -151016, 285019, 216584, 110998, 302856, -75831, 382209, 274673, 136468, 173370, 145126, 161015, 163664, 293102, -449355, 72326, -94683, 30941]
17274C26417J09251j33386G1158K60336j14743C6439J10342a62389a7387A76678
17263B49667P5379o2997o6392J94094A37192J18169j13363c2444k10345C76560
17252B37276J64480J28117j99676A4727N1795O2496i1260G8635K77142j23572
17242B32205Q8370A29664a4791B68158m5785I8704A3893f1292C13130j00453p8330
17231A34347P0406M6221L4077J73053j91352j4364q3466K3795R6468R7882A46497
17219B5952K39092O217F4197k9828N07424j9839a00545A16179J59670G4607J67723
17208B42330j3348l664k1299L33085A2580J41830h5817J7617E16391B37104N2353
17197B89457e3174D7744K07600A8410L73233C3508M56324q2685G3449p569j0486
$$ y = [326417, 435668, 302282, 71158, 331494, 216751, 36439, 146781, -162389, -17387, 176678, 249667, 325046, 262049, 195657, 389751, 137192, 255361, 141998, -32444, -242789, 376560, 237276, 401756, 529873, 330197, 14727, 66522, 129018, -91260, 78635, 355777, 232205, 320575, 129664, -14791, 268158, 222373, 98704, 13893, -61292, 313130, 212677, 134347, 204753, 250974, 285051, 458104, 266752, 252388, 168922, 192717, 289185, 387067, 146497, 25952, 265044, 271261, 64197, 34369, 541793, 521954, -100545, 116179, 275849, 74607, 242330, 228982, 225318, 204019, 537104, 12580, 154410, -85817, -68200, 516391, 237104, 289457, -53174, 47744, 255344, 18410, 391643, 33508, 489832, 407147, 73449, 65880, 55394]
17186E5394J3494P9115L34385J6841A99185m7294e4079D41308j78716E6281K44496
17175C00777M0617P519B8217b645I8872L25095A32749a15773C66967q3557G0616
17163F42996B41823n2773Q7764j7797j5707J96663J03279B61957N97744C93891
17152C37082L5890J839j74092K76946A76876J89534p2394G6161L53912K5777j10082
17141C45768h674C73161O2775j76670j11511K52213R3684M4016j67032o0583J27635
17130D37688j21912o4610H1791K71796l2791L5738A61312K63054Q6687n4062B04281
17118C09512O6065A26122M36796j72564j38223O2844q6699J07529r2569K02730
17108D45966B09980Q7930K4585j36357Q4437d1928C02076A07201N65615B80309
$$ y = [55394, 68888, 148003, 482388, 499229, 199185, 151891, -54079, 441308, 262592, 56281, 300777, 341394, 348913, 28217, -2645, 98872, 423967, 132749, -115773, 366967, 283410, 70616, 642996, 241823, 189050, 276814, 259017, 243310, 439973, 543252, 261957, 859701, 393891, 337082, 372972, 374811, 200719, 477665, 176876, 366410, 294016, 76161, 430073, 455850, 345768, -8674, 373161, 435936, 259266, 147755, 399968, 493652, 537668, 370636, 310053, 437688, 315776, 251166, 81791, 353587, 320796, 356534, 161312, 424366, 511053, 456991, 204281, 309512, 375577, 126122, 562918, 390354, 252131, 314975, 228276, 335805, 243236, 445966, 209980, 297910, 322495, 186138, 270575, -41928, 302076, 107201, 672816, 280309]
17097D23971K7993H7512N30032k88896A57141J34992P7729J13208F2465N34243
17087E96708j83257j65718M3550N7808p4468r8622J94589J60055K2311L7354M8988
17076F39298l07038K62838j59652A91197Q3689J31659J40858I8246K46359K0119
17066C64724N2892l2314M40205r0355k32048L9634l1221j44439J61000j08266
17056D19812r3403K73926J41023O7058l84181J44699J29096E8495L10592L03671
17046F72758l220K14042k11357J76370k09609j85716O9311m9168J45817K4651
17036F43879l2515K8384l2820j83201K73690j15893R6513k78188N95283m08474
17026E86658N2041k70098L50139j83077P3203r3867K02223L773j20104K62170
$$ y = [423971, 451964, 87512, 617544, 328648, 157141, 292133, 369862, 483070, 62465, 596708, 413451, 247733, 291283, 349091, 274623, 176001, 370590, 530645, 552956, 590310, 639298, 332260, 595098, 435446, 191197, 274886, 406545, 547403, 98246, 344605, 364724, 417616, 385302, 825507, 735152, 503104, 542738, 511517, 367078, 528078, 419812, 326409, 600335, 741358, 808416, 424235, 568934, 698030, 58495, 369087, 672758, 669538, 883580, 672223, 848593, 638984, 453268, 522579, 473411, 619228, 643879, 611364, 639748, 606928, 423727, 697417, 581524, 678037, 399849, 995132, 586658, 638699, 368601, 718740, 535663, 608866, 514999, 717222, 720995, 600891, 863061]
17016H63061J3065R811l09714L74160m27227j2667K55079R7409k9911L7003k99751
17005E70318J92068M1614j09925p5232K36820j68423k6820K07078m388k05849
16995F57261o6334J1474J4358L20039k30971J97136l59909M10733Q2345l53405
16985F82727K80384m28448L89623j0439K8927j33165p437K42786m9066j24530
16975H71362R7251l18768K96893p1092K147N0242p0494n502p3442L62706j96148
16964I45155l7184J32663j01396J4969K78870n9881o6885j59540O7622J68147
16954A182540j18341N059j51705R0427j5602L18376k03469j0663K05602l5308
16944A266916k08194K40015R43P6603j32578L9548m016l4029L82021l91347p1615
$$ y = [863061, 876126, 885937, 576223, 950383, 523156, 510489, 765568, 862977, 833066, 870069, 570318, 762386, 804000, 694075, 618843, 855663, 687240, 660420, 867498, 863110, 657261, 590927, 602401, 616759, 936798, 705827, 902963, 543054, 953787, 1036132, 682727, 963111, 534663, 924286, 913847, 942774, 809609, 802172, 1044958, 995892, 871362, 968613, 649845, 946738, 875646, 877793, 928035, 857541, 852039, 778597, 1141303, 945155, 907971, 1040634, 939238, 954207, 1233077, 1173196, 1106311, 946771, 1014393, 1182540, 1064199, 1069258, 917553, 1007980, 992378, 1310754, 1107285, 1096622, 1302224, 1266916, 1058722, 1298737, 1299680, 1376283, 1243705, 1283253, 1279237, 1245208, 1627229, 1235882, 1164267]
16933A164267N91493l43597l3714n4038k18858J37532K34716O7484q6859k43938
16923A214488J65494j00920R6957P678j23131J74258L00259Q829k49028m4242
16913A450642J69033J67743N1747l54180M48869l15144M5918J08040j92901K36490
16903A816257J93076l27345L6749J56503J11625K16113m3545j53257j10343o7218
16893A828615R4086O2400L40160l87093J49262m2840q7230K62339M5170M0281
16883B305150m68719N81217J6229K261L50477k23626j67603k7885R6873N9201
16873B523575P3669K38040j00770J84955l15632K44951k04206L83230k47471p3757
16863B706584N4586K90804o2407o4428M05039l32444R4800M26495l45798L63457
$$ y = [1164267, 1755760, 1412163, 1378449, 1324411, 1105553, 1243085, 1477801, 1545285, 1458426, 1214488, 1379982, 1279062, 1376019, 1383697, 1260566, 1434824, 1735083, 1743912, 1494884, 1450642, 1619675, 1787418, 1839165, 1484985, 1933854, 1618710, 1664628, 1772668, 1579767, 1816257, 2009333, 1681988, 1718737, 1875240, 1986865, 2202978, 2159433, 2006176, 1895833, 1828615, 1922701, 1985101, 2325261, 1938168, 2087430, 2044590, 1957360, 2219699, 2264869, 2305150, 1836431, 2417648, 2433877, 2436138, 2786615, 2562989, 2395386, 2367501, 2464374, 2523575, 2597244, 2835284, 2734514, 2919469, 2603837, 2848788, 2644582, 3027812, 2780341, 2706584, 2761170, 3051974, 2989567, 2925139, 3330178, 2997734, 3092534, 3519029, 3173231, 3536688]
16853C536688O5167J4884m09842M58406l00472J76277L70436k01002k26254N05826
16843C990114j10585R0960K50684J760j74879K67936K04983k09867L0888J55640
16833D497634j18634K19799k4689K90077K54052J64205k48798M4241M41819N856
16823E525562j64517L29863N4795P8533N1626J11648N91N60444K2040J48298k01175
16812F517708O82204l08067J51261r220L38282L27731J13124L561N70224K63491
16802H650299j4373J22616j90723O30723L91176j11312L91752N75862Q3005J89049
16792A0718074J00435M55034j35153P50666K50574J81975O99823M43850j23598
16783A3341680O58435o5267P55151K66189M68520M44358P21833M57394J96760
$$ y = [3536688, 3601855, 3616739, 3206897, 3665303, 3364831, 3541108, 3911544, 3710542, 3484288, 3990114, 3879529, 3970489, 4221173, 4222933, 4048054, 4315990, 4520973, 4311106, 4341994, 4497634, 4379000, 4598799, 4574110, 4864187, 5118239, 5282444, 5033646, 5077887, 5519706, 5525562, 5361045, 5690908, 5745703, 5824236, 5875862, 5987510, 5988101, 6548545, 6570585, 6718883, 6517708, 7199912, 6891845, 7043106, 7033886, 7372168, 7699899, 7813023, 7816584, 8386808, 8650299, 8635926, 8758542, 8567819, 9198542, 9589718, 9478406, 9870158, 10446020, 10529025, 10718074, 10818509, 11273543, 11138390, 11889056, 12139630, 12321605, 13021428, 13465278, 13341680, 14000115, 13934848, 14689999, 14956188, 15424708, 15869066, 16590899, 17048293, 17245053]
16774A7245053J166630M17964N84300L56632J185922M79954O08663J100285P56724
16765B3902127P19101R95806J119703Q61843J362735O60119J187255J499299J344569
16756C3652557J395893J555826J545337J840059J580059J753923K207753K709950
16748D8241357K072248K297618K717204K589590L150076L202817L233202L853923
16740G1358035L555339M490897M300247M381092M755999N597798N348034N880149
16732A09667590O139718O727887O360133P013913O227656P193413P028655O593874
16724A62952839O173039N809065N297761L997239L616625K328581J197628j8974
16716A91353803j156901k454006l510810m778346n255886o022930o672071p123257
$$ y = [17245053, 18411683, 18829647, 19413947, 19770579, 20956501, 21436455, 22045118, 23145403, 23902127, 24621228, 25617034, 26736737, 27598580, 28961315, 29621434, 30808689, 32307988, 33652557, 35048450, 36604276, 38149613, 39989672, 41569731, 43323654, 45531407, 48241357, 50313605, 52611223, 55328427, 57918017, 61068093, 64270910, 67504112, 71358035, 74913374, 79404271, 83704518, 88085610, 92841609, 98439407, 103787441, 109667590, 115807308, 122535195, 128895328, 135909241, 142136897, 149330310, 156358965, 162952839, 169125878, 174934943, 180232704, 184229943, 187846568, 190175149, 191372777, 191353803, 190196902, 187742896, 184232086, 179453740, 174197854, 168174924, 161502853, 154379596]
16708A54379596p256707p126796p542465o849342o714664o616423o231444o218644
16700I9823111o034056m921045n091051m544228m736662m150268l764485l738189
16692F2843127l280603l081822l053076k422560l019943k138136k288265j906870
16684D1651852j908157k133549j650771j614266j074433k096106r90847j227044
16676B8956679j481436j024003j141969r52174q90521o46585j046565r74071m24888
16667B0374467p15301r90140o20081r02319j6347r20979o04811n19768l35865
16658A4748856j99781l17531p79046n06708l16683l92718j36621m35238k94859
16649A1369671l34720l97479O008m08575l26874n52146J90740o09698j11763j56983
$$ y = [154379596, 147122889, 139996093, 132453628, 125604286, 118889622, 112273199, 106041755, 99823111, 93789055, 88868010, 83776959, 79232731, 74496069, 70345801, 66581316, 62843127, 59562524, 56480702, 53427626, 51005066, 47985123, 45846987, 43558722, 41651852, 39743695, 37610146, 35959375, 34345109, 33270676, 31174570, 30183723, 28956679, 27475243, 26451240, 25309271, 24357097, 23466576, 22819991, 21773426, 20799355, 20374467, 19659166, 18669026, 18048945, 17146626, 17130279, 16209300, 15604489, 15084721, 14748856, 14549075, 14231544, 13452498, 12945790, 12629107, 12236389, 12099768, 11664530, 11369671, 11034951, 10637472, 10643480, 10234905, 9908031, 9355885, 9546625, 8936927, 8825164, 8668181]
16639H668181r8269m93435N854n25268N7070L8818k52820m32230J30539l65338
16629F733102J44350k49981k62814j94531Q5025p9042j72805n13376M56091l21991
16619E624028j96503o7543k62000r8710J87392l90521J13072k32725p631J43992
16609D812851k08768J83113m78192M8140m88368L03242J96743m08484K55725j46619
16599D069383r9127k83398j60807O6709J68112l04652p5370j66644K55152j77035
16589C292323n3775k23825K28196k61647k1121M36547n69425l5313n8926J40272
16579B873306J37328k71406j54350K78078k25594j70519O8596j20078O7702k39421
16569B243642J75383m4245n0924M56458p67442M88329O918k99053j27168m4556
$$ y = [8668181, 8569912, 8076477, 8082331, 7557063, 7614133, 7652951, 7400131, 6967901, 7098440, 6733102, 6877452, 6627471, 6364657, 6170126, 6255151, 6176109, 6003304, 5489928, 5946019, 5624028, 5427525, 5359982, 5097982, 4999272, 5186664, 4796143, 4909215, 4676490, 4668859, 4812851, 4604083, 4787196, 4309004, 4357144, 3868776, 4172018, 4368761, 3960277, 4216002, 4069383, 3970256, 3686858, 3526051, 3592760, 3760872, 3456220, 3380850, 3214206, 3469358, 3292323, 3238548, 3014723, 3242919, 2981272, 2960151, 3396698, 2827273, 2791960, 2733034, 2873306, 3010634, 2739228, 2584878, 2862956, 2637362, 2466843, 2535439, 2415361, 2483063, 2243642, 2419025, 2374780, 2323856, 2780314, 2012872, 2501201, 2508119, 2209066, 2081898, 2037342]
16559B037342n4589m2134K20213j92589J02619j91766J91644m7403n4766j57542
16549A811029k99519K96579J7159q2491j056K383k17059K00647M8459k98657n2888
16538A424586N77796j87261j94394j48128j50403J54218J58812j71960r1356n4282
16528A317628J19678Q6655r892k41915j78559J6023J89777r9044J08500J37860
16518A446711k00486j25289M6435M99454n37886j73310L66289k00607l6018J61112
16508A246405j621l3943N6061l78194L70653Q1897j48602j28500K39897p4466
16498A229587l80551L22837l13073P4850p8497K63108j00886K03246P0471m80401
16488H10691j05264M58252J53080n02223n0087L91284k08365j17259l3957K9270
$$ y = [2037342, 1982753, 1940619, 2160832, 1968243, 2070862, 1879096, 2070740, 2023337, 1968571, 1811029, 1511510, 1808089, 1825248, 1742757, 1741701, 1744084, 1527025, 1727672, 1776131, 1477474, 1424586, 2002382, 1815121, 1620727, 1472599, 1322196, 1476414, 1635226, 1463266, 1371910, 1317628, 1437306, 1523961, 1514069, 1272154, 1093595, 1109618, 1299395, 1200351, 1308851, 1446711, 1246225, 1120936, 1167371, 1666825, 1128939, 955629, 1321918, 1121311, 1085293, 1246405, 1244784, 1210841, 1266902, 888708, 1259361, 1341258, 1192656, 1064156, 1304053, 1229587, 849036, 1171873, 858800, 933650, 855153, 1118261, 1017375, 1220621, 1291092, 810691, 705427, 1163679, 1316759, 814536, 764449, 1155733, 947368, 830109, 796152, 825422]
16478H25422L81120j90536l37748R2238j3978J84166P960L5041L9001j02746C63481
16466G19325M89202k01714j43104K22013j48787n6755l13331L64338k6802l15550
16456E88835J00232L8954J42917l30119M18854k00969J1703O991O1004o3116j97465
16445E77821m4322J01938J70386o1627K87652j02275D46329P1927J92946j40480
16435E70722K28903j28159j53515L20482k30701J4800j1620K9996j84338j73763
16425B82807N89095k97547M7214k44126J43433q9136J75814L37045C26655K06903
16415E33558J3841j13551P4587J9626K21390K92793n12214M5698j9871l9296J20850
16404F37411k98139J38279j9114J56151k20403J20731k6069R5571J21108K3796
$$ y = [825422, 1206542, 1016006, 678258, 770496, 756518, 940684, 948644, 983685, 1022686, 919940, 363481, 719325, 1208527, 1006813, 863709, 1085722, 936935, 880180, 566849, 931187, 904385, 588835, 689067, 728021, 870938, 540819, 959673, 758704, 770407, 777398, 838402, 775286, 577821, 533499, 635437, 805823, 744196, 1031848, 929573, 446329, 518256, 711202, 570722, 799625, 671466, 517951, 838433, 607732, 622532, 610912, 640908, 456570, 282807, 871902, 574355, 621569, 377443, 520876, 431740, 607554, 944599, 326655, 533558, 547399, 433848, 508435, 528061, 749451, 1042244, 530030, 575728, 555857, 516561, 637411, 339272, 477551, 458437, 614588, 394185, 514916, 488847, 584418, 705526, 729322]
16394G29322J37253D01623j12822l146J12773P697L7001o26M763L16407l50701
16383D12969C9035L44638J40529N8494k33408b785C72721A49459K59753m7704
16373C61508K2948p6347H2567K91745p2588N63129c2036C98449j46847M63183
16363G14785j94588n3543J36282B30639E3982J49501F6471M66291N3730B17520
16352C64222j2557r1968K68975A76407M71564C17745K92327k36649k3822a0527
16341A32037M77394k86436a867A28611J65936J29386m404j01745A56708J45552
16331C02260L3919L96154a54906E63153j68815A41626P9349N4572K49090c5467
16320D37931A49653L23169Q6331n8059B48167r8660M0168J19595A19500L31034
$$ y = [729322, 866575, 401623, 288801, 285655, 398428, 406125, 443126, 442500, 447263, 763670, 412969, 39035, 383673, 524202, 582696, 349288, -2785, 372721, 149459, 409212, 361508, 384456, 308109, 82567, 374312, 301724, 864853, -32036, 398449, 251602, 714785, 520197, 466654, 602936, 230639, 53982, 203483, 66471, 532762, 586492, 217520, 364222, 351665, 259697, 528672, 176407, 647971, 317745, 610072, 373423, 349601, -10527, 132037, 609431, 322995, -1867, 128611, 294547, 423933, 419529, 317784, 156708, 302260, 336179, 732333, -154906, 563153, 394338, 141626, 220975, 275547, 524637, -35467, 437931, 149653, 472822, 559153, 501094, 248167, 149507, 189675, 309270, 119500, 450534]
16310D50534n711j52880D8795J0096L86627k3982A29964K56744j81540a52233
16299C28489R305R0894A95458J79292A37851N2942J5425k2088l6614K7006M838
16288A79360K2897E9284L50595o2533n5563K62456B62294K4147j0135p488M29503
16277F98321B6264P8124L10577b05498A59103J23961l2135p7075J80514a08969
16266B27491B1718J82338K46296j44573j10680l1396O6697E3458L28443c0364
16255F77695B62484R8006B3965K63375r3537J80225E0831L58532j22716b21624
16244a9798C91882c8332A61857J59278O5027j42283K92498A19352L27122A78355
16233D4373j6971d9959G739K41061e3208C26293j40262Q3536A22048a56842C22574
$$ y = [450534, 444823, 291943, 48795, 58891, 445518, 421536, 129964, 386708, 205168, -152233, 328489, 337794, 428688, 195458, 374750, 137851, 190793, 206218, 184130, 147516, 174522, 179360, 202257, 59284, 409879, 347346, 291783, 554239, 262294, 286441, 276306, 268818, 698321, 26264, 104388, 414965, -205498, 159103, 283064, 250929, 173854, 354368, -108969, 227491, 21718, 204056, 450352, 305779, 195099, 163703, 230400, 53458, 381901, -30364, 677695, 262484, 360490, 23965, 287340, 193803, 374028, 50831, 409363, 286647, -221624, -19798, 391882, -38332, 161857, 321135, 386162, 243879, 536377, 119352, 446474, 178355, 44373, 27402, -49959, 7739, 248800, -53208, 326293, 186031, 269567, 122048, -156842, 322574]
16221A04915J75150b8753C46695l9982J1495j07145a3738m7166B23262b31158
16210A74163o1246E0514R9705a16041K8647A04047j6325a3385j20334B11561a25994
16198D07018j35196p8562J28485Q9238A84434o0531j1245J78346h7772a4320C3276
16186B00074a44967F6384d0119A71027b65989I8623A7299l754Q7741k7599J74262
16175B47949a02566c7985B54878H6431Q3846R7439K1530A14723J5614l4300J12183
16164B08220J62488b7999B83900J94374A46682K63185E6379J13257M4685a3852
16153C13096j03676I560J34825a34570b3367C58781A26148J02259O8884A11123
16142b61054E925a3296p2434k7675A12774K97524o2139a1A48620b96139a42481
$$ y = [104915, 280065, -28753, 346695, 306713, 318208, 211063, -13738, -60904, 223262, -231158, 174163, 112917, 50514, 150219, -116041, -87394, 104047, 87722, -13385, -133719, 211561, -125994, 407018, 271822, 193260, 321745, 410983, 184434, 123903, 112658, 291004, -87772, -14320, 33276, 200074, -144967, 66384, -40119, 171027, -265989, 98623, 17299, 13545, 101286, 73687, 247949, -102566, -37985, 254878, 86431, 170277, 267716, 289246, 114723, 130337, 96037, 208220, 370708, -27999, 283900, 478274, 146682, 409867, 56379, 169636, 214321, -13852, 313096, 209420, 9560, 144385, -134570, -23367, 358781, 126148, 228407, 297291, 111123, -261054, 5925, -13296, -85730, -113405, 112774, 410298, 348159, -11, 148620, -296139, -142481]
16130A33112b25911C1873i565r8438L8830A11064J73058a51939f5837A03845L534
16119A07379K19369e3549A92429a29067B34333A3330J44019K8726d35602a00578
16108A47042N7390b19405D19597A52144L38462D7891A4397P2128M16706H0630
16097B12616G5498K02848C7178J36951E4808L08300b04401D460Q3375c11808i1796
16085e3689C37405g1774B01373o3708a95577M9104j66315J40261e9567A00543
16074B17497a43426A11259k480d8799K2192A10671h9194b3397D29190i270A3060
16062d0666D3935R3142b63030J00478P3937E0530a54662D51722a52525C2337L69635
16051D01972B2123K5448J64993B9912G634K36683a04648J2037A68776b49035o7584
$$ y = [133112, -225911, 31873, -9565, -108003, -69173, 111064, 284122, -151939, -65837, 103845, 107379, 326748, -53549, 192429, -129067, 234333, 13330, 157349, 186075, -435602, -100578, 147042, 204432, -219405, 419597, 152144, 490606, 47891, 14397, 86525, 503231, 80630, 212616, 75498, 278346, 37178, 174129, 54808, 363108, -204401, 4460, 87835, -311808, -91796, -53689, 337405, -71774, 201373, 137665, -195577, -146473, -312788, -172527, -59567, 100543, 217497, -143426, 111259, 108779, -48799, -26607, 110671, -89194, -23397, 429190, -9270, 13060, -40666, 43935, 137077, -263030, -162552, -88615, 50530, -154662, 451722, -152525, 32337, 401972, 22123, 47571, 212564, 29912, 7634, 244317, -104648, -92611, 168776, -249035, -316619]
16040c16619d5226j06856F8695a05739C54508j63416a23284B42827f8482A18113
16029I7791c49394a15791I9309C9873J33179a89900A78783m4762a57552A01404
16018B5107g7340c224A14136m2306G579a30226b4756C9438d0673A05736a91709
16006b4035B18654I8773Q3750h5960I7765d5417A44416c06298b3216A94238B1922
15994A47506J42214c09406A80000F0181j5707f9813B8270K0646b1527C3435K22353
15983B55788G8168A2320C070J36175f9143j54576A51708b42570j18869J71134
15973a90305A19877J57770F126c3399j75348d9335g455k27301b742o9582P025
15962f5299C18019A4274a30716D11935A66497J44018a47807n7545I3300c32039
$$ y = [-316619, -45226, -152082, 68695, -105739, 354508, 191092, -123284, 242827, -68482, 118113, 97791, -349394, -115791, 99309, 39873, 173052, -189900, 178783, 134021, -157552, 101404, 25107, -77340, -3224, 114136, 71830, 7579, -130226, -24756, 39438, -40673, 105736, -191709, -24035, 218654, 98773, 182523, -85960, 97765, -45417, 144416, -306298, -23216, 194238, 21922, 147506, 289720, -309406, 180000, 60181, 44474, -69813, 28270, 48916, -21527, 33435, 255788, 78168, 12320, 3070, 139245, -69143, -223719, 151708, -242570, -361439, -190305, 119877, 277647, 6126, -33399, -208747, -49335, -7455, -234756, -2742, -72324, -65299, 318019, 14274, -130716, 411935, 166497, 310515, -147807, -205352, 93300, -332039]
15951a36762A76116a41773O1191b3925l3709A47864B0198J03228a57263B751J04686
15940A07437e8194r8276B9301Q3801E6298h9819p341A71939a74673o133e7522
15928c23465C7085K70307A41993a7797j01815a5043j76459H8002a29091d4046
15917b4751C04010d0191A4790a92006D6038M2100f3703k96194J47411R2780B31867
15905a4808k47858H9835D3845c12579d9536A03740J35350K76964h7678A22543
15894c44859J63637p7651P8123I3378O4827J04701B0578g9201j67458D42371d5955
15882A64540a8228q9542B66703b69676P7830E2330J08724B4092e5427j62279A6214
15870b46851A6248J6420d687m31A69705E4552c21055e4684q7764C6927e8996q9799
$$ y = [-136762, 176116, -141773, -80582, -23925, -57634, 147864, 20198, 123426, -157263, 2751, 107437, -58194, -156470, 29301, 113102, 56298, -89819, -97160, 171939, -174673, -180806, -57522, -323465, 37085, 307392, 141993, -17797, -119612, -15043, -191502, 88002, -129091, -44046, -24751, 304010, -40191, 14790, -192006, 46038, 88138, -63703, -359897, -212486, -119706, 231867, -14808, -262666, 89835, 43845, -312579, -49536, 103740, 239090, 516054, -87678, 122543, -344859, -181222, -258873, -180750, 93378, 158205, 262906, 20578, -79201, -246659, 442371, -45955, 164540, -18228, -107770, 266703, -269676, -191846, 52330, 161054, 24092, -55427, -217706, 16214, -246851, 16248, 32668, -4687, -5118, 169705, 54552, -321055, -54684, -142448, 36927, -58996, -148795]
15858a48795O9500a8220q92A07826b51467a6650j29106c9717E391K09937r5968
15847A19360P4175i3543A9173a74274h1444l0650A7368a92424B82556G5207b3925
15835a61052H9461N2444e3632A4142a93323p64Q4238H8003A7526J2395h9214D7791
15822e2003q4517C8234a56622j26140a7124I8174b43700n485I7510Q3125G4418
15810H7009J14373d5816j62434A24430J06843a75968E0532K412b07401B5198c1454
15798f7072k4544K6758p7724G5410J76234a37508a9561B01945i173G1638K51622
15787C23260a99556N5288b5652n071A8902O4932K9642i2309D3194b13836C02156
15775g9386F0593R2781L563f8935n0336b8236g516A55298J16013H59O2078J19433
$$ y = [-148795, -79295, -18220, -19112, 107826, -251467, -16650, -145756, -39717, 5391, 215328, 119360, 193535, -93543, 19173, -174274, -81444, -112094, 17368, -192424, 282556, 75207, -23925, -161052, 89461, 141905, -53632, 14142, -193323, -194087, -109849, 88003, 17526, 29921, -89214, 47791, -52003, -136520, 38234, -156622, -282762, -17124, 98174, -243700, -249185, 97510, 180635, 74418, 87009, 201382, -45816, -208250, 124430, 231273, -175968, 50532, 52944, -207401, 25198, -31454, -67072, -91616, -64858, -142582, 75410, 251644, -137508, -19561, 201945, -9173, 71638, 323260, -199556, -144268, -25652, -30723, 18902, 83834, 113476, -92309, 43194, -213836, 302156, -79386, 60593, 153374, 156937, -68935, -119271, -28236, -7516, 155298, 271311, 859, 62937, 182370]
15763A82370a71653h267A47626a07771H1022a00164A99354C4843P3168a22816
15752a7235l55196A23261M4154a07645C42981A34874D4581d4948D0362Q7215j1613
15741A15964b70520j41355B12192g2506C47983a88735L3524d0896f717j82284
15731a89001B5225a81893Q1200l5607e3741B19123c99322a37881f969j36350E1922
15719e7191j39463R3758F0202a76565C0038J56812h5352B13010c2540j3565p5256
15708a21361B09864r8209g0986C1932L4674f8778g148r274m9262b8708k33271
15697b61979J25745p2497e1414C6028h1335A23173A4002m013J34508E461J2296
15686A7757H495O04N5471N9651h7273c2334l5761p9121A53328m9281g1411F9059
$$ y = [182370, -171653, -8267, 147626, -107771, 81022, -100164, 199354, 34843, 108011, -122816, -17235, -372431, 123261, 167415, -107645, 342981, 134874, 44581, -44948, 40362, 127577, 115964, -270520, -411875, 212192, -72506, 347983, -188735, -155211, -40896, -6717, -189001, 25225, -181893, -100693, -136300, -53741, 219123, -399322, -137881, -6969, -143319, 51922, -57191, -196654, -102896, 60202, -176565, 30038, 186850, -85352, 213010, -32540, -46105, -121361, 209864, 111655, -70986, 31932, 66606, -68778, -7148, -16422, -65684, -28708, -261979, -136234, -208731, -51414, 36028, -81335, 123173, 14002, 9989, 144497, 5461, 17757, 8495, 9099, 64570, 124221, -87273, -32334, -68095, -147216, 153328, 104047, -71411, 69059]
15673e8792A31439a77229F0296J84415J57799j64892r2446B1666O7997J4293b80890
15661b63988b537A55572n1194C7311K67114F496N4727c73017a13556B13303c17664
15649b63404a14900L3109o7260A55020A1489a78857q576A62799R298e3330a3939
15637g5072j35562C78618A9591c78793h4712d1411j65245L1652c6892m16257J69249
15626b83900D9070J54381f2108k18036f5515A96971H7551B1746L5617K62431b67146
15614h0298G717J92535E7920g8913b3369r6585c4071A35017K41471a22258c4170
15602b88148a15726A13358M9021F2568h1831q1926I4140m1845e1598g249A29407
15590A22901b01056g5942B32261b9895E5046n022a25202A63542G2520l4437A5086
$$ y = [-58792, 131439, -177229, 60296, 244711, 402510, 237618, 145172, 21666, 89663, 103956, -280890, -263988, -2537, 155572, 104378, 37311, 304425, 6496, 61223, -373017, -113556, 213303, -317664, -263404, -114900, -81791, -149051, 155020, 11489, -178857, -187433, 162799, 172097, -53330, -13939, -75072, -210634, 378618, 19591, -378793, -84712, -41411, -206656, -175004, -36892, -453149, -283900, 49070, 203451, -62108, -280144, -65515, 196971, 87551, 21746, 57363, 319794, -267146, -80298, 7717, 200252, 57920, -78913, -23369, -119954, -34071, 135017, 376488, -122258, -34170, -288148, -115726, 113358, 162379, 62568, -81831, -163757, 94140, 52295, -51598, -7249, 129407, 122901, -201056, -75942, 232261, -29895, 55046, 50024, -125202, 163542, 72520, 38083, 15086]
15578c15230i7971A84977l9065A511b16578E0291h8544j29612A92751l2535a59658
15566A19874e5201M089k41751B9530a25293n1253P7993P966B41453a310A67725
15554b35685P5060J4763j35714C67260a45195C11336A29905D0413O9975P1858
15544A82246K0266E081P194k373c6880E9637J57974d1170E1953c32400a02515
15532A45687a919F4182b5924k8184D9343c23410r2606b8007A55806a07862C12403
15520e3454A78399a51866J0495O4471A50295m5475e072A65436a81611e3261C8858
15508c29184A63072J2717K5446i2274A69012E9144R444K1177h8810j76911A73724
15496a0750A79531D9708K47642B5423a79829B3534a23447B41373j04201e3765
$$ y = [-315230, -97971, 184977, 145912, 1511, -216578, 50291, -88544, -218156, 192751, 160216, -159658, 119874, -55201, -51112, -292863, 29530, -125293, -176546, -98553, -90587, 241453, -1310, 167725, -235685, -160625, -145862, -281576, 367260, -145195, 311336, 129905, 40413, 110388, 182246, 202512, 5081, 12275, 9902, -36880, 59637, 217611, -41170, 51953, -332400, -102515, 145687, -1919, 64182, -25924, -54108, 49343, -323410, -416016, -28007, 155806, -107862, 312403, -53454, 178399, -151866, -141371, -76900, 150295, 104820, -5072, 165436, -181611, -53261, 38858, -329184, 163072, 175789, 201235, -92274, 169012, 59144, 68588, 89765, -88810, -265721, 173724, -10750, 179531, 49708, 297350, 25423, -179829, 23534, -123447, 241373, 137172, -53765]
15485d17661D3231A9223b79577a0248k38571B94222E1958a36204G0745J14222
15475A84967c52162N7a08776A5745b74039a23867B47630j18281j5510b7471A29581
15463C6593N2892L2638b88950B5550J97621b0011A3422b62565K3031B73824L513
15452B77337a21185B52093e8940b227H9858j3193k7192i0087I6135g8486j5185
15441i3671p061k77759B19689h2596B47275a68726H9249c12439C9634b18053i8877
15429a28607D8120K03236n9585i169j29306A63090G57b71216i5665I800g1980
15417a88551H2533l267a16980b0197A23361E9438a4082j54778C60793E2727a33475
15405C61394c32398A69738a18410d2668p8624H6993d0139r3390j08333J0347e6796
$$ y = [-417661, 43231, 19223, -279577, -10248, -248819, 294222, 51958, -136204, 70745, 184967, -352162, -352105, -108776, 15745, -274039, -123867, 247630, 129349, 113839, -27471, 129581, 36593, 89485, 122123, -288950, 25550, 223171, -20011, 13422, -262565, -239534, 273824, 277337, -121185, 252093, -58940, -2227, 89858, 76665, 49473, -90087, 96135, -78486, -93671, -100732, -378491, 219689, -82596, 247275, -168726, 89249, -312439, 39634, -218053, -98877, -128607, 48120, 251356, 191771, -9169, -138475, 163090, 757, -271216, -95665, 9800, -71980, -188551, 82533, 79266, -116980, -20197, 123361, 59438, -14082, -168860, 360793, 52727, -133475, 361394, -332398, 169738, -118410, -42668, -121292, 86993, -40139, -133529, -241862, -231515, -56796]
15393b14734G2758b5636j2247E03339A31471c61534a9382D47346c45108D49386
15382c05596a00859M9375J113D19539D4211j465J18360e7583D1392a49151E2694
15370i6721G7784f1437A8889a83826h1808A68522N0094A5793b59447h6689I7954
15358D89574B16880m7574R1052c2824j75750C50004c1199B47509a3259r3839A22572
15346i28j13757A21056c39303k5918C01460g9429B32514a59345g4802B72611i750
15334G7061a05166L7743C91841a9011j85511l5478A05143N8581b65665e2778B28168
15322A9158m815R3637K460K9663B0338P5739a6717E44266i682A16687a43058c9694
15309i2178j53442C68408E5924J83710a59501C094P8533j9737B5047J43211b68984
$$ y = [-214734, 72758, -25636, -37883, 503339, 131471, -361534, -19382, 447346, -345108, 449386, -305596, -100859, -51484, -50371, 419539, 44211, 42746, 161106, -57583, 41392, -149151, 52694, -96721, 77784, -61437, 18889, -183826, -81808, 168522, 218616, 15793, -259447, -86689, 97954, 489574, 216880, 169306, 260358, -32824, -208574, 350004, -31199, 247509, -13259, -107098, 122572, -928, -114685, 121056, -339303, -365221, 301460, -79429, 232514, -159345, -74802, 272611, -9750, 77061, -105166, -67423, 391841, -19011, -204522, -240000, 105143, 163724, -265665, -52778, 228168, 19158, 14343, 107980, 110440, 140103, 20338, 96077, -16717, 544266, -9682, 116687, -143058, -39694, -92178, -245620, 368408, 55924, 239634, -159501, 3094, 81627, 61890, 25047, 168258, -268984]
15297b53882C80621A00346J15240A03154P1727f3606B83067c1588A30234a67506
15286B2563a09557j09192f9560A22566i2912C5317J05989J46183o0346c25754
15275E1327J09966b28410O5147B35344h3548D7157K1375L06361j63268b48641
15264e4625j05249l8718H0207k7735K88290A41355R7882g6133m2589B06504C454
15252F7020J72598e3813A48477C2116N38079Q27961P16740p30486L95294m84793
15242A294911B74490K82643j97719G478J34481b69354A18048f4416K5892l4580
15232g3104c3348o6946j08673M9576A00117Q7319q8989R4532r5348m3486a00079
15220A18648f3414E1489J13206K07352G550J68538P1722I5624a31988D70905J7166
$$ y = [-253882, 380621, 100346, 215586, 103154, 174881, -63606, 283067, -31588, 130234, -167506, 22563, -109557, -218749, -69560, 122566, -92912, 35317, 141306, 287489, 227143, -325754, 51327, 161293, -228410, -163263, 235344, -83548, 47157, 68532, 374893, 211625, -248641, -54625, -159874, -198592, 80207, 52472, 340762, 141355, 239237, -76133, -118722, 206504, 3454, 67020, 239618, -53813, 148477, 32116, 570195, 1398156, 2114896, 1384410, 1779704, 1294911, 274490, 557133, 359414, 7478, 141959, -269354, 118048, -64416, -38524, -73104, -33348, -100294, -208967, -159391, 100117, 187436, 98447, 192979, 97631, 54145, -100079, 118648, -63414, 51489, 164695, 372047, 7550, 176088, 247810, 95624, -131988, 470905, 488071]
15209D88071D0801b76759B0761K91593B4485g8826J4355j73690a8055F7823J22177
15198A90000a16799A67940E9351I316K7987G603J45089J3561e0732B95550b8814
15186B26552G4298a31437A34740F5968R8627l1616k5246L55214a67528j16990
15176b84518d8611A56606C7599b0703l7631o2164A36142J61749B5364J05448M1097
15165A71909J31480l1625r9230g7947H6107c51848g3245B81696f3375r9256C70071
15153h4409B07246a23126c4881B42149J239i5526B77125F1508a13985B6887i889
15141g212B98653J1179p3641k9965q1836l0266M46806A22221K06517d1758H5964
15129A34972f6129o9978c5110p7133C34434A43087L18063o2850A41178J41976
$$ y = [488071, 40801, -276759, 20761, 312354, 24485, -78826, -64471, -238161, -18055, 67823, 190000, -116799, 167940, 59351, 9316, 37303, 7603, 152692, 166253, -50732, 295550, -28814, 226552, 74298, -131437, 134740, 65968, 164595, 132979, 107733, 462947, -167528, -284518, -48611, 156606, 37599, -20703, -58334, -120498, 136142, 297891, 25364, 130812, 171909, 303389, 271764, 172534, -77947, 86107, -351848, -73245, 281696, -63375, -162631, 370071, -84409, 207246, -123126, -34881, 242149, 243388, -95526, 277125, 61508, -113985, 26887, -9889, -7212, 298653, 309832, 236191, 206226, 124390, 94124, 540930, 122221, 328738, -41758, 85964, 134972, -66129, -136107, -35110, -112243, 334434, 143087, 461150, 398300, 141178, 283154]
15119B83154m9846O4083R5508A60786N1191K1231m9932J57496d37805B61010M9891
15108C10901H9537F303L48952O5506b58828a20917C11351C6210K29634J3376a76915
15096f0734B59800a49251E6951k6484c47456B18829N6189j05900M2396J76165
15086C87679j59657L2644O4920j09082b2250C51941A14236g6344E1859B1732L64549
15075C86281a42757I0215J38891j0829l2491J74013b21478B67905A20291Q1132
15065B01423G4979Q3237O0388I0546N9658f4271b8594B87865K15381c10628K6852
15054b83776B88706J19825a70107A99387E1914K69028D0143K82097A06544J34325
15044B40869a00526B85523A17793K59730a36071A51209J46290J0454d0370A46583
$$ y = [283154, 233308, 297391, 392899, 160786, 211977, 233208, 183276, 340772, -437805, 261010, 310901, 89537, 6303, 355255, 420761, -258828, -120917, 311351, 36210, 265844, 279220, -176915, -60734, 259800, -149251, 56951, 30467, -347456, 218829, 275018, 169118, 211514, 387679, 228022, 260666, 325586, 216504, -22250, 351941, 114236, -76344, 51859, 21732, 386281, -142757, 90215, 229106, 218277, 185786, 359799, -221478, 267905, 120291, 201423, 74979, 158216, 218604, 90546, 150204, -64271, -28594, 287865, 503246, -310628, -283776, 288706, 408531, -170107, 199387, 51914, 320942, 40143, 322240, 106544, 240869, -100526, 285523, 117793, 377523, -136071, 151209, 297499, 307953, -40370, 146583]
15033E13839B04887N6515e1108a0632C13944J12955A08209P2744F728K53829k0914
15022B39643A08186m3392Q3499R5794R3084c00312A73286K49326A03341L60316
15012D63657a41069F370N8200e8918C20168n2658o7990r5017L77843A31386J0451
15001A41837J18029G0753O56957l27133A84140B4074K41345L8947M2897p2371
14991B74892e2665C39551C1014L25762M8238c8658A41568K14537H5298J84185
14981B69483a02060E53328k24418F9448J77335k1352H0859K41930M8795q0153
14971B91431Q2617f6598B31831K59131A46695J64273o7943M3798L9385j820j21095
14960B03293Q3735J84536J49772A71040m0102M16023l1802p4502j92036H7661
$$ y = [513839, 204887, 261402, -51108, -10632, 313944, 426899, 108209, 180953, 6728, 260557, 239643, 108186, 64794, 148293, 244087, 337171, -300312, 173286, 422612, 103341, 463657, -141069, 6370, 64570, -58918, 320168, 267510, 199520, 104503, 482346, 131386, 141837, 259866, 70753, 727710, 400577, 184140, 24074, 265419, 304366, 347263, 274892, -52665, 339551, 31014, 356776, 405014, -38658, 141568, 356105, 85298, 269483, -102060, 553328, 328910, 69448, 246783, 225431, 80859, 322789, 371584, 291431, 374048, -66598, 231831, 490962, 146695, 310968, 243025, 286823, 326208, 324388, 203293, 287028, 471564, 621336, 171040, 130938, 546961, 515159, 440657, 248621, 87661]
14949B91293n7642k2030G8772J62640J3804J80885o5470l2717j06911C174K28301
14938B31475J91785j21902L32204B30443A9502b10671C27122m290M0114j29784
14928B33162L19007B34347J41164j26721Q5218l9419k6400J6232j04459k2211
14918A57751O1476N3690O608m6588p5813L1200M0314K33962j97929r20l2720O7192
14906B98223l948n6741J43337n0075K48941j07364q6568J19008I2863e79C71865
14894B34620K26487p3604n9389J56010n8255A72296L13332L31412B39916J21281
14884C61197O9160j08033j3247J10535j85219R2160J78242j69331K16584j22513
14874D29535r3567K72832B52856L63934j21290J25401B99909j3699J3639J69516
$$ y = [291293, 233651, 211621, 78772, 241412, 255216, 436101, 370631, 337914, 231003, 3174, 231475, 423260, 301358, 633562, 230443, 19502, -210671, 327122, 322832, 362946, 233162, 552169, 234347, 375511, 248790, 334008, 294589, 268189, 284421, 179962, 157751, 219227, 272917, 279525, 232937, 157124, 188324, 228638, 462600, 264671, 263751, 231031, 298223, 294275, 237534, 380871, 330796, 579737, 472373, 385805, 504813, 92863, -579, 371865, 234620, 461107, 387503, 328114, 484124, 425869, 172296, 485628, 817040, 239916, 361197, 430357, 322324, 309077, 419612, 234393, 326553, 504795, 335464, 552048, 429535, 335968, 608800, 252856, 616790, 495500, 620901, 299909, 286210, 299849, 469365]
14864D69365k1050m8478L76869C69334j5673l0432L07011k08784l0650K13902
14854F04708n7072K72248F4504K5779L11501j74093K69206j76976K45436j1634
14844E53723N2543n6836B33491p3093K91550k17348p9616O12043j84043M4217
14834F27201B87059R1700j48182L42610j59999K88115j21585J01511k5502m4284
14824F11443j23928j0942q215p6343L06262l1357Q7453k29704j75779k2049K34565
14813E61406M4079J63753C01942J68850J26062k7266k18622J30908lN4647B42154
14801E11248K88291j11632l03507O4258K6348J1371P4916J73490C13951K11356
14791E25307J28583j68885M7192j14188K82193L0705j83872K65278j45799J52595
$$ y = [469365, 448315, 399837, 776706, 369334, 353661, 323229, 630240, 421456, 390806, 604708, 547636, 819884, 64504, 90283, 401784, 227691, 496897, 319921, 565357, 553723, 606266, 549430, 233491, 160398, 451948, 234600, 154984, 767027, 582984, 627201, 287059, 378759, 230577, 573187, 413188, 701303, 579718, 681229, 655727, 611443, 487515, 476573, 468358, 392015, 698277, 666920, 754373, 524669, 348890, 326841, 561406, 605485, 769238, 301942, 470792, 596854, 569588, 350966, 481874, 481871, 536518, 242154, 511248, 799539, 687907, 384400, 448658, 475006, 486377, 561293, 734783, 313951, 525307, 653890, 485005, 532197, 418009, 700202, 730907, 547035, 812313, 666514, 819109]
14781H19109j86810k22349L18075K63225l28691M03208k25097m03581K33025C30580
14770G67687A68119N00105k71927L13965K6450O3919m3723P4667j49430l04179
14760C77966J89089j85921k8631O63216m58335J48143p6799L26190l11564N75112
14750A218466j43705C81107M32533j55443K05386K56005l29074k43117M39205
14741I86602D45958J3905J71788J80386k27406K72654k60909J99138R1841m3888
14731H43467J6224j0804R5491k23162q2164L22056k1209q2005j22265L76848n06643
14720F05834k4386M88877k94546K75212j01889j48416j22557L14199l03772m0265
14710F48291L31236J8224m94823N69262k16439J99179j30012J32265j75725N4887
$$ y = [819109, 632299, 409950, 728025, 991250, 662559, 1065767, 840670, 437089, 670114, 330580, 767687, 168119, 668224, 396297, 710262, 736712, 800631, 756908, 831575, 682145, 377966, 567055, 381134, 352503, 1015719, 557384, 705527, 628728, 954918, 643354, 1218466, 1074761, 381107, 813640, 658197, 863583, 1119588, 790514, 547397, 986602, 445958, 459863, 631651, 812037, 584631, 857285, 596376, 795514, 887355, 843467, 859691, 848887, 944378, 721216, 639052, 961108, 939899, 857894, 735629, 1112477, 605834, 581448, 1070325, 775779, 1050991, 949102, 800686, 678129, 992328, 688556, 648291, 979527, 997751, 502928, 1072190, 855751, 1054930, 924918, 1057183, 881458, 936345]
14700I36345M6428l71321K81468N7354L3302j10563L21486l80991j51401L33028
14690I95135J01177m1088j24776J34891J89656J133n70000M17388j98968J49731
14680A054279l6493J22749j21589m35562N37026p9934j8604r9273L21905Q9034
14670A333538l22433k83764J50226P8931M01770n1385k21114m2207K56531n41051
14660G59042L96874L25231m78957J88969l7421m8874L32401m39214M40322l95625
14650A042748J11510k88774M06667L05628l04502K19461j58462K7730R8924j95849
14640A265081J6915L5212l5965J18167j44572J19587P634o4155K89371M4555j25558
14629A526272j44694J62076j24469j07794L4559j49905M23367j31735j22545J39640
$$ y = [936345, 982773, 611452, 892920, 950274, 983576, 873013, 1194499, 813508, 662107, 995135, 1096312, 1055224, 930448, 1065339, 1254995, 1256128, 686128, 1103516, 904548, 1054279, 1017786, 1140535, 1018946, 583384, 1120410, 1040476, 1021872, 922599, 1244504, 1333538, 1011105, 727341, 877567, 956498, 1358268, 1306883, 1085769, 1043562, 1300093, 759042, 1155916, 1481147, 1002190, 1191159, 1153738, 1104864, 1437265, 998051, 1438373, 1042748, 1154258, 865484, 1272151, 1577779, 1273277, 1492738, 1334276, 1362006, 1460930, 1265081, 1281996, 1317208, 1281243, 1399410, 1254838, 1374425, 1382059, 1317904, 1607275, 1651830, 1526272, 1381578, 1543654, 1419185, 1311391, 1345950, 1196045, 1619412, 1487677, 1365132, 1504772]
14619A504772n868K6483J97630j15662K2148j54977L46657l7015K7313j53129
14609A658352K16530k34654r8009J71734k52734K71762k8971k24523L89976j59650
14599A709813k1204K76614q0841L72762k51600k1598M8109k01675j37130n5582
14589A637668o4581R0277P83559k16426n20319J83272m2214K40867j72261K92685
14579B212527L9865L61111n59287K29733j67614L33538j46517L63948l99091j62613
14569B105600N78299l13785j50315L26246L55076k15272J26626K077M54849n52880
14559B716521N18724k10537L40390J22416J11938J51504O09487L2786N65802J441939
14549F400970J607996L457769R353650J6324709Q665911B1819971j0331827m068844
$$ y = [1504772, 1498904, 1525387, 1723017, 1607355, 1629503, 1474526, 1821183, 1784168, 1811481, 1658352, 1874882, 1640228, 1542219, 1713953, 1461219, 1732981, 1704010, 1479487, 1869463, 1709813, 1688609, 1965223, 1884382, 2257144, 2005544, 1983946, 2032055, 1830380, 1693250, 1637668, 1573087, 1663364, 2446923, 2230497, 1710178, 1893450, 1851236, 2092103, 1919842, 2212527, 2252392, 2613503, 2054216, 2283949, 2116335, 2449873, 2303356, 2667304, 2268213, 2105600, 2683899, 2370114, 2219799, 2546045, 2901121, 2685849, 2812475, 2814552, 3269401, 2716521, 3235245, 3024708, 3365098, 3487514, 3599452, 3750956, 4360443, 4393229, 4959031, 6400970, 8008966, 11466735, 20820385, 37145094, 45811005, 21819971, 11488144, 7419300]
14541G419300C616589r74624j55708R370k44452N38728m14538r5831j8843K46571
14531B507262k17707l39206N91548l4375j39403J62852J08740K85647q8366k44809
14521B592183J14659O4561Q7376k34492J19722K99234j74586J4058k12997M63243
14511C132961n37282L31784J31953R6272r8195j13326L61090k4012j37696L1074
14501C174623J9776L36627l15963N3462M06408l043k88740L21352k58428M32601
14491C878675l88062K14695m3316K43311K01993l8837r8357j89656K46395K21518
14481D248359J9734j75566K77582J26064l53763j47250N91489R4415P0930l10175
14471D441819J35649l5994L60436j92937K30390j48675J89561p5569J11075q2468
$$ y = [7419300, 3616589, 2641965, 2486257, 2495627, 2251175, 2789903, 2375365, 2279534, 2260691, 2507262, 2289555, 1950349, 2541897, 2507522, 2368119, 2530971, 2639711, 2925358, 2836992, 2592183, 2706842, 2771403, 2858779, 2624287, 2744009, 3043243, 2868657, 2882715, 2669718, 3132961, 2595679, 2927463, 3059416, 3155688, 3057493, 2944167, 3305257, 3281245, 3143549, 3174623, 3194399, 3531026, 3215063, 3268525, 3674933, 3671890, 3383150, 3704502, 3446074, 3878675, 3490613, 3705308, 3661992, 3905303, 4107296, 4068459, 3970102, 3780446, 4026841, 4248359, 4268093, 4092527, 4370109, 4496173, 4142410, 3995160, 4586649, 4681064, 4751994, 4441819, 4577468, 4541474, 4901910, 4708973, 4939363, 4790688, 4980249, 4904680, 5015755, 4933287]
14461D933287K15073k05776N94619J83069l00245K67156k53469L93573j57087
14452E670200M2900m5335J19424M92192k74163L15841l41008M80171m85328P67981
14442F742875r8342r6963O56828k95305l0547J34437K47141k01643K68597r608
14432G317470J74649J82032j13509j31926M91670O8799K3272L6078K12513J20663
14422H381711q3502l2546L45987N3223J54702N23841k39626K91691L7229M52938
14412I885648j93410L55581Q0294j1829J18341O08343k69708R0926l3543O57407
14402A1288050L44490l30208O58844m87J10576j5515O23334m20330M71812K714
14392A2733280M09101L76249J11080J85694J06009L94764K41417L20054K09891
$$ y = [4933287, 5148360, 4942584, 5537203, 5720272, 5420027, 5687183, 5433714, 5827287, 5670200, 5713100, 5667765, 5787189, 6279381, 6005218, 6321059, 5980051, 6460222, 5974894, 6742875, 6644533, 6547570, 7204398, 6909093, 6878546, 7012983, 7260124, 7058481, 7327078, 7317470, 7492119, 7674151, 7560642, 7428716, 7920386, 7989185, 8012457, 8048535, 8261048, 8381711, 8298209, 8265663, 8611650, 8664873, 8819575, 9343416, 9103790, 9395481, 9432710, 9885648, 9692238, 10047819, 10128113, 10116284, 10234625, 10842968, 10573260, 10664186, 10630643, 11288050, 11632540, 11302332, 11961176, 11960689, 12071265, 12055750, 12679084, 12258754, 12730566, 12733280, 13142381, 13518630, 13629710, 13815404, 13921413, 14316177, 14557594, 14877648, 15087539]
14383A5087539J15696O62246R5141M04478O6601L04153N74752L13070M03900J73134
14373A8200710l4002J037929J93501M26696M13727J68276M84144M48881P19283
14364B2059145L35979L63766M49805N02938P95220K32360P67445K33963O54970
14355B6395591R10175L12173O76062M53548P32349P42430J054113N79439R74664
14346C2830544O63983J050561Q81674R14772J113222P49411R17213P08338J536249
14337D1365967R34619J377706J306566J025842J259800J341279J804719J535404
14329E1951902J792786J250667J705344K051648J610913K261501K036429K079443
14321F6740633J962201K643060K464062K694238K500770K946535L180135K906031
$$ y = [15087539, 15203235, 15865481, 15960622, 16365100, 16431701, 16735854, 17310606, 17623676, 18027576, 18200710, 18166708, 19204637, 19398138, 19824834, 20238561, 20406837, 20890981, 21339862, 22059145, 22395124, 22758890, 23208695, 23711633, 24506853, 24739213, 25506658, 25740621, 26395591, 27305766, 27617939, 28294001, 28747549, 29479898, 30222328, 31276441, 31855880, 32830544, 33494527, 34545088, 35426762, 36341534, 37454756, 38204167, 39121380, 39829718, 41365967, 42300586, 43678292, 44984858, 46010700, 47270500, 48611779, 50416498, 51951902, 53744688, 54995355, 56700699, 58752347, 60363260, 62624761, 64661190, 66740633, 68702834, 71345894, 73809956, 76504194, 79004964, 81951499, 85131634, 88037665]
14313H8037665L383602L540711M032803L498365M041270M309928M659627N024562
14305A20528533M719937N133467N591022N969197O578567O298589P055051P438600
14297A69312963P636897Q397286Q501676Q918094R665471J0012779J0929063J1366355
14289B44740584J1560981J2122839J2667494J3288936J3293220J4233297J4204943
14282C36112294J4520178J4636490J4620754J4749704J3937906J3576774J2714123
14275D34868223J1405398J0101586Q154447N821043J304009o45166P65133k886477
14267D68888196k787756n994632q686650j0872841j3060758j4320994j4988789
14260C98175776j5648818j6001975j6101198j5933208j5579373j5436846j5100145
$$ y = [88037665, 91421267, 94961978, 98994781, 102493146, 106534416, 110844344, 115503971, 120528533, 125248470, 130381937, 135972959, 141942156, 148520723, 154819312, 161874363, 169312963, 176949860, 185347146, 193848822, 202766916, 212432387, 222445166, 233374229, 244740584, 256301565, 268424404, 281091898, 294380834, 307674054, 321907351, 336112294, 350632472, 365268962, 379889716, 394639420, 408577326, 422154100, 434868223, 446273621, 456375207, 464529654, 470350697, 471654706, 471009540, 471774673, 468888196, 466100440, 460105808, 451419158, 440546317, 427485559, 413164565, 398175776, 382526958, 366524983, 350423785, 334490577, 318911204, 303474358, 288374213]
14253B88374213j2246911j3755020j2916897j2449927j1866709j1228916j0449254
14246B03460579r959832r350588q742435q053091q100548p425484p044486o317856
14238A38466259n701988n652053n566907n492756n001459m321973m478720l905018
14230I8345385l456091m162715l570751l238404l399011l008555k834372k251879
14222G2423607k672082k477153k152708k056045k397144j973817j868033k011341
14214E4815284j456948j475007j640090j515923j818238j198142j105564r51176
14206D3654196j077030j300268j467755r05699j216043p39776m54521j361907
14198C5131197j019238p90527r55302q60621l26158j145235r98502j51642q86214
$$ y = [288374213, 276127302, 262372282, 249455385, 237005458, 225138749, 213909833, 203460579, 193500747, 184150159, 175407724, 167354633, 159254085, 151828601, 144784115, 138466259, 132764271, 127112218, 121545311, 116052555, 111051096, 106729123, 102250403, 98345385, 94889294, 90726579, 87155828, 83917424, 80518413, 77509858, 74675486, 72423607, 69751525, 67274372, 65121664, 63065619, 60668475, 58694658, 56826625, 54815284, 53358336, 51883329, 50243239, 48727316, 46909078, 45710936, 44605372, 43654196, 42577166, 41276898, 39809143, 38903444, 37687401, 36947625, 36493104, 35131197, 34111959, 33321432, 32366130, 31505509, 31179351, 30034116, 29035614, 28883972, 27997758]
14189B7997758j072982n31674l02615r09545l60457q75102L0646o57988l89662
14180B2928379m83547q25966j66749n99083m86766n41095l61928l62463l77570
14171A8723212o1350l07993m22513m02021M4384m40296l11054n23843k94034j77991
14161A5826501M5744j054292o9768L5302m08331l50111N1339m86761k01095P5520
14151A3464048r24969L56992J2505k84321n23919K5481l41575k48157J56288l25093
14141A1367280j85291r1744k62304j01522l13399R6900l52264q690l4310p24396
14131I390260J42955J13349n96827K53157k47995J7526o1242l06383K3124o2684
14121H665240q1413o24322P0820j36185m3503m4277k91311K74855n09404o9289
$$ y = [27997758, 26924776, 26393102, 26090487, 25180942, 24820485, 23945383, 23976029, 23318041, 22928379, 22444832, 21618866, 21452117, 20853034, 20366268, 19825173, 19463245, 19100782, 18723212, 18661862, 18353869, 17931356, 17529335, 17573719, 17133423, 16822369, 16298526, 16004492, 15826501, 15872245, 14817953, 14748185, 14783487, 14375156, 14025045, 14076384, 13589623, 13388528, 13464048, 12539079, 12896071, 12908576, 12624255, 12100336, 12125817, 11784242, 11536085, 11692373, 11367280, 11181989, 11090245, 10827941, 10726419, 10413020, 10509920, 10157656, 10148966, 10114656, 9390260, 9533215, 9646564, 9049737, 9302894, 9054899, 9072425, 9011183, 8704800, 8727924, 8665240, 8583827, 7959505, 8030325, 7894140, 7850637, 7806360, 7515049, 7789904, 7280500, 7211211]
14111G211211Q020j21839r8852Q0828l69399M35439j54530k98343J24020l97102
14101F419453q2835l1145r2767J91204J75272l26669r2930J33411k22543N8162
14091F128613l67698j06459P1375l06429K46426N9009l87397R9402m5295J58177
14081E549724n87820K16356j44355K283M347k51257J35202J77430l83733j06257
14071D611920J02730l61325R6319K42872n58346N32911k18282j79264J69840l28168
14061D111207M1931J38412K51629o30426R4262P478K5179k7760k78677K86327
14051D019562K52471l24966m38853O1245J4759N16876l97438j83620R5092r5644
14041C519484J71533k59639k20100K26492K05322m62571m48738O95335k42735
$$ y = [7211211, 7219231, 7097392, 6998540, 7079368, 6709969, 7145408, 6990878, 6692535, 6816555, 6419453, 6336618, 6305473, 6212706, 6403910, 6579182, 6252513, 6159583, 6292994, 6070451, 6128613, 5760915, 5654456, 5725831, 5419402, 5665828, 5724837, 5337440, 5436842, 5391547, 5549724, 4961904, 5178260, 5033905, 5036188, 5040535, 4789278, 4924480, 5101910, 4718177, 4611920, 4714650, 4353325, 4449644, 4692516, 4134170, 4667081, 4448799, 4269535, 4439375, 4111207, 4153138, 4291550, 4543179, 3912753, 4007015, 4014493, 4039672, 4011912, 3733235, 4019562, 4272033, 3947067, 3508214, 3569459, 3584218, 4101094, 3703656, 3520036, 3615128, 3519484, 3691017, 3431378, 3211278, 3437770, 3643092, 3180521, 2731783, 3427118, 3184383]
14032C184383K17566K2325l09657J92588k56866p241k51911N34534k09447j38338
14022B977936j16832k38934L94214L3073J04260n20371M29165o05694L57884l02561
14012B512140K79591j22983j23564k25010M0414L69787k88060r8015J25386J94010
14002B663696k12918k16390L37700k61611j3523O5875J15301M5199j12810K44872
13992B655391K1960P1411M01180J069019K144420P254844J6633300J7264805k0185296
13983B7331034j3165249n720292k510324p84230p77402k44604n32019k05966p8830
13974C312118n0051m27345J58564k45143J577l29037O8502j90041J14480P6994
13964B490618K33577l48872j53497L51684k60877J74269n78192L21394j26806
$$ y = [3184383, 3401949, 3424274, 3114617, 3307205, 3050339, 3043098, 2791187, 3325721, 3116274, 2977936, 2861104, 2622170, 3016384, 3049457, 3153717, 2633346, 3062511, 2456817, 2814701, 2512140, 2791731, 2668748, 2545184, 2320174, 2360588, 2730375, 2442315, 2344300, 2469686, 2663696, 2450778, 2234388, 2572088, 2310477, 2296954, 2362829, 2478130, 2523329, 2410519, 2655391, 2677351, 2748762, 3149942, 4218961, 6363381, 13618225, 30251525, 47516330, 27331034, 14165785, 8445493, 5935169, 5150939, 4373537, 4128933, 3596914, 3390948, 3312118, 3262067, 2834722, 2993286, 2748143, 2749720, 2420683, 2489185, 2299144, 2413624, 2490618, 2724195, 2375323, 2221826, 2573510, 2312633, 2486902, 1908710, 2230104, 2103298]
13955B103298J79786o7058k57236J77529J42302m2253l40159J37085o3448j46513
13945A823333R8576J99355q3860m4265p1759k8475J36223j61319L8886j10258
13935A796437k38206K37543Q4009j57454j3953m7708o2000Q1554K78959l57879
13925A601302K98997o65664M99129j89561r1027P5531J33557J89067k24339R8829
13915A725821j38121p1230j1060l2297j17354j63795J94587L84892m53284M5197
13905A363356j19596K56414J90160k14788m9973J89362l29569L67310j47318j29047
13895A376311j08314j77927O18164n78342L48229p5978k78038M2346K20804o4441
13885A322814j83744K16841l11547N454K24304K18966m58476K46976m1482k89395
$$ y = [2103298, 2283084, 2216026, 1958790, 2136319, 2278621, 2236368, 1896209, 2033294, 1969846, 1823333, 1921909, 2121264, 2037404, 1993139, 1921380, 1892905, 2029128, 1867809, 1906695, 1796437, 1558231, 1795774, 1879783, 1722329, 1708376, 1660668, 1598668, 1680222, 1959181, 1601302, 1900299, 1234635, 1733764, 1544203, 1453176, 1528707, 1662264, 1851331, 1626992, 1725821, 1587700, 1516470, 1505410, 1473113, 1355759, 1191964, 1386551, 1771443, 1318159, 1363356, 1243760, 1500174, 1690334, 1475546, 1425573, 1614935, 1285366, 1652676, 1505358, 1376311, 1267997, 1090070, 1708234, 1129892, 1478121, 1402143, 1124105, 1166451, 1387255, 1322814, 1139070, 1355911, 1044364, 1049818, 1274122, 1493088, 1034612, 1281588, 1240106, 950711]
13875I50711L96395j65914K15763j88014Q232N9802r7065J3429N2169N071J16062
13864A366641l04366j27011L5055M1211j75526M10435j42811J35915j20849J67982
13854A286676j19403k68588l3339K06147M2057K37240l31837J66184k48764J3088
13844I49461K06671k18517K17436r6321J36698O2246m09944K5336j58807K53856
13834I68115J23808k81056L43679l09195L91663j08677k07302k29595L25475D86995
13823H60426C56595L53368M98363l40434J55275j19185K16131n35723K93995j03449
13813G74936L6661M34186l86702J83707j44260o3263J29837j05752L18924n0770
13803A127504k08436l93727K32142J60828k45221K54257l49623K22868J38211
$$ y = [950711, 1347106, 1181192, 1396955, 1208941, 1217173, 1276975, 1179910, 1193339, 1245508, 1250579, 1366641, 1062275, 935264, 970319, 1011530, 836004, 1246439, 1103628, 1239543, 1118694, 1286676, 1167273, 898685, 865346, 1071493, 1113550, 1350790, 1018953, 1185137, 936373, 949461, 1156132, 937615, 1155051, 1058730, 1195428, 1257674, 847730, 873066, 714259, 968115, 1091923, 810867, 1154546, 845351, 1237014, 1128337, 921035, 691440, 1016915, 486995, 860426, 356595, 709963, 1208326, 867892, 1023167, 903982, 1120113, 584390, 878385, 774936, 811597, 1245783, 859081, 1042788, 898528, 835265, 965102, 859350, 1178274, 1127504, 919068, 525341, 757483, 918311, 673090, 927347, 577724, 800592, 938803]
13794I38803O8429j59529L9871K38444k84920j98500L9536M67459D76340K60406
13784G36746k46796O0612J48031J30361D02657M25296M3495l06953J3531L55294
13774I33320Q1803D35793P1196J83156Q5685K76718k25649k33324K59540j34759
13764G18356j7172J07551l84466N42803J48779D72819K32407K4743k82584Q8855
13754E36240n3560J62316J65134N7686k62308J32965A82258P18502m01179P1378
13744E70959L95026C94749K65925o5138K2559M5239K14979j85826K73884l23040
13734F43331j83883K75143L539k25343L66633l20397P5889j32971J12600K36425
13724H50966l7991k62703j8621K66797k16883n7478K72071j33092l06666J22058
$$ y = [938803, 1007232, 847703, 887574, 1126018, 841098, 642598, 682134, 1149593, 476340, 736746, 489950, 550562, 698593, 828954, 402657, 827953, 871448, 564495, 578026, 933320, 1015123, 435793, 506989, 690145, 775830, 1052548, 826899, 593575, 853115, 718356, 701184, 808735, 424269, 967072, 1115851, 472819, 705226, 729969, 447385, 536240, 482680, 644996, 810130, 867816, 605508, 738473, 182258, 900760, 499581, 570959, 965985, 394749, 660674, 595536, 618095, 663334, 878313, 692487, 966371, 643331, 459448, 734591, 738130, 512787, 879420, 559023, 634912, 501941, 614541, 850966, 812975, 550272, 531651, 798448, 581565, 524087, 796158, 663066, 356400, 478458]
13714D78458J6196O0839J45039J21669o0654B86251K25510p8999m601M08399r9308
13703G37252l13367p3980K96398j22408m7364j72536N4738Q2716L68225r7617
13693G12057j70185N2230j13183K32501k62157Q7372K2417j86742J40353N823
13683E20486B51556N09079N7010B29634O2735K35389J8589j61954O33473H6542
13672E93427j97777J16228O8668j25493j716J47544j33355R6384P8904r729l677
13661F29408B48874M06534P2295j72647N2692B25875n231L2515L43307k89630
13651C06836R5076q2735K41395A83111K73564J07662B06947q5327K27527m8910
13641C00237j10206O56936r4799l13851J28868B27582K61786e5795B36667b8099
$$ y = [478458, 494654, 555493, 700532, 822201, 761547, 286251, 511761, 432762, 428161, 836560, 737252, 423885, 349905, 646303, 523895, 476531, 303995, 358733, 441449, 809674, 712057, 541872, 594102, 480919, 713420, 451263, 538635, 561052, 374310, 514663, 520486, 251556, 760635, 817645, 229634, 292369, 527758, 546347, 384393, 1017866, 86542, 593427, 395650, 511878, 580546, 455053, 453337, 600881, 467526, 563910, 642814, 633085, 629408, 248874, 655408, 727703, 555056, 607748, 225875, 220644, 253159, 596466, 306836, 401912, 319177, 560572, 183111, 456675, 564337, 206947, 121620, 349147, 300237, 190031, 846967, 752168, 438317, 567185, 227582, 489368, -55795, 236667, -28099]
13630B04239N60607m1873k98329J8761J64414j73014J84785B65523J34654L44946
13620G45123j84438k74819R4890J04189k35799Q0081j18280K17255K59392B23338
13609B71684J78982K0892A34141F4276Q8186K69290n4040j52123F6222L94286
13599D60508A76319J93834J6154A54543K51928K06900k72098P1091m9080j22455
13589B40829N6026L61740i879B57006L01523A26292N34103k34901o049P6525O0712
13578E56682j40985K09210C1704L06425Q5160j90679G8505M37998j45919j41772
13568B28812M668j00433h4830n4396A47128L37407j59655j31042I134J37034K15772
13557C61940j02122q1980K33128j89313K67907B35339M1908p9059K61450j62445
$$ y = [204239, 764846, 722973, 424644, 443405, 607819, 434805, 619590, 265523, 400177, 745123, 560685, 285866, 380756, 484945, 249146, 329227, 210947, 428202, 687594, 223338, 271684, 450666, 471558, 134141, 64276, 152462, 421752, 367712, 215589, 66222, 460508, 176319, 370153, 386307, 154543, 406471, 613371, 341273, 412364, 363284, 240829, 296855, 658595, -9879, 257006, 558529, 126292, 660395, 425494, 419445, 495970, 556682, 415697, 624907, 31704, 338129, 423289, 232610, 78505, 516503, 370584, 228812, 233480, 133047, -84830, -139226, 147128, 484535, 324880, 193838, 9134, 146168, 361940, 259818, 177838, 410966, 221653, 489560, 235339, 277247, 198188, 459638, 297193]
13547B97193B5875N25111k25984J39476A00542J25311M30171k52206K82966C30009
13536C46230q8546A4864O5629M51790a02440F24970B13865J4104p8287L63167
13526E12849j62566m9447A20423D0663J85844J95926A79768K71416j13346e0360
13515B06081J31889m9984J76838D8913K51590j3348D6254N54319L0661E9752f4010
13503C53671K49216B46729J10811o9888K42438k26691L78607C8070J93639I3174
13492C24722A18911L40445K25489A92987K01298K6806j61437N2049J25824j62795
13482B74732q0494Q9098J16593A78631K08703A8338J90229k8468j9296p2344N03552
13471E92011A44603N2328J15429K29008b3758m9050C44431m7653l7085b43723
$$ y = [297193, 25875, 550986, 325002, 464478, 100542, 225853, 656024, 403818, 686784, 330009, 346230, 257684, 14864, 80493, 532283, -102440, 624970, 213865, 227969, 149682, 512849, 350283, 300836, 120423, 40663, 226507, 422433, 179768, 451184, 337838, -50360, 206081, 337970, 287986, 464824, 48913, 300503, 287155, 46254, 600573, 631234, 59752, -64010, 353671, 602887, 246729, 357540, 287652, 530090, 303399, 682006, 38070, 231709, 93174, 324722, 118911, 459356, 684845, 192987, 394285, 421091, 259654, 311703, 437527, 274732, 194238, 283336, 399929, 178631, 387334, 18338, 208567, 180099, 160803, 88459, 592011, 144603, 196931, 312360, 541368, -23758, -72808, 344431, 296778, 259693, -243723]
13460B58614r6499K52678A34341L8881H2647P78J90665o2760O0393F6322K59047
13449C25369A20221K05352k4298h8568B06218m9372a1653k49782A68032R7513
13439B65545p3695b6609j51532L4497C67053j75170a39635B73856J43501A59021
13428B14624J37115A17376J32049L5999a54547A56366J82534A57078K26211D9511
13417B90837A06519A6863K51656L260a79891B27298q3536K36478J29341A34654
13406A48575K30621r7261D4340O33M7256H293N76295B04567K49256A50909L620
13395A54529J20008q8149F6071L8463J68795A10168a85317B05938J92571J4841
13385D13350E5875Q6946k9551J53215K5179o5115K24907A33202Q7022p4534j307
$$ y = [258614, 162115, 414793, 134341, 173222, 82647, 83425, 274090, 211330, 271723, 66322, 325369, 120221, 325573, 301275, -88568, 206218, 156846, -11653, -261435, 168032, 265545, 191850, -26609, -178141, -143644, 367053, 191883, -139635, 273856, 417357, 159021, 214624, 351739, 117376, 249425, 285424, -154547, 156366, 338900, 157078, 383289, 49511, 290837, 106519, 16863, 268519, 271779, -179891, 227298, 143762, 380240, 509581, 134654, 148575, 379196, 281935, 44340, 44973, 92229, 8293, 584588, 204567, 453823, 150909, 154529, 274537, 186388, 66071, 104534, 273329, 110168, -185317, 205938, 398509, 413350, 55875, 142821, 113270, 266485, 291664, 226549, 451456, 133202, 220224, 145690, 144383]
13374A44383Q33K429E3912b4976A67602g9231B92454j05Q1136j17193K09830G7953
13361C78681b3840C68514b1709A08990Q8233J1270q5318K37989Q7632A86055N8532
13350B44587J69905A13160J15312m0335J31767j42054M5145e1193D54182o7297
13340C86885J8160N2615h9699B36036a08575B26561g1128C77844q4296a86617
13329C13682j06495G3044G349K27706M4577a02505C00899N7810j42009Q4805J19803
13318D21308A43342K21314K53826A93193O2535l5743B4501M38424l4066A64917
13307C26919A30525a59473E01536f6808C29309f0996l9438A64171O6138A550K62739
13296B64289q6594O3091b24046o7579g812m6561j18109A52897n1350N6041g6534
$$ y = [144383, 145216, 147645, 53912, -24976, 167602, -79231, 292454, 292349, 373485, 256292, 466122, 77953, 378681, -23840, 368514, -21709, 108990, 197223, 208493, 123175, 361164, 448796, 186055, 244587, 414492, 113160, 228472, 188137, 319904, 177850, 222995, -51193, 454182, 386885, 405045, 457660, -89699, 236036, -108575, 226561, -71128, 377844, 293548, -186617, 313682, 207187, 73044, 7349, 235055, 279632, -102505, 300899, 358709, 216700, 301505, 421308, 143342, 364656, 618482, 193193, 255728, 219985, 24501, 462925, 428859, 164917, 326919, 130525, -159473, 501536, -66808, 329309, -60996, -100434, 164171, 230309, 1550, 264289, 177695, 240786, -224046, -291625, -7812, -54373, -172482, 152897, 101547, 157588, -76534]
13284a73052C50712j56089J34330p0814a21189A51547K5596H558k373N17709k08664
13273C15230g2698B36235h3435A65201J03203a02375o549A9717M2702J09798o2697
13262A09520J75211j4259a51986D94080F8837J38824D6991J13832J13176C1152
13251C82539A15168R9797E0380a36802k1348c0401D44618j41250l3048q1197K14065
13240D03188G2733M0184K69978K8333a33232B92059q6663a64952B38200A05956
13229E1423a46076N9806q2455c259G6633O7552a229j31629B63760h9107B94567
13217B13687K05962A13603J46864O74j18449q113N3838L61432A53822D3990b0397
13205H0873J28550J29606J14191A12126L3479P6766I3057R9828J91182B8922K79046
$$ y = [-173052, 350712, 194623, 328953, 258139, -121189, 151547, 177143, 8558, 6185, 523894, 315230, -72698, 236235, -83435, 165201, 268404, -102375, -108924, 19717, 62419, 172217, 109520, 284731, 270472, -151986, 494080, 68837, 207661, 46991, 160823, 273999, 31152, 382539, 115168, 214965, 50380, -136802, -158150, -30401, 444618, 303368, 270320, 189123, 403188, 72733, 112917, 382895, 411228, -133232, 292059, 205396, -164952, 238200, 105956, 51423, -146076, -86270, -168725, -3259, 76633, 144185, -1229, -132858, 263760, -89107, 294567, 213687, 419649, 113603, 260467, 261141, 142692, 134579, 188417, 549849, 153822, 43990, -20397, 80873, 209423, 339029, 453220, 112126, 145605, 222371, 93057, 192885, 384067, 28922, 307968]
13194C07968d0196G8089a81617A73684b48299H5991K9984J67167a03799a4610
13183b89650J24010g5627A44878a33401B32038A931R4379J04848A00579O1447
13173A62026a75457A9750J42892p2560K20970C5221J81568f2971E1854J30279
13163A82133o2955a8519B4483L33884J24142i5055A81170b06471C36325c9151
13152A64359L14897A04668J5853J89066c5397C80765A82646g8988C18308R9946
13142D18254a35621H3954K4184a88801A31804B6659J42566J8739m1429A6049b03467
13130A82056c9381A56655n3576c3558E34477b54607D26726H665K20744B9327K6577
13119E5904L39727e6003K2312A54397b48935I1561M7398Q1983a14339C99143g5056
$$ y = [307968, -40196, 78089, -181617, 173684, -248299, 85991, 115975, 283142, -103799, -14610, -289650, -165640, -75627, 144878, -133401, 232038, 1931, 96310, 201158, 100579, 162026, -175457, 19750, 162642, 90082, 311052, 35221, 216789, -62971, 51854, 182133, 119178, -18519, 24483, 358367, 482509, -95055, 181170, -206471, 336325, -39151, 164359, 479256, 104668, 120521, 309587, -35397, 380765, 182646, -78988, 318308, 418254, -135621, 83954, 108138, -188801, 131804, 26659, 169225, 187964, 146535, 16049, -203467, 182056, -39381, 156655, 103079, -33558, 534477, -254607, 426726, 8665, 229409, 29327, 55904, 395631, -56003, -33691, 154397, -248935, 91561, 138959, 220942, -114339, 399143, -75056]
13107B46662j9418C1713d3461A19727c5397j16725a4172A23413d17552D0645N43
13096D1188b7814c021A48834M5731P2898A17444a48583D3130K5914R6908J43560
13085C09512d9389p6169N2028A49283n9920O1710J676N3763Q0114f9071D40713
13073A99496g7420C33750A6587J33624g699l4452A61168a67851A27559f5072A67952
13061B17729l6517B8116K48188a52973B9898P8802k1582J50270G0667N1605o0285
13050F1987K9613N26494F5995J12435K54461A26385K9461R4763b989n5631j93709
13039b52329F1579e6833A92277a42446D3809c15744J18440O5934F8305a68523
13028c0071A19230a72423H2197J6466a88277G0524N1597A6417J75218O091J41411
$$ y = [246662, 227244, 31713, -43461, 119727, -35397, -152122, -14172, 123413, -417552, 40645, 41188, -27814, -3021, 148834, 194565, 267463, 117444, -148583, 43130, 69044, 165952, 309512, -49389, -125558, -73530, 149283, 89363, 151073, 152749, 206512, 286626, -69071, 440713, 199496, -77420, 333750, 16587, 150211, -7699, -42151, 161168, -167851, 127559, -65072, 167952, 217729, 181212, 28116, 276304, -152973, 29898, 108700, 87118, 237388, 70667, 122272, 61987, 91600, 618094, 65995, 178430, 432891, 126385, 155846, 250609, -2989, -58620, -252329, 61579, -56833, 192277, -142446, 43809, -315744, -197304, -131370, 68305, -168523, -30071, 119230, -172423, 82197, 98663, -188277, 70524, 122121, 16417, 191635, 197726, 339137]
13017C39137O9584j98158q5237Q5775C2298J19716l4741k9240P1471J78746R1922
13006D30172j61197l1812P6287j56550n664B6582L52492b14920g5462B60736I1923
12994G2743J35481b5585A788N55479h3892A97603J52578b24892D06806b6909B28096
12982a49083A43658l3529h1242B33429b54657d6630E0967Q7029J03396f9145j20396
12971a89541B06418K01499B0203a78092A56829g1439C14444e5403G739K5491K8961
12960F2191c24109B34159p8631d16711a24601B1024J1007R6799m9097L38842B9603
12948b24359B32914N8393l3700F3125J27325l6821j4718c22626d9939A60656d9447
12936i204A30579j1529j6037C5441J71541C1602b09035A79502d8529o213r356
$$ y = [339137, 408721, 210563, 125326, 211101, 32298, 152014, 117273, 88033, 159504, 338250, 430172, 268975, 237163, 313450, 156900, 151236, 26582, 379074, -214920, -75462, 260736, 91923, 72743, 208224, -25585, 1788, 557267, -83892, 197603, 350181, -224892, 406806, -26909, 228096, -149083, 143658, 110129, -81242, 233429, -254657, -46630, 50967, 137996, 241392, -69145, -189541, 206418, 407917, 20203, -178092, 156829, -71439, 314444, -55403, 7739, 33230, 62191, -324109, 234159, 155528, -416711, -124601, 21024, 32031, 128830, 79733, 418575, 29603, -224359, 232914, 291307, 257607, 63125, 190450, 153629, 138911, -322626, -49939, 160656, -49447, -9204, 130579, 119050, 103013, 35441, 206982, 31602, -209035, 179502, -48529, -54742, -64098]
12925f4098D16385G3598o024M1139L173m5344L4413C1028c3836N403B62605i9059
12912B476R6046J06793P8118j06300n4893K9890J66420j52129K88638c9266l3440
12901g2706B50695n6855a71675E5555k6573L98807B1716b15619P1539L2625k35506
12890c46961A12337a25457k5195A6970a25597A52497J41424H6650B2971P3803
12880I6774O3348a54691d27j69058A53063a25965e6436A20185E3334d0171A82917
12868B89596A21001a31744N5963A60662A0660J02211a0914B6304J73389J81260
12858C80953h1876j74581d9649A15783b39308A8604i2292G4997a00174A90381
12847A31683J23163b00108I6305K2279J30159a9548C68816A07502L41605a05081
$$ y = [-64098, 416385, 73598, 67574, 108713, 111886, 66542, 100955, 31028, -33836, -28433, 262605, -99059, 2476, 98522, 205315, 283433, 177133, 122240, 152130, 318550, 166421, 455059, -39266, -72706, 250695, 193840, -171675, 55555, 28982, 427789, 21716, -215619, -144080, -111455, -346961, 112337, -125457, -150652, 16970, -125597, 152497, 293921, 86650, 22971, 96774, 160122, -154691, -427, -169485, 153063, -125965, -56436, 120185, 53334, -40171, 182917, 289596, 121001, -131744, -75781, 160662, 10660, 112871, -10914, 26304, 199693, 380953, -81876, -256457, -49649, 115783, -239308, 18604, -92292, 74997, -100174, 190381, 131683, 254846, -200108, 96305, 118584, 248743, -19548, 368816, 107502, 449107, -105081]
12836D0713P889f4826e993A9835a8294C8944J62030J08825b48688M7014e6039
12824H0108R9698a49236A22070J97718D482J43919b47964f7359B25255B161M75097
12813D77258r4631A83151e249B39567E1098K86196p5676b04466R1454B44232a49041
12801a56983o899A02809a16903B7839a12909B96808c060j45894a5087l251F6353
12789f3290n6515n0849D3665a42316e5981a5527j20323j25986k9306C33435b78107
12777a90784A90131E1708A5214R81g2032B82446k6672d0501E5856f1534p6755
12766a38289A28881e985E6370J75437c0446H4007L5606n2195K09385c99336a24879
12754b16642L619h4574c5060m5439B9245d57991A08173D1585e368A98480C9113
$$ y = [40713, 48602, -64826, -5993, 19835, -18294, 38944, 200974, 309799, -248688, -201674, -56039, 80108, 179806, -149236, 122070, 319788, 4482, 148401, -247964, -67359, 225255, 2161, 477258, 382627, 183151, -5249, 239567, 51098, 337294, 261618, -204466, -113012, 244232, -149041, -156983, -163882, 102809, -116903, 27839, -112909, 296808, -3060, -148954, -15087, -18338, 66353, -63290, -119805, -170654, 43665, -142316, -55981, -15527, -135850, -261836, -291142, 333435, -278107, -190784, 190131, 51708, 15214, 16195, -72032, 282446, 255774, -40501, 55856, -61534, -138289, 128881, -5985, 56370, 231807, -30446, 84007, 119613, 67418, 276803, -399336, -124879, -216642, -213023, -84574, -35060, -80499, 29245, -457991, 108173, 41585, -5368, 198480, 39113]
12742A17548a37506O8607A42677Q5709J13544a65046n0617O1091G3761Q9993j2572
12731A51182F5723J56415f5181A9808J37623d0404A84650e7693l65646B75716
12720a54710A55201d8783m1156k94744A83205D5671M2612a18266B20445d9443
12709F7451P8061M6575N827J38582R452A65546J82843q5977a50925a3463j00232
12698a13695p8224c11A66515m360N8099r5566K29625a23336a2700k54717g6608
12686A02731l8048J49076r64K53715G129a65317G0428R5085a89186A33307K79333
12675D12640G1846e0983a8201B86666d9157B5885h9131p8728I6445R9323a08115
12663C28971e3194A64065j7511b32892A37580F5217J25916q7699D1462c5900B36933
$$ y = [117548, -137506, -68899, 142677, 228386, 341930, -165046, -215663, -154572, 73761, 163754, 151182, 65723, 222138, -65181, 19808, 157431, -40404, 184650, -57693, -423339, 275716, -154710, 155201, -48783, -89939, -384683, 183205, 45671, 88283, -118266, 220445, -49443, 67451, 145512, 192087, 197914, 336496, 345948, 165546, 348389, 262412, -150925, -13463, -113695, -191919, -311, 166515, 162155, 220254, 124688, 354313, -123336, -12700, -267417, -76608, 102731, 64683, 213759, 212795, 466510, 7129, -165317, 70428, 165513, -189186, 133307, 412640, 71846, -50983, -18201, 286666, -49157, 25885, -89131, -167859, 96445, 195768, -108115, 328971, -53194, 164065, 146554, -232892, 137580, 65217, 191133, 103434, 41462, -35900, 236933]
12651b76143B34885d0425M727C05115j01916J36660j07551A15461g4671K1708
12641e2963n698j28576B08106E1580b18818A12241J3720O735a45489E25674a94620
12629A39879J1955M56001B48911p044p4079F8407J125K03843c0151B0689J69152
12618A89841a05880a9970B68288e8117F3921K35274h7153M0126C1416N5917J24426
12607B11759f7085b1559m0898A71519a53862k33419F5595N3452Q3984A6971J45643
12596A62614o4538K3169c05193C4637J07846N432K3559c97408a28286F627f9444
12584A52696F1247M674d7770A88085P1704H6997d7777A14268e0295A30990g6170
12572a6841k9906d123j22540A35862f3036A24427f5639k3678C3244K75536I7957
$$ y = [-276143, 234885, -40425, -35698, 305115, 203199, 339859, 232308, 115461, -74671, -52963, -58661, -187237, 208106, 51580, -218818, 112241, 125961, 132696, -145489, 525674, -194620, 139879, 151834, 607835, 248911, 241867, 167788, 68407, 69532, 273375, -30151, 20689, 189841, -105880, -19970, 268288, -58117, 63921, 299195, -87153, -47027, 31416, 87333, 211759, -67085, -21559, -62457, 171519, -153862, -387281, 65595, 119047, 203031, 16971, 162614, 98076, 121245, -305193, 34637, 142483, 147915, 171474, -397408, -128286, 6627, -69444, 152696, 61247, 65921, -47770, 188085, 259789, 86997, -47777, 114268, -50295, 130990, -76170, -16841, -46747, -4123, -126663, 135862, -63036, 124427, -65639, -89317, 33244, 308780, 97957]
12560B91872d82004h9560j41536A53465f9291G3630a00769j14022r0228Q1973
12550b23046j5409C4912b3047C02263L9489a23060C02414D6679K41741A0655M64471
12539D75126a41724B6710a42107A86484o3963l9402Q8415k0201i6895b6765j97196
12528b23961f8375j17106D9097a37726j03631e8743j28923m531A94600a66728
12517F3691K32054H8069J08805q547B347Q1002h4624C18974E47a1376j6700l884
12505c1960j1007A60501j6689L0818p6838D510a60531A1661a69314B58581a1882
12493i3417L2969C91930a5249B21576b80666a13304b8230a0557j07437A55809
12482A89585b76256A71797d70305B50940g5851c2661B24545P9107a6826D33915
$$ y = [291872, -482004, -89560, -231096, 153465, -69291, 73630, -100769, -214791, -305019, -223046, -238455, 34912, -23047, 302263, 341752, -123060, 302414, 46679, 288420, 10655, 475126, -141724, 26710, -142107, 186484, 122521, 83119, 171534, 151333, -96895, -26765, -223961, -68375, -185481, 49097, -137726, -241357, -58743, -187666, -192197, 194600, -166728, 63691, 295745, 88069, 196874, 188327, 2347, 83349, -84624, 318974, 547, -11376, -28076, -31960, -42967, 160501, 143812, 174630, 97792, 4510, -160531, 11661, -169314, 258581, -11882, -93417, -60448, 391930, -15249, 221576, -280666, -113304, -28230, -10557, -117994, 155809, 189585, -276256, 171797, -470305, 250940, -75851, -32661, 224545, 303652, -16826, 433915]
12471e7411C3147a48973j18498A7536Q2023a55837b9036A41959d6840q681Q037
12460d7484j07878R397J3545f102p011F3910f6089o725A79752a55714H6947a30821
12447G7808Q3089a80722A02477Q5136b48811D4251R6106c5039B88540b0713h209
12435A05124K3700c39611o0454a2388G4354g6031n9215B04196B5044K9773c06800
12423I0686O9678d2002j77365l4272A21959J4159m0776l8327M8554K30407n9868
12412B76108o8194h2411o1285C74172h2388k38067b5551k1652C1164I659O2525
12401G2184b17357d60l4197B33083b08271Q6524C2012a9308j31190P5219p2818
12390a48097M4884B14369b30570a8981r3600k06549C1821R9836a85872g0213j87589
$$ y = [-57411, 33147, -148973, -267471, 17536, 99559, -155837, -29036, 141959, -46840, -55521, -47484, -155362, -145965, -132420, -6102, -13113, 63910, -66089, -72814, 179752, -155714, 86947, -130821, 77808, 160897, -180722, 102477, 187613, -248811, 44251, 140357, -35039, 288540, -20713, -8209, 105124, 128824, -339611, -400065, -12388, 74354, -76031, -135246, 204196, 25044, 54817, -306800, 90686, 160364, -42002, -219367, -253639, 121959, 136118, 95342, 57015, 105569, 335976, 276108, 207914, -82411, -143696, 374172, -82388, -320455, -25551, -47203, 31164, 9659, 72184, -217357, -460, -34657, 233083, -208271, -121747, 32012, -19308, -150498, -75279, -148097, -103213, 214369, -230570, -18981, -112581, -319130, 31821, 131657, -185872, -70213, -257802]
12379b57802a4888j20931f0267B71563K5051b63923a04620H0921A4106J75917
12369A90023b99203d3721J3323A9721J68143P8075g5761A67999J86071A43221
12358B09696a63611F5153a38661A00979i3634l0858C3044c03477B620c69698C24013
12346A09149a63000A74464p0979a77606j2588l28592B22865l0903a32039I6536
12335B1692J12841a6499A39813C5709G092a03A23359L3142a17066B5271J68309
12324A93580M6343d0813E0504O2458L2602A8724a38060o1844j73445H5893j1406
12313G4487a36620d6852D91220a31396d7042B8884a81982a8657A12836N8123j7180
12302A53779d8171B30844c37791F7187B1958J1464a8988k6232q4906B29563K5626
$$ y = [-257802, -14888, -135819, -60267, 271563, 296614, -263923, -104620, 80921, 14106, 190023, -299203, -43721, -30398, 19721, 187864, 265939, -75761, 167999, 354070, 143221, 209696, -163611, 65153, -138661, 100979, -93634, -124492, 33044, -303477, 2620, -369698, 324013, 109149, -163000, 174464, 103485, -177606, -190194, -518786, 222865, 191962, -132039, 96536, 21692, 134533, -16499, 139813, 35709, 7092, -103, 123359, 156501, -117066, 25271, 193580, 239923, -40813, 50504, 112962, 145564, 18724, -138060, -199904, -373349, 85893, 74487, -136620, -46852, 491220, -131396, -47042, 28884, -181982, -18657, 112836, 170959, 153779, -48171, 230844, -337791, 67187, 21958, 33422, -18988, -45220, -130126, 229563, 255189]
12291B55189I1859c2684m415m0991D9771M9970a98759B4855c6278C2125K03602
12280B35727a8993a226m8152k24648A93241D3177b895q6384c4229C7897L7532
12269G5429a56540j09272D22486j58987q3849a20127j32729Q4087A29485c406
12258B88457A32767L09192e2600A41783A95g8660A04609h289k72574I7724B153
12246b64088B4369L2356c2126A35622K18179f6509C01947H9119K21448O2178A47331
12234e0610j65631E5913L5390C9630J27924K5939p33a10072D02644p6413j17472
12223B08759b3236j4281C9539a32038A46470K01830A73435o5807L93450C0072
12212a97682A25466n9995M05963A78066C594K99494E9245a33339E29111k32264
$$ y = [255189, 91859, -32684, -37099, -78090, 49771, 99741, -198759, 24855, -36278, 32125, 235727, -18993, -1226, -49378, -274026, 193241, 43177, -2895, -89279, -34229, 37897, 75429, -156540, -265812, 422486, 263499, 179650, -120127, -252856, -168769, 129485, -3406, 288457, 132767, 441959, -52600, 141783, 195, -78660, 104609, -8289, -280863, 97724, 2153, -264088, 24369, 56725, -32126, 135622, 353801, -66509, 301947, 89119, 310567, 372745, 147331, -50610, -216241, 55913, 91303, 39630, 167554, 193493, 192760, -110072, 402644, 326231, 208759, -23236, -37517, 39539, -132038, 146470, 348300, 173435, 107628, 501078, 30072, -197682, 125466, 65471, 471434, 178066, 3594, 303088, 59245, -133339, 529111, 296847]
12202B96847D0528K74043a79513D74355E1267K73248j41936L4255N0017J10813
12192C77664O635r8915a38503C38237e0063H8126O2517L5405g851j22118E7481
12180a47178b2677B79886o8671a305B06139J71849A61160b627n4615A209K03487
12169B04696c5375j45013A27449j1785b9097A03011f2351A37411J69968A46639
12158a25526B89784a14317H4723J09871a17937E06426i2403B41951A07853E2415
12147F774J92108E1676b37850b8450I0276a86728M4378d8965A5967L1021b46265
12135A08215J10006J9723E3670a10652A88227a36856C05339F1166d4411A08282
12124A15592n6516P8798h362j96834I2218O1946M682K262b63333B33502m8276
$$ y = [296847, 40528, 314571, -179513, 474355, 51267, 324515, 182579, 216834, 266851, 377664, 384299, 285384, -138503, 338237, -50063, 88126, 150643, 186048, -7851, -129969, 57481, -147178, -22677, 279886, 211215, -1305, 206139, 377988, 161160, -2627, -57242, 1209, 204696, -35375, -180388, 127449, 115664, -29097, 103011, -62351, 137411, 307379, 146639, -125526, 289784, -114317, 84723, 194594, -117937, 506426, -92403, 241951, 107853, 52415, 6774, 198882, 51676, -237850, -28450, 90276, -186728, -142350, -48965, 15967, 46988, -246265, 108215, 218221, 237944, 53670, -110652, 188227, -136856, 305339, 61166, -44411, 108282, 115592, 59076, 137874, -8362, -205196, 92218, 154164, 158846, 161108, -263333, 233502, 185226]
12113A85226J91354j76931e8523A80463b1076A67875c889B61097J39792A29956
12102f5493A48433a76635C03062b0671j36570F08151I178J01585b28318M8800
12092a79518J0039N2018A26397a55094q1920d4675j63990A19014K05741a2681
12081G3462J77749a21629k79556g0821A96184j3930b20071A74716o3888J20692
12071B31520n7948b47884A04633d2951B01752C4392a35634L1775c6915A06444
12060g4695o6759D7620g2959E42746M59556J05102A13060a0947B66319G4578R0130
12049A64708a81556B70681i8609E6391a86403P4640A96457L2792c17227J28699
12039a88528A16551a77668B91869a53740g5613A51726c4589A9273Q1827J554n479
$$ y = [185226, 376580, 199649, -58523, 180463, -21076, 167875, -3889, 261097, 400889, 129956, -65493, 148433, -176635, 303062, -20671, -157241, 608151, 9178, 110763, -228318, -179518, -169479, -117461, 126397, -155094, -237014, -44675, -208665, 119014, 324755, -12681, 73462, 251211, -121629, -401185, -70821, 196184, 182254, -220071, 174716, 110828, 231520, 173572, -247884, 104633, -42951, 201752, 34392, -135634, -103859, -36915, 106444, -74695, -141454, 47620, -72959, 542746, 1002302, 1107404, 113060, -10947, 266319, 74578, 164708, -181556, 270681, -98609, 56391, -186403, -111763, 196457, 229249, -317227, -188528, 116551, -177668, 291869, -153740, -75613, 151726, -34589, 19273, 101100, 102654, 97175]
12028I7175J12445H373a99237l5838h1813A34945b82168Q8869P7773A86930n1953
12017A34977a27287G4323b20381M1280L5359A51723h1827n4945B60979b01874
12006B07784b65689B89042G6277J28865a47072C52192a14608a7390j78680l2401
11996b28471l6963A25043B0798J59076a10989b1880q3894G8661J95220b32346
11985I0538J6963b54827b5701A55709c22795i6762m3161G7681J02851a2515j72624
11974a85139H2200B352b57897B09513b33549g5066A60031a19464k22323d6905
11963A45917a06952A12860f279A73357a20469I0617a93865A52814n1378f9973
11952A01936b73169E898P503M7097n511i9532n9901j94682g6454H7834a34924
$$ y = [97175, 209620, 8373, -199237, -235075, -81813, 134945, -282168, -193299, -115526, 186930, 134977, -127287, 74323, -220381, -179101, -143742, 151723, -81827, -136772, 260979, -201874, 207784, -265689, 289042, 76277, 205142, -147072, 352192, -114608, -17390, -196070, -228471, -265434, 125043, 20798, 179874, -110989, -21880, -105774, 78661, 273881, -232346, 90538, 107501, -254827, -25701, 155709, -322795, -96762, -139923, 77681, 180532, -12515, -185139, 82200, 2352, -257897, 209513, -233549, -75066, 160031, -119464, -341787, -46905, 145917, -106952, 112860, -6279, 173357, -120469, 90617, -193865, 152814, 101436, -69973, 101936, -273169, 5898, 13401, 60498, 54987, -99532, -159433, -354115, -76454, 87834, -134924]
11940E1788J7408d1653A51301E7047l692g4391l12564B28804f2410H085a67860
11928G3223b96327I59a55339o1526B43844E740b99553L5653A38221B9273p116
11917B2157c9547q3860F8552a89547G3649c13511J25161A0805c78134a69050g5471
11905I2507c03989F1039A8140p172a72866j80166J19154C5480c0328C8042b66641
11893A27230n6101L0339J6532L2225a96765A19618E7094i1377H5584O6728a25967
11881B49591i1564j31708H978h4450C4395a2333j10206e8188l72248B6911b74012
11869I2447a03145I4077c0243m4814k12508g5099j61262j52395e9947A23107a53041
11857f1424l42437a94276j27489B7902a70999k50232C17309H7270a16498H9088
$$ y = [51788, 69196, -41653, 151301, 57047, 53355, -74391, -386955, 228804, -62410, 8085, -167860, 73223, -296327, 959, -155339, -216865, 243844, 5740, -299553, -263900, 138221, 29273, 22157, -39547, -123407, 68552, -189547, 73649, -313511, -188350, 10805, -378134, -169050, -75471, 92507, -303989, 61039, 18140, 10968, -172866, -353032, -233878, 35480, -30328, 38042, -266641, 127230, 71129, 101468, 118000, 150225, -196765, 119618, 57094, -91377, 85584, 152312, -125967, 249591, -91564, -223272, 8978, -84450, 34395, -12333, -122539, -58188, -430436, 26911, -274012, 92447, -103145, 94077, -30243, -75057, -287565, -75099, -236361, -388756, -59947, 123107, -153041, -61424, -403861, -194276, -321765, 27902, -170999, -421231, 317309, 87270, -116498, 89088]
11846a08421l9619O2565k2434q3315g1047I137c21978P7541a07033A59227N9807
11835B19034c17484L5141r244D789O2547J9351J8380c017l65358J14734C7533
11823e1162D3637J51179b71469a27985j2698K4123C74878a14113A43059G0902
11812A5614P7531h1641n6322j13732H921b20840C04785g7618j500A03012j8407
11801H4605I154d20817d822A468K1882i2776E6260c63055C23774D965b5008G2323
11788h5166A15196l6596d17438a64290j66520H2987b3202j70517O8703E19994
11777a9165j79382c3571a4793k42667B24986i2079d3720p3936N4283C58976B0739
11765c68723G4640O2388a0974A2200c59335a45731N7062A6340K7421a3371q3757
$$ y = [-108421, -148040, -85475, -107909, -191224, -71047, 9137, -321978, -244437, -107033, 159227, 219034, -317484, -282343, -291587, 4789, 67336, 86687, 105067, -3017, -368375, -253641, 37533, -51162, 43637, 194816, -271469, -127985, -140683, -116560, 374878, -114113, 143059, 70902, 15614, 93145, -81641, -137963, -251695, 8921, -220840, 304785, -77618, -79118, 103012, 84605, 9154, -420817, -4822, 1468, 23350, -92776, 56260, -363055, 323774, 4965, -25008, 72323, -85166, 115196, 78600, -417438, -164290, -330810, 82987, -23202, -193719, -125016, 519994, -19165, -198547, -33571, -14793, -257460, 224986, -92079, -43720, -117656, -63373, 358976, 20739, -368723, 74640, 137028, -10974, 12200, -359335, -145731, -88669, 16340, 43761, -13371, -97128]
11754i7128l36422K05274F2352J60409c82676c4579n8056b5984G7598J41444b39274
11742H9028J23088j6677e7066A2746J29248a93292m9891N977A01188J2621J25938
11731B39747A11751l7525h7492C96060c91423R0572B5697c8378B1223a9020k30110
11720b49130A99449a31300L6084C28864L0588A16113D5608K77777a15765A76190
11709A44499a30143A1873d9257B36310c89648i2149p2419A09927J56679b51988
11698h4845j19369E2510a66011P4871n2098a0245k6065A27578K9806D8316i1113
11686I6655K42125p2046i259j7393j61030j93208a74261A51463q231J88571J0357
11675C42160A37694J45331l9765f3556L0070B24479b62745J01043e7712b2780
$$ y = [-97128, -433550, -228276, 62352, 222761, -382676, -34579, -92635, -25984, 77598, 219042, -239274, 89028, 212116, 195439, -57066, 12746, 141994, -193292, -243183, -237206, 101188, 113809, 239747, 111751, 74226, -87492, 396060, -391423, -300851, 25697, -38378, 21223, -19020, -249130, 199449, -131300, -95216, 328864, 359452, 116113, 45608, 323385, -115765, 176190, 144499, -130143, 11873, -49257, 236310, -389648, -92149, -164568, 109927, 266606, -251988, -84845, -204214, 52510, -166011, -91140, -143238, -10245, -36310, 127578, 157384, 48316, -91113, 96655, 338780, 266734, -9259, -26652, -187682, -380890, -174261, 151463, 143232, 331803, 342160, 137694, 283025, 243260, -63556, -33486, 224479, -262745, -161702, -57712, -22780]
11664a29289l8184A64968m6290h6201A9760a33684C82396e258E463K92861E8749
11652a26037o3991M4441B1478a04889j49381A68893a40075c0270C48743f4979
11641b53491A95889n9698d5189B7131Q3140b16184i583A30394e6943o2938L5348
11630h4533l09003a14297j08741A9184K36980c66054C9862a92769A54752e2579
11619B3740f4037A36900m6901b29564B26360b12870a7788l0516A88917G2029B7414
11607a52076j29338J13976j33199a42902j52708A49801c89248g1245I894c74029
11596h6978A25829g5664A68644K69715b57393b7949p6518K4328C5486b16430B61424
11584A21646f4512k18824B73828d324l7071k9526n5894K7092j77234A48686a35271
$$ y = [-129289, -167473, 164968, 118678, -86201, 19760, -133684, 382396, -5258, 5463, 298324, 58749, -126037, -190028, -145587, 21478, -104889, -254270, 168893, -140075, -30270, 348743, -64979, -253491, 195889, 136191, -45189, 27131, 110271, -216184, -9583, 130394, -56943, -119881, -84533, -393536, -114297, -223038, 19184, 256164, -366054, 39862, -192769, 154752, -52579, 23740, -64037, 136900, 89999, -229564, 226360, -212870, -17788, -48304, 188917, 72029, 27414, -152076, -281414, -167438, -300637, -142902, -295610, 149801, -389248, -71245, 9894, -374029, -86978, 125829, -75664, 168644, 438359, -257393, -27949, -104467, -80139, 35486, -216430, 261424, 121646, -64512, -283336, 273828, -4324, -41395, -70921, -126815, -99723, -276957, 148686, -135271]
11572e5134C82169d68574A17016a22943A18286a54746B52908i1377J7440B22793
11561C22723P1284a19417e4246k00609C7999K3495K02730g3676j08303C82716
11550a49013c7620A62101e1312l63421a26773A22427A3839a57434F6389K17058
11540B83447j5998m8741K04132c24588I2744j9946K35888Q6413a58947A50235
11529A62865R840K289K6396g481A87519g2419n9726c6872E9909J69462H2141a05025
11516A16519K41544a31489k73919A48517O0837m3140B3601b58763A25310e2883
11505I1270Q6328B9478L11169G9634a3088B29760j1571K3493A06415K13294j57108
11494A62601K517d970j00602C7015K48239a36730L8513n2213B13873o5182o1855
$$ y = [-55134, 382169, -468574, 117016, -122943, 118286, -154746, 252908, -91377, -73937, 222793, 322723, 394007, -119417, -54246, -254855, 37999, 61494, 264224, -73676, -181979, 382716, -149013, -37620, 162101, -51312, -414733, -126773, 122427, 13839, -157434, 66389, 283447, 267449, 218708, 422840, -324588, 92744, 72798, 308686, 395099, -158947, 150235, 162865, 172705, 174994, 201390, -7481, 187519, -72419, -132145, -36872, 59909, 229371, 82141, -105025, 116519, 358063, -131489, -405408, 148517, 209354, 166214, 23601, -258763, 125310, -52883, 91270, 177598, 29478, 340647, 79634, -13088, 229760, 218189, 241682, 106415, 319709, 162601, 165118, -4970, -105572, 37015, 285254, -136730, -98217, -150430, 213873, 148691, 86836]
11483H6836l088J85211j7705g6731A76960L3529b10689B74233L0885a5237A84697
11471h0986C7538K00190A9728J67616K7473l9984g8477B60983j26608D3585f0469
11459B5472K73810n9604J14744i2183A69514a41523B35178l5372E6170j5799K20861
11448B61232H0540d5776q7893F54R0528B7617a38797d3534C33245D5173J49624
11437A94797I5124b27841J4971B54936D0013b352p9991c4394j40720b2989A28828
11425g2851A8450K38964q9890E7287K12777H4664A3519b01950A3854M5623L93498
11414D52975F9769Q9157a60347A6871a21631q3560Q2101E4394k4006J38907c17595
11402a22429j49136D94842a62291G2389Q2251J9737f025r2667p6037l3957g035
$$ y = [86836, 83748, 268959, 251254, -76731, 176960, 210489, -210689, 274233, 305118, -15237, 184697, -80986, 37538, 237728, 19728, 187344, 214817, 174833, -78477, 260983, 134375, 43585, -60469, 25472, 299282, 239678, 354422, -92183, 169514, -141523, 235178, 199806, 56170, 40371, 261232, 80540, -45776, -133669, 654, 91182, 27617, -138797, -43534, 333245, 45173, 194797, 95124, -227841, -212870, 254936, 40013, -2352, -82343, -34394, -175114, -22989, 128828, -72851, 18450, 257414, 167524, 57287, 270064, 84664, 13519, -201950, 13854, 59477, 452975, 69769, 158926, -160347, 16871, -121631, -205191, -123090, 54394, 30388, 169295, -317595, -122429, -271565, 494842, -162291, 72389, 154640, 174377, -6025, -98692, -174729, -208686, -7035]
11390a71819A35706a11651o5836k95370a32157A96347k8916c53032A44455a87735
11379A75002q2808E590M7831K30346d7771F5681o574N4941b33536L6518j97491
11368c94509B07247b53628E1750M0582a08759j12811A96219a43308E1571a16722
11357C11559a6014B7214c07473A06764J23833r3626A8597K45961b48740k2803
11347b71543i9457I4363h2674l11930i7299r6416A43910c8569k19342A22508K13254
11336C35762a07186B67683b45977B45519C4538j823M4969d4955n926I8921l6737
11325F2184a58524d1066a9229A56181b4373C06884i5763k4034o9471j09155K4234
11314b74189a31763B67818J15701p1568a41407I8380a06818c6293j88518d7000
$$ y = [-171819, 135706, -111651, -177487, -472857, -132157, 196347, 167431, -353032, 144455, -187735, 175002, 92194, 5590, 53421, 283767, -47771, 65681, 59107, 114048, -233536, -197018, -394509, 207247, -253628, 51750, 92332, -108759, -221570, 196219, -143308, 51571, -116722, 311559, -16014, 27214, -307473, 106764, 230597, 136971, 18597, 264558, -248740, -271543, -99457, 94363, -82674, -394604, -97299, -193715, 143910, -38569, -257911, 122508, 335762, -107186, 267683, -245977, 245519, 34538, 32715, 77684, -44955, -50881, 98921, 62184, -158524, -41066, -19229, 156181, -24373, 306884, -95763, -119797, -189268, -298423, -274189, -131763, 267818, 383519, 311951, -141407, 98380, -106818, -36293, -224811, -47000]
11303B02880I7380j0840c54925B1782J89293a48814A30172B8366c0991A4641J83993
11292A98634a45044G184f9056a4353j4660j12758C7513J19333R1996a31764A86912
11280a69824G863J29616A1606a21935A25601a7006k24609C7199c74190e8087l1380
11269h9467D3405d5165B43301c09700J14366e9227k22726K2240a17054I7157J66051
11258B63208a59919A1314b33184R2400H2642K30366c6787j28706I317a06812q3572
11247a90384A72554n2817a83159G3981a37818k33110L4618d8570j20282B57213
11236h8266B3680a21110e4671j524l18379P0237h3094L2783d392B28710a66270
11224b3643A82122e9042M271n4762B13114a23007b5560j45877A68972a01898F0793
$$ y = [202880, 97380, 86540, -354925, 21782, 211075, -148814, 130172, 28366, -30991, 14641, 198634, -145044, 7184, -69056, -14353, -29013, -141771, 37513, 156846, 248842, -131764, 186912, -169824, 7863, 137479, 11606, -121935, 125601, -17006, -241615, 37199, -374190, -58087, -89467, 43405, -45165, 243301, -309700, -195334, -59227, -281953, -259713, -117054, 97157, 263208, -159919, 11314, -233184, -140784, 82642, 313008, -36787, -165493, 9317, -106812, -190384, 172554, 119737, -183159, 73981, -137818, -370928, -336310, -48570, -168852, 257213, -88266, 23680, -121110, -54671, -56195, -374574, -304337, -83094, -50311, -4392, 228710, -166270, -23643, 182122, -59042, -54771, -109533, 213114, -123007, -25560, -171437, 168972, -101898, 60793]
11212C43355a91066B06509c66478a33578B52676m4925j6936f4446k39223c7810
11201a05893a6834H8284O1803a04644M6939F5330a81802d7186k53708A84626c35261
11189D2564j8191O8019a76952Q4834d5623j84215R7880a2021j80570A38307h4921
11177C5927a89567D70506B8304a32807N1247j95534a3859B59851B8465N9037a12527
11165c06697K6614A45043b71186f8318b674j11843j9599A31286a26180C8385a52824
11153A86347H2108j3711N5730P0464C2243b66362I872d2185j55744F4590d3679
11141b56947A38588c60407a29199A42631a80056F0562d2102D0692J4017O526E260
11129A75641D1296K38205I5946K3795R7898R9475A01561L84097k39719A14808
$$ y = [343355, -191066, 206509, -366478, -133578, 252676, 207751, 190815, -64446, -303669, -37810, -105893, -16834, 88284, 150087, -104644, -57705, 65330, -181802, -47186, -300894, 184626, -335261, 42564, 24373, 92392, -176952, -92118, -45623, -229838, -131958, -12021, -192591, 138307, -84921, 35927, -189567, 470506, 28304, -132807, -81560, -277094, -13859, 259851, 28465, 87502, -112527, -306697, -280083, 145043, -271186, -68318, -2674, -114517, -134116, 131286, -126180, 38385, -152824, 186347, 82108, 68397, 124127, 194591, 32243, -266362, 9872, -42185, -197929, 64590, -43679, -256947, 138588, -360407, -129199, 142631, -180056, 60562, -42102, 40692, 54709, 61235, 5260, 175641, 41296, 279501, 95946, 119741, 217639, 317114, 101561, 485658, 245939, 114808]
11118C75809A64289q027C8271M8701O3655l6098J36636b9749F3148K0034K37999
11107C21181j16414P8914b08269A0404K87124m1741J1916j29441J9542i0659G9322
11095c6455A12842a91516C61100q2162d1664E27927k12732D4905b29433B06266
11084A48463M57600A23374A2309K41687p7368M86951A58888P4826r756L89426
11074F13384I7386E140L04281A18498j0105L12336j83019j7549K9123K28149D4474
11062A35962O68578A60523J35082M99325C45321J25303q0311L14281l03862A53562
11051C95993J15863o372O9419j13859M13409l16120L82342C21403K44970B65883
11040G50221j01289K8202J0461J81168p4254l87157J29956K6136L867n8732j7664
$$ y = [375809, 164289, 156262, 38271, 86972, 150627, 114529, 251165, -29749, 63148, 83182, 321181, 204767, 283681, -208269, 10404, 297528, 255787, 267703, 138262, 157804, -90659, 79322, -36455, 112842, -191516, 361100, 278938, -41664, 527927, 315195, 44905, -229433, 206266, 148463, 606063, 123374, 12309, 253996, 176628, 663579, 158888, 233714, 223958, 613384, 97386, 5140, 309421, 118498, 108393, 420729, 237710, 220161, 249284, 477433, 44474, 135962, 804540, 160523, 295605, 794930, 345321, 470624, 390313, 704594, 400732, 153562, 395993, 511856, 505484, 574903, 461044, 874453, 558333, 940675, 321403, 566373, 265883, 750221, 648932, 677134, 687595, 868763, 794509, 407352, 537308, 563444, 567311, 508579, 490915]
11029D90915o1874P0609J87596j27700k0405O8957K8784l11088L34829j31369
11019E29254q4126A17083L29040J02323q3567j59346K27464L2891K48480l28421
11009D85947n6148J93226q8005P7060n3305k66728K93307m8943j77728M71469
10999H30152k90663o6935K87466l54318R487L40486m3470j42278M83012m89553
10989E63386K43269M9051J00069k0908P326j53208J38820j6357P6227k07289O20213
10978A400599k08171N92012j17269L88833K43358j60572L93313j91428N1639J66879
10968B559193p1507k09159k55190k82578j32565l01830O15756k88108l73309K71176
10958A531879n1192J17550O1859m17794J46279k47934m98371J80004j13662j27836
$$ y = [490915, 429041, 499650, 687246, 559546, 539141, 608098, 636882, 325794, 660623, 529254, 445128, 117083, 446123, 548446, 464879, 305533, 532997, 565888, 814368, 485947, 429799, 623025, 535020, 612080, 558775, 292047, 585354, 536411, 358683, 830152, 539489, 472554, 760020, 405702, 415189, 755675, 712205, 569927, 1052939, 563386, 806655, 855706, 955775, 934867, 942193, 788985, 927805, 911448, 987675, 780386, 1400599, 1192428, 1784440, 1667171, 2056004, 2299362, 2138790, 2532103, 2340675, 2392314, 2559193, 2487686, 2278527, 2023337, 1740759, 1608194, 1306364, 1922120, 1634012, 1260703, 1531879, 1480687, 1598237, 1660096, 1242302, 1388581, 1140647, 642276, 822280, 708618, 580782]
10948E80782B73771N1712j02353n4759j3539J00549n9235l440m6031J40324l4479
10937B52520j01808P8209a30274B19695o3265e742j52933O942d9418A11793d1701
10925B21952c3325B1527B024L17276c89178A95092H6215b81523i2632A03724l5410
10914F8314P1077J53993b29857Q0202A99079r6179M6236O9641f4744A81208f3448
10902b8579B18870a73665B82350a63524A03181a62030B2234G663e2059l11337
10892c63396d3025A3016h8960l83029a60380A64357p5688e440H0626d4793A62989
10880a80381A55261L1944i4480l598j71836H4860b2156A9937Q1896k6441J2034
10869H7426a25463C80396o2072b90237B05475Q4221a21166k926e3053j10640F7994
$$ y = [580782, 273771, 325483, 223130, 168371, 154832, 255381, 196146, 192706, 146675, 286999, 252520, 150712, 228921, -130274, 219695, 156430, -5742, -158675, -151733, -49418, 111793, -41701, 221952, -33325, 21527, 2024, 319300, -389178, 195092, 86215, -281523, -92632, 103724, 68314, 139391, 293384, -229857, -149655, 199079, 102900, 149136, 218777, -64744, 181208, -63448, -28579, 218870, -173665, 282350, -163524, 103181, -162030, 22234, 7663, -52059, -363396, -43025, 13016, -88960, -471989, -160380, 164357, 88669, -5440, 80626, -44793, 162989, -180381, 155261, 187205, -94480, -98078, -269914, 84860, -22156, 19937, 101833, 75392, 87426, -125463, 380396, 318324, -290237, 205475, 289696, -121166, -124092, -53053, -163693, 67994]
10857b17143B03704a8690A46055a2362B26317p3181a31255j62063H7698J2073
10847I9771B5253h993j52602e5939j03144B11034b06028G1906g574I6847b31341
10835B03576j6331b08457A47832g7211l00747B98085E8271g3077A03352A9404
10824H5413b39227H278k670N2037J99498c19935c8568m5476L8539j45213I2948
10812b00837C6332d526k6728k29656c1744B652a19287E9411d03818A23307P0316
10801A93623g3412k12305a16910j72828P4015M9999a9310j76817K6198m40649
10791f10578H240c89320a22135B35564b08042m8262g6427H5886k2649a60528C5790
10779d14735B34025F3821B571c01083a6425m47514J65268F232O7611C2150f8452
$$ y = [-217143, 203704, -18690, 146055, -12362, 226317, 153136, -131255, -293318, 87698, 99771, 25253, -8993, -161595, -55939, -159083, 211034, -206028, 71906, -7574, 96847, -231341, 203576, 187245, -208457, 147832, -77211, -377958, 298085, 58271, -73077, 103352, 19404, 85413, -239227, 8278, 5608, 57645, 257143, -319935, -38568, -84044, -45505, -190718, 92948, -200837, 36332, -4526, -31254, -260910, -31744, 2652, -119287, 59411, -403818, 123307, 193623, -73412, -285717, -116910, -289738, -215723, -165724, -19310, -196127, -169929, -610578, 8240, -389320, -122135, 235564, -208042, -256304, -76427, 85886, 63237, -160528, 35790, -414735, 234025, 63821, 2571, -301083, -16425, -463939, -298671, 6232, 73843, 32150, -68452]
10767I6433B6550N8678B121O3819B8627h1035K6637B95967b90043R1920M5455
10756a52668j04923a02674j30828P6766B28044b49203j08900C59973a26301D4418
10745g4288B9993O2610Q308N498a55927c6192j38937g6650K6930j59280h3956
10733b26064B1725e739A13328P6412a35560B39884n436i7690j46440D6181a54632
10721f8142m30933a2905A98790c7144q9889l5392E6232a83367L6603A55486f9558
10709C9110J29378d211A57979D6196k0651a32770I2789O6843E2430A9940d51393
10697a7025j07227m3207c4735A27056C8216b80650B4035b48621N2168P6758L6204
10686h3491A25777h0921j29430a8907m1677l7513H1898c05358J38624k0203P4984
$$ y = [96433, 26550, 85228, 2121, 65940, 28627, -81035, -54398, 295967, -290043, -198123, -152668, -257591, -102674, -233502, -156736, 228044, -249203, -358103, 359973, -126301, 44418, -74288, 29993, 92603, 100911, 106409, -155927, -36192, -175129, -76650, -49720, -209000, -83956, -226064, 21725, -5739, 113328, 189740, -135560, 239884, 234448, -97690, -244130, 46181, -154632, -68142, -499075, -12905, 198790, -37144, -127033, -162425, 56232, -183367, -146764, 155486, -69558, 39110, 168488, -4211, 157979, 46196, 25545, -132770, 92789, 159632, 52430, 19940, -451393, -17025, -124252, -167459, -34735, 127056, 38216, -280650, 24035, -248621, -196453, -119695, -83491, 125777, -80921, -210351, -18907, -60584, -98097, 81898, -305358, -166734, -186937, -111953]
10675a11953A23867J36163c20880i5424k6822k8599n4021f4032k57482i869n14168
10664e24037a61389j70466J44811B085c28299M2111J39655D695a59394O1653M4355
10653e3386k61040c292n6411A32651e0969K446k6368K4578m3525L8832k0098k2931
10641i8035P291L3846I4898K36098F3124P9340a48766E9540a79748j852e77k3974
10629b4551k61154J25852G4432d12695C35215a64758g9557j10543c2568q1038
10619a13606A5471J66516B9132d41599h988k69928A90686a07300l8835k16714
10609c62849a20542k3552j26494K5723A30610h7567l56619C3758b2819k83011
10599c05830a35813A58430F0556J31984d2267j39998J7287C3004J2644h9613J4561
$$ y = [-111953, 123867, 260030, -320880, -95424, -122246, -150845, -204866, -64032, -321514, -9869, -524037, -161389, -331855, -187044, 2085, -328299, -286188, -146533, 4695, -159394, -97741, -53386, -314426, -3292, -59703, 132651, -50969, -48523, -74891, -50313, -93838, -55006, -75104, -98035, -90744, -56898, 94898, 330996, 63124, 142464, -148766, 59540, -179748, -181600, -577, -24551, -285705, -159853, 74432, -412695, 335215, -164758, -79557, -190100, -32568, -113606, 15471, 181987, 29132, -441599, -8988, -278916, 190686, -107300, -146135, -362849, -120542, -144094, -270588, -244865, 130610, -87567, -444186, 33758, -22819, -305830, -135813, 158430, 60556, 192540, -42267, -182265, -164978, 33004, 45648, -89613, -75052]
10588g5052k25357h8126A99418N074f5435k25664a27612F2600b30234M5024Q8137
10577i7073o3857f8701H1325a23243B65870a05175b0634D442a48258B38162L1379
10566B69541c14736g5371j47672a03455H8708a85409a8031j00403m6795C08416
10555A81561j7062O7423a55364C1862L8661k344a49302A34582M8162a1388D14063
10543a39549K5846J0331j84284a35762N9575G8452M2598m9933a84950d9498E5024
10531d55358B35780b80801C4993b17779e8340J0705j93571O6758C4209L0053N1549
10520A15811a56255B69a57789A7030J34579J08818N6293A42932A9193K0226A1500
10508D34940a36488f0652k09440f1845G3157c6514C25643a60487D75521b50206
$$ y = [-75052, -300409, -88126, 199418, 204492, -65435, -291099, -127612, 62600, -230234, -185210, -97073, -160930, -68701, 81325, -123243, 265870, -105175, -20634, 4442, -148258, 238162, 269541, -314736, -75371, -223043, -103455, 88708, -185409, -18031, -118434, -165229, 308416, 181561, 164499, 231922, -155364, 31862, 70523, 68179, -149302, 134582, 182744, -11388, 414063, -139549, -113703, -103372, -287656, -135762, -76187, 78452, 121050, 71117, -184950, -49498, 55024, -455358, 235780, -280801, 34993, -217779, -58340, -47635, -241206, -174448, 34209, 64262, 115811, -156255, 269, -157789, 17030, 151609, 260427, 316720, 142932, 19193, 39419, 11500, 434940, -136488, -60652, -270092, -61845, 73157, -36514, 325643, -160487, 475521, -250206]
10497b9101k17767k30586a8760j85784K5197p758m5196d2096A22466J50530b44087
10485D1004b66062p370I4634a39311L6564A12124J11661p0424a25309G9127Q2284
10474A61411a9328k49843a2364j549C2743b8574j6793C52036B1428J34956n5960
10463A00424l7327P6068b73478g4578C93643i8843b7676k78791f9552m60612A22769
10451f6440C2536a92807n9244b5455m1390A38965a21944B16870q0375a80859A31062
10439A11127a38577d6018K0306j00268G8390a41993K5486E4644a77231c0915r6563
10428a27478C1735J43819a87502P5609H1679Q9436d0849j7932G2984a45280b5683
10416b79768a3824A33216B3441d11802g0338K272l8442c0008p3886H8100a85040
$$ y = [-29101, -246868, -477454, -18760, -204544, -179347, -187105, -232301, -42096, 122466, 272996, -244087, 41004, -266062, -273432, 94634, -139311, -102747, 112124, 223785, 153361, -125309, 79127, 161411, -19328, -269171, -12364, -13913, 32743, -28574, -45367, 352036, 21428, 156384, 100424, 63097, 139165, -273478, -74578, 393643, -98843, -27676, -306467, -69552, -530164, 122769, -66440, 32536, -192807, -252051, -25455, -66845, 138965, -121944, 216870, 136495, -180859, 131062, 111127, -138577, -46018, -25712, -125980, 78390, -141993, -116507, 54644, -177231, -30915, -127478, 31735, 175554, -187502, -111893, 81679, 171115, -40849, -58781, 72984, -145280, -25683, -279768, -13824, 133216, 23441, -411802, -70338, -68066, -106508, -30008, -103894, 88100, -185040]
10404a97516L0532A99354n350c24573D3437B0753J83996a01228G3289K2387J25640
10393B21316a74697A42486i9415C08606N2048a02832I7657b6599A59163b97226
10382D19197A49333g230C20491A33538J04466I6600J29891E4958g457o6507B22490
10370F2366M12148j64898k1692m0256n0590Q6411J55955k13492L0358J50172j96653
10359B09829J57162g086B24791p5816K89843E0134J66890J90485J53503j94634
10349C66378J26716j3330j25960j37454j6903J32414J1427q7478r3387E9493K91233
10338C50726F4133Q0015b25895E6461k1125J04494k9537i1156A4028m794R9925
10327A09159m1977J3517B2949J57833K9941D1419a47045C24208q4740p7192l6899
$$ y = [-197516, -166984, 199354, 194004, -324573, 43437, 20753, 204749, -101228, 73289, 95676, 221316, -174697, 142486, -99415, 308606, 360654, -102832, 97657, -26599, 159163, -297226, 419197, 149333, -7230, 320491, 133538, 238004, 96600, 226491, 54958, -7457, -73964, 222490, 62366, 474514, 309616, 287924, 247668, 197078, 283489, 439444, 225952, 256310, 406482, 209829, 366991, -7086, 224791, 148975, 438818, 50134, 217024, 407509, 561012, 366378, 493094, 479764, 353804, 216350, 199447, 331861, 343288, 255810, 162423, 59493, 350726, 64133, 144148, -225895, 56461, 35336, 139830, 110293, -91156, 14028, 9234, 109159, 67182, 80699, 22949, 180782, 210723, 41419, -147045, 324208, 239468, 162276, 125377]
10316A25377h1041B95772a20429A43302b74178A60943d3792j53002E610e2837
10305a55821p2282l5882J18009g2306B03863d5759j42429h3540q9171M2110B5365
10293b78385a0331A41429d4778o1857j15349P2260A01577e2409A91153A0037J30730
10282A40767l9186a72636K2229M1857C92339E6200g7739B71241a22400k1524j9061
10271a62985I2151b48448A54039L0020a84751j48379R7787G2898c629B31749k1421
10260B10328J40158R091j43123E080J25826K95238b41765D37236A04988b02243
10249E3030b12219A05205E92J38472M1298a42084L8584i396j99879P5479f1087
10237d96986G294d1911j30125A52221d1466A38339b4734O340j11914H1682A9765
$$ y = [125377, -81041, 295772, -120429, 143302, -274178, 160943, -43792, -196794, 5610, -52837, -155821, -228103, -263985, -145976, -72306, 203863, -45759, -188188, -83540, -172711, -130601, 25365, -278385, -10331, 141429, -44778, -106635, -221984, -149724, 101577, -52409, 191153, 10037, 140767, 101581, -172636, -150407, -108550, 392339, 56200, -77739, 271241, -122400, -143924, -162985, 92151, -248448, 154039, 184059, -184751, -333130, -235343, 72898, -3629, 231749, 210328, 350486, 359577, 216454, 5080, 130906, 426144, -241765, 437236, 104988, -202243, 53030, -212219, 105205, 592, 139064, 180362, -142084, -103500, -9396, -209275, -133796, -61087, -496986, 7294, -41911, -172036, 152221, -41466, 138339, -24734, -18394, -130308, 81682, 19765]
10225b19509h945j31881B55031d79655H334a4043A17861c47720Q7152A7514b26695
10213H2962b17113L8865O9543o6134n6640F9671O1771m575b17150R126E8130d7695
10200a48150J4748A13879i8129J084k27512K2972A00129c1406j7343F1092J9523
10189H0615J7240l859a62084B06676C6244b9088l30128A64856a03285q351D5605
10177a0204p746j0791j8984e820A5573b2027A14970O5005o529a69272j11486B29588
10164b38830J01089a1900m35828E2780Q3483a05630c0097D8544b49059h0267L065
10153g7202c7206l44336A68267J4402a1053j9515H447a59979d510j29791d0535
10141a48328H040a72337f6561A15867b73060J22404d6877C7227a8819D4329a88167
$$ y = [-219509, -8945, -140826, 255031, -479655, 8334, -14043, 117861, -347720, -260568, 17514, -226695, 82962, -217113, -178248, -108705, -174839, -231479, 69671, 131442, 126867, -217150, -208024, 58130, -47695, -148150, -133402, 113879, -98129, -97045, -324557, -301585, 100129, -31406, -48749, 61092, 80615, 97855, 93996, -162084, 206676, 36244, -29088, -359216, 164856, -103285, -111636, 45605, -10204, -17950, -28741, -47725, -5820, 15573, -22027, 114970, 179975, 173446, -169272, -280758, 229588, -238830, -137741, -11900, -447728, 52780, 136263, -105630, -30097, 48544, -249059, -80267, -77202, -37206, -381542, 168267, 182669, -11053, -30568, 8447, -159979, -4510, -134301, -40535, -148328, 8040, -172337, -66561, 115867, -273060, -150656, -46877, 37227, -18819, 44329, -188167]
10129a15898A94822a70048M2945K0774B45161B4555K6385a99892A72212b04480
10118a65673d5786D9674a22044C6040g9144q4957K0844K5326b4686k54210C2090
10106b53102O1568E6972K1202k3415a09982N4755C1429E194c432j88611k04037
10095c96080b3950B12656a4075A12214b32276n1852J3427B21948n8898A3103i8379
10083b4315L381j52273C5543e38777g9851C9271D787b87585B08873c8166B33445
10071f52A71215a22216A06270b09709D973a33986c7582B7955a83529o81B90246
10059b5993I3205a6928B23175j5247a49664K3708k4812A85795l253a08968m66889
10048e75857b68155m8477J58239e7174A01188B5645J51399c12284J11099h5002
$$ y = [-115898, 194822, -170048, -127103, -106329, 245161, 24555, 50940, -199892, 172212, -204480, -165673, -45786, 49674, -122044, 36040, -79144, -164101, -143257, -117931, -24686, -278896, 32090, -253102, -191534, 56972, 78174, 54759, -109982, -55227, 31429, 5194, -3432, -192043, -396080, -23950, 212656, -14075, 112214, -232276, -284128, -270701, 221948, 163050, 13103, -98379, -24315, -20934, -173207, 35543, -538777, -79851, 39271, 4787, -287585, 208873, -38166, 233445, -652, 171215, -122216, 106270, -209709, 4973, -133986, -37582, 27955, -183529, -184210, 290246, -25993, 93205, -16928, 223175, 207928, -149664, -125956, -150768, 185795, 182542, -108968, -575857, -268155, -316632, -158393, -57174, 101188, 25645, 177044, -312284, -201185, -85002]
10037E1097J02628C5162a78778q1162B09176b0116j63559o6455m2940e7688l39328
10026c97016P0555A13649c21986F0156A1902J55375g4286r3365f3203j08432B32975
10014a61860e1019j32108P2835B98640G0773i4973j61916A5181b48977P4285l5229
10003b09921g3389H0166e9046k1687m62577J37622J69310r4195B43590h4864J6785
9992f8079j3152r187C4402J39904b88489B1623a23880e9580j57890a3208A77321
9980b2276A02094a0846o4801B27823C0218a67915o4893N2694p4166A41122b48923
9968b39067A24882g2721C4186b54739c5449k39088J12856O7985q2263B0911d8106
9956a49667M1607q5289A64461K7644g4742A00915g0506l49983a95375A50069d31972
$$ y = [51097, 153725, 35162, -178778, -259940, 209176, -20116, -183675, -250130, -293070, -57688, -397016, -326461, 113649, -321986, 60156, 11902, 167277, -74286, -167651, -63203, -171635, 232975, -161860, -51019, -183127, -110292, 298640, 70773, -94973, -256889, 15181, -248977, -174692, -209921, -73389, 80166, -59046, -80733, -543310, -405688, -236378, -330573, 243590, -84864, -68079, -81231, -90418, 34402, 174306, -288489, 21623, -123880, -59580, -217470, -13208, 177321, -22276, 102094, -10846, -75647, 227823, 30218, -167915, -232808, -180114, -254280, 141122, -248923, -239067, 124882, -72721, 34186, -254739, -35449, -274537, -161681, -93696, -175959, 20911, -48106, -149667, -108060, -193349, 164461, 192105, -74742, 100915, -70506, -420489, -195375, 150069, -431972]
9944g5543B38483c22175F4074f5546P756A27681A3621a81133p525e1821A45040
9932I2709a02827N534d7576A29840a57229r0130F2568K23620A38883b24878a06420
9920b66409a04702B07230d23801J33047P2178j95264a24117e0840A92063p4371
9910A17692D8636b6157A9204M4344c27A1148K26444J3138j24262f890B24378G337
9897e6535F2868k9260b97492J03934A30113d5621A12824J15761a24365A19288
9886a61575A80482a78065B38143e78352d7610C7558a73440G2100b6246A25020
9875i1627k66504A11437b59815b5472C0717K48631D1860c05025M2760N7033F9626
9863c5160d13l58655i2774K7146A3097h1046a5195o9383B0480a55872A14556r189
$$ y = [-75543, 238483, -322175, 64074, -65546, -57790, 127681, 13621, -181133, -188658, -51821, 145040, 92709, -102827, -97293, -47576, 129840, -157229, -247359, 62568, 286188, 138883, -224878, -106420, -266409, -104702, 207230, -423801, -290754, -218576, -413840, -124117, -50840, 192063, 117692, 48636, -26157, 19204, 63548, -327, 11148, 237592, 250730, 126468, -6890, 224378, 7337, -56535, 62868, 33608, -297492, -193558, 130113, -45621, 112824, 228585, -124365, 119288, -161575, 180482, -178065, 238143, -578352, -47610, 37558, -173440, 72100, -26246, 125020, -91627, -358131, 111437, -259815, -25472, 30717, 279348, 41860, -305025, -262265, -205232, 69626, -35160, -413, -359068, -92774, -65628, 13097, -81046, -15195, -84578, 20480, -155872, 114556, 105367]
9851A05367j250a44561q4l1045k51209J54190A42959F0997Q660c11275J47421
9840a63854k44993a92433C79847C1895b4932E5321b1574m5516j07345h0719k54738
9829c35457a3237A203M6422J07911E3408a61967n2765j40807J9606A22208n9038
9818F3170a50890A82636a21584C764c1956n3155A37221h2957l28806G5044R4226
9807A69270a1614F3389b83488f4656F2417K6005B4518d64598C04572a02499G8052
9795a14338E6118a07900p5742L9913B58533F6865e9139k22039i138I5485m0412
9784E5073K01375a31705m703J2491n7432H6233c652j32109J9372j41104j54516
9773d12009a11498A69891f2381l6950B42907a10875B01079b81543G1575a59564
$$ y = [105367, 104117, -144561, -144645, -175690, -426899, -272709, 142959, 60997, 69657, -311275, -163854, -408847, -192433, 379847, 31895, -24932, 55321, -21574, -67090, -174435, -80719, -335457, -13237, 1203, 47625, 155536, 53408, -161967, -214732, -355539, -335933, 122208, 63170, -150890, 182636, -121584, 3764, -31956, -85111, 137221, -82957, -411763, 75044, 169270, -11614, 63389, -283488, -64656, 62417, 88422, 24518, -464598, 304572, -102499, 78052, -114338, 56118, -107900, -183642, -143729, 258533, 66865, -59139, -281178, -9138, 95485, 55073, 256448, -131705, -136408, -123917, -181349, 86233, -3652, -135761, -116389, -257493, -412009, -111498, 169891, -62381, -99331, 242907, -110875, 201079, -281543, 71575, -159564]
9762a02880j1917A03332a9894A15955a63362B65282q3377c78186B44498a14488
9751e24377A44126c9157r720k06627R4054j75486M9626a34147m1377N7159K7740
9740i0625A04145J02094a43830b8492p7960l06489h7062B1788J59888a95722j1927
9729b07649k9521h757k63718Q3633d2005k30406C6772a04559d2156p2589d7079
9717a40764F968J35816c16110B25139h5219C00893h5521q7200E6726A3963i1650
9705a34798H1443f7219j19102B4971a4887m86995a53731G3721c18604J13947b6245
9693i007j78903A68739b06504m68F7759C2654A1297M72406H4529a81634J2312
9682a69322A29216b18482Q777c1931r0194e9152H8211b41246C7545b95031B32570
$$ y = [-102880, -114797, 103332, -19894, 115955, -163362, 265282, 181905, -378186, 244498, -114488, -524377, 144126, -39157, -48877, -255504, -161450, -336936, -287310, -134147, -175524, -118365, -90625, 104145, 206239, -143830, -28492, -106452, -412941, -87062, 21788, 181676, -195722, -207649, -237170, -8757, -272475, -188842, -42005, -272411, 36772, -104559, -42156, -114745, -47079, -140764, 6968, 142784, -316110, 225139, -85219, 300893, -85521, -172721, 56726, 13963, -91650, -134798, 81443, -67219, -186321, 24971, -14887, -501882, -153731, 73721, -318604, -204657, -26245, -9007, -187910, 168739, -206504, -206972, 67759, 32654, 11297, 483703, 84529, -181634, -169322, 129216, -218482, -209705, -31931, -122125, -59152, 88211, -241246, 37545, -295031, 232570]
9670a10814A18071f492j90526A92024a02294o9511e6919B46568a33069A09075
9659b4137m9312L1911a4009m77838E8886b27066e4941K4922j25512g0761K448
9648f8313j44837C7908G653b21918a01073C2679a71914n0535H0589a60780q6985
9637b47765K9508K3136A09040A0677N5704b29409Q3424d4943A69653c2182l78259
9626d10441B21687c07326c5384l32644B11711a99972N2146H9864K7352b44048
9615a97871M3302j09446B82497i0601A99341r4205a23559B0143i9909B38131m5844
9604A92287d3850A06762a24631c288k15577j91449H5818b2960l48134b5594l59122
9593c84716A0205a55153G8669M5998i5303k50182J69426m5449Q3083j1522J3465
$$ y = [-110814, 118071, -6492, -197018, 192024, -102294, -171805, -56919, 246568, -133069, 109075, -24137, -73449, -41538, -14009, -491847, 58886, -227066, -54941, -30019, -155531, -70761, -68313, -213150, 37908, 7653, -221918, -101073, 32679, -171914, -222449, 80589, -160780, -247765, -218257, -195121, 109040, 10677, 66381, -229409, -145985, -44943, 169653, -32182, -410441, 221687, -307326, -35384, -368028, 211711, -199972, -147826, 89864, 117216, -244048, -197871, -154569, -264015, 282497, -90601, 199341, 105136, -123559, 20143, -99909, 238131, 192287, -43850, 106762, -124631, -3288, -218865, -410314, 85818, -22960, -371094, -25594, -384716, 10205, -155153, 78669, 124667, -95303, -345485, -176059, -221508, -138425, -149947, -136482]
9582a36482A55714b18371A9853f7028H250c43952A51548g1197A10531D1462b05278
9570b26802A71518D7664a75753O036g0459j14720j9147A01389R5819b06995E1900
9558A37928f3416C9977J14101E8038f2263j57042i2918A6653b50462A47872C7663
9546a16362k6961r0462i1167j02121k84996b21462C06736A16014a18284B11425
9535a37838I2362c18643h6718o8862b8218k50096p0067C0767d02557P5658I8929
9523b48744B44801I5707b87125a0040A05626a33542H7691c96728J37364Q6777
9513a72587D4268a87213i3467J8988B09127a53010G5468a24458o2850h9982n7108
9502a47090A70528f0739k16707a8138m9172j52470m204F7106i9234A08597b5270
$$ y = [-136482, 155714, -218371, 19853, -67028, 8250, -343952, 151548, -71197, 110531, 41462, -205278, -226802, 171518, 47664, -175753, -169717, -70459, -185179, -204326, 101389, 197208, -206995, 51900, 137928, -63416, 39977, 154078, 58038, -62263, -219305, -92918, 16653, -250462, 147872, 37663, -116362, -143323, -233785, -91167, -193288, -478284, -221462, 306736, 116014, -118284, 211425, -137838, 92362, -318643, -86718, -155580, -28218, -278314, -348381, 30767, -402557, -326899, 98929, -248744, 244801, 95707, -287125, -10040, 105626, -133542, 87691, -396728, -259364, -172587, 44268, -187213, -93467, -74479, 209127, -153010, 75468, -124458, -187308, -89982, -147090, 170528, -60739, -277446, -18138, -67310, -219780, -223984, 67106, -99234, 108597, -25270]
9490A1043c43936A74631a42108a7941j15499A64554B5624f5338q6208r22d0103
9478c13463M4929k7172h7164k90208a04587q4179q7303B3087j0761J89019c93896
9466g652k79630b3367H487d4437k5115A27315H512K61866r0067a49471A81110
9454A82783a95565A42217b38221J18411M9871A40570R6549j15407d8598A47559
9443a49497j5266M8541j33003Q9523q1905o2737i1885l4615q1982D0711R2632
9432A33343b08155A03899a16329B85574m5629k5113a32713h893j40157b1505A85943
9420b33779J16335p9798l7272d6767n3574c8822o125j28050B13693c935k2968
9409b6903I4654a9503m4091E5681j6853a6751k68040n193k52936K26779J18678
$$ y = [11043, -343936, 174631, -142108, -17941, -133440, 164554, 25624, -65338, -151546, -152468, -40103, -313463, -268534, -295706, -87164, -377372, -104587, -188766, -276069, 23087, 12326, 201345, -393896, -7652, -287282, -23367, 8487, -44437, -69552, 127315, 8512, 270378, 180311, -149471, 181110, 182783, -195565, 142217, -238221, -119810, -69939, 140570, 237119, 121712, -48598, 147559, -149497, -164763, -116222, -249225, -159702, -241607, -304344, -91885, -126500, -208482, 40711, 133343, -208155, 103899, -116329, 285574, 239945, 214832, -132713, -8893, -149050, -21505, 185943, -233779, -117444, -197242, -234514, -46767, -100341, -38822, -44947, -172997, 213693, -3935, -26903, 94654, -19503, -63594, 55681, 38828, -16751, -284791, -289984, -542920, -316141, -197463]
9398a97463K516e3712A30604i7983B99566i5072k60160A06510a54928a93j43289
9387a43482e5878k451j55219G142a88090k61688f3059I668c6678J0891n7437K0474
9375f2750a7578j81147j37837H2529j0122a49079B9337i7467B8801e1828H2100
9363a29781b2529H5425d11152A0834J98038N7000n7180A5702b3944F3832J0317
9352G4149a77051O0938A0148M77b54371a08965J2745M4732i337k69896F6632b47980
9339a3286k22333B27984F8483J06001d6948N622k85178A2521e2411l70701O9115
9328c53997N285D280N5058e5487B8967h5256C08899c47277J70325B68110o1013
9317B07097a41764a2452j63162B44702b13796A4190h5026m00777a1659B6522c12577
$$ y = [-197463, -194947, -53712, 130604, -97983, 299566, -95072, -355232, 106510, -154928, -193, -143482, -55878, -58329, -213548, 7142, -188090, -449778, -63059, 9668, -36678, -25787, -83224, -62750, -17578, -198725, -336562, 82529, 72407, -149079, 29337, -97467, 28801, -51828, 82100, -129781, -22529, 85425, -411152, 10834, 208872, 265872, 208692, 15702, -23944, 63832, 74149, -177051, -116113, 10148, 10625, -254371, -108965, -96220, -51488, -9337, -279233, 66632, -247980, -13286, -235619, 227984, 68483, 174484, -46948, -41326, -326504, 12521, -52411, -423112, -353997, -348712, 4280, 59338, -55487, 28967, -85256, 308899, -347277, -176952, 268110, 207097, -141764, -12452, -175614, 244702, -213796, 14190, -85026, -485803, -11659, 26522, -312577]
9305e9731C2160d3026A45766O4315b20170K4004O3849p1406a1060l33238C26894
9293C1627r525A156a72908A469K06214m9003g4820k53350J15707B31244g3490
9281A06799c95607J17557d1880l6640B24016b42104J2047E775J60073F9879a86755
9269H6743b17272A49735D0363a05997k02748O4965A86770D1056J66755p3968A2014
9257c90672c8049E5908a08852j1598j91785A09633a70120J7392g1194o0283A23888
9245D673K38894a6061n1813K8063o6831F8871b66631D11273c04987e8527l9551
9234i8078c781k9611l961B19381B5984b56159A85502f9254j85888i4400n6630
9223a51030I7913C1502i5001B01570c28475i6350A63906b4156j25474I9718b0183
$$ y = [-59731, 32160, -43026, 145766, 210081, -220170, -196166, -132317, -203723, -11060, -344298, 326894, 31627, 22102, 1156, -172908, 1469, 207683, 158680, -74820, -328170, -212463, 231244, -73490, 106799, -395607, -278050, -41880, -78520, 224016, -242104, -230057, 5775, 165848, 69879, -186755, 86743, -217272, 149735, 40363, -105997, -308745, -243780, 186770, 41056, 207811, 133843, 12014, -390672, -38049, 55908, -108852, -120450, -312235, 109633, -170120, -152728, -71194, -131477, 123888, 4673, 243567, -16061, -67874, -39811, -106642, 68871, -266631, 411273, -304987, -58527, -98078, -3781, -33392, -37353, 219381, 25984, -256159, 185502, -69254, -255142, -94400, -151030, 97913, 31502, -95001, 201570, -328475, -96350, 163906, -24156, -149630, 99718, -20183]
9211A74378a77749C5068d72578F5018a42363j00674c6710l75694a11834K2791
9201h9043k63069J31543C8487A2054a88272o6575i5445j81873D8313O5313D8278
9189f2790o0269B17397a53121F1748J26892H6763M6775a91981b4464d832l5831
9178d0663n1372B48289a87141A34505a75676j52023i3835I6007a7905k4309G207
9166g6043m7263a3481A33221b84643C9531b43210A83173b6827o3535O583A9014
9154B24304r3127d5412j10693b2848C43035a04398A34849c33665A6417K5555a40317
9142H7990e1323k53614A23448H244K26784a2012n5645A47757c58913c3124k8680
9131f1804j78506A8652J43064b6831k39084i2332j37834N1669F702J26944K54725
$$ y = [174378, -177749, 35068, -472578, 65018, -142363, -243037, -36710, -412404, -111834, -89043, -352112, -220569, 38487, 12054, -188272, -254847, -95445, -277318, 48313, 113626, 48278, -62790, -123059, 217397, -153121, 61748, 188640, 86763, 133538, -191981, -24464, -4832, -40663, -92035, 248289, -187141, 134505, -175676, -327699, -93835, 96007, -17905, -42214, 7207, -76043, -123306, -13481, 133221, -284643, 39531, -243210, 183173, -26827, -90362, -83779, 19014, 224304, 131177, -45412, -156105, -22848, 343035, -104398, 134849, -333665, 16417, 41972, -140317, 87990, -51323, -304937, 123448, 8244, 235028, -12012, -67657, 147757, -358913, -33124, -61804, -240310, 18652, 161716, -26831, -265915, -92332, -230166, -178497, 6702, 133646, 388371]
9120C88371j27748n9335E456c31934D3108e5628G7500b33753k06093K18575I6296
9108a62566F4744P8612b42290F3232a03442a5069A86563h4682A5837f917j8590
9097b5507D2898a24914k7429A82032C2250b64936a29934e4177J948J4168E4919
9085D0603M4560J0104J25416A8599F377e8717k91915A96488E1387e2637k12202
9074b64839A38225C1107i9617r2238f0159A46293c3j25193n4154B40405A0281
9062a38511k9538A1905a2179J663E697a18229D41416A36962J04023e6431l33278
9051c89709b0548B73634b29271L5500d8203F1970b82704a13529o1410E7152c48456
9039b66988i729j41385A17703m6844M0755e50888C9891d46919B83930b21495A33958
$$ y = [388371, 260623, 201288, 5456, -331934, 43108, -55628, 77500, -233753, -439846, -221271, 96296, -162566, 64744, 143356, -242290, 63232, -103442, -15069, 186563, -84682, 15837, -6917, -25507, 42898, -124914, -152343, 182032, 32250, -264936, -129934, -54177, -52229, -38061, 54919, 40603, 85163, 95267, 220683, 18599, 6377, -58717, -350632, 196488, 51387, -52637, -264839, 138225, 31107, -99617, -191855, -60159, 146293, -33, -125226, -179380, 240405, 10281, -138511, -168049, 11905, -12179, -10516, 5697, -118229, 441416, 136962, 240985, -56431, -389709, -20548, 273634, -229271, -193771, -48203, 61970, -282704, -113529, -174939, 57152, -348456, -266988, -9729, -151114, 117703, 70859, 111614, -550888, 39891, -446919, 283930, -221495, 133958]
9027a01133c7406j72715A44957a0831j14507A1258a6312j05295A32701f4996M006
9016f0990A68870b85501E7907J6503d25737A9519J9614a3027j19785p0944a8556
9004A86996K1071b2316l8457k75485A48056O3678a59795B7652J8686b31819e6081
8992E89441B10818a87932d2687B5931e33914a37179A93612a4699k14326b591l06945
8981c09536a25838k68426a84249k08149B08131j00485d6479K0806J065A618O2254
8970F3872J0972J48186k4866b00971P7137N8302j08240b9923A31593D0449j2392
8959B8057a7693j50645e7472k09352J32790l7928D032c85875C7624R460c986m6305
8947e0291q8996B72711A01830a84816Q0188k9753p155B21614b01058i550l9167
$$ y = [-101133, -37406, -210121, 144957, -10831, -125338, 11258, -16312, -121607, 132701, -64996, -60990, 168870, -285501, 57907, 74410, -425737, 19519, 39133, -13027, -132812, -203756, -18556, 186996, 208067, -22316, -60773, -336258, 148056, 211734, -159795, 27652, 46338, -231819, -56081, 589441, 210818, -187932, -42687, 25931, -533914, -137179, 193612, -14699, -229025, -2591, -309536, -125838, -394264, -184249, -392398, 208131, 107646, -46479, -25673, -24608, 1618, 63872, 74844, 223030, 198164, -200971, -123834, -65532, -173772, -29923, 131593, 40449, 28057, -17693, -168338, -57472, -266824, -134034, -171962, 4032, -385875, 37624, 47084, -3986, -50291, -139287, 272711, 101830, -184816, -104628, -134381, -141536, 221614, -201058, -9550, -48717]
8936d8717j21288C82384J52959i086A59010C6626J32191E6721F752K24209K55843
8925D86804J07624M09323L439347Q749310M086766D255871A142385B13544L01532
8916E15076m1735m2599B05407E6908f2890C16686d1848D72110L03518B97807P2267
8905C70074j74294F8193J24089o1785a31390C0505J33614b4282j42080A37917
8894a66441B50589o8364b69744J12035A53078G0469K17182a23875j38685I768
$$ y = [-48717, -170005, 382384, 535343, -9086, 159010, 36626, 168817, 56721, 6752, 230961, 486804, 594428, 1003751, 4443098, 13192408, 17279174, 4255871, 1142385, 213544, 515076, 473341, 430742, 205407, 56908, -62890, 316686, -41848, 472110, 775628, 297807, 370074, 195780, 68193, 192282, 130497, -131390, 30505, 164119, -24282, -166362, 137917, -166441, 250589, 182225, -269744, -157709, 153078, 70469, 287651, -123875, -262560, 9768]
$$ [...]
##END NTUPLES=NMR SPECTRUM
##END=
