
##TITLE=UV1247_M9_1261-1207_70_7241305_NDJgzlZaKL
##JCAMPDX= 6.0         $$ Bruker NMR JCAMP-DX V2.0
##DATA TYPE= NMR SPECTRUM
##DATA CLASS= NTUPLES
##ORIGIN= BRUKER
##OWNER= Administrator
$$ 1.72 TOPSPIN		Version 2.1
$$ 2013-01-24 04:27:05.561 -0500  Administrator@X
$$ Compression mode = diff/dup
##.OBSERVE FREQUENCY= 400.02188249412
##.OBSERVE NUCLEUS= ^1H
##.ACQUISITION MODE= SIMULTANEOUS (DQD)
##.ACQUISITION SCHEME= undefined
##.AVERAGES= 64
##.DIGITISER RES= 22
##SPECTROMETER/DATA SYSTEM= spect
##.PULSE SEQUENCE= noesygpps1d.comp
##.SOLVENT NAME= COFFEE_meoh
##.SHIFT REFERENCE= INTERNAL, COFFEE_meoh, 1, 14.96095
##AUDIT TRAIL= $$ (NUMBER, WHEN, WHO, WHERE, PROCESS, VERSION, WHAT)
$$ ##TITLE= Audit trail, TOPSPIN		Version 2.1
$$ ##JCAMPDX= 5.01
$$ ##ORIGIN= Bruker BioSpin GmbH
$$ ##OWNER= Administrator
$$ $$ E:\/data/COFFEE/nmr/UV1247_M9_1261-1207_70_7241305_NDJgzlZaKL/22/pdata/1/auditp.txt
$$ ##AUDIT TRAIL=  $$ (NUMBER, WHEN, WHO, WHERE, PROCESS, VERSION, WHAT)
(   1,<2013-01-24 04:26:59.749 -0500>,<Administrator>,<X>,<go>,<TOPSPIN 2.1>,
      <created by zg
	started at 2013-01-24 04:15:29.357 -0500,
	POWCHK enabled, PULCHK disabled,
       configuration hash MD5:
       86 BA 57 50 F2 9D 5C 9B 26 00 A9 28 5F 66 2E 89
       data hash MD5: 64K
       7B 09 D6 2B B9 FE 0B 4B 87 B3 05 21 2B BC DA C6>)
(   2,<2013-01-24 04:27:02.749 -0500>,<Administrator>,<X>,<proc1d>,<TOPSPIN 2.1>,
      <Start of raw data processing
       efp LB = 0.3 FT_mod = 6 PKNL = 1 PHC0 = 0 PHC1 = 0 SI = 128K 
       data hash MD5: 128K
       92 5E 1F 9D B7 97 9B 2B 9D 67 7C 29 78 6F 47 81>)
(   3,<2013-01-24 04:27:03.780 -0500>,<Administrator>,<X>,<proc1d>,<TOPSPIN 2.1>,
      <pk PHC0 = -78.03589 PHC1 = 0 
       data hash MD5: 128K
       2A B9 F1 4D C2 0F 4F 0B 79 71 55 73 EE 73 40 9F>)
(   4,<2013-01-24 04:27:04.468 -0500>,<Administrator>,<X>,<proc1d>,<TOPSPIN 2.1>,
      <abs ABSG = 1 
       data hash MD5: 128K
       FD AC 83 BA 2A EE 5C 55 41 06 10 3F C1 D3 1A 92>)
(   5,<2013-01-24 04:27:04.640 -0500>,<Administrator>,<X>,<proc1d>,<TOPSPIN 2.1>,
      <abs ABSG = 2 
       data hash MD5: 128K
       36 EE E4 7C BD 0D 29 9F D3 3E A1 8B 8A F7 D8 0D>)
(   6,<2013-01-24 04:27:04.827 -0500>,<Administrator>,<X>,<proc1d>,<TOPSPIN 2.1>,
      <abs ABSG = 3 
       data hash MD5: 128K
       FA 44 A4 90 D9 DC 40 B0 5A D0 15 69 FB BA 92 85>)
(   7,<2013-01-24 04:27:05.030 -0500>,<Administrator>,<X>,<proc1d>,<TOPSPIN 2.1>,
      <abs ABSG = 4 
       data hash MD5: 128K
       A3 AF 7B 59 1A 72 16 44 7F 87 B7 01 59 EA 5B AE>)
(   8,<2013-01-24 04:27:05.218 -0500>,<Administrator>,<X>,<proc1d>,<TOPSPIN 2.1>,
      <abs ABSG = 5 
       data hash MD5: 128K
       64 4B 52 92 33 5A 96 9D 47 90 F5 54 05 27 BF BD>)
$$ ##END=
$$ 
$$ $$ hash MD5
$$ $$ 3F 60 5F 17 09 C9 16 67 09 52 EC B4 C1 41 1F BF
##$RELAX= 
##$RELAX= 
##$RELAX= 
##$RELAX= 
##$RELAX= 
##$RELAX= 
##$RELAX= 
##$RELAX= 
$$ Bruker specific parameters
$$ --------------------------
##$DU= <E:\>
##$EXPNO= 22
$$ [...]
##$TP07= 0
##$TPNAME0= <>
##$TPNAME1= <>
##$TPNAME2= <>
##$TPNAME3= <>
##$TPNAME4= <>
##$TPNAME5= <>
##$TPNAME6= <>
##$TPNAME7= <>
##$TPOAL= (0..7)
0.5 0.5 0.5 0.5 0.5 0.5 0.5 0.5
##$TPOFFS= (0..7)
0 0 0 0 0 0 0 0
##$TUNHIN= 0
##$TUNHOUT= 0
##$TUNXOUT= 0
##$USERA1= <user>
##$USERA2= <user>
##$USERA3= <user>
##$USERA4= <user>
##$USERA5= <user>
##$V9= 5
##$VALIST= <valist>
##$VCLIST= <CCCCCCCCCCCCCCC>
##$VD= 0
##$VDLIST= <DDDDDDDDDDDDDDD>
##$VPLIST= <PPPPPPPPPPPPPPP>
##$VTLIST= <TTTTTTTTTTTTTTT>
##$WBST= 1024
##$WBSW= 4
##$XGAIN= (0..3)
0 0 0 0
##$XL= 0
##$YL= 0
##$YMAX_a= 6193571
##$YMIN_a= -13911161
##$ZGOPTNS= <>
##$ZL1= 120
##$ZL2= 120
##$ZL3= 120
##$ZL4= 120
##$ABSF1= 14.96095
##$ABSF2= -5.597232
##$ABSG= 5
##$ABSL= 3
##$ALPHA= 0
##$AQORDER= 0
##$ASSFAC= 0
##$ASSFACI= 0
##$ASSFACX= 0
##$ASSWID= 0
##$AUNMP= <proc_prof1d_extract.lims>
##$AXLEFT= 0
##$AXNAME= <>
##$AXNUC= <1H>
##$AXRIGHT= 0
##$AXTYPE= 0
##$AXUNIT= <>
##$AZFE= 0.1
##$AZFW= 0.1
##$BCFW= 0
##$BC_mod= 0
##$BYTORDP= 0
##$COROFFS= 0
##$CY= 15
##$DATMOD= 1
##$DC= 0
##$DFILT= <>
##$DTYPP= 0
##$F1P= 0
##$F2P= 0
##$FCOR= 0.5
##$FTSIZE= 131072
##$FT_mod= 6
##$GAMMA= 0
##$GB= 0
##$INTBC= 1
##$INTSCL= 1
##$ISEN= 128
##$LB= 0.3
##$LEV0= 0
##$LPBIN= 0
##$MAXI= 10000
##$MC2= 0
##$MEAN= 0
##$ME_mod= 0
##$MI= 0
##$NCOEF= 0
##$NC_proc= -2
##$NLEV= 6
##$NOISF1= 0
##$NOISF2= 0
##$NSP= 0
##$NTH_PI= 0
##$NZP= 0
##$OFFSET= 14.96095
##$PC= 1
##$PHC0= -78.03589
##$PHC1= 0
##$PH_mod= 1
##$PKNL= yes
##$PPARMOD= 0
##$PPDIAG= 0
##$PPIPTYP= 0
##$PPMPNUM= 2147483647
##$PPRESOL= 1
##$PSCAL= 4
##$PSIGN= 0
##$PYNMP= <proc.py>
##$REVERSE= no
##$SF= 400.020009655851
##$SI= 131072
##$SIGF1= 0
##$SIGF2= 0
##$SINO= 400
##$SIOLD= 131072
##$SPECTYP= <>
##$SREGLST= <1H.CDCl3>
##$SSB= 0
##$STSI= 131072
##$STSR= 0
##$SW_p= 8223.68421052631
##$SYMM= 0
##$S_DEV= 0
##$TDeff= 65536
##$TDoff= 0
##$TI= <>
##$TILT= no
##$TM1= 0
##$TM2= 0
##$TOPLEV= 0
##$USERP1= <user>
##$USERP2= <user>
##$USERP3= <user>
##$USERP4= <user>
##$USERP5= <user>
##$WDW= 1
##$XDIM= 131072
##$YMAX_p= 406526581
##$YMIN_p= -28216
##$CURPLOT= <Network HP LaserJet P1505>
##$CURPRIN= <$Network HP LaserJet P1505>
##$DFORMAT= <normdp>
##$LAYOUT= <+/1D_H.xwp>
##$LFORMAT= <normlp>
##$PFORMAT= <normpl>
##$SURQMSG= 1
$$ End of Bruker specific parameters
$$ ---------------------------------
##NTUPLES= NMR SPECTRUM
##VAR_NAME=  FREQUENCY,     SPECTRUM/REAL,   SPECTRUM/IMAG
##SYMBOL=    X,             R,               I
##VAR_TYPE=  INDEPENDENT,   DEPENDENT,       DEPENDENT
##VAR_FORM=  AFFN,          ASDF,            ASDF
##VAR_DIM=   131072,        131072,          131072
##UNITS=     HZ,            ARBITRARY UNITS, ARBITRARY UNITS
##FACTOR=    0.0627417313425164, 1,          1
##FIRST=     8223.62146879497, -2491,        -68040
##LAST=      0,             0,               -68269
##MIN=       0,             -28216,          0
##MAX=       8223.62146879497, 406526581,    0
$$ Real data points
##PAGE= N=1
##DATA TABLE= (X++(R..R)), XYDATA
$$ [...]
64976 242297 245187 246286 245321 243026 240030 236249 231588 226549 221705 217084 212602 208761 206262 204887
64962 204887 203384 200797 197640 195384 194846 195439 196113 196573 197197 198069 198706 198771 198440 197884 196917 195415 193569
64945 193569 191420 188666 185347 182241 180047 178560 177271 176369 176446 177424 178597 179649 180905 182541 184226
64930 184226 185665 186881 187818 188186 187889 187158 186184 185118 184425 184571 185196 185208 184081 182488 181349 180726 180082
64913 180082 179228 178535 178451 179158 180504 181963 183007 183762 185032 187346 190316 193299 196367 200093 204665 209805
64897 209805 215498 222094 229550 237134 244251 251232 258911 267597 276864 286363 296388 307396 319150
64884 319150 330662 340970 349675 356621 361428 363685 363390 360832 356067 348940 339711 329389 319242
64871 319242 310175 302627 296772 292539 289611 287588 286104 284724 282876 280194 276888 273572 270602 267647
64857 267647 264006 259359 254103 248877 243882 238867 233780 229094 225317 222411 219928 217550 215200 212843
64843 212843 210511 208449 206868 205661 204637 203899 203501 202879 201253 198729 196458 195432 195565 196160 196774 197334
64827 197334 197875 198623 199979 201912 203683 204683 205341 206591 208543 210337 211439 212459 214346 217181 220188
64812 220188 222758 225104 227931 231709 236317 241239 246046 250711 255387 259885 263543 265765 266625 266672 266132
64797 266132 264592 261658 257696 253663 250235 247438 245137 243508 242786 242744 242765 242473 242161 242530 244033 246435
64781 246435 248983 251006 252323 253106 253498 253618 253730 254040 254283 254031 253552 253922 255974 259537 264023 269257
64765 269257 275210 281331 286908 291968 297096 302399 307366 311879 316667 322434 329037 335788 342238 348463
64751 348463 355011 362757 372345 383357 394294 403619 410587 414942 416290 414247 408923 400832 390470
64738 390470 378310 365118 351901 339588 328922 320480 314473 310554 308067 306489 305499 304767 303935 302823
64724 302823 301567 300534 300143 300648 301984 303929 306465 309875 314506 320599 328279 337344 346942 355820 363161
64709 363161 368979 373560 376792 378197 377319 373820 367549 358814 348389 336945 324731 312099 299983
64696 299983 289326 280221 272096 264639 258067 252591 248177 244879 242809 241666 240727 239585 238546 238055
64682 238055 238109 238503 239376 241105 243728 246826 250018 253335 257047 261200 265475 269522 273449 277844 283126
64667 283126 288846 293808 296985 298202 297869 296297 293554 289931 286103 282635 279513 276445 273528 271244
64653 271244 269715 268361 266584 264668 263642 264326 266820 270804 275799 281000 285305 288008 289371 290261 291376
64638 291376 293066 295700 299739 305347 312180 319734 327729 336077 344571 352766 360155 366387 371314 374802
64624 374802 376548 376117 373159 367557 359521 349668 338936 328146 317619 307393 297765 289256 282043
64611 282043 275890 270809 267270 265359 264169 262643 260772 259335 258573 257807 256475 254867 253543 252508 251402
64596 251402 250132 249004 248401 248617 249757 251542 253427 255258 257611 261134 265734 270834 276333 282823 290824
64581 290824 300282 310943 322752 335638 349255 363232 377375 391278 404049 414873 423682 430856
64569 430856 436398 439940 441436 441176 438964 434004 426008 415885 404877 393451 381608 369885 359215
64556 359215 349907 341537 333935 327524 322427 317911 313187 308382 304218 301023 298511 296412 294908 294398
64542 294398 295070 296713 298805 300857 302803 304968 307509 309978 311526 311377 309125 304810 298967 292409 285785
64527 285785 279430 273736 269325 266542 264974 263809 262584 261360 260327 259594 259256 259330 259606 259818 259895 259774
64511 259774 259103 257568 255550 254039 253684 254189 254878 255656 257164 260023 264083 268474 272425 276009 280014
64496 280014 285067 290985 297066 302756 307806 311978 314971 316669 317281 317242 317182 317792 319407 321766 324466 327614
64480 327614 331644 336545 341651 346156 349360 350448 348753 344589 339314 334144 329285 324567 320434 317628
64466 317628 316160 315273 314440 313920 314374 316384 320263 325690 331436 336014 338921 340832 342362 343091 342133 339275
64450 339275 335168 330635 326260 322483 319710 318301 318598 320763 324290 327978 330861 333152 335939 340068
64436 340068 345746 353001 361892 372115 383007 394273 406406 420318 436913 457037 481199 509003
64424 509003 539520 572777 610540 655148 707859 768762 837791 915045 1000318 1093068 1192618
64413 1192618 1297383 1403712 1506453 1601392 1686945 1763390 1830941 1888736 1934892 1966853 1982028
64402 1982028 1978988 1958362 1922460 1874013 1815124 1746837 1669185 1581793 1484982 1380633 1272124
64391 1272124 1163575 1058913 961013 871272 790197 718544 657384 606704 564474 527922 495638
64380 495638 467861 444895 426086 410541 398021 388519 381394 375559 370400 366012 362467 359177 355091
64367 355091 349341 341697 332663 323223 314245 305839 297397 288493 279711 272295 266883 262937 259589 256760
64353 256760 255029 254574 254787 255073 255558 256749 258781 261285 263780 265950 267652 268917 269860 270382 270089 268655
64337 268655 266176 263028 259510 255817 252178 248807 245827 243481 242269 242563 244089 246012 247577 248570 249287
64322 249287 250278 252028 254548 257300 259770 262147 265193 269374 274357 279451 284323 289062 293578 297109
64308 297109 298466 296870 292555 286516 279652 272295 264499 256500 248734 241608 235471 230578 226812 223587
64294 223587 220335 217049 214136 211851 210162 208992 208259 207706 207137 206815 207252 208517 210155 211918 214156
64279 214156 217207 220709 223879 226348 228492 231127 235066 240730 247697 254647 260166 263803 266187 268096
64265 268096 269742 270998 271911 272591 272870 272545 271970 271997 273187 275336 277812 279917 280761 279322 275199 269199
64249 269199 262705 256508 250581 244815 239476 234918 231351 228976 227861 227515 226950 225465 223187 220800 219086
64234 219086 218758 220202 223051 226325 229278 231952 234798 238130 242056 246464 250768 254176 256578 258755
64220 258755 261333 264071 266698 269858 274340 279580 283843 286042 286750 287297 288405 289911 291338 292402 293181
64205 293181 293940 294682 294879 293859 291454 288131 284571 281233 278072 274465 269767 264377 259951 257955 258160
64190 258160 259165 260239 261995 265300 270332 276836 284505 292653 300148 306240 311134 315270 318235 318838
64176 318838 316226 310655 303241 295216 287443 280383 274245 268941 263987 258747 253017 247179 241636 236386
64162 236386 231425 227178 224043 221683 219319 216592 213712 210996 208886 208167 209336 211673 213788 215247
64148 215247 216970 219836 223721 228179 233206 238722 243968 248155 251322 253921 255863 256539 255664 253586 250931
64133 250931 248296 246131 244519 243156 241743 240203 238352 235811 232636 229724 228116 228057 229067 230646 232492
64118 232492 234332 236114 238288 241452 245753 250950 256892 263518 270497 277384 284085 290764 297287 303188
64104 303188 308168 312253 315390 317376 318347 319050 320397 322884 326504 330964 335845 340668 345005 348542 351160
64089 351160 352988 354230 354680 353559 350175 344813 338723 333114 328315 323866 319114 313604 307263 300538
64075 300538 294265 289055 284723 280534 276151 272223 269835 269436 270494 272138 273816 275214 276000 276132 276298
64060 276298 277477 279836 282404 284086 284820 285543 287144 289622 292162 293941 294931 295948 297828 300567 303502
64045 303502 306275 309280 312976 317107 320916 323995 326668 329579 333082 336987 340749 343924 346435 348338
64031 348338 349411 349242 347782 345505 342894 340026 336839 333644 331147 330027 330569 332525 335256 338176 341149
64016 341149 344239 347010 348349 347264 343724 338628 333108 327967 323510 319641 316181 313128 310506 308089
64002 308089 305619 303281 301507 300211 298793 297146 296139 296607 298239 300013 301420 302752 304346 306178
63988 306178 308217 310603 313352 316244 319161 322294 325868 329847 334015 338218 342499 347138 352565 359124
63974 359124 366794 375119 383339 390682 396733 401646 405992 410450 415732 422518 430979 440414 449918 459544
63960 459544 470316 482861 496577 510586 525043 540998 559280 579995 602901 627838 654954
63949 654954 685032 719491 759757 806751 861302 924664 998053 1081895 1176220 1281852 1400568
63938 1400568 1533824 1681496 1841837 2012261 2190176 2373535 2560799 2750259 2939288
63929 2939288 3124195 3300395 3462486 3604678 3722095 3811985 3873476 3906332 3910435 3886210
63919 3886210 3834601 3756183 3650876 3519208 3363895 3190054 3003968 2811630 2617919 2426423
63909 2426423 2239618 2059236 1886785 1724077 1573337 1436481 1314185 1205888 1110886 1028963
63899 1028963 959623 901180 851285 808274 771496 740403 713992 691187 671203 653344 636883
63888 636883 621366 606718 592876 579584 566652 554160 542393 531817 523024 516232 510840 505972
63876 505972 501638 498906 498712 500834 504278 508324 513000 518904 526906 537750 551559 567809 585975
63863 585975 606041 628264 652664 679062 707520 738443 772162 808496 846699 885859 925423
63852 925423 965326 1005459 1045078 1083020 1118509 1151444 1181756 1208762 1231421 1248999 1261237
63841 1261237 1267958 1268868 1263766 1252766 1236207 1214445 1187826 1156807 1122014 1084110 1043657 1001185
63829 1001185 957399 913204 869509 827082 786585 748466 712782 679381 648441 620605 596300
63818 596300 575093 555941 537987 520866 504450 488656 473411 458467 443342 427819 412553
63807 412553 398772 387216 377542 368831 360473 352466 345090 338461 332414 326714 321315 316312 311696 307365
63793 307365 303408 300076 297358 294874 292329 289756 287103 284070 280641 277364 274626 272122 269594 267643
63779 267643 266949 266949 266182 264033 261324 259060 257369 255918 254628 253580 252663 251756 250926 250209 249504 248874 248580
63762 248580 248633 248660 248386 247929 247467 246995 246580 246475 246794 247350 247967 248572 248920 248676 248005 247644 248139 249331 250744
63743 250744 252117 253369 254464 255493 256560 257430 257780 257961 258893 260876 263045 264537 265656 267302 269665
63728 269665 272231 274862 278047 282013 286213 289960 293164 296274 299776 303961 308900 314367 319773 324322
63714 324322 327370 328714 328627 327563 325786 323302 320114 316421 312594 309040 306151 304180 303113 302678 302575
63699 302575 302673 303036 303807 304959 306173 307154 308130 309700 312027 314561 316880 319364 322524 326035 329118 331631
63683 331631 334017 336254 337693 337996 337491 336531 335271 334249 334284 335372 336380 336319 335428 334682 334803 336134 338739
63666 338739 342088 345134 347335 349230 351537 354093 356117 357050 356592 354447 350726 346325 342182 338289 333964
63651 333964 328951 323745 318972 314965 311857 309665 308267 307568 307565 308042 308506 308713 309002 309823 311282 313493
63635 313493 316921 321774 327366 332649 337246 341559 346106 351229 357176 363908 370993 378095 385427 393256
63621 393256 401329 409386 417937 427785 438913 450583 462556 475526 490297 507125 525952 546651
63609 546651 568905 592405 617346 644258 673145 703177 733335 762803 790455 814432 832788
63598 832788 844610 850394 851458 849091 844170 837425 829933 823041 817574 813195 808632 802334 792786 778778
63584 778778 760055 737671 713300 688228 663276 639372 617507 598088 580947 566076 553828
63573 553828 544203 536485 529981 524862 521959 521858 524359 528694 534040 539742 545208 549922 553907 558048
63559 558048 563403 569951 576502 582230 587879 595015 604523 616394 630571 647214 666356 688140 713339
63546 713339 742829 776504 813572 853937 898042 944410 987869 1021269 1039459 1041945 1032392 1016084
63534 1016084 997489 979335 963120 949857 939981 932806 926672 919820 910928 898967 883161 863311
63522 863311 839805 813133 783765 752573 720881 689734 659447 630147 602492 577507 555816
63511 555816 537161 520518 504664 489026 474244 461652 451919 444372 437758 431400 425374 419902 414967
63498 414967 410432 406224 402356 398914 395930 393209 390428 387556 385023 383278 382339 381913 381798 381970 382448
63483 382448 383325 384848 387149 389891 392445 394505 396393 398683 401693 405386 409519 413670 417207 419582
63469 419582 420776 421234 421155 420033 417194 412734 407655 403000 399102 395690 392481 389463 386835 384730 382932
63454 382932 380925 378532 376463 375746 376521 377905 379254 380992 383790 387534 391727 396524 402569 409979 418285
63439 418285 427503 438620 452747 470156 490385 513108 538858 569069 605128 646693 690559 731374
63427 731374 763951 785460 796151 798563 795987 791195 786272 783197 783993 790049 801794 819316 842693
63414 842693 871164 902534 934284 965001 993982 1019723 1039880 1052913 1059046 1059494 1055541 1048559
63402 1048559 1040160 1031753 1024122 1017400 1010871 1002795 991121 974704 953487 927585 896977 862398
63390 862398 825869 789799 755820 724593 696196 670334 646597 624884 605436 588431 573888
63379 573888 561957 552725 545661 539849 535002 531762 530819 532232 535743 541123 547995 555917 564907 575308
63365 575308 586932 599116 612017 627055 645436 666769 689706 713509 738448 765141 794092
63354 794092 825514 858987 893450 927887 961579 993242 1020477 1040830 1053301 1058516 1057912 1053309
63342 1053309 1046668 1039383 1031780 1023796 1015746 1007747 998757 987021 971435 951814 928078 900129 868650
63329 868650 835197 801274 767849 735848 706402 680379 658189 640228 626872 617822 612244 610048
63317 610048 612237 618953 627180 631221 626054 610441 587184 560837 535111 511693 490727 471977
63305 471977 455540 441644 430106 420290 411653 404161 398014 393103 388924 384971 380990 376896 372700
63292 372700 368568 364638 360703 356491 352408 349493 348170 347511 346321 344623 343351 342849 342516 341874 341067
63277 341067 340157 338862 337350 336437 336522 337003 337296 337702 338587 339318 338919 337501 336227 335965 336623 337757 339115
63260 339115 340499 341621 342352 342887 343545 344505 345664 346619 346979 346904 347138 348284 350217 352415 354652 357041
63244 357041 359632 362272 364852 367438 370228 373410 376953 380556 384162 388428 394144 401040 407892 414049
63230 414049 420234 427374 435336 443421 451463 459667 467786 475367 482563 489949 497675 505479 513341 521450
63216 521450 529723 538093 547066 557102 567407 576171 582215 585854 588145 589909 591519 592833 593096 591533
63202 591533 588299 584353 580247 575643 570239 564610 559796 556501 554951 555109 556740 559627 564064 570788
63188 570788 580218 592050 605805 621399 638865 657890 678058 699373 722143 746311 771162 795784
63176 795784 819836 843846 868659 894447 920332 945100 968198 989815 1010247 1029492 1047308
63165 1047308 1063156 1076089 1085096 1089616 1089385 1083868 1072386 1054823 1031765 1003862 971623 935953
63153 935953 898283 859844 821273 783253 747002 713643 683399 655937 631245 609632 590999
63142 590999 574624 559760 546129 533800 522924 513659 506039 499782 494432 489831 486265 483962 482602
63129 482602 481595 480755 480419 480851 481853 483176 484997 487613 490804 493970 496929 500136 504021 508529 513500
63114 513500 519057 525234 531517 537181 541966 546223 550549 555418 560862 566255 570712 574015 576845 579884
63100 579884 583087 586191 589413 593053 596797 600149 603308 606867 610768 614311 617168 619673 622061 624141
63086 624141 625834 627345 628576 628995 628344 626990 625278 623012 619890 616078 612056 608150 604372 600491 596237
63071 596237 591759 587854 585281 583833 582666 581614 581491 582857 585151 587541 590133 593760 598922 605463
63057 605463 613150 622017 632130 643323 655307 668021 681927 697869 716330 736786 758053 779309
63045 779309 800453 821521 842359 863105 884428 906754 929533 951717 972818 993208 1013552
63034 1013552 1034267 1055444 1076904 1098227 1118821 1137995 1155072 1169594 1181415 1190359 1195803 1196880
63022 1196880 1193124 1184697 1172019 1155682 1136742 1116578 1096117 1075577 1055189 1035821 1018607 1004363
63010 1004363 993664 987109 985043 987255 993423 1003725 1018673 1038461 1062808 1091361 1123829 1159765
62998 1159765 1198583 1239921 1283722 1329752 1377116 1424476 1470920 1516595 1562295 1608317 1653972
62987 1653972 1698376 1741347 1782996 1822612 1858624 1889649 1914924 1933534 1943899 1944465 1934438 1913600
62975 1913600 1881987 1840258 1789950 1732774 1669909 1602465 1532306 1461768 1392660 1325976 1262449
62964 1262449 1202754 1147236 1096008 1049409 1007874 971159 938128 907574 878986 852359 827574
62953 827574 804304 782311 761432 741326 721631 702502 684630 668424 653318 638290 622965
62942 622965 607795 593203 579190 566020 554544 545231 537324 529758 522547 516420 511220 505748 499401
62929 499401 493046 487883 484163 481462 479501 478071 476622 474595 472010 469351 467114 465668 465114 464972 464432
62914 464432 463343 462497 462545 463021 462935 461956 460494 458979 457602 456537 455881 455540 455544 456116 457031 457407 456843 456434
62896 456434 457820 461345 465862 470275 474499 478901 483568 488327 492860 496527 498634 499219 499250 499753 500918
62881 500918 502121 502541 501724 499819 497401 494951 492478 489807 486986 484136 481125 477873 474787 472292 469959
62866 469959 466751 462266 457226 452527 448317 444269 440252 436271 432086 427445 422681 418732 416374 415455
62852 415455 414970 414010 412684 411973 412557 414054 415646 417121 418793 420583 421828 422082 421576 420781 420015 419590
62836 419590 419763 420243 420227 419321 418011 416938 416101 415255 414649 414741 415388 415963 416303 416980 418474 420506 422343 423510
62818 423510 424022 424190 424417 425011 426016 427235 428465 429613 430594 431408 432421 434274 437154 440352 442919 444771
62802 444771 446738 449441 452535 455343 457901 460949 464949 469510 473867 477593 480782 483847 487298 491522
62788 491522 496524 502011 507942 514966 524134 536128 550776 567284 584937 603662 623948 646272
62776 646272 670692 697061 725325 755213 785698 815273 842998 868937 893314 915527 934336
62765 934336 948861 959016 965003 966725 963823 956101 943798 927472 907716 884981 859718 832647
62753 832647 804700 776641 748786 721201 694142 668285 644528 623470 604951 588109 572037
62742 572037 556469 541881 529031 518474 510225 503574 497392 490973 484588 479049 474891 472276 471346
62729 471346 472071 473786 475597 477317 479489 482460 486076 490338 495543 501486 507324 512699 518381 525301
62715 525301 533575 542956 553578 565631 578890 593363 609901 629345 651415 675253 700786 728750
62703 728750 759644 793654 831448 874022 921548 973214 1028457 1087712 1151787 1221044 1295283
62692 1295283 1373725 1454868 1536914 1618535 1698643 1775337 1845756 1907226 1957855 1995694 2018249
62681 2018249 2023701 2012294 1985782 1945709 1892850 1828276 1754282 1673960 1590156 1504936 1419773
62670 1419773 1335925 1254698 1177502 1105619 1039791 979972 925584 876036 830987 790118 752964
62659 752964 719201 688897 662093 638241 616495 596536 578546 562278 546887 532112 518938
62648 518938 508412 500122 492552 484724 476844 469486 462875 457027 452045 448036 444964 442598 440432 437962
62634 437962 435393 433686 433355 433509 432797 431079 429345 428048 426450 423847 420581 417464 414815 412545 410731
62619 410731 409628 409331 409690 410385 410942 410972 410541 410102 410020 410413 411392 413070 415274 417582 419689 421480 422901
62602 422901 424158 425831 428248 430907 433191 435548 439149 444397 450663 457647 466055 476560 488965 502823
62588 502823 518020 534113 549818 563921 576208 586924 595901 602927 608362 612387 613942 611427 604511
62575 604511 594493 582830 570042 556251 542048 528360 515756 504239 493623 483848 474917 466626
62563 466626 458538 450378 442476 435601 430287 426447 423633 421325 418941 416081 413068 410916 410334 410935 411776
62548 411776 412445 413247 414436 415703 416496 416633 416564 417146 419076 422374 426422 430531 434310 437509 439928 441752
62532 441752 443688 446404 449930 453885 458203 463373 469954 478017 487087 496562 506310 516904 529175 543547
62518 543547 560026 578775 600313 625006 652790 683609 717773 755508 796431 839800 885078
62507 885078 931896 979582 1027077 1073241 1116945 1156844 1191310 1218698 1237695 1247672 1248847 1242050
62495 1242050 1228195 1208077 1182704 1153576 1122524 1091394 1061938 1035587 1012998 994000 978297
62484 978297 966215 958580 955906 957823 963263 971220 981418 994180 1009365 1025381 1039461 1049026 1052808
62471 1052808 1050949 1044452 1034344 1020708 1002295 977572 946411 910528 872316 833668 795830 759464
62459 759464 724458 690272 657011 625793 597737 573084 551589 533207 517859 505012 494104
62448 494104 485058 477977 472675 468960 466887 466223 466154 466142 466665 468424 471212 474222 477130 480072 482904 485318
62432 485318 487475 489614 491130 491004 489163 486556 483765 480385 476016 470962 465624 459985 454133 448641
62418 448641 443875 439441 434903 430650 427468 425432 423816 422047 420289 418927 417775 416111 413546 410665
62404 410665 408538 407573 407156 406607 406057 406077 406855 408293 410587 413912 417690 421070 424229 428315 433733 439301
62388 439301 443561 446317 448339 450280 452663 456400 462242 469687 477332 484513 491980 500705 510627 520950
62374 520950 531227 541638 552381 563286 574085 584701 595219 605798 616760 628632 641978
62363 641978 657268 674947 695488 719271 746543 777603 812909 852802 897180 945541 997198
62352 997198 1051329 1106936 1162900 1217859 1269727 1315727 1353568 1382704 1403931 1417760 1423819 1422034
62340 1422034 1413549 1399846 1381399 1357788 1328837 1295055 1257279 1216685 1175111 1134590 1096270
62329 1096270 1060143 1025892 993548 963257 934993 908792 884862 863057 842476 821927 800719
62318 800719 778797 756316 733469 710678 688618 667821 648375 630125 613058 597311 582883
62307 582883 569608 557518 547001 538433 531794 526829 523334 521001 519163 517211 515249 513918 513527 513805
62293 513805 514544 515950 518185 521029 524253 527802 531346 534183 536038 537592 539756 542720 546113 549735
62279 549735 553600 557490 561002 564006 566696 569303 571999 574884 577890 581028 584909 590468 597833 606089
62265 606089 614776 625032 638484 655501 675461 698377 725179 756448 791917 831335 874841 922304
62253 922304 973150 1027101 1084095 1143010 1201167 1255718 1305000 1348094 1383721 1410367 1427341
62242 1427341 1435106 1434579 1426407 1410791 1387630 1356746 1318224 1272732 1221647 1166934 1110702 1054639
62230 1054639 999887 947522 898810 854585 814685 778572 746338 718465 694637 673640 654626
62219 654626 637800 623531 611411 600678 591098 582834 575665 568857 561811 554594 547816 542121 537668
62206 537668 534039 530728 527664 525070 522951 521123 519750 519357 520150 521717 523590 525803 528674 532401 537077
62191 537077 542778 549313 556118 562753 569417 576774 585306 594963 605348 616128 627262 638836 650591
62178 650591 661674 671016 677989 682737 686045 689033 692691 697508 703778 712391 724870 742203 764036
62165 764036 789572 818840 852350 889818 930106 972273 1015663 1058885 1099634 1135850 1166307
62154 1166307 1189991 1205945 1214249 1216345 1213744 1206873 1195571 1179984 1160345 1136372 1107718 1074875
62142 1074875 1039218 1002369 965829 930873 898369 868801 842665 820546 802681 788796 778516
62131 778516 771473 766884 763691 761464 760616 761372 763178 765550 768883 773750 779932 786807 794330 802977 813052
62116 813052 824594 837618 851788 866153 879921 893281 906770 919850 930656 937076 937759 932479
62104 932479 922404 910090 898475 889419 883187 878933 875185 870108 862195 851197 838220 824862 812392
62091 812392 801605 793027 787081 784165 784538 788088 794410 803254 814614 828343 844114 862022 882718
62078 882718 906470 932557 960111 989178 1020255 1053084 1086599 1119927 1152722 1184568 1214754
62067 1214754 1242773 1268603 1292493 1314901 1336555 1358064 1379452 1400560 1421708 1443301 1464711
62056 1464711 1484228 1500276 1512187 1519759 1522822 1521642 1517217 1510635 1502216 1491419 1477220 1458408
62044 1458408 1433933 1403467 1367742 1328266 1286741 1244515 1202104 1159063 1114705 1069293 1024462
62033 1024462 982275 943820 908705 875783 844428 815248 789553 768025 749992 734083 719400
62022 719400 705809 693343 681824 671028 660759 650653 640269 629485 618628 608161 598462 589863
62010 589863 582578 576531 571540 567679 565142 563731 562866 562300 562588 564642 568857 574672 580832 586110 590010
61995 590010 592878 595219 596999 597772 597316 595782 593253 589577 584719 578904 572270 564622 555756 545861 535491
61980 535491 525234 515481 506390 498075 490885 485300 481292 478008 474539 471016 468444 467263 466569 465083
61966 465083 462560 459840 457729 456312 455350 454827 454799 454953 454738 454102 453827 454896 457533 461074 464771 468505
61950 468505 472650 477524 483195 489678 497108 505806 516298 529135 544425 561570 579652 598137 617221
61937 617221 637597 659837 683752 708236 731980 754443 775991 797048 817451 836725 854496
61926 854496 870360 883697 894044 901392 905810 907061 904915 899529 891167 879929 866296 851690 837961
61913 837961 826462 817997 813271 812703 815938 822244 831372 843493 858359 875030 892313 908916 923358
61900 923358 934507 942226 946877 948161 945144 937470 925791 910970 893568 874279 853969 833006
61888 833006 811307 789456 768939 750680 733974 717549 701310 686366 673637 662944 653347 643863
61876 643863 634010 624022 614504 605742 597614 590278 584497 580880 579136 578476 578528 579466 581501 584676 589065
61861 589065 594838 602179 611332 622579 636024 651575 669296 689483 712297 737738 766159 798201
61849 798201 833752 871462 909952 949160 989737 1031243 1071722 1109129 1142537 1171730 1196245
61838 1196245 1215212 1227783 1233409 1231930 1223828 1210368 1193319 1174496 1155574 1138163 1123831 1113905
61826 1113905 1109181 1109738 1115082 1124547 1137577 1153577 1171421 1189163 1204284 1214444 1218263 1215461 1206226
61813 1206226 1190531 1168317 1140297 1108141 1073659 1037987 1001788 965888 931356 899055 869451
61802 869451 842816 819244 798436 779755 762707 747259 733653 721977 711932 702948 694544 686694
61790 686694 679812 674223 669647 665376 660970 656624 652745 649330 645961 642303 638397 634429 630483 626678
61776 626678 623315 620586 618210 615732 613270 611573 611109 611362 611309 610398 608779 606829 604881 603331 602584 602836
61760 602836 604162 606681 610255 614069 617012 618621 619351 619890 620615 621723 623332 625179 626628 627312 627513
61745 627513 627587 627321 626221 624314 622345 621166 621062 621610 622063 621946 621350 620639 619966 619328 619021 619607 621296
61728 621296 623643 625995 628006 629701 631420 633850 637600 642443 647334 651497 655272 659569 664786 670601
61714 670601 676554 682431 688143 693523 698269 701963 704286 705278 705158 703852 701107 697198 692996 689021 684946
61699 684946 680476 676206 672936 670480 667880 664606 660879 656974 652950 649045 645494 641825 637071 630981
61685 630981 624475 618658 613904 610145 607383 605495 604022 602687 601757 601409 601081 600001 598135 596075 594171
61670 594171 592404 590933 590022 589296 587827 585352 582803 581130 580023 578430 576100 573873 572480 571785 571434
61655 571434 571593 572533 573939 575229 576414 578086 580535 583346 585940 588132 590027 591741 593465 595535 598146
61640 598146 601119 604122 606970 609541 611482 612238 611405 608983 605322 600820 595668 589986 584295 579646 576831
61625 576831 575468 574258 572337 570023 568009 566271 564260 562002 560362 560029 560554 560717 559758 558057 556487
61610 556487 555202 553260 549573 544060 537608 530962 524093 516834 509682 503530 498742 494920 491491 488176
61596 488176 484779 480939 476425 471531 466938 463119 460007 457273 454742 452397 450045 447277 443942 440500
61582 440500 437671 435735 434309 432826 431110 429443 428167 427240 426142 424340 421848 419163 416552 413697
61568 413697 410261 406573 403401 401267 400277 400375 401256 402253 402884 403414 404286 405133 405113 404254 403592 403769 404329 404764
61550 404764 405444 406928 408973 410909 412505 413878 414921 415491 415843 416368 417114 418009 419219 420792 422373 423801
61534 423801 425552 428002 430728 433246 435915 439155 442121 443329 442511 440736 438691 436032 432735 429813
61520 429813 428011 426707 424929 422750 420867 419358 417820 416455 416018 416608 417309 417306 416764 416269 415832 414942 413442
61503 413442 411913 411009 410709 410462 409975 409507 409328 409275 409128 409171 409933 411407 412912 413749 413692 412787 411084 408785
61485 408785 406387 404391 402956 401960 401204 400470 399516 398256 396961 396203 396568 398320 401140 404147 406398 407560
61469 407560 408141 408984 410508 412338 413658 413982 413565 412961 412233 411017 409488 408770 409766 411816 413118 412675
61453 412675 411299 410536 411005 412086 412914 413240 413386 413706 414247 414853 415501 416470 418130 420593 423575 426575 429194
61436 429194 431464 433898 437019 440692 444186 447061 449773 453012 456656 459783 461625 462118 461618 460549 459413
61421 459413 458738 458796 459641 461397 464214 467845 471626 475029 477990 480604 482767 484292 485098 485089 484008 481667
61405 481667 478301 474666 471696 469871 468760 467291 464679 460999 456767 452382 448358 445655 444983 445791 446658
61390 446658 446801 446614 446660 446885 447108 447537 448279 448880 448914 448673 448754 449270 449963 450810 451969 453288 454480 455690
61372 455690 457352 459407 461128 461850 461648 461250 461549 463165 466118 469692 472816 474796 475706 476147 476689 477578
61356 477578 478912 481011 484445 489471 495443 501135 505861 510168 515330 522285 531129 541316 552082 562859
61342 562859 573604 584719 596470 608474 619867 629825 637839 643741 647745 650356 652005 652747 652440
61329 652440 651128 649107 646705 644100 641256 637947 634052 629916 626178 623071 620186 617213 614633 613273
61315 613273 613376 614542 616447 619108 622443 626090 629794 633571 637350 640894 644383 648751 655054 663567
61301 663567 673765 685085 697399 710635 724180 736841 747396 755119 759830 761591 760478 756606
61289 756606 750223 741804 732142 722299 713183 705052 697591 690524 683947 678012 672655 667942 664409 662660
61275 662660 662735 664207 666782 670428 675013 680225 685835 691665 697303 702377 707239 712861 719753 727330 734624
61260 734624 741287 747589 753836 760283 767489 776241 787088 800155 815259 831738 848165 862716 874071
61247 874071 881852 886207 887279 885151 879998 872131 862165 851256 840810 831602 823308 815149 806910 799116
61233 799116 792401 787107 783477 781779 781974 783443 785337 787225 789316 792069 795743 800384 806068 812865
61219 812865 820442 827988 834870 841262 847752 854303 860108 864690 868616 872674 876734 880069 882564 884820
61205 884820 887041 888668 889420 890012 891321 893344 895569 898068 901690 907341 915575 926668 940490 956265
61191 956265 973099 990924 1010588 1032768 1056991 1081801 1105627 1127403 1146595 1162896 1175985
61180 1175985 1185695 1192462 1197399 1201541 1205028 1207226 1207548 1205885 1202375 1197193 1190600 1182765 1173436 1162166
61166 1162166 1148987 1134506 1119200 1102984 1085664 1067417 1048535 1029068 1009082 989024 969507
61155 969507 950889 933390 917369 903159 890734 879930 870882 863860 858696 854730 851454 849041 848228
61142 848228 849762 853706 858945 863444 865420 864361 860843 855604 849260 842738 837304 833815 832330 832642
61128 832642 834812 838942 844849 852371 861800 873654 888162 905279 924996 947296 971923 998547
61116 998547 1027090 1057553 1089588 1122554 1155930 1189400 1222668 1255606 1288444 1321277 1353272
61105 1353272 1382877 1409034 1431886 1452143 1470172 1485852 1498876 1508848 1515349 1518168 1517205 1511889
61093 1511889 1501029 1483678 1459990 1431082 1398368 1363275 1327132 1290764 1254256 1217553 1181172
61082 1181172 1145999 1112597 1081098 1051685 1024745 1000637 979638 961989 947560 935570 925070
61071 925070 915672 907539 900840 895573 891730 889164 887404 886107 885578 886415 888738 892188 896437 901189 905919
61056 905919 910328 914993 920922 928540 937735 948696 961833 976961 993431 1011164 1030665 1051974
61044 1051974 1074542 1098388 1124360 1152863 1183148 1214314 1246311 1279557 1314259 1350485 1388201
61033 1388201 1426847 1465533 1504076 1543335 1584248 1627048 1671414 1716764 1762433 1808552 1856682
61022 1856682 1908529 1963934 2021196 2079185 2137780 2196487 2254892 2314982 2380980 2456066 2541151
61011 2541151 2637578 2748551 2876456 3020844 3180731 3357318 3553726 3775167 4031651 4338215
61001 4338215 4710695 5164574 5721042 6411317 7271796 8336962 9636571 11189810 12996444
60992 12996444 15047742 17361286 19981724 22886101 25848029 28425602 30162420 30865083
60984 30865083 30709343 30091282 29395940 28893741 28765688 29093553 29749097 30327977 30292312
60975 30292312 29264946 27234196 24508843 21502829 18548303 15840000 13466273 11447855
60967 11447855 9762318 8367062 7219015 6279906 5512898 4884183 4368118 3945924 3599709
60958 3599709 3311439 3066822 2856177 2671647 2506705 2358146 2225239 2106417 1998929
60949 1998929 1901516 1814793 1738667 1671429 1611548 1558203 1509633 1462763 1415105 1365882 1315327
60938 1315327 1264238 1214242 1166934 1122522 1080324 1040392 1003358 968981 936378 905609 877528
60927 877528 852128 828519 806580 787106 770137 754648 740081 726778 714672 702964 691513
60916 691513 681263 672856 665962 660324 656307 654000 652785 652208 652352 653062 653763 654358 655366 656939 658642
60901 658642 660411 662731 665617 668384 670710 672923 674946 675939 675427 673886 671811 669013 665263 660893 656394
60886 656394 651922 647395 642453 636336 628583 619848 611235 602865 594082 584970 576488 568947 561614 554145
60872 554145 547212 541303 535998 530916 526348 522426 518704 515134 512528 511461 511606 512674 515072 518987
60858 518987 523724 528676 534195 540775 548083 555502 563013 570789 578435 585326 591298 596548 601368 606429
60844 606429 612700 620481 628890 636698 643207 647994 650527 650649 648971 646290 642976 639232 635407 631696
60830 631696 628024 624510 621528 619099 616837 614681 612903 611161 608440 604318 599426 594261 588515 582025
60816 582025 575324 568592 561181 552970 545164 538687 532675 525714 517886 510460 504136 498787 494393 490951
60802 490951 487751 484039 480364 478106 477572 477518 476651 474824 472641 470744 469701 469937 471432 473810 476721
60787 476721 479788 482362 483979 485091 486863 490113 494725 499966 505037 509496 513594 518133 523647 529824
60773 529824 535992 541917 547783 553730 559875 566517 573798 581313 588492 595204 601574 607483 612652 617002
60759 617002 620512 623056 624917 627096 630448 634597 638279 640661 641838 642246 642174 641763 640960 639525 637523
60744 637523 635624 634405 633571 632434 630935 629424 627504 624009 618431 611743 605416 600083 595505 591462
60730 591462 588200 586086 585202 585421 586702 589145 592740 597289 602724 609292 617091 625665 634596 644429 656197
60715 656197 669928 684459 699177 715095 733514 754275 776189 798700 822182 846854 872381
60704 872381 898508 925141 951643 976782 999678 1020311 1038925 1055338 1068974 1079172 1085300 1086890
60692 1086890 1083821 1076265 1064488 1048927 1030328 1009472 986863 962915 938292 913686 889348 865202
60680 865202 841340 818171 796176 775804 757438 741079 726170 712108 698842 686617 675239
60669 675239 663969 652224 640184 628776 619121 611683 605706 599728 592887 585449 577963 570524 563316
60656 563316 557255 553264 551165 549973 549082 548500 548152 547802 547641 548198 549497 550998 552548 554744 558013 561746
60640 561746 564739 566313 566787 566982 567428 568080 568791 569943 572259 575890 580139 584328 588531 593125 598056
60625 598056 602992 607676 611649 614099 614751 614487 614261 613714 611747 608271 604377 600804 597221 593158 588691
60610 588691 583933 578761 573431 568720 565015 561865 558841 556193 554208 552483 550425 548081 545908 544047
60596 544047 542366 540970 540075 539431 538380 536658 534840 533805 533856 534503 535129 535714 536719 538250 539653 540236
60580 540236 540228 540720 542645 546051 550285 554609 558707 562908 567958 574456 582528 592155 603548 616935 632214
60565 632214 649262 668437 690308 714844 741169 768052 794270 818529 839417 855486 865254 867416
60553 867416 861651 849317 832952 814991 797114 780606 766690 756251 749549 746399 746578 750101 757283
60540 757283 768538 784003 803464 826716 853661 883878 916397 950087 983750 1015417 1042170
60529 1042170 1061483 1072593 1076062 1072425 1062141 1046624 1028309 1009457 991520 975598 962616 952708
60517 952708 945037 938619 933010 928141 924058 921097 919953 921293 925352 931757 939500 947408 955159 963671
60503 963671 974035 986404 1000628 1017619 1039152 1066463 1100072 1140953 1190696 1250140 1318788
60492 1318788 1395844 1480754 1572110 1666780 1760759 1850252 1931558 2000737 2054200 2089192 2103344
60481 2103344 2094619 2062723 2010207 1941296 1859684 1767955 1668768 1565765 1463183 1364949 1274037
60470 1274037 1192072 1119310 1055147 998669 948792 904328 864402 828804 797739 771315 749288
60459 749288 730976 715255 700963 687564 675274 664353 654651 645993 638563 632528 627558 623113 618973
60446 618973 615161 611550 607942 604392 601109 598088 595178 592508 590534 589553 589281 588998 588064 586364 584280
60431 584280 582268 580510 578992 577740 576765 575897 574879 573579 571969 570031 567931 566064 564663 563545 562586
60416 562586 562185 562746 563939 565033 565829 566626 567359 567603 567483 567770 568767 569795 570187 570276 570945 572554 574708
60399 574708 576794 578425 579520 580134 580178 579443 578128 577095 577060 577762 578583 579753 582034 585162 587665 588582
60383 588582 588492 588484 588927 589758 591125 593039 594993 596545 597847 599128 600216 601095 602295 604018 605433 605619
60367 605619 604776 603773 602855 601718 600635 600562 601942 604092 605982 607240 608261 609683 611849 614562 617235
60352 617235 619338 620686 621368 621678 622193 623505 625676 628195 630679 633304 636468 640418 645292 650978 656623
60337 656623 660866 662964 663359 662857 661744 660019 657903 655595 652979 650114 647624 645996 644812 643203 640883
60322 640883 638332 636231 635105 635178 636106 637224 638435 640502 643940 648057 651687 654574 657526 661525 667317
60307 667317 675545 686590 700399 716913 736424 759168 785142 814850 849348 888119 927102 960293
60295 960293 983765 997385 1002436 998749 984959 960971 929316 894225 859807 828902 802907 782149
60283 782149 766219 754116 744533 736382 729050 722011 714535 706186 697466 689426 682542 676271 669776 662824
60269 662824 655906 649780 644952 641413 638704 636248 633721 631218 629202 628237 628469 629292 629727 629206 627776
60254 627776 625697 623305 621294 620442 620750 621326 621441 621236 621168 621363 621920 623231 625357 627565 629066 629802 630026
60237 630026 629644 628730 628188 628978 630905 633023 635064 637623 641002 644710 648204 651399 654349 657114 660016
60222 660016 663354 666720 669219 670591 671563 672866 674396 675692 676791 678239 680440 683326 686573 690019
60208 690019 693867 698498 703975 709772 715018 718966 721291 722285 722827 723777 725158 726309 726931 727400 727759 727178
60192 727178 725078 722220 719891 718438 717382 716600 716358 716350 715717 714091 711802 708997 705449 701426 697915 695574
60176 695574 694067 692752 691556 690821 690723 691167 692024 693268 694991 697256 699696 701480 702081 701944 701904 702042 701774
60159 701774 701019 700643 701519 703680 706572 709740 713002 716263 719313 721781 723444 724741 726583 729259 731878
60144 731878 733536 734663 736497 739520 743327 747823 753422 759972 766599 773046 780260 789083 798976 808473
60130 808473 816342 821909 824880 825419 824029 820979 816136 809617 802170 794658 787679 781866 777976 776070
60116 776070 775089 773768 771851 770089 769333 769906 771561 773627 775366 776467 777085 777350 777186 776745 776512 776647
60100 776647 776603 775802 774435 773130 772031 770655 768641 766331 764572 764054 764865 766632 769049 772192 776252
60085 776252 781144 786664 792861 799842 807303 814633 821481 827690 832652 835316 835092 832315 827602 821211
60071 821211 813369 804766 796234 788113 780295 772757 765720 759314 753380 747630 741897 736168 730383 724215
60057 724215 717236 709453 701548 694288 687786 681596 675498 669790 664795 660398 656149 651661 646960 642659
60043 642659 639687 638541 638929 640374 642878 646563 650969 655396 659797 664562 669365 673008 674657 674631 673741
60028 673741 672447 670938 669433 667928 666014 663277 659631 655072 649517 643118 636317 629316 621842 613732
60014 613732 605443 597700 590965 585489 581547 579242 578185 577669 577097 576232 575280 574807 575334 576863 578921 581135
59998 581135 583482 586074 589000 592394 596260 600153 603418 605811 607580 608975 610134 611433 613326 615671
59984 615671 617736 619126 620190 621269 622014 621864 620867 619624 618618 617833 616938 615636 613948 612173 610463
59969 610463 608551 606221 603902 602371 601899 602199 603190 605218 608353 612035 615652 619043 622260 625298 628285
59954 628285 631460 634628 636943 637589 636558 634668 632936 631905 631281 630256 628432 626262 624332 622482 620190
59939 620190 617462 614632 611503 607647 603470 600013 597498 595020 591976 588874 586395 584536 583162 582546
59925 582546 582751 583154 583279 583592 584843 587001 589430 591722 593870 595943 598078 600578 603602 606910 610124
59910 610124 613015 615468 617539 619679 622435 625754 628984 631596 633448 634395 634397 634105 634533 635893 637506 639138
59894 639138 641527 645244 649849 654622 659358 664022 668408 672703 677585 683284 689275 695392 702298 710243
59880 710243 718240 725243 731308 736831 741558 745313 748875 752923 756673 758689 758635 757114 754206 749401 742867
59865 742867 735674 728656 721922 715452 709422 703863 698673 693985 690059 687016 685150 685107 686989 689578 691276
59850 691276 691730 691882 692662 694459 697741 703194 710992 720513 731026 742260 754246 766823 779195 789716
59836 789716 796467 798610 797096 793837 790546 788690 789672 793985 800212 805629 807827 805502 798254 786627
59822 786627 772281 757265 742821 729075 715656 702245 688781 675730 664013 654305 646602 640701
59810 640701 636522 633483 630318 626366 622593 620440 620022 620231 620244 619972 619358 618283 617086 616238 615477 614065
59794 614065 611862 609405 606999 604499 601930 599549 597303 594944 592654 590894 589726 588894 588328 587840 586602
59779 586602 583903 580349 577369 575517 574101 572499 570960 570025 569939 570729 572092 573173 573207 572430 571669 571093
59763 571093 570223 569174 568907 570061 572306 574964 577563 579726 581398 583298 586328 590374 594493 598339 602479
59748 602479 607156 611715 615591 618935 621856 623978 625236 626317 627755 629184 629999 630198 630141 630001 629978 630501
59732 630501 631754 633253 634304 634658 634515 634213 634068 634181 634298 634163 633996 634180 634542 634525 634031 633532 633372 633603
59714 633603 634406 635863 637330 637961 637988 638550 639989 641299 641681 641726 642556 644526 647301 650482 653599 656099
59698 656099 657967 659884 662281 664730 666721 668478 670444 672485 674121 675111 675284 674248 671848 668635 665428
59683 665428 662662 660522 659227 658680 658295 657730 657519 658368 660021 661371 661604 660733 659051 656492 652653 647308
59667 647308 640877 634486 629324 625781 623272 620948 618411 615761 613331 611554 610784 611055 612156 613987 616579
59652 616579 619778 623306 627176 631619 636484 641113 644962 647916 649814 650174 648721 645868 642322 638440
59638 638440 634258 629945 625912 622485 619688 617371 615474 614117 613350 612849 612179 611461 611404 612370 613716 614438
59622 614438 614235 613591 613180 613601 615280 617959 620514 621870 621871 620826 618750 615842 613189 611917 611878 612150 612663
59605 612663 614222 617069 620585 624457 628883 633431 636875 638603 639273 639734 640190 640642 641135 641256 640434 639034
59589 639034 638157 638013 637635 636644 636035 636473 636940 636005 633585 630554 627421 624328 621673 619693 617796 615175
59573 615175 611831 608313 604850 601355 598011 595173 592871 590889 589142 587692 586661 586363 587137 588807 590761
59558 590761 592714 594881 597273 599467 601286 602974 604481 605350 605659 606347 608209 611178 614810 618709 622386
59543 622386 625613 629230 634610 642037 650644 660110 671188 684375 699728 718296 741343 766623 787334
59530 787334 797103 795435 786943 776476 766817 759897 757269 758924 763426 769638 777166 785176 792328 798116
59516 798116 802969 806707 808116 806352 801768 794993 786204 775694 764327 752956 741935 731415 721534
59503 721534 712230 703476 695773 689760 685210 680978 676132 670718 665493 661400 659201 658871 659275 659008 657684
59488 657684 656020 654736 653933 653559 653875 655234 657742 661214 665322 669931 675499 682866 692346 703327 715030
59473 715030 727171 739433 750829 760276 767434 772377 774904 774963 773417 771480 769570 767495 765597 764941
59459 764941 766429 770430 777258 787251 800254 815562 832445 850488 869525 889610 910730 932173
59447 932173 952617 971378 989072 1006329 1022073 1033685 1038510 1034836 1022230 1002080 977568 952035
59435 952035 927281 903863 882434 863689 847307 832108 817392 803453 790890 780192 771897 766423
59423 766423 763777 763971 767369 773974 782912 793525 806546 823223 843631 866750 891674 917754 944301
59410 944301 971501 1000621 1030997 1056842 1069537 1064293 1043757 1015082 985087 958286 936936 921178
59398 921178 910218 904639 906425 915131 924687 925764 912029 884083 847917 810373 775708 745307
59386 745307 719490 698759 683130 671230 661381 653453 648448 646201 644871 643120 641440 640610 640090 638963
59372 638963 637578 637056 637732 639150 641196 644228 648185 652365 656138 659408 662559 666323 671470 678155 685780
59357 685780 693778 702220 711380 721190 731600 743044 755991 770421 786267 804013 824227 846673
59345 846673 870452 894875 919674 944472 968608 991514 1012839 1032124 1048663 1061691 1070512 1074551
59333 1074551 1073699 1068611 1060376 1049748 1036792 1021307 1003462 983904 963329 942139 920657 899583
59321 899583 879910 862253 846501 832241 819187 806993 795183 783797 773736 765767 759445 753766
59309 753766 748709 745175 743375 742230 740756 739173 738203 738097 739060 742012 747944 756654 766931 778085
59295 778085 790670 805485 822416 840788 860581 882434 905747 926973 940694 943117 934624 918950
59283 918950 900335 881749 864991 851256 841206 835019 832679 833986 838276 844555 852132 860976 871474
59270 871474 883970 898442 914345 930767 946810 961615 974103 983287 989126 992457 993596 991597
59258 991597 985486 975617 962986 947854 930132 910747 891317 872497 853818 835313 818146 803343
59246 803343 790860 780351 772021 766218 762841 761649 762695 766037 771344 777962 785115 792060 798539 805080
59232 805080 812374 820339 828193 835187 840621 843450 842902 839554 834822 829156 821598 811403 799282 786632
59218 786632 774247 762199 750469 739295 729236 720970 714682 709669 705028 700604 696667 692947 688947
59205 688947 685070 682373 681038 680165 679303 679147 680289 682213 684006 685365 686464 687559 689158 691917 695899
59190 695899 700431 704949 709478 714146 718944 724109 730008 736377 742410 747879 753525 760087 767594 775684
59176 775684 783842 791210 797082 801874 806913 813042 820149 828017 836669 845778 854856 864267 875008 887224
59162 887224 899901 912196 923864 934125 941483 945298 946416 945664 942808 937512 930149 921014 909834
59149 909834 896781 882982 869418 856324 844111 833604 824743 816391 808167 801122 795727 790694 784924
59136 784924 779281 775103 772194 769769 768233 768288 769130 769284 768840 769310 771536 775066 779311 784149 789628 796187
59120 796187 804871 816252 829421 842957 856424 869983 883182 895456 907366 919941 932886 944636
59108 944636 954108 961333 966480 969447 970506 970395 969523 967698 964590 959980 953879 946991 940640 935478 930652
59093 930652 925029 918782 912948 907862 903032 898208 893589 889255 885273 882066 879698 877065 872760 866538
59079 866538 859079 850644 841009 830506 820028 810040 800413 791183 782649 774860 767802 761948 757781 754866
59065 754866 752125 748912 745243 741300 737432 734282 732110 730297 728237 726245 724798 723425 721431 719289
59051 719289 718100 717904 717613 716504 714781 712851 711046 709913 709746 709930 709636 708979 708574 708300 707634 706957 707335
59034 707335 709068 711595 714740 718869 723770 728510 732615 736454 740396 744513 749141 754829 761686 769568
59020 769568 778727 789296 800356 810611 819927 829021 837744 844872 849648 852346 853264 852457 850638 849003
59006 849003 847770 846074 843738 842048 842337 844817 849221 855513 863379 871973 880818 890243 900388 910515
58992 910515 919784 928103 935696 942436 948084 952591 955723 956784 955163 950840 944158 935514 925498 915007
58978 915007 904964 896097 888876 883341 879223 876692 876698 879988 886080 893947 903453 915246 929383 945020
58964 945020 961478 978755 996899 1015602 1034405 1052537 1068598 1081249 1090277 1096241 1099123 1098107
58952 1098107 1092598 1082647 1068443 1050304 1029193 1006446 982992 959565 937391 917602 900079 883901
58940 883901 868911 855798 844749 835217 827004 820365 814972 809989 805378 801844 799271 796410 792492
58927 792492 788089 784020 780528 777816 776234 775442 774416 772785 771307 770710 770919 771718 773106 774731 776029
58912 776029 777304 779624 783263 787281 791087 795284 800550 806759 813779 822095 832058 843462 856389 871437
58898 871437 888453 906015 922870 939062 955054 970742 986123 1002152 1020038 1040243 1062833
58887 1062833 1088190 1116705 1148124 1181642 1216151 1250101 1281681 1309453 1332330 1349028 1358549
58876 1358549 1361362 1358948 1351694 1338323 1317929 1291573 1261264 1228394 1193978 1159574 1127036 1097807
58864 1097807 1072883 1052681 1036269 1021461 1006395 990713 974988 959717 945170 931319 917404
58853 917404 902429 886565 871227 857307 844274 831528 819613 809303 800383 792179 784605 777927
58841 777927 772030 766548 761194 755554 749231 742612 736659 731556 726447 720966 715971 712088 708602 704638
58827 704638 700542 697190 694745 693008 692276 692886 694473 696519 699151 702714 707096 712071 717686 723670 729128
58812 729128 733506 737283 741060 744606 747405 749488 751046 751847 751674 750734 749135 746654 743567 740878 739064
58797 739064 737356 734920 731993 729176 726443 723526 720555 717595 714384 711233 709287 709126 710011 711323 713779
58782 713779 718174 723766 729077 733659 737984 742140 745744 748751 751409 753673 755309 756195 755949 753910 750057
58767 750057 745325 740485 735529 730664 726764 724002 721153 717343 713524 710987 709322 707218 704631 702866
58753 702866 702952 705076 709081 714345 719561 723806 727523 731639 736226 741019 746557 753641 762048 770914 780013
58738 780013 789636 799581 809277 818623 827854 836912 845751 854803 864372 874027 883322 892423 901286 909046
58724 909046 915187 920489 925780 930596 934244 937374 941164 945675 950341 955462 961812 969281 977299 986034
58710 986034 995681 1004962 1011832 1015432 1016068 1013735 1008179 1000073 990496 979265 965188 947938 928399
58697 928399 907263 884687 861373 838597 816949 796167 776331 758205 742282 728479 716797
58686 716797 707359 699760 693229 687400 682201 677207 671864 666097 659998 653467 647010 642167 639886 639003
58672 639003 637627 635616 634443 635089 637504 641803 648431 657180 667382 678969 692140 706212 720059
58659 720059 733360 745962 756311 762189 763117 760650 756320 750707 744444 738492 733114 727889 722943 718884
58645 718884 715510 711967 708388 705942 704950 704333 703266 702191 701893 702801 705476 710474 717237 724136 730033
58630 730033 734943 738999 741863 743392 743836 743032 740422 736193 731599 727935 726007 726524 729949 735844 743368
58615 743368 752579 764290 778594 794514 811132 827925 843909 857603 868109 875259 878626 877545
58603 877545 872398 864902 856791 848912 841577 834811 828166 821126 813849 806858 800328 794544 790586 789318
58589 789318 789960 791003 792458 795917 802472 811900 823726 837621 852593 867230 880984 894098 906259
58576 906259 916617 925123 932491 938691 942920 945225 946938 949286 952769 957893 965182 974435 985327 998701
58562 998701 1015751 1035894 1056990 1077752 1098267 1118066 1135560 1149832 1161239 1169682 1173953 1173510
58550 1173510 1169403 1162793 1154008 1143699 1133372 1123844 1114358 1104063 1093241 1082443 1071403 1059534
58538 1059534 1046566 1032269 1016547 1000175 984457 969786 955629 942137 930524 921491 914503 908985
58526 908985 905059 902699 901393 901059 902254 905130 909218 914343 920594 927358 933720 939908 946915 954629
58512 954629 961851 968276 974806 981740 988324 994339 1000352 1006030 1010071 1012297 1014012 1015737 1016305 1014828
58498 1014828 1011778 1007524 1001615 994233 986647 979413 971753 963406 955463 948663 942550 937004 932871 930309
58484 930309 928293 926553 926295 928228 931705 936558 943824 953686 964607 975527 986933 998609 1008415
58471 1008415 1014750 1018464 1020913 1021805 1020368 1016879 1011585 1003782 993655 983525 975558 969537 964402 960622
58457 960622 959361 960464 963011 966946 972627 979575 986957 994552 1002154 1008863 1013947 1017457 1019242 1018634
58443 1018634 1015912 1012729 1010036 1007040 1003242 1000032 999015 1000162 1002840 1007294 1013707 1021008 1027919 1034293
58429 1034293 1040424 1046216 1051887 1058251 1065450 1072809 1080647 1090495 1102607 1115063 1126364 1137027 1147507
58416 1147507 1156627 1163528 1169223 1174557 1178444 1179774 1179381 1178411 1176365 1172486 1167533 1162501 1157080 1151001
58402 1151001 1145397 1141198 1137668 1134067 1131150 1129508 1128196 1126669 1126293 1128085 1130688 1132443 1133807 1135840
58388 1135840 1137996 1139397 1140654 1142476 1144053 1144768 1145862 1148444 1151534 1154080 1157138 1161973 1167768 1173395
58374 1173395 1179691 1187702 1196409 1204583 1213103 1223029 1233136 1242030 1251050 1262348 1275571 1289092 1303021
58361 1303021 1318247 1333907 1348628 1363022 1378247 1393377 1406900 1419498 1432509 1444957 1454992
58350 1454992 1463085 1470893 1478169 1483866 1489237 1496669 1506157 1515844 1525394 1536023 1547848 1559962 1572548
58337 1572548 1586423 1601201 1616267 1632702 1651893 1673188 1695185 1718073 1742329 1766479 1788791
58326 1788791 1809825 1830737 1850542 1867727 1882981 1897521 1910419 1920682 1930263 1941718 1954491
58315 1954491 1966788 1979431 1994249 2010290 2025484 2040742 2058558 2078806 2099668 2121455 2145567
58304 2145567 2170867 2195089 2218831 2244261 2271040 2297475 2324449 2353976 2384872 2414200 2442082
58293 2442082 2470818 2500255 2528470 2556200 2586072 2618136 2650520 2683755 2720004 2758772 2797851
58282 2797851 2837644 2879992 2923693 2966067 3008089 3052945 3100330 3147423 3194795 3245823 3300577
58271 3300577 3355813 3410971 3468828 3530221 3593406 3658647 3728221 3801869 3877353 3955337 4038526
58260 4038526 4126327 4215669 4306661 4401787 4500028 4597686 4694607 4793634 4894471 4994507 5095276
58249 5095276 5201426 5313527 5428670 5547863 5675572 5811993 5953296 6099809 6256397
58240 6256397 6424282 6600200 6784216 6980548 7189975 7409374 7639432 7884732 8145505
58231 8145505 8417670 8701832 9003637 9324597 9661636 10016490 10396074 10802718 11233986
58222 11233986 11693132 12189200 12725635 13299769 13914961 14581682 15305190 16084584 16926108
58213 16926108 17844668 18850255 19946832 21147310 22475183 23948880 25580762 27395748
58205 27395748 29434884 31737502 34339469 37295768 40687487 44604020 49144285 54448593
58197 54448593 60713647 68177373 77125221 87928014 101036948 116894888 135823113
58190 135823113 157944468 183155324 211192076 241806426 274788488 309415692 343421832
58183 343421832 372467955 391162558 395410239 384460403 361111433 330103889 296128795
58176 296128795 262747062 232311862 206152980 184529539 166583588 150754293 135619319
58169 135619319 120579770 105889243 92146907 79800620 69009161 59751086 51920069
58162 51920069 45346819 39832662 35203943 31322564 28057498 25282385 22902575 20857377
58154 20857377 19093375 17556726 16209947 15031655 13995230 13066006 12221616 11456762
58146 11456762 10764169 10126796 9532258 8979714 8468115 7990793 7545541 7137700 6768839
58137 6768839 6432640 6124858 5847083 5597886 5370156 5159772 4967255 4788337 4612611
58128 4612611 4434808 4259040 4089522 3925617 3768234 3622036 3487873 3360847 3238877
58119 3238877 3125683 3022653 2925309 2830899 2742280 2661177 2584442 2510184 2441087 2378398 2318647
58108 2318647 2259504 2203214 2151324 2101420 2051870 2004532 1960122 1916111 1871657 1829472 1790342
58097 1790342 1750980 1709883 1670260 1634541 1600936 1568054 1538010 1512052 1487631 1462702 1438762
58086 1438762 1417111 1396304 1375730 1357412 1341659 1325155 1305984 1286430 1268219 1249239 1227865
58075 1227865 1206435 1187285 1168987 1149680 1130695 1113736 1097580 1080669 1064248 1050094 1037738
58064 1037738 1026392 1016962 1009699 1002614 994554 987162 981514 975612 967596 958629 950197 941288 930841
58051 930841 920384 911600 903565 894897 886372 879030 871939 864248 857306 852348 848116 843063 837881 833628
58037 833628 829397 824129 818806 814583 810624 805912 801332 797775 794007 788598 782212 775868 768746 759931
58023 759931 750613 742382 734946 727626 721461 717572 714911 711828 708524 705937 703599 700681 697949 696565
58009 696565 696041 695223 694210 693638 693227 692682 692802 694111 695673 696760 698323 701272 704794 708031 711826 717026
57993 717026 722536 726958 730766 734975 739036 741994 744525 747880 751925 755984 760387 765305 769359 771374
57979 771374 772383 773919 775413 775352 774025 772967 772501 771887 771269 771464 772270 772727 772606 772153 770986 768814 766586
57962 766586 765426 765052 764602 764223 764348 764232 762774 760076 756755 752545 747142 741612 737340 734242 731445
57947 731445 728970 727218 725717 724025 723128 724226 726808 729564 732507 736507 741387 746301 751538 758172
57933 758172 766223 774802 783803 793906 805074 816390 827173 837087 845553 852218 857569 861939 864523
57920 864523 864547 862674 859952 856092 850260 842945 835503 828357 821003 813272 805229 796467 786933 777865 770499
57905 770499 764420 758551 752972 748228 743647 738231 732641 728358 725212 721583 716819 711742 706969 702458
57891 702458 698600 696060 694563 693414 693078 694647 697803 700925 703263 705464 707947 710328 712701 715993
57877 715993 720650 726007 731091 735119 737344 737620 737021 736850 737187 737336 737181 736888 735967 734220 733103 734348
57861 734348 737488 740593 743297 747133 752770 758940 764573 770198 776683 784158 792794 803122 814823 826418
57847 826418 836834 846308 855281 863472 870502 876424 881206 884612 886984 889242 891756 893978 895312 895516
57833 895516 894275 891431 887703 884118 880690 876795 872859 870319 869639 869723 869676 869893 870896 872344 873842 875744
57817 875744 878456 881743 885265 889135 893477 898080 902826 907857 913115 918305 923325 927983 931270 931955
57803 931955 930086 927057 923971 920823 917465 914396 912219 911020 910491 910084 909008 906857 904293 902336 901116
57788 901116 900127 899481 899744 900652 901260 901526 902438 904362 906515 908398 910553 913489 917003 920984 925798 931395
57772 931395 937065 942560 948483 955118 961791 967844 973337 978375 982684 986252 989404 991872 992793 992091 990880
57757 990880 989976 989008 987551 986107 985302 984969 984750 984905 985912 987963 991315 996310 1002445 1008168 1012226 1014680
57741 1014680 1016195 1017126 1017784 1018793 1020487 1022485 1024384 1026386 1028891 1032084 1036236 1041732 1048426 1055588
57727 1055588 1062748 1069921 1076873 1083115 1088925 1095378 1102870 1110465 1117139 1122764 1127497 1131275 1134534 1138403
57713 1138403 1143394 1148675 1153239 1157080 1160627 1163913 1166939 1170019 1173094 1175566 1177489 1180015 1183905 1188450
57699 1188450 1192726 1197022 1202096 1207749 1213230 1218484 1224028 1229977 1236079 1242336 1248799 1255176 1261356 1267894
57685 1267894 1275278 1283192 1291206 1299725 1309511 1320758 1333427 1348026 1365247 1385240 1408066 1434653
57673 1434653 1466669 1505727 1553166 1609974 1676133 1750567 1832589 1922800 2020915 2121806 2213772
57662 2213772 2281244 2310626 2296241 2242994 2163740 2073110 1982509 1899056 1826553 1765948 1715874
57651 1715874 1674530 1641253 1615847 1597115 1583137 1572657 1565252 1560399 1557326 1555663 1555448 1556600 1559012
57638 1559012 1562822 1567919 1573488 1578876 1584553 1591366 1599086 1606625 1613562 1620492 1627793 1634917 1641153 1646514
57624 1646514 1651633 1657136 1663173 1669339 1675103 1680492 1686106 1692319 1698863 1705465 1712268 1719252 1725901 1731953
57610 1731953 1737896 1744138 1750376 1756437 1762998 1770599 1778641 1786370 1794311 1803602 1814320 1825579 1836887
57597 1836887 1848220 1858979 1868194 1875845 1882939 1890169 1897419 1904569 1911829 1919136 1926141 1932922 1939980
57584 1939980 1947465 1955160 1963124 1971509 1979817 1987370 1994596 2002886 2012950 2024168 2035669 2047062 2057912
57571 2057912 2067600 2076245 2084955 2094574 2104785 2114893 2124900 2135254 2146015 2156838 2167555 2178348
57559 2178348 2189521 2201267 2213534 2226031 2238587 2251456 2265001 2279161 2293616 2308351 2323575
57548 2323575 2339175 2354814 2370519 2386551 2402640 2417940 2431986 2445284 2458770 2472994 2487827
57537 2487827 2502698 2517132 2531319 2545954 2561153 2575915 2589189 2601216 2613122 2625440 2637788
57526 2637788 2649893 2662088 2674762 2688094 2702288 2717322 2732409 2746542 2759701 2772863 2786759
57515 2786759 2801385 2816714 2832940 2849784 2866481 2882808 2899364 2916446 2933461 2949835 2965801
57504 2965801 2981790 2997708 3013321 3028770 3044199 3059402 3074350 3089623 3105745 3122418 3138922
57493 3138922 3155028 3171171 3187933 3205649 3224224 3243074 3261522 3279493 3297565 3316169 3335102
57482 3335102 3353972 3372737 3391561 3410554 3429868 3449711 3469973 3490222 3510302 3530622 3551582
57471 3551582 3573014 3594418 3615481 3636185 3656714 3677425 3698690 3720537 3742669 3764871 3787153
57460 3787153 3809539 3832091 3855100 3878768 3902628 3925776 3947835 3969291 3990819 4012750 4035244
57449 4035244 4058366 4081852 4105302 4128818 4152889 4177473 4201799 4225378 4248654 4272307 4296403
57438 4296403 4320598 4344769 4369060 4393632 4418710 4444525 4470964 4497536 4523872 4549940 4575671
57427 4575671 4600850 4625639 4650744 4676725 4703436 4730283 4756719 4782455 4807737 4833528 4860835
57416 4860835 4889560 4918532 4946848 4974607 5002156 5029445 5056537 5084026 5112316 5141043 5169809
57405 5169809 5198954 5228927 5259341 5289388 5318960 5348681 5378929 5409350 5439305 5468415 5496795
57394 5496795 5525090 5554154 5584344 5615207 5646067 5676731 5707432 5738387 5769652 5801154 5832686
57383 5832686 5864187 5896167 5929413 5963940 5998653 6032336 6064672 6096123 6127353 6159048 6191709
57372 6191709 6225100 6258300 6290806 6323123 6355844 6388669 6420944 6452776 6484873 6517530 6550420
57361 6550420 6583226 6615858 6648194 6680205 6712338 6745212 6778837 6812499 6845471 6877618 6909389
57350 6909389 6941416 6973967 7006572 7038398 7069213 7099787 7131089 7163367 7196221 7229176 7261792
57339 7261792 7293594 7324428 7354751 7385114 7415478 7445373 7474610 7503569 7532888 7563046 7594006
57328 7594006 7625075 7655382 7684721 7713682 7742880 7772454 7802425 7832908 7863642 7893925 7923445
57317 7923445 7952642 7981806 8010431 8038038 8065103 8092542 8120688 8149385 8178577 8208077 8237161
57306 8237161 8265188 8292391 8319400 8346372 8373261 8400473 8428314 8456066 8482623 8508000 8533393
57295 8533393 8559677 8586546 8613134 8638867 8663705 8688164 8713041 8738599 8764187 8789200 8814049
57284 8814049 8839449 8865094 8890060 8914295 8938569 8962906 8986243 9007932 9028561 9048850 9068636
57273 9068636 9087466 9105479 9123117 9140556 9157902 9175459 9193340 9211206 9228857 9246753 9265555
57262 9265555 9285407 9305967 9326899 9348058 9369394 9390853 9412255 9433220 9453417 9472846 9491569
57251 9491569 9509279 9525550 9540477 9554546 9567893 9580279 9591838 9603210 9614604 9625295 9634347
57240 9634347 9641440 9646718 9650177 9651472 9650076 9645469 9637583 9627170 9615398 9602926 9589821 9576452 9563845
57227 9563845 9552715 9542631 9532682 9522767 9513749 9506344 9500211 9494193 9487311 9479488 9471407 9463771 9456785
57214 9456785 9450250 9443878 9437362 9430565 9423942 9418466 9414708 9412269 9410468 9409216 9408531 9407598 9405152 9400746
57200 9400746 9394811 9387466 9378157 9366622 9353339 9338733 9322659 9305011 9286204 9266714 9246713 9226451
57188 9226451 9206299 9185966 9164251 9140060 9113261 9084273 9053441 9021324 8989045 8957633 8927236
57177 8927236 8897442 8868189 8840004 8813567 8789350 8767335 8746731 8726202 8704790 8682575 8660408
57166 8660408 8639257 8619885 8602593 8586975 8572224 8557895 8543993 8530238 8515888 8500528 8484382
57155 8484382 8467357 8448417 8426397 8400797 8371084 8335755 8293080 8242687 8185764 8123799 8057743
57144 8057743 7988367 7916783 7844294 7772035 7700879 7631661 7565559 7504222 7449097 7400451 7357415
57133 7357415 7319155 7285355 7255136 7226235 7196094 7163514 7128545 7091118 7050745 7007630 6963310
57122 6963310 6919984 6879673 6844131 6814956 6793488 6780792 6777745 6784802 6801663 6827574 6862205 6906337
57110 6906337 6962055 7032723 7122669 7236497 7378613 7553523 7766251 8022302 8328031 8692269
57100 8692269 9128053 9652694 10286733 11053891 11982368 13105778 14462802 16096159 18050736
57091 18050736 20369570 23087801 26226356 29786517 33745726 38056758 42653213 47459631
57083 47459631 52398200 57384464 62312228 67035851 71360970 75053240 77868637 79597506
57075 79597506 80104250 79346528 77372323 74305474 70328592 65663231 60545367 55200466
57067 55200466 49825595 44581130 39588835 34933240 30665966 26812327 23377740 20352166
57059 20352166 17713439 15430839 13468761 11789737 10356802 9135363 8094193 7205443
57051 7205443 6444517 5790439 5226084 4737611 4313426 3943544 3619442 3333970 3081166
57042 3081166 2856104 2654797 2474096 2311626 2165615 2034498 1916612 1810366 1714624 1628719
57032 1628719 1552197 1484788 1426486 1377397 1337742 1308394 1291219 1288516 1302375 1334582 1386014
57021 1386014 1455671 1542642 1651052 1789365 1956631 2125840 2246562 2272920 2193243 2033429
57011 2033429 1834424 1628994 1435409 1262488 1113643 987990 882558 794899 723033 664180
57001 664180 615431 575170 542506 515839 493296 474150 458540 446014 435369 425643 416419 407490
56989 407490 399190 392755 389382 388974 390515 393503 398337 405365 414053 422690 428443 428233 420576 406589
56975 406589 388784 369154 348845 328964 310670 294613 281040 270308 262695 257903 255442 255279
56963 255279 257560 261983 268133 276217 286818 300129 315974 334222 354203 373732 389348 397715
56951 397715 396741 386112 367618 344727 320888 298031 276908 258263 242846 230729 221594 215575
56939 215575 213035 213754 217250 223772 234023 247967 264835 284290 306681 332001 359304 386876
56927 386876 411797 429326 434299 424333 401524 370871 337504 305174 275899 249984 226694 205616
56915 205616 187276 172313 160491 150851 142518 135150 128898 124115 120817 118390 116145 114098 112753
56902 112753 112107 111526 110739 110399 111397 114063 118189 123442 129570 136625 145204 156196 170115 186857 206012
56887 206012 227134 249874 274266 300553 327959 353591 373285 383849 384380 375929 360897 342703
56875 342703 324782 309177 296390 286604 280315 277665 278178 281756 289259 301584 318761 340531 367321
56862 367321 399901 438345 481922 529804 581071 633406 681714 718531 736889 734014 712696 678934
56850 678934 638462 595561 554061 517556 488120 465870 450438 442156 441571 448807 464122 488323
56838 488323 521928 564475 615328 674553 742304 817767 899027 982626 1061639 1124689 1159244
56827 1159244 1157715 1121089 1057325 977069 890391 805371 727521 659662 602638 556464 521026
56816 521026 496029 480792 474517 476854 488079 508573 538203 576301 622047 674529 732226 792266
56804 792266 849665 896922 925036 926715 900118 850007 785142 714285 643935 578378 520367 471254
56792 471254 430929 398404 372855 354122 342175 336385 335819 340241 350279 366345 387828 413648
56780 413648 442926 474306 504813 530015 545327 547083 533326 504983 466371 423417 380747 340535
56768 340535 303657 270769 242134 217425 196268 178440 163348 150073 138284 128479 120968 115214
56756 115214 110453 106354 102750 99315 95896 92652 89571 86384 83221 80701 79014 77552 75863 74354
56742 74354 73566 73323 73079 72659 72147 71455 70511 69493 68516 67453 66385 65815 66064 66871 67869 68958 69949 70381
56724 70381 70164 69903 70162 70887 71864 73182 74771 76064 76680 76957 77338 77696 77851 78257 79475 81280 82925
56707 82925 84106 85128 86291 87528 88550 89038 88831 88077 86988 85453 83358 81267 80046 79661 79153 78117
56691 78117 77355 77593 78376 78854 78908 78855 78765 78784 79426 80745 81839 81979 81656 81655 81733 81179 80228 79859 80473 81706
56671 81706 83297 85210 87110 88636 90109 92155 94676 96931 98521 99636 100400 100721 100704 100626 100634 100940 102021
56654 102021 104028 106355 108515 111052 114734 119166 123186 126413 129404 132351 134684 136145 137305 138689
56640 138689 140102 141116 141660 141877 141887 141868 141976 142088 141923 141425 140732 139914 139105 138612 138449 138051 137030 135924
56622 135924 135598 136164 137174 138568 140535 142550 143469 142711 140696 138102 135416 133191 131944 131601 131672 132113
56606 132113 133359 135383 137336 138394 138512 138239 138233 138996 140580 142377 143575 143863 143450 142579 141530 140823 140723
56589 140723 140617 139608 137783 136139 135186 134406 133333 132382 132162 132485 132670 132522 132495 132997 133907 134829 135565 136183
56571 136183 136754 137307 138100 139685 142356 145735 149303 153173 157865 163463 169708 176822 185287 194735 204088
56556 204088 212995 221906 230254 236029 238197 238494 239550 242042 244805 246966 248547 249505 249624 249229 248866
56541 248866 248435 247558 246472 245573 244516 242836 241006 239662 238220 235551 231713 227636 223405 218331 212590
56526 212590 207308 203045 199618 197378 197058 198087 198555 197309 194851 191911 188490 184709 181266 178422 175599
56511 175599 172537 169900 168185 166922 165406 163506 161403 159330 157805 157264 157276 156904 155941 154971 154244 153566
56495 153566 153325 154336 156453 158546 160161 162035 164594 167079 168624 169127 168705 167400 165842 165126 165561
56480 165561 166430 167224 168024 168511 167925 166459 165411 165477 166074 166752 167916 169635 171158 172297 173895 176138
56464 176138 177820 178213 178386 179636 181754 183866 185840 187793 189296 190304 191872 194661 197537 198924 198909
56449 198909 198762 198940 198811 198049 197166 196724 196798 197070 197024 196430 196009 196969 199383 201774 202883 203128 203655 204791
56431 204791 206140 207445 208474 208706 207947 206736 205558 204316 203167 202962 204072 205582 206535 207204 208264
56416 208264 209431 209941 209822 209700 209808 209998 210307 210722 210862 210536 210167 210072 209978 209777 209988 210831 211636 211931 212255
56397 212255 213097 213944 214348 215021 216765 219030 220706 221724 222728 223641 223750 222872 221448 219780 218052 216797
56381 216797 216529 217134 218272 219929 222082 224397 226886 230163 234459 239103 243614 248337 253238 257178 259398
56366 259398 260793 262559 264483 265712 266282 266567 266083 264339 262246 261172 261032 260732 260094 259916 260422 261020
56350 261020 261445 261920 262366 262570 262918 263970 265578 267341 269503 272336 275132 276995 278217 279673 281294
56335 281294 282355 282951 283881 285285 286596 287678 288941 290564 292567 295260 298558 301382 302932 304154 306648
56320 306648 310501 314454 317810 320769 323208 324678 325541 326757 328519 330216 331632 333045 334373 335430
56306 335430 336774 339033 341638 343530 344912 346949 350002 353615 358036 364052 371166 377516 382017 385296
56292 385296 388257 390951 393167 394988 396376 397155 397741 399053 401580 405261 410146 416220 422640 428261 433027
56277 433027 437972 443850 450568 457808 465327 472774 480119 488113 497529 508259 519919 532749 546869
56264 546869 561362 575419 589908 606366 624874 644440 665058 687733 712731 739568 768797
56253 768797 802136 840619 883987 932028 985196 1043834 1108089 1178606 1256049 1339931 1429120
56242 1429120 1523306 1622562 1725628 1830032 1933716 2035031 2131421 2219820 2298195 2364971
56232 2364971 2417123 2450974 2465185 2461116 2440032 2401999 2348032 2281264 2204997 2121134 2031318
56221 2031318 1938055 1843722 1749614 1656808 1566972 1481584 1401170 1325827 1255823 1191348 1132408
56210 1132408 1078993 1030684 986337 945146 907735 875054 846626 821154 798326 778402 760539
56199 760539 743460 727566 714367 703835 694354 685403 678151 673045 668836 664516 660435 657005 654040
56186 654040 651850 651218 651793 652159 651865 651776 652163 652339 652462 653680 655932 657557 657806 657909 659045 661036 663673
56169 663673 667428 672076 676354 679870 683764 688823 694468 700194 706389 713174 720032 727082 735078 743759
56155 743759 751930 759571 768050 777880 788251 799141 811713 826079 840861 855573 871327 888568
56143 888568 906489 925483 947826 974924 1006086 1040968 1081014 1127507 1180557 1241196 1312084
56132 1312084 1394649 1487412 1588248 1696023 1808508 1920624 2026333 2120892 2200717 2263732
56122 2263732 2311664 2350196 2385094 2419006 2452035 2482684 2507100 2520143 2519463 2507417 2488227 2465162
56110 2465162 2440791 2416638 2390539 2356563 2309515 2248134 2173413 2086891 1992420 1896890 1806661
56099 1806661 1724624 1651903 1589939 1539135 1497747 1464156 1438458 1420363 1407782 1399055 1394367 1393392
56087 1393392 1394067 1395421 1399090 1406085 1414554 1422759 1431797 1443143 1455852 1468430 1481223 1494747 1507884
56074 1507884 1520034 1533030 1548755 1566811 1586308 1607630 1630574 1653244 1674955 1697789 1723248
56063 1723248 1749910 1776389 1803771 1832884 1862054 1890044 1918364 1948052 1977067 2003576 2028990
56052 2028990 2054922 2080079 2103224 2126390 2152009 2179467 2207548 2237607 2271084 2306548 2342293
56041 2342293 2379277 2418460 2458130 2497059 2537389 2581040 2626217 2670860 2716574 2765586 2816861
56030 2816861 2868848 2923014 2980912 3040861 3101332 3164430 3232152 3302553 3373648 3447609 3526741
56019 3526741 3608868 3691251 3775588 3864393 3956010 4048148 4142879 4242981 4346882 4452495 4562463
56008 4562463 4680136 4803882 4930934 5063216 5203589 5350218 5500845 5658799 5828233
55999 5828233 6007138 6191768 6384295 6589184 6805759 7031530 7269245 7523201 7792154
55990 7792154 8073249 8369252 8684401 9017200 9365313 9733481 10128518 10551039 11000622
55981 11000622 11484081 12009258 12575610 13180897 13832146 14539795 15306643 16133952 17033091
55972 17033091 18019422 19100545 20283397 21587291 23037026 24649865 26444045 28453974
55964 28453974 30722962 33290103 36202775 39535938 43383983 47847492 53054384 59191308
55956 59191308 66501174 75273249 85870573 98749050 114389250 133166185 155253192
55949 155253192 180598838 208981362 240153715 273915530 309699408 345553314 377326302
55942 377326302 399308290 406526581 397196267 373446486 339954858 301817515 263119507
55935 263119507 226554677 193603353 164834859 140230496 119476279 102135314 87714075
55928 87714075 75719845 65725129 57381555 50390670 44496151 39500448 35256083 31634428
55920 31634428 28519449 25824715 23490220 21459706 19677577 18104684 16717153 15488679
55912 15488679 14389154 13399181 12509983 11708865 10978433 10309326 9700082 9144458 8630922
55903 8630922 8154119 7715101 7310572 6932879 6580119 6255503 5956989 5677629 5415836
55894 5415836 5175484 4955940 4751312 4559458 4382803 4220299 4067249 3923229 3792028
55885 3792028 3673705 3564521 3464668 3378338 3306120 3244766 3194441 3158788 3137687 3126903 3124459
55874 3124459 3129574 3134680 3125943 3093315 3034801 2951426 2845331 2723593 2596783 2471507 2348986
55863 2348986 2231080 2121842 2022538 1931003 1846855 1772026 1705544 1643338 1584151 1530483 1482986
55852 1482986 1439118 1398062 1361612 1329184 1297065 1263865 1231938 1202408 1173559 1145179 1119591
55841 1119591 1096986 1074317 1050335 1027453 1007151 987671 967696 948407 930464 912627 894684
55830 894684 878209 863249 847808 831667 817283 805807 795633 785673 776568 767787 757188 744574
55818 744574 732278 721268 710062 698252 687481 678004 667959 657138 647873 641071 635012 629228
55806 629228 625775 625182 624971 623999 624780 629502 636928 645129 654146 663916 672479 678409 682475 685042 684422
55791 684422 679635 672274 663747 653169 639914 625892 613288 602199 592346 584818 579950 575328 568037
55778 568037 557526 544777 530483 515779 503090 494373 489524 487657 488597 492173 497681 504933 513969
55765 513969 522750 527296 525449 518775 509686 498826 486502 474264 463165 452306 440868 429911
55753 429911 420496 411741 402531 393558 385844 378674 370895 363033 356282 350389 344267 337843 331795 326290
55739 326290 321297 317353 314766 312871 311059 309605 308539 306881 304065 300964 298400 295834 292618 289353
55725 289353 286674 283793 279608 274411 269303 264712 260561 257057 254287 251754 249179 246997 245455 244290
55711 244290 243877 245389 248994 253267 257310 261984 267836 273298 276344 276795 275575 272817 268284 262726 257188
55696 257188 251557 245178 238448 232555 228022 224537 221753 219288 216412 212712 208776 205611 203807 203612
55682 203612 205013 207242 209194 210852 213267 216579 219374 220830 222095 224408 226995 228090 227101 224554
55668 224554 220836 216307 211953 208651 206237 204238 202876 202477 202677 203197 204709 207873 212182 216672 221111
55653 221111 225601 229783 233421 237092 241360 245881 250120 254054 257272 258363 256414 252325 247537 242180
55639 242180 235668 228419 221572 215426 209353 203026 196780 191004 186007 182102 179163 176536 173960 171897
55625 171897 170413 168693 166472 164878 164771 165139 164307 161994 159108 156355 154205 153319 153579 153410 151517 148741
55609 148741 146809 145837 144582 142663 140843 139328 137516 135496 134313 134464 135304 136160 136906 137284 136763 135463
55593 135463 134290 133799 133571 132973 131959 130923 130238 130054 130214 130344 130231 129992 129711 129323 129012 129141 129492 129288
55575 129288 128455 127986 128502 129275 129456 129379 129728 130261 130466 130731 131614 132569 132697 132377 132843 134316 135736 136222
55557 136222 135764 134650 133209 131942 130924 129268 126185 122434 119724 118748 118730 118764 118622 118336 117912 117546 117385
55540 117385 117125 116495 115946 116122 116898 117645 118136 118407 118135 117099 115960 115594 115860 115933 115579 115159 114616 113541
55522 113541 112044 110525 108719 106027 102697 99621 97079 94712 92673 91687 91930 92882 94334 96520 99148
55507 99148 101290 102415 102680 102189 100865 99076 97434 95948 94274 92774 92248 92506 92396 91467 90600 90623 91294
55490 91294 92030 92774 93673 94610 95435 96120 96499 96477 96563 97424 98831 99913 100593 101748 103672 105370 105910 105594
55472 105594 105260 105128 104973 104801 104743 104684 104481 104204 103828 103137 102216 101580 101439 101333 100923 100701 101332 102546 103227
55453 103227 102605 101055 99659 99177 99496 100042 100514 101011 101489 101563 101056 100371 100002 100048 100482 101418 102625 103341
55435 103341 103168 102751 102809 102895 102009 100199 98647 98195 98612 99352 100236 101249 102285 103251 104016 104368 104406 104730
55417 104730 105675 106658 106945 106710 106639 106851 107087 107609 108833 110278 111015 111067 111268 111695 111413 109958 108019 106338
55399 106338 104862 103348 101996 101129 100832 101064 101555 101676 101197 101021 102187 104211 105510 105471 104887 104227 102842
55382 102842 100361 97646 95723 94747 94596 95483 97287 99132 100293 100873 101089 100684 99649 98700 98355 98148
55366 98148 97384 96124 94874 93862 93172 93081 93747 94950 96447 98103 99470 99944 99623 99297 99283 99080 98529
55349 98529 98406 99265 100538 101380 101680 101683 101365 100870 100779 101264 101629 101401 101162 101553 102125 102010 101130 99893 98305
55330 98305 96372 94917 94940 96360 98151 99493 100086 99796 98864 98230 98628 99488 99564 98636 97782 97941 98898 99814
55312 99814 100134 99840 99264 98811 98598 98380 98001 97680 97566 97402 97070 97068 97875 99110 100033 100651 101614 103010 104035
55293 104035 104048 103405 102992 103282 104061 104794 105111 105077 105067 105343 105834 106408 107111 107895 108290 107724 106238 104656 103971
55274 103971 104518 105607 106060 105334 104067 103287 103197 103227 103157 103383 103906 103915 102928 101709 101387 102067 102956 103544 103973
55255 103973 104402 104686 104669 104374 103846 103154 102462 101822 101048 100160 99780 100651 102724 105010 106423 106636 106169 105784
55237 105784 105823 106076 106264 106456 106764 106935 106698 106391 106577 107075 107110 106559 106242 106689 107396 107720 107761 107734 107192 105631
55217 105631 103485 101786 101060 101153 101842 102989 104242 105131 105459 105344 105013 104774 104917 105421 106048 106815 107884
55200 107884 108864 108934 107970 106884 106444 106507 106805 107599 108838 109559 109012 107762 106815 106308 105987 106264 107551 108966
55182 108966 109097 107911 106747 106473 106761 107159 107722 108399 108824 108995 109295 109645 109478 108748 108139 108055 108233 108567
55164 108567 109470 111021 112511 113274 113367 113118 112640 112177 112275 113088 113973 114296 114265 114568 115486 116714 117778 118330
55146 118330 118254 117769 117248 116802 116269 115626 115048 114527 113855 113193 113084 113614 113972 113331 111866 110453 109568 108920
55128 108920 108118 107220 106495 105960 105416 104858 104626 105048 106027 107131 108014 108594 108901 109006 109131 109534 110147 110648
55110 110648 110948 111262 111599 111699 111741 112515 114377 116456 117586 117752 117906 118585 119429 120056 120657 121485 122314 122735
55092 122735 122683 122486 122563 123139 124133 125248 126265 127090 127480 127042 125732 124065 122530 121174 120000 119266 118968
55075 118968 118513 117560 116699 116588 116820 116511 115675 115093 114978 114759 114185 113676 113525 113631 114147 115422 117102 118248
55057 118248 118655 119127 120010 120388 119415 117665 116395 115966 115795 115471 115117 114750 114032 112843 111702 111364 112110
55040 112110 113596 115335 117214 119287 121066 121519 120259 118416 117648 118366 119561 120339 120857 121531 122104 121975
55024 121975 121048 119865 119135 119336 120467 121954 123036 123327 122902 121969 120853 120094 119976 120022 119638 119180 119625
55007 119625 121107 122656 123602 124318 125166 125624 125186 124468 124568 125666 126890 127362 126908 125953 125190 125140 125725 126436
54989 126436 127071 127904 128898 129341 128726 127549 126705 126423 126291 126094 126084 126609 127870 129826 131969 133433 133707
54972 133707 133062 131994 130661 129259 128495 128968 130231 131109 131001 130434 130320 131052 132305 133398 133848 133852 134122
54955 134122 135062 136290 137243 137956 138808 139683 139979 139435 138473 137608 136907 136205 135485 134846 134319 133949 133945 134550 135747
54936 135747 137262 138875 140662 142763 145013 147042 148780 150574 152598 154534 156215 158225 161290 165344
54922 165344 169920 175384 182885 192862 204397 216308 228087 239251 248546 254620 257147 256630 253391
54909 253391 247361 238734 228271 217024 206039 196048 187088 178679 170770 164172 159577 156535 154026
54896 154026 151796 150397 149993 149796 148900 147180 145287 144116 144308 145908 148322 150835 153256 155921 159205
54881 159205 163260 168089 173603 179628 186111 193223 201089 209531 218260 227077 235540 242620 247138 248541
54867 248541 247035 243085 237061 229306 220237 210408 200614 191735 184218 177791 171938 166521 161722 157622
54853 157622 154080 150879 147749 144496 141350 138929 137499 136541 135340 133667 131608 129196 126791 125382
54839 125382 125717 127182 128252 128110 127305 126800 126934 127422 127908 128304 128867 129978 131648 133330 134497 135236 135894
54822 135894 136405 136401 135819 134875 133597 132044 130856 130919 132365 134454 136475 138197 139417 139789 139379 138814 138557
54805 138557 138417 137986 137159 136044 134819 133862 133596 133975 134473 134819 135332 136353 137646 138630 138887 138325 137157
54788 137157 135906 135108 134929 135346 136578 138801 141400 143281 144211 145174 147020 149428 151697 153877 156322
54773 156322 158650 160134 161039 162709 166177 171330 177603 184930 193709 204150 215903 228113 239672
54760 239672 249619 257438 262887 265623 265244 261759 255724 247806 238411 227937 217177 207191 198698 191716
54746 191716 185863 180894 176812 173470 170378 167225 164467 163033 163274 164492 165644 166254 166432 166361 166264 166650
54730 166650 168022 170184 172340 174117 176142 179265 183483 188123 193002 198928 206824 216651 227356 237638
54716 237638 246505 253242 257245 258108 255751 250449 242821 233743 224133 214697 205901 198050 191237 185255
54702 185255 179778 174677 169987 165599 161280 157093 153514 150993 149476 148445 147312 145791 144138 142980
54688 142980 142595 142354 141338 139625 138395 138515 139505 140335 140663 140716 140414 139498 138294 137493 137124 136505 135397
54671 135397 134490 134511 135377 136498 137375 137643 137110 136169 135755 136402 137547 138130 137681 136490 135065 133833 133213
54654 133213 133438 134248 135068 135557 135813 136062 136371 136646 136778 136780 136889 137474 138696 140275 141704 142677 143278 143819
54636 143819 144507 145147 145150 144032 142048 140169 139291 139525 140296 140942 141049 140485 139466 138581 138426 139054 139911 140396
54618 140396 140413 140388 140831 141888 143195 144152 144441 144379 144653 145581 146703 147278 147198 147174 147855 148948 149519 149095 148064
54599 148064 146983 145963 144962 144234 143952 143654 142676 141204 140349 140990 142828 144751 145832 145825 144979 143717 142445
54582 142445 141451 140874 140707 140773 140778 140561 140275 140176 140244 140214 139959 139652 139606 140120 141366 143132 144676 145268 144995 144700
54562 144700 145003 145719 146340 146699 146859 146669 145935 144904 144166 144017 144195 144349 144516 144961 145634 146057 145853 145285
54544 145285 145051 145518 146398 147292 148292 149740 151566 153288 154612 155638 156447 156894 156958 156898 156905 156943 157107 157742
54526 157742 158867 159844 160006 159440 158778 158414 158315 158456 158883 159295 159054 157926 156546 155847 156122 156861 157423 157656
54508 157656 157779 157906 157868 157497 156884 156288 155836 155385 154646 153486 152182 151363 151505 152423 153456 154225 154971 155967
54490 155967 156873 157026 156208 154820 153424 152484 152379 153197 154431 155358 155808 156193 156680 156821 156258 155376 154968 155466
54472 155466 156743 158379 159832 160626 160720 160603 160749 161113 161426 161791 162632 164082 165770 167270 168511 169621
54456 169621 170528 170957 170836 170572 170738 171414 172025 171948 171173 170137 169041 167706 166110 164622 163563 162850 162295
54439 162295 161969 162040 162470 163092 163784 164309 164153 162912 160883 159053 158363 158939 160010 160601 160384 159882 159785 160201
54421 160201 160801 161523 162654 164175 165478 166048 166147 166509 167535 168974 170238 170797 170443 169408 168188 167146
54405 167146 166409 166178 166794 168265 169952 171037 171241 170953 170775 171143 172187 173690 175209 176379 177157 177731
54389 177731 178329 179116 180106 181078 181707 181861 181638 181117 180308 179388 178690 178321 177991 177403 176626 175995 175744 175778 175680
54370 175680 175009 173813 172722 172238 172078 171669 171175 171383 172527 173941 175007 175758 176233 176025 174965 173683
54354 173683 172940 172842 173133 173733 174467 174791 174391 173692 173226 172941 172649 172573 172793 172697 171836 170853 170598 170641 169745 167706
54334 167706 165637 164425 163882 163561 163405 163313 162943 162345 162078 162348 162686 162807 163124 164012 165098 165705 165580 164875
54316 164875 163933 163393 163973 165769 168189 170883 174194 178315 182564 186018 188454 190170 191369 192380 194069
54301 194069 197158 201144 204547 206341 206684 206232 205272 203689 201361 198380 195088 191982 189339 186922 184316
54286 184316 181600 179299 177599 176013 174150 172461 171700 171757 171557 170302 168415 166966 166481 166658 166997 167178
54270 167178 166929 166124 165234 165126 166121 167582 168711 169347 169654 169493 168701 167723 167308 167641 168286 168920 169554 170027
54252 170027 169979 169465 169080 169178 169405 169264 168709 167942 167014 165995 165230 165017 165161 165160 164758 164106 163520 163274 163485 163937
54232 163937 164089 163530 162466 161650 161759 162812 164172 165133 165561 165902 166482 166936 166555 165123 163185 161493 160453
54215 160453 160121 160401 161085 161947 162942 164175 165537 166570 166833 166352 165559 164859 164313 163745 163095 162578 162399 162372
54197 162372 162083 161480 160984 160885 161009 161243 161939 163278 164597 165013 164581 164173 164294 164737 165418 166700 168587 170283
54179 170283 170996 170733 169936 168764 167151 165244 163367 161771 160683 160352 160775 161625 162625 163782 165093 166404
54163 166404 167747 169377 171154 172345 172475 171996 171594 171144 169956 167958 166043 165150 165361 166041 166560 166743
54147 166743 166805 167011 167399 167802 168056 168036 167558 166523 165267 164447 164400 164789 165074 165117 165130 165259 165481 165796 166268 166877
54127 166877 167484 167933 168193 168478 169130 170203 171263 171855 172099 172447 172979 173437 173902 174746 175799 176289 175962 175593
54109 175593 175935 176749 177405 177898 178572 179283 179593 179558 179582 179641 179342 178692 178139 177792 177226 176185 175017 174249 174127
54090 174127 174636 175559 176422 176710 176284 175395 174331 173340 172813 173166 174434 176229 178094 179694 180782 181321 181607
54073 181607 181963 182352 182604 182936 183812 185258 186701 187601 187920 187932 187863 187845 187956 188222 188644 189216 189759 189957 189879
54054 189879 190265 191777 194030 195889 196803 197368 198344 199670 200750 201414 202191 203747 206321 209645 213304 217132
54038 217132 221251 225684 230130 234431 239127 245011 252005 258871 264402 268682 272944 278321 284894 291754
54024 291754 297718 302104 305099 307490 309951 312575 314998 316832 317944 318475 318702 318829 318812 318407 317364 315514
54008 315514 312772 309201 305052 300577 295798 290645 285230 279851 274745 270123 266380 263902 262499 261327
53994 261327 259636 257429 255215 253281 251488 249671 247916 246338 244853 243338 241942 241010 240726 240972 241606
53979 241606 242715 244405 246508 248766 251305 254713 259642 266499 275446 286389 298948 312802 328077
53966 328077 344779 361479 374997 381931 380597 371547 356871 339395 321890 306022 291964 279489
53954 279489 269252 262334 258654 256699 254992 253181 251541 250207 249315 249233 250019 251041 251686 252181 253239
53939 253239 255089 257379 259840 262449 264996 267080 268762 270738 273597 277139 280718 284053 287408 291092
53925 291092 295106 299358 303894 308749 313708 318492 323150 328110 333820 340434 347806 355585 363333 370785
53911 370785 378057 385403 392827 400285 408160 416923 426029 433781 438843 441499 442889 443395 442546 440286 437359
53896 437359 434336 431137 427793 424892 422705 420412 416821 411586 405246 398356 391148 383913 377061 370614
53882 370614 364021 356743 348939 341415 334970 329783 325421 321386 317584 314237 311409 308786 305908 302466
53868 302466 298353 293697 288935 284706 281445 279046 276896 274222 270568 266250 262340 259883 258900 258368 257338
53853 257338 255932 255010 254943 255017 254139 251951 249141 246736 245283 244769 245060 246042 247305 248101 247934 247089 246323
53836 246323 246108 246295 246346 245710 244144 242007 240143 239202 239107 239396 239887 240671 241633 242427 242952 243423 243931 244259
53818 244259 244204 243812 243297 243048 243638 245425 248088 250985 253993 257536 261762 266284 270968 276467 283592 292557
53802 292557 303233 315877 331109 349257 370036 392938 417766 444733 473753 503184 529116
53791 529116 546455 551451 543725 526259 503747 480638 459809 442218 427500 414936 403845 393491
53779 393491 383281 373329 364377 356821 350093 343266 336034 328860 322377 316925 312468 308627 304837 300723
53765 300723 296340 292007 287933 284019 279919 275382 270673 266539 263492 261285 259415 257950 257297 257254 256978
53750 256978 256045 254952 254387 254546 255328 256606 258058 259355 260834 263366 267175 271365 274997 277982 280432
53735 280432 281883 281897 280912 279718 278490 277035 275505 274001 271863 268375 264095 260589 258761 258193 258124 258262
53719 258262 258569 259008 259776 261155 262851 263947 263759 262416 260592 259089 258638 259470 260953 262198 263132 264421
53703 264421 266240 267844 268655 269111 269985 271381 272929 274598 276717 279365 282229 285002 287592 289971 292122
53688 292122 294067 295708 296685 296662 295757 294595 293893 294006 294733 295434 295416 294410 292699 290807 289154 288014 287610
53671 287610 288019 288946 289760 289919 289455 288938 288885 289242 289639 290036 290690 291374 291206 289662 287422 285649 284693 284097
53653 284097 283697 283912 284779 285493 285328 284504 283663 282936 282069 281193 280814 281038 281377 281472 281634 282397 283815 285440
53635 285440 286894 288219 289654 291319 293154 295017 296725 298133 299291 300492 302004 303831 305834 308015
53621 308015 310459 313137 316031 319355 323207 327056 330101 332332 334662 337688 340827 343153 344712 346354
53607 346354 348543 351004 353502 356330 359894 364288 369365 374772 379763 383413 385294 385800 385735 385764 386195 386907
53591 386907 387378 387119 386245 385360 384819 384325 383377 381866 380088 378320 376503 374222 371061 367142 363310 360488
53575 360488 358834 357694 356353 354566 352450 350238 348267 346862 346028 345408 344641 343639 342525 341523 340933
53560 340933 340995 341695 342771 343914 344888 345640 346438 347681 349325 350755 351543 352066 352920 354014 354847 355447 356351
53543 356351 357722 359343 361521 365072 370004 375068 379238 383054 387828 393901 400365 406376 412087 418268
53529 418268 425453 433678 442769 452703 463616 475549 488372 502176 517484 534658 553171 571987
53517 571987 590693 609675 629042 648084 666194 683765 701645 720110 738906 758002 777713
53506 777713 798218 819439 841309 863806 886786 910120 933802 957612 980835 1002698 1022989
53495 1022989 1041956 1059801 1076685 1093085 1109684 1126870 1144628 1162797 1181090 1199024 1216312
53484 1216312 1233314 1250645 1268242 1285303 1301225 1316246 1330943 1345457 1359480 1372695 1384802
53473 1384802 1395236 1403254 1408470 1411126 1411737 1410624 1407885 1403638 1397950 1390454 1380350 1367065 1350844
53460 1350844 1332568 1313215 1293663 1274724 1256741 1239153 1220912 1201462 1180989 1159786 1137940
53449 1137940 1115813 1094172 1073460 1053389 1033707 1014931 997786 982214 967497 953179 939367
53438 939367 926332 914485 904691 897869 893919 891493 889189 886830 885318 885402 886864 889020 891853 896351
53424 896351 903497 913020 923564 934195 945357 958127 972954 989570 1007782 1027665 1049072 1071626
53412 1071626 1095375 1120954 1148787 1178463 1209201 1240747 1273574 1308373 1345542 1384990 1426157
53401 1426157 1468295 1511055 1554972 1601178 1650386 1702099 1754960 1807926 1860927 1914284 1967779
53390 1967779 2020727 2072892 2124859 2177280 2230071 2282562 2334102 2384176 2432130 2477205 2518866
53379 2518866 2556896 2591210 2621801 2648828 2672527 2692922 2709644 2722037 2729495 2731853 2729453 2722636
53367 2722636 2711124 2694129 2671098 2642086 2607409 2567306 2522095 2472229 2418072 2360107 2299684
53356 2299684 2238985 2179681 2121859 2064696 2007886 1951923 1897431 1844908 1794960 1747993 1703545
53345 1703545 1660478 1617829 1575058 1531627 1487094 1441848 1397170 1354276 1313649 1275397 1239739
53334 1239739 1206835 1176475 1148264 1121902 1097212 1074198 1053205 1034731 1018888 1005255 993264
53323 993264 982392 972021 961621 951320 941886 933876 927154 921495 917161 914431 912915 911978 911789 913384
53309 913384 917548 924028 932028 941103 951245 962361 974220 986998 1001437 1018021 1036234 1055071
53297 1055071 1074238 1094367 1115986 1138928 1163057 1188939 1217151 1247189 1277743 1307892 1337407
53286 1337407 1365989 1392964 1417917 1441038 1462573 1482379 1500197 1515928 1529424 1540356 1548502
53275 1548502 1553791 1555962 1554617 1549879 1542528 1533215 1521895 1508337 1492715 1475337 1456153 1435000
53263 1435000 1412036 1387508 1361371 1333658 1305082 1276661 1248745 1220826 1192317 1163163 1133601
53252 1133601 1103742 1073539 1042981 1012204 981586 951758 923331 896491 870865 845794 820718
53241 820718 795421 770058 744933 720237 696092 672804 650753 629931 609948 590766 573075
53230 573075 557571 544139 532239 521840 513280 506188 499318 491757 483733 475854 468027 459671 450686
53217 450686 441569 432611 423575 414317 405285 397122 390001 383585 377470 371418 365264 358907 352490 346470
53203 346470 341398 337600 334984 333035 330966 328030 323912 318981 314151 310267 307388 304714 301441 297775
53189 297775 294827 293390 293034 292636 291551 289926 288029 285834 283347 280903 278861 277282 276090 275294 274836
53174 274836 274455 273982 273588 273520 273740 274068 274509 275195 276085 276960 277660 278192 278675 279279 280035 280550 280200 278870 277290
53155 277290 276402 276555 277495 278798 279907 280151 279349 278261 277898 278366 278885 278870 278481 278109 277851 277595 277103 275941
53137 275941 273895 271597 270221 270278 271111 271707 271564 270620 269011 267264 266209 266108 266233 265711 264520 263234
53121 263234 262113 261032 260084 259642 259823 260350 260985 261738 262620 263521 264407 265276 265868 265705 264620 263109 261957
53104 261957 261489 261198 260145 257808 254645 251744 249884 248967 248385 247732 247068 246655 246612 246775 246775 246333 245503 244535
53086 244535 243544 242510 241626 241283 241563 242023 242231 242249 242324 242369 242160 241898 242059 242630 242836 241884 239821 237513 235817
53067 235817 234922 234473 234194 234158 234382 234476 234041 233331 233144 233982 235588 237302 238522 238864 238406 237945 238453 239946
53049 239946 241321 241666 241337 241355 242179 243575 245318 247307 249180 250494 251235 251635 251578 250777 249518 248564 248184
53032 248184 247886 247299 246767 246794 247370 248130 248781 249021 248413 246798 244664 242740 241268 239910 238295 236413 234525
53015 234525 232834 231271 229629 227994 226968 227123 228205 229210 229489 229399 229577 229878 229561 228433 227285 227042
52999 227042 227817 228972 229822 230073 229744 229015 228180 227582 227504 228033 228955 229797 230181 230298 230886 232467 234637 236349
52981 236349 236992 236951 237094 237918 239331 240905 242037 242176 241393 240629 240841 241770 242093 241060 239579 239310 240951
52964 240951 243820 246823 249302 250919 251367 250583 249057 247598 246747 246468 246363 246078 245455 244399 242765 240569
52948 240569 238266 236578 235875 235844 235860 235597 235133 234594 233943 233151 232367 231803 231497 231315 231173 231164 231383 231675 231810
52929 231810 231917 232388 233136 233283 232092 230015 228203 227070 226071 224978 224489 225045 225841 225783 224983 224492 224810
52912 224810 225458 225931 226283 226680 227028 227229 227262 226908 225910 224546 223470 222823 222038 220791 219599 219090 219193 219492
52894 219492 219963 220799 221715 222097 221835 221562 221952 223116 224761 226583 228260 229298 229250 228208 226966 226490 227157
52877 227157 228536 229955 231134 232179 233110 233679 233649 233037 232068 231093 230517 230523 230846 231095 231393 232318 234081 236091
52859 236091 237632 238646 239504 240281 240766 241086 241796 243134 244553 245221 244747 243240 240848 237647 233937 230339
52843 230339 227355 224968 222859 220950 219507 218670 218148 217564 216965 216671 216713 216686 216303 215825 215726 216059 216417 216535
52825 216535 216748 217673 219465 221474 222677 222482 221128 219385 218020 217499 217959 219197 220715 222044 223192
52810 223192 224634 226801 229607 232616 235627 238926 242830 246936 249992 250727 248912 245507 241708 238008
52796 238008 234210 230116 225986 222403 219905 218646 218146 217469 215972 213918 212149 211152 210719 210481 210386 210535
52780 210535 210880 211331 211875 212361 212419 211934 211415 211561 212512 213806 215001 216018 216900 217599 218118 218565 218946 219156
52762 219156 219277 219610 220162 220398 219841 218777 218002 217901 218142 218283 218276 218229 218045 217636 217229 217170 217527 218192 219230
52743 219230 220813 222821 224795 226277 226980 226771 225893 225196 225613 227179 228861 229588 229246 228471 227756 227091 226368
52726 226368 225806 225829 226605 227745 228584 228845 228949 229438 230240 230798 230837 230532 229954 228903 227501 226390 226041 226217
52708 226217 226366 226105 225142 223306 221025 219209 218162 217221 216005 215313 215926 217112 217498 217048 216929 217471 217666
52691 217666 216995 216425 216873 217747 217977 217760 218227 219720 221413 222582 223445 224565 226073 227727 229352 230920
52675 230920 232318 233259 233490 233138 232790 233092 234183 235689 237280 238926 240530 241727 242310 242550 242702 242444
52659 242444 241301 239541 238163 237875 238422 239066 239398 239471 239387 239220 239286 240068 241604 243155 243826 243439 242503 241387
52641 241387 239988 238315 236859 235991 235362 234393 233132 232139 231685 231609 231844 232528 233569 234707 236069 238129
52625 238129 240992 244222 247422 250341 252231 251981 249474 246214 243866 242477 240834 238401 236098 235099 235485
52610 235485 236392 237132 237777 238778 240240 241675 242420 242221 241406 240614 240488 241467 243495 245882 247716 248601 248787
52593 248787 248679 248590 249046 250679 253400 256028 257252 256893 255925 255448 255921 257190 258728 259867 260220 260111 260382
52576 260382 261626 263646 265645 266841 266998 266538 266146 266142 266251 266069 265706 265766 266624 267888 268716 268710 268274 267977 267725
52557 267725 266896 265265 263334 261576 259865 257996 256294 255125 254221 253171 252321 252281 252686 252448 251414 250766
52541 250766 251426 252883 254131 254987 255880 256973 258114 259168 259776 259309 257733 256060 255261 255053 254458 253268
52525 253268 252212 251890 252300 253253 254560 255812 256583 256897 257044 257058 256894 256965 257905 259759 261895 263722 265128
52508 265128 266404 268149 270989 274801 278372 280423 280802 280080 278354 275372 271710 268707 267017 266131 265511
52493 265511 265263 265304 264911 263759 262665 262543 263183 263771 264103 264486 264788 264572 264154 264649 266660 269451 271748
52476 271748 273053 273921 275133 276886 278739 280224 281374 282592 284033 285331 286084 286432 286887 287659 288416 288834
52460 288834 289155 289917 291210 292414 292811 292270 291147 289676 287797 285552 283222 280936 278495 275915 273798
52445 273798 272798 272822 273103 272970 272267 271220 270270 269870 270024 270072 269436 268486 268178 268783 269526 269676 269402 269267 269315
52426 269315 269152 268722 268449 268618 268943 268937 268527 268181 268429 269369 270729 272322 274226 276428 278602 280515 282422
52409 282422 284757 287590 290830 294865 300456 307825 316294 325076 334078 343549 353118 361489 367083 368822
52395 368822 366436 360393 351804 342311 333642 326851 321800 317540 313361 309386 306166 304017 302970 303033 304068
52380 304068 305441 306193 305734 304325 302933 302706 304338 307636 311650 315364 318278 320450 322265 324234 326574
52365 326574 328758 329855 329620 328855 328359 328030 327448 326807 326539 326397 325745 324554 323384 322495 321824 321697 322692
52348 322692 324693 326892 328873 330940 333298 335710 338174 341057 344242 346922 348674 350112 352109 355015
52334 355015 358960 364132 370254 376468 382366 388593 395866 403917 412068 420394 429582 439938 451096 462471
52320 462471 473432 483318 491931 499962 508399 517602 527231 536819 545997 554455 562238 569935 578090 586549
52306 586549 594833 602969 611516 620854 630852 641141 651274 660781 669472 677628 685534 692901 699105 703842
52292 703842 707149 708989 709328 708562 707292 705690 703510 700870 698501 697005 696171 695264 693798 691942 690369
52277 690369 689883 691003 693662 697205 700768 703796 706398 709164 712524 716341 720298 724640 730110 737133
52263 737133 745397 754354 763686 773085 782085 790488 798595 806640 814396 821772 829422 838054 847323 856101
52249 856101 863880 871286 878995 886614 892961 897265 899849 901764 903940 906695 909909 913464 917285 921131
52235 921131 924723 928215 932127 936656 941384 945925 950436 955181 959976 964538 969143 974409 980479 986815
52221 986815 992743 997956 1002584 1007053 1011758 1016617 1021163 1025293 1029629 1034820 1040832 1047335 1054416 1062329
52207 1062329 1070752 1078958 1086700 1094335 1102100 1109785 1117199 1124411 1131445 1138178 1144691 1151363 1158490 1166049
52193 1166049 1173856 1181707 1189360 1196666 1203621 1210004 1215122 1218380 1220021 1220854 1221272 1220993 1219691 1217245 1213308
52178 1213308 1207262 1198956 1189148 1178976 1169261 1160423 1152621 1145678 1139145 1132769 1126812 1121734 1117741 1114718
52164 1114718 1112438 1110679 1109291 1108293 1107868 1108166 1109090 1110245 1111084 1111313 1111215 1111341 1111747 1111845 1111226 1110242 1109429 1108773
52146 1108773 1108086 1107807 1108720 1110944 1113816 1116672 1119076 1120353 1119759 1117326 1113890 1109993 1105360 1099757 1093811
52131 1093811 1088551 1084532 1081758 1080156 1079823 1081133 1084768 1091278 1100300 1110576 1121094 1131966 1143955
52118 1143955 1157424 1171982 1186842 1201229 1214643 1227006 1238406 1248680 1257553 1265248 1272437 1279349
52106 1279349 1285441 1290398 1294996 1300466 1307289 1315161 1323903 1333751 1344756 1356449 1368261 1379935 1391365
52093 1391365 1402263 1412007 1419646 1424087 1424556 1421020 1414108 1404692 1393762 1382591 1372568 1364588 1358661
52080 1358661 1354273 1351078 1349176 1348764 1349712 1351552 1353831 1356330 1359007 1361867 1364916 1368098 1371256 1374392
52066 1374392 1378022 1382905 1389134 1395773 1401757 1406955 1411933 1416890 1421392 1425117 1428291 1431221 1433853 1435972
52052 1435972 1437417 1437978 1437483 1436095 1434085 1431119 1426260 1419018 1409988 1400140 1389856 1379063 1367972 1357166
52038 1357166 1347104 1337982 1329961 1323162 1317420 1312346 1307682 1303448 1299738 1296548 1293768 1291234 1288743 1286055
52024 1286055 1282799 1278553 1273338 1268001 1263647 1260547 1257983 1255353 1252945 1251258 1249994 1248330 1245990 1243515
52010 1243515 1241440 1239651 1237546 1234470 1229892 1223415 1214717 1203369 1188758 1170411 1148472 1123721 1097133
51997 1097133 1069534 1041650 1014291 988339 964420 942509 922014 902513 884338 868047 853280
51986 853280 838673 823193 807195 791872 778075 766013 755590 746288 736919 726191 713725 700144
51974 700144 686240 672542 659596 648009 638044 629729 623538 620431 620871 624185 629303 635753 643572
51961 643572 652572 662227 672096 681773 690447 697096 701236 703049 702599 699457 693466 685510 676986 668664
51947 668664 660547 652776 646100 641303 638745 638729 641924 648907 659413 672391 686671 701353 715723
51934 715723 729196 741342 751722 759793 765179 767809 767445 763279 754632 741997 726813 710074 691791
51921 691791 672007 651708 632230 614182 597425 581870 567796 555503 545071 536412 529285 523295
51909 523295 518155 513920 510836 509072 508887 510878 515688 523278 532705 542737 552630 562299 571753 580461
51895 580461 587266 590920 590589 585913 576956 564445 549887 534968 520746 507680 496326 487432 481289
51882 481289 477519 475767 476173 478886 483672 490390 499495 511481 526037 542148 558890 575779 592497
51869 592497 608578 623182 634860 641774 642715 637959 629029 617750 605723 594235 584154 576036 570744
51856 570744 569743 574227 583961 597455 613310 631032 650672 672198 695256 718808 740534 756893
51844 756893 764313 760776 746650 724406 697412 668506 639377 611125 585009 562212 543099 527338
51832 527338 514831 505950 500690 498176 497411 498076 500062 502517 503925 503254 500603 496642 491828 486455 481166
51817 481166 476925 474345 473308 473431 474739 477646 482306 488202 494373 499817 503716 505545 505192 502868 498811
51802 498811 493252 486620 479562 472630 466135 460324 455443 451535 448480 446305 445112 444577 443969 442950 441976
51787 441976 441585 441696 442048 442966 445065 448317 451851 454587 455669 454568 451391 447091 442884 439402 436801
51772 436801 435479 436086 438759 442964 448245 454684 462414 471156 480456 490055 499740 509084 517513 524362
51758 524362 528710 529480 526046 518772 508859 497718 486391 475362 464851 455324 447540 441856 437653
51745 437653 433849 429997 426669 424836 425205 428006 432915 439102 445797 452973 461164 470602 480844 491256
51731 491256 501320 510356 517404 521762 523397 522749 520456 517420 514778 513517 514173 516767 520562 523830
51717 523830 524549 521848 516592 510447 504715 500112 496999 495220 494027 492659 490908 488892 486590 484043
51703 484043 481838 480991 482393 486426 492658 499485 504486 505957 504276 501492 499577 499337 500738 503678 508209
51688 508209 514211 520918 526638 529237 527479 522035 514847 507437 500139 492907 486317 481442 479058 479255
51674 479255 481602 485394 489824 494209 498077 501000 502492 502278 500721 498904 498257 499981 504518 511308 519010
51659 519010 526056 531086 533136 531768 527325 520891 513802 507142 501771 498597 498499 501909 508627 517980 528792
51644 528792 539020 545819 546625 540571 528849 513658 496876 479632 462843 447665 435122 425364
51632 425364 417507 410452 403851 398147 393683 390090 386727 383568 381336 380726 381672 383380 384912 385705 385758
51617 385758 385472 385270 385284 385380 385407 385354 385351 385562 385923 385858 384561 381901 378848 376594 375388 374727 374553 375564 378210
51598 378210 382042 386377 391068 396313 402228 409048 417238 426935 437600 448623 459748 470371 478922
51585 478922 483828 485019 483893 482016 480421 479955 481397 485082 490959 499177 510227 524573 542573 564475
51571 564475 589769 616674 643231 669204 696286 726175 759010 793694 828864 863271 896307
51560 896307 929167 965074 1007453 1057704 1114882 1177022 1242010 1307141 1368454 1420885 1459345
51549 1459345 1480180 1482250 1466780 1436104 1392428 1337632 1273827 1203734 1130487 1057087 985871
51538 985871 918385 855777 799174 749390 706295 668886 636173 607825 583960 564586 549232
51527 549232 536861 526186 516486 508096 501624 496724 492213 487506 483209 479952 477294 474277 470623 466894
51513 466894 463747 461521 460269 459709 459307 458754 458154 457437 455846 452442 446984 440046 432477 425071 418531
51498 418531 413326 409577 407212 406038 405532 404986 404196 403731 404174 405450 407245 409680 412988 416755 420029
51483 420029 422126 422908 422472 421063 419139 416996 414380 410962 407177 404107 402451 401974 401927 401638 400709 399080
51467 399080 396992 394627 391872 388714 385670 383319 381498 379538 377309 375467 374572 374535 375128 376532 379047
51452 379047 382678 387321 392974 399395 405861 411758 417305 423414 430877 439968 450727 463338 478148
51439 478148 495372 514569 534113 551252 563197 568646 568488 565133 561143 558156 556474 555086 552029
51426 552029 545255 533816 518610 501992 486521 473810 464191 457090 451688 447479 444454 442779 442261
51413 442261 442225 442011 441547 441369 442044 443568 445385 447069 448927 451680 455445 459405 462794 465926 469809 474900
51397 474900 480774 486917 493254 499783 506362 513110 520506 528717 537333 546233 556365 569227 585755
51384 585755 606150 630604 659825 694938 737167 787444 845993 912161 984747 1062371 1143613
51373 1143613 1227040 1311019 1392899 1468167 1531016 1576403 1601607 1606030 1590335 1556258 1506517
51362 1506517 1443996 1371134 1290513 1205526 1119758 1035928 955999 881932 815444 757120 706544
51351 706544 663354 627534 598614 575186 555421 537756 521226 505642 491432 478825 467308
51340 467308 456338 446286 437935 431154 424908 418655 412963 408505 405155 402284 399351 395989 392108 388221
51326 388221 385076 382654 380061 376710 373121 370244 368523 367971 368598 370234 372331 374468 376756 379316 381619
51311 381619 382940 383339 383748 385005 387114 389395 391137 392077 392517 393106 394491 397102 401044 405863 410398
51296 410398 413247 413611 411688 408163 403534 397991 391729 385242 379308 374611 371211 368517 366044 364140
51282 364140 363621 364733 366812 369013 371064 373275 376097 379638 383369 386376 388296 389830 391948 394716
51268 394716 397412 399610 401485 403212 404951 407462 411688 417350 422856 427116 430609 434099 437140 438712
51254 438712 438636 437346 434686 430104 423967 417743 412643 408698 405226 401614 397543 393065 388731 385277 382989
51239 382989 381597 380733 380098 379237 377665 375402 373048 371230 370257 370321 371507 373405 375138 376119 376540 376835
51223 376835 376988 376757 376406 376661 377849 379494 381059 382756 385230 388546 391973 394856 397225 399243 400544
51208 400544 400746 400443 400943 402890 405661 408363 410902 413748 417107 420813 424748 428878 433025 437005 440873
51193 440873 444608 447659 449284 449382 448662 447903 447353 446880 446362 445715 444792 443569 442403 441884 442291 443125 443304
51176 443304 441984 439308 436292 433908 432316 430992 429382 427275 424725 421937 419282 417200 415971 415576
51162 415576 415827 416567 417714 419195 420893 422664 424300 425359 425142 423097 419467 415286 411517 408271 405114
51147 405114 401958 399287 397503 396356 395120 393126 390222 386971 384348 382887 382122 381252 380246 379858 380549
51132 380549 381952 383512 385113 386811 388484 390110 391982 394362 397181 400327 403840 407578 411118 414253
51118 414253 417186 419967 422229 423834 425255 426894 428519 429839 431135 432712 434200 435143 435903 437242 439267
51103 439267 441612 444438 448308 453061 457613 461061 463348 464779 465484 465428 464352 461683 457183 451729 446675
51088 446675 442302 437786 432941 428999 427045 426453 425696 424279 423106 423200 424753 427278 430030 432258 433630
51073 433630 434568 435927 438334 441985 446777 452217 457420 461721 465360 469183 473713 478894 484653 491209
51059 491209 498677 506799 515241 523785 532009 539070 544041 546369 546056 543899 541784 542178 546550 554164 562759
51044 562759 570493 577118 583544 590749 599114 608243 617085 624458 629805 633513 636561 639869 643793 647671
51030 647671 649752 648049 641714 631550 619091 605524 591620 578160 565817 554812 545191 537349
51018 537349 531842 528726 527561 527984 529845 532864 536677 541340 547269 554509 562471 570449 578056 585149
51004 585149 591856 598769 606541 615073 623510 631194 638040 643870 648156 650835 652695 654362 655492 655622
50990 655622 655343 655885 657921 661538 667059 674942 684866 695821 707276 719625 733312 748201 764118
50977 764118 781395 800253 819827 838256 853855 866088 875472 882667 887849 891036 892882 894665 897325
50964 897325 900867 905078 910492 918192 928858 942478 958900 978069 999693 1023165 1048011 1074100
50952 1074100 1101312 1129266 1157525 1185914 1214581 1243911 1274338 1306159 1339563 1374876 1412496
50941 1412496 1452528 1494901 1540098 1589000 1641068 1692805 1738996 1775856 1802790 1821311 1833106
50930 1833106 1839236 1840288 1836457 1827502 1812986 1792493 1765704 1732514 1693192 1648225 1598105 1543578
50918 1543578 1486056 1427275 1368542 1310724 1254946 1202567 1154228 1109496 1067898 1029905 996379
50907 996379 967309 941575 917977 896160 876488 859211 843928 829887 816733 804713 794103
50896 794103 784738 776391 769223 763341 758180 753006 747942 743794 740776 738135 735248 732371 729985 728043
50882 728043 726346 725135 724756 725021 725398 725688 726242 727670 730537 734977 740415 745968 751374 757178 763817
50867 763817 770990 778259 785752 793896 802897 812946 824490 837710 852051 866916 882566 899729
50855 899729 918569 938763 960602 985276 1013858 1046362 1081951 1119769 1159621 1202194 1248629
50844 1248629 1299496 1354172 1411491 1470938 1532783 1597147 1663453 1730847 1798589 1865756 1931051
50833 1931051 1993356 2052349 2108349 2161737 2212880 2262604 2312401 2363936 2418399 2476488 2539014
50822 2539014 2607208 2681965 2762795 2847886 2935331 3023738 3111217 3194156 3267699 3327366 3369801
50811 3369801 3392240 3392325 3368969 3322961 3256213 3170670 3068272 2951610 2824110 2689643 2552336
50800 2552336 2416546 2286188 2163694 2049875 1945114 1850421 1767028 1695236 1634255 1583206
50790 1583206 1541739 1509449 1485188 1467410 1454951 1447025 1442695 1440813 1440384 1440483 1439938 1437764 1434004 1429506
50776 1429506 1424632 1418723 1411011 1401417 1390106 1376955 1362035 1345987 1329173 1310825 1289864 1266309
50764 1266309 1241089 1214663 1186769 1157611 1128352 1100120 1073225 1047729 1024128 1002976 984256
50753 984256 967606 952937 940427 930165 922118 916255 912479 910632 910817 913462 918856 926882 937436
50740 937436 950737 966962 985906 1007347 1031337 1057620 1085135 1112845 1140978 1170758 1202781
50729 1202781 1236243 1269954 1303522 1337212 1371149 1405153 1439146 1473252 1507517 1541768 1575679
50718 1575679 1608718 1640080 1668921 1694691 1717160 1736255 1752110 1765304 1776917 1788303 1800832
50707 1800832 1815729 1834038 1856745 1884878 1919151 1959238 2003630 2050474 2098444 2146395 2192305
50696 2192305 2233020 2265166 2286007 2293505 2286234 2263781 2227138 2178503 2120895 2057978 1993602 1930775
50684 1930775 1871051 1815177 1764101 1718906 1679964 1646872 1619354 1597644 1581842 1571590 1566904
50673 1566904 1568841 1578580 1595915 1619316 1647523 1680334 1717389 1756719 1795262 1830759 1862595 1890797
50661 1890797 1915010 1934927 1951233 1965355 1978297 1990259 2001390 2012305 2023576 2035116 2046286
50650 2046286 2056387 2064915 2071817 2077859 2084432 2092621 2102665 2114643 2129331 2147881 2170770 2197590
50638 2197590 2227792 2261113 2297195 2335187 2373898 2412154 2448981 2483730 2516145 2546154 2573609
50627 2573609 2598299 2620167 2639610 2657885 2676890 2697037 2713998 2718349 2700597 2657966 2596326
50616 2596326 2525844 2455550 2391493 2337396 2294844 2263163 2240720 2226709 2221013 2222496 2228388 2235547
50604 2235547 2241573 2244349 2241189 2229155 2206281 2172386 2128763 2077153 2018873 1954875 1886575 1816231
50592 1816231 1746166 1677771 1611624 1548434 1489304 1435019 1385603 1340867 1301026 1266489 1237309
50581 1237309 1213166 1193743 1178735 1167553 1159400 1153830 1151137 1152053 1157109 1166288 1179188 1195329 1214274
50568 1214274 1235459 1257945 1280326 1300988 1318714 1333209 1345072 1355267 1364690 1374195 1384797 1397616
50556 1397616 1413642 1433592 1457821 1486246 1518552 1554670 1594794 1638618 1684740 1731245 1776774
50545 1776774 1820625 1861978 1899728 1933372 1963644 1992033 2020109 2049513 2082081 2119415 2162394
50534 2162394 2211353 2266580 2328272 2396194 2469794 2548817 2633757 2725726 2825859 2934513 3050710
50523 3050710 3172320 3296874 3422204 3546427 3667646 3783752 3892268 3990247 4074562 4142545
50513 4142545 4192241 4222090 4230809 4217867 4183866 4130205 4058484 3970381 3867959 3754049 3632595
50502 3632595 3508645 3387539 3273732 3170482 3080559 3006653 2950797 2913823 2895725 2896116 2913867
50491 2913867 2946568 2990709 3042080 3095683 3145680 3186028 3211077 3215546 3194898 3147014 3073631
50480 3073631 2979479 2869872 2749425 2622503 2493607 2366684 2244462 2128691 2020572 1920679
50470 1920679 1828935 1745100 1669102 1600664 1538856 1482394 1430435 1382895 1339979 1301509 1266853
50459 1266853 1235614 1208221 1185429 1167160 1152257 1139719 1129743 1123103 1119802 1118987 1120045 1123048 1127963
50446 1127963 1134069 1140487 1146973 1153913 1161780 1170784 1180800 1191410 1202130 1212741 1223268 1233652
50434 1233652 1243636 1253059 1262049 1270835 1279577 1288501 1297985 1308327 1319489 1331252 1343631 1357027 1371960
50421 1371960 1388719 1407375 1428152 1451584 1478161 1507980 1541073 1578059 1620059 1667838 1721360
50410 1721360 1780267 1844332 1913143 1985677 2060544 2136396 2211836 2285291 2355453 2421672 2483525
50399 2483525 2540123 2590066 2631813 2663687 2683723 2689932 2680732 2655147 2613090 2555925 2486389 2407576
50387 2407576 2322280 2233607 2145475 2061591 1984094 1913897 1852092 1800181 1759122 1729024 1709792
50376 1709792 1701199 1702153 1710693 1724883 1743043 1762897 1781210 1794676 1800721 1797361 1783030 1757111
50364 1757111 1720378 1674631 1622032 1564801 1505041 1444553 1384917 1327621 1273762 1223761 1177836
50353 1177836 1136570 1100402 1068679 1040012 1013659 989828 968630 949599 932514 917840 905933
50342 905933 896425 888699 882324 876794 871607 866989 863776 862049 860607 858321 855354 852420 849587 846604
50328 846604 843853 842026 841130 840683 840788 842275 845738 850939 857156 863684 870075 876323 882822 889929 897663
50313 897663 905910 914495 922789 929801 935282 940392 946655 954413 962807 971028 978916 986471 993455 999594
50299 999594 1004728 1008755 1011868 1014828 1018579 1023489 1029210 1035211 1041087 1046423 1050757 1053738 1055142 1054950
50285 1054950 1053852 1053494 1055789 1061990 1072788 1088887 1110397 1135280 1159177 1177659 1188727 1192996
50273 1192996 1191839 1185994 1175957 1163020 1149245 1136363 1125031 1115302 1107406 1101617 1097468 1093654 1089038
50260 1089038 1083548 1077890 1072643 1067939 1063839 1060570 1058256 1056587 1054891 1052610 1049696 1046592 1043810 1041638
50246 1041638 1040270 1039985 1040851 1042368 1043825 1045086 1046688 1049112 1052287 1055858 1059589 1063353 1067038 1070602
50232 1070602 1073929 1076598 1078148 1078648 1078557 1077894 1076016 1072401 1067181 1060737 1053293 1045209 1037087 1029172 1021020
50217 1021020 1012193 1002888 993558 984313 975070 965845 956534 946897 937270 928753 922088 916767 911906 907567
50203 907567 904452 902654 901625 901346 902684 906492 913017 922285 934485 949753 968000 989040 1012516
50190 1012516 1037727 1063928 1090671 1117381 1142736 1165193 1184375 1201460 1218014 1234783 1251775
50179 1251775 1268980 1286603 1304581 1322003 1336932 1346927 1349964 1344972 1331663 1310299 1281933 1248538
50167 1248538 1212385 1175323 1138905 1104848 1074718 1049209 1028195 1011468 999035 990857 986742 986392
50155 986392 988999 992747 995258 994698 990349 982345 971405 958628 944941 930612 915646 900501 885898
50142 885898 872059 858769 846086 834265 823029 811779 800814 791508 784889 780679 778177 777485 779202
50129 779202 783235 788519 793835 798468 802173 804875 806572 807391 807699 808062 808917 810314 812103 814262 816777
50114 816777 819364 821740 824171 827316 831487 836421 841819 847669 853953 860467 867083 873832 880615 887163
50100 887163 893324 899074 904261 908828 913302 918406 924039 929293 933776 938360 944267 951961 961368 972653
50086 972653 986208 1002137 1020323 1040794 1063666 1088964 1116890 1148024 1182804 1221056 1262436
50075 1262436 1307116 1355473 1407190 1461162 1516203 1571366 1625583 1677642 1726900 1773784 1819397
50064 1819397 1864704 1910103 1955377 1999686 2041506 2078648 2108432 2128045 2135013 2127646 2105382 2069089
50052 2069089 2021159 1964979 1903817 1839952 1774748 1709339 1645030 1583163 1524873 1471090 1422634
50041 1422634 1380239 1344493 1315757 1294012 1278722 1268926 1263499 1261365 1261504 1262981 1265130 1267728 1270828
50028 1270828 1274350 1277921 1281134 1283757 1285420 1285262 1282277 1276181 1267700 1257922 1247566 1236918 1226030
50015 1226030 1214632 1202010 1187275 1169804 1149462 1126780 1103157 1080516 1060293 1042713 1027107
50004 1027107 1012623 998621 985030 972881 964035 959726 959610 962762 969119 979087 991989 1005889 1018986
49991 1018986 1030268 1038852 1043902 1045736 1046022 1046054 1045292 1042116 1035559 1025782 1013402 999148 984039 969230
49977 969230 955649 943977 934719 927873 922735 918510 915056 912784 911947 912364 913742 915970 919215 923900
49963 923900 930494 939046 949132 960549 974032 991081 1013097 1040689 1073552 1110780 1151539 1195640
49951 1195640 1243248 1293809 1345502 1396049 1443869 1488151 1528114 1562792 1591761 1615821 1636724
49940 1636724 1656028 1673772 1687803 1694361 1689632 1671087 1637874 1590680 1531716 1464449 1392625 1319218
49928 1319218 1246350 1176021 1110381 1051130 998934 953617 914783 882065 854901 832400 813687
49917 813687 798395 786687 778640 773636 770462 768038 765940 764293 763386 763498 764961 768188 773641 781732
49903 781732 792693 806418 822461 840227 859262 879452 900852 923019 944298 962116 974435
49892 974435 981093 983554 983403 981139 976164 967492 954439 937041 916077 892701 868073 843336 819598
49879 819598 797500 776812 756751 736730 716808 697703 680610 666618 655773 646963 639190 632745
49867 632745 628567 626735 626299 626525 627504 629531 632791 637853 645648 656489 669660 684300 700190 717452
49853 717452 736112 756297 778145 800991 823007 842144 857251 868144 875174 879092 880835 880908 879071
49840 879071 874717 867223 855967 840711 822285 802375 782399 763170 745713 731381 720576 712165
49828 712165 704890 698837 694924 693598 694699 697985 703012 709001 715706 724000 734839 748063 763026
49815 763026 779883 799143 820124 840927 859956 876601 890572 901629 910183 917221 923160 927334
49803 927334 928868 927579 923702 917180 907629 894898 879685 863653 848628 835216 822337 808598
49791 808598 793988 779793 767067 755832 745708 736651 728898 722650 717926 714380 711341 708433 706023
49778 706023 704562 703647 702346 700460 698849 698453 699608 702482 707560 715342 725824 738423 752220 766253
49764 766253 779791 792262 802710 809781 812809 812777 811589 810478 809563 808551 806850 802952 794801 781350
49750 781350 763379 742688 721053 700046 680969 664445 650446 638948 630053 623337 617824 613006
49738 613006 609333 607255 606373 606092 606516 608050 610469 613138 615979 619514 623921 628675 633293 638015 643507
49723 643507 650164 657946 666795 676996 689084 703425 719857 737670 755821 773185 788767 801816
49711 801816 811689 817661 819196 816608 811115 803784 794559 782715 768254 752416 736771 722237 709068
49698 709068 697393 687392 679082 672156 666172 660909 656482 653016 650263 647954 646585 647312 650717 656072
49684 656072 662318 669322 677557 686880 696449 705799 715349 725849 737931 752161 768805 787488 807613
49671 807613 828967 851082 871952 888374 898125 901369 899787 895113 888843 882495 877253 873428 870660
49658 870660 868431 866122 862809 857198 847722 832884 812251 787368 761227 736548 714762 696374
49646 696374 681369 669050 658367 649006 641551 636186 632022 628323 625698 625188 626567 628397 629495 629605
49632 629605 628847 627337 625392 623339 620960 617640 613242 608427 603954 599955 595991 591581 586646 581674
49618 581674 577501 574770 573523 573277 573338 573026 572031 570791 570216 570740 571883 573108 574716 577337 580745 583905
49602 583905 586194 587924 589484 590613 590996 591134 591916 593342 594268 593642 591698 589594 588122 587222 586667 586622
49586 586622 587211 588032 588618 589117 590004 591235 592306 593184 594583 597119 600656 604731 609271 614552 620702 627514
49570 627514 634668 642055 650027 659337 670561 683520 697504 711996 726802 741519 755323 767314
49558 767314 776684 782564 784428 782880 779452 775278 770342 764312 757585 751148 745863 742236 740487 740390 741319
49543 741319 742784 744641 746567 747832 747988 747397 746671 745942 745082 744217 743566 743131 743101 744266 747524 753140 760882
49526 760882 770564 781993 794725 808481 823628 840727 859743 880077 900972 921208 938759 951731
49514 951731 959882 964711 968119 971532 976174 983195 992911 1004334 1015811 1025947 1033759 1038274 1038323 1032763
49500 1032763 1021001 1003584 982325 959619 937439 916926 898622 882714 869065 857355 847276
49489 847276 838510 830699 823736 817942 813589 810348 807542 804927 802755 801105 799615 798000 796392 794972
49475 794972 793626 792243 791060 790406 790281 790526 791288 792964 795636 798917 802557 806902 812418 818866 825333
49460 825333 831090 835949 839725 841985 842748 842879 843031 842552 840181 835685 829898 823316 815698 807228 798941
49445 798941 791469 784334 777066 770183 764327 759220 754376 750228 747617 746574 746445 746782 747344 747742 748173
49430 748173 750122 755194 763309 773069 783790 796141 810752 827250 844724 862259 879101 895538
49418 895538 913476 934285 955194 969372 971189 961170 945035 928655 914896 904480 897860 895542
49406 895542 897538 903322 912205 923490 936539 950935 966501 983137 1000790 1019545 1039474 1060207
49394 1060207 1080746 1099812 1116388 1130022 1140781 1148991 1154916 1158490 1159345 1157163 1152091 1144742 1135634
49381 1135634 1124711 1111653 1096739 1081134 1066263 1053102 1042192 1033938 1028449 1025283 1023741 1023454
49369 1023454 1024505 1027135 1031577 1037896 1045487 1052803 1058055 1060419 1060343 1058733 1056150 1052753 1048590 1043706
49355 1043706 1038108 1031758 1024606 1016712 1008433 1000316 992719 985740 979642 974948 971841 969807 968298 967396
49341 967396 967301 967511 967169 965993 964116 961111 956101 949015 941007 933327 926366 920081 914716 910607 907710
49326 907710 905752 904656 904425 904835 905566 906513 907845 909833 912677 916293 920218 923897 927114 929924 932280
49311 932280 934140 935850 937927 940352 942517 943955 944713 944987 944957 945130 946301 948820 952322 956344 960712
49296 960712 965139 969092 972614 976709 982209 988478 993852 997319 999342 1001122 1003467 1006347 1009115 1011037
49282 1011037 1011870 1012045 1012272 1013054 1014675 1017434 1021615 1027291 1034308 1042488 1051763 1062154 1073619 1085769
49268 1085769 1097816 1109152 1120034 1131283 1143124 1154752 1165326 1174967 1184283 1193257 1201321 1208562
49256 1208562 1216250 1226065 1239210 1256302 1277368 1301400 1326351 1350394 1373118 1394652 1413294 1424827
49244 1424827 1425185 1413845 1394064 1369807 1343214 1315264 1287876 1264076 1245842 1232286 1220183 1206285
49232 1206285 1189487 1171348 1154759 1141801 1132626 1126149 1121473 1118442 1117275 1118126 1120924 1125205 1130188
49219 1130188 1135349 1140760 1146511 1152027 1156505 1159925 1163082 1166654 1170751 1175375 1180730 1186938 1193951 1201822
49205 1201822 1210606 1219894 1228999 1237797 1246903 1256843 1267556 1278930 1291326 1305081 1319774 1334320
49193 1334320 1347728 1359691 1370625 1381176 1391500 1401016 1409098 1415867 1421924 1427422 1431947 1435277 1437639
49180 1437639 1439199 1440048 1440955 1443577 1449613 1460120 1475715 1496699 1522748 1553294 1588741 1630681 1679985
49167 1679985 1734567 1789022 1836095 1868766 1882539 1877458 1858261 1831912 1804411 1779421 1758809
49156 1758809 1743339 1732766 1726008 1721754 1718904 1716605 1714195 1711245 1707553 1703082 1697918 1692215 1686155
49143 1686155 1680096 1674774 1671176 1670101 1671778 1675744 1681011 1686669 1692691 1699940 1709137 1720167 1732738
49130 1732738 1747073 1763128 1779611 1794965 1809215 1823762 1839357 1855469 1871724 1888591 1906258
49119 1906258 1924208 1942584 1962736 1985590 2010595 2037187 2066218 2098865 2135186 2175017 2219423
49108 2219423 2269895 2326988 2391601 2467021 2556975 2659922 2765944 2861031 2936507 2996199 3054384
49097 3054384 3123519 3200178 3262635 3285164 3257546 3191875 3111420 3033582 2961649 2888714 2806842
49086 2806842 2714053 2615851 2521591 2438767 2369720 2312890 2266246 2228978 2200589 2179540 2163370
49075 2163370 2149908 2138125 2127827 2118701 2109768 2099873 2088655 2077003 2066561 2058699 2053646 2050439
49063 2050439 2047821 2045263 2042990 2041204 2039757 2038675 2038334 2038800 2039562 2040361 2041816 2044687 2048953 2054091 2059820
49048 2059820 2065978 2072126 2078006 2084038 2090613 2097246 2103293 2109264 2116471 2125417 2135435 2145973 2157407
49035 2157407 2170470 2185614 2203153 2223306 2245727 2269407 2293160 2315824 2336037 2352385 2363910
49024 2363910 2370112 2370681 2365941 2357532 2347882 2338751 2330731 2323994 2318753 2314913 2312180 2310832 2311739 2315320
49010 2315320 2321090 2328510 2337546 2347959 2358727 2368846 2378461 2388605 2399836 2411395 2421708 2429656
48998 2429656 2435425 2440125 2444482 2448120 2450330 2451183 2451380 2451278 2450744 2449924 2449384 2449410 2449723 2449975 2449987 2449479 2448153
48981 2448153 2446206 2444243 2442561 2440993 2439422 2437895 2436211 2434070 2431691 2429632 2427921 2425972 2423419 2420296
48967 2420296 2416412 2411509 2406281 2402328 2400691 2401073 2402792 2405700 2409816 2414968 2421350 2429696 2440248 2452128
48953 2452128 2464323 2476800 2490133 2504607 2520227 2537101 2555190 2574131 2593829 2614770 2637116
48942 2637116 2659986 2682316 2704197 2726808 2751325 2778440 2808514 2841438 2876432 2912704 2950387
48931 2950387 2990470 3033796 3080364 3129451 3180119 3231761 3284425 3338555 3394398 3451929 3511392
48920 3511392 3573311 3637746 3704000 3771259 3838764 3904972 3967411 4024321 4076128 4124610 4170922
48909 4170922 4215061 4256872 4296525 4334002 4368876 4400969 4430736 4458866 4485741 4511305 4535191
48898 4535191 4556996 4576636 4594287 4609811 4622546 4632052 4638835 4643917 4647846 4650508 4651692 4651325 4649240
48885 4649240 4645172 4639074 4631089 4621230 4609325 4595201 4578591 4558842 4535033 4506502 4473265 4435973
48873 4435973 4395515 4352418 4306466 4257012 4203825 4147533 4089282 4030191 3971085 3912328 3853855
48862 3853855 3795748 3738893 3684560 3633236 3584363 3537409 3492533 3449926 3409251 3370298 3333644
48851 3333644 3300016 3269393 3241278 3215459 3191933 3170519 3151191 3134507 3121085 3110860 3103453
48840 3103453 3098895 3097331 3098243 3100717 3104403 3109613 3116543 3125061 3135233 3147516 3162331 3179809 3199830
48827 3199830 3221888 3245086 3268787 3293224 3318951 3345754 3372593 3398699 3424323 3450437 3477945
48816 3477945 3507020 3536778 3565637 3592359 3616775 3639536 3661520 3683672 3706818 3731053 3755658
48805 3755658 3780125 3804941 3830894 3858090 3886259 3915637 3946765 3979697 4014106 4049811 4086330
48794 4086330 4122219 4155748 4186224 4213895 4238808 4260659 4279566 4295958 4309683 4320239 4327926
48783 4327926 4333690 4337601 4338398 4334799 4326360 4312840 4293828 4269516 4241017 4209365 4174912 4138065
48771 4138065 4099761 4060525 4019791 3976814 3931744 3885240 3837640 3789129 3740200 3691233 3642067
48760 3642067 3592724 3544231 3497936 3454230 3412545 3372470 3334226 3298211 3264790 3234470 3207600
48749 3207600 3183715 3161673 3140624 3120488 3101415 3083244 3065771 3049300 3034713 3023106 3015452
48738 3015452 3012327 3013560 3018093 3024369 3031065 3037493 3043346 3048185 3051365 3052454 3051447 3048536 3043913 3038051
48724 3038051 3032005 3027088 3024165 3023340 3024199 3026203 3028926 3032144 3035703 3039359 3043003 3047060 3052198 3058369
48710 3058369 3064632 3070343 3076052 3082596 3089784 3096816 3103806 3111925 3121932 3133363 3145371 3157629 3170165
48697 3170165 3183011 3196454 3211111 3227351 3244934 3263355 3282105 3300356 3316911 3330803 3341614
48686 3341614 3349135 3353233 3354342 3353588 3352115 3350610 3349630 3349807 3351316 3353458 3355053 3354838 3351370 3343289 3330266
48671 3330266 3313334 3293826 3272273 3248654 3223177 3196190 3167782 3138206 3108512 3080002 3053066
48660 3053066 3027032 3001139 2975103 2948739 2921604 2893254 2863530 2832383 2799735 2765851 2731777
48649 2731777 2699203 2669697 2643982 2621879 2602858 2586432 2571890 2557970 2543317 2527285 2509915
48638 2509915 2491181 2470770 2448742 2425814 2402745 2379961 2358058 2337910 2319533 2301208 2280591
48627 2280591 2256698 2230277 2202353 2173182 2142842 2112170 2082644 2055517 2031355 2010257 1992205
48616 1992205 1977215 1965350 1956710 1951436 1949670 1951403 1956265 1963478 1972077 1981150 1989786 1996900 2001326
48603 2001326 2002316 2000051 1995717 1991030 1987594 1986556 1988491 1993216 1999632 2006100 2011283 2014515 2015233 2012420
48589 2012420 2005068 1993124 1977654 1960107 1941707 1923439 1906157 1890488 1876683 1864543 1853484
48578 1853484 1843020 1833403 1825443 1819400 1814570 1810486 1808069 1808763 1812795 1819154 1827163 1837055 1848960 1862336
48564 1862336 1876688 1891931 1907519 1921909 1933319 1940472 1942368 1938169 1927993 1913290 1895917 1877272
48552 1877272 1858672 1841782 1827816 1816623 1807134 1798388 1789442 1778694 1764205 1745078 1722203 1697573
48540 1697573 1672916 1648889 1625423 1602829 1582308 1564929 1550248 1536679 1523421 1511350 1501764
48529 1501764 1495043 1490971 1489675 1491506 1496439 1504143 1514365 1526918 1541758 1559405 1580418 1603550
48517 1603550 1624727 1638731 1642150 1634861 1619560 1600510 1582071 1567185 1556916 1551528 1551504 1557121 1567699
48504 1567699 1582100 1599651 1619928 1641977 1664485 1686427 1706980 1725306 1741332 1756329 1771488
48493 1771488 1785658 1795267 1796773 1788939 1773097 1752092 1728940 1705528 1681992 1657511 1631751 1605412
48481 1605412 1579716 1555917 1535110 1517757 1503278 1490543 1478829 1468059 1458336 1449718 1442301 1436037
48469 1436037 1430548 1425581 1421458 1418700 1417453 1417794 1420262 1425450 1433208 1442900 1454324 1467791 1483325
48456 1483325 1500235 1517299 1532897 1545312 1553600 1558127 1559759 1558787 1555257 1549996 1544461 1539629 1535674
48443 1535674 1532572 1530214 1527958 1524778 1519921 1512957 1503472 1491527 1478320 1465599 1454334 1444505 1435997
48430 1435997 1428955 1423354 1418964 1415658 1413054 1410035 1405533 1399786 1394060 1389151 1384915 1381078 1377483 1373515
48416 1373515 1368334 1361915 1354991 1347839 1339979 1331294 1322511 1314271 1306504 1299013 1291919 1285217 1278585 1271910
48402 1271910 1265430 1259167 1252882 1246693 1240959 1235360 1228917 1221188 1212730 1204102 1195110 1185366 1174923 1164066
48388 1164066 1153042 1142191 1131780 1121571 1111207 1101119 1092292 1085019 1078616 1072538 1067003 1062300
48376 1062300 1058343 1055180 1053201 1052500 1052675 1053467 1054924 1056784 1058452 1059785 1061212 1062905 1064621 1066417 1068652
48361 1068652 1071071 1072828 1073671 1074248 1074986 1075489 1075276 1074221 1072079 1068523 1063932 1059222 1054671 1049786 1044484
48346 1044484 1039348 1034482 1029275 1023652 1018395 1013848 1009412 1004733 1000179 995759 990764 985076 979538 974470
48332 974470 969086 963141 957815 954111 951529 949241 947458 946649 946470 946522 947181 948657 950072 950604 950844 952007
48316 952007 954283 956758 958331 958100 955617 951533 947304 943595 939699 935046 930375 926703 924066 921987
48302 921987 920351 919147 918141 917420 917429 918066 918718 919555 921505 924499 927151 928824 930604 933569 937567 942456
48286 942456 948885 956846 964991 972486 980190 989091 999060 1009984 1022501 1036643 1051531 1067428 1086080
48273 1086080 1107638 1129053 1146907 1160254 1169666 1175708 1179866 1184829 1192120 1201131 1211656 1225165
48261 1225165 1242278 1261576 1282431 1306221 1333061 1360479 1387357 1415937 1447633 1480329 1512556
48250 1512556 1546859 1586078 1629856 1677963 1733304 1798297 1872292 1956198 2055191 2173102 2309474
48239 2309474 2467031 2656674 2890386 3176584 3529857 3978877 4556840 5289084 6192661
48230 6192661 7272971 8513620 9895755 11448858 13240248 15233253 17131597 18431190
48222 18431190 18710237 17903495 16304352 14332321 12315652 10438402 8788300 7395079
48214 7395079 6245111 5304243 4541168 3928651 3435607 3032588 2701515 2431568 2210027
48205 2210027 2024380 1868651 1740061 1632464 1538903 1457223 1387504 1326737 1271073 1220509
48195 1220509 1176480 1137169 1099646 1064389 1033462 1006178 980532 956986 936993 919468 902378
48184 902378 886313 872959 861451 849719 838299 829490 823626 819256 816177 815329 816331 817915 820291
48171 820291 824496 829642 833070 832978 829063 821234 809774 796399 783258 771110 759822 749947 742179
48158 742179 736003 730521 726041 723236 721404 719189 716488 714205 712652 711585 711194 711726 712725 713860 715670
48143 715670 718265 720304 720742 720561 721108 721689 720684 718386 716748 716729 717692 719128 721230 723816 726280 728645
48127 728645 731432 734591 737625 740512 743394 745751 747050 747814 748987 750658 752448 754470 756684 758078
48113 758078 757960 757419 757995 759428 760425 761171 763234 767088 771507 775452 778975 782159 784785 787341 790968
48098 790968 795967 801468 806745 811835 816770 821370 825919 830920 836031 840300 843588 846745 850301 854087
48084 854087 858243 863336 869123 874309 878062 881000 884284 888400 893162 898213 903173 907727 911858 915779
48070 915779 919743 924195 929706 936281 943191 950187 958352 968866 981333 994251 1006614 1017989 1027471
48057 1027471 1033958 1037400 1038624 1038048 1035702 1032267 1028614 1024275 1017765 1008718 998451 988173 977884
48044 977884 967431 957406 948398 940234 932439 924622 916126 906222 895121 884058 874060 865286 857657
48031 857657 851150 845199 838788 831539 823973 816474 808890 801326 794286 787655 780591 772916 765642 759517
48017 759517 753900 747736 740935 734177 727970 722469 717633 713093 708404 703865 700445 698473 697042 695166
48003 695166 692846 690539 688325 686226 684742 684305 684535 684562 683835 682329 680403 678778 678064 677998 677735 677254 677712
47986 677712 679805 682506 684172 684384 683950 683518 683085 682658 682523 682768 683067 683021 682394 681088 679242 677280 675540
47969 675540 673938 672176 670129 667827 665284 662600 660058 657836 655715 653232 650073 646261 642203 638555
47955 638555 635720 633351 630650 627320 623981 621558 620505 620601 621133 621217 620337 618728 617011 615486 614148 613258
47939 613258 613312 614396 616066 617925 619787 621349 622381 623385 625337 628496 632085 635328 638132 640496 642029
47924 642029 642560 642559 642447 642009 640984 639689 638487 637050 634759 631628 628319 625460 623289 621681 620166 618150
47908 618150 615488 612610 609888 607230 604547 602208 600609 599639 598960 598528 598469 598665 598841 598904 598995 599366 600371
47891 600371 602259 604801 607372 609596 611629 613717 615908 618317 621201 624524 627866 631005 634206 637701
47877 637701 641334 644890 648339 651530 654115 656044 657678 659202 660427 661362 662439 663857 665224 666090 666279
47862 666279 665475 663237 659832 656422 653878 651969 650118 648395 647239 646759 646842 647422 648141 648304 647712 647024
47846 647024 646750 646538 646057 645895 646727 648105 648996 649185 649288 649705 650465 651906 654563 658270 662019 664794 666131
47829 666131 666155 665701 666187 668581 672363 676001 678557 680470 682911 686757 692109 698497 705654 714234 725364
47814 725364 739280 755054 772150 791603 814874 842084 872199 904492 938766 974388 1010284
47803 1010284 1046027 1081902 1117502 1150868 1179384 1201232 1215997 1224317 1227000 1224091 1214732 1198247
47791 1198247 1175211 1147194 1115778 1082332 1048399 1015518 984659 956268 930739 908325 888842
47780 888842 872099 858429 848137 840581 834582 829670 826214 824374 823715 823908 824999 826773 828539 829870
47766 829870 831011 832276 833427 833871 833195 831415 829004 826614 824427 821879 818381 814168 809987 806098 802145
47751 802145 797893 793469 788981 784456 780082 775909 771347 765654 758966 752289 746541 742112 739107 737206
47737 737206 735337 732496 729050 726485 725646 726009 726804 727913 729270 730248 730252 729395 728118 726618 724996 723432
47721 723432 721786 719507 716374 712886 709546 706170 702355 698213 694153 690230 686179 681935 677678 673474
47707 673474 669213 664832 660345 655689 650769 645711 640991 637276 634911 633473 632016 630032 627979 626598
47693 626598 625983 625751 625820 626344 627057 627495 627914 629283 632129 636051 640489 645329 650534 655891 661507 667925
47677 667925 675309 682981 690196 697012 704065 711800 720248 729134 737863 745716 752456 758505 764319 769797
47663 769797 774513 778208 780853 782506 783284 783287 782434 780716 778640 776962 775870 774799 773243 771352 769628
47648 769628 768512 768407 769625 772118 775688 780555 787133 795061 803149 810663 818156 826724 837013 849298
47634 849298 863879 880801 899695 920473 943864 970710 1001101 1034775 1072059 1113737 1160063
47623 1160063 1210348 1263425 1318121 1373336 1428022 1481034 1530837 1575558 1613598 1643959 1665774
47612 1665774 1677833 1678935 1668535 1646819 1614457 1572578 1522652 1466018 1403770 1337379 1269107
47601 1269107 1201357 1135846 1073680 1015750 962508 913712 869045 828864 793731 763353 736643
47590 736643 712838 691980 674196 659076 645981 634500 624339 615154 606838 599740 594176 589838
47578 589838 585938 581992 578146 574727 571741 569029 566696 565068 564303 564401 565544 567917 571037 573865 575962
47563 575962 578057 580982 584503 587923 591390 595624 600437 604536 607065 608513 609832 611351 612924 614473
47549 614473 615891 616907 617412 617600 617551 617140 616464 615793 614936 613419 611564 610557 610906 611618 611564 610949 610631 610552
47531 610552 609868 608424 607228 607423 609295 612247 615301 617788 619975 622823 626784 631135 634986 638517 642555
47516 642555 647181 651533 654969 657709 660190 662294 663423 663040 661048 657846 653957 649436 643776 636645
47502 636645 628526 620385 612874 606131 600067 594470 589038 583701 578804 574706 571408 568836 567156 566365
47488 566365 565866 564976 563725 562727 562408 562757 563666 565087 566951 569292 572346 576113 580011 583376 586217 589148
47472 589148 592681 596931 601853 607377 613302 619286 624796 629000 631181 631646 631851 633080 635202 637162 638405
47457 638405 639247 640012 640470 640261 639499 638867 639258 641235 644697 649305 655268 663319 673707 685775 698901
47442 698901 713338 729725 748290 769072 792335 817992 845090 872665 900885 930647 962288
47431 962288 995232 1028434 1060398 1089196 1113504 1133469 1149751 1161957 1168937 1170423 1167285 1160238
47419 1160238 1149418 1135362 1119317 1102202 1084176 1065571 1047395 1030358 1014040 997529 980528
47408 980528 963519 947205 931946 917423 902735 887211 871104 855157 839701 824781 810928
47397 810928 798957 788932 780086 771809 763992 756449 748959 742033 736708 733315 731268 730188 730238 731073
47383 731073 731686 731976 733438 737434 743511 750263 757166 764598 772596 780656 788549 796318 803418 808715 811613
47368 811613 812742 813303 813921 814093 812592 808465 801804 793469 784077 773575 761914 749598 737289 725241
47354 725241 713482 702196 691508 681155 670802 660467 650322 640341 630549 621409 613476 606703
47342 606703 600426 594076 587680 581752 576835 573077 570116 567490 565214 563745 563293 563467 563744 564006 564445
47327 564445 565264 566676 568849 571543 574064 575903 577243 578646 580437 582648 585267 588176 590975 593201
47313 593201 594705 595584 595810 595203 593685 591369 588339 584471 579602 573915 568095 562904 558511 554496 550644
47298 550644 547389 545069 543105 540548 537365 534464 532452 531027 529736 528684 528178 528237 528777 529854 531452
47283 531452 533425 535835 538939 542682 546684 550870 555553 560757 566147 571820 578389 585869 593269 599836
47269 599836 605917 611940 617333 621370 624514 627840 631486 634670 637037 638907 640207 640245 638815 636698 634693
47254 634693 632818 630745 628433 625948 623206 620366 618089 616902 616476 615994 615186 614665 615221 617072 619918
47239 619918 623445 627460 631614 635480 639215 643776 649868 656775 662924 667863 673067 680326 689777 700040
47225 700040 709912 719316 728741 738466 748448 758538 768659 779005 789999 801694 813245 823380
47213 823380 831478 837866 843038 846997 849531 850771 851131 850765 849349 846463 842104 836777 831107 825474 820118
47198 820118 815479 812199 810716 811056 812967 815878 818516 818954 815652 808549 798992 788629 778566 769457
47184 769457 761935 756549 753367 751957 752032 753937 758192 764589 772232 780725 790832 803404 818043 833520
47170 833520 849352 866029 883598 900918 916747 930868 943709 955441 965899 974782 981377 984609
47158 984609 984022 980369 974681 967135 957449 945960 933496 920368 906310 891399 876339 861765 847864
47145 847864 834783 822839 812070 802028 792283 782996 774847 768565 764439 762114 760898 760395 760702 761883
47131 761883 763635 765721 768355 771714 775427 779085 782972 787602 792684 797225 800603 802855 803914 803331
47117 803331 800940 797168 792410 786699 780280 773956 768351 763193 757810 752139 746902 742800 739817 737269
47103 737269 734326 730558 726053 721070 715646 709701 703363 696876 690139 682704 674407 665811 657840 651059
47089 651059 645386 640371 635637 631194 627332 624225 621691 619472 617581 616149 615048 613969 612895 612132
47075 612132 611868 611976 612355 613061 613901 614222 613459 611825 610137 608944 607929 606275 603512 599976 596434 593331
47059 593331 590513 587686 584965 582794 581382 580422 579411 578215 577284 577343 578790 581341 584258 586952 589322
47044 589322 591612 594096 596984 600397 604337 608746 613602 618805 624004 628774 633019 636944 640568 643574
47030 643574 645829 647744 649935 652723 656072 659722 663201 666008 667994 669371 670294 670840 671473 672899 675104
47015 675104 677076 677976 678140 678366 678693 678613 678208 678246 679193 680769 682483 684022 685066 685313 684780 683693 682121
46998 682121 680247 678970 679468 681876 684847 686769 687200 686942 687032 687871 689133 690331 691453 692990 695278 698006
46982 698006 700591 702788 704711 706568 708859 712496 717988 724584 730889 736353 741589 747202 753081 758972
46968 758972 764961 771007 776641 781615 786315 790969 794929 797395 798601 799531 800501 800748 799683 797953 796815
46953 796815 796727 797061 797110 796839 796404 795442 793418 790560 787904 786316 785934 786596 788229 790511 792747 794565 796337
46936 796337 798411 800364 801683 802827 804858 808077 811787 815414 819088 822935 826459 829006 830503 831489
46922 831489 832655 834411 836567 838328 838850 837923 835930 833255 830037 826361 822246 817510 812103 806583 801811
46907 801811 798167 795452 793452 792030 790799 789396 788232 788275 789855 792276 794891 798017 802467 808629 816380
46892 816380 825483 835660 846574 858045 870105 882630 895215 907545 919565 931082 941618 950917
46880 950917 959259 966905 973536 978611 982158 984881 987511 990235 992707 994516 995678 996646 997815 999210
46866 999210 1000906 1003485 1007567 1012925 1018610 1024048 1029483 1035233 1041092 1046735 1052278 1058108 1064459 1071405
46852 1071405 1078962 1086909 1094766 1102165 1109075 1115563 1121598 1127145 1132171 1136452 1139707 1141960 1143403 1143899
46838 1143899 1143170 1141575 1140136 1139472 1139243 1138921 1138580 1138499 1138424 1137886 1137042 1136682 1137386 1139055 1141314 1144144 1148007
46821 1148007 1153405 1160361 1168436 1177259 1186797 1196910 1207062 1216960 1227173 1238427 1250362 1261734
46809 1261734 1271884 1281219 1290137 1298376 1305765 1312780 1319792 1326403 1332120 1337127 1341822 1346037 1349333 1351693
46795 1351693 1353343 1354228 1354238 1353754 1353493 1353984 1355519 1358317 1362231 1366617 1370989 1375576 1380779 1386296 1391377
46780 1391377 1395857 1400437 1405886 1412260 1418879 1424852 1429741 1433971 1438546 1444192 1450871 1458172 1465822 1473635
46766 1473635 1481409 1489224 1497628 1507203 1518095 1530098 1542904 1556155 1569717 1584113 1600202 1618056
46754 1618056 1636663 1655104 1673528 1692490 1711873 1731150 1750326 1769799 1789367 1808030 1824856
46743 1824856 1839614 1852551 1863965 1874013 1882590 1889322 1893771 1895668 1894971 1892087 1888125 1884441 1881590
46730 1881590 1879090 1876526 1874392 1873348 1873120 1872790 1872041 1871583 1872411 1874994 1879007 1883539 1887766 1891699 1895998
46715 1895998 1900816 1905276 1908404 1910034 1910306 1908853 1905210 1899643 1892788 1884681 1874808 1862935 1849163 1833325
46701 1833325 1815080 1794643 1772786 1750054 1726470 1702005 1676842 1651158 1625055 1598712 1572323
46690 1572323 1546087 1520589 1496924 1475864 1457069 1439535 1422560 1405814 1388881 1371610 1354799
46679 1354799 1339729 1326872 1315516 1304639 1293623 1282230 1270531 1258960 1247940 1237426 1227101
46668 1227101 1216957 1207251 1198080 1189405 1181266 1173513 1165675 1157655 1150162 1143737 1137778 1131437 1125192 1120367
46654 1120367 1117132 1114093 1110026 1105068 1099935 1094921 1090008 1085170 1080139 1074553 1068685 1063419 1059178 1055490
46640 1055490 1051808 1048128 1044547 1041024 1038025 1036778 1038325 1042721 1049400 1057783 1067202 1076897 1086611 1096783
46626 1096783 1107768 1119206 1130467 1141259 1151464 1160867 1169398 1177233 1184379 1190601 1195976 1200978 1205623
46613 1205623 1209126 1210843 1210994 1209909 1207146 1202153 1195509 1188738 1182858 1177633 1172303 1166587 1160909 1155959
46599 1155959 1152188 1149613 1148019 1147232 1147022 1146926 1146582 1146192 1146243 1146749 1147276 1147777 1148660 1149801 1150232 1149301 1147593
46582 1147593 1146097 1144933 1143496 1141539 1139424 1137509 1135898 1134753 1134305 1134504 1135017 1135604 1136266 1137119 1138356
46567 1138356 1140187 1142600 1145337 1148393 1152277 1157438 1163568 1169801 1175472 1180392 1184576 1188108 1191304 1194701
46553 1194701 1198827 1204057 1210515 1217911 1225633 1233226 1240654 1247987 1255173 1262404 1270426 1279966 1290867 1302191
46539 1302191 1313256 1324397 1336619 1350600 1365945 1381382 1395872 1409670 1424098 1440180 1457791
46528 1457791 1476354 1495981 1517420 1541039 1566345 1592574 1619458 1647319 1676609 1707386 1739135
46517 1739135 1771055 1802566 1833413 1863300 1891688 1918039 1942019 1963308 1981516 1996470 2008292
46506 2008292 2017038 2022662 2025661 2027275 2028415 2028618 2026722 2022481 2016939 2011243 2005741 2000375 1995284 1990617
46492 1990617 1986251 1982065 1978211 1974722 1971039 1966279 1959831 1951403 1940709 1927579 1912362 1895750 1878089
46479 1878089 1859082 1838285 1815620 1791287 1765547 1738810 1711575 1683918 1655303 1625416 1595130
46468 1595130 1566105 1539406 1514985 1492539 1472249 1454408 1438938 1425788 1415379 1408141 1403928 1402397
46456 1402397 1403719 1408272 1415814 1425521 1436731 1449123 1462330 1476047 1490464 1505951 1522267 1538681
46444 1538681 1554759 1570203 1583912 1594290 1600960 1605335 1608874 1611378 1611644 1609232 1604733 1598608 1590588
46431 1590588 1580300 1567935 1554225 1540077 1526236 1513021 1500384 1488284 1476868 1466176 1456022
46420 1456022 1446345 1437453 1429657 1422992 1417455 1413187 1410196 1408338 1407858 1409400 1412982 1417485 1421836 1426365
46406 1426365 1432206 1439686 1448159 1457395 1468144 1481007 1495528 1510811 1526465 1542461 1558490 1574013
46394 1574013 1588758 1602689 1615523 1626668 1635674 1642506 1647317 1650129 1650876 1649670 1646876 1642871 1637733
46381 1637733 1631299 1623647 1615396 1607322 1599671 1592010 1583898 1575542 1567735 1561296 1556735 1554333 1554184 1556049
46367 1556049 1559458 1564249 1570903 1580128 1592241 1607255 1625433 1647180 1672272 1699809 1729347 1761628
$$ [...]
##END NTUPLES=NMR SPECTRUM
##END=
