
##TITLE=UV1248_M9_1261-1207_90_7241173_lqGwhHHLvY
##JCAMPDX= 6.0         $$ Bruker NMR JCAMP-DX V2.0
##DATA TYPE= NMR SPECTRUM
##DATA CLASS= NTUPLES
##ORIGIN= BRUKER
##OWNER= Administrator
$$ 1.72 TOPSPIN		Version 2.1
$$ 2013-01-24 03:37:08.569 -0500  Administrator@X
$$ Compression mode = diff/dup
##.OBSERVE FREQUENCY= 400.02188249412
##.OBSERVE NUCLEUS= ^1H
##.ACQUISITION MODE= SIMULTANEOUS (DQD)
##.ACQUISITION SCHEME= undefined
##.AVERAGES= 8
##.DIGITISER RES= 22
##SPECTROMETER/DATA SYSTEM= spect
##.PULSE SEQUENCE= zg30
##.SOLVENT NAME= COFFEE_meoh
##.SHIFT REFERENCE= INTERNAL, COFFEE_meoh, 1, 14.98509
##AUDIT TRAIL= $$ (NUMBER, WHEN, WHO, WHERE, PROCESS, VERSION, WHAT)
$$ ##TITLE= Audit trail, TOPSPIN		Version 2.1
$$ ##JCAMPDX= 5.01
$$ ##ORIGIN= Bruker BioSpin GmbH
$$ ##OWNER= Administrator
$$ $$ E:\/data/COFFEE/nmr/UV1248_M9_1261-1207_90_7241173_lqGwhHHLvY/20/pdata/1/auditp.txt
$$ ##AUDIT TRAIL=  $$ (NUMBER, WHEN, WHO, WHERE, PROCESS, VERSION, WHAT)
(   1,<2013-01-24 03:36:59.230 -0500>,<Administrator>,<X>,<go>,<TOPSPIN 2.1>,
      <created by zg
	started at 2013-01-24 03:35:53.308 -0500,
	POWCHK enabled, PULCHK disabled,
       configuration hash MD5:
       86 BA 57 50 F2 9D 5C 9B 26 00 A9 28 5F 66 2E 89
       data hash MD5: 64K
       F9 5D 7A 28 71 02 A3 B6 D8 9A 16 ED D9 46 DD 32>)
(   2,<2013-01-24 03:37:03.189 -0500>,<Administrator>,<X>,<proc1d>,<TOPSPIN 2.1>,
      <Start of raw data processing
       efp LB = 0 FT_mod = 6 PKNL = 1 PHC0 = 0 PHC1 = 0 SI = 32K 
       data hash MD5: 32K
       05 F0 C1 39 51 DC 4B E1 F7 36 CB BF B0 92 E7 44>)
(   3,<2013-01-24 03:37:03.705 -0500>,<Administrator>,<X>,<proc1d>,<TOPSPIN 2.1>,
      <pk PHC0 = 99.54712 PHC1 = 0 
       data hash MD5: 32K
       78 FA F6 9E 60 6A D9 B9 51 25 AE 64 31 9E C4 76>)
(   4,<2013-01-24 03:37:03.945 -0500>,<Administrator>,<X>,<proc1d>,<TOPSPIN 2.1>,
      <abs ABSG = 1 
       data hash MD5: 32K
       1A D2 4C 20 6C 3A 2A 79 41 C6 A9 59 50 AD AA 20>)
(   5,<2013-01-24 03:37:04.100 -0500>,<Administrator>,<X>,<proc1d>,<TOPSPIN 2.1>,
      <abs ABSG = 2 
       data hash MD5: 32K
       04 1E 4B 00 F2 8C BF 0E A4 91 8E 77 D3 5E B6 FC>)
(   6,<2013-01-24 03:37:04.272 -0500>,<Administrator>,<X>,<proc1d>,<TOPSPIN 2.1>,
      <abs ABSG = 3 
       data hash MD5: 32K
       31 38 28 48 74 35 22 27 50 FB 6C 34 C3 5B E0 0A>)
(   7,<2013-01-24 03:37:04.427 -0500>,<Administrator>,<X>,<proc1d>,<TOPSPIN 2.1>,
      <abs ABSG = 4 
       data hash MD5: 32K
       0B 81 26 AD 99 6D 75 B7 6C A6 CF B9 1B 75 F2 9E>)
(   8,<2013-01-24 03:37:04.599 -0500>,<Administrator>,<X>,<proc1d>,<TOPSPIN 2.1>,
      <abs ABSG = 5 
       data hash MD5: 32K
       1D 63 10 21 C7 B5 ED 40 97 E0 C8 55 68 38 11 0F>)
$$ ##END=
$$ 
$$ $$ hash MD5
$$ $$ 10 B6 E4 FC B0 DD 13 E9 B3 AF B3 EC D8 83 77 2D
##$RELAX= 
##$RELAX= 
##$RELAX= 
##$RELAX= 
##$RELAX= 
##$RELAX= 
##$RELAX= 
$$ Bruker specific parameters
$$ --------------------------
##$DU= <E:\>
##$EXPNO= 20
$$ [...]
##$TP= (0..7)
150 150 150 150 150 150 150 150
##$TP07= 0
##$TPNAME0= <>
##$TPNAME1= <>
##$TPNAME2= <>
##$TPNAME3= <>
##$TPNAME4= <>
##$TPNAME5= <>
##$TPNAME6= <>
##$TPNAME7= <>
##$TPOAL= (0..7)
0.5 0.5 0.5 0.5 0.5 0.5 0.5 0.5
##$TPOFFS= (0..7)
0 0 0 0 0 0 0 0
##$TUNHIN= 0
##$TUNHOUT= 0
##$TUNXOUT= 0
##$USERA1= <user>
##$USERA2= <user>
##$USERA3= <user>
##$USERA4= <user>
##$USERA5= <user>
##$V9= 5
##$VALIST= <valist>
##$VCLIST= <CCCCCCCCCCCCCCC>
##$VD= 0
##$VDLIST= <DDDDDDDDDDDDDDD>
##$VPLIST= <PPPPPPPPPPPPPPP>
##$VTLIST= <TTTTTTTTTTTTTTT>
##$WBST= 1024
##$WBSW= 4
##$XGAIN= (0..3)
0 0 0 0
##$XL= 0
##$YL= 0
##$YMAX_a= 668518
##$YMIN_a= -569095
##$ZGOPTNS= <>
##$ZL1= 120
##$ZL2= 120
##$ZL3= 120
##$ZL4= 120
##$ABSF1= 14.98509
##$ABSF2= -5.573092
##$ABSG= 5
##$ABSL= 3
##$ALPHA= 0
##$AQORDER= 0
##$ASSFAC= 0
##$ASSFACI= 0
##$ASSFACX= 0
##$ASSWID= 0
##$AUNMP= <proc_prof1d_extract_pilot.lims>
##$AXLEFT= 0
##$AXNAME= <>
##$AXNUC= <1H>
##$AXRIGHT= 0
##$AXTYPE= 0
##$AXUNIT= <>
##$AZFE= 0.1
##$AZFW= 0.1
##$BCFW= 0
##$BC_mod= 0
##$BYTORDP= 0
##$COROFFS= 0
##$CY= 15
##$DATMOD= 1
##$DC= 0
##$DFILT= <>
##$DTYPP= 0
##$F1P= 0
##$F2P= 0
##$FCOR= 0.5
##$FTSIZE= 32768
##$FT_mod= 6
##$GAMMA= 0
##$GB= 0
##$INTBC= 1
##$INTSCL= 1
##$ISEN= 128
##$LB= 0
##$LEV0= 0
##$LPBIN= 0
##$MAXI= 10000
##$MC2= 0
##$MEAN= 0
##$ME_mod= 0
##$MI= 0
##$NCOEF= 0
##$NC_proc= -8
##$NLEV= 6
##$NOISF1= 0
##$NOISF2= 0
##$NSP= 0
##$NTH_PI= 0
##$NZP= 0
##$OFFSET= 14.98509
##$PC= 1
##$PHC0= 99.54712
##$PHC1= 0
##$PH_mod= 1
##$PKNL= yes
##$PPARMOD= 0
##$PPDIAG= 0
##$PPIPTYP= 0
##$PPMPNUM= 2147483647
##$PPRESOL= 1
##$PSCAL= 4
##$PSIGN= 0
##$PYNMP= <proc.py>
##$REVERSE= no
##$SF= 400.02
##$SI= 32768
##$SIGF1= 0
##$SIGF2= 0
##$SINO= 400
##$SIOLD= 32768
##$SPECTYP= <>
##$SREGLST= <1H.CDCl3>
##$SSB= 0
##$STSI= 32768
##$STSR= 0
##$SW_p= 8223.68421052631
##$SYMM= 0
##$S_DEV= 0
##$TDeff= 65536
##$TDoff= 0
##$TI= <>
##$TILT= no
##$TM1= 0
##$TM2= 0
##$TOPLEV= 0
##$USERP1= <user>
##$USERP2= <user>
##$USERP3= <user>
##$USERP4= <user>
##$USERP5= <user>
##$WDW= 1
##$XDIM= 32768
##$YMAX_p= 471192857
##$YMIN_p= -702711
##$CURPLOT= <Network HP LaserJet P1505>
##$CURPRIN= <$Network HP LaserJet P1505>
##$DFORMAT= <normdp>
##$LAYOUT= <+/1D_H.xwp>
##$LFORMAT= <normlp>
##$PFORMAT= <normpl>
##$SURQMSG= 1
$$ End of Bruker specific parameters
$$ ---------------------------------
##NTUPLES= NMR SPECTRUM
##VAR_NAME=  FREQUENCY,     SPECTRUM/REAL,   SPECTRUM/IMAG
##SYMBOL=    X,             R,               I
##VAR_TYPE=  INDEPENDENT,   DEPENDENT,       DEPENDENT
##VAR_FORM=  AFFN,          ASDF,            ASDF
##VAR_DIM=   32768,         32768,           32768
##UNITS=     HZ,            ARBITRARY UNITS, ARBITRARY UNITS
##FACTOR=    0.250966925370066, 1,           1
##FIRST=     8223.43324360094, 63529,        -95799
##LAST=      0,             282902,          -3546
##MIN=       0,             -702711,         0
##MAX=       8223.43324360094, 471192857,    0
$$ Real data points
##PAGE= N=1
##DATA TABLE= (X++(R..R)), XYDATA
$$ [...]
19520a87400d1167A61155F5810a20196l5282C8525j7676d193r0123B9388d5082
19508a10708A80881a93626B13202a34963A16042a89519j98260B0239a6939j80737
19498a97676F724a31019j61458a13024a6571l4432l11094B45474b02962F4532
19487a86073H4059L1388N4244a17024l11087a37888c593l10360F3309e9359B37306
19475b01506E0227e5082j52805g2132r7927O2380A2351a51560N8676j97839J27546
19464a63177D867J41398k6569D7815J02917f3903B5600O7659j7700a30697H9260
19452A89460o2904c30270E8597e0995I4727k1777a65775f2772D306L2229a02735
19440E613a62900B24475d3847a9790k56599R6488O8349Q9A55069m0236b97899
$$ y = [-187400, -41167, 161155, 65810, -120196, -155478, 38525, 20849, -4193, -94316, 29388, -45082, -110708, 180881, -193626, 213202, -134963, 116042, -189519, -387779, 20239, -16939, -197676, 6724, -131019, -292477, -113024, -16571, -51003, -362097, 245474, -202962, 64532, -186073, 84059, 115447, 169691, -117024, -428111, -137888, -3593, -313953, 63309, -59359, 237306, -201506, 50227, -55082, -207887, -72132, -170059, -107679, 12351, -151560, -92884, -290723, -163177, 4867, 146265, 119696, 47815, 150732, -63903, 25600, 93259, 75559, -130697, 89260, 189460, 126556, -330270, 58597, -50995, 94727, 72950, -165775, -62772, 4306, 36535, -102735, 5613, -162900, 224475, -43847, -19790, -276389, -179901, -111552, -111463, 155069, 114833, -297899]
19428C70488c71303c9098n9901k2652A53747e1608a7835l02543d5051p6890j94585
19417c16526A94614F406b33504j2235P3165g7027l23606B5142a15597m06481B2574
19405b09151e0767j71912C25597a21456D43377A57988B2813f0017l53285a09201
19394C23314G7145b84124g4936j99957P1971F0022c78063E5012b02380r5785J45293
19383a52872f3307k33374H068b79667E9925K73866c4276j66415P2938d3837A39248
19371A1652a52057d6419A74613g4306H0695K9355a53591c3931k72051H2028R6283
19360A78311a98728l7056d4319l23533i6880o1006m2080C5741a20949a3332j49044
19349a62376L8511D479b24013R2H2860d0878k00080j28071B34080c7811C9693
$$ y = [370488, -371303, -39098, -98999, -121651, 153747, -51608, -17835, -320378, -45051, -121941, -316526, 194614, 6406, -233504, -245739, -172574, -77027, -400633, 25142, -115597, -522078, 22574, -209151, -50767, -222679, 325597, -121456, 443377, 157988, 22813, -60017, -413302, -109201, 323314, 77145, -284124, -74936, -274893, -202922, 60022, -378063, 55012, -202380, -298165, -152872, -63307, -296681, 8068, -279667, 59925, 333791, -34276, -200691, -127753, -43837, 139248, 11652, -152057, -46419, 174613, -74306, 80695, 110050, -153591, -33931, -305982, 82028, 178311, -198728, -235784, -44319, -367852, -96880, -157886, -199966, 35741, -120949, -13332, -162376, -123865, 4479, -224013, -223921, 82860, -40878, -240958, -369029, 234080, -37811, 39693]
19337C07001A21386a20904K194j25213h9048A30101a53129k31625a1147A35258
19326b58538h9328d0014A42100b74897e3024A34382L0616A5992J34711a04263
19315g0423l54754I5342e2562A67002f5332m3379B9651N1200K73484f6587k67321
19304c33908A03982a15066p850A17558b85082B26912a95387P4088A10967b32245
19293b13935c3295l50132a62028C7636a03309B29365k2290j2432D2459a76249
19282a61204A00255a37654B3754b14819e198n7407n9717J7521N237o2137P4836
19271h6865E716a26998k30435a70813k45619A34309D6207b47901A15375d9054
19260c74762a13867d2217G9153b07898A11665a15184d9220B4838h7272b400p0761
$$ y = [307001, 121386, -120904, -118710, -243923, -89048, 130101, -153129, -384754, -11147, 135258, -258538, -89328, -40014, 142100, -274897, -53024, 134382, 164998, 15992, 150703, -104263, -70423, -425177, 95342, -52562, 167002, -65332, -108711, 29651, 80851, 354335, -66587, -333908, 103982, -115066, -122916, 117558, -285082, 226912, -195387, -121299, 110967, -232245, -213935, -33295, -383427, -162028, 37636, -103309, 229365, 207075, 194643, 42459, -176249, -161204, 100255, -137654, 23754, -214819, -5198, -62605, -122322, -104801, -99564, -161701, -86865, 5716, -126998, -357433, -170813, -416432, 134309, 46207, -247901, 115375, -49054, -374762, -113867, -42217, 79153, -207898, 111665, -115184, -49220, 24838, -87272, -2400, -73161]
19249g3161G1820a52373b8809j18904F0145d96452Q1593I9730C0872b08491O8546
19238a39945F9545a2541B19644H6633a16885b11j79967M3808q6190E3865A8244
19226d15138e3729j45693P5022g064q9944E6507a26105H6800c860F4544a71678
19214H2536J13214r980q7027K9493A1495b72314A53325C7229b75990O9666M5570
19203a60754B0883a55578F7218J08013a27663q661o9972R9555A04320R4067d6961
19191I9062a80133A16224k5896a91817b0974j34405C357b35455E10010b41647
19180F5069P619c01532I2499B5147b01305A3781a90352h8115p0049c5995j52375
19169a88370j68175C4856c09643G4209g1290L0366I672g2704I1575g3740G5896
$$ y = [-73161, 71820, -152373, -28809, -147713, 60145, -496452, -414859, 99730, 30872, -208491, -139945, 69545, -12541, 219644, 86633, -116885, -211, -180178, -136370, -222560, 53865, 18244, -415138, -53729, -199422, -124400, -7064, -97008, 56507, -126105, 86800, -3860, 64544, -171678, 82536, 195750, 185770, 98743, 128236, 11495, -272314, 153325, 37229, -275990, -206324, -160754, 20883, -155578, 67218, 175231, -127663, -136324, -206296, -106741, 104320, 198387, -46961, 99062, -180133, 116224, 90328, -191817, -20974, -155379, 3357, -235455, 510010, -241647, 65069, 72688, -301532, 92499, 25147, -201305, 13781, -190352, -88115, -158164, -35995, -188370, -356545, 34856, -309643, 74209, -71290, -40924, 9672, -72704, 91575, -73740, 75896]
19157c66777I6248a87152b0232l3662E2450c3348E3837P7511E996h6315q0723
19146a67038J7097K771G725d833p8651D1267K76312a87779A32445o0486b18971
19134d8698C25821a94035k24359b8189l3489b8168j56125m9216h8219R345j74517
19123b53391e9228p0016K1812A51937A411f1510q5318d3770k06340A88830F4308
19111A72923e2500j67606A43703f0842F624c0224j33723j69021e3413j87008K9797
19100b10624L3211f4404o2261A28822h0975K3168k50582A41744C133d47690A32220
19088F2001a40283D53119h1319q8763l4124Q7686J3421j65262e2748D2495J09779
19077A52274a10462J3669k35922i6137E9585a24693M0184K9598f931j99434Q8594
$$ y = [-366777, 96248, -187152, -20232, -53894, 52450, -33348, 53837, 131348, 5996, -86315, -167038, -149941, -147170, 7725, -4833, -83484, 41267, 317579, -187779, 132445, 71959, -218971, -48698, 325821, -194035, -418394, -28189, -61678, -28168, -184293, -233509, -88219, -78874, -253391, -59228, -129244, -107432, 151937, 1411, -61510, -146828, -43770, -250110, 188830, 64308, 172923, -52500, -220106, 143703, -60842, 6624, -30224, -163947, -332968, -53413, -240421, -210624, -177413, -64404, -126665, 128822, -80975, -57807, -308389, 141744, 3133, -447690, 132220, 62001, -140283, 453119, -81319, -170082, -204206, -116520, -103099, -268361, -52748, 42495, 152274, -110462, -96793, -332715, -96137, 59585, -124693, -84509, -54911, -6931, -206365, -117771]
19066a17771I2006j9369f4081r5310A8490b14282m3300a7046m01491B2346a18214
19054F9549a43770A06435h1610B90020a69746f3610j18746b5050F0400b60431
19043a97122A01569b99834R9292Q833L2338B17445b9718j6586F5901g35k18753
19032b19488a05809A51827n1247c54252J02517E7985J34541m9573a73252c8990
19021g3467B31074b51495a4732r5806r0641A03862a60460A75171d8890Q853q3460
19010a23497c9082B3301a24112f1928A42781C9956e5083p5640A61498A8008J60062
18999A78070b96894D4031c3789j60476H3732a25943A48491A831g9537A13401A6202
18987b71376A02105b0799A3216J37982h5209k87585a63801o2414A18569J99324
$$ y = [-117771, 92006, 72637, -64081, -159391, 18490, -214282, -257582, -17046, -418537, 22346, -118214, 69549, -143770, 106435, -81610, 290020, -169746, -63610, -182356, -25050, 60400, -260431, -197122, 101569, -299834, -200542, -191709, -159371, 217445, -29718, -46304, 65901, -735, -219488, -105809, 151827, 100580, -354252, -251735, 57985, 192526, 142953, -173252, -38990, -73467, 231074, -251495, -14732, -110538, -201179, 103862, -160460, 175171, -48890, -40037, -123497, -39082, 23301, -124112, -61928, 142781, 39956, -55083, -130723, 161498, 18008, 178070, -296894, 44031, -33789, -194265, 83732, -125943, 148491, 1831, -79537, 113401, 16202, -271376, 102105, -20799, 13216, 151198, -85209, -372794, -163801, -226215, 118569, 317893]
18977C17893F5106M5914B4019e2425a0051l82331A28433m1993L68618H3328K44757
18966C28085A7759R911b1984A9677a30788l41121b02602A19910P212c06602E6618
18954b53737B15632B4715J09544a22326M6488A03159B8600a10216K7372k05313
18944b88157C3784K48495j15735a87312r0427k08138B9948J09112i3165h813j02815
18933a11628M0293A61160J50607j30002b29031H9135h7269B3711e9492j37863
18923a97355h066M5r5974j77834K5355j34452f9167A0549b24179B48913a05092
18911A20694a84694e7382j72555A79005g7200l41181B68292C303M7845Q2313n9154
18900G4307C1174b95992i0366r2570e832m3569k5108a9579A81465a63780l0677
$$ y = [317893, 65106, 111020, 24019, -52425, -10051, -392382, 128433, 86440, 455058, 83328, 328085, 17759, 27670, -21984, 19677, -130788, -471909, -202602, 119910, 127122, -306602, 56618, -253737, 215632, 24715, 134259, -122326, -75838, 103159, 28600, -110216, -82844, -288157, 33784, 282279, 166544, -187312, -277739, -485877, 29948, 139060, -93165, -8813, -111628, -71335, 161160, 311767, 181765, -229031, 89135, -87269, 23711, -59492, -197355, -8066, -8021, -103995, -281829, -256474, -390926, -69167, 10549, -224179, 248913, -105092, 120694, -184694, -57382, -229937, 179005, -77200, -418381, 268292, 3303, 51148, 133461, 74307, 31174, -295992, -90366, -182936, -5832, -49401, -74509, -19579, 181465, -163780, -194457]
18889a94457N4366M1773B69828p3339c71190a79023P2082G4854d141C7594b17968
18877i0073B45257h7514j46054R2705p3612j07402a34664H2629i4844E6778f20213
18865a48390A32743F2768J26355g4419j23524A03974k5632a94811L9884A2441
18854D10857f53k09357l61502J47400J03437A94287l7831h6041j58386C06798
18843b15885A76765d7064j73855A15476b6438o9447c4710A71182G1136K38330
18833C09466b4593l21687g0965j17341C8942R9676n9581L0735J67810F7770c84030
18821A68555b11336j72154a56732A00383D0514D00a07743b5163l54786E5815J40004
18810A95819C844K40341j5219c9713A1733i8803D18199h3023n9531A38132b39552
$$ y = [-194457, -140091, -98318, 269828, 196489, -371190, -179023, -106941, 74854, -4141, 37594, -217968, -90073, 245257, -87514, -233568, -140863, -214475, -321877, -134664, 82629, -94844, 56778, -620213, -148390, 132743, 62768, 189123, -74419, -197943, 103974, 78342, -194811, -154927, 12441, 410857, -653, -210010, -571512, -424112, -320675, 194287, 156456, -86041, -244427, 306798, -215885, 176765, -47064, -220919, 115476, -26438, -95885, -34710, 171182, 71136, 309466, -24593, -346280, -70965, -188306, 38942, 138618, 79037, 109772, 277582, 67770, -384030, 168555, -211336, -383490, -156732, 100383, 40514, 400, -107743, -25163, -379949, 55815, 195819, 3844, 244185, 228966, -39713, 11733, -98803, 418199, -83023, -142554, 138132, -239552]
18798f9565k13264B56937a76978A2522i1535q826C46406A36323c2283k56392F7783
18786h4724P957l16445O4237F764J44707P9021A03251L8230K8031P1084B8037
18774B83648H9431a56811g5440A82011c37307a02282j0843b0431C1656a14171
18763d9776k76667h5654B4031b4626k23762E1410a7662k30941h7446o8696B13172
18751a13590j20858a01512j80587a38209h874p2630A89594a03640L6528l76705
18741d43817a16897q8813E4427a85784K3858k95296o9224b33662j08691J63494
18731a78859N3717b7638n3096G3303C4817c5990E6797c16000b5310A43820a11482
18719a184A2437h9632m3523q0162B23628D8739a95642L5278A56162P5548B3202
$$ y = [-69565, -282829, 256937, -176978, 12522, -91535, -100361, 346406, 136323, -32283, -288675, 67783, -84724, -76767, -393212, -328975, 6764, 151471, 230492, 103251, 141481, 169512, 240596, 28037, 283648, 89431, -156811, -75440, 182011, -337307, -102282, -113125, -20431, 31656, -114171, -49776, -326443, -85654, 24031, -24626, -248388, 51410, -17662, -248603, -87446, -156142, 213172, -113590, -234448, -101512, -282099, -138209, -8874, -81504, 189594, -103640, -67112, -443817, -116897, -205710, 54427, -185784, -161926, -457222, -526446, -233662, -342353, -178859, -125142, -27638, -80734, 73303, 34817, -35990, 56797, -316000, -25310, 143820, -111482, -1184, 12437, -89632, -133155, -213317, 223628, 48739, -195642, -160364, 156162, 231710, 23202]
18707f2084A66314J17839a47515D1681b30116g7653a7576m23420e7293j75655
18697b32948A77820l3002f586m7710j03417A02318m7024a73600p9684A07818a14719
18685b88579C6069b5898j97267R818J0787B22252A11063a33223M6962B27126N9253
18674B86379I3476m646a85415N7280e0675A9397a68512A25740a80811f3785k865
18663f6650h12l5766n7250g723k87152d2749k62258d9176J1270A60824J60027
18652C20851c31182B3505a98226E9369A4877a86297j32776B66556b92568P1845
18642b20723J00361A07103f233j02707L3010k03798M5659m1577j70121R9328b7531
18630B7121A0964a1547k74712B81160H5769a67930n3721i0230B04177b26455h0426
$$ y = [-62084, 166314, 284153, -147515, 41681, -230116, -77653, -17576, -440996, -57293, -232948, 177820, 144818, -6586, -54296, -157713, 102318, 55294, -173600, -253284, 107818, -114719, -288579, 36069, -25898, -223165, -213347, -202560, 222252, 111063, -133223, -86261, 227126, 286379, 93476, 88830, -185415, -128135, -50675, 19397, -168512, 125740, -180811, -63785, -66650, -812, -36578, -93828, -7723, -294875, -42749, -305007, -49176, -37906, 160824, 320851, -331182, 23505, -198226, 59369, 14877, -186297, -319073, 266556, -292568, -220723, -120362, 107103, -6233, -108940, -75930, -279728, -234069, -275646, -445767, -346439, -27531, 27121, 10964, -11547, -286259, 281160, 85769, -167930, -221651, -90230, 204177, -226455, -80426]
18618I2721d0169D7329b75538A6316L30314h8727A45539b51475e7510j23529b4649
18606d6346j56333C09499a28518l4629P1550I8003b95244l2324J08712A0592J15190
18595A25782L55032a67702C9527K29704a17966C95225a97881q4824h7519B0247
18584g4036H3703O0984c77502i9359l65379A17770e5083c312j4345k78200j3722
18573c09579a40436k2512g0642i500k68617O4408B54740e6209l8910I1375a78235
18561B09977M4919a8314A1955b06598f2715b3264o7167M0010D3100J13558c301
18549A85001a70112h0464L6678A45302a75946A01352b89201J43731A56106N4074
18539B10180h6162D5806Q8552K0664a86463B17813b4160l6558k13208A21265i1621
$$ y = [92721, -40169, 47329, -275538, 16316, 346630, -88727, 145539, -251475, -57510, -181039, -24649, -46346, -202679, 309499, -128518, -163147, -91597, 98003, -295244, -327568, -218856, 10592, 125782, 480814, -167702, 39527, 269231, -117966, 395225, -197881, -282705, -87519, 20247, -74036, 83703, 144687, -377502, -99359, -464738, 117770, -55083, -3312, -17657, -295857, -309579, -140436, -162948, -70642, -9500, -278117, -213709, 254740, -56209, -95119, 91375, -178235, 209977, 254896, -18314, 11955, -206598, -62715, -23264, -90431, -50421, 43100, 156658, -3301, 185001, -170112, -80464, -43786, 145302, -175946, 101352, -289201, -145470, 156106, 210180, -86162, 45806, 134358, 155022, -186463, 217813, -24160, -60718, -273926, 121265, -91621]
18527a62084C5223a77584k06766A359n15a36735r8530B43355e3685A61622p5572
18516H6050b7274E5018N3059b69861g3026E9441c61832A32622i0238B72338b06898
18504b48357h2189a7904l92237A98454B8417b26976A88622C9405c79144g759k14100
18493b21859B3971O130b76763G4396a13160C46230D752a10930k5175L0877k09542
18482c14770I6259b59906c1744o2621A7804a38929J1700A40589A3358a27204n6620
18471a83824d8597C3588O0042c3157G2351a5389l48097F9833a72805D2798J27457
18460A70255H1327J50110j08455j6987a66160h1040k68097B3701N72J33129L1805
18449A89207a12157k05962A56225e4379A7988b3315l867F3543H525f7481d932
$$ y = [-162084, 35223, -177584, -384350, 1359, 844, -136735, -235265, 243355, -53685, 161622, 86050, -27274, 55018, 108077, -269861, -73026, 59441, -361832, 132622, -90238, 272338, -206898, -248357, -82189, -17904, -410141, 198454, 28417, -226976, 188622, 39405, -379144, -7759, -221859, 23971, 30101, -276763, 74396, -113160, 346230, 4752, -110930, -136105, -105228, -314770, 96259, -259906, -31744, -94365, 17804, -138929, -127229, 140589, 13358, -127204, -183824, -48597, 33588, 93630, -33157, 72351, -15389, -363486, 69833, -172805, 42798, 170255, 81327, 231437, 122982, 105995, -166160, -81040, -349137, 23701, 24273, 157402, 189207, -112157, -318119, 156225, -54379, 17988, -23315, -27182, 63543, 8525, -67481, -4932]
18437I4745a94279A9958a77626A12373b05123g8768c7142k7577a2551J0j91680
18426b04221a8202A23030c7081j72881q016n3518A51505b76615B45689a09188
18415a02639m2450J5487A07403O432J55422k4129A05804b86688b013k59917h2820
18403C18946a84143m7992b9645l2119A63353e739A76641b72163n593F6470d9963
18391e2751h703j28154K4585B31852L3952g4370j95343l4697e3277l4578A99636
18379b98750A40533a87304B04720i6637o9384A90740a25319b6940j77372B67824
18368G4606a88410P6336A0165J25033a98442j09961B00107o9853I824J09831A3111
18356b53625A24479b73196f9052j40335a6959C03263e0618F536J55303c13867
$$ y = [94745, -194279, 19958, -177626, 112373, -205123, -78768, -37142, -64719, -12551, -12541, -204221, -18202, 123030, -37081, -209962, -217978, -271496, 151505, -276615, 245689, -109188, -102639, -145089, -129602, 107403, 113835, 269257, 245128, 105804, -286688, -2013, -261930, -82820, 318946, -184143, -232135, -29645, -61764, 163353, -5739, 176641, -272163, -277756, 66470, -49963, -52751, -8703, -136857, -112272, 231852, 265804, -74370, -269713, -304410, -53277, -87855, 199636, -298750, 140533, -187304, 204720, -96637, -166021, 190740, -125319, -26940, -204312, 267824, 74606, -188410, -112074, 10165, 135198, -198442, -308403, 200107, 130254, 9824, 119655, 13111, -253625, 124479, -273196, -69052, -209387, -16959, 303263, -50618, 6536, 161839, -313867]
18345b50569R8164L4494I4808l258c08181a3562j9961l148A26572a50114d5939
18333c23136e4478j13500j79938F9498d5208C5166J03018d4538F9939g0466E50
18321c55714O1257b3194a0782l0866j60924A78149b54995I4287d633m3188j33601
18310a81422B79718b3922o657j02158j33573A13398K1622B3350K85115a24123
18299c55264o2456a21919I527b79659n8179A13258D7472a56895A54739m015F8668
18287B94493b07559C14390b398A30344b94624l4092A84019E8478b00718j3956
18277b14674f4596A8799a95100A36686M4877g825k23053d4316K1569r6083B01686
18265A63397a31740j95616A62494b24771F6251K1046b90427i1384k85720e0433
$$ y = [-250569, -152405, -117911, 94808, 91550, -308181, -13562, -33523, -36671, 126572, -150114, -45939, -323136, -54478, -167978, -347916, 69498, -45208, 35166, 138184, -44538, 69939, -70466, 550, -355714, -294457, -23194, -10782, -41648, -202572, 178149, -254995, 94287, -4633, -47821, -181422, 279718, -23922, -30579, -132737, -266310, 113398, 135020, 23350, 308465, -124123, -355264, -417720, -121919, 9527, -279659, -337838, 113258, 47472, -156895, 154739, 150724, 68668, 294493, -207559, 314390, -2398, 130344, -294624, -328716, 184019, 58478, -200718, -214674, -64596, 18799, -195100, 136686, 181563, -7825, -230878, -44316, -22747, -118830, 201686, 163397, -131740, -327356, 162494, -224771, 66251, 87297, -290427, -91384, -377104, -50433]
18254G9469J62719a76207A52483l1991b00561A01585L3420a32373j38435g362
18243A46573a86534o7690A985g0047j74063B38047c21390B07543g2570B10835
18232a61516I5566Q0662b0158B35483J5831a45747D8198d5033j21780m4945m1075
18221b52833F3873F914b09013i8339H4908a5601B2891L99328D4943d45293A37108
18209a20329M8981q8905A11411n5014i3342A3092K076b30962C04261b21350b5239
18197B65884H2568k6745A0865J75648F0408K38652B783Q9747a51005A32916J71784
18186C04700b0241B2442a00419H3279f10079h9805l3910J8073H3407M901e1428
18174f0803G4852e9200F362e8683B90553j08089C048R8981J62250a03009A35487
$$ y = [79469, 242188, -176207, 152483, 120492, -200561, 101585, 135005, -132373, -270808, -7362, 146573, -186534, -254224, 1985, -70047, -244110, 238047, -321390, 207543, -72570, 210835, -161516, 95566, 176228, -20158, 235483, 251314, -145747, 48198, -45033, -166813, -211758, -252833, 63873, 6914, -209013, -98339, 84908, -15601, 22891, 422219, 44943, -445293, 137108, -120329, -71348, -160253, 111411, 56397, -93342, 13092, 15168, -230962, 304261, -221350, -25239, 265884, 82568, 55823, 10865, 186513, 60408, 299060, 2783, 92530, -151005, 132916, 304700, -20241, 22442, -100419, 83279, -610079, -89805, -123715, -105642, 83407, 88308, -51428, -60803, 74852, -59200, 6362, -58683, 290553, 182464, 3048, 102029, 264279, -103009, 135487]
18162A55764d63679H252J14313E9877a1765k87190E262a90852a9813r5950G5144
18150b6719B6070A2196P2234b85621H0735a64965N9597J0516b9501A26376b91267
18138b99735L523C00080h303A19335N6272B8836O8003J6628J25848a25776A51388
18126I2079J9705D7170a16213L4080a5934n2031g895j28344j91719A49248B3929
18114G9835Q2725b47479g6884r7323A90277c97199F2420B6099a16315A74006d57079
18102c71951Q1349A20559c6087E81036c2010B5569E760c1475j92274o096O8280
18091a61565K906n36G4487c09389B55351n6477n4943i4272C2017B61h011F8297
18078h2813m2326H9749C0671c82283A31908n3343A0320b71514J11772L5058f833
$$ y = [155764, -463679, 8252, 122565, 59877, -11765, -298955, 5262, -190852, -19813, -115763, 75144, -26719, 26070, 12196, 84430, -285621, 80735, -164965, -105368, -94852, -29501, 126376, -291267, -299735, -296212, 300080, -8303, 119335, 175607, 28836, 96839, 113467, 239315, -125776, 151388, 92079, 111784, 47170, -116213, -82133, -15934, -67965, -7895, -136239, -327958, 149248, 23929, 79835, 162560, -247479, -76884, -174207, 190277, -397199, 62420, 26099, -116315, 174006, -457079, -371951, -290602, 120559, -36087, 581036, -32010, 25569, 5760, -31475, -223749, -229845, -161565, -158659, -159195, 74487, -309389, 255351, 198874, 143931, -94272, 32017, 261, -8011, 68297, -82813, -125139, 89749, 30671, -382283, 131908, 78565, 10320, -271514, -159742, -124684, -6833]
18066h8977G3047K0982i0102B5787b83091A85145h6679E9054d6422k15654A48795
18054A21971h5389B1061b01818M9331f5517q7872B20180c85313B2601J00416a69151
18042c06847J45452H8093b64254A56537n1321a7117j436j81974D1872b0806A26869
18030e3951H4321b40270c5662G6087l6961a8024A52694k2604J94706A23371H526
18018a38190E9655R1609J14617b7863B0356L14869F7582c2298p1050j55951C08153
18006a49782A13929a48943F786a93172j6111d8989k42863A58011a06644d2340
17995G3114P4269b51918E06768b92158a9338B00288B6528a27556N1176j02625
17985a79005k3194Q6421l2107B86428c0727A66734N3478c0k02080A66361h865
$$ y = [-88977, 73047, 94029, -90102, 25787, -283091, 185145, -86679, 59054, -46422, -262076, 148795, 121971, -85389, 21061, -201818, -152487, -65517, -153389, 220180, -385313, 22601, 123017, -169151, -306847, -161395, 88093, -264254, 156537, 105216, -17117, -18553, -200527, 41872, -20806, 126869, -53951, 84321, -240270, -35662, 76087, 39126, -18024, 152694, 130090, 324796, 123371, 8526, -138190, 59655, 151264, 265881, -27863, 20356, 335225, 67582, -32298, -103348, -259299, 308153, -149782, 113929, -148943, 6786, -193172, -209283, -48989, -291852, 158011, -106644, -42340, 73114, 147383, -251918, 506768, -292158, -19338, 200288, 26528, -127556, -76380, -179005, -202199, -115778, -147885, 286428, -30727, 166734, 220212, -30, -202110, 166361, -8865]
17973a64669A110b69192a28758M6207k8271j80151H6021b70844B39057A01419
17962c17900A45903a20818q2017J3336A29615a08337A76931c66189h6709j05846
17952a92555A72981i5257H6858c05796B04891r0384b19891h3471C90793a26530
17941A46470b80413Q9450B59759I1260K23316a4384H1008K45529O3574a20316
17930b15264i2818j03689k593p422A04999c9400m2323A93380d6825B41340c12869
17918a01088o6962d1837p749a2111A39855L2382g5019j39828A97614a85615o3416
17907b49031B47308I0277N9742a34211B13492J3178i5337K7735H4156c78846J82306
17896a96540O3123A14353L262m4843f9509G8114l7742g5856A07566c35646a13767
$$ y = [-164669, 1110, -269192, -128758, -82551, -110822, -290973, 86021, -270844, 239057, 101419, -317900, 145903, -120818, -202835, -189499, 129615, -108337, 176931, -366189, -86709, -192555, 172981, -95257, 86858, -305796, 204891, 114507, -219891, -83471, 390793, -126530, 146470, -280413, -190963, 259759, 91260, 314576, -14384, 81008, 326537, 390111, -120316, -215264, -92818, -196507, -199100, -206522, 104999, -39400, -81723, 193380, -46825, 241340, -312869, -101088, -168050, -41837, -49586, -12111, 139855, 172237, -75019, -214847, 197614, -185615, -249031, 247308, 90277, 150019, -134211, 213492, 226670, -95337, -67602, 84156, -378846, -196540, -133417, 114353, 117615, 72772, -69509, 78114, 40372, -75856, 107566, -335646, -113767]
17884i404A44611a58863I7182c15004A01281f0671a2802j71148j07765a5742A98286
17872H2490f1037j43443I4087g0027B58482M6677r5815a31148B11871g9435A49659
17860E2599c52127f8723r3406c1236A2913b19344b0176j65998m2196Q3902B70413
17848g485j17606I5506l284K10223c49898a1469j76082A36155d6166A69635l4332
17837A35303c6860A93128K1262c7307m5499D77852B9564i5891o8860b11B99860
17825B1700h1723A96882b44834B07884a41180C4263f6207A50990e0721n5869j5879
17814a22469l4314J1027o4915F5197J63284A1565M3173J61201b11347e2197j50457
17803b02654g5458D50517g4832m6447F9215O5561h0166A7218a39464c5044j4926
$$ y = [-9404, 144611, -158863, 97182, -315004, 101281, -60671, -12802, -183950, -291715, -15742, 198286, 82490, -61037, -204480, 94087, -70027, 258482, 305159, 209344, -131148, 211871, -79435, 149659, 52599, -352127, -68723, -162129, -31236, 12913, -219344, -20176, -186174, -228370, -144468, 270413, -7485, -125091, 95506, 92222, 302445, -349898, -11469, -187551, 136155, -46166, 169635, 135303, -36860, 193128, 214390, -37307, -82806, 477852, 29564, -95891, -164751, -211, 299860, 21700, -81723, 196882, -244834, 207884, -141180, 34263, -66207, 150990, -50721, -106590, -122469, -156783, -145756, -210671, 65197, 228481, 11565, 54738, 215939, -211347, -52197, -202654, -75458, 450517, -74832, -121279, 69215, 134776, -80166, 17218, -139464, -35044, -49970]
17792d9970a6644F2542J89197b02270A59930d9058C690J42015a11963H867a09099
17780A14847L90b84219N7794A21303O4332G2134f7885G9665a78287A2573M8477
17769F1050a85673A13545J24512P7519c6046B9102a76622I5516h8610j57659G0395
17757A47696g532B49504j14196c47862C60378a3988C7364a17397B20701c52728
17746A59523a6433J186G7232a65687a3131j71327B25657g1629j28459A31430i5569
17734B03958A818P1292b44782e5445A93133b12399C0993b3434j36717C52005b32477
17722B11209A358a76440e6603D5400a28066B78576d2143a1805E8355J54947H798
17710b2918B6892k143L8865i8486B80761a8579A39201e3089m51042B37337a36682
$$ y = [-49970, -16644, 62542, 251739, -202270, 159930, -49058, 3690, 145705, -111963, 8867, -109099, 114847, 115237, -284219, -226425, 121303, 185635, 72134, -67885, 79665, -178287, 12573, 61050, -185673, 113545, 238057, 315576, -36046, 29102, -176622, 95516, -88610, -246269, 70395, 147696, -7532, 249504, 135308, -347862, 360378, -13988, 37364, -117397, 220701, -352728, 159523, -16433, -15247, 77232, -165687, -13131, -184458, 225657, -71629, -200088, 131430, -95569, 203958, 1818, 73110, -244782, -55445, 193133, -212399, 30993, -23434, -160151, 352005, -232477, 211209, 1358, -176440, -56603, 45400, -128066, 278576, -42143, -11805, 58355, 213302, 8798, -22918, 26892, 24749, 63614, -98486, 280761, -18579, 139201, -53089, -504131, 237337, -136682]
17698b57732c3718k17750a6875A28934a87000A10470K9786L9452a62237j12142
17688b74379i3348c9908B98076a18886K7477j06177E6089M1073b52930C33237
17677c70281H0635g7866K8909G6035b52766B31188a63735j6747D8765n889b95255
17665A21262n2489b2050I7090a41204j52174h7337B2689N6664a05855A4609M1924
17654E6533k2185e27612E6940b57299D80212G7421k5537K55100a3731A68794b9413
17642B54987L4084a23847I4369m4843Q5325a53377D8710O4319B0596J38455J25583
17631B84634A1727Q9526K24461a03642C11850b41242i3794o1842C7517J6838f9441
17619e8840A02219O1775J6265E0658J28210D4110f7850I6230R6305a48119B4153
$$ y = [-257732, -33718, -251468, -16875, 128934, -187000, 110470, 140256, 179708, -162237, -274379, -93348, -39908, 298076, -118886, -91409, -197586, 56089, 97162, -252930, 333237, -370281, 80635, -77866, -48957, 76035, -252766, 231188, -163735, -180482, 48765, 42876, -295255, 121262, 68773, -22050, 97090, -141204, -293378, -87337, 22689, 79353, -105855, 14609, 56533, 34348, -527612, 56940, -257299, 480212, 77421, 51884, 306984, -13731, 168794, -29413, 254987, 289071, -123847, 94369, 49526, 134851, -153377, 48710, 113029, 20596, 159051, 284634, 11727, 101253, 325714, -103642, 311850, -241242, -93794, -155636, 37517, 54355, -69441, -58840, 102219, 163994, 180259, 50658, 178868, 44110, -67850, 96230, 192535, -148119, 24153]
17607a24859K6255k32850g1273J0891j94952A21624a60531l8122A2428M1061K03728
17596B57217A09168k6216e0276a8493F858J3740f3590k22604C73024a7194A70719
17584B27684A711P8204J13967G2411b6561B9142h0967B61765m1860l3640r7D1275
17571E9617J36988a99078A1451d5924A01004K26948A63376a04093B34239r1724
17561A42515g991j74817B89950j07882p1682c1368B44147f0686A03202J25425
17551B28627B6688J07892g8730j58411a4922j26029A12060K2370j1021i2091j05152
17540a97243B72201l2181G4409b67703e8731B56431b6492B64122d09158A42879
17529B26815j00322N5582q4349g2472A80650N522P2031A15341a14844B54225l5770
$$ y = [-124859, -98604, -331454, -71273, -60382, -255334, 121624, -160531, -198653, 12428, 53489, 257217, 109168, 82952, -50276, -18493, 6858, 20598, -63590, -286194, 373024, -17194, 170719, 227684, 1711, 79915, 193882, 72411, -26561, 29142, -80967, 261765, 219905, 186265, 186168, 41275, 59617, 196605, -199078, 11451, -45924, 101004, 327952, 163376, -104093, 234239, 142515, -7991, -182808, 289950, 182068, 110386, -31368, 244147, -60686, 103202, 228627, 26688, 134580, -78730, -237141, -14922, -140951, 112060, 134430, 123409, -92091, -197243, 272201, 240020, 74409, -267703, -58731, 256431, -26492, 264122, -409158, 142879, 226815, 126493, 182075, 97726, -72472, 180650, 186172, 258203, 115341, -114844, 254225, 218455]
17518B18455a78547A85819a63791A58341a15519A69860J76199I5987P3356M5596
17508B14939E5764a92290R2011B55004C4362j2089K20322e2101m1261k2267B14026
17496a80430c7435a4109A47437L2412L2673m1101c6088m8341A95948M5553j02640
17485A38861L56288I95R0221J29316k4413K28520b55467B40945I9838H92J30642
17474A31534N1594m1535e2819B0753Q4193a60866C13262a49833K9823K2013M8933
17463d9064p7125I4901P3491i4206F3722J54954r6693E5852C686J40373L4709
17452A78768l6758B2313K43602j3013O9509A42606M3774J89677N044a11030B38981
17440B48693c574C6218J60299a18937A48697J1941a15047A93545l9707J55645
$$ y = [218455, -178547, 185819, -163791, 158341, -115519, 169860, 346059, 95987, 169343, 214939, 55764, -192290, -100279, 255004, 34362, 22273, 242595, -52101, -93362, -115629, 214026, -180430, -37435, -14109, 147437, 179849, 212522, 171421, -36088, -84429, 195948, 241501, 138861, 495149, 995, 91216, 220532, 196119, 424639, -255467, 240945, 99838, 892, 131534, 183128, 141593, -52819, 20753, 104946, -160866, 313262, -149833, -120010, -97997, -49064, -126189, 94901, 168392, -94206, 63722, 218676, 121983, 55852, 3686, 144059, 178768, 142010, 22313, 265915, 252902, 322411, 142606, 186380, 376057, 381101, -111030, 238981, 248693, -3574, 36218, 196517, -118937, 148697, 160638, -115047, 193545, 153838, 309483]
17430C09483B831J96548K74294b01395A41907j8572J78680M3795J74963A51397
17419G3027Q9894k6221K12031j72670K83717k14866j12603K64165A42068E2011
17408F7059b89770A26574J75407j11439H6700G649P1181Q6628a66324A7648Q1770
17397I9418J83316m9851K609L81062B10305J6348l1658j3728B5483N7553L95107
17386D78143j96635j16880i0765B11684a12391B77368O4727E1576b79958D43406
17375D2026P9122b19849A35879o6387P8026i2838G0734L28363A60760b5396D15603
17363A61238K03261f4216B75972k1243c40580G3634J51821H6051k9737L7462R7566
17352A91342M872D1054a73460D2743J64292d9769j18750B02400F7298D064N3435
$$ y = [309483, 2831, 199379, 473673, -201395, 141907, 123335, 302015, 345810, 520773, 151397, 73027, 162921, 136700, 348731, 176061, 459778, 244912, 132309, 396474, 142068, 52011, 67059, -289770, 126574, 301981, 190542, 86700, 7649, 78830, 165458, -166324, 17648, 99418, 282734, 232883, 235492, 616554, 210305, 226653, 194995, 181267, 25483, 83036, 478143, 281508, 164628, -90765, 211684, -112391, 277368, 342095, 51576, -279958, 443406, 42026, 121148, -219849, 135879, 69492, 147518, -92838, 70734, 399097, 160760, -25396, 415603, 161238, 364499, -64216, 275972, 254729, -340580, 73634, 225455, 86051, 56314, 93776, 191342, 196214, 41054, -173460, 42743, 207035, -49769, -168519, 202400, 67298, 4064, 57499]
17341E7499g162j77095C46357e9736C38097F6330K98081F7894K54768j12333J32149
17330C42478A10032a24926A19822R3262G5800J28382J25372G5855P8138J29547
17320B83540n8836F0051K75691k5811b81076B34835K1947B2343Q0770L4298D8069
17308C14017c2181A17642J56091b42459C60910G3992e4429E36700I3421K8844
17298A22265d5026m4258m1555B32603Q6772E9815g9991A32330K5212p2824K62614
17287C47332d9683C59040b62114A2081K11217A00446K47886M367G0687R0848M1990
17276B03525n3644M5986p9401M37193j34154A5702M9409J9481R7622P5569d6288
17264f7603B87795R0152A50526O6099G1370R6530P3283J92035j06329j52820J16495
$$ y = [57499, -7162, -184257, 346357, -59736, 338097, 66330, 364411, 67894, 322662, 210329, 342478, 110032, -124926, 119822, 213084, 75800, 204182, 329554, 75855, 153993, 283540, 224704, 60051, 335742, 309931, -281076, 234835, 256782, 22343, 103113, 137411, 48069, 314017, -32181, 117642, 273733, -242459, 360910, 73992, -54429, 536700, 93421, 122265, -45026, -89284, -130839, 232603, 319375, 59815, -79991, 132330, 157542, 84718, 347332, -49683, 359040, -262114, 12081, 223298, 100446, 348332, 352699, 70687, 161535, 203525, 149881, 195867, 116466, 553659, 419505, 15702, 65111, 84592, 182214, 257783, -46288, -67603, 287795, 377947, 150526, 216625, 71370, 167900, 241183, 433218, 326889, 174069, 290564]
17253B90564J27207a77116C36914A67994h1263E0402J97885A20269L51585B9779
17242B03913N9216p2024O7311R8574o0612a17384E4862a65297D45245A40555a68827
17230D92131B15688Q1600j00525K29057A57844K7143J81221J2428A73549o0056
17220A13493J591n2011O1924K01923o6092J21939j11999M4411j49603K06121B6971
17208C26437e2000C5420J87725M706P6406Q3937j44727a64600D00432j53971N6694
17197C03155K33871A72594E3895a34221I7312M06661B089K05286b9424j60158
17187a89582E67941I4863K1880K07054A39610k8294N15893B19907R1086q6740
17177B24253J30918A63833D5244J19440M47339A88329D5859P1835K22106A32053
$$ y = [290564, 417771, -177116, 336914, 167994, -81263, 50402, 248287, 120269, 471854, 29779, 203913, 263129, 191105, 258416, 356990, 296378, -117384, 54862, -165297, 445245, 140555, -168827, 492131, 215688, 297288, 196763, 425820, 157844, 184987, 366208, 378636, 173549, 113493, 115084, 63073, 124997, 326920, 260828, 382767, 270768, 315179, 165576, 371697, 26971, 326437, -52000, 35420, 223145, 227851, 304257, 388194, 243467, -164600, 400432, 246461, 303155, 537026, 172594, 53895, -134221, 97312, 503973, 2089, 207375, -29424, -189582, 567941, 94863, 116743, 323797, 139610, 111316, 627209, 219907, 310993, 224253, 355171, 163833, 45244, 164684, 612023, 188329, 45859, 117694, 339800, 132053]
17166D8874Q2585K61044M4318i9887A07171J28532K7610l3355I7091J04893K12862
17155D14846I2179K15883f6892B11740o4505N1667K7976J12849r7755g0986D01639
17143B54816l1356l5454K08798n096H9257L29489A75922K32704H15M8570J12656
17132A62041j1603J98310H1926K14173O7227J52387k32688n3040K24974b2168
17121B32545N41009C47964j36543K47175k23247L28139A65924J91044P7231L9576
17111D73775k35557K71182j16658K4176m7161J38464B19676J70169K81606l18089
17101C53362j06322l2942L30404B59415O6087M2315j40232J86256J68460k46707
17091C35594B6135L68540N183M0553j5691j95667J09539L21926j30098A04885
$$ y = [48874, 131459, 392503, 436821, -99887, 107171, 235703, 263313, 229958, 97091, 201984, 414846, 92179, 308062, -66892, 211740, 147235, 198902, 226878, 339727, 241972, -70986, 401639, 254816, 223460, 188006, 396804, 391708, 89257, 418746, 175922, 408626, 815, 49385, 162041, 150438, 348748, 81926, 296099, 363326, 515713, 283025, 229985, 454959, -22168, 232545, 773554, 347964, 211421, 458596, 235349, 563488, 165924, 356968, 434199, 473775, 238218, 509400, 392742, 416918, 369757, 508221, 219676, 389845, 671451, 353362, 247040, 214098, 544502, 259415, 325502, 367817, 227585, 413841, 582301, 335594, 26135, 394675, 399858, 440411, 424720, 229053, 338592, 660518, 530420, 104885]
17080D18596J88771k63880j49683m5083M60283k11935L85416j77939N0651A59841
17069C56878M52398r7459k31335J05220B73611J90531r6811A77860M20632k00377
17059C98115j24512K22199j98999L43377J68250B81929L1565L40670k50404O241
17049D10001K98839r0061j77506J60838J21720B03051M29654k27397J40603J63169
17039G09080l43931L18748C28313j49592J58824K03080M7472L59385B95481R6919
17029C92400l3973J80981K94324l34639K70054j300Q749k24624N194K3367M20521
17018A001054k13912K4570N9593k68175M4139J26235j01792l21784J75816k3422
17008E02322K72350J62909k54885J22780K08652m32916J40614P5689K26533m07075
$$ y = [418596, 607367, 343487, 193804, 148721, 609004, 397069, 782485, 604546, 655197, 159841, 356878, 809276, 711817, 480482, 585702, 273611, 464142, 367331, 177860, 598492, 398115, 273603, 495802, 296803, 640180, 808430, 281929, 313494, 654164, 403760, 410001, 708840, 618779, 441273, 602111, 723831, 203051, 632705, 405308, 545911, 709080, 365149, 683897, 328313, 178721, 337545, 540625, 588097, 947482, 295481, 392400, 358427, 539408, 833732, 499093, 769147, 767847, 776596, 551972, 557166, 580533, 1001054, 787142, 811712, 871305, 603130, 647269, 773504, 671712, 349928, 525744, 502322, 774672, 937581, 682696, 805476, 1014128, 581212, 721826, 797515, 1024048, 616973]
16998F16973J68314p4002J35328J86908D49827N28943j09023P9277N4224n8722
16988I44526k60845J36871j64773j79588K92779m6152Q7599C66545M56530J52348
16978I75423j2989j37182P1423j16801L60131m15374M02631m19692r5599L08127
16968I20098j75988R4109k03K91453j12268J84664r0861K36104n16771n0679N38705
16957A318363m41462M98266o22121K59098J17586j21320k4514J64243k46198N82530
16947A484471n10931L42494m00092J8563L0257J04039K89966l66472K44736K4373
16937A261404k42191r267L59858k33672j27258K98686J12623m10373L64529m0587
16927A333752j53542J45878J12394J7845j90765J35214j9756l070k1769J3631
$$ y = [616973, 785287, 711285, 846613, 1033521, 449827, 978770, 869747, 949024, 1003248, 944526, 683681, 820552, 655779, 476191, 768970, 722818, 810417, 366545, 823075, 975423, 962434, 825252, 896675, 779874, 1140005, 724631, 1127262, 707570, 611971, 920098, 744110, 838219, 838016, 1129469, 1017201, 1201865, 1111004, 1347108, 830337, 779658, 1318363, 876901, 1375167, 753046, 1012144, 1129730, 1008410, 983896, 1148139, 901941, 1484471, 973540, 1316034, 915942, 934505, 964762, 1068801, 1358767, 992295, 1237031, 1261404, 1019213, 1009946, 1369804, 1136132, 1008874, 1307560, 1420183, 1009810, 1374339, 1333752, 1180210, 1326088, 1438482, 1456327, 1265562, 1400776, 1381020, 1377950, 1356181, 1369812]
16917A369812J49419k59310K39766j71630k22879O58686n00826R7975N27768J61877
16907B050658q21312J55433L58698l5449j52134J39036J19381K9326j38607K83832
16897A988862k83811k03104J23587J18278J41166n8567j12383N2054m279p5362
16887A686441J20777M16171Q6015l07633J25656O874k2600l6881J00444J00786
16877B276050l41677K04232r781p1127J35203J04617j67549Q9970N7194k4179
16867B252953J13417L52103k3761L37822l19929l36774J00109N35760p7644j03418
16857B830638j68631o2105J15285J39326O65349n57894m267J91374L36970k188
16847C483857m34141J46148j03195J52019N78705n63865M99903J82175j64424
$$ y = [1369812, 1519231, 1259921, 1499687, 1328057, 1105178, 1763864, 1263038, 1361013, 1888781, 2050658, 1229346, 1384779, 1743477, 1708028, 1555894, 1694930, 1814311, 1843637, 1705030, 1988862, 1705051, 1501947, 1625534, 1743812, 1884978, 1826411, 1714028, 1766082, 1761803, 1686441, 1807218, 2223389, 2309404, 2001771, 2127427, 2134301, 2111701, 2074820, 2175264, 2276050, 1934373, 2138605, 2128824, 2057697, 2192900, 2297517, 2129968, 2219938, 2277132, 2252953, 2366370, 2718473, 2694712, 3032534, 2712605, 2375831, 2475940, 3011700, 2934056, 2830638, 2662007, 2599902, 2715187, 2854513, 3519862, 2961968, 2957701, 3149075, 3486045, 3483857, 3049716, 3195864, 3092669, 3244688, 3823393, 3259528, 3759431, 3941606, 3777182]
16838C777182n5499J91626K75762l08072J98599L51693R6927k21540J99879l89956
16828D116601M34361j65821J87636N00630k59093L11923P6150J23110j88089J78673
16818E316081J59722q272J52321m9302L56387m6794K11647k9877K57772j22598
16808F197087N89113k37983M31495J69996P9338j95387M64129M05736k22490K43242
16798G924276O25578K0888M4793K60030K60466N91837l0774K14681L29658K99387
16788A0540820o6137M22557L85103J97314K73526K11558N80555J11918L65166
16779A3022380M32656K76593P87616M29932N24229K07750L40071O55484O87465
16770A7364176Q17841N59089N30866M17192P57264M23219R65483J125243J062422
$$ y = [3777182, 3721683, 3913309, 4189071, 3880999, 4079598, 4431291, 4528218, 4306678, 4506557, 4116601, 4550962, 4385141, 4572777, 5073407, 4814314, 5126237, 5202387, 5325497, 5137408, 5316081, 5475803, 5467531, 5619852, 5570550, 5926937, 5880143, 6091790, 6061913, 6319685, 6197087, 6786200, 6548217, 6979712, 7149708, 7229046, 7033659, 7497788, 7903524, 7681034, 7924276, 8549854, 8570742, 8615535, 8875565, 9136031, 9727868, 9697094, 9911775, 10241433, 10540820, 10474683, 10897240, 11282343, 11479657, 11753183, 11964741, 12545296, 12657214, 13022380, 13455036, 13731629, 14519245, 14949177, 15473406, 15681156, 16021227, 16676711, 17364176, 18182017, 18741106, 19271972, 19689164, 20446428, 20869647, 21835130, 22960373, 24022795]
16761B4022795M93325Q71243J201734J112539J173738J323253J278389J087559
16753C2564575J197891K292012J163099J821764J487188K457758K070103K081598
16745D7135988K231420K810621K688458K435173L511377L234706L542575L584755
16737G1175073L838704M479651M567700M793344M935390N315896N914043O021355
16729A11041156O035134O658751O451468O845505O939368O784061O954151O428630
16721A64138224O073167N515694M630832M252063K528819J940854Q85084m10919
16713A89553818j771826k747091l660451m644063n303507o025573o390664p139921
16705A51870722o901895p196745o837370o729931o657185o363141n962515o115183
$$ y = [24022795, 24516120, 25387363, 26589097, 27701636, 28875374, 30198627, 31477016, 32564575, 33762466, 36054478, 37217577, 39039341, 40526529, 42984287, 45054390, 47135988, 49367408, 52178029, 54866487, 57301660, 60813037, 64047743, 67590318, 71175073, 75013777, 79493428, 84061128, 88854472, 93789862, 99105758, 105019801, 111041156, 117076290, 123735041, 130186509, 137032014, 143971382, 150755443, 157709594, 164138224, 170211391, 175727085, 180357917, 184609980, 187138799, 189079653, 189964737, 189553818, 187781992, 185034901, 181374450, 176730387, 171426880, 165401307, 159010643, 151870722, 144968827, 137772082, 130934712, 124204781, 117547596, 111184455, 105221940, 99106757]
16697I9106757n636026n046879n083604m373162m836010m081277l236484l719580
16689F3093735l422740k953686k837927k910477k798979k183378k393385j768883
16681D1824280k091077j634862j836902j421920j464367j308605j850030q15335
16673B9401182j449726q01624j256152q46317q76675q49620j372666p31661o68923
16664B0547818p80928n34318m88466o05214n90856p18102p07611o28845k15355
16655A5278123p23310l42855m64919o6422m31949m71509l15399o69148L4218l84336
16645A1442494j93818m20591n15404k1512n2383n97380k32687j61596l96248J18231
16635H969106m5258p17668m9339r8588k08384k94425l15247j72398j49927j24822
$$ y = [99106757, 93470731, 88423852, 83340248, 78967086, 74131076, 70049799, 66813315, 63093735, 59670995, 56717309, 53879382, 50968905, 48169926, 45986548, 43593163, 41824280, 39733203, 38098341, 36261439, 34839519, 33375152, 32066547, 30216517, 29401182, 27951456, 27149832, 25893680, 25047363, 24170688, 23321068, 21948402, 21216741, 20547818, 19766890, 19232572, 18744106, 18138892, 17548036, 16829934, 16122323, 15493478, 15278123, 14554813, 14211958, 13747039, 13680617, 13248668, 12777159, 12461760, 11792612, 11826830, 11442494, 11248676, 10828085, 10312681, 10291169, 10238786, 9641406, 9408719, 9247123, 8850875, 8969106, 8923848, 8206180, 8156841, 8058253, 7849869, 7555444, 7240197, 7067799, 6917872, 6793050]
16625F793050l17973J13018o9838k69644j14122k37440J6925N12476n33814k85817
16615E606821m65518K14967l76406j24858K63092m2166J51677m63028l7442j46523
16605D580616K4451k19856R8021K144m67469j39421J83140l03807N8637m9323
16595C767133k39052M43531m55731M7047Q7685R6518m42667r866L29769j55407
16585C468960k94764J16904k80295J07878o2755m03796K42416K51587l52492K74983
16575C068626m65678J59402O1000q2303J22962n35581K02018J24761l42850L0562
16565B342919L80513k70689j54303j88551J33946J17257j48374n896J90094l25618
16555B071298J34029k484K05814o24926j43277O99042n28158K03035P3032j28613
$$ y = [6793050, 6475077, 6588095, 6518257, 6248613, 6134491, 5897051, 5913976, 6426452, 5892638, 5606821, 5141303, 5356270, 4979864, 4855006, 5118098, 5075932, 5227609, 4764581, 4727139, 4580616, 4605067, 4385211, 4483232, 4485376, 4017907, 3878486, 4061626, 3757819, 3816456, 3767133, 3528081, 3971612, 3515881, 3562928, 3650613, 3747131, 3304464, 3294598, 3624367, 3468960, 3174196, 3291100, 3010805, 3118683, 3055928, 2652132, 2894548, 3146135, 2793643, 3068626, 2602948, 2762350, 2823350, 2741047, 2864009, 2328428, 2530446, 2655207, 2312357, 2342919, 2723432, 2452743, 2298440, 2109889, 2243835, 2361092, 2212718, 2206822, 2396916, 2071298, 2205327, 2202843, 2408657, 1783731, 1640454, 2339496, 1811338, 2014373, 2087405, 1958792]
16545A958792k92091J53207j38071R4972J31750k50041J21307p9448l84009N58963
16535A875331m86801J11006K38331n8370k90411o5406K68576p7902j36730k00393
16525A177231K44201j40537p4191K61074R3109l36485K05468L5388o9081J65066
16515A561243m8766k62874k2945L13491n74994K91021l17512M73535J5940j99709
16505A228430Q8551l36300L12227Q2950l47102M32235n01551L86164l79520M32439
16495A398523j78545j95447j44045K46348k53388K81434l29058N7339J98821K56250
16485A338232j13782k3334j55343r4408K01090n11267M51868j86688k29381M96224
16475A173211m13793J87088o104L2141M4283k73106M59787k81672k10053Q2920
$$ y = [1958792, 1666701, 1819908, 1681837, 1776809, 1908559, 1658518, 1779825, 1700377, 1316368, 1875331, 1388530, 1499536, 1737867, 1679497, 1389086, 1323680, 1592256, 1514354, 1377624, 1177231, 1421432, 1280895, 1206704, 1467778, 1560887, 1224402, 1429870, 1465258, 1396177, 1561243, 1512477, 1249603, 1226658, 1540149, 965155, 1256176, 938664, 1412199, 1428139, 1228430, 1316981, 980681, 1292908, 1375858, 1028756, 1460991, 959440, 1345604, 966084, 1398523, 1219978, 1024531, 880486, 1126834, 873446, 1154880, 825822, 883161, 1081982, 1338232, 1224450, 1201116, 1045773, 951365, 1152455, 641188, 1093056, 906368, 676987, 1173211, 759418, 946506, 940402, 972543, 1016826, 743720, 1203507, 921835, 711782, 794702]
16465G94702K33116L2014j75004j98425J13139K08805j75507K598C96883L09234
16455G06117k35365M57378k38306K41039k3552k06357k5273J60426R5853l16924
16445F15036J30654m2189J80473l28433J20293J41734m8103N7269O5076J6105
16435I07915m1228j08923K50962k52727n2158r2394N4885p2244l7408R3024j19381
16424E30323J82603N6301j99466L53305l50633L5288P6422n454K9088K11217l10486
16413F08508n9406L1474K09009L30869n52502K27611l51612J31371q1826P3089
16403E66585B14281M17332K03316k59775K08482L937B96726J35277J22904A81446
16392D15469J3772L33336j02378k55158j53993M10085B98108I8407J29037L18644
$$ y = [794702, 1027818, 1059832, 884828, 686403, 799542, 1008347, 832840, 835438, 396883, 706117, 470752, 928130, 689824, 930863, 907311, 700954, 675681, 836107, 931960, 615036, 745690, 703501, 883974, 555541, 675834, 817568, 769465, 826734, 891810, 907915, 866687, 757764, 1008726, 755999, 703841, 611447, 666332, 594088, 556680, 649704, 530323, 712926, 769227, 569761, 923066, 572433, 607721, 684143, 678689, 707777, 918994, 608508, 549102, 580576, 789585, 1120454, 567952, 795563, 443951, 575322, 493496, 566585, 214281, 631613, 834929, 575154, 783636, 787573, 296726, 432003, 554907, 181446, 415469, 429241, 762577, 660199, 405041, 251048, 661133, 298108, 98407, 227444, 546088]
16382E46088J66380q302l03196j48902K86513j04101K78984L64487m78824k42210
16372C56917K99679j72962K37088j75135A66981r845L70694j64142L30981k62774
16362D31895N8497C2256K09259K02718j54747k6477Q3731j37766D9395K78755
16352C28150N9963R846L59924D3942J90870A1936M96574G596O30332M3579l04682
16341C76825J62261B41531K71720A58874J53960L86446j71047B35222J36161O1119
16331D32502J02041m197O797k40090m2756R0742r3579M10048C05098H5480L97860
16320D83340A42470K52173J76312m7912n7801K58688j30252J0979k07644A53045
16309E53368A14645J49545J89401J28006J00038A58655J48624R6390m6166O0463
$$ y = [546088, 712468, 704166, 400970, 252068, 538581, 434480, 713464, 1077951, 599127, 356917, 656596, 483634, 720722, 545587, 166981, 157136, 527830, 363688, 694669, 431895, 490392, 32256, 241515, 444233, 289486, 263009, 346740, 208974, 49395, 328150, 388113, 397959, 757883, 43942, 234812, 11936, 508510, 7596, 637928, 681507, 376825, 539086, 241531, 513251, 158874, 312834, 699280, 528233, 235222, 371383, 432502, 534543, 530346, 537143, 297053, 254297, 345039, 251460, 661508, 305098, 85480, 483340, 142470, 394643, 570955, 523043, 465242, 723930, 593678, 604657, 397013, 153045, 553368, 114645, 264190, 453591, 581597, 681635, 158655, 307279, 403669, 357503, 417966]
16299D17966m0410k2338O2585A04250M06794j69700J14850j07122K05353B34334
16288C53912l4250A54765j8747K25165F3600N16507j14810a9966C34899A63173
16277C69076j15710J31698N0757D6505K13150M8187K988j07059L90824j15025
16267D79570j89983r5452K81394j77381J12684J3868a46958D27334m1153C9261
16256B30600R209p7676n1138L30632b483D87123a1249E56934B30317l3947J95550
16245C91920g2001C00718r9229L2731O5339K86062k67599j3231G4912J96960b6622
16233H0252d8145B15436L03678a96705D6298K40946b22152B69880O5565M3766
16223C79211n3032m8020K20221B21762c7596E45767k17751j60257G9702K50150
$$ y = [417966, 377556, 355218, 417803, 104250, 511044, 341344, 456194, 349072, 554425, 234334, 353912, 319662, 154765, 136018, 361183, 63600, 580107, 465297, -19966, 334899, 163173, 369076, 253366, 385064, 435821, 46505, 259655, 307842, 310830, 203771, 594595, 479570, 289587, 194135, 475529, 298148, 410832, 424700, -146958, 427334, 386181, 39261, 230600, 239809, 162133, 110995, 441627, -2483, 487123, -11249, 556934, 230317, 196370, 391920, -72001, 300718, 201489, 234220, 299559, 585621, 318022, 304791, 74912, 271872, -26622, 80252, -48145, 215436, 519114, -196705, 46298, 287244, -222152, 269880, 335445, 379211, 326179, 278159, 498380, 221762, -37596, 545767, 328016, 167759, 79702, 329852]
16213C29852l0580H2058a13720D19814A61791l344E8250J14515h8408J4614A58599
16201B85576A25417b80849A60104E7277J77478L6665j9810A17014J00095F2763
16190B52722k8881b8504B69938E1249J20396H2414L3316J95378E3670K47805P5757
16179C77232A07134K40157a02223A56517n5237D2449c7886F3052J6264a5124A40773
16167A47556J5474a10276M1088C96738a18399D08324j58521A16429J00527O5462
16157B82418L33833f7874A43766K59882a4192A48762L01999h1084j04579d9114
16146a94324B20082C0804c1495i95r0486A28894l1715f9554D95987E4461b21493
16134B14041B6670J03022B9086J87718N6446p477E453P895a00492B44518L370
$$ y = [329852, 299272, 82058, -113720, 419814, 161791, 158447, 58250, 172765, -88408, -73794, 158599, 285576, 125417, -280849, 160104, 57277, 234755, 271420, 251610, 117014, 217109, 62763, 252722, 223841, -28504, 269938, 51249, 171645, 82414, 115730, 311108, 53670, 301475, 377232, 107134, 347291, -102223, 156517, 101280, 42449, -37886, 63052, 79316, -15124, 140773, 147556, 163030, -110276, -69188, 396738, -118399, 408324, 249803, 116429, 216956, 282418, 616251, -67874, 143766, 403648, -14192, 148762, 450761, -81084, -185663, -49114, -194324, 220082, 30804, -31495, -995, -91481, 128894, 97179, -69554, 495987, 54461, -221493, 214041, 26670, 129692, 29086, 216804, 273250, 265773, 5453, 13348, -100492, 244518, 247888]
16123B47888A01438K33700a01816p3511F9858L7191a12373d8004n4684A48026
16112A89440J96475c6784A11522J95138C7147J47128J04900h631C81038B8464
16101A03061J20072m0399n5494J1753R5847J7571a41540f1206C27725a5637B30399
16089A72088O6138D9519a46513C12641a6904j68611f3033B40628a72666B31563
16078A76674G5210d2491B20283a25210C69652i2108j8161D2831c44989B06907
16067a75888b0203F2910J8358a80235B37464K15157e4646B44334F5094B5758J24105
16056A49863b7466B81262E4427i2599M0045m9210A57486a14284B36665I9655D4594
16044d0314C06448b73540a3124m9669B851f8325C47278B5302e8955k62186J07565
$$ y = [247888, 101438, 335138, -101816, -175327, 69858, 107049, -112373, -48004, -102688, 148026, 189440, 385915, -36784, 111522, 306660, 37147, 184275, 289175, -8631, 381038, 28464, 103061, 223133, 182734, 127240, 138993, 234840, 252411, -141540, -61206, 327725, -15637, 230399, 172088, 238226, 49519, -146513, 312641, -16904, -185515, -63033, 240628, -172666, 231563, 176674, 75210, -42491, 220283, -125210, 369652, -92108, -110269, 42831, -344989, 206907, -175888, -20203, 62910, 81268, -180235, 237464, 452621, -54646, 244334, 65094, 25758, 149863, -27466, 281262, 54427, -92599, -52554, -101764, 157486, -114284, 236665, 99655, 44594, -40314, 306448, -273540, -13124, -62793, 2851, -68325, 347278, 25302, -58955, -321141, -213576]
16033b13576J244f9669j54883B1357b95260L4943A04170c15432a40811A94750
16022A60079a61092m25b8617j85454C770b85995J18268D23971h8331D43872f7362
16010g0067K1597j41103g4053A7898J11972c2726A0410K5665Q4686B5576J06769
15999A32345j3233a79502a3853k33775M6052Q3244K438a4635r8707J4176B35170
15987C75159I7173c51726D94751A27061N8069f0058D24920A42908J3854p0313
15977H6449Q9389J48018A3419L08442i48I6358A8138M4525c07088a12115A384
15965I0060q043c080C46456D0158b2288o2621A3338K79249A35621a9384C14654
15953b51383A49593a7816k00356k46025J75455F4802C1685b73640j192F1415a25342
$$ y = [-213576, -212332, -69669, -224552, 21357, -295260, -260317, 104170, -315432, -140811, 194750, 160079, -161092, -161517, -28617, -214071, 3770, -285995, -167727, 423971, -88331, 443872, -67362, -70067, -48470, -189573, -74053, 17898, 129870, -32726, 10410, 36075, 120761, 25576, 132345, 119112, -179502, -13853, -247628, -201576, -118332, -115894, -14635, -113342, -99166, 235170, 375159, 97173, -351726, 494751, 127061, 185130, -60058, 424920, 142908, 156762, 86449, 175838, 323856, 13419, 321861, -948, 96358, 18138, 62663, -307088, -112115, 1384, 90060, 82017, -3080, 346456, 40158, -22288, -84909, 13338, 292587, 135621, -19384, 314654, -251383, 149593, -17816, -218172, -464197, -288742, 64802, 31685, -273640, -274832, 61415, -125342]
15941i9813D35433b60934a9877j2734C9239b06363b2388B65615b13337A31985
15930h7006p8379A63554l4184b8390k31584B39551c1396q6088j6700B02414c46867
15918b49986F884f4972A85236p4678i9728A08409a85826K0453m6421E7212a07987
15906d3294A03524D6345J6073c23685a33616C44725c0932E0115c6783B53718c6144
15894a04425j78700J19628j00507c7067r3214j68427B41495B4361i9018m16268
15884e15286b44645e2047C8561J28116P79K71415a37815j99381L1874A75658G1774
15872B16984a00585D8946a93714g616l97185a42233j22701j8837B01766d1087
15861b44807N4675A8685h5622j59183j45338a79762k4195B04911D0342o466N4579
$$ y = [-99813, 435433, -260934, -19877, -32611, 39239, -206363, -22388, 265615, -213337, 131985, -87006, -165385, 163554, 129370, -28390, -259974, 239551, -31396, -117484, -134184, 202414, -346867, -249986, 6884, -64972, 185236, 110558, -99728, 108409, -185826, -165373, -211794, 57212, -107987, -43294, 103524, 46345, 62418, -323685, -133616, 344725, -30932, 50115, -36783, 253718, -36144, -104425, -283125, -163497, -264004, -37067, -130281, -298708, 241495, 24361, -99018, -515286, -244645, -52047, 38561, 166677, 167456, 438871, -137815, -337196, -305322, 175658, 71774, 216984, -100585, 48946, -193714, -7616, -404801, -142233, -264934, -283771, 201766, -41087, -244807, -190132, 18685, -85622, -244805, -390143, -179762, -203957, 204911, 40342, 33876, 88455]
15850H8455J90513j18851D409c42451e1502B06326a09208q2370B3952O8061f120
15838B94304j32469m1280K15842c11623L0208B0681b23181H38K2287l180a69389
15826c01840c1691j46234A20140b60390A29210b10483N9604O7690D8873a39442
15815a89178B80680b84409i3450k7393L7080c9625j71038H9944h8623k49876C15945
15803C905c77208a63653P5898m2952e0564m4832A96641J07246d95092a98692B61112
15791B66774B3488L9209A7644d27780D74667D9163a68934k2696H0606k269b70077
15779A30904a27408F6255e2086j679a0635j64699B14152O842f2991J9747l48769
15768c92013a06674d3341k13251j52482J84414f6477j62399j5581B60440A0238
$$ y = [88455, 278968, 160117, 4409, -342451, -51502, 206326, -109208, -191578, 23952, 92013, -6120, 294304, 161835, 120555, 336397, -311623, -281415, 20681, -223181, 838, 23125, 19945, -169389, -301840, -31691, -177925, 120140, -260390, 129210, -210483, -150879, -83189, 48873, -139442, -189178, 280680, -284409, -93450, -120843, -83763, -39625, -210663, 89944, -88623, -338499, 315945, 3905, -377208, -163653, -87755, -130707, -50564, -95396, 196641, 303887, -495092, -198692, 261112, 266774, 23488, 62697, 17644, -427780, 474667, 49163, -168934, -191630, 80606, 78337, -270077, 130904, -127408, 66255, -52086, -53765, -10635, -175334, 214152, 220994, -62991, -43244, -392013, -106674, -43341, -256592, -409074, -224660, -66477, -228876, -244457, 260440, 10238]
15757D1436J29437A5624a26153B57311g7569n2455j68792j56908B11716b962D5864
15745A22548K6337l0960a43568N7888A08644P9600o6167a47242B51655o8826c73445
15733b5636A26552l8839b20498B49658L977a46123N4018B61238b00328A88657
15722D4053c70218j4274A2248d0590j63172q1800J08902g2394k3832j55118G2906
15710f1217n2205m0616g254A76927G2274b91375D2789K8273R3625g0441l6131
15699a06572j0905H7777L34048a5967l53588J69758C68151A1483b32203D9834
15688c14195i9041E8286C811a80194A75989a70453b2627H8904a24695M5074K0710
15677e8911j9576B00408G1994a44847D7337a04377j15059e6503H0965J7205m044
$$ y = [41436, 170873, 15624, -126153, 257311, -77569, -130024, -298816, -455724, 211716, -2962, 45864, 122548, 148885, 117925, -143568, -85680, 108644, 188244, 122077, -147242, 251655, 182829, -373445, -25636, 126552, 87713, -220498, 249658, 253635, -146123, -92105, 261238, -200328, 188657, 44053, -370218, -384492, 12248, -40590, -203762, -285562, -176660, -72394, -96226, -251344, 72906, -61217, -113422, -154038, -7254, 176927, 72274, -291375, 42789, 71062, 164687, -70441, -106572, -117477, 87777, 421825, -15967, -369555, -199797, 368151, 11483, -232203, 49834, -314195, -99041, 58286, 3811, -180194, 175989, -170453, -22627, 88904, -124695, -79621, -58911, -78487, 200408, 71994, -144847, 47337, -104377, -219436, -56503, 80965, 98170, 94126]
15666I4126l0800J86033o8675C6037a1247l69637B1876a49170A5998a32883j05861
15655b38744j14873h3055j40654B32322g5502i521D0632b76695B61680j14310
15645A47370A0462a82826b5819k1242j3435A30520c06002b2509B86379b91865
15634b65048C5038J12763P8327a09362A47813h6005l3350A3053P8725a47058f7836
15622D9248K18209f1041A97322c6922j94569A21722J79592B1316b93450J02638
15612a90812I5084J3519B3626c63570A43665O9495c1320I1019b2956D0465J65141
15601B05606a6208j76102E7584a40878N7226F9349b5268p8503c7448n39787i7509
15589e6483k02647A02316a54657j21843a8165l57327E3172h1714k6284J4930l3170
$$ y = [94126, 63326, 249359, 180684, 36037, -11247, -380884, 21876, -149170, 15998, -132883, -238744, -353617, -83055, -223709, 232322, -75502, -9521, 40632, -276695, 261680, 147370, 10462, -182826, -25819, -47061, -60496, 130520, -306002, -22509, 286379, -291865, -265048, 35038, 147801, 226128, -109362, 147813, -86005, -119355, 13053, 91778, -147058, -67836, 49248, 267457, -61041, 197322, -36922, -231491, 121722, 301314, 21316, -293450, -190812, 95084, 108603, 23626, -363570, 143665, 213160, -31320, 91019, -22956, 40465, 205606, -16208, -192310, 57584, -140878, -83652, 69349, -25268, -103771, -37448, -577235, -97509, -56483, -259130, 102316, -154657, -276500, -18165, -375492, 53172, -81714, -107998, -93068, -126238]
15578a26238a4162k93797a8171k57481J10611B33306J8050a08331F0155a47730
15567d9474B52381b2612I2071M5521a81418A22870P6867c4316j96042A51106O6372
15556B17478c04002a7967m89554H1024c8629B35288G6307b2805r0912r82A5323
15544B05967b12319b3753j02772f1828D6308o804J38412a90520A78644o7836B3171
15532b1313l7989E0377b0151k41448E7431b30747A7025J93762b79875A00746N7591
15521A58337g4554B9798J78054n8840d20541B40332a38621A6463a78497l909b8838
15509b50216f7073a9299A6436J1960M3911A0567b53208D3991a92041B27039I6433
15497C51268e6775k5764l0986L5291j43520B85684i9117b0404C29158a02350b5827
$$ y = [-126238, -14162, -307959, -18171, -275652, -165041, 233306, 251356, -108331, 60155, -147730, -49474, 252381, -22612, 92071, 137592, -181418, 122870, 199737, -34316, -230358, 151106, 217478, -304002, -17967, -507521, 81024, -38629, 235288, 76307, -22805, -113717, -114699, 15323, 205967, -212319, -23753, -126525, -61828, 46308, 39504, 177916, -190520, 178644, 110808, 23171, -21313, -59302, 50377, -20151, -261599, 57431, -230747, 17025, 210787, -279875, 100746, 158337, -74554, 29798, 207852, 149012, -420541, 240332, -138621, 16463, -178497, -182406, -28838, -250216, -67073, -19299, 16436, 28396, 72307, 10567, -253208, 43991, -192041, 227039, 96433, 351268, -56775, -82539, -113525, -78234, -221754, 285684, -99117, -20404, 329158, -102350, -25827]
15485A91568b53843A89179b5582I2725J1114e4652D1345P9351K0694C2971a18543
15473a56314D14934e4064D8649P5838k876K00863a07086j52043M532A20711B6586
15461A15570i8962j4190C57706b6688E5992O7882E9620o649K29524a6404B25883
15449A71718G6231f2832j27390B3790a09164A18022J82039A8290Q7510a66453
15438a26819B62022n1337a41473m6120G3021b50993L4886Q3316A79245b59793
15427B81295c2487l7860A75038f2841j59977M5516B54943F6094f680o2997k5391
15416i5068j21678f4459B14667J15161a14699E5662a40388k07548I4906b07002
15405D2478a17463E3965a3512A29447b78184a3101G0751A8480c1609m3242c1726
$$ y = [191568, -253843, 189179, -25582, 92725, 103839, -54652, 41345, 120696, 141390, 32971, -118543, -156314, 414934, -54064, 48649, 124487, 121611, 322474, -107086, -259129, -254597, 120711, 26586, 115570, -98962, -113152, 357706, -26688, 55992, 123874, 59620, 52971, 282495, -16404, 225883, 171718, 76231, -62832, -190222, 23790, -109164, 118022, 300061, 18290, 105800, -166453, -126819, 262022, 210685, -141473, -187593, 73021, -250993, -216107, -132791, 179245, -259793, 281295, -32487, -70347, 175038, -62841, -222818, -177302, 254943, 66094, -6680, -69677, -95068, -216746, -64459, 214667, 329828, -114699, 55662, -140388, -347936, 94906, -207002, 42478, -117463, 53965, -13512, 129447, -278184, -13101, 70751, 18480, -31609, -74851, -31726]
15393e1253q3794H7087a00584j6779r959j33976A10288a44511b2674n4370j0147
15382h7191r11A0072i1181A39069E3480J02787c3036J4410k42672b1217k54936
15371b76153F85597A5160a01102B67557E4313b46487A12348e2825A10348a88143
15360B06964c4236B09257E4732b11397g9319A44248a53698I0184M3922J79442
15350C13548A39465J25497a67248P7118a6637l3176m595A48161J1734h3264I5043
15338A76161K9907k6999H994J9076c9628j16259l70981a7655B20141a44790M8031
15327i6759D9733J50929I1317a85133h4259A18643a31034E6092O4814R670R3641
15316B24217d8950k1007o9360l36055F4896N5323K75887j76246i8313k58393D13259
$$ y = [-51253, -135047, 87087, -100584, -117363, -127322, -261298, 110288, -144511, -22674, -77044, -87191, -88102, 10072, -91181, 139069, 53480, 156267, -33036, -18626, -261298, -21217, -276153, 685597, 15160, -101102, 267557, 54313, -246487, 112348, -52825, 110348, -188143, 206964, -34236, 209257, 54732, -211397, -79319, 144248, -153698, 90184, 134106, 313548, 139465, 264962, -167248, -90130, -16637, -49813, -54408, 148161, 159895, -83264, 95043, 176161, 206068, 179069, 8994, 28070, -39628, -155887, -526868, -17655, 220141, -144790, -96759, 49733, 200662, 91317, -185133, -84259, 118643, -131034, 56092, 120906, 130576, 224217, -48950, -69957, -139317, -475372, 64896, 120219, 396106, 219860, -98313, -356706, 413259]
15304A50893j5l5448J70557a18946l5291H667d4393A42890b37215L8161b2040
15292H8116b90213n6325h0696L7354j1134l80642a36082B07320C3509a9523k09184
15281b28707C31122K5238A33948m2639A4381c9885A18110J8272K00689h6526H9349
15269g5307E0149O924b9507r06B96264J72568j78826d16550J93682E5133P3991
15258A29124c5291G9501i783A64253a62708C00719K60245j96074p3394L80390
15248F71886j47905P83771P73592o08679K51079k73971o95732A83879B7232L31847
15238C59079A06137J41817a38711C79786h1113A18392M50680d2360A71892o9450
15228A02442B8424L11204b93323f5925B01502a23942b4834I2093j2732b546B63379
$$ y = [150893, 150878, 115430, 285987, -118946, -154237, 8667, -44393, 142890, -237215, -199054, -22040, 88116, -290213, -346538, -80696, -43342, -54476, -435118, -136082, 207320, 33509, -19523, -228707, 331122, 356360, 133948, 91309, 14381, -39885, 118110, 136382, 337071, -86526, 89349, -75307, 50149, 57073, -29507, -30413, 296264, 468832, 290006, -416550, -222868, 55133, 129124, -35291, 79501, -9783, 164253, -162708, 300719, 560964, 364890, 291496, 671886, 523981, 1307752, 2081344, 1472665, 1723744, 1449773, 754041, 183879, 27232, 359079, 106137, 247954, -138711, 379786, -81113, 118392, 569072, -42360, 171892, 102442, 28424, 339628, -293323, -65925, 201502, -123942, -24834, 92093, 79361, -2546, 263379]
15216B26415l8261k2603F7251N8610c98771a14068p2776B00394J70403A61691
15205A3434Q3465c23002a2240j67669A60179r451n50n4839J94788c269B07554
15193A52081l7774K41622P703b79748h3836F05697k78442k7106A03727a10539
15182b4729A22467k9258K66455a33140A92189Q1811a64186B10553i6435E80748
15171b3434C92741a0397p1300B46370D1923L12093f4377A82405J73129L02241
15161F57775A06625k0170J38657O575a0971F1224J27869J41964e9091F0083J59068
15150B19151l929e3939K3402A731K99510J84514A35506K34667A5692a28824I3641
15138B32076A10554a60499A28418h1090j0428C7111j7953L43791E2035I211K81955
$$ y = [226415, 188154, 165551, 67251, 125861, -398771, -114068, -186844, 200394, 370797, 161691, 13434, 96899, -323002, -12240, -179909, 160179, 150728, 150178, 95339, 290127, -3269, 207554, 152081, 114307, 355929, 363632, -279748, -83836, 605697, 327255, 300149, 103727, -110539, -24729, 122467, 93209, 359664, -133140, 192189, 274000, -164186, 210553, -96435, 580748, -23434, 392741, -10397, -81697, 246370, 41923, 354016, -64377, 182405, 355534, 657775, 106625, 86455, 225112, 231687, -10971, 61224, 189093, 331057, -59091, 60083, 219151, 215222, -53939, -30537, 1731, 301241, 485755, 135506, 370173, 15692, -128824, 93641, 232076, 110554, -160499, 128418, -81090, -91518, 37111, 19158, 362949, 52035, 9211, 291166]
15127B91166A11134m4922K71791E2959J88211r7483h0964l7866A14251c2115C67921
15115a26297B04734k592P9719d1839C51742G9844J41288d5613b0700D4194K8204
15104G2398L65058C744J16728C5124a01027j6511B39242E8822J11357R9428J91782
15093D61389H7253l1961L45527a56475C20843E4184f8692A68119d2022J9358B65820
15081E1881J7464Q4254J18704J4524a38356J6223B64983a95164D89451k26099
15071B63352J32767j45208j1880J09691j48954a18210J9977c3406F5474M19110
15061D84584A57962J1411a6583o9810A47112m4093f5793D175K6046b24389C54536
15049D28445j14661G4097M5768K0980K25482c938C1259J22318k7286k6076K82168
$$ y = [291166, 111134, 66212, 338003, 52959, 241170, 143687, -80964, -118830, 114251, -32115, 367921, -126297, 204734, 202142, 281861, -41839, 351742, 79844, 221132, -45613, -20700, 44194, 72398, 437456, 3744, 120472, 35124, -101027, -117538, 239242, 58822, 170179, 269607, 461389, 87253, 55292, 400819, -156475, 320843, 54184, -68692, 168119, -42022, -22664, 265820, 51881, 69345, 153599, 272303, 286827, -138356, -122133, 264983, -195164, 489451, 263352, 396119, 250911, 239031, 348722, 199768, -118210, -98233, -33406, 65474, 484584, 157962, 169373, -16583, -86393, 147112, 103019, -65793, 4175, 30221, -224389, 354536, 428445, 313784, 74097, 119865, 140845, 366327, -3938, 31259, 153577, 126291, 100215, 382383]
15038C82383K5482a39402B35153J3043A1762K58354p5160p0757J57609a32517
15027B218J00900J73355o8776J30830A58882a21522r8656C62993a26730B0667
15016A01799P0957q2660J07003b51979B98075r091P0321o1675L64402A37508f8973
15004B44913L17370C5351N10628g0187j9293B57266a54423C52947g334B99588
14993C29792A22811a6264A09232K9190K94239e2891B60310Q1653P0140A31587
14982A25709K60427l9216A44098J8743Q6304J69582j96143R1139j12056p7394
14972A24273O5726e2121K2954k47573B50237L9597m2402m765o8321F9475K33307
14961C02782A30175C6069M31144j17822A60485Q2877m4030b22741E26424B50557
$$ y = [382383, 407865, -139402, 235153, 248196, 11762, 270116, 194956, 124199, 281808, -132517, 2218, 103118, 276473, 207697, 338527, 158882, -121522, -220178, 362993, -126730, 20667, 101799, 172756, 90096, 197099, -251979, 298075, 288984, 359305, 297630, 662032, 137508, -68973, 244913, 562283, 35351, 545979, -70187, -89480, 257266, -154423, 352947, -7334, 299588, 329792, 122811, -16264, 109232, 138422, 432661, -52891, 260310, 341963, 412103, 131587, 125709, 386136, 346920, 144098, 162841, 249145, 418727, 222584, 313723, 201667, 124273, 189999, -52121, -29167, -276740, 250237, 289834, 247432, 242667, 174346, 69475, 302782, 130175, 36069, 467213, 349391, 160485, 243362, 199332, -222741, 526424, 250557]
14950C25050K82230l0402j40186A79464J40519k0283h5730C31065J18346k03825
14940B45586a21338D54869j92742K59502B24572J22204f2821A03517K23495J31319
14930D58331A04294O6510K88130q0720C6637L01315j59037K65383A45166m556
14920A40610K46961J12096j90159A35975M9390K1991J82434q2110K1635H1674
14909D54639j04157j0103J36766A68079N07025B79091k8135Q5589m144A3182M4399
14898E7581M899M77300B67994J51308j51311A26740J96382l3460J62264F5892
14887D23175J86878j47753E8585L25069K12969k20212A00637L37182j35787J15026
14877D17058K33026j05206k44827J67907j04153r4845J24486j2035k4571J4611
$$ y = [325050, 607280, 576878, 436692, 179464, 319983, 299700, -85730, 331065, 449411, 245586, -121338, 454869, 262127, 521629, 224572, 346776, -62821, 103517, 327012, 458331, 104294, 170804, 458934, 378214, 36637, 337952, 178915, 444298, 145166, 140610, 387571, 499667, 309508, 135975, 185365, 207356, 389790, 307680, 329315, 81674, 454639, 350482, 340379, 477145, 168079, 675104, 279091, 250956, 336545, 332401, 13182, 57581, 62480, 539780, 267994, 419302, 267991, 126740, 323122, 289662, 451926, 65892, 423175, 610053, 462300, 58585, 383654, 596623, 376411, 100637, 437819, 302032, 417058, 650084, 544878, 300051, 467958, 363805, 268960, 393446, 381411, 356840, 371451]
14867C71451j20133p5313J01248L4596J20004K9238Q3843k12529p771Q5800m5694
14856C64740J50654k22163M0313K45381k49769L66901B42784M01245N6041j86709
14846E13361J74038B75679Q7360R7445o9691J14235j81648N3970G9934N20196
14836F00130A34205K57582P5353l4239L48160C52818r1187L14086R5829j85576
14826D85970J19387A82402M95125J1890B16424L38120r0244k21218M79264j22565
14816E99781j89921O2123j23464J33899k01868L56656K4500B32523K14161L67131
14806H13815j91240J96832A36789K82214k02549J89811K30951j3247j29424N2249
14796E46794J15823j04944k36676L71093C28662L04694B54200O27984j64809m0439
$$ y = [371451, 251318, 176005, 277253, 311849, 431853, 461091, 544934, 332405, 324634, 410434, 364740, 515394, 293231, 333544, 578925, 329156, 696057, 242784, 644029, 700070, 513361, 687399, 275679, 363039, 460484, 390793, 505028, 323380, 377350, 79934, 600130, 134205, 391787, 467140, 432901, 781061, 352818, 261631, 575717, 671546, 485970, 605357, 182402, 677527, 689417, 216424, 554544, 464300, 243082, 722346, 599781, 409860, 471983, 348519, 482418, 280550, 637206, 661706, 232523, 446684, 813815, 622575, 819407, 136789, 419003, 216454, 406265, 637216, 623969, 494545, 546794, 662617, 557673, 320997, 692090, 328662, 633356, 254200, 882184, 717375, 676936]
14786F76936k30624K34120j53707K6031n4891M4744K2931N3914o4497K5709q7581
14775D93085J21755B89341j31121N06616M466J73056j2415l47780j74760L17948
14765F25351J4827A94595K75655P802J25347J11984K00908l45357K00323k11516
14755E59741J30828j9111J384j04955L62204m07569J08669K49495K11116m75931
14745F15871L47612l34681J394o7077K56856C54009L07650N34037E01587O6686
14735E68273K9244K86279J7044j19987N1835j94496J20898j24614j5771l7877
14725E80828K26838M62682n96166J79102K16334k52874k16079J18301Q4338K49320
14715A052624k55167j90729J60574o1899l3608L56038l16595m9634J00108J8842
$$ y = [676936, 446312, 680432, 526725, 552756, 497865, 542609, 565540, 619454, 554957, 580666, 493085, 614840, 289341, 158220, 664836, 669302, 842358, 829943, 482163, 307403, 625351, 640178, 194595, 470250, 478052, 603399, 715383, 916291, 570934, 771257, 559741, 690569, 671458, 672842, 567887, 930091, 522522, 631191, 880686, 1091802, 615871, 963483, 628802, 630196, 563119, 819975, 354009, 661659, 1195696, 501587, 568273, 597517, 883796, 900840, 780853, 832688, 638192, 759090, 634476, 618705, 580828, 807666, 1270348, 674182, 853284, 1069618, 816744, 600665, 718966, 803304, 1052624, 797457, 606728, 767302, 705403, 671795, 1027833, 711238, 661604, 761712, 780554]
14705G80554K14153M6728k12417K11818k06651J75379k87229L66037m22188J77551
14695H43735k4887M7619M65751k23555j72479j66950N5480N34196n43947K58033
14685A072996j04385O0301J94631q2463l01965M05385k61542Q1716R0613l05822
14675H49465L18859l20382J04189j5863L00059N3442D92368N36641l25251J34363
14665H38121L82454l19272q2212J69012L16209k99957K9493N7447J30097N3671
14655A275063k96940L50127n32706L36617l02685N05147j25922p5182K62749j91514
14645A204754J5133k49r6545K2561j50836L85570K2211Q6562k88939J39708q9552
14634A250378L22998m72387L58502Q0302j16712j3564q7802J94865j74602n40884
$$ y = [780554, 994707, 1041435, 829018, 1040836, 834185, 1009564, 722335, 1088372, 666184, 843735, 818848, 866467, 1332218, 1108663, 936184, 769234, 824714, 1358910, 814963, 1072996, 968611, 1028912, 1223543, 1141080, 839115, 1244500, 982958, 1064674, 1155287, 849465, 1168324, 847942, 952131, 936268, 1236327, 1289769, 492368, 1029009, 703758, 838121, 1220575, 901303, 819091, 988103, 1304312, 1004355, 1033848, 1091295, 1221392, 1275063, 978123, 1328250, 795544, 1132161, 829476, 1334623, 1208701, 1133519, 1396268, 1204754, 1219887, 1219638, 1123093, 1145654, 994818, 1380388, 1402599, 1489161, 1200222, 1339930, 1250378, 1573376, 1100989, 1459491, 1539793, 1423081, 1409517, 1321715, 1516580, 1341978, 801094]
14624H01094O63494j44605P8854j89752K76865P3107K04790k66388r0632J00846
14614A507673K19660l33104J78497k91050L17443J84325l69439K62533J76518
14605A853056j98277J59689l52688L59129j31813k55556L30100l24331M56920
14596A896229k49782o7077J66346L49866k03799P6065m69214M25252K63032o13195
14586A573723o1823K11047J50802r899J61473j67385j99683N29444k43953J38889
14576B082635N074n6180K85373J69011m49493K21359q8590N2627L03929L2310
14566B558055k1944p9980l7681L94879j30765J2716k0489O9815N32076j79001
14556C097681J36737K10848R1815L90868N00301M37799J223746J382020L811955
$$ y = [801094, 1464588, 1319983, 1398837, 1209085, 1485950, 1559057, 1763847, 1497459, 1406827, 1507673, 1727333, 1394229, 1572726, 1281676, 1599119, 1783444, 1414005, 1676538, 1853056, 1654779, 1814468, 1461780, 1820909, 1689096, 1433540, 1763640, 1439309, 1896229, 1646447, 1579370, 1745716, 2095582, 1891783, 1967848, 1498634, 1923886, 2186918, 1573723, 1511900, 1722947, 1873749, 1863850, 2025323, 1857938, 1658255, 2187699, 1943746, 2082635, 2087709, 2031529, 2316902, 2485913, 2036420, 2257779, 2169189, 2221816, 2525745, 2558055, 2536111, 2456131, 2418450, 2813329, 2682564, 2695280, 2674791, 2744606, 3276682, 3097681, 3234418, 3445266, 3537081, 3927949, 4428250, 4866049, 6089795, 7471815, 11283770]
14547A1283770P585997J6152109Q704333k0401579j0297603l636109m549000j709423
14539C132495n25781l02748l16936K47040k01303K35362l56324L24221M9748r7869
14529B187905j40784M05479L00285L6489j76296j68955n4879K20618n05660J89298
14519B293500P52085k57308j43049K64326k08736J61142K3271m8253J33776m83390
14509B487364N79152k26139M51322P2606k91728K03414k50672K01408j04423J53105
14499C275409o5691l8352j17933M42945L46226n20623K12462j81668J44708L69150
14489C866633l89926N7032K39211K28442m71493j398J38484L38632R1265j37153
14479C959729L1623J62600L7418l33762M14214l14342M45457k64673L11958J61820
$$ y = [11283770, 18869767, 35021876, 43726209, 23324630, 13027027, 9390918, 4841918, 3132495, 2606714, 2303966, 1987030, 2234070, 2032767, 2268129, 1911805, 2236026, 2285774, 2187905, 2047121, 2452600, 2752885, 2789374, 2613078, 2444123, 2389244, 2609862, 2104202, 2293500, 3045585, 2788277, 2645228, 2909554, 2700818, 2861960, 2885231, 2836978, 2970754, 2487364, 3066516, 2840377, 3291699, 3364305, 3072577, 3275991, 3025319, 3226727, 3122304, 3275409, 3209718, 3171366, 3053433, 3496378, 3842604, 3321981, 3534443, 3352775, 3497483, 3866633, 3476707, 3533739, 3772950, 4001392, 3529899, 3528501, 3666985, 4005617, 4096882, 3959729, 3991352, 4153952, 4191370, 3857608, 4271822, 3957480, 4402937, 4138264, 4450222, 4612042]
14469D612042j03402J60431L8378j16927L64235q230L24954k66051j722k88300
14459D715408M42715l5425L40353O8805j47117k4249o4660K61418k51807L97256
14449E702697m3391J19412J25251J87469k50850K23368J7803m9515J86367J82755
14439F401366l01769J61894P687l7821J94478o4642N15583O8107J45785K83629
14429G374297j69523q811J20696K70101J04743J07423j78930J70559J62894K82388
14419H235837L75438n01009M90716n6083J92173m1717J41849K25355P571L10846
14409I380976o0515J64430K60286L4195L34817o7647L74525J57463L68860j41398
14399A0805992M86795j02022Q5744L54797l5537Q53694k05479J31602M11608k7850
$$ y = [4612042, 4508640, 4669071, 4707449, 4590522, 4954757, 4946527, 5271481, 5005430, 5003708, 4715408, 5158123, 5122698, 5463051, 5531856, 5384739, 5360490, 5295830, 5557248, 5305441, 5702697, 5659306, 5778718, 5903969, 6091438, 5840588, 6063956, 6081759, 6032244, 6218611, 6401366, 6099597, 6261491, 6269178, 6231357, 6425835, 6361193, 6876776, 6944883, 7090668, 7374297, 7204774, 7195963, 7316659, 7586760, 7691503, 7798926, 7619996, 7790555, 7953449, 8235837, 8611275, 8110266, 8600982, 8544899, 8737072, 8695355, 8837204, 9062559, 9070130, 9380976, 9320461, 9484891, 9745177, 9779372, 10114189, 10046542, 10421067, 10578530, 10947390, 10805992, 11292787, 11190765, 11276509, 11631306, 11595769, 12449463, 12243984, 12375586, 12787194, 12759344]
14389A2759344K10695O36979j07444K9621K28920N76855k59366Q74630l57137
14380A4593097O76360M54249M53886R786K90975o9504M81524M78201K51370K99887
14370A7919831L63668N05054L74061K32284N83106J78452O07402N2270R07904
14361B1724032J71572P22120L34509Q11053L27402P63248L70298K99713R41075
14352B6465022K40448J062770M75185O75695P80251M86193Q58436J402974P09975
14343C3156949N30701R16232J047347R47883M66443J057302J685080J182319R76228
14334D1966484R91998J191386J940588Q40526J417220J967413J397199K070414
14326E3783228J561701J263725K407024J424298K494604K097470K446419K342710
$$ y = [12759344, 12970039, 13607018, 13499574, 13529195, 13758115, 14334970, 14075604, 14950234, 14593097, 15269457, 15723706, 16177592, 16187378, 16478353, 16408849, 16890373, 17368574, 17619944, 17919831, 18283499, 18788553, 19162614, 19394898, 19978004, 20156456, 20763858, 20816128, 21724032, 21895604, 22617724, 22952233, 23763286, 24090688, 24853936, 25224234, 25523947, 26465022, 26705470, 27768240, 28243425, 28919120, 29699371, 30185564, 31044000, 32446974, 33156949, 33687650, 34603882, 35651229, 36599112, 37065555, 38122857, 39807937, 40990256, 41966484, 42958482, 44149868, 46090456, 46930982, 48348202, 50315615, 51712814, 53783228, 55344929, 56608654, 59015678, 60439976, 62934580, 65032050, 67478469, 69821179]
14318F9821179K381598K824222K823106L049097L175544L143918L383490L743307
14310I4345461L901266L966222M418825M229524M860385N021819N601425N773827
14302A32118754N809009O361527O676681P335120P316703P989672Q259839R325260
14294A91192565R320286R763637J0560955J0997498J1437480J2545375J2552667
14287B68370463J3106719J3688528J3934572J4540220J4725667J5100012J4981872
14280C68448053J4593993J4358516J4189373J3469902J1935108J0986508R843079
14273D57824532P412188M648242J307895k91741q15451l694453l793870o164924
14265D56432418q783888r890540j1226948j2626350j4093334j4446881j5451940
$$ y = [69821179, 72202777, 75026999, 77850105, 80899202, 84074746, 87218664, 90602154, 94345461, 98246727, 102212949, 106631774, 110861298, 115721683, 120743502, 126344927, 132118754, 137927763, 144289290, 150965971, 158301091, 165617794, 173607466, 181867305, 191192565, 200512851, 210276488, 220837443, 231834941, 243272421, 255817796, 268370463, 281477182, 295165710, 309100282, 323640502, 338366169, 353466181, 368448053, 383042046, 397400562, 411589935, 425059837, 436994945, 447981453, 457824532, 465236720, 469884962, 471192857, 470901116, 470085665, 466391212, 462597342, 456432418, 447648530, 437757990, 426531042, 413904692, 399811358, 385364477, 369912537]
14258C69912537j5795508j5633883j5650843j5392189j4665447j3493726j3134097
14251B66146844j3293424j2316820j2010183j1093848j0771463j0274193r231772
14244A87155141q765049q292278q084216p269855p306493o845996n861437n383873
14236A29345944n918536n359534m999295m624904m276995m050957l555229m103794
14228I2456700l677814l741147k906043k959671k906226k907351k658989k217863
14220F8481596j972260k422399k414905j914643k229664j816882j394374j171083
14212E3145386j872673j752209j543347j492492j087629n50791j558311j307816
14204D1980118j168310j469753j051590n19463l51777j879104o43563j202175
$$ y = [369912537, 354117029, 338483146, 322832303, 307440114, 292774667, 279280941, 266146844, 252853420, 240536600, 228526417, 217432569, 206661106, 196386913, 187155141, 178390092, 170097814, 162013598, 154743743, 147437250, 140591254, 134729817, 129345944, 123427408, 118067874, 113068579, 108443675, 104166680, 100115723, 96560494, 92456700, 88778886, 85037739, 82131696, 79172025, 76265799, 73358448, 70699459, 68481596, 66509336, 64086937, 61672032, 59757389, 57527725, 55710843, 54316469, 53145386, 51272713, 49520504, 47977157, 46484665, 45397036, 44846245, 43287934, 41980118, 40811808, 39342055, 38290465, 37771002, 37419225, 35540121, 34896558, 33694383]
14196C3694383o50923j075947m55337p25932r05096q30432q65912n57978m78410
14187B7148416m80709n93340n31279r43553l22863p92247l12217n72348m57806
14178B2142054l19275l28699r03126m44939m68346j92208l47519k54508n30578
14169A8352856q4181o43439K11440q91298j85529l48353o9814l08005q03199K65717
14159A5496195l88451m23747m31335r6692m9544k45890k97561l66493j55641k01695
14149A2839146K29594n62250k95168m11778o1919J77964j69879l85355l35254
14140A1025101R3121m10460J3882k96233R5566k44498l48008J51497n37373M42448
14130I985043k98742n79079R5712Q6678j09251k76287k27729l19423J08084q8565
$$ y = [33694383, 33043460, 31967513, 31512176, 30786244, 29881148, 29050716, 28184804, 27626826, 27148416, 26667707, 26074367, 25543088, 24599535, 24276672, 23484425, 23172208, 22599860, 22142054, 21822779, 21494080, 20590954, 20146015, 19677669, 19485461, 19137942, 18883434, 18352856, 18268675, 17625236, 17836676, 16945378, 16759849, 16411496, 16341682, 16033677, 15230478, 15496195, 15107744, 14683997, 14252662, 14155970, 14106426, 13860536, 13562975, 13196482, 13040841, 12839146, 13068740, 12506490, 12211322, 11799544, 11737625, 11915589, 11745710, 11360355, 11025101, 11118222, 10707762, 10721644, 10425411, 10520977, 10276479, 9928471, 10079968, 9542595, 9985043, 9686301, 9107222, 9202934, 9289612, 9180361, 8904074, 8676345, 8356922, 8465006, 8376441]
14120H376441J31788m02688J29902k20090o8365K35998n77615m63j42664k53204
14110G209040M04598n01172K31361m95152j60544L31027k3460l00514k49387Q0271
14100F526068l44237M4130K97482j59323l26896j03952k13511J89841m1639k5508
14090E842455l2759l35998K73727k8384m10408m332k60182L25889M9320p2354
14080E346974l92689J69081r7553k86245j2387Q441k03642O7393k03634J50851
14070D546590l66736J30127M04011k50667P9243k4597l69632R3678J45497J87955
14060D575469n37306j4679k26789M91041m36132k14840P77435l85090j87485q9581
14050C752043K3944L48000n79930J66534o19961O56261j25313l50817J84308M7423
$$ y = [8376441, 8508229, 8105541, 8235443, 8015353, 7946988, 8182986, 7605371, 7604908, 7462244, 7209040, 7613638, 7112466, 7343827, 6848675, 6688131, 7019158, 6995698, 6695184, 6445797, 6526068, 6181831, 6225961, 6523443, 6364120, 6037224, 5933272, 5719761, 5909602, 5867963, 5842455, 5809696, 5473698, 5747425, 5719041, 5308633, 5304301, 5044119, 5370008, 5419328, 5346974, 4954285, 5123366, 5025813, 4739568, 4727181, 4735622, 4531980, 4599373, 4395739, 4546590, 4179854, 4309981, 4713992, 4463325, 4542568, 4517971, 4148339, 4242017, 4387514, 4575469, 4038163, 4023484, 3796695, 4287736, 3851604, 3636764, 4414199, 4029109, 3841624, 3752043, 3775987, 4123987, 3544057, 3710591, 3090630, 3746891, 3621578, 3270761, 3455069, 3502492]
14040C502492j57398O4037j38327K76018k71493r1933J20014l94434M22192j3578
14030C317590l51980N33582k63480l47094L26887k43558l37133N17009k11179
14021B940644j10546l4995k8400O7024l77553K38888L8244q4576Q4769J265k22169
14010B512595j63821K64778q243L82959n07892M1753l55968M63495j69611R9282
14000B559327l48155r2266r4107M56321L2924K04623j81153J97924k8544Q6218
13990B793112O06089O06127K196590O570320J5157067J6324850j5610726j2941606
13982A5701823n992794k435470j771836q65459o13698m55235j26467m88363J92639
13973C145140l57334k32649K72485k74863Q5370j11112J61166j33829o3549k6300
$$ y = [3502492, 3345094, 3409131, 3270804, 3546822, 3275329, 3183396, 3303410, 2908976, 3331168, 3317590, 2965610, 3499192, 3235712, 2888618, 3215505, 2971947, 2634814, 3151823, 2940644, 2830098, 2795103, 2766703, 2833727, 2456174, 2695062, 2733306, 2648730, 2733499, 2734764, 2512595, 2348774, 2613552, 2605309, 2988268, 2480376, 2522129, 2166161, 2629656, 2460045, 2559327, 2211172, 2118906, 2024799, 2481120, 2514044, 2718667, 2537514, 2735438, 2706894, 2793112, 3399201, 4005328, 6201918, 12772238, 27929305, 44254155, 28643429, 15701823, 9709029, 7273559, 5501723, 4636264, 4022566, 3567331, 3440864, 2952501, 3145140, 2787806, 2555157, 2827642, 2552779, 2638149, 2527037, 2688203, 2554374, 2490825, 2464525]
13963B464525J42106m17847K14573l90156J85421J5447P3498j8179k54055L31743
13953B347076q6993K9485m34744Q3132K89430l73806N9943J43792j14425R1680
13943B034570J85049o55491M53611j09627j64315k64554J85390J57840L8145K1815
13933A882433j14071j54055J14216r7512P6454J51988j2165j82697K58047q1766
13923A840872N5783k13808j91911l7818L51877m68257L27170J61795k29164L3991
13913A630530k6679P3591J8722J70395n49982K51316l47738L2615K08120J13928
13903A574818k8275l34875J90369J03766q0183l04049K54587l2486L7323J45853
13893A526848k56104l84764L71165L39381m93743K64488j21247k9379l984M2705
$$ y = [2464525, 2606631, 2188784, 2403357, 2013201, 2198622, 2214069, 2287567, 2269388, 2015333, 2347076, 2260083, 2289568, 1854824, 1937956, 2227386, 1853580, 1913523, 2057315, 1942890, 2034570, 2219619, 1564128, 2017739, 1908112, 1743797, 1479243, 1664633, 1822473, 1860618, 1882433, 1768362, 1614307, 1728523, 1631011, 1707465, 1859453, 1847288, 1664591, 1922638, 1840872, 1896655, 1682847, 1490936, 1453118, 1804995, 1336738, 1663908, 1825703, 1596539, 1630530, 1603851, 1677442, 1696164, 1866559, 1316577, 1567893, 1220155, 1252770, 1460890, 1574818, 1546543, 1211668, 1402037, 1505803, 1425620, 1121571, 1376158, 1343672, 1380995, 1526848, 1270744, 885980, 1257145, 1596526, 1102783, 1367271, 1246024, 1216645, 1212661, 1255366]
13883A255366j31700o0527N44048m70350J66955J66167j21398j05377N9912n44497
13873G58599M65754k7120J90810m3238K22890l71519K47767l05616j01758M8166
13863A084735j5208K29540k74171J62148K03793L6905k19748q3939M2464j2834
13853A153685n0049O6506J90588o09669L4342Q1757J00221O4412k18599K78924
13843A092118L32346k74042j39684J75162k62572K03104j17494K38983o2443L8781
13833A224259O9741j94469J95741l58122j27215L16205k55935J93824k60034l2022
13823G71973M99575m53643j59786N7542j7496k2022J30010K00023k05371K27995
13813A028800q8460j9982L9674k15597K86342k02206J4237K30701j41295L69338
$$ y = [1255366, 1123666, 1063139, 1607187, 1136837, 1303792, 1469959, 1348561, 1243184, 1303096, 758599, 1224353, 1197233, 1388043, 1344805, 1567695, 1196176, 1443943, 1138327, 1036569, 1084735, 1069527, 1299067, 1024896, 1187044, 1390837, 1427742, 1207994, 1124055, 1166519, 1153685, 1103636, 1170142, 1360730, 751061, 785403, 867160, 967381, 1031793, 813194, 1092118, 1424464, 1150422, 1010738, 1185900, 923328, 1126432, 1008938, 1247921, 1185478, 1224259, 1294000, 1099531, 1295272, 937150, 809935, 1126140, 870205, 1064029, 803995, 771973, 1271548, 817905, 658119, 715661, 698165, 676143, 806153, 1006176, 800805, 1028800, 940340, 920358, 960032, 744435, 1030777, 828571, 842808, 1073509, 932214, 1301552]
13803A301552n36382M9777j65076L55630j20790J91284m13960L60764l10966K31167
13793I43000k37968J07088o2345L9351k52086L66979l62032M45378j13767k44951
13783F28647K769J10132R4359J14523J74761k44630C27685N14400K74786r4244
13773A022627l28418J05686j84343J49085M4069m0413l03910L81577j28520M09164
13763A126604l26974K42519k03916k23486P5920l1311J08482N753M053j46426
13753F31218k41018K39169K29672k67081j0501J88797R0443l10236M4723j63134
13743D32052L95671j75614r2787j9712A34352P45479C26793O21038k70401K41186
13733I18616D15014J70538L502L00267A74858M68387J99934j02848A69398K35979
$$ y = [1301552, 765170, 814947, 649871, 1005501, 884711, 1075995, 662035, 1022799, 711833, 943000, 705032, 812120, 749775, 789126, 537040, 904019, 541987, 987365, 873598, 628647, 631416, 741548, 835907, 950430, 1125191, 880561, 327685, 842085, 1116871, 1022627, 694209, 799895, 615552, 764637, 808706, 768293, 464383, 845960, 717440, 1126604, 799630, 1042149, 838233, 614747, 690667, 659356, 767838, 773591, 777644, 631218, 390200, 629369, 859041, 591960, 581459, 770256, 860699, 550463, 595186, 432052, 827723, 652109, 559322, 539610, 134352, 879831, 326793, 947831, 677430, 918616, 415014, 585552, 589054, 889321, 174858, 643245, 843179, 740331, 169398, 405377]
13723D05377M33038j55171j76936l4212p9843M97083j14726N5256j67716n4722
13713F07428J49219J57906C35319K23758J08760B26710L32249Q253B81949K51978
13703E33927q0735Q3218M9172J20745l21093L14229k12632P1913j36313L0579
13693D53010K50951R5700C93133J87024j18842j13303J56895J22940J63322k71397
13683E19772N0776J33907j69169j01363K88692k99504J34106J37467l11842J23576
13673E06418J18994B88486K57514j03735n5255N4708n580K7153m7856J30628L57288
13662I03351m47559J21652L5282j92565K06188B49020K51944L07095A67740K41938
13652D09678J58806j51247L18765B97626K90214j89949J9237O6413K53082k03958
$$ y = [405377, 838415, 683244, 506308, 472096, 392253, 889336, 774610, 829866, 662150, 607428, 756647, 914553, 335319, 559077, 667837, 226710, 558959, 567212, 281949, 533927, 453192, 536410, 585582, 706327, 385234, 699463, 486831, 558744, 422431, 453010, 703961, 799661, 393133, 580157, 461315, 348012, 504907, 627847, 791169, 519772, 570548, 704455, 535286, 433923, 722615, 423111, 557217, 694684, 382842, 506418, 625412, 288486, 546000, 442265, 387010, 441718, 436138, 463291, 415435, 546063, 903351, 455792, 577444, 612726, 420161, 626349, 249020, 500964, 808059, 167740, 409678, 568484, 417237, 736002, 297626, 587840, 397891, 417128, 483541, 736623, 532665]
13642E32665K52607l54711L60132B40243N44767B18715M15848n5060B30895J05981
13632C36876J7327k4380r2702q2128K35331K6681m073j55632L00616k02496J31821
13621D87241j01897J30482r337j37020K73270l05254K47767j73173J89997G4904
13610B82039N7117M868N5814p7891j6730K40714A62010J75051K44441k06376j61909
13599B13217K7605R9309R7252R8288j11065P7060j20928Q0911I7892L45460j71406
13588B71946j1438Q9935K16001k42602L22238l00623J43106k11755K44448K30094
13578G51350k43956k03591r0409J33344k3637k4224Q3323L7908L3162q1208R9118
13567D71180j0423K4880A28753L00574N1577k18096O0353p8198N4439K4800k6621
$$ y = [532665, 785272, 430561, 790693, 240243, 785010, 218715, 634563, 579503, 230895, 336876, 354203, 329823, 237121, 154993, 390324, 417005, 412932, 257300, 557916, 355420, 487241, 385344, 515826, 506489, 369469, 642739, 337485, 585252, 412079, 602076, 74904, 282039, 339156, 344024, 399838, 321947, 305217, 545931, 162010, 337061, 581502, 375126, 213217, 240822, 340131, 437383, 535671, 424606, 501666, 380738, 461649, 97892, 443352, 271946, 260508, 350443, 566444, 323842, 646080, 345457, 488563, 276808, 521256, 751350, 507394, 303803, 213394, 346738, 323101, 298877, 382200, 420108, 453270, 372062, 471180, 460757, 485637, 128753, 429327, 480904, 262808, 323161, 244963, 299402, 324202, 297581]
13556B97581k8833J36550o3911J78099k0600A57565C4584Q2998K63792l541k2680
13545C55153J13751A38018J04147K0899R0035C7275J52319R3654I3813L43752
13535D37565A70145R4622J35084j06125l2649r7198M57104l07967Q7204j72519
13525B27701R21l5378J40984a22300C47130K00861P6823A41990J92945j1867r7869
13514B25199D6843O5105O7533B3979K89811K94190A68461K07204l0912c0673A56912
13502D80583q8860o7202J97219k17498p3627m125J54256j31032I5977K14754D1376
13490C76012E3085J63421R9316J69173D885N66998A24315K0159J43784I2961O61330
13479G54291A02810J15207J87558k02277J84623A58786j2502M2523j3884K89557
$$ y = [297581, 268748, 405298, 341387, 519486, 498886, 157565, 34584, 117582, 381374, 377833, 355153, 468904, 138018, 242165, 263064, 353099, 37275, 189594, 283248, 93813, 437565, 170145, 264767, 399851, 293726, 261077, 163879, 620983, 313016, 400220, 227701, 228622, 193244, 334228, -122300, 347130, 547991, 624814, 141990, 334935, 323068, 225199, 46843, 111948, 179481, 23979, 313790, 607980, 168461, 375665, 344753, -30673, 156912, 480583, 391723, 324521, 521740, 304242, 230615, 226490, 380746, 249714, 95977, 310731, 41376, 376012, 53085, 216506, 315822, 484995, 4885, 571883, 124315, 144474, 288258, 92961, 754291, 102810, 218017, 405575, 203298, 387921, 158786, 146284, 188807, 174923, 464480]
13469D64480j94932L00480O9394A76173J24099j24372M2455J17730L7765H9241
13458A46213l4066K40131j9761A54082E8902K71387a76841C16278E094L80807
13448C85901p367G6896J61657G48K69269J24287A65360i4227C74732A10820P4112
13437A84932R7481K8984n8436c1835A65232r049J60152A11375j0444j2756A0373
13425A41239A0743L40996J00736p4309H6538Q0552J98303q2388q4281I5450J35806
13414B31256D5539L5738J14745j0238k2366K41370a55645B82013l7413J23429
13404C68029C0598M16910j84198j8337K9530j21939F2692R3102J3860G6299N0781
13393A27080e928r920A04035b0071C94766F3087K36775G1585J74239O5918O1125
$$ y = [464480, 269548, 570028, 639422, 176173, 300272, 175900, 218355, 336085, 373850, 89241, 146213, 112147, 352278, 332517, 154082, 58902, 330289, -176841, 316278, 5094, 385901, 378534, 76896, 238553, 748, 270017, 394304, 165360, -94227, 374732, 110820, 184932, 282413, 311397, 252961, -31835, 165232, 156183, 316335, 111375, 100931, 88175, 10373, 141239, 10743, 351739, 452475, 378166, 86538, 167090, 365393, 283005, 198724, 95450, 231256, 45539, 81277, 196022, 185784, 163418, 404788, -155645, 282013, 244600, 368029, 30598, 447508, 263310, 244973, 274503, 152564, 62692, 155794, 169654, 76299, 127080, -5928, -15848, 104035, -20071, 394766, 63087, 299862, 71585, 245824, 311742, 372867]
13382C72867J02452j85078Q0789j34309P9866A30486a03521C06576j38697m2513
13372A25366J43648P1982K6376j22910a74001B09039F3491K01231A06758K93201
13362C99959A91938K05833n9503h6034l8525F07110k51050a31258C72692G8047
13351E74851m2365I4767M60448A64815K5116O2049h1675B07574L0409m5934K74191
13340D66240k3014C7092J63190N0777j01935g5068B02899K61584B00483A127J90227
13329A91354b134A02382J45868K06172B11335p7766K54476A93570n9670d4046
13318B66530J09703a50029B78748A36180a0507C14403A15670j1712K52975a50241
13307A85597P4710h2717B09511C5190J89200J94677h5614J5772H9654K86044a6891
$$ y = [372867, 475319, 290241, 371030, 236721, 316587, 130486, -103521, 306576, 167879, 125366, 269014, 340996, 367372, 244462, -174001, 209039, 63491, 264722, 106758, 399959, 191938, 397771, 338268, -86034, -124559, 607110, 356060, -131258, 372692, 78047, 574851, 532486, 94767, 555215, 164815, 189931, 251980, -81675, 207574, 237983, 192049, 466240, 443226, 37092, 200282, 251059, 149124, -75068, 202899, 464483, 200483, 1127, 191354, -2134, 102382, 248250, 454422, 211335, 133569, 388045, 193570, 133900, -44046, 266530, 376233, -150029, 278748, 136180, -10507, 314403, 115670, 103958, 356933, -150241, 185597, 260307, -82717, 209511, 35190, 224390, 419067, -85614, -69842, 89654, 375698, -16891]
13295B28222o5681G1090L61141a28389B60577p2488K78943k26017K11912A43933
13284B36640P1224J0042A42173Q7552e7150d176j53612D97569A69987E930J61497
13273A67427J50262A02582N60942h4226b4955B6975O43547l31397r8035c3725
13262A69050J3984A7088Q1766J0188e9683A53296k6796f1259E24121A34253J49664
13251B83917C1499R8639K42677r2767H0439J51926L644J54800J26292F3063J93264
13240B56327L52139a52730F425Q4454J13864O5404o1145F264Q0782K84090j34344
13229B36792I062J97438p527G6406l616K8819e5724C53438B1349a21603A45152
13217a38756G2645j2664R5015n5361c5272H7942N9580i7923C50748F0702a42932
$$ y = [228222, 162541, 71090, 432231, -128389, 260577, 188089, 467032, 241015, 452927, 143933, 236640, 307864, 317906, 142173, 229725, -57150, -4176, -157788, 497569, 169987, 5930, 167427, 317689, 102582, 663524, -84226, -24955, 26975, 670522, 339125, 241090, -33725, 169050, 183034, 17088, 98854, 109042, -59683, 153296, 126500, -61259, 524121, 134253, 283917, 31499, 130138, 372815, 280048, 80439, 232365, 236009, 390809, 517101, 63063, 256327, 608466, -152730, 6425, 90879, 204743, 270147, 209002, 6264, 87046, 371136, 236792, 9062, 206500, 198973, 76406, 72790, 101609, -55724, 353438, 21349, -121603, 145152, -138756, 72645, 59981, 154996, 99635, -35272, 87942, 147522, -97923, 350748, 60702, -142932]
13205a6932m8224F4631J9026R5763L23402A4487K32031b0047n7111D38568F8453
13193B35311h5598b963j60306D34596A82803l1437n5625L97132a30839a3790B60901
13181a66460P5530j03135A75653n8405h6399A88529B51N475c2069k6520B05140
13169B84404C2830K09771m0070K16854c7782A3621M26388a49145L6290C87357
13158a58336g161j00737E3697a86603A57688a18681C13781a76461B0729J64019
13148A84748c303B58773G0433N7333k8953k2621b08659A48587J2809C9578K88569
13137C28147j50057K3415q82a7074C22557c673H9147M2065a20239A86827e4443
13125B89229b09849A64914d4224F9744E044b29989B53643H8880Q4300F9533j6782
$$ y = [-16932, -65156, 64631, 83657, 179420, 502822, 14487, 246518, -20047, -77158, 438568, 68453, 235311, -85598, -2963, -163269, 434596, 182803, 151366, 95741, 492873, -130839, -13790, 260901, -166460, -90930, -194065, 175653, 117248, -86399, 188529, 251, 5726, -32069, -58589, 205140, 284404, 32830, 242601, 202531, 419385, -37782, 13621, 440009, -149145, -112855, 387357, -158336, -7161, -107898, 53697, -186603, 157688, -118681, 313781, -176461, 20729, 184748, -3303, 258773, 70433, 127766, 98813, 76192, -208659, 148587, 161396, 39578, 328147, 178090, 201505, 200623, -17074, 322557, -3673, 89147, 131212, -120239, 186827, -54443, 289229, -209849, 164914, -44224, 69744, 5044, -229989, 253643, 88880, 173180, 69533, 52751]
13114E2751f3656j30959I7395j6067a16074A35534m2031K48592j21225j08574
13104A12296f6418A0228K17709R8486A08949K48671c0429A06089d23602B01041
13093e9850A95491G5639a47165B7250a09350C7902F839L58838i0593H8051K1799
13082A09850R3150O8211E4883J07189J23181j2165H2651B964a51436r910j30190
13071b91536A54493l027g4792D65934a24459A92867L2517M2458B6741a9131B92020
13059A31649E4252k3513i4527B9357c00815D07161j15571P4579M2429A70940K05337
13048C76277d4836I8844a44926F3787J18417j3390J56743j12309b11143A65299
13037C43363b7875j66096E7609J87045A14978b06075F9331j7694a36114p7770
$$ y = [52751, -63656, -194615, 97395, 81328, -116074, 135534, 93503, 342095, 220870, 112296, -66418, 10228, 227937, 326423, 108949, 357620, -30429, 106089, -423602, 201041, -59850, 195491, 75639, -147165, 27250, -109350, 37902, 6839, 365677, -90593, 88051, 109850, 203000, 271211, 54883, 162072, 285253, 273088, 82651, 2964, -151436, -161346, -291536, 154493, 151466, -74792, 465934, -124459, 192867, 225384, 267842, 26741, -19131, 292020, 131649, 54252, 30739, -94527, 29357, -300815, 407161, 291590, 366169, 408598, 170940, 376277, -44836, 98844, -144926, 63787, 182204, 168814, 325557, 213248, -211143, 165299, 343363, -27875, -193971, 57609, 244654, 114978, -206075, 69331, 51637, -136114, -213884]
13027b13884c6395B25351J2529J61873j62296a1882B76985c1091A33005b55424
13016a12343A80161q3632j2305f9805A04190K7369c6502C97992f3202j42562E6276
13004i9454F88001l28952F365R748N4686K47842R7314I7333K3740b15011C62691
12992B16797a87109A34255B5721a868B32243r1759c35657f8243Q116A33573K74083
12981D07656a7199B58773r1071a6377C45209H8676P4776k6978R2915b56234e4200
12969C57499j05493L1691K8634L72170a12492C15732e2483B33320j02563L6368
12959A67125Q230h9407I1145P9019K24617A19961b66293a5339B02090i730m0161
12948d9891a7476B13971a24500C47591e14071H832c9517A08832J08465b18523
$$ y = [-213884, -36395, 225351, 237880, 399753, 237457, -11882, 276985, -31091, 133005, -255424, -112343, 180161, 96529, 84224, -69805, 104190, 131559, -36502, 397992, -63202, -205764, 56276, -99454, 688001, 359049, 6365, 16113, 70799, 318641, 415955, 97333, 121073, -215011, 362691, 216797, -187109, 134255, 25721, -1868, 232243, 140484, -335657, -68243, -60127, 133573, 407656, -17199, 258773, 167702, -16377, 345209, 88676, 163452, 136474, 229389, -256234, -54200, 357499, 252006, 283697, 312331, 684501, -112492, 315732, -52483, 233320, 130757, 167125, 175355, -89407, 91145, 170164, 394781, 119961, -266293, -15339, 202090, -9730, -49891, -17476, 213971, -124500, 347591, -514071, 8832, -39517, 108832, 217297, -218523]
12937G5926Q545l9357L41484b26253a3356A60906L563C244a69898e6614A67962
12925h0296j54342L4863J0871A96002m0749e5295p258G7648g4779K4996N141B18409
12912B02305D3616f5696A14982K12551j28673E2561M3283b51365g990j30388C11859
12900a5058A67539M1202O2629b9725A28198b22336C00074f1898b1147I8322a35022
12888e1522A49630b61434C68351h4587A17076L88896b1066D5889h4297B36810
12877G202a73589I3337b35345B64831r0813L4772q0689f4861A2242J00925b27256
12865B85567j22430l2178i4305r5570c0627n1359k43496D2946g670j99981A70150
12853e1663A47189M4568P0840C8246K59976b47086A14415J64665H2857N8656J28422
$$ y = [75926, 84471, 45114, 386598, -226253, -13356, 160906, 164469, 3244, -169898, -56614, 167962, -80296, -234638, -199775, -188904, 196002, 155253, -55295, -62553, 77648, -74779, -49783, -44642, 218409, 202305, 43616, -65696, 114982, 327533, 198860, 52561, 95844, -251365, -7990, -138378, 311859, -15058, 167539, 208741, 271370, -29725, 128198, -222336, 300074, -61898, -21147, 98322, -135022, -51522, 149630, -261434, 368351, -84587, 117076, 505972, -21066, 45889, -84297, 236810, 7202, -173589, 93337, -235345, 264831, 174018, 208790, 128101, -64861, 12242, 113167, -227256, 285567, 163137, 130959, -94305, -189875, -30627, -81986, -325482, 42946, -7670, -207651, 170150, -51663, 147189, 191757, 262597, 38246, 298222, -247086, 114415, 279080, 82857, 141513, 269935]
12842B69935J44233J29757a62072B04749c14187g3754m0720M9749A4844a03364
12831A63689h9596K6662I3489e5843A66392J70325a33748j71383f2432a5395A86125
12819a49726A26902A2130K76716E8471h8700E6384b14547a1512B3007b86281A87789
12807a23244j32181C8365K9913a0648I9059i1021C6919J08400F9087J1679g1509
12795d0663j28184b0810p08C03291q9168a93365A22838E565g5067F0239N075I545
12782a64383C7956J56679o4416C2948c0827F6592J3706h9023j74247B38098a8016
12770C56657j46529a41064A41866Q4343J09547A23258N8325f3810J8375j33348
12760a78783H2803N3499b13493a9877E239a10241A58130a51163d950A20391J7746
$$ y = [269935, 414168, 543925, -162072, 204749, -314187, -73754, -114474, -64725, 14844, -103364, 163689, -89596, -62934, 93489, -55843, 166392, 336717, -133748, -305131, -62432, -15395, 186125, -149726, 126902, 12130, 288846, 58471, -88700, 56384, -214547, -11512, 23007, -286281, 187789, -123244, -255425, 38365, 68278, -10648, 99059, -91021, 36919, 145319, 69087, 80766, -71509, -40663, -168847, -20810, -21518, 303291, 214123, -193365, 122838, 5565, -75067, 60239, 65314, 9545, -164383, 37956, 194635, 130219, 32948, -30827, 66592, 80298, -89023, -263270, 238098, -18016, 356657, 210128, -141064, 141866, 226209, 335756, 123258, 181583, -63810, -45435, -178783, 82803, 136302, -213493, -19877, 5239, -110241, 158130, -151163, -4950, 120391, 138137]
12749A38137F2872L28591A42286N3493h2806j72597B20740l4817A3360c2947j33989
12738a66936b1832k98817c3410k59764B41132J37399e1344l29674A32105J97775
12728C29880b4599j36628O2606q0743G8939J32284a30427A15466j7954L6011K260
12717A35783F2487B486J20304J04307q910A8115K71464J1094b48049B9861Q8825
12706A18686O4182p0837K79381q2147M0334A73547q6491J6463g9223b0624k32344
12695b52968g491B63081c6875m9966E7457b1605I9259J63984o8960n858J01177
12684B89602A413c403A56086a86367C66919A62471d1277C09297G7990P5623J03559
12673B57172A7864K71116A8065J47592a4834A73268P9748n6279H0673A8512J65557
$$ y = [138137, 62872, 391463, 142286, 195779, -82806, -255403, 220740, 185923, 13360, -32947, -166936, -21832, -320649, -33410, -293174, 241132, 378531, -51344, -381018, 132105, 329880, -24599, -161227, -98621, -179364, 78939, 211223, -130427, 115466, 97512, 133523, 135783, 62487, 2486, 122790, 227097, 218187, 18115, 289579, 300673, -248049, 29861, 118686, 182868, 112031, 391412, 309265, 349599, 173547, 87056, 103519, -79223, -20624, -252968, -7491, 263081, -36875, -86841, 57457, -21605, 99259, 263243, 194283, 188425, 289602, 1413, -3403, 156086, -186367, 366919, 162471, -41277, 309297, 77990, 153613, 257172, 17864, 288980, 18065, 165657, -14834, 173268, 253016, 196737, 80673, 18512, 184069]
12662A84069E43c51075b9053D0543O9101K05653H526J45082l1557g7395A0951
12650C29539K4130K9415I5942a3068B79012q7473B1765J96298r2454e1783b0954
12638B83076b71109B54876P2011A672h2014B86939a55478A38632R6345D872R3940
12627I8812M56852j63182A56333M71476I8521C8525K12371j18387k9437h518j79935
12616a88453A15374c16703F8532J30687N64b03436N6026j66846A95583G3634a3203
12604D8774j8274K22241r4098d8248q3312A14096J63572J03847b5004k00059D2316
12592I1626K09569j06422b15963i6695J8377c3566l8827B12793B5818L4300J75456
12581B35574a05424B56433b542k65144C23592A58698c4351d781j1522k34117r0899
$$ y = [184069, 543, -351075, -29053, 40543, 109644, 315297, 8526, 153608, 122051, -77395, 10951, 329539, 353669, 383084, 95942, -13068, 279012, 191539, 21765, 218063, 125609, -51783, -20954, 283076, -271109, 254876, 326887, 1672, -82014, 286939, -155478, 138632, 234977, 4872, 98812, 555664, 392482, 156333, 627809, 98521, 38525, 250896, 132509, 103072, -8518, -188453, 115374, -316703, 68532, 199219, 199783, -203436, -147410, -314256, 195583, 73634, -13203, 48774, 30500, 252741, 158643, -48248, -131560, 114096, 277668, 381515, -25004, -225063, 42316, 91626, 301195, 194773, -215963, -96695, -78318, -33566, -72393, 212793, 25818, 60118, 235574, -105424, 256433, -2542, -267686, 323592, 158698, -34351, -4781, -16303, -250420, -341319]
12570c41319e1422A94203L27183f2724j01415g9578B62571b3019H2465a19365
12559e198m8062k35116b157A35932m2578b14437J01732A36455J9974B9673c8533
12547B24321I6615m0922a85941f2289E17586a7949A03199e6579K6113B73134j13803
12536A59331h9108A93074a81878j7332A25141b0056A62905B3762L36119A06068
12525A8289g4872C31754e6041D491a46102A43992B155N8802Q7520K40870A86205
12513B2913J70529H8984J44239c56312C80933m0909a6542F7271b5192E2722d2891
12501b20814C34615F8805B9843l7a4266A37428J8360b8739k03854a07140K4119
12490h3021I7831a57746k034a8684G608Q7637m1375E060d5682C30299n2796o3810
$$ y = [-341319, -51422, 194203, 521386, -62724, -164139, -79578, 262571, -23019, 82465, -119365, -5198, -53260, -288376, -2157, 135932, 93354, -214437, -112705, 136455, 156429, 29673, -38533, 224321, 96615, 55693, -185941, -62289, 517586, -17949, 103199, -56579, -30466, 273134, 159331, -89108, 193074, -181878, -199210, 125141, -20056, 162905, 23762, 359881, 106068, 18289, -74872, 331754, -56041, 4491, -146102, 143992, 2155, 60957, 148477, 389347, 186205, 22913, 193442, 88984, 233223, -356312, 380933, 340024, -16542, 67271, -25192, 52722, -42891, -220814, 334615, 68805, 29843, 29806, -14266, 137428, 155788, -28739, -232593, -107140, -83021, 97831, -157746, -159780, -18684, 7608, 95245, 53870, 5060, -45682, 330299, 277503, 213693]
12478B13693E0633a45322A48190a8442j68419Q7783B4071K6131a354F2670J76578
12467B39248f3038A03432a12283j7916A53207e32502a95450A31111i2375G8430
12456B51342b1067j38737B02699H3188a25855j45779h3087j70573R6204B6572
12445a27393M9193D9392N1549a03461J3164B88429I6180a04900M7959A72529C0248
12433a01670C27814n7800A00749a62140A84044J69882i3037j563E7496c5135k1871
12422e7006Q446j44322j25339F7511b55538F3061i49o8375F4016k535i5587B02556
12409I1864N9799a38025k40341e7080B30838h9511j95058B6954i3050D563J66990
12398A71553D4825N0349a84567J5543A60425K22079A2565b08337A40410n6932
$$ y = [213693, 50633, -145322, 148190, -18442, -186861, -99078, 24071, 50202, -1354, 62670, 239248, -63038, 103432, -112283, -130199, 153207, -532502, -195450, 131111, -92375, 78430, 251342, -21067, -159804, 202699, 83188, -125855, -271634, -83087, -253660, -157456, 26572, -127393, -78200, 49392, 100941, -103461, -90297, 288429, 96180, -104900, -56941, 172529, 30248, -101670, 327814, 270014, 100749, -162140, 184044, 353926, -93037, -94600, 57496, -35135, -57006, -48560, -192882, -318221, 67511, -255538, 63061, -949, -69324, 64016, 61481, -95587, 202556, 91864, 151663, -138025, -378366, -57080, 230838, -89511, -284569, 26954, -93050, 4563, 171553, 44825, 95174, -184567, -169024, 160425, 382504, 12565, -208337, 140410, 83478]
12388H3478K34568j35143a56432I7734K5021c18141J40365A23497m315J72996
12378B92178G7003J65589A15103E6936f7678k04881J286R5435N4076A53646h2496
12366A27287M7272a41947k28296i6465K1127k5048A03283m2459J35121C2395a91303
12354E0543b4489j02833A77690h9823l0845C43369c42196J48826A36148b06557
12343d3367B15892c6530a2244j18286A36711b15721g0897B1928K61487a21543
12332C098J12149b570G1491M6386E8147M6887m2071M5165b1827A98566h3672B36684
12319c50556J48758O6522J312M5729a4918E8361O0036K52307a31021A45009A3015
12307i7627A71183p0211d1865D4674b91582J24189j02946A78355a18775j25550
$$ y = [83478, 318046, 182903, -156432, 97734, 122755, -318141, -177776, 123497, 119182, 292178, 77003, 242592, 115103, 56936, -67678, -272559, -271273, -175838, -121762, 153646, -82496, 127287, 174559, -141947, -370243, -96465, -75338, -100386, 103283, 60824, 195945, 32395, -191303, 50543, -24489, -127322, 177690, -89823, -120668, 343369, -342196, -193370, 136148, -206557, -43367, 215892, -36530, -12244, -130530, 136711, -215721, -70897, 21928, 283415, -121543, 3098, 115247, -2570, 71491, 117877, 58147, 105034, 62963, 108128, -21827, 198566, -83672, 236684, -350556, -201798, -135276, -133964, -88235, -14918, 58361, 118397, 370704, -131021, 145009, 13015, -97627, 171183, 100972, -41865, 44674, -291582, -167393, -270339, 178355, -118775, -244325]
12297b44325M5823F3782d3554k24973A77003g4978C00364r3544k4913a60206G2868
12285A25846a96517B20431E6752R2417R4337b47380Q0763O0078A76115f3603D3203
12273b5233m8076A30175a54599G3381b19159C0915M0451a81042H61748a04560
12262A87832R0966J3348b2819j66787B86576b72803I0766b9391J3616I8050L06948
12251D04998A99340b464A99394k69o6018b6520K550i205A22682a45620B0858b32857
12238a2035A36933g3633C97169I4236a18745A06022J69203C102K31402a41295
12227C77484A67876M7955P5772p4569m0799J61408r3550r2806K70664C1386J47207
12216A78593L35218j95419D9329P2572a86111O9856C7a37695n4867E5607K64793
$$ y = [-244325, -198502, 63782, -43554, -268527, 177003, -74978, 300364, 206820, 181907, -160206, 72868, 125846, -196517, 220431, 56752, 149169, 243506, -247380, -166617, -106539, 176115, -63603, 43203, -25233, -73309, 130175, -154599, 73381, -219159, 30915, 71366, -181042, 861748, -104560, 187832, 278798, 292146, -22819, -189606, 286576, -272803, 90766, -29391, -15775, 98050, 404998, 199340, -2464, 199394, 199125, 133107, -26520, -23970, -9205, 122682, -145620, 20858, -232857, -12035, 136933, -73633, 397169, 94236, -118745, 106022, 275225, 3102, 234504, -141295, 377484, 167876, 215831, 291603, 217034, 176235, 337643, 244093, 151287, 421951, 31386, 178593, 513811, 318392, 49329, 121901, -186111, -116255, 37, -137695, -192562, 55607, 320400]
12205C20400D7523J58725q1755O1789g6522A31396L8574N2907I6162A192K47379
12194B48571j6701L1464j05176o7828N1759L418J30990K9179f2997B07613J0637
12183B18250E8833c2578C00900j15768M4006O0647A9695N51559A06222A1790K35803
12172B47593D6255K47050h2446A08442C4327K38409J33796h1909C82054A23703
12161C37245K73544a88655H6773d75801D43888k01491K4357a44917N1226D3992
12150B53566E3389E690J9197a11226d480H0053a08372A32645O8085g1017A35441
12138A40969K43718g477k60278C94829a50476I3135q45J07239q3509a93941f0114
12126h2330C06197a59568B22740l3861c29363A83479d7369E5847G911K36333I3753
$$ y = [320400, 47523, 206248, 124493, 186282, -76522, 131396, 169970, 222877, 96162, 1192, 248571, 231870, 263334, 158158, 90330, 142089, 145507, 276497, 305676, -62997, 207613, 218250, 58833, -32578, 300900, 185132, 229138, 289785, 19695, 571254, 106222, 11790, 247593, 46255, 293305, -82446, 108442, 34327, 272736, 406532, -81909, 382054, 123703, 337245, 610789, -188655, 86773, -475801, 443888, 242397, 266754, -144917, -93691, 43992, 253566, 53389, 5690, 24887, -111226, -4480, 80053, -108372, 132645, 200730, -71017, 135441, 140969, 384687, -7477, -267755, 394829, -150476, 93135, 92290, 199529, 116020, -193941, -60114, -82330, 306197, -159568, 222740, 188879, -329363, 183479, -47369, 55847, 7911, 244244, 93753]
12114B10807q0577a69238P3477D86004a61159A12625a52029A59321G0508N0892
12104A21400c10904A7380a78221A22165E008K45015Q202P5498I7228k5820P2737
12093A44145A2820f1855H9565J10454a66009F9497a81914C17804c74433A32591
12082A35694o522f0462q2542A38085c74159F7044a08033o8616A47841E5361P3882
12071A29243h9577a109j67072D1241b85028d6013j95978a13802B97055A03950
12060a09394A08064a65818A05000b8520H786a21960j13615B42450C607O1073R39252
12049A003932K16628D8862J9108b12781A90365L1972a24939C9871c7992J1273
12039b6719A37283J24391c01388J50524B32356a58882B73558a45414C0963d90825
$$ y = [210807, 130230, -169238, -95761, 486004, -161159, 112625, -152029, 159321, 70508, 121400, -310904, 17380, -178221, 122165, 5008, 250023, 258225, 333723, 97228, 71408, 144145, 12820, -61855, 89565, 200019, -166009, 69497, -181914, 317804, -374433, 132591, 135694, 129172, -60462, -143004, 138085, -374159, 67044, -108033, -176649, 147841, 55361, 129243, -89577, -1109, -168181, 41241, -285028, -46013, -241991, -113802, 297055, 103950, -109394, 108064, -165818, 105000, -28520, 8786, -121960, -235575, 242450, 3607, 64680, 1003932, 1220560, 48862, 67970, -212781, 190365, 222337, -124939, 39871, -37992, -26719, 137283, 261674, -301388, -150864, 232356, -158882, 273558, -145414, 30963, -490825]
12028D3944a20764J6559l8532O8417k81988B43084e8555B27213e4457k63392B3566
12016I0150A3013b29752C17767c87103J42645g1348j68776A98201A2847K78320
12006B91167G4046a33085N8479l39831G3895L8547a21084A0876O5170g544A76928
11994c0915B2248g2790G6173a40727A45495O2815r5522c14209R7485A7415a04046
11982A4074a71112L1592H8606a67824O3721I675f1670A73097j4950h3124k02688
11971b85812e9223j25496h5868j79835P7205P4260D9909h0319j41092J6438H93
11959a95777N2667F0801J73734g5410A8442a64998B04094k0025b90578a24391
11948a18762A80286g7684F5103b17072Q4103B49566K48615G5268I68K9657a58455
$$ y = [43944, -120764, -104205, -142737, -74320, -356308, 243084, -58555, 227213, -54457, -317849, 23566, 90150, 13013, -229752, 317767, -387103, -244458, -71348, -240124, 198201, 12847, 291167, 74046, -133085, -74606, -414437, 73895, 112442, -121084, 10876, 76046, -7544, 176928, -30915, 22248, -72790, 76173, -140727, 145495, 208310, 112788, -314209, -216724, 17415, -104046, 14074, -171112, -139520, 88606, -167824, -104103, 9675, -61670, 173097, 158147, -83124, -285812, -59223, -184719, -85868, -265703, -188498, -114238, 49909, -80319, -221411, -204973, 893, -195777, -143110, 60801, 234535, -75410, 18442, -164998, 204094, 184069, -290578, -124391, -118762, 180286, -77684, 65103, -217072, -132969, 249566, 498181, 75268, 968, 30625, -158455]
11936c31174A70397b8200j35442n4912B74536F6248b35797H0320b19082a8764
11925a89717K2304k4768D5095j7956b10893Q9636D8648K22057a90073e3390G1418
11913a15636k9030o6259B88658E4218b67977a13230A6758C232L29658c9209B26795
11901D6375b44507d4629B76802C1048b2651m5245a9553C07837q6735c81231J47029
11890b34202B70713B9609a23572D2154J38192q9527a43312A04069B8985i4980
11879g2677j01879m6676G4103N8916F2209a77626K7055O8965E6330L7836J8759
11868A12925e1600I0179k6790j1995b48479A44627b50403D2657a11944K2611A32492
11856d2047a6372j84967B15771k3098m9762O8299F7306K15428A10919B2018a53520
$$ y = [-331174, 170397, -28200, -163642, -218554, 274536, 66248, -235797, 80320, -219082, -18764, -189717, -167413, -192181, 45095, 27139, -210893, -121257, 48648, 270705, -190073, -53390, 71418, -115636, -144666, -210925, 288658, 54218, -267977, -113230, 16758, 3232, 332890, -39209, 226795, 46375, -244507, -44629, 276802, 31048, -22651, -67896, -19553, 307837, 221102, -381231, -234202, 270713, 29609, -123572, 42154, 180346, 90819, -143312, 104069, 28985, -94980, -72677, -174556, -221232, 74103, 133019, 62209, -177626, -150571, -81606, 56330, 94166, 112925, -51600, 90179, 63389, 51394, -248479, 144627, -250403, 42657, -111944, -89333, 132492, -42047, -16372, -201339, 215771, 192673, 142911, 211210, 67306, 282734, 110919, 22018, -153520]
11844a71602P996F0207I798K1579a42581A7610i5803G5726a164k33433A15197
11832f1543A75387a77934E0125J24567d1722A09742P8219a76808E5762b13094
11821a25345K3761k9763C6612a85878N0887A38036a58361L2122l27880G72c7025
11809a71223j39110B24555d13031D592f3277F0094f6717k8351O50B76840d989
11797A08506a2920A44087f3921A12515a52974D1282C71K3925a74795j7156a8123
11785b10965k84704E796h9336J363o4692o3058b5654A45605O7302m1194a32714
11773D4021a83611B05833D7945a2889l31493M4267C6520L00120a02597A75736
11762H4742b04348I7740a59709l3790A76926a04569i976B31643f8299l8603G0954
$$ y = [-171602, -163606, 60207, 9798, 31377, -142581, 17610, -95803, 75726, -1164, -234597, 115197, -61543, 175387, -177934, 50125, 174692, -41722, 109742, 187961, -176808, 55762, -213094, -125345, -101584, -131347, 36612, -185878, -134991, 138036, -158361, -126239, -454119, 772, -37025, -171223, -310333, 224555, -413031, 4592, -63277, 60094, -66717, -95068, -94418, 276840, -4989, 108506, -12920, 144087, -63921, 112515, -152974, 41282, 371, 24296, -174795, -191951, -18123, -210965, -495669, 5796, -89336, -87973, -152665, -215723, -25654, 145605, 212907, 171713, -132714, 44021, -183611, 205833, 47945, -12889, -344382, -300115, 36520, 336640, -102597, 175736, 84742, -204348, 97740, -159709, -193499, 176926, -104569, -9976, 231643, -68299, -106902, 70954]
11750d5223o7704j77502A2131a51949l28651B50278l2614M2354a17794B85149
11739a47520A2406g6812G4882f6601A10405R7062c1545H1823c19048A64908b83908
11727a33049c0501k26157A21942a09203L5579B69268c39844a23180C26391a7534
11716G4130b45718A36222c00155n822c1904A65471b80440I513a6518p7637B18985
11704A98998b0794B62654a06547f573k84315A45241d7589b1413F5289j194O8713
11693A32808a05489B91915a4866l3409m8805k18739B96541a68818D26638a74644
11682b39147A88117m2007h4354o3721E9153a69385B3026M4508i2651b8561k58285
11671b86846r0447J57083d0181A16863k6131a4464l8447j19664B66671q8595B1125
$$ y = [-45223, -112927, -290429, 12131, -151949, -480600, 250278, 217664, 260018, -117794, 285149, -147520, 12406, -76812, 74882, -66601, 110405, 207467, -31545, 81823, -319048, 164908, -283908, -133049, -30501, -256658, 121942, -109203, -73624, 269268, -339844, -123180, 326391, -17534, 74130, -245718, 136222, -300155, -305977, -31904, 165471, -280440, 9513, -16518, -94155, 218985, 198998, -20794, 262654, -106547, -6573, -290888, 145241, -47589, -21413, 65289, 64095, 132808, -105489, 291915, -14866, -48275, -97080, -315819, 296541, -168818, 426638, -174644, -239147, 188117, 146110, -84354, -148075, 59153, -169385, 23026, 67534, -92651, -28561, -286846, -377293, -220210, -40181, 116863, 90732, -14464, -52911, -172575, 266671, 178076, 21125]
11659b09068f08B30779M9958j25300d4678C37934r8396a31599i766j12498E935
11647G3109f1814b8946H2734a15948m3823Q85j15604a0599j58340f7596A05389
11635h4264k0700B42302b2529F0319c3363A64881K95098A9204M12160b84316K5085
11624b59231C52822j47535D6842M8697C6012a67627a7902B0792c5492a2868k35026
11613b47894A32792e2600o7711C3695R469a15450C17353g6573A30569L22278a45606
11601b13787d5022D1082J91992e4245k2599C38952b22697G2519H319j920N11539
11590E17938e8763n10986A46959L28691D8322b67025B33701C9967f2754G2632
11579A3709a23413B74495O659C9490K68891a81055G4781b33009C24383A2366a6598
$$ y = [-209068, -608, 230779, 280737, 155437, -44678, 337934, 239538, -131599, -9766, -122264, 5935, 73109, -61814, -28946, 82734, -115948, -159771, -158886, -274490, -10599, -168939, -67596, 105389, -84264, -104964, 242302, -22529, 60319, -33363, 164881, 459979, 19204, 431364, -284316, -259231, 352822, 205287, 46842, 95539, 36012, -167627, -17902, 20792, -35492, -12868, -247894, 132792, -52600, -120311, 33695, 43164, -115450, 317353, -76573, 130569, 452847, -145606, -213787, -45022, 41082, 233074, -54245, -76844, 338952, -222697, 72519, 8319, 6399, 517938, -58763, -569749, 146959, 475650, 48322, -267025, 233701, 39967, -62754, 72632, 13709, -123413, 274495, 281154, 39490, 308381, -181055, 74781, -233009, 324383, 12366, -16598]
11567A4983a7830j00452F5930k3948O7963b1917f841j06842C897J4474J21494
11556A39865i0020D58180A1544b1606G0193b54564J5348j79895E8429J72553c7594
11544A63117Q5301C1498a70335A69360e2545A27174J29081A27731e3668A5842
11533a5391l7225l9309B43473c4383J6030A06861b77093F288P0775g0254j64789
11522b35043l2084B20841I8544J24263E7272P544J94486b18582B27838a45156
11511b9845f693B18224A3141N925a35705C8650Q7294l0585b1187B01197p1882
11500A29315L27611D9694K16243K22173k17855n7068G2895K0845O6237h9428A16189
11488d7939C4806J64351a25392A1653J40052D5736M04827f9119A25042O5930c19012
$$ y = [14983, -17830, -118282, 65930, 41982, 109945, -21917, -6841, -113683, 3897, 18371, 139865, -90020, 458180, 11544, -21606, 70193, -254564, -239216, -419111, 58429, 230982, -37594, 163117, 248418, 31498, -170335, 169360, -52545, 127174, 256255, 127731, -53668, 15842, -15391, -52616, -91925, 243473, -34383, -18353, 106861, -277093, 6288, 77063, -70254, -235043, -267127, 220841, 98544, 222807, 57272, 64816, 259302, -218582, 227838, -145156, -29845, -6693, 218224, 13141, 19066, -135705, 38650, 125944, 95359, -21187, 201197, 129315, 456926, 49694, 265937, 488110, 270255, 213187, 72895, 93740, 159977, -89428, 116189, -47939, 34806, 199157, -125392, 11653, 151705, 45736, 450563, -69119, 125042, 190972, -319012]
11476a34846C6817J62621Q4273A30799E1928b5069D4450J52499a70488E13752
11465e609A20272a79786Q3684B89033j19926j7496K72866h456F4675K72774I2284
11453a54370A81748F5949k3178i72C3866f8637j20676B36786a38526A43278o5861
11442G7417N9700J40791b01025l1610c0696E4688O6501e3264B0824L81828D2159
11430f6272G1053O5956N4906k3983C7766b0174k77439j8292a54469B45287b1589
11418g8462B8682d10266E7463c9806B40845d5700C34662b09856A01535J70109
11408B71644a04444K57c6628B5121a33933M9906j54164G7581h9505m7052B23360
11396b26824H8018i4548m4374A97523P8211c39229G8294B0439J5019r099d2345
$$ y = [-134846, 36817, 199438, 283711, 130799, 51928, -25069, 44450, 196949, -170488, 513752, -5609, 120272, -179786, -96102, 289033, 169107, 151611, 424477, -8456, 64675, 337449, 92284, -154370, 181748, 65949, 42771, -972, 33866, -68637, -189313, 236786, -138526, 143278, 77417, 137117, 277908, -201025, -232635, -30696, 54688, 121189, -53264, 20824, 402652, 42159, -66272, 71053, 137009, 191915, 167932, 37766, -20174, -297613, -315905, -154469, 245287, -21589, -78462, 28682, -410266, 57463, -39806, 240845, -45700, 334662, -209856, 101535, 271644, -104444, -104187, -36628, 25121, -133933, -84027, -238191, 77581, -89505, -136557, 223360, -226824, 88018, -94548, -138922, 197523, 275734, -339229, 78294, 20439, 35458, 26359, -42345]
11384A30904b51587A58123e3164A468a54953C43983a43641H9806a20031j02083
11374b22114H1809a20786j03897A36680Q1030I4547A9025K3573P1291g8122D14864
11362A40150c28310a4801j18213H8388d9991A57801b94961a5608G7825b29213
11351a1549A65563b5243n9740B8145b69623A62548A2647J4263d09329B0096a8139
11339B2392P5457l3775d11966h8147F5775A3349a7899j00407A15415C7571j2453
11328B5118K6817J71879K5169b14474A38083b27041H4674K5508a41226K3011A87415
11316i1627A88648D7590J9371c8640L426j24292a948p4017l7344A8100a6026I1805
11303b87531C0838N6695C4356J6802b41251M5562f2024A65430a08479D40700a27487
$$ y = [130904, -251587, 158123, -53164, 1468, -154953, 343983, -143641, 89806, -120031, -222114, 81809, -120786, -224683, 136680, 217710, 94547, 19025, 42598, 113889, -78122, 414864, 140150, -328310, -14801, -133014, 88388, -49991, 157801, -294961, -15608, 77825, -229213, -11549, 165563, -25243, -84983, 28145, -269623, 162548, 12647, 26910, -409329, 20096, -18139, 22392, 97849, 64074, -411966, -88147, 65775, 13349, -17899, -118306, 115415, 37571, 25118, 51935, 223814, 248983, -214474, 138083, -227041, 84674, 110182, -141226, -118215, 187415, -91627, 188648, 47590, 66961, -38640, -35214, -159506, -1948, -75965, -113309, 18100, -16026, 91805, -287531, 30838, 87533, 34356, 51158, -241251, -195689, -62024, 165430, -108479, 440700, -127487]
11291e0765A7238K37645C905h0365j42414Q2997C75485f7069l2213A32027F4675
11279c69165G9024b7297J2718C25914I7586a17476a387j33821L4343k44207a70801
11267b65488P6459A9580K0728Q0664e2823j09916D58707b27884h5788k22350d1058
11255a42213D5386K07689E8138a05041F982a70017h3562g772B52801q4193b72991
11243e6493j78570B38853a63576H7185M2809A3783J65322g0770j58952D0600b04144
11231e55754H0571B9339b22516J08556j07245C8254b54148j83946A58409d5529
11220b73645a0816F0638J91041E7455g1561k81715D1791a8385j37776J6138k6581
11209a66604A8472c13326J25896A48517a92198C25418E6023J15195b83597J14084
$$ y = [-50765, 17238, 254883, 3905, -80365, -222779, -139782, 375485, -67069, -99282, 132027, 64675, -369165, 79024, -27297, -14579, 325914, 97586, -117476, -1387, -135208, -100865, -345072, -170801, -265488, -189029, 19580, 40308, 120972, -52823, -162739, 458707, -227884, -85788, -308138, -41058, -142213, 45386, 253075, 58138, -105041, 6982, -170017, -83562, -7772, 252801, 168608, -272991, -56493, -235063, 238853, -163576, 87185, 129994, 13783, 179105, -70770, -229722, 40600, -204144, -555754, 80571, 29339, -222516, -113960, -221205, 38254, -254148, -438094, 158409, -45529, -273645, -10816, 60638, 251679, 57455, -71561, -353276, 41791, -18385, -156161, -140023, -166604, 18472, -313326, -187430, 148517, -192198, 325418, 56023, 171218, -283597, -169513]
11199a69513A87065H3778c97123N0399A52262a12301c4089j39651A14637q308
11189A06329a17479C23797b99439F4239a46504j41212A42191D2978a10654M6279
11179f4375Q579l2914B28851j06797a53674d2227C79710a13645F0491e4291B14599
11167e8940r405l31556a06875J723l55446c6265H9038e1657m89243b31696N4622
11156a77074f7574G5408h4475j08893b7927k05621D8450a75027C4345J69620i3613
11144I8753b68637m6964J13229A00336b5663l5684p508a5471A15267K8949K4269
11133A68485G4371a00362j25395K0538D8637a27641C96886C8609p100K3406a60749
11121H4822b49816n2823r4492p9037B51411h9007B24878D8531a02457n2859A41300
$$ y = [-169513, 187065, 83778, -397123, -346724, 152262, -112301, -34089, -173740, 114637, 106329, -117479, 323797, -299439, 64239, -146504, -287716, 142191, 42978, -110654, -64375, -55796, -88710, 228851, 122054, -153674, -42227, 379710, -113645, 60491, -54291, 214599, -58940, -68345, -399901, -106875, -105152, -460598, -36265, 89038, -51657, -540900, -231696, -177074, -67574, 75408, -84475, -193368, -27927, -233548, 48450, -175027, 34345, 203965, -93613, 98753, -268637, -315601, -202372, 100336, -25663, -61347, -68855, -15471, 115267, 144216, 168485, 74371, -100362, -225757, -205219, 48637, -127641, 396886, 38609, 31509, 54915, -160749, 84822, -249816, -302639, -397131, -476168, 251411, -89007, 224878, 48531, -102457, -155316, 141300]
11109B9193e712q8371A27741A6241a19739B51376l5574b02203d2408E0652L9042
11098H9694J72764j28979g6069C42738J8911K19301A99127L36269E9451K23123
11088B82574J39266p4688a2215B23041m6617L09051C3069J35354O9026q98k8861
11077B07690p7383k880J65405K311L20772k97452m1318a29108M4259D26184j48308
11066B77876l1861E2504J57592I6226J90015k6942L93318k21787j57744O1949
11056C35035K90965O72j77436K30007B83910J44449L65095O0833l67305J98488
11046F85470o7296A81344N02833j39521K85050k34785k3797K25743B71874M62739
11036G34613j52884m1515j50077N34168j45537C27684M47529k46879p3474N07904
$$ y = [29193, -5712, -94083, 127741, 16241, -119739, 251376, 215802, -202203, -42408, 50652, 89694, 262458, 133479, -76069, 342738, 361649, 580950, 199127, 535396, 59451, 282574, 421840, 347152, -12215, 223041, 176424, 485475, 33069, 168423, 237449, 236551, 207690, 130307, 127427, 292832, 295143, 615915, 318463, 277145, -129108, -84849, 426184, 277876, 246015, 52504, 210096, 96226, 286241, 259299, 652617, 430830, 273086, 335035, 626000, 626672, 449236, 679243, 283910, 428359, 793454, 854287, 486982, 685470, 618174, 181344, 684177, 544656, 829706, 594921, 571124, 796867, 271874, 734613, 581729, 540214, 390137, 924305, 778768, 327684, 775213, 528334, 454860, 962764]
11026I62764m60370m4531K45158j16167k41745j48354L09162M5270A85464K80529
11016D65993q5226K69203k65682J30952K44415C02834J56868J43056q6288K15425
11006G31895l09226q2313J89940p22L05458C44280J47305Q3868L6217p9832P1330
10995F03168J35293B29270N55598Q2321l05695K03513Q3586O0529k34453P9759
10985G54428j69749J17877J61447k63935K01047J14435M30528K30226m5256m5578
10975A485470J00282K39586N56742K63617n4846l25889J73633L973k69908j91202
10965A981458m82971K04298o39705J31376J26343K47272l13139M18299l97887
10956A275344l10793M98463m28797l1616k02161k85645J05428B39455K6098m6741
$$ y = [962764, 502394, 457863, 703021, 586854, 345109, 196755, 505917, 551187, 185464, 465993, 380767, 649970, 384288, 515240, 759655, 302834, 459702, 602758, 516470, 731895, 422669, 340356, 530296, 529574, 835032, 344280, 491585, 575453, 611670, 531838, 603168, 738461, 229270, 784868, 867189, 561494, 765007, 848593, 909122, 674669, 754428, 584679, 702556, 864003, 600068, 801115, 915550, 1346078, 1576304, 1531048, 1485470, 1585752, 1825338, 2382080, 2645697, 2590851, 2264962, 2438595, 2442568, 2172660, 1981458, 1498487, 1702785, 1063080, 1194456, 1320799, 1568071, 1254932, 1673231, 1275344, 964551, 1463014, 1034217, 1002601, 800440, 514795, 620223, 239455, 265553, 218812]
10946B18812f3047A15342J75863o5420c4178E86310d429A42726K18637j00650
10936B60713j5036j923A2865d4641q6621A36427B3753R6929b04727C9006L83171
10925D22177A11066e9208h703l2416A35911e2326B7852a58951O5185n4027j54145
10914c01938J7823i9709B37655a1596C69549E2165b7396j22367f6528j2608D3669
10902B5751I246b21246p6112M0467E4128R9202d0895F7395a81320C44234A53795
10890c6795F1038b44647D3861b21546A77546b01806B4774b0648j50358A66963
10879a61247j5512Q5831l85806A79472g6305q6225k85194I2506O007K8514J05242
10868B32269A4517c456R84o1051K512n6128C6597g6113A33286c694k1868l6414
$$ y = [218812, -63047, 115342, 291205, 225785, -34178, 586310, -4429, 142726, 361363, 260713, 245677, 243754, 12865, -44641, -131262, 136427, 23753, 120682, -204727, 39006, 422177, 111066, -59208, -8703, -41119, 135911, -52326, 27852, -158951, -93766, -147793, -301938, -284115, -99709, 237655, -11596, 369549, 52165, -27396, -149763, -66528, -79136, 43669, 25751, 9246, -221246, -297358, -256891, 54128, 153330, -40895, 67395, -181320, 344234, 153795, -36795, 61038, -244647, 43861, -221546, 177546, -201806, 24774, -20648, -171006, 166963, -161247, -176759, -90928, -476734, 179472, -76305, -162530, -447724, 92506, 98513, 127027, 232269, 14517, -3456, -2472, -63523, -61011, -117139, 36597, -76113, 133286, -3694, -25562, -61976]
10856f1976r7769k52784J52996J09610A77014J23857a76867m9839o3971A47947
10845a123j93131A08315N2578e4976j92865B27357a09195D1431c3841j07219b2044
10833B528b3471E0289R0113e9372E9594b67443g2892j97946B27472F76J4495b17455
10820G1880e4339j18326A38754n5442d61592E8908J04502c5525A29608e5737a3626
10808A26097b12817A12920J84103a57737D2212K3576J76177F1780M6766g4645
10797a98219C12171E6481a02179C0214J44545q4117h0672D2641a8620j10551j84204
10786c13375A91553d4096J5872I0984a0882p7636B64033f8018D6057a45434e0317
10774I9249a16012m9610E8821a46936I79J07806A5699K33043M7254j33779a92943
$$ y = [-61976, -159745, -412529, -259533, -149923, 177014, 300871, -176867, -226706, -290677, 147947, -1123, -194254, 108315, 160893, -54976, -247841, 227357, -109195, 41431, -33841, -141060, -22044, 2528, -23471, 50289, 140402, -59372, 59594, -267443, -72892, -270838, 227472, 676, 15171, -217455, 71880, -54339, -172665, 138754, 83312, -461592, 58908, 163410, -35525, 129608, -55737, -13626, 126097, -212817, 112920, 297023, -157737, 42212, 65788, 241965, 61780, 108546, -74645, -198219, 312171, 56481, -102179, 30214, 174759, 90642, -80672, 42641, -18620, -129171, -313375, 191553, -44096, -28224, 90984, -10882, -88518, 264033, -68018, 46057, -145434, -50317, 99249, -116012, -165622, 58821, -146936, 979, 108785, 15699, 248742, 295996, 162217, -192943]
10762A2290J5875K27375j06212D8247a57632P7677J893j56586D750e7337A58680
10750d3625C13377c89568f9735A97411b15677f3016b2417p7412H6485a22877A39983
10738H0618f8012j5519A9411i9979I8107f0990p6982J4292J0671j74366M3913
10727b43462A09409a52754c2699n6940l4551K1550D1088a47600B98662E9607h9498
10715b2805A38111a58050k54280a87460B753a17914j06633D57585A25158O6313
10705A91471a87243o7966a07892A77719a88806A02113a40033c8173B08183a33455
10694a50862c2186l36634a6493r1049k1185e4511r630j33174A76589q6592i4851
10682b26279A98641b41802D6342b00060j20910k89951a02016e0064A231f3974
$$ y = [12290, 28165, 255540, 149328, 48247, -157632, -79955, -78062, -234648, 4750, -57337, 158680, -43625, 313377, -389568, -69735, 197411, -215677, -63016, -22417, -99829, 86485, -122877, 139983, 80618, -68012, -83531, 19411, -99979, 98107, -60990, -137972, -123680, -113009, -287375, -243462, 109409, -152754, -32699, -89639, -124190, -102640, 41088, -147600, 298662, 59607, -89498, -22805, 138111, -158050, -412330, -187460, 2753, -117914, -224547, 457585, 125158, 191471, -187243, -255209, -107892, 177719, -188806, 102113, -140033, -38173, 208183, -133455, -150862, -32186, -368820, -16493, -107542, -128727, -54511, -64141, -197315, 176589, 89997, -94851, -226279, 198641, -241802, 46342, -200060, -320970, -610921, -102016, -50064, 1231, -63974]
10671c40359J49800f3851o8031e0024l7490r5173C7387K06331a02702j3408j35209
10660b51319A85591D337G76c22265A33332c61235A11738j8602b29295e9399a3459
10648E119J10814h6566k86901k7065H0336Q0372b15507I8910D3649E092c8960
10636e9078j43331A272e24130B01087c797A98027i2457a8781k86950J08736j03632
10625c00627N1502e5571l12747e5155A49846A0083a03254k86085e2553j42136
10615a94689j61757J22649C8632j9253J22871D1610e1111l21866A72734l0894
10605A41840d1411A35895b92274p2078i4666D7358d18126G9750k5932H9g1689
10593A78307e0090F0683a27854k2401B0058J04766a68590O579H4148a04603k9538
$$ y = [-340359, -190559, -63851, -131882, -50024, -87514, -182687, 37387, 243718, -102702, -116110, -251319, 185591, 4337, 776, -322265, 133332, -361235, 111738, 93136, -229295, -59399, -13459, 5119, 115933, -86566, -373467, -400532, 80336, 160708, -215507, 98910, 43649, 5092, -38960, -59078, -202409, 1272, -524130, 201087, -3797, 198027, -92457, -18781, -305731, -196995, -300627, -249125, -55571, -368318, -55155, 149846, 10083, -103254, -389339, -52553, -194689, -356446, -233797, 38632, 19379, 142250, 41610, -51111, -372977, 172734, 141840, -41411, 135895, -292274, -364352, -94666, 47358, -418126, 79750, 53818, 89, -71689, 178307, -50090, 60683, -127854, -150255, 20058, 124824, -168590, -162011, 84148, -104603, -134141]
10582a34141A9802K13879d31064a04547j15816e7984D7738a44731D6315i5761
10571b05613i4112D4796a63081L7036C8053j1288b35273C07714n0183a14783G100
10559b47342B5451g4580A8293J11517a47122A16059C9854N4858g5352A41141L0436
10548A71577f0541B97405g8164C013J37200i1413A27513a08464G2981M1270O0774
10537A75025Q7215b0429l6657H1871C1739a55653J2332j2353m709b5235q0491
10526a05726j25050A66266b7462G5535a57864E3380g4330o932A08344c52556a9507
10514a05892k62195B16449d35192A78654c4725B18274j7237F2289O2927K25415
10504C50631A8527g4247j51248K765B24077G7135f9878A06208o057C0297b70924
$$ y = [-134141, 19802, 233681, -431064, -104547, -220363, -57984, 47738, -144731, 46315, -95761, -205613, -94112, 44796, -163081, -126045, 38053, 26765, -235273, 307714, 257531, -114783, 7100, -247342, 25451, -74580, 18293, 129810, -147122, 116059, 39854, 94712, -75352, 141141, 171577, -60541, 297405, -78164, 3013, 140213, -91413, 127513, -108464, 72981, 114251, 175025, 262240, -20429, -57086, 81871, 31739, -155653, -143321, -155674, -160383, -25235, -105726, -230776, 166266, -27462, 75535, -157864, 53380, -74330, -81262, 108344, -352556, -19507, -105892, -368087, 216449, -435192, 178654, -34725, 218274, 201037, 62289, 125216, 350631, 18527, -74247, -225495, -222730, 224077, 77135, -69878, 106208, 100151, 30297, -270924]
10492A2104b61109a21328b110k68176a11346d4464j90036K1476k00536h2041C24518
10480A61583d7603j14851A48451B7121J39195f0658b404A71769J51749I66a0173
10468i571l9934k93320g1654J4017A56328c05654B72204a35624a6503r126j30800
10457a56429j59167B3373f3609F2030d2502J8559H964J80138p0458a56173J6515
10446a39658j05098C14633d2245A04375A7747K72585i7412B58455k9081o8086
10436A61288d1759a4577j75834A49594J34182A25160k1612J36787m612K01730
10426D37453A81657g5191L1359l32062J07476B16831a08763D1030b26275b109
10415E9917a49000A39587b26019C75130b62860R2614G1717k3125J3717g1358q2708
$$ y = [12104, -261109, -121328, -2110, -270286, -111346, -44464, -234500, -213024, -413560, -82041, 324518, 161583, -47603, -162454, 148451, 27121, 166316, -60658, -2404, 171769, 323518, 966, -10173, -9571, -49505, -342825, -71654, -57637, 156328, -305654, 272204, -135624, -16503, -25629, -156429, -315596, 23373, -63609, 62030, -42502, -23943, 8964, 189102, 118644, -156173, -139658, -244756, 314633, -42245, 104375, 17747, 290332, -97412, 258455, 229374, 161288, -41759, -14577, -190411, 149594, 283776, 125160, 103548, 240335, 235723, 437453, 181657, -75191, -43832, -375894, -268418, 216831, -108763, 41030, -226275, -2109, 59917, -149000, 139587, -226019, 375130, -262860, -170246, 71717, 48592, 62309, -71358, -154066]
10404a54066A30887L6522m3536f1990A14894K55936C649c1137l6708q5915L4567
10393a19193m4352A37761a66755B41413n490b38083B89890H9825l6437B2707M18367
10382D41074C7208b0815A41607K2549d9863A40375Q2914F1194J66998F8253L35614
10371D03867j16157F7160K06230A24336L75647o5519M9888j37657K3816A33509
10360B79146J54675k4879A53625B9669n724f8844H6828j7327L53853K34459n9049
10349E98764j33733H0114K72481j16953K7540F4191J55764J62613n6042j02195
10339B24331r1410Q6469L845r8230M3967N2366d6418p2366B4178J60104D8815
10327I2984O4279F8183g9155C78616a03181B69825A28184a12743A196L53611a46856
$$ y = [-154066, 130887, 167409, 123873, -61990, 114894, 370830, 3649, -31137, -67845, -153760, -119193, -163545, 137761, -166755, 241413, 235923, -238083, 289890, 89825, 53388, 22707, 441074, 37208, -20815, 141607, 164156, -49863, 140375, 223289, 61194, 228192, 68253, 403867, 287710, 67160, 273390, 124336, 499983, 434464, 484352, 346695, 370511, 133509, 279146, 433821, 408942, 153625, 29669, 23945, -68844, 86828, 69501, 423354, 657813, 598764, 465031, 80114, 352595, 235642, 263182, 64191, 219955, 382568, 326526, 224331, 132921, 219390, 223235, 125005, 168972, 221338, -46418, -118784, 24178, 184282, 48815, 92984, 157263, 68183, -79155, 378616, -103181, 269825, 128184, -112743, 1196, 354807, -146856]
10315B36195j9471J1844j06141f1524j63295j33049B72330A2019b10382B54649
10304b33856g1434j31182A05769L5945c22402B44699E3570L0937A7206L45608
10294C62814A25147a91668a4050f308j06036j38485Q1671B32565e4965A45659
10283E2739b31299l7149n760A6362J33096d3867B61905A6224J3330h1730j11200
10272a92930N3990D9799b27493L5484A51904a02929j68605M964D5167c14996d1483
10260a37229C89114K6723Q3195p0199A09928K50180P1845G2070Q4430p1459g7595
10248G2422K47025j6254b84796B63039A01556b83764B40708E7690A6510R59O4228
10237H1697i278F3552c8896k13890A30218F484b9057k74833f4927o3820N1B8090
$$ y = [236195, 216724, 228568, 122427, -61524, -224819, -357868, 272330, 12019, -210382, 254649, -233856, -71434, -202616, 105769, 141714, -322402, 244699, 53570, 84507, 17206, 362814, 125147, -191668, -14050, -6308, -112344, -250829, -169158, 232565, -54965, 145659, 52739, -231299, -268448, -274208, 16362, 149458, -43867, 261905, 16224, 29554, -81730, -192930, -138940, 49799, -227493, -192009, 151904, -102929, -271534, -266570, 45167, -314996, -41483, -137229, 389114, 415837, 499032, 428833, 109928, 360108, 431953, 72070, 156500, 85041, -77595, 72422, 319447, 303193, -284796, 263039, 101556, -283764, 240708, 57690, 16510, 17469, 81697, -9278, 63552, -38896, -252786, 130218, 6484, -29057, -303890, -64927, -128747, -128696, 28090]
10224B17100c25808i2030k82044J62851A18378B9708b7205j01098G1931a37916
10213a74312B58011A10870C0621a06967b5130A09571C0100i7181k22153C60064
10202a71939A22290c92290g880I0322a99364b4883D3886f237j88078q3618Q510
10191b69423L0180m9602d8083d372j33807K4519j59371J14334A04080M1762a32529
10179B67444C3392a01298H6080a46306c0345k18079B08555a40376a0867A0615
10168d3020F8215l2666a07668A69014k4476e5919A52341a29181H7251e1655H4809
10156H7629D2243J91004f5511a2984A1479a69591A2129a92553A15607g6176A45049
10144H683c30117a17086L1785j40860h593k45766g3907A08609C8461q243O5406
$$ y = [217100, -325808, -92030, -374074, -211223, 118378, 29708, -27205, -128303, 71931, -137916, -174312, 258011, 110870, 30621, -106967, -25130, 109571, 30100, -97181, -319334, 360064, -171939, 122290, -392290, -7880, 90322, -199364, -24883, 43886, -6237, -194315, -277933, -269423, -239243, -288845, -48083, -4372, -138179, -113660, -273031, -158697, 104080, 145842, -132529, 267444, 33392, -101298, 86080, -146306, -30345, -248424, 208555, -140376, -10867, 10615, -43020, 68215, 35549, -107668, 169014, 144538, -55919, 152341, -129181, 87251, -51655, 84809, 87629, 42243, 233247, -65511, -12984, 11479, -169591, 12129, -192553, 115607, -76176, 145049, 8683, -330117, -117086, -85301, -226161, -8593, -254359, -73907, 108609, 38461, 30218, 95624]
10133I5624k2584L0543B2653g1617m6417k80951c2424j23088k34463A48602a06237
10121d07780a60392j33012a7032k52363o785A94232H1115b55662f3300q4994L9117
10110a09177O985F8930L6898a71160j00429A31325b61674j42045D2434a90368
10099i2846A76701c29814a06417A23979a58063n417G3644J12388p4012c01417
10088a01011a4523j58928d387j68888E4441J3839O1143f44732e3945l54010B9739
10076A58045G8180J88627F071G2J58288B1404M754c08154A00291J59582a2230
10064H334J4113N9632a02880j29898A6934c33605B162a09521b0576B037f7507
10052a05243G6435a27584L0930H8289F156J33888d5028k68712p0148C0723c85830
$$ y = [95624, 73040, 103583, 22653, -71617, -118034, -398985, -32424, -155512, -389975, 148602, -106237, -407780, -160392, -293404, -17032, -269395, -276180, 194232, 81115, -255662, -63300, -148294, -109177, -102192, 68930, 105828, -171160, -271589, 131325, -261674, -403719, 42434, -190368, -92846, 176701, -329814, -106417, 123979, -158063, -163480, 73644, 186032, 112020, -301417, -101011, -14523, -173451, -4387, -173275, 54441, 68280, 129423, -644732, -53945, -407955, 29739, 158045, 78180, 266807, 6071, 72, 158360, 21404, 26158, -308154, 100291, 259873, -12230, 8334, 22447, 82079, -102880, -232778, 16934, -333605, 2162, -109521, -20576, 2037, -67507, -105243, 76435, -127584, -96654, 88289, 6156, 140044, -45028, -313740, -383888, 30723, -385830]
10040b68110C19256b6209k80688F8154a11119q7170A20395J42423a20458A7218
10029B15909d970j12446d5935B3857d1072l8456N205A19907a25353B56397a39875
10017B25373f1600m40008C36805d8535n6040D5345K12388a58741o9510Q5222A5730
10005h3172D24393B06849a57650A83484J04628c5881j73500m1029n2829i6329
9994H696h7448A80478o3433a06088j47502j48368a02023B46466G2140b82158P8571
9983b03587A37672a3533j66107c7552k78439Q7954E8831b0313j10058j20821E20820
9971c34721B348c78810f4875p00j89619f280j09737k87381d8238J1144B2000a38377
9958e3564k9860k2142q6449c9947j88584L6088h8373K4882l7314c8413l01984
$$ y = [-268110, 319256, -26209, -306897, 68154, -111119, -198289, 120395, 262818, -120458, 17218, 215909, -4970, -117416, -45935, 23857, -41072, -79528, -74323, 119907, -125353, 256397, -139875, 225373, -61600, -501608, 336805, -48535, -104575, 45345, 257733, -158741, -228251, -143029, 15730, -83172, 424393, 206849, -157650, 183484, 288112, -35881, -209381, -250410, -303239, -96329, 8696, -87448, 180478, 117045, -106088, -253590, -401958, -102023, 246466, 72140, -282158, -203587, 137672, -13533, -179640, -37552, -315991, -228037, 58831, -20313, -130371, -251192, 520820, -334721, 2348, -378810, -64875, -65575, -255194, -6280, -116017, -403398, -48238, -37094, 22000, -138377, -53564, -83424, -105566, -192015, -39947, -228531, -192443, -88373, -63491, -100805, -38413, -340397]
9947c40397F7523J25888g8893A81100a2985l41696g265k77849R5755A3160a12767
9935B10049B6037f2195A9801a76760F4070K18696f3703E92Q426b01017O2728j00460
9923b38749p5548j57958Q5859a74219b1647k01036j88436a40503c1368E3550B4733
9911c71884A32039a34707o8151e8011G7103i1398j90760E80244f2671b9723k66455
9900b96178j06621A05664c79538L4557a43683A2236J3654a59351A3635R5391a14192
9888f3234E42069b56787P0976J8266K7973n2044k37709a16352B39331E984a69692
9876c57720F398c29628B854N3084L3393K2951g0515i427j74111B03520b7107k6305
9864e3412m60341A65048o3952m0302a46765Q402e7357j1093F2689b00o8222k4631
$$ y = [-340397, 67523, 193411, -78893, 181100, -12985, -354681, -7265, -285114, -189359, 13160, -112767, 210049, 26037, -62195, 19801, -176760, 64070, 282766, -63703, 592, 9018, -201017, -138289, -238749, -314297, -472255, -386396, -174219, -21647, -222683, -411119, -140503, -31368, 53550, 24733, -371884, 132039, -134707, -202858, -58011, 77103, -91398, -282158, 580244, -62671, -29723, -296178, -402799, 105664, -379538, -344981, -143683, 12236, 25890, -159351, 13635, 109026, -114192, -63234, 542069, -256787, -185811, -167545, -139572, -191616, -429325, -116352, 239331, 5984, -169692, -357720, 6398, -329628, 2854, 55938, 89331, 112282, -70515, -9427, -183538, 203520, -27107, -53412, -513753, 165048, 101096, 60794, -146765, -138363, -57357, -68450, 62689, -200, -68422, -93053]
9852i3053C1186b57483g2128j45828a4615l8616K3764m49785c3556p8810n1319
9841a63685A37680c2176G3301b75722k1028A03996m8272g2788D583c45437O3053
9830b82384J04939a4768A7174K3443d5902i853j23530a5883C573b6333o7461F4326
9817A71703J74768a57542E6941a74727d1673l3717c2495l14740J40451c0922L441
9806b7481A7907a76525k5609j24928j1644A17488b6922j48148A43499n1616a06218
9794h7065E7126b46491B25069R9914o3279o4907k1212d45217D0048c84217M1646
9783c42571B1282J1879j1627e7887j83291F5645a85877B49477h0069a1709j1092
9772b2801C6808a14895n8726G7343a48849a7564l44508J68236F1992L8336d0207
$$ y = [-93053, 31186, -257483, -72128, -217956, -14615, -53231, -29467, -479252, -33556, -112366, -163685, 137680, -32176, 73301, -275722, -296750, 103996, 55724, -72788, 4583, -345437, -282384, -177445, -14768, 17174, 40617, -45902, -9853, -133383, -15883, 3573, -26333, -93794, 64326, 171703, 346471, -157542, 56941, -174727, -41673, -75390, -32495, -347235, -206784, -30922, -27481, 17907, -176525, -202134, -327062, -338706, 117488, -26922, -175070, 143499, 91883, -106218, -87065, 57126, -246491, 225069, 324983, 261704, 196797, 175585, -445217, 40048, -384217, -342571, 21282, 33161, 21534, -57887, -241178, 65645, -185877, 249477, -80069, -11709, -22801, 36808, -114895, -173621, 77343, -148849, -17564, -362072, -193836, 61992, 100328, -40207]
9760A28795b22425A22459a16654D3326d4572B94405b75177O2155Q3116j90334
9750c20240J38270A46154b66294H3454I507b3308A36926R3807o9000a65131P6791
9739h8340j91295A37025f695q7186j33434A31897a08396b3128m20668A4033P0635
9728H4668a74584D6463a31408G18c16920C3686a68318l8080Q8325l6140H105b11480
9715c03238a6283j21889j03006B7285D732J40560b90828L5367R2660P6999D0760
9703f9407E7419e6605k23667a24025C21840g5379K2430C6266J31723C0831K48220
9692B79051L5830F3156M054L2958c0186j5508A45793g0990L194L2980A9159c13781
9679G6392e9523j21903A13807E1486d63051a31347l04702f0242f502j83719B71844
$$ y = [128795, -222425, 122459, -116654, 43326, -44572, 294405, -275177, -213022, -129906, -320240, -181970, 146154, -266294, 83454, 9507, -23308, 136926, 230733, 161733, -165131, -88340, -279635, 137025, -6695, -93881, -227315, 131897, -108396, -23128, -443796, 14033, 84668, -174584, 46463, -131408, 718, -316920, 33686, -168318, -206398, -118073, -154213, 8105, -211480, -303238, -16283, -138172, -241178, 27285, 4732, 145292, -290828, -255461, -162801, -85802, 40760, -69407, 57419, -56605, -280272, -124025, 321840, -75379, -52949, 36266, 167989, 30831, 279051, 314881, 63156, 67210, 100168, -30186, -45694, 145793, -70990, -67796, -34816, 19159, -313781, 76392, -59523, -181426, 113807, 51486, -463051, -131347, -436049, -60242, -6502, -190221, 271844]
9667c32261P832J17440C9214j658a32179p7683c1448j02071H8198a36649j20749
9656b57398A0964g5468k64650J03788d7878k49707g6868q1555G3895c9905D7987
9644g3291k02460D889a60916P2302A06189E1841J0840b56881f094C31644E1400
9632b63649j2939G0676a96848d413j17250k32647B83149j17706G1780b36969D8656
9620B2066b52035B72800d58164b3927A57047d05702a37589m395B46058e0293C41048
9608g4428A24405q739b10269h1014k452G6187P1372b86050a00838B42708D8402
9596b96858g7947I5101d2061j13189o5054j46772g3849j71904m968c7191J3344
9585b3847j15q9374j52136A00130c42156b2354j31037B29996a51910c0363a2424
$$ y = [-332261, -324429, -206989, 39214, 37556, -132179, -209862, -31448, -133519, 88198, -136649, -257398, 10964, -75468, -340118, -236330, -47878, -297585, -76868, -158423, 73895, -39905, 47987, -73291, -275751, 4889, -160916, -88614, 106189, 51841, 62681, -256881, -6094, 331644, 51400, -263649, -276588, 70676, -196848, -4413, -121663, -354310, 283149, 165443, 71780, -236969, 48656, 22066, -252035, 272800, -458164, -23927, 157047, -405702, -137589, -141984, 246058, -50293, 341048, -74428, 124405, 115666, -210269, -81014, -83466, 76187, 147559, -286050, -100838, 242708, 48402, -296858, -77947, 95101, -42061, -155250, -220304, -367076, -73849, -245753, -250721, -37191, -23847, -23962, -113336, -265472, 100130, -342156, -22354, -153391, 229996, -151910, -30363, -12424]
9573b15892f5182k3361C5297A2425b4678j06686B27941F7102h3956F663c3353
9561f6779D7253p118J22314b94350A66320d79885a894E9198R9639B7134c09427
9549a07331I6128f5794d382G9553c90695A39578B1397b8145k77666A5569J5165
9538C0734Q971C5h6267A6390J09463a38898j87568C3956J93000F8649j6532i9657
9525D6258h715k55020P0032A36094r450a19318d3581k42128B48430c7905D5172
9513F2246J46806d17775a13006N5181n17786I3234a58667m9378k52205A02081
9502c99152C194L0680O9772a4259j52298i71l15268a40153A45724a472D8560L9613
9490H8173h6984K7379d627E5427g0831m0501j6479A44802l1851c02786r1757B9530
$$ y = [-215892, -65182, -88543, 35297, 12425, -24678, -131364, 227941, 67102, -83956, 6663, -33353, -66779, 47253, 40135, 162449, -294350, 166320, -479885, -1894, 59198, 158837, 27134, -309427, -107331, 96128, -65794, -4382, 79553, -390695, 139578, 21397, -28145, -305811, 15569, 30734, 39705, 35, -86267, 16390, 125853, -138898, -326466, 33956, 226956, 68649, 52117, -99657, 46258, -8715, -263735, -193703, 136094, 126644, -119318, -43581, -285709, 248430, -37905, 45172, 62246, 209052, -417775, -113006, -57825, -575611, 93234, -158667, -208045, -460250, 102081, -399152, 3194, 33874, 103646, -14259, -166557, -971, -316239, -140153, 145724, -1472, 48560, 88173, -86984, -59605, -4627, 55427, -70831, -111332, -127811, 144802, 112951, -302786, -394543, 29530]
9477B20018b6838j36787K6844q5360l7024J6337B4217c16120a29549j31921C2071
9465g4006l55251h7821H6774a72297e7357j53339E2752M1008d4974E2723b27326
9453a29237c4398j13706Q825l445B22869q1718a36525H9364b13157o3272A87956
9441b22201B73103a83204j9238e3126j29352l3304a3255k43847C6892Q1406n2089
9430F6209N3398C3808J38250n9030O1399i752B36833a13544M778e0900k93592
9419c44492F3667e010E0067d5011k47211a17448B41765Q4208h5155L4277n9111
9408a09989B43609a64683F4785b23357B5419g8212c1333k72183H2494a43156L4335
9397a08821j03548J00284d8687F3110J75752d68021A70022f4153J5108B02809
$$ y = [220018, -26838, -163625, -136781, -222141, -259165, -242828, 24217, -316120, -129549, -261470, 32071, -74006, -429257, -87821, 86774, -172297, -57357, -210696, 52752, 93760, -44974, 52723, -227326, -129237, -34398, -148104, -139279, -142724, 222869, 141151, -136525, 89364, -213157, -276429, 187956, -222201, 273103, -183204, -202442, -53126, -182478, -215782, -13255, -257102, 36892, 118298, 66209, 119607, 33808, 172058, 113028, 174427, -9752, 236833, -113544, -108766, -50900, -344492, 63667, -5010, 50067, -45011, -292222, -117448, 241765, 325973, -85155, -50878, -109989, 243609, -164683, 64785, -223357, 25419, -78212, -31333, -303516, 82494, -143156, -108821, -212369, -112085, -48687, 63110, 238862, -468021, 170022, -64153, -49045, 202809]
9386a39107q4974Q3123M6553l18947J17184f0743q9097F0387j2669d34261a82354
9374B37802G8111A4988b50061a12o12428K99815a27197B41456a1377B28710L9863
9363B68573d9180A80836h2296j6993C29388a89528O7232L5402k71454a24464B8286
9351b30904B85227E703J30924b68237d5044E739h0464K8142N707j28610j27466
9340c02691a50080A1905K74446C9694P9394h8681A74504a89945e8493j43364F284
9328c97584f2544q629p9639J7133A15571j438b3355k83847J7917F3325a59575
9316a22915a7735D888h7331A08133Q255N4838c11027p2516h4463E9237J4557J09908
9304A83702h6960m4579k35069A11763a73885j81027j95347e6654G2420f3158a117
$$ y = [-139107, -224081, -140958, -94405, -413352, -296168, -60743, -149840, 60387, 47718, -434261, -182354, 237802, 78111, 14988, -250061, -112, -612540, -312725, -127197, 241456, -11377, 228710, 268573, -49180, 180836, -82296, -99289, 329388, -189528, -122296, -86894, -358348, -124464, 28286, -230904, 285227, 5703, 136627, -268237, -45044, 5739, -80464, -52322, -46615, -175225, -302691, -150080, 11905, 286351, 39694, 119088, -88681, 174504, -189945, -58493, -201857, 6284, -397584, -62544, -71173, -150812, -133679, 115571, 114133, -23355, -307202, -289285, 63325, -159575, -122915, -17735, 4888, -87331, 108133, 116388, 171226, -311027, -383543, -84463, 59237, 73794, 183702, -86960, -131539, -366608, 111763, -173885, -354912, -550259, -56654, 72420, -63158, -1117]
9292E7499a7063k28394j34000N4991D1575a6387A02440Q2856b25321B17865c98849
9280A76817G0709a1464H9525b49045j13741G124i4914G7010Q4017h3895D6969
9268B84472c01388G9838p602R3601e5633A03671a15042H7508B6542a49930j14339
9257b64269f4623q1287d2538k29018N128H956b81845g113k56749R1658f0226r0362
9245a50588A53636b7766k37624A94769a93024I9515m146a96303A5212b2741k16023
9234b38764A02690R888K2674L5839o2290b29440A47362a46406j17671P7607d0946
9222A2210K2062a57397F7261f8851b2578R109j72051o0729K7518A83020b87583
9210d6801K0641m283A99399d99580f2482A47153C0743J69599a24750n5007a2187
$$ y = [57499, -17063, -245457, -379457, -324466, 41575, -16387, 102440, 185296, -225321, 217865, -398849, 176817, 70709, -11464, 89525, -249045, -362786, 7124, -94914, 77010, 161027, -83895, 46969, 284472, -301388, 79838, 72236, 165837, -55633, 103671, -115042, 87508, 26542, -149930, -264269, -64623, -145910, -42538, -271556, -266428, 8956, -281845, -7113, -263862, -172204, -60226, -150588, 153636, -27766, -265390, 194769, -193024, 99515, 95369, -196303, 15212, -22741, -238764, 102690, 112578, 135252, 171091, 108801, -229440, 147362, -146406, -264077, -186470, -40946, 12210, 34272, -157397, 67261, -68851, -22578, -13469, -185520, -246249, -218731, 183020, -287583, -46801, -26160, -30443, 199399, -499580, -62482, 147153, 30743, 200342, -124750, -179757, -12187]
9198b56445f1142j34046A66493F6019b6474G3460c09522a01213K4656A18297e65981
9186b80441d3073k99422i8893k46070B0269a36623j07618G6442b56306p9066b7006
9174A91324a98661h6222F5418K76738a62761H3013i2247I1054a69235r1447a15414
9162I3485K32013G5018i6434E1298J12608C022b61357k6133a5148A54958P8541
9151B33499d7345f050j75944G5749L9012O7343a10835j41328C85177c36078f6091
9139a26086K0403A97622a36023n2920f7795A01829k1471b69681b7037j01890J993
9128a26934D0170b10696J04965A0740c63118I8312A6133e187C8231J22478C5011
9116A75739J23293c7246p3766B35535E876c8244k76827D1532J23326B9961h6991
$$ y = [-256445, -61142, -195188, 166493, 66019, -26474, 73460, -309522, -101213, -76557, 118297, -565981, -280441, -43073, -342495, -98893, -344963, 20269, -136623, -244241, 76442, -256306, -335372, -27006, 191324, -198661, -86222, 65418, 342156, -162761, 83013, -92247, 91054, -169235, -260682, -115414, 93485, 325498, 75018, -96434, 51298, 163906, 3022, -261357, -287490, -15148, 154958, 233499, -47345, -6050, -181994, 75749, 114761, 182104, -110835, -252163, 385177, -336078, -66091, -126086, -105683, 197622, -136023, -188943, -67795, 101829, 80358, -269681, -27037, -128927, -126934, 40170, -210696, -105731, 10740, -363118, 98312, 16133, -5187, 38231, 160709, 35011, 175739, 299032, -37246, -111012, 235535, 5876, -38244, -315071, 41532, 164858, 29961, -86991]
9104E829h5676j34782c547l78215F0986m554b3697k62718A5873b8845C45396Q52
9092C46248a6581q120l52476i9997j37510B59231e9216j53560E6048P6132b4916
9080a12528j54045C3548c6559A16284b68896B61467A03680i7931F0519b12199
9069A1756a14049j29973F7102b86641A18276c00181N8246b1229p1939l0606A38806
9057b64361i1849C16394c63849G5692g6238E3019O7396K3891m8626c10387a14957
9045e24530H6669a62785B76087G8409c49839a42426B89737e44180K18883a34355
9034a27096E9451e1960A15411a05954j75370k02503a46280q1706C07425b56367
9023h1203C6527m67a68328N9429k68064a62474H273a55738G5003a9633B51437
$$ y = [5829, -85676, -220458, -3547, -381762, 60986, 56432, -23697, -286415, 15873, -28845, 345396, 346248, -16581, -24701, -377177, -99997, -237507, 259231, -59216, -212776, 56048, 132180, -24916, -112528, -266573, 33548, -36559, 116284, -268896, 261467, 103680, -97931, 60519, -212199, 11756, -114049, -244022, 67102, -286641, 118276, -300181, -241935, -21229, -93168, -123774, 138806, -264361, -91849, 316394, -363849, 75692, -76238, 53019, 120415, 144306, 95680, -310387, -114957, -524530, 86669, -162785, 276087, 78409, -349839, -142426, 289737, -544180, -325297, -134355, -127096, 59451, -51960, 115411, -105954, -281324, -483827, -146280, -227986, 307425, -256367, -81203, 36527, 36060, -168328, -108899, -376963, -162474, 8273, -155738, 75003, -19633, 251437]
9011E8666b89954C0645K38552d20861D0420b42075a18501j13525R7006A22721
9000g8104l17575B73901b73864A05098a59825P3866j89575A9631d2570j00651
8990a43221A10809b04487B29743h8009j65894Q121B51856e02243b10690d0866
8979b26436A93010A7319J28812L9162a61327j22510k7542B39671b05781B6631
8968I5642J90183a42394G8985j3015b28815B7559a26195l32350d2462F4989J06980
8957A71969c3148j84550m2334B77827h6491n4284j79421J14684A25523R2308c22158
8945A72313a48861A6082a43923A85432b13731c386k2875F9318b00464B7559L41953
8934C69512j41068G6598b49692h8790A84194a97321E06022A78430L94964j06454
$$ y = [58666, -289954, 30645, 269197, -420861, 40420, -242075, -118501, -232026, -135020, 122721, -78104, -395679, 273901, -273864, 105098, -159825, -85959, -275534, 19631, -42570, -143221, 110809, -204487, 229743, -88009, -253903, -245782, 251856, -502243, -210690, -40866, -226436, 193010, 17319, 146131, 185293, -161327, -283837, -311379, 239671, -205781, 26631, 95642, 285825, -142394, 78985, 65970, -228815, 27559, -126195, -458545, -42462, 64989, 171969, -33148, -217698, -260032, 277827, -86491, -140775, -320196, -205512, 125523, 217831, -322158, 172313, -148861, 16082, -143923, 185432, -213731, -3386, -26261, 69318, -200464, 27559, 369512, 228444, 76598, -249692, -88790, 184194, -197321, 506022, 178430, 573394, 466940]
8924D66940Q60814K392587R979809O322091F003099B369589A112007n55182j98448
8915C58377O7612k04905m1553E8945J66209l3532K83534J22577j59325b1140k47865
8904b69005G2618f7917A4276Q9658c6107l55511I5583b29719C65371g0424B02578
8892c0452A14331E0573J90541E1845o507K47161h7640B0769N1826b94434c5609
8880C75964a42941A87021A2731L9453b6480B89004i5504A3603L06303b45108E8029
$$ y = [466940, 1327754, 3720341, 13700150, 20022241, 6003099, 2369589, 1112007, 556825, 358377, 425989, 221084, 179531, 58945, 225154, 191622, 475156, 597733, 438408, -21140, -269005, 72618, -67917, 14276, 103934, -36107, -391618, 95583, -229719, 365371, -70424, 202578, -30452, 114331, 50573, 241114, 51845, 45338, 292499, -87640, 20769, 72595, -294434, -35609, 375964, -142941, 187021, 12731, 52184, -26480, 289004, -95504, 13603, 319906, -245108, 58029]
$$ [...]
##END NTUPLES=NMR SPECTRUM
##END=
